trbc individuals
type: Ontology
download URL: http://data.ga-group.nl/ics/trbc2020.ttl
abstract: This ontology includes individuals representing the set of classification codes based on the principal business activity of the company. This set of classification codes is valid from 2020.
creator: https://orcid.org/0000-0002-7352-2825
description: The Refinitiv Business Classification (TRBC) is an industry classification taxonomy launched by Reuters in 2004 as RBSS, and is now used by LSEG after the merger with Refinitiv. Codes are five-tiered, numeric, and not prefix-free. The first tier is called economic sector, the second tier is the business sector, the third tier is the industry group, the fourth tier is the industry, and the fifth tier is the activity group. LSEG is responsible for assigning a TRBC classification to all major public as well as many private companies. Each company is allocated to the activity group that most closely represents the nature of its business according to the TRBC classification methodology.
format: text/turtle
issued: 2026-06-03T02:25:19Z
language: en
license: https://creativecommons.org/licenses/by-sa/4.0/
modified: 2026-06-03T02:25:19Z
publisher: https://orcid.org/0000-0002-7352-2825
has maturity level: Release
imports: trbc
imports: ics
version info: 2020
content language: owl2-quick-reference
label: TRBC 2020
contributor: PAMIYA Strategic Advisors GmbH
copyright: Copyright (c) 2020 Refinitiv Limited
copyright: Copyright (c) 2022-2026 PAMIYA Strategic Advisors GmbH
filename: trbc2020.ttl
valid from: 2020
preferred namespace prefix: trbc2020

Coal (NEC)
type: NamedIndividual
type: Activity
type: BusinessClassification
is contemporary version of: http://data.ga-group.nl/ics/trbc/5010101010
is version of: http://data.ga-group.nl/ics/trbc/5010101010
replaces: http://data.ga-group.nl/ics/trbc/2012/5010101010
imported on: 2023-04-07T16:52:39.364811Z
last refreshed on: 2026-06-05T07:16:11.699Z
source accessed on: 2017-12-31T07:04:19Z
source last accessed on: 2021-08-01T01:06:53Z
definition: Companies engaged in the mining and beneficiating of coal and providing support service for coal.
notation: 5010101010
valid from: 2020
is activity of: Coal

Coal Mining Support
type: NamedIndividual
type: Activity
type: BusinessClassification
is contemporary version of: http://data.ga-group.nl/ics/trbc/5010101011
is version of: http://data.ga-group.nl/ics/trbc/5010101011
replaces: http://data.ga-group.nl/ics/trbc/2012/5010101011
imported on: 2023-04-07T16:52:39.364811Z
last refreshed on: 2026-06-05T07:16:11.699Z
source accessed on: 2017-12-31T07:04:19Z
source last accessed on: 2021-08-01T01:06:53Z
definition: Companies engaged in support activities related to coal, such as testing, tunneling, blasting, training, and other contract-based, coal-related services.
notation: 5010101011
valid from: 2020
is activity of: Coal

Coal Wholesale
type: NamedIndividual
type: Activity
type: BusinessClassification
is contemporary version of: http://data.ga-group.nl/ics/trbc/5010101012
is version of: http://data.ga-group.nl/ics/trbc/5010101012
replaces: http://data.ga-group.nl/ics/trbc/2012/5010101012
imported on: 2023-04-07T16:52:39.364811Z
last refreshed on: 2026-06-05T07:16:11.699Z
source accessed on: 2017-12-31T07:04:19Z
source last accessed on: 2021-08-01T01:06:53Z
definition: Companies engaged in wholesaling coal. Excludes coke wholesaling, classified in Coke Coal Mining.
notation: 5010101012
valid from: 2020
is activity of: Coal

Coal
type: NamedIndividual
type: BusinessClassification
type: Industry
is contemporary version of: http://data.ga-group.nl/ics/trbc/50101010
is version of: http://data.ga-group.nl/ics/trbc/50101010
replaces: http://data.ga-group.nl/ics/trbc/2012/50101010
imported on: 2023-04-07T16:52:39.364811Z
last refreshed on: 2026-06-05T07:16:11.699Z
source accessed on: 2017-12-31T07:04:19Z
source last accessed on: 2021-08-01T01:06:53Z
definition: Explorers, miners, processors and wholesalers of coal. Includes providers of testing, tunnelling, blasting, training, and other contract-based, coal-related services.
notation: 50101010
valid from: 2020
is industry of: Coal

Coal
type: NamedIndividual
type: BusinessClassification
type: IndustryGroup
is contemporary version of: http://data.ga-group.nl/ics/trbc/501010
is version of: http://data.ga-group.nl/ics/trbc/501010
replaces: http://data.ga-group.nl/ics/trbc/2012/501010
imported on: 2023-04-07T16:52:39.364811Z
last refreshed on: 2026-06-05T07:16:11.699Z
source accessed on: 2017-12-31T07:04:19Z
source last accessed on: 2021-08-01T01:06:53Z
definition: Explorers, miners and processors of coal. Includes providers of testing, tunnelling, blasting, training, and other contract-based, coal-related services.
notation: 501010
valid from: 2020
is industry group of: Energy - Fossil Fuels

Integrated Oil & Gas
type: NamedIndividual
type: Activity
type: BusinessClassification
is contemporary version of: http://data.ga-group.nl/ics/trbc/5010201010
is version of: http://data.ga-group.nl/ics/trbc/5010201010
replaces: http://data.ga-group.nl/ics/trbc/2012/5010201010
imported on: 2023-04-07T16:52:39.364811Z
last refreshed on: 2026-06-05T07:16:11.699Z
source accessed on: 2017-12-31T07:04:19Z
source last accessed on: 2021-08-01T01:06:53Z
definition: Companies engaged in the exploration, production, refining and distribution of oil and gas.
notation: 5010201010
valid from: 2020
is activity of: Integrated Oil & Gas

Integrated Oil & Gas
type: NamedIndividual
type: BusinessClassification
type: Industry
is contemporary version of: http://data.ga-group.nl/ics/trbc/50102010
is version of: http://data.ga-group.nl/ics/trbc/50102010
replaces: http://data.ga-group.nl/ics/trbc/2012/50102010
imported on: 2023-04-07T16:52:39.364811Z
last refreshed on: 2026-06-05T07:16:11.699Z
source accessed on: 2017-12-31T07:04:19Z
source last accessed on: 2021-08-01T01:06:53Z
definition: Explorers, producers, refiners and distributors of oil and gas. Includes companies that have global operations and significant activities in both exploration and production, and refining and marketing operations.
notation: 50102010
valid from: 2020
is industry of: Oil & Gas

Oil & Gas Exploration and Production (NEC)
type: NamedIndividual
type: Activity
type: BusinessClassification
is contemporary version of: http://data.ga-group.nl/ics/trbc/5010202010
is version of: http://data.ga-group.nl/ics/trbc/5010202010
replaces: http://data.ga-group.nl/ics/trbc/2012/5010202010
imported on: 2023-04-07T16:52:39.364811Z
last refreshed on: 2026-06-05T07:16:11.699Z
source accessed on: 2017-12-31T07:04:19Z
source last accessed on: 2021-08-01T01:06:53Z
definition: Companies engaged in the exploration and extraction of crude petroleum and natural gas.
notation: 5010202010
valid from: 2020
is activity of: Oil & Gas Exploration and Production

Oil Exploration & Production - Onshore
type: NamedIndividual
type: Activity
type: BusinessClassification
is contemporary version of: http://data.ga-group.nl/ics/trbc/5010202011
is version of: http://data.ga-group.nl/ics/trbc/5010202011
replaces: http://data.ga-group.nl/ics/trbc/2012/5010202011
imported on: 2023-04-07T16:52:39.364811Z
last refreshed on: 2026-06-05T07:16:11.699Z
source accessed on: 2017-12-31T07:04:19Z
source last accessed on: 2021-08-01T01:06:53Z
definition: Companies engaged in onshore exploration and extraction of crude petroleum and natural gas.
notation: 5010202011
valid from: 2020
is activity of: Oil & Gas Exploration and Production

Oil Exploration & Production - Offshore
type: NamedIndividual
type: Activity
type: BusinessClassification
is contemporary version of: http://data.ga-group.nl/ics/trbc/5010202012
is version of: http://data.ga-group.nl/ics/trbc/5010202012
replaces: http://data.ga-group.nl/ics/trbc/2012/5010202012
imported on: 2023-04-07T16:52:39.364811Z
last refreshed on: 2026-06-05T07:16:11.699Z
source accessed on: 2017-12-31T07:04:19Z
source last accessed on: 2021-08-01T01:06:53Z
definition: Companies engaged in offshore exploration and extraction of crude petroleum and natural gas.
notation: 5010202012
valid from: 2020
is activity of: Oil & Gas Exploration and Production

Natural Gas Exploration & Production - Onshore
type: NamedIndividual
type: Activity
type: BusinessClassification
is contemporary version of: http://data.ga-group.nl/ics/trbc/5010202013
is version of: http://data.ga-group.nl/ics/trbc/5010202013
replaces: http://data.ga-group.nl/ics/trbc/2012/5010202013
imported on: 2023-04-07T16:52:39.364811Z
last refreshed on: 2026-06-05T07:16:11.699Z
source accessed on: 2017-12-31T07:04:19Z
source last accessed on: 2021-08-01T01:06:53Z
definition: Companies engaged in onshore exploration and production of natural gas.
notation: 5010202013
valid from: 2020
is activity of: Oil & Gas Exploration and Production

Natural Gas Exploration & Production - Offshore
type: NamedIndividual
type: Activity
type: BusinessClassification
is contemporary version of: http://data.ga-group.nl/ics/trbc/5010202014
is version of: http://data.ga-group.nl/ics/trbc/5010202014
replaces: http://data.ga-group.nl/ics/trbc/2012/5010202014
imported on: 2023-04-07T16:52:39.364811Z
last refreshed on: 2026-06-05T07:16:11.699Z
source accessed on: 2017-12-31T07:04:19Z
source last accessed on: 2021-08-01T01:06:53Z
definition: Companies engaged in offshore exploration and production of natural gas.
notation: 5010202014
valid from: 2020
is activity of: Oil & Gas Exploration and Production

Unconventional Oil & Gas Production
type: NamedIndividual
type: Activity
type: BusinessClassification
is contemporary version of: http://data.ga-group.nl/ics/trbc/5010202015
is version of: http://data.ga-group.nl/ics/trbc/5010202015
replaces: http://data.ga-group.nl/ics/trbc/2012/5010202015
imported on: 2023-04-07T16:52:39.364811Z
last refreshed on: 2026-06-05T07:16:11.699Z
source accessed on: 2017-12-31T07:04:19Z
source last accessed on: 2021-08-01T01:06:53Z
definition: Companies engaged in producing oil & gas using techniques viewed as unconventional or specialized, such as hydraulic fracturing. Includes oil and gas production from oil shales and tar sands.
notation: 5010202015
valid from: 2020
is activity of: Oil & Gas Exploration and Production

Oil & Gas Exploration and Production
type: NamedIndividual
type: BusinessClassification
type: Industry
is contemporary version of: http://data.ga-group.nl/ics/trbc/50102020
is version of: http://data.ga-group.nl/ics/trbc/50102020
replaces: http://data.ga-group.nl/ics/trbc/2012/50102020
imported on: 2023-04-07T16:52:39.364811Z
last refreshed on: 2026-06-05T07:16:11.699Z
source accessed on: 2017-12-31T07:04:19Z
source last accessed on: 2021-08-01T01:06:53Z
definition: Explorers, extractors and producers of crude petroleum and natural gas. Includes operators that recover butane, ethane and natural liquefied petroleum gases (LPG) from oil and gas fields in land, water, as well as explorers and producers of unconventional oil and gas.
notation: 50102020
valid from: 2020
is industry of: Oil & Gas

Oil & Gas Refining and Marketing (NEC)
type: NamedIndividual
type: Activity
type: BusinessClassification
is contemporary version of: http://data.ga-group.nl/ics/trbc/5010203010
is version of: http://data.ga-group.nl/ics/trbc/5010203010
replaces: http://data.ga-group.nl/ics/trbc/2012/5010203010
imported on: 2023-04-07T16:52:39.364811Z
last refreshed on: 2026-06-05T07:16:11.699Z
source accessed on: 2017-12-31T07:04:19Z
source last accessed on: 2021-08-01T01:06:53Z
definition: Companies engaged in the operation of oil and gas refineries for the production of heating, lubricating, and fuel oils, as well as gasoline, diesel, jet fuel, propane, kerosene and other liquefied petroleum gas (LPG) products. Includes also marketing operations, such as bulk gasoline and crude oil terminals and truck and automobile service stations with or without convenience stores.
notation: 5010203010
valid from: 2020
is activity of: Oil & Gas Refining and Marketing

Petroleum Refining
type: NamedIndividual
type: Activity
type: BusinessClassification
is contemporary version of: http://data.ga-group.nl/ics/trbc/5010203011
is version of: http://data.ga-group.nl/ics/trbc/5010203011
replaces: http://data.ga-group.nl/ics/trbc/2012/5010203011
imported on: 2023-04-07T16:52:39.364811Z
last refreshed on: 2026-06-05T07:16:11.699Z
source accessed on: 2017-12-31T07:04:19Z
source last accessed on: 2021-08-01T01:06:53Z
definition: Companies engaged in the operation of refining crude petroleum into refined petroleum. Petroleum refining involves fractionation, straight distillation of crude oil, and cracking.
notation: 5010203011
valid from: 2020
is activity of: Oil & Gas Refining and Marketing

Gasoline Stations
type: NamedIndividual
type: Activity
type: BusinessClassification
is contemporary version of: http://data.ga-group.nl/ics/trbc/5010203012
is version of: http://data.ga-group.nl/ics/trbc/5010203012
replaces: http://data.ga-group.nl/ics/trbc/2012/5010203012
imported on: 2023-04-07T16:52:39.364811Z
last refreshed on: 2026-06-05T07:16:11.699Z
source accessed on: 2017-12-31T07:04:19Z
source last accessed on: 2021-08-01T01:06:53Z
definition: Companies engaged in retailing automotive fuels (diesel fuel, gasoline) in combination with convenience store or food mart items.
notation: 5010203012
valid from: 2020
is activity of: Oil & Gas Refining and Marketing

Petroleum Product Wholesale
type: NamedIndividual
type: Activity
type: BusinessClassification
is contemporary version of: http://data.ga-group.nl/ics/trbc/5010203013
is version of: http://data.ga-group.nl/ics/trbc/5010203013
replaces: http://data.ga-group.nl/ics/trbc/2012/5010203013
imported on: 2023-04-07T16:52:39.364811Z
last refreshed on: 2026-06-05T07:16:11.699Z
source accessed on: 2017-12-31T07:04:19Z
source last accessed on: 2021-08-01T01:06:53Z
definition: Companies engaged in wholesaling petroleum and petroleum products.
notation: 5010203013
valid from: 2020
is activity of: Oil & Gas Refining and Marketing

Oil & Gas Refining and Marketing
type: NamedIndividual
type: BusinessClassification
type: Industry
is contemporary version of: http://data.ga-group.nl/ics/trbc/50102030
is version of: http://data.ga-group.nl/ics/trbc/50102030
replaces: http://data.ga-group.nl/ics/trbc/2012/50102030
imported on: 2023-04-07T16:52:39.364811Z
last refreshed on: 2026-06-05T07:16:11.699Z
source accessed on: 2017-12-31T07:04:19Z
source last accessed on: 2021-08-01T01:06:53Z
definition: Operators of oil and gas refineries for the production of heating and lubricating products, as well as fuel oils, and gasoline, diesel, jet fuel, propane, kerosene and other liquefied petroleum gas (LPG) products. Includes marketers and retailers of refined products, such as operators of bulk gasoline and crude oil terminals, and operators of truck and automobile service stations with or without convenience stores, as well as wholesale traders of oil and gas products.
notation: 50102030
valid from: 2020
is industry of: Oil & Gas

Oil & Gas
type: NamedIndividual
type: BusinessClassification
type: IndustryGroup
is contemporary version of: http://data.ga-group.nl/ics/trbc/501020
is version of: http://data.ga-group.nl/ics/trbc/501020
replaces: http://data.ga-group.nl/ics/trbc/2012/501020
imported on: 2023-04-07T16:52:39.364811Z
last refreshed on: 2026-06-05T07:16:11.699Z
source accessed on: 2017-12-31T07:04:19Z
source last accessed on: 2021-08-01T01:06:53Z
definition: Producers, refiners and transporters of raw and refined oil and gas products.
notation: 501020
valid from: 2020
is industry group of: Energy - Fossil Fuels

Oil & Gas Drilling (NEC)
type: NamedIndividual
type: Activity
type: BusinessClassification
is contemporary version of: http://data.ga-group.nl/ics/trbc/5010301010
is version of: http://data.ga-group.nl/ics/trbc/5010301010
replaces: http://data.ga-group.nl/ics/trbc/2012/5010301010
imported on: 2023-04-07T16:52:39.364811Z
last refreshed on: 2026-06-05T07:16:11.699Z
source accessed on: 2017-12-31T07:04:19Z
source last accessed on: 2021-08-01T01:06:53Z
definition: Companies involved in at least two activities under the Oil and Gas Drilling Industry, none being dominant: Oil Drilling - Onshore, Gas Drilling - Onshore, Oil Drilling - Offshore, Gas Drilling - Offshore and Unconventional Oil & Gas Drilling. Includes also entities not elsewhere classified under the Oil & Gas Drilling Industry.
notation: 5010301010
valid from: 2020
is activity of: Oil & Gas Drilling

Oil Drilling - Onshore
type: NamedIndividual
type: Activity
type: BusinessClassification
is contemporary version of: http://data.ga-group.nl/ics/trbc/5010301011
is version of: http://data.ga-group.nl/ics/trbc/5010301011
replaces: http://data.ga-group.nl/ics/trbc/2012/5010301011
imported on: 2023-04-07T16:52:39.364811Z
last refreshed on: 2026-06-05T07:16:11.699Z
source accessed on: 2017-12-31T07:04:19Z
source last accessed on: 2021-08-01T01:06:53Z
definition: Companies engaged in onshore oil drilling on a contract basis. Includes contractors that specialize in spudding in, drilling in, redrilling, and directional drilling. Excludes companies engaged in offshore (sea-based) oil drilling, classified in Oil Drilling - Offshore.
notation: 5010301011
valid from: 2020
is activity of: Oil & Gas Drilling

Gas Drilling - Onshore
type: NamedIndividual
type: Activity
type: BusinessClassification
is contemporary version of: http://data.ga-group.nl/ics/trbc/5010301012
is version of: http://data.ga-group.nl/ics/trbc/5010301012
replaces: http://data.ga-group.nl/ics/trbc/2012/5010301012
imported on: 2023-04-07T16:52:39.364811Z
last refreshed on: 2026-06-05T07:16:11.699Z
source accessed on: 2017-12-31T07:04:19Z
source last accessed on: 2021-08-01T01:06:53Z
definition: Companies engaged in onshore gas drilling on a contract basis. Includes contractors that specialize in spudding in, drilling in, redrilling, and directional drilling. Excludes companies engaged in offshore (sea-based) gas drilling, classified in the Gas Drilling - Offshore.
notation: 5010301012
valid from: 2020
is activity of: Oil & Gas Drilling

Oil Drilling - Offshore
type: NamedIndividual
type: Activity
type: BusinessClassification
is contemporary version of: http://data.ga-group.nl/ics/trbc/5010301013
is version of: http://data.ga-group.nl/ics/trbc/5010301013
replaces: http://data.ga-group.nl/ics/trbc/2012/5010301013
imported on: 2023-04-07T16:52:39.364811Z
last refreshed on: 2026-06-05T07:16:11.699Z
source accessed on: 2017-12-31T07:04:19Z
source last accessed on: 2021-08-01T01:06:53Z
definition: Companies engaged in offshore oil drilling on a contract basis. Includes contractors that specialize in spudding in, drilling in, redrilling, and directional drilling. Excludes companies engaged in onshore (land-based) oil drilling, classified in Oil Drilling - Onshore.
notation: 5010301013
valid from: 2020
is activity of: Oil & Gas Drilling

Gas Drilling - Offshore
type: NamedIndividual
type: Activity
type: BusinessClassification
is contemporary version of: http://data.ga-group.nl/ics/trbc/5010301014
is version of: http://data.ga-group.nl/ics/trbc/5010301014
replaces: http://data.ga-group.nl/ics/trbc/2012/5010301014
imported on: 2023-04-07T16:52:39.364811Z
last refreshed on: 2026-06-05T07:16:11.699Z
source accessed on: 2017-12-31T07:04:19Z
source last accessed on: 2021-08-01T01:06:53Z
definition: Companies engaged in offshore gas drilling on a contract basis. Includes contractors that specialize in spudding in, drilling in, redrilling, and directional drilling. Excludes companies engaged in onshore (land-based) gas drilling, classified in Gas Drilling - Onshore.
notation: 5010301014
valid from: 2020
is activity of: Oil & Gas Drilling

Unconventional Oil & Gas Drilling
type: NamedIndividual
type: Activity
type: BusinessClassification
is contemporary version of: http://data.ga-group.nl/ics/trbc/5010301015
is version of: http://data.ga-group.nl/ics/trbc/5010301015
replaces: http://data.ga-group.nl/ics/trbc/2012/5010301015
imported on: 2023-04-07T16:52:39.364811Z
last refreshed on: 2026-06-05T07:16:11.699Z
source accessed on: 2017-12-31T07:04:19Z
source last accessed on: 2021-08-01T01:06:53Z
definition: Companies engaged in oil & gas drilling techniques viewed as unconventional or specialised, such as those deployed to exploit oil shales, oil sands, coal-based liquids, tight sand gas, shale gas, deep natural gas, and tight natural methane hydrates.
notation: 5010301015
valid from: 2020
is activity of: Oil & Gas Drilling

Oil & Gas Drilling
type: NamedIndividual
type: BusinessClassification
type: Industry
is contemporary version of: http://data.ga-group.nl/ics/trbc/50103010
is version of: http://data.ga-group.nl/ics/trbc/50103010
replaces: http://data.ga-group.nl/ics/trbc/2012/50103010
imported on: 2023-04-07T16:52:39.364811Z
last refreshed on: 2026-06-05T07:16:11.699Z
source accessed on: 2017-12-31T07:04:19Z
source last accessed on: 2021-08-01T01:06:53Z
definition: Providers of oil and gas drilling services on a contract basis, such as directional drilling, well drilling and reconditioning of oil and gas field wells in land and water, as well as providers of unconventional drilling services.
notation: 50103010
valid from: 2020
is industry of: Oil & Gas Related Equipment and Services

Oil Related Services and Equipment (NEC)
type: NamedIndividual
type: Activity
type: BusinessClassification
is contemporary version of: http://data.ga-group.nl/ics/trbc/5010302010
is version of: http://data.ga-group.nl/ics/trbc/5010302010
replaces: http://data.ga-group.nl/ics/trbc/2012/5010302010
imported on: 2023-04-07T16:52:39.364811Z
last refreshed on: 2026-06-05T07:16:11.699Z
source accessed on: 2017-12-31T07:04:19Z
source last accessed on: 2021-08-01T01:06:53Z
definition: Companies involved in at least two activities under Oil Related Services and Equipment, none being dominant: Oil Related Services, Oil Related Equipment, and Oil Related - Surveying & Mapping Services. Includes also entities not elsewhere classified under the Oil Related Services and Equipment Industry.
notation: 5010302010
valid from: 2020
is activity of: Oil Related Services and Equipment

Oil Related Services
type: NamedIndividual
type: Activity
type: BusinessClassification
is contemporary version of: http://data.ga-group.nl/ics/trbc/5010302011
is version of: http://data.ga-group.nl/ics/trbc/5010302011
replaces: http://data.ga-group.nl/ics/trbc/2012/5010302011
imported on: 2023-04-07T16:52:39.364811Z
last refreshed on: 2026-06-05T07:16:11.699Z
source accessed on: 2017-12-31T07:04:19Z
source last accessed on: 2021-08-01T01:06:53Z
definition: Companies engaged in specialized services related to oil industry, such as cleaning, testing, erecting, repairing, and dismantling oil and gas field rigs and derricks as well as pipeline related services. Excludes geological surveying and mapping services, classified in Oil Related - Surveying & Mapping Services; producers of oil and gas equipment, classified in Oil Related Equipment; and drilling services, classified under Oil & Gas Drilling.
notation: 5010302011
valid from: 2020
is activity of: Oil Related Services and Equipment

Oil Related Equipment
type: NamedIndividual
type: Activity
type: BusinessClassification
is contemporary version of: http://data.ga-group.nl/ics/trbc/5010302012
is version of: http://data.ga-group.nl/ics/trbc/5010302012
replaces: http://data.ga-group.nl/ics/trbc/2012/5010302012
imported on: 2023-04-07T16:52:39.364811Z
last refreshed on: 2026-06-05T07:16:11.699Z
source accessed on: 2017-12-31T07:04:19Z
source last accessed on: 2021-08-01T01:06:53Z
definition: Companies engaged in manufacturing oil field machinery and equipment, such as oil drilling machinery and equipment, oil field production machinery and equipment, support machinery and vessels, such as anchor-handling tug supply (AHTS) vessels, platform supply vessels (PSVs), construction support vessels (CSV) and floating production, storage and offloading units (FPSO), among others.
notation: 5010302012
valid from: 2020
is activity of: Oil Related Services and Equipment

Oil Related - Surveying & Mapping Services
type: NamedIndividual
type: Activity
type: BusinessClassification
is contemporary version of: http://data.ga-group.nl/ics/trbc/5010302013
is version of: http://data.ga-group.nl/ics/trbc/5010302013
replaces: http://data.ga-group.nl/ics/trbc/2012/5010302013
imported on: 2023-04-07T16:52:39.364811Z
last refreshed on: 2026-06-05T07:16:11.699Z
source accessed on: 2017-12-31T07:04:19Z
source last accessed on: 2021-08-01T01:06:53Z
definition: Companies engaged in gathering, interpreting, and mapping geophysical data with reference to oil and gas deposits. Companies in this activity often specialize in locating and measuring the extent of subsurface oil.
notation: 5010302013
valid from: 2020
is activity of: Oil Related Services and Equipment

Oil Related Services and Equipment
type: NamedIndividual
type: BusinessClassification
type: Industry
is contemporary version of: http://data.ga-group.nl/ics/trbc/50103020
is version of: http://data.ga-group.nl/ics/trbc/50103020
replaces: http://data.ga-group.nl/ics/trbc/2012/50103020
imported on: 2023-04-07T16:52:39.364811Z
last refreshed on: 2026-06-05T07:16:11.699Z
source accessed on: 2017-12-31T07:04:19Z
source last accessed on: 2021-08-01T01:06:53Z
definition: Providers of oil-and-gas-related services on a contract basis, such as cleaning, testing, erecting, repairing and dismantling oil and gas field rigs and derricks. Includes providers of exploration services, such as geological surveys and mapping. Includes also manufacturers of oil and gas well pumping and other related equipment.
notation: 50103020
valid from: 2020
is industry of: Oil & Gas Related Equipment and Services

Oil & Gas Transportation Services (NEC)
type: NamedIndividual
type: Activity
type: BusinessClassification
is contemporary version of: http://data.ga-group.nl/ics/trbc/5010303010
is version of: http://data.ga-group.nl/ics/trbc/5010303010
replaces: http://data.ga-group.nl/ics/trbc/2012/5010303010
imported on: 2023-04-07T16:52:39.364811Z
last refreshed on: 2026-06-05T07:16:11.699Z
source accessed on: 2017-12-31T07:04:19Z
source last accessed on: 2021-08-01T01:06:53Z
definition: Companies engaged in at least two activities within the Oil and Gas Transportation industry, none being dominant: LNG Transportation & Storage, Natural Gas Pipeline Transportation, Oil Pipeline Transportation, Sea-Borne Tankers and Oil & Gas Storage. Includes also entities not elsewhere classified under the Oil and Gas Transportation industry.
notation: 5010303010
valid from: 2020
is activity of: Oil & Gas Transportation Services

LNG Transportation & Storage
type: NamedIndividual
type: Activity
type: BusinessClassification
is contemporary version of: http://data.ga-group.nl/ics/trbc/5010303011
is version of: http://data.ga-group.nl/ics/trbc/5010303011
replaces: http://data.ga-group.nl/ics/trbc/2012/5010303011
imported on: 2023-04-07T16:52:39.364811Z
last refreshed on: 2026-06-05T07:16:11.699Z
source accessed on: 2017-12-31T07:04:19Z
source last accessed on: 2021-08-01T01:06:53Z
definition: Companies engaged in transportation and storage of Liquefied natural gas (LNG), liquid petroleum gas (LPG), compressed natural gas (CNG), natural gas liquids (NGL). Excludes pipeline transportation of natural gas, classified in Natural Gas Pipeline Transportation, and land-based transportation of Liquefied Natural Gas, classified in Ground Freight & Logistics.
notation: 5010303011
valid from: 2020
is activity of: Oil & Gas Transportation Services

Natural Gas Pipeline Transportation
type: NamedIndividual
type: Activity
type: BusinessClassification
is contemporary version of: http://data.ga-group.nl/ics/trbc/5010303012
is version of: http://data.ga-group.nl/ics/trbc/5010303012
replaces: http://data.ga-group.nl/ics/trbc/2012/5010303012
imported on: 2023-04-07T16:52:39.364811Z
last refreshed on: 2026-06-05T07:16:11.699Z
source accessed on: 2017-12-31T07:04:19Z
source last accessed on: 2021-08-01T01:06:53Z
definition: Companies engaged in pipeline transportation of natural gas from processing plants to local distribution systems. Excludes pipeline transportation of oil, classified in Oil Pipeline Transportation, and transportation of LNG, classified in LNG Transportation & Storage.
notation: 5010303012
valid from: 2020
is activity of: Oil & Gas Transportation Services

Oil Pipeline Transportation
type: NamedIndividual
type: Activity
type: BusinessClassification
is contemporary version of: http://data.ga-group.nl/ics/trbc/5010303013
is version of: http://data.ga-group.nl/ics/trbc/5010303013
replaces: http://data.ga-group.nl/ics/trbc/2012/5010303013
imported on: 2023-04-07T16:52:39.364811Z
last refreshed on: 2026-06-05T07:16:11.699Z
source accessed on: 2017-12-31T07:04:19Z
source last accessed on: 2021-08-01T01:06:53Z
definition: Companies engaged in pipeline transportation of crude oil. Excludes land-based transportation of oil, classified in Ground Freight & Logistics industry, and pipeline transportation of gas, classified in Natural Gas Pipeline Transportation.
notation: 5010303013
valid from: 2020
is activity of: Oil & Gas Transportation Services

Sea-Borne Tankers
type: NamedIndividual
type: Activity
type: BusinessClassification
is contemporary version of: http://data.ga-group.nl/ics/trbc/5010303014
is version of: http://data.ga-group.nl/ics/trbc/5010303014
replaces: http://data.ga-group.nl/ics/trbc/2012/5010303014
imported on: 2023-04-07T16:52:39.364811Z
last refreshed on: 2026-06-05T07:16:11.699Z
source accessed on: 2017-12-31T07:04:19Z
source last accessed on: 2021-08-01T01:06:53Z
definition: Companies engaged in transportation of oil by sea/ocean. Excludes: operators of such vessels as anchor-handling tug supply (AHTS) vessels, platform supply vessels (PSVs), construction support vessels (CSV) and floating production, storage and offloading units (FPSO), classified in Oil Related Services; producers of vessels, such as anchor-handling tug supply (AHTS) vessels, platform supply vessels (PSVs), construction support vessels (CSV) and floating production, storage and offloading units (FPSO), among others, classified in Oil Related Equipment; and constructors of tankers, classified under the Shipbuilding industry.
notation: 5010303014
valid from: 2020
is activity of: Oil & Gas Transportation Services

Oil & Gas Storage
type: NamedIndividual
type: Activity
type: BusinessClassification
is contemporary version of: http://data.ga-group.nl/ics/trbc/5010303015
is version of: http://data.ga-group.nl/ics/trbc/5010303015
replaces: http://data.ga-group.nl/ics/trbc/2012/5010303015
imported on: 2023-04-07T16:52:39.364811Z
last refreshed on: 2026-06-05T07:16:11.699Z
source accessed on: 2017-12-31T07:04:19Z
source last accessed on: 2021-08-01T01:06:53Z
definition: Companies engaged in storage of oil, gas and refined products.
notation: 5010303015
valid from: 2020
is activity of: Oil & Gas Transportation Services

Oil & Gas Transportation Services
type: NamedIndividual
type: BusinessClassification
type: Industry
is contemporary version of: http://data.ga-group.nl/ics/trbc/50103030
is version of: http://data.ga-group.nl/ics/trbc/50103030
replaces: http://data.ga-group.nl/ics/trbc/2012/50103030
imported on: 2023-04-07T16:52:39.364811Z
last refreshed on: 2026-06-05T07:16:11.699Z
source accessed on: 2017-12-31T07:04:19Z
source last accessed on: 2021-08-01T01:06:53Z
definition: Distributors of oil, gas and refined products. Includes operators of pipelines, storage facilities, gas liquefaction and re-gasification plants, sea-borne tankers, and related services.
notation: 50103030
valid from: 2020
is industry of: Oil & Gas Related Equipment and Services

Oil & Gas Related Equipment and Services
type: NamedIndividual
type: BusinessClassification
type: IndustryGroup
is contemporary version of: http://data.ga-group.nl/ics/trbc/501030
is version of: http://data.ga-group.nl/ics/trbc/501030
replaces: http://data.ga-group.nl/ics/trbc/2012/501030
imported on: 2023-04-07T16:52:39.364811Z
last refreshed on: 2026-06-05T07:16:11.699Z
source accessed on: 2017-12-31T07:04:19Z
source last accessed on: 2021-08-01T01:06:53Z
definition: Providers of oil and gas drilling and related services, as well as manufacturers of oil related equipment.
notation: 501030
valid from: 2020
is industry group of: Energy - Fossil Fuels

Energy - Fossil Fuels
type: NamedIndividual
type: BusinessClassification
type: BusinessSector
is contemporary version of: http://data.ga-group.nl/ics/trbc/5010
is version of: http://data.ga-group.nl/ics/trbc/5010
replaces: http://data.ga-group.nl/ics/trbc/2012/5010
imported on: 2023-04-07T16:52:39.364811Z
last refreshed on: 2026-06-05T07:16:11.699Z
source accessed on: 2017-12-31T07:04:19Z
source last accessed on: 2021-08-01T01:06:53Z
definition: Explorers, refiners, marketers and distributors of fossil fuels, as well as manufacturers of energy-related equipment and providers of supporting services.
notation: 5010
valid from: 2020
is business sector of: Energy

Renewable Energy Equipment & Services (NEC)
type: NamedIndividual
type: Activity
type: BusinessClassification
is contemporary version of: http://data.ga-group.nl/ics/trbc/5020101010
is version of: http://data.ga-group.nl/ics/trbc/5020101010
replaces: http://data.ga-group.nl/ics/trbc/2012/5020101010
imported on: 2023-04-07T16:52:39.364811Z
last refreshed on: 2026-06-05T07:16:11.699Z
source accessed on: 2017-12-31T07:04:19Z
source last accessed on: 2021-08-01T01:06:53Z
definition: Companies engaged in at least two activities under Renewable Energy Equipment & Services, none being dominant: Wind Systems & Equipment, Stationary Fuel Cells, Photovoltaic Solar Systems & Equipment, Thermal Solar Systems & Equipment, Biomass Power Energy Equipment; Waste to Energy Systems & Equipment, Hydropower Equipment, Wave Power Energy Equipment, Renewable Energy Services, Geothermal Equipment. Includes also entities not classified elsewhere under Renewable Energy Equipment & Services industry.
notation: 5020101010
valid from: 2020
is activity of: Renewable Energy Equipment & Services

Wind Systems & Equipment
type: NamedIndividual
type: Activity
type: BusinessClassification
is contemporary version of: http://data.ga-group.nl/ics/trbc/5020101011
is version of: http://data.ga-group.nl/ics/trbc/5020101011
replaces: http://data.ga-group.nl/ics/trbc/2012/5020101011
imported on: 2023-04-07T16:52:39.364811Z
last refreshed on: 2026-06-05T07:16:11.699Z
source accessed on: 2017-12-31T07:04:19Z
source last accessed on: 2021-08-01T01:06:53Z
definition: Companies engaged in manufacturing wind powered turbine generator sets, windmills, propellers and any other wind-related renewable energy equipment. Excludes operators of wind farms which provide electricity, classified under the Electric Utilities & IPPs industry, in Renewable Utilities or Renewable IPPs.
notation: 5020101011
valid from: 2020
is activity of: Renewable Energy Equipment & Services

Stationary Fuel Cells
type: NamedIndividual
type: Activity
type: BusinessClassification
is contemporary version of: http://data.ga-group.nl/ics/trbc/5020101012
is version of: http://data.ga-group.nl/ics/trbc/5020101012
replaces: http://data.ga-group.nl/ics/trbc/2012/5020101012
imported on: 2023-04-07T16:52:39.364811Z
last refreshed on: 2026-06-05T07:16:11.699Z
source accessed on: 2017-12-31T07:04:19Z
source last accessed on: 2021-08-01T01:06:53Z
definition: Companies engaged in manufacturing non-portable fuel cells (that convert the chemical energy from a fuel into electricity through a chemical reaction with oxygen) that are connected to electric grid or installed as a grid-independent generator for on-site service and are aimed at providing supplemental power and as emergency power system for critical areas. Includes manufacturers of hydrogen cells, polymer electrolyte fuel cell, phosphoric acid fuel cell, and molten carbonate fuel cell. Excludes portable fuel cells, used as micro power in consumer electronic devices or as portable power in emergency power systems for critical areas, classified in Portable Motors and Generators.
notation: 5020101012
valid from: 2020
is activity of: Renewable Energy Equipment & Services

Photovoltaic Solar Systems & Equipment
type: NamedIndividual
type: Activity
type: BusinessClassification
is contemporary version of: http://data.ga-group.nl/ics/trbc/5020101013
is version of: http://data.ga-group.nl/ics/trbc/5020101013
replaces: http://data.ga-group.nl/ics/trbc/2012/5020101013
imported on: 2023-04-07T16:52:39.364811Z
last refreshed on: 2026-06-05T07:16:11.699Z
source accessed on: 2017-12-31T07:04:19Z
source last accessed on: 2021-08-01T01:06:53Z
definition: Companies engaged in manufacturing photovoltaic devices, solar panels, solar cells and other PV systems & equipment, used mainly for electricity generation. Excludes companies engaged in the production of solar devices for heating purposes, classified as Thermal Solar Systems & Equipment.
notation: 5020101013
valid from: 2020
is activity of: Renewable Energy Equipment & Services

Thermal Solar Systems & Equipment
type: NamedIndividual
type: Activity
type: BusinessClassification
is contemporary version of: http://data.ga-group.nl/ics/trbc/5020101014
is version of: http://data.ga-group.nl/ics/trbc/5020101014
replaces: http://data.ga-group.nl/ics/trbc/2012/5020101014
imported on: 2023-04-07T16:52:39.364811Z
last refreshed on: 2026-06-05T07:16:11.699Z
source accessed on: 2017-12-31T07:04:19Z
source last accessed on: 2021-08-01T01:06:53Z
definition: Companies engaged in manufacturing solar thermal collectors, used for electricity generation and heating purposes. Excludes producers of solar energy panels, cells and systems used for the electricity generation, classified in Photovoltaic Solar Systems & Equipment.
notation: 5020101014
valid from: 2020
is activity of: Renewable Energy Equipment & Services

Biomass Power Energy Equipment
type: NamedIndividual
type: Activity
type: BusinessClassification
is contemporary version of: http://data.ga-group.nl/ics/trbc/5020101015
is version of: http://data.ga-group.nl/ics/trbc/5020101015
replaces: http://data.ga-group.nl/ics/trbc/2012/5020101015
imported on: 2023-04-07T16:52:39.364811Z
last refreshed on: 2026-06-05T07:16:11.699Z
source accessed on: 2017-12-31T07:04:19Z
source last accessed on: 2021-08-01T01:06:53Z
definition: Companies engaged in manufacturing biomass power energy related systems & equipment, such as biomass steam turbines, gasifiers or biomass combustion equipment that convert biomass (organic), such as forest residues, algae, wood chips into energy. Excludes companies that produce equipment for the transformation of industrial waste into energy, classified in Waste to Energy Systems & Equipment.
notation: 5020101015
valid from: 2020
is activity of: Renewable Energy Equipment & Services

Waste to Energy Systems & Equipment
type: NamedIndividual
type: Activity
type: BusinessClassification
is contemporary version of: http://data.ga-group.nl/ics/trbc/5020101016
is version of: http://data.ga-group.nl/ics/trbc/5020101016
replaces: http://data.ga-group.nl/ics/trbc/2012/5020101016
imported on: 2023-04-07T16:52:39.364811Z
last refreshed on: 2026-06-05T07:16:11.699Z
source accessed on: 2017-12-31T07:04:19Z
source last accessed on: 2021-08-01T01:06:53Z
definition: Companies engaged in manufacturing large scale equipment & systems which convert industrial and municipal (non-organic) waste to energy, such as waste to energy combustion equipment, incinerators, gasification or pyrolysis equipment. Excludes companies that produce equipment for converting biomass into energy, classified in Biomass Power Energy Equipment.
notation: 5020101016
valid from: 2020
is activity of: Renewable Energy Equipment & Services

Hydropower Equipment
type: NamedIndividual
type: Activity
type: BusinessClassification
is contemporary version of: http://data.ga-group.nl/ics/trbc/5020101017
is version of: http://data.ga-group.nl/ics/trbc/5020101017
replaces: http://data.ga-group.nl/ics/trbc/2012/5020101017
imported on: 2023-04-07T16:52:39.364811Z
last refreshed on: 2026-06-05T07:16:11.699Z
source accessed on: 2017-12-31T07:04:19Z
source last accessed on: 2021-08-01T01:06:53Z
definition: Companies engaged in manufacturing hydropower equipment, such as various types of hydroelectric dams, hydroelectricity plant equipment, vertical- and horizontal-axis hydraulic machines, hydroelectricity generators and turbines, among others. Excludes producers of wave and tidal energy equipment, classified in Wave Energy Equipment.
notation: 5020101017
valid from: 2020
is activity of: Renewable Energy Equipment & Services

Wave Power Energy Equipment
type: NamedIndividual
type: Activity
type: BusinessClassification
is contemporary version of: http://data.ga-group.nl/ics/trbc/5020101018
is version of: http://data.ga-group.nl/ics/trbc/5020101018
replaces: http://data.ga-group.nl/ics/trbc/2012/5020101018
imported on: 2023-04-07T16:52:39.364811Z
last refreshed on: 2026-06-05T07:16:11.699Z
source accessed on: 2017-12-31T07:04:19Z
source last accessed on: 2021-08-01T01:06:53Z
definition: Companies engaged in manufacturing wave power equipment that convert the power of ocean/sea waves into energy, known as Wave Energy Converters (WEC). Includes also tidal energy equipment producers. Excludes manufacturers of traditional hydropower equipment (using water power other than waves and tides), classified in Hydropower Equipment.
notation: 5020101018
valid from: 2020
is activity of: Renewable Energy Equipment & Services

Renewable Energy Services
type: NamedIndividual
type: Activity
type: BusinessClassification
is contemporary version of: http://data.ga-group.nl/ics/trbc/5020101019
is version of: http://data.ga-group.nl/ics/trbc/5020101019
replaces: http://data.ga-group.nl/ics/trbc/2012/5020101019
imported on: 2023-04-07T16:52:39.364811Z
last refreshed on: 2026-06-05T07:16:11.699Z
source accessed on: 2017-12-31T07:04:19Z
source last accessed on: 2021-08-01T01:06:53Z
definition: Companies engaged in the provision of services related to renewable industry, such as consulting services, engineering services, contractual construction, installation, repair and maintenance services, among others.
notation: 5020101019
valid from: 2020
is activity of: Renewable Energy Equipment & Services

Geothermal Equipment
type: NamedIndividual
type: Activity
type: BusinessClassification
is contemporary version of: http://data.ga-group.nl/ics/trbc/5020101020
is version of: http://data.ga-group.nl/ics/trbc/5020101020
replaces: http://data.ga-group.nl/ics/trbc/2012/5020101020
imported on: 2023-04-07T16:52:39.364811Z
last refreshed on: 2026-06-05T07:16:11.699Z
source accessed on: 2017-12-31T07:04:19Z
source last accessed on: 2021-08-01T01:06:53Z
definition: Companies engaged in the manufacture of geothermal equipment, such as equipment used in dry steam power plants, flash steam power plants and binary cycle power plants. This machinery includes geothermal heat pumps, Ground source heat pumps (GSHPs), geothermal heat exchangers, geothermal turbines, among others.
notation: 5020101020
valid from: 2020
is activity of: Renewable Energy Equipment & Services

Renewable Energy Equipment & Services
type: NamedIndividual
type: BusinessClassification
type: Industry
is contemporary version of: http://data.ga-group.nl/ics/trbc/50201010
is version of: http://data.ga-group.nl/ics/trbc/50201010
replaces: http://data.ga-group.nl/ics/trbc/2012/50201010
imported on: 2023-04-07T16:52:39.364811Z
last refreshed on: 2026-06-05T07:16:11.699Z
source accessed on: 2017-12-31T07:04:19Z
source last accessed on: 2021-08-01T01:06:53Z
definition: Manufacturers of solar power panels, hydrogen fuel cell systems, wind turbines, solar water-heating systems, wave power equipment and geothermal heating systems. Includes renewable energy system installation and consulting services.
notation: 50201010
valid from: 2020
is industry of: Renewable Energy

Renewable Fuels (NEC)
type: NamedIndividual
type: Activity
type: BusinessClassification
is contemporary version of: http://data.ga-group.nl/ics/trbc/5020102010
is version of: http://data.ga-group.nl/ics/trbc/5020102010
replaces: http://data.ga-group.nl/ics/trbc/2012/5020102010
imported on: 2023-04-07T16:52:39.364811Z
last refreshed on: 2026-06-05T07:16:11.699Z
source accessed on: 2017-12-31T07:04:19Z
source last accessed on: 2021-08-01T01:06:53Z
definition: Companies involved in at least two activities under Renewable Fuels, none being dominant: Biodiesel, Ethanol Fuels, Pyrolytic & Synthetic Fuels, Biomass & Biogas Fuels, Hydrogen Fuel. Includes also entities not elsewhere classified in the Renewable Fuels Industry.
notation: 5020102010
valid from: 2020
is activity of: Renewable Fuels

Biodiesel
type: NamedIndividual
type: Activity
type: BusinessClassification
is contemporary version of: http://data.ga-group.nl/ics/trbc/5020102011
is version of: http://data.ga-group.nl/ics/trbc/5020102011
replaces: http://data.ga-group.nl/ics/trbc/2012/5020102011
imported on: 2023-04-07T16:52:39.364811Z
last refreshed on: 2026-06-05T07:16:11.699Z
source accessed on: 2017-12-31T07:04:19Z
source last accessed on: 2021-08-01T01:06:53Z
definition: Producers and distributors of biodiesel fuel that is derived from vegetable oil or animal fat, made through a chemical process which converts oils and fats of natural origin into fatty acid methyl esters. Includes also producers of green diesel, derived from algae and other plant sources. Excludes bioethanol, classified in Ethanol Fuels.
notation: 5020102011
valid from: 2020
is activity of: Renewable Fuels

Ethanol Fuels
type: NamedIndividual
type: Activity
type: BusinessClassification
is contemporary version of: http://data.ga-group.nl/ics/trbc/5020102012
is version of: http://data.ga-group.nl/ics/trbc/5020102012
replaces: http://data.ga-group.nl/ics/trbc/2012/5020102012
imported on: 2023-04-07T16:52:39.364811Z
last refreshed on: 2026-06-05T07:16:11.699Z
source accessed on: 2017-12-31T07:04:19Z
source last accessed on: 2021-08-01T01:06:53Z
definition: Producers and distributors of ethanol fuel, also known as ethyl alcohol, and producers of bioethanol (made from biological materials, such as corn or sugarcane).
notation: 5020102012
valid from: 2020
is activity of: Renewable Fuels

Pyrolytic & Synthetic Fuels
type: NamedIndividual
type: Activity
type: BusinessClassification
is contemporary version of: http://data.ga-group.nl/ics/trbc/5020102013
is version of: http://data.ga-group.nl/ics/trbc/5020102013
replaces: http://data.ga-group.nl/ics/trbc/2012/5020102013
imported on: 2023-04-07T16:52:39.364811Z
last refreshed on: 2026-06-05T07:16:11.699Z
source accessed on: 2017-12-31T07:04:19Z
source last accessed on: 2021-08-01T01:06:53Z
definition: Producers of fuels achieved through pyrolysis (waste to energy conversion through decomposition of organic material at high temperatures without oxygen), and producers of synthetic renewable fuels. Excludes biomass fuels and biogas, classified in Biomass & Biogas Fuels.
notation: 5020102013
valid from: 2020
is activity of: Renewable Fuels

Biomass & Biogas Fuels
type: NamedIndividual
type: Activity
type: BusinessClassification
is contemporary version of: http://data.ga-group.nl/ics/trbc/5020102014
is version of: http://data.ga-group.nl/ics/trbc/5020102014
replaces: http://data.ga-group.nl/ics/trbc/2012/5020102014
imported on: 2023-04-07T16:52:39.364811Z
last refreshed on: 2026-06-05T07:16:11.699Z
source accessed on: 2017-12-31T07:04:19Z
source last accessed on: 2021-08-01T01:06:53Z
definition: Producers and distributors of biomass fuels, which is a result of the decomposition of the organic matter, such as dead plant, animal dung, and biogas, methane derived from animal manure and other digested organic material. Biomass fuel sources include dung and bagasse (sugar cane waste), stalks, straw, treetops, branches, wood chips, perennial crops and other forest waste. Excludes fuels derived as a result of pyrolysis process and synthetic fuels, classified in Pyrolytic & Synthetic Fuels, and producers of ethanol fuel/biodiesel, classified in Biodiesel.
notation: 5020102014
valid from: 2020
is activity of: Renewable Fuels

Hydrogen Fuel
type: NamedIndividual
type: Activity
type: BusinessClassification
is contemporary version of: http://data.ga-group.nl/ics/trbc/5020102015
is version of: http://data.ga-group.nl/ics/trbc/5020102015
replaces: http://data.ga-group.nl/ics/trbc/2012/5020102015
imported on: 2023-04-07T16:52:39.364811Z
last refreshed on: 2026-06-05T07:16:11.699Z
source accessed on: 2017-12-31T07:04:19Z
source last accessed on: 2021-08-01T01:06:53Z
definition: Producers and distributors of fuel based on Hydrogen, which uses electrochemical cells to generate power for vehicles (cars, spacecrafts) and electric devices. It is called zero emission fuel.
notation: 5020102015
valid from: 2020
is activity of: Renewable Fuels

Renewable Fuels
type: NamedIndividual
type: BusinessClassification
type: Industry
is contemporary version of: http://data.ga-group.nl/ics/trbc/50201020
is version of: http://data.ga-group.nl/ics/trbc/50201020
replaces: http://data.ga-group.nl/ics/trbc/2012/50201020
imported on: 2023-04-07T16:52:39.364811Z
last refreshed on: 2026-06-05T07:16:11.699Z
source accessed on: 2017-12-31T07:04:19Z
source last accessed on: 2021-08-01T01:06:53Z
definition: Producers and distributors of biofuels, hydrogen fuel and blended fuels such as biodiesel.
notation: 50201020
valid from: 2020
is industry of: Renewable Energy

Renewable Energy
type: NamedIndividual
type: BusinessClassification
type: IndustryGroup
is contemporary version of: http://data.ga-group.nl/ics/trbc/502010
is version of: http://data.ga-group.nl/ics/trbc/502010
replaces: http://data.ga-group.nl/ics/trbc/2012/502010
imported on: 2023-04-07T16:52:39.364811Z
last refreshed on: 2026-06-05T07:16:11.699Z
source accessed on: 2017-12-31T07:04:19Z
source last accessed on: 2021-08-01T01:06:53Z
definition: Manufacturers of renewable energy equipment, as well as service providers, and producers and distributors of renewable fuels.
notation: 502010
valid from: 2020
is industry group of: Renewable Energy

Renewable Energy
type: NamedIndividual
type: BusinessClassification
type: BusinessSector
is contemporary version of: http://data.ga-group.nl/ics/trbc/5020
is version of: http://data.ga-group.nl/ics/trbc/5020
replaces: http://data.ga-group.nl/ics/trbc/2012/5020
imported on: 2023-04-07T16:52:39.364811Z
last refreshed on: 2026-06-05T07:16:11.699Z
source accessed on: 2017-12-31T07:04:19Z
source last accessed on: 2021-08-01T01:06:53Z
definition: Manufacturers of renewable energy equipment, as well as service providers, and producers and distributors of renewable fuels. Includes manufacturers of solar power panels, hydrogen fuel cell systems, wind turbines, solar water-heating systems, wave power equipment and geothermal heating systems. Includes also renewable energy system installation and consulting services.
notation: 5020
valid from: 2020
is business sector of: Energy

Uranium (NEC)
type: NamedIndividual
type: Activity
type: BusinessClassification
is contemporary version of: http://data.ga-group.nl/ics/trbc/5030101010
is version of: http://data.ga-group.nl/ics/trbc/5030101010
replaces: http://data.ga-group.nl/ics/trbc/2012/5030101010
imported on: 2023-04-07T16:52:39.364811Z
last refreshed on: 2026-06-05T07:16:11.699Z
source accessed on: 2017-12-31T07:04:19Z
source last accessed on: 2021-08-01T01:06:53Z
definition: Companies engaged in both Uranium Mining and Uranium Processing, none being dominant. Includes entities not classified anywhere else under the Uranium Industry. Includes also companies engaged in mining and processing thorium, carnotite, polonium, radium, roscoelite, tyuyamunite, and vanadium.
notation: 5030101010
valid from: 2020
is activity of: Uranium

Uranium Mining
type: NamedIndividual
type: Activity
type: BusinessClassification
is contemporary version of: http://data.ga-group.nl/ics/trbc/5030101011
is version of: http://data.ga-group.nl/ics/trbc/5030101011
replaces: http://data.ga-group.nl/ics/trbc/2012/5030101011
imported on: 2023-04-07T16:52:39.364811Z
last refreshed on: 2026-06-05T07:16:11.699Z
source accessed on: 2017-12-31T07:04:19Z
source last accessed on: 2021-08-01T01:06:53Z
definition: Companies engaged in mining of uranium. Includes companies engaged in mining carnotite, radium, roscoelite, tyuyamunite and vanadium.
notation: 5030101011
valid from: 2020
is activity of: Uranium

Uranium Processing
type: NamedIndividual
type: Activity
type: BusinessClassification
is contemporary version of: http://data.ga-group.nl/ics/trbc/5030101012
is version of: http://data.ga-group.nl/ics/trbc/5030101012
replaces: http://data.ga-group.nl/ics/trbc/2012/5030101012
imported on: 2023-04-07T16:52:39.364811Z
last refreshed on: 2026-06-05T07:16:11.699Z
source accessed on: 2017-12-31T07:04:19Z
source last accessed on: 2021-08-01T01:06:53Z
definition: Companies engaged in the primary processing of uranium (purchased from other uranium mining companies), including hydrometallurgical processing, concentrating, refining, and leaching, among others. Includes also companies engaged in processing carnotite, radium, coscoelite, tyuyamunite and vanadium.
notation: 5030101012
valid from: 2020
is activity of: Uranium

Uranium
type: NamedIndividual
type: BusinessClassification
type: Industry
is contemporary version of: http://data.ga-group.nl/ics/trbc/50301010
is version of: http://data.ga-group.nl/ics/trbc/50301010
replaces: http://data.ga-group.nl/ics/trbc/2012/50301010
imported on: 2023-04-07T16:52:39.364811Z
last refreshed on: 2026-06-05T07:16:11.699Z
source accessed on: 2017-12-31T07:04:19Z
source last accessed on: 2021-08-01T01:06:53Z
definition: Extraction and primary processing of uranium. Includes companies engaged in mining thorium, polonium, carnotite, radium, roscoelite, tyuyamunite and vanadium.
notation: 50301010
valid from: 2020
is industry of: Uranium

Uranium
type: NamedIndividual
type: BusinessClassification
type: IndustryGroup
is contemporary version of: http://data.ga-group.nl/ics/trbc/503010
is version of: http://data.ga-group.nl/ics/trbc/503010
replaces: http://data.ga-group.nl/ics/trbc/2012/503010
imported on: 2023-04-07T16:52:39.364811Z
last refreshed on: 2026-06-05T07:16:11.699Z
source accessed on: 2017-12-31T07:04:19Z
source last accessed on: 2021-08-01T01:06:53Z
definition: Extraction and primary processing of uranium. Includes companies engaged in mining thorium, polonium, carnotite, radium, roscoelite, tyuyamunite and vanadium.
notation: 503010
valid from: 2020
is industry group of: Uranium

Uranium
type: NamedIndividual
type: BusinessClassification
type: BusinessSector
is contemporary version of: http://data.ga-group.nl/ics/trbc/5030
is version of: http://data.ga-group.nl/ics/trbc/5030
replaces: http://data.ga-group.nl/ics/trbc/2012/5030
imported on: 2023-04-07T16:52:39.364811Z
last refreshed on: 2026-06-05T07:16:11.699Z
source accessed on: 2017-12-31T07:04:19Z
source last accessed on: 2021-08-01T01:06:53Z
definition: Extraction and primary processing of uranium. Includes companies engaged in mining thorium, polonium, carnotite, radium, roscoelite, tyuyamunite and vanadium.
notation: 5030
valid from: 2020
is business sector of: Energy

Energy
type: NamedIndividual
type: BusinessClassification
type: EconomicSector
is contemporary version of: http://data.ga-group.nl/ics/trbc/50
is version of: http://data.ga-group.nl/ics/trbc/50
replaces: http://data.ga-group.nl/ics/trbc/2012/50
imported on: 2023-04-07T16:52:39.364811Z
last refreshed on: 2026-06-05T07:16:11.699Z
source accessed on: 2017-12-31T07:04:19Z
source last accessed on: 2021-08-01T01:06:53Z
definition: Explorers, refiners, marketers and distributors of fossil fuels, uranium and renewable energy, manufacturers of energy-related equipment and providers of supporting services.
notation: 50
valid from: 2020

Commodity Chemicals (NEC)
type: NamedIndividual
type: Activity
type: BusinessClassification
is contemporary version of: http://data.ga-group.nl/ics/trbc/5110101010
is version of: http://data.ga-group.nl/ics/trbc/5110101010
replaces: http://data.ga-group.nl/ics/trbc/2012/5110101010
imported on: 2023-04-07T16:52:39.364811Z
last refreshed on: 2026-06-05T07:16:11.699Z
source accessed on: 2017-12-31T07:04:19Z
source last accessed on: 2021-08-01T01:06:53Z
definition: Companies engaged in the processing and refining of industrial chemicals and gases, petrochemicals, liquid hydrocarbons, vinyl, casein and other plastic resin materials, stains, paints, tanning and softening agents, explosives and other commodity chemicals.
notation: 5110101010
valid from: 2020
is activity of: Commodity Chemicals

Plastics
type: NamedIndividual
type: Activity
type: BusinessClassification
is contemporary version of: http://data.ga-group.nl/ics/trbc/5110101011
is version of: http://data.ga-group.nl/ics/trbc/5110101011
replaces: http://data.ga-group.nl/ics/trbc/2012/5110101011
imported on: 2023-04-07T16:52:39.364811Z
last refreshed on: 2026-06-05T07:16:11.699Z
source accessed on: 2017-12-31T07:04:19Z
source last accessed on: 2021-08-01T01:06:53Z
definition: Companies engaged in the manufacturing resins, plastics materials, and non-vulcanizable thermoplastic elastomers.
notation: 5110101011
valid from: 2020
is activity of: Commodity Chemicals

Paints & Coatings
type: NamedIndividual
type: Activity
type: BusinessClassification
is contemporary version of: http://data.ga-group.nl/ics/trbc/5110101012
is version of: http://data.ga-group.nl/ics/trbc/5110101012
replaces: http://data.ga-group.nl/ics/trbc/2012/5110101012
imported on: 2023-04-07T16:52:39.364811Z
last refreshed on: 2026-06-05T07:16:11.699Z
source accessed on: 2017-12-31T07:04:19Z
source last accessed on: 2021-08-01T01:06:53Z
definition: Companies engaged in mixing pigments, solvents, and binders into paints and other coatings, such as stains, varnishes, lacquers, enamels, and shellacs.
notation: 5110101012
valid from: 2020
is activity of: Commodity Chemicals

Tanning & Softening Agents
type: NamedIndividual
type: Activity
type: BusinessClassification
is contemporary version of: http://data.ga-group.nl/ics/trbc/5110101013
is version of: http://data.ga-group.nl/ics/trbc/5110101013
replaces: http://data.ga-group.nl/ics/trbc/2012/5110101013
imported on: 2023-04-07T16:52:39.364811Z
last refreshed on: 2026-06-05T07:16:11.699Z
source accessed on: 2017-12-31T07:04:19Z
source last accessed on: 2021-08-01T01:06:53Z
definition: Companies engaged in manufacturing tanning & softening agents.
notation: 5110101013
valid from: 2020
is activity of: Commodity Chemicals

Explosives
type: NamedIndividual
type: Activity
type: BusinessClassification
is contemporary version of: http://data.ga-group.nl/ics/trbc/5110101014
is version of: http://data.ga-group.nl/ics/trbc/5110101014
replaces: http://data.ga-group.nl/ics/trbc/2012/5110101014
imported on: 2023-04-07T16:52:39.364811Z
last refreshed on: 2026-06-05T07:16:11.699Z
source accessed on: 2017-12-31T07:04:19Z
source last accessed on: 2021-08-01T01:06:53Z
definition: Companies engaged in manufacturing explosives, such as dynamite, blasting powders, and gunpowder.
notation: 5110101014
valid from: 2020
is activity of: Commodity Chemicals

Industrial Gases
type: NamedIndividual
type: Activity
type: BusinessClassification
is contemporary version of: http://data.ga-group.nl/ics/trbc/5110101015
is version of: http://data.ga-group.nl/ics/trbc/5110101015
replaces: http://data.ga-group.nl/ics/trbc/2012/5110101015
imported on: 2023-04-07T16:52:39.364811Z
last refreshed on: 2026-06-05T07:16:11.699Z
source accessed on: 2017-12-31T07:04:19Z
source last accessed on: 2021-08-01T01:06:53Z
definition: Companies engaged in manufacturing industrial organic and inorganic gases in compressed, liquid, and solid forms.
notation: 5110101015
valid from: 2020
is activity of: Commodity Chemicals

Commodity Chemicals Wholesale
type: NamedIndividual
type: Activity
type: BusinessClassification
is contemporary version of: http://data.ga-group.nl/ics/trbc/5110101016
is version of: http://data.ga-group.nl/ics/trbc/5110101016
replaces: http://data.ga-group.nl/ics/trbc/2012/5110101016
imported on: 2023-04-07T16:52:39.364811Z
last refreshed on: 2026-06-05T07:16:11.699Z
source accessed on: 2017-12-31T07:04:19Z
source last accessed on: 2021-08-01T01:06:53Z
definition: Companies engaged in wholesaling of any type(s) of chemicals.
notation: 5110101016
valid from: 2020
is activity of: Commodity Chemicals

Glass
type: NamedIndividual
type: Activity
type: BusinessClassification
is contemporary version of: http://data.ga-group.nl/ics/trbc/5110101017
is version of: http://data.ga-group.nl/ics/trbc/5110101017
imported on: 2023-04-07T17:17:07.492231Z
last refreshed on: 2026-06-05T07:16:11.699Z
source accessed on: 2021-04-25T05:48:36Z
source last accessed on: 2021-08-01T01:06:53Z
definition: Companies engaged in the manufacturing of raw form glass.
notation: 5110101017
valid from: 2020
is activity of: Commodity Chemicals

Commodity Chemicals
type: NamedIndividual
type: BusinessClassification
type: Industry
is contemporary version of: http://data.ga-group.nl/ics/trbc/51101010
is version of: http://data.ga-group.nl/ics/trbc/51101010
replaces: http://data.ga-group.nl/ics/trbc/2012/51101010
imported on: 2023-04-07T16:52:39.364811Z
last refreshed on: 2026-06-05T07:16:11.699Z
source accessed on: 2017-12-31T07:04:19Z
source last accessed on: 2021-08-01T01:06:53Z
definition: Producers, refiners and wholesalers of industrial chemicals and gases, petrochemicals, liquid hydrocarbons, vinyl, casein and other plastic resin materials, stains, paints, tanning and softening agents, explosives and other commodity chemicals.
notation: 51101010
valid from: 2020
is industry of: Chemicals

Agricultural Chemicals (NEC)
type: NamedIndividual
type: Activity
type: BusinessClassification
is contemporary version of: http://data.ga-group.nl/ics/trbc/5110102010
is version of: http://data.ga-group.nl/ics/trbc/5110102010
replaces: http://data.ga-group.nl/ics/trbc/2012/5110102010
imported on: 2023-04-07T16:52:39.364811Z
last refreshed on: 2026-06-05T07:16:11.699Z
source accessed on: 2017-12-31T07:04:19Z
source last accessed on: 2021-08-01T01:06:53Z
definition: Companies engaged in the production of potash, soda ash, peat humus beneficiating, nitrogenous, phosphatic and ammonia based fertilizers and minerals, insecticides, fungicides, weed and rodent poisons, agricultural salts and other agricultural related products.
notation: 5110102010
valid from: 2020
is activity of: Agricultural Chemicals

Fertilizers
type: NamedIndividual
type: Activity
type: BusinessClassification
is contemporary version of: http://data.ga-group.nl/ics/trbc/5110102011
is version of: http://data.ga-group.nl/ics/trbc/5110102011
replaces: http://data.ga-group.nl/ics/trbc/2012/5110102011
imported on: 2023-04-07T16:52:39.364811Z
last refreshed on: 2026-06-05T07:16:11.699Z
source accessed on: 2017-12-31T07:04:19Z
source last accessed on: 2021-08-01T01:06:53Z
definition: Companies engaged in the manufacturing or mixing of fertilizers, such as ammonia, nitric, and urea.
notation: 5110102011
valid from: 2020
is activity of: Agricultural Chemicals

Pesticides
type: NamedIndividual
type: Activity
type: BusinessClassification
is contemporary version of: http://data.ga-group.nl/ics/trbc/5110102012
is version of: http://data.ga-group.nl/ics/trbc/5110102012
replaces: http://data.ga-group.nl/ics/trbc/2012/5110102012
imported on: 2023-04-07T16:52:39.364811Z
last refreshed on: 2026-06-05T07:16:11.699Z
source accessed on: 2017-12-31T07:04:19Z
source last accessed on: 2021-08-01T01:06:53Z
definition: Companies engaged in the manufacturing or mixing of pesticides for agricultural purposes.
notation: 5110102012
valid from: 2020
is activity of: Agricultural Chemicals

Organic Fertilizers
type: NamedIndividual
type: Activity
type: BusinessClassification
is contemporary version of: http://data.ga-group.nl/ics/trbc/5110102013
is version of: http://data.ga-group.nl/ics/trbc/5110102013
replaces: http://data.ga-group.nl/ics/trbc/2012/5110102013
imported on: 2023-04-07T16:52:39.364811Z
last refreshed on: 2026-06-05T07:16:11.699Z
source accessed on: 2017-12-31T07:04:19Z
source last accessed on: 2021-08-01T01:06:53Z
definition: Companies engaged in the manufacturing or mixing of fertilizers which are organic in nature, such as plant or animal waste based.
notation: 5110102013
valid from: 2020
is activity of: Agricultural Chemicals

Agricultural Chemicals Wholesale
type: NamedIndividual
type: Activity
type: BusinessClassification
is contemporary version of: http://data.ga-group.nl/ics/trbc/5110102014
is version of: http://data.ga-group.nl/ics/trbc/5110102014
replaces: http://data.ga-group.nl/ics/trbc/2012/5110102014
imported on: 2023-04-07T16:52:39.364811Z
last refreshed on: 2026-06-05T07:16:11.699Z
source accessed on: 2017-12-31T07:04:19Z
source last accessed on: 2021-08-01T01:06:53Z
definition: Companies engaged in wholesaling of any type(s) of agricultural chemicals.
notation: 5110102014
valid from: 2020
is activity of: Agricultural Chemicals

Agricultural Chemicals
type: NamedIndividual
type: BusinessClassification
type: Industry
is contemporary version of: http://data.ga-group.nl/ics/trbc/51101020
is version of: http://data.ga-group.nl/ics/trbc/51101020
replaces: http://data.ga-group.nl/ics/trbc/2012/51101020
imported on: 2023-04-07T16:52:39.364811Z
last refreshed on: 2026-06-05T07:16:11.699Z
source accessed on: 2017-12-31T07:04:19Z
source last accessed on: 2021-08-01T01:06:53Z
definition: Producers and wholesalers of potash, soda ash and peat humus, and nitrogenous, phosphoric, and ammonia-based fertilizers and minerals, as well as insecticides, fungicides, weed and rodent poisons, agricultural salts and other agricultural related products.
notation: 51101020
valid from: 2020
is industry of: Chemicals

Specialty Chemicals (NEC)
type: NamedIndividual
type: Activity
type: BusinessClassification
is contemporary version of: http://data.ga-group.nl/ics/trbc/5110103010
is version of: http://data.ga-group.nl/ics/trbc/5110103010
replaces: http://data.ga-group.nl/ics/trbc/2012/5110103010
imported on: 2023-04-07T16:52:39.364811Z
last refreshed on: 2026-06-05T07:16:11.699Z
source accessed on: 2017-12-31T07:04:19Z
source last accessed on: 2021-08-01T01:06:53Z
definition: Companies engaged in the manufacturing of specialized chemicals, such as pigments, synthetic chemicals, polymers and glues.
notation: 5110103010
valid from: 2020
is activity of: Specialty Chemicals

Coloring Agents
type: NamedIndividual
type: Activity
type: BusinessClassification
is contemporary version of: http://data.ga-group.nl/ics/trbc/5110103011
is version of: http://data.ga-group.nl/ics/trbc/5110103011
replaces: http://data.ga-group.nl/ics/trbc/2012/5110103011
imported on: 2023-04-07T16:52:39.364811Z
last refreshed on: 2026-06-05T07:16:11.699Z
source accessed on: 2017-12-31T07:04:19Z
source last accessed on: 2021-08-01T01:06:53Z
definition: Companies engaged in the manufacturing of chemical based coloring agents.
notation: 5110103011
valid from: 2020
is activity of: Specialty Chemicals

Synthetic Fibers
type: NamedIndividual
type: Activity
type: BusinessClassification
is contemporary version of: http://data.ga-group.nl/ics/trbc/5110103012
is version of: http://data.ga-group.nl/ics/trbc/5110103012
replaces: http://data.ga-group.nl/ics/trbc/2012/5110103012
imported on: 2023-04-07T16:52:39.364811Z
last refreshed on: 2026-06-05T07:16:11.699Z
source accessed on: 2017-12-31T07:04:19Z
source last accessed on: 2021-08-01T01:06:53Z
definition: Companies engaged in manufacturing synthetic fibers and synthetic fiber raw materials.
notation: 5110103012
valid from: 2020
is activity of: Specialty Chemicals

Adhesives
type: NamedIndividual
type: Activity
type: BusinessClassification
is contemporary version of: http://data.ga-group.nl/ics/trbc/5110103013
is version of: http://data.ga-group.nl/ics/trbc/5110103013
replaces: http://data.ga-group.nl/ics/trbc/2012/5110103013
imported on: 2023-04-07T16:52:39.364811Z
last refreshed on: 2023-04-07T17:12:26.910158Z
source accessed on: 2017-12-31T07:04:19Z
source last accessed on: 2020-09-13T08:40:59Z
definition: Companies engaged in manufacturing adhesives, glues, and caulking compounds.
notation: 5110103013
valid from: 2020
is activity of: Specialty Chemicals

Advanced Polymers
type: NamedIndividual
type: Activity
type: BusinessClassification
is contemporary version of: http://data.ga-group.nl/ics/trbc/5110103014
is version of: http://data.ga-group.nl/ics/trbc/5110103014
replaces: http://data.ga-group.nl/ics/trbc/2012/5110103014
imported on: 2023-04-07T16:52:39.364811Z
last refreshed on: 2026-06-05T07:16:11.699Z
source accessed on: 2017-12-31T07:04:19Z
source last accessed on: 2021-08-01T01:06:53Z
definition: Companies engaged in manufacturing advanced polymers, such as fluoropolymers, fluorosurfactants, and silicone emulsions.
notation: 5110103014
valid from: 2020
is activity of: Specialty Chemicals

Epoxy Chemicals
type: NamedIndividual
type: Activity
type: BusinessClassification
is contemporary version of: http://data.ga-group.nl/ics/trbc/5110103015
is version of: http://data.ga-group.nl/ics/trbc/5110103015
replaces: http://data.ga-group.nl/ics/trbc/2012/5110103015
imported on: 2023-04-07T16:52:39.364811Z
last refreshed on: 2023-04-07T17:12:26.910158Z
source accessed on: 2017-12-31T07:04:19Z
source last accessed on: 2020-09-13T08:40:59Z
definition: Companies engaged in manufacturing epoxy resins, epoxy coatings, and epoxy adhesives.
notation: 5110103015
valid from: 2020
is activity of: Specialty Chemicals

Industrial Biotechnology Chemicals
type: NamedIndividual
type: Activity
type: BusinessClassification
is contemporary version of: http://data.ga-group.nl/ics/trbc/5110103016
is version of: http://data.ga-group.nl/ics/trbc/5110103016
replaces: http://data.ga-group.nl/ics/trbc/2012/5110103016
imported on: 2023-04-07T16:52:39.364811Z
last refreshed on: 2026-06-05T07:16:11.699Z
source accessed on: 2017-12-31T07:04:19Z
source last accessed on: 2021-08-01T01:06:53Z
definition: Companies engaged in manufacturing chemicals for industrial purposes, such as bioenergy, and biomaterials.
notation: 5110103016
valid from: 2020
is activity of: Specialty Chemicals

Specialty Chemicals Wholesale
type: NamedIndividual
type: Activity
type: BusinessClassification
is contemporary version of: http://data.ga-group.nl/ics/trbc/5110103017
is version of: http://data.ga-group.nl/ics/trbc/5110103017
replaces: http://data.ga-group.nl/ics/trbc/2012/5110103017
imported on: 2023-04-07T16:52:39.364811Z
last refreshed on: 2026-06-05T07:16:11.699Z
source accessed on: 2017-12-31T07:04:19Z
source last accessed on: 2021-08-01T01:06:53Z
definition: Companies engaged in wholesaling of any type(s) of specialty chemicals.
notation: 5110103017
valid from: 2020
is activity of: Specialty Chemicals

Composites
type: NamedIndividual
type: Activity
type: BusinessClassification
is contemporary version of: http://data.ga-group.nl/ics/trbc/5110103018
is version of: http://data.ga-group.nl/ics/trbc/5110103018
imported on: 2023-04-07T17:17:07.492231Z
last refreshed on: 2026-06-05T07:16:11.699Z
source accessed on: 2021-04-25T05:48:36Z
source last accessed on: 2021-08-01T01:06:53Z
definition: Companies engaged in manufacturing materials made by combining two or more components.
notation: 5110103018
valid from: 2020
is activity of: Specialty Chemicals

Adhesive & Epoxy
type: NamedIndividual
type: Activity
type: BusinessClassification
is contemporary version of: http://data.ga-group.nl/ics/trbc/5110103019
is version of: http://data.ga-group.nl/ics/trbc/5110103019
imported on: 2023-04-07T17:17:07.492231Z
last refreshed on: 2026-06-05T07:16:11.699Z
source accessed on: 2021-04-25T05:48:36Z
source last accessed on: 2021-08-01T01:06:53Z
definition: Companies engaged in manufacturing adhesives, glues, and caulking compounds, epoxy resins, epoxy coatings, and epoxy adhesives.
notation: 5110103019
valid from: 2020
is activity of: Specialty Chemicals

Specialty Chemicals
type: NamedIndividual
type: BusinessClassification
type: Industry
is contemporary version of: http://data.ga-group.nl/ics/trbc/51101030
is version of: http://data.ga-group.nl/ics/trbc/51101030
replaces: http://data.ga-group.nl/ics/trbc/2012/51101030
imported on: 2023-04-07T16:52:39.364811Z
last refreshed on: 2026-06-05T07:16:11.699Z
source accessed on: 2017-12-31T07:04:19Z
source last accessed on: 2021-08-01T01:06:53Z
definition: Producers and wholesalers of specialized chemicals such as pigments, inks, dyes, synthetic fibers, filaments and polymers, synthetic chemicals, adhesives, glues and epoxies.
notation: 51101030
valid from: 2020
is industry of: Chemicals

Diversified Chemicals
type: NamedIndividual
type: Activity
type: BusinessClassification
is contemporary version of: http://data.ga-group.nl/ics/trbc/5110109010
is version of: http://data.ga-group.nl/ics/trbc/5110109010
replaces: http://data.ga-group.nl/ics/trbc/2012/5110109010
imported on: 2023-04-07T16:52:39.364811Z
last refreshed on: 2026-06-05T07:16:11.699Z
source accessed on: 2017-12-31T07:04:19Z
source last accessed on: 2021-08-01T01:06:53Z
definition: Companies significantly engaged in at least two the following industries: Commodity Chemicals, Agricultural Chemicals and Specialty Chemicals.
notation: 5110109010
valid from: 2020
is activity of: Diversified Chemicals

Diversified Chemicals
type: NamedIndividual
type: BusinessClassification
type: Industry
is contemporary version of: http://data.ga-group.nl/ics/trbc/51101090
is version of: http://data.ga-group.nl/ics/trbc/51101090
replaces: http://data.ga-group.nl/ics/trbc/2012/51101090
imported on: 2023-04-07T16:52:39.364811Z
last refreshed on: 2026-06-05T07:16:11.699Z
source accessed on: 2017-12-31T07:04:19Z
source last accessed on: 2021-08-01T01:06:53Z
definition: Producers of two or more types of chemical from the commodity, agricultural or specialty chemical industries.
notation: 51101090
valid from: 2020
is industry of: Chemicals

Chemicals
type: NamedIndividual
type: BusinessClassification
type: IndustryGroup
is contemporary version of: http://data.ga-group.nl/ics/trbc/511010
is version of: http://data.ga-group.nl/ics/trbc/511010
replaces: http://data.ga-group.nl/ics/trbc/2012/511010
imported on: 2023-04-07T16:52:39.364811Z
last refreshed on: 2026-06-05T07:16:11.699Z
source accessed on: 2017-12-31T07:04:19Z
source last accessed on: 2021-08-01T01:06:53Z
definition: Producers and refiners of agricultural, commodity and specialty chemicals.
notation: 511010
valid from: 2020
is industry group of: Chemicals

Chemicals
type: NamedIndividual
type: BusinessClassification
type: BusinessSector
is contemporary version of: http://data.ga-group.nl/ics/trbc/5110
is version of: http://data.ga-group.nl/ics/trbc/5110
replaces: http://data.ga-group.nl/ics/trbc/2012/5110
imported on: 2023-04-07T16:52:39.364811Z
last refreshed on: 2026-06-05T07:16:11.699Z
source accessed on: 2017-12-31T07:04:19Z
source last accessed on: 2021-08-01T01:06:53Z
definition: Producers and refiners of agricultural, commodity and specialty chemicals.
notation: 5110
valid from: 2020
is business sector of: Basic Materials

Non-Gold Precious Metals & Minerals (NEC)
type: NamedIndividual
type: Activity
type: BusinessClassification
is contemporary version of: http://data.ga-group.nl/ics/trbc/5120101010
is version of: http://data.ga-group.nl/ics/trbc/5120101010
replaces: http://data.ga-group.nl/ics/trbc/2012/5120101010
imported on: 2023-04-07T16:52:39.364811Z
last refreshed on: 2026-06-05T07:16:11.699Z
source accessed on: 2017-12-31T07:04:19Z
source last accessed on: 2021-08-01T01:06:53Z
definition: Companies engaged in the extraction and primary processing of silver, platinum, diamond, gem stone, semiprecious stones, and other rare minerals and ores, as well as pearl cultivation. Excludes: (miners, refiners, producers and wholesalers of gold, classified in Gold), (miners, refiners, producers and wholesalers of uranium, classified in Uranium).
notation: 5120101010
valid from: 2020
is activity of: Non-Gold Precious Metals & Minerals

Silver Mining
type: NamedIndividual
type: Activity
type: BusinessClassification
is contemporary version of: http://data.ga-group.nl/ics/trbc/5120101011
is version of: http://data.ga-group.nl/ics/trbc/5120101011
replaces: http://data.ga-group.nl/ics/trbc/2012/5120101011
imported on: 2023-04-07T16:52:39.364811Z
last refreshed on: 2026-06-05T07:16:11.699Z
source accessed on: 2017-12-31T07:04:19Z
source last accessed on: 2021-08-01T01:06:53Z
definition: Companies engaged in the extraction and/or primary processing of silver.
notation: 5120101011
valid from: 2020
is activity of: Non-Gold Precious Metals & Minerals

Platinum Mining
type: NamedIndividual
type: Activity
type: BusinessClassification
is contemporary version of: http://data.ga-group.nl/ics/trbc/5120101012
is version of: http://data.ga-group.nl/ics/trbc/5120101012
replaces: http://data.ga-group.nl/ics/trbc/2012/5120101012
imported on: 2023-04-07T16:52:39.364811Z
last refreshed on: 2026-06-05T07:16:11.699Z
source accessed on: 2017-12-31T07:04:19Z
source last accessed on: 2021-08-01T01:06:53Z
definition: Companies engaged in the extraction and/or primary processing of platinum.
notation: 5120101012
valid from: 2020
is activity of: Non-Gold Precious Metals & Minerals

Diamond Mining
type: NamedIndividual
type: Activity
type: BusinessClassification
is contemporary version of: http://data.ga-group.nl/ics/trbc/5120101013
is version of: http://data.ga-group.nl/ics/trbc/5120101013
replaces: http://data.ga-group.nl/ics/trbc/2012/5120101013
imported on: 2023-04-07T16:52:39.364811Z
last refreshed on: 2026-06-05T07:16:11.699Z
source accessed on: 2017-12-31T07:04:19Z
source last accessed on: 2021-08-01T01:06:53Z
definition: Companies engaged in the extraction and/or primary processing of diamonds.
notation: 5120101013
valid from: 2020
is activity of: Non-Gold Precious Metals & Minerals

Semiprecious Gem Stones
type: NamedIndividual
type: Activity
type: BusinessClassification
is contemporary version of: http://data.ga-group.nl/ics/trbc/5120101014
is version of: http://data.ga-group.nl/ics/trbc/5120101014
replaces: http://data.ga-group.nl/ics/trbc/2012/5120101014
imported on: 2023-04-07T16:52:39.364811Z
last refreshed on: 2026-06-05T07:16:11.699Z
source accessed on: 2017-12-31T07:04:19Z
source last accessed on: 2021-08-01T01:06:53Z
definition: Companies engaged in the mining and/or beneficiating of gem stones, such as amethyst, garnet, agate, ruby, sapphire, and jade.
notation: 5120101014
valid from: 2020
is activity of: Non-Gold Precious Metals & Minerals

Pearl Cultivation
type: NamedIndividual
type: Activity
type: BusinessClassification
is contemporary version of: http://data.ga-group.nl/ics/trbc/5120101015
is version of: http://data.ga-group.nl/ics/trbc/5120101015
replaces: http://data.ga-group.nl/ics/trbc/2012/5120101015
imported on: 2023-04-07T16:52:39.364811Z
last refreshed on: 2026-06-05T07:16:11.699Z
source accessed on: 2017-12-31T07:04:19Z
source last accessed on: 2021-08-01T01:06:53Z
definition: Companies engaged in the artificially cultivating pearls.
notation: 5120101015
valid from: 2020
is activity of: Non-Gold Precious Metals & Minerals

Rare Earth Minerals
type: NamedIndividual
type: Activity
type: BusinessClassification
is contemporary version of: http://data.ga-group.nl/ics/trbc/5120101016
is version of: http://data.ga-group.nl/ics/trbc/5120101016
replaces: http://data.ga-group.nl/ics/trbc/2012/5120101016
imported on: 2023-04-07T16:52:39.364811Z
last refreshed on: 2026-06-05T07:16:11.699Z
source accessed on: 2017-12-31T07:04:19Z
source last accessed on: 2021-08-01T01:06:53Z
definition: Companies engaged in the mining and/or beneficiating of rare earth metal ores, such as aeschynite, britholite, fluorite, gadolinite, and titanite.
notation: 5120101016
valid from: 2020
is activity of: Non-Gold Precious Metals & Minerals

Non-Gold Precious Metals & Minerals
type: NamedIndividual
type: BusinessClassification
type: Industry
is contemporary version of: http://data.ga-group.nl/ics/trbc/51201010
is version of: http://data.ga-group.nl/ics/trbc/51201010
replaces: http://data.ga-group.nl/ics/trbc/2012/51201010
imported on: 2023-04-07T16:52:39.364811Z
last refreshed on: 2026-06-05T07:16:11.699Z
source accessed on: 2017-12-31T07:04:19Z
source last accessed on: 2021-08-01T01:06:53Z
definition: Miners, refiners, producers and wholesalers of silver, platinum, diamonds, gem stones, semiprecious stones and other rare minerals and ores, as well as pearl cultivation. Excludes: (miners, refiners, producers and wholesalers of gold, classified in Gold), (miners, refiners, producers and wholesalers of uranium, classified in Uranium).
notation: 51201010
valid from: 2020
is industry of: Metals & Mining

Iron & Steel (NEC)
type: NamedIndividual
type: Activity
type: BusinessClassification
is contemporary version of: http://data.ga-group.nl/ics/trbc/5120102010
is version of: http://data.ga-group.nl/ics/trbc/5120102010
replaces: http://data.ga-group.nl/ics/trbc/2012/5120102010
imported on: 2023-04-07T16:52:39.364811Z
last refreshed on: 2026-06-05T07:16:11.699Z
source accessed on: 2017-12-31T07:04:19Z
source last accessed on: 2021-08-01T01:06:53Z
definition: Companies engaged in reduction of iron ore, manufacturing pig iron, chromite, chrome mining and making steel.
notation: 5120102010
valid from: 2020
is activity of: Iron & Steel

Iron Ore Mining
type: NamedIndividual
type: Activity
type: BusinessClassification
is contemporary version of: http://data.ga-group.nl/ics/trbc/5120102011
is version of: http://data.ga-group.nl/ics/trbc/5120102011
replaces: http://data.ga-group.nl/ics/trbc/2012/5120102011
imported on: 2023-04-07T16:52:39.364811Z
last refreshed on: 2026-06-05T07:16:11.699Z
source accessed on: 2017-12-31T07:04:19Z
source last accessed on: 2021-08-01T01:06:53Z
definition: Companies engaged in reduction of iron ore, and manufacturing pig iron.
notation: 5120102011
valid from: 2020
is activity of: Iron & Steel

Coke Coal Mining
type: NamedIndividual
type: Activity
type: BusinessClassification
is contemporary version of: http://data.ga-group.nl/ics/trbc/5120102012
is version of: http://data.ga-group.nl/ics/trbc/5120102012
replaces: http://data.ga-group.nl/ics/trbc/2012/5120102012
imported on: 2023-04-07T16:52:39.364811Z
last refreshed on: 2026-06-05T07:16:11.699Z
source accessed on: 2017-12-31T07:04:19Z
source last accessed on: 2021-08-01T01:06:53Z
definition: Companies engaged in mining coke coal and coke wholesaling.
notation: 5120102012
valid from: 2020
is activity of: Iron & Steel

Iron, Steel Mills & Foundries
type: NamedIndividual
type: Activity
type: BusinessClassification
is contemporary version of: http://data.ga-group.nl/ics/trbc/5120102013
is version of: http://data.ga-group.nl/ics/trbc/5120102013
replaces: http://data.ga-group.nl/ics/trbc/2012/5120102013
imported on: 2023-04-07T16:52:39.364811Z
last refreshed on: 2026-06-05T07:16:11.699Z
source accessed on: 2017-12-31T07:04:19Z
source last accessed on: 2021-08-01T01:06:53Z
definition: Companies engaged in pouring molten pig iron or iron alloys into molds to manufacture castings, and manufacturing steel investment castings.
notation: 5120102013
valid from: 2020
is activity of: Iron & Steel

Metal Service Centers
type: NamedIndividual
type: Activity
type: BusinessClassification
is contemporary version of: http://data.ga-group.nl/ics/trbc/5120102014
is version of: http://data.ga-group.nl/ics/trbc/5120102014
replaces: http://data.ga-group.nl/ics/trbc/2012/5120102014
imported on: 2023-04-07T16:52:39.364811Z
last refreshed on: 2026-06-05T07:16:11.699Z
source accessed on: 2017-12-31T07:04:19Z
source last accessed on: 2021-08-01T01:06:53Z
definition: Companies engaged in functions, such as sawing, shearing, bending, leveling, cleaning, or edging, on a custom basis.
notation: 5120102014
valid from: 2020
is activity of: Iron & Steel

Metallic Rolling & Drawing Products
type: NamedIndividual
type: Activity
type: BusinessClassification
is contemporary version of: http://data.ga-group.nl/ics/trbc/5120102015
is version of: http://data.ga-group.nl/ics/trbc/5120102015
replaces: http://data.ga-group.nl/ics/trbc/2012/5120102015
imported on: 2023-04-07T16:52:39.364811Z
last refreshed on: 2026-06-05T07:16:11.699Z
source accessed on: 2017-12-31T07:04:19Z
source last accessed on: 2021-08-01T01:06:53Z
definition: Companies engaged in manufacturing rolling mill machinery and equipment for metal production, and wire drawing. Includes also manufacturers of steel pipes made of purchased steel.
notation: 5120102015
valid from: 2020
is activity of: Iron & Steel

Metal Merchant Wholesale
type: NamedIndividual
type: Activity
type: BusinessClassification
is contemporary version of: http://data.ga-group.nl/ics/trbc/5120102016
is version of: http://data.ga-group.nl/ics/trbc/5120102016
replaces: http://data.ga-group.nl/ics/trbc/2012/5120102016
imported on: 2023-04-07T16:52:39.364811Z
last refreshed on: 2026-06-05T07:16:11.699Z
source accessed on: 2017-12-31T07:04:19Z
source last accessed on: 2021-08-01T01:06:53Z
definition: Companies engaged in wholesaling products of the primary metals industries.
notation: 5120102016
valid from: 2020
is activity of: Iron & Steel

Iron & Steel
type: NamedIndividual
type: BusinessClassification
type: Industry
is contemporary version of: http://data.ga-group.nl/ics/trbc/51201020
is version of: http://data.ga-group.nl/ics/trbc/51201020
replaces: http://data.ga-group.nl/ics/trbc/2012/51201020
imported on: 2023-04-07T16:52:39.364811Z
last refreshed on: 2026-06-05T07:16:11.699Z
source accessed on: 2017-12-31T07:04:19Z
source last accessed on: 2021-08-01T01:06:53Z
definition: Miners and processers of iron ore and coke coal and producers of iron and steel. Includes providers of metal ore exploration and mining services, operators of iron and steel foundries for beneficiating, smelting, rolling, forging, spinning, recycling, stamping, polishing and plating of iron and steel products such as pipes, tubes, wire, spring, rolls and bars, and providers of metal processing services and wholesalers of iron and steel products.
notation: 51201020
valid from: 2020
is industry of: Metals & Mining

Aluminum (NEC)
type: NamedIndividual
type: Activity
type: BusinessClassification
is contemporary version of: http://data.ga-group.nl/ics/trbc/5120103010
is version of: http://data.ga-group.nl/ics/trbc/5120103010
replaces: http://data.ga-group.nl/ics/trbc/2012/5120103010
imported on: 2023-04-07T16:52:39.364811Z
last refreshed on: 2026-06-05T07:16:11.699Z
source accessed on: 2017-12-31T07:04:19Z
source last accessed on: 2021-08-01T01:06:53Z
definition: Miners and processers of bauxite, including smelting, refining and processing of alumina and aluminum alloys. Includes also operators of recycling and die-casting plants, and foundries, as well as producers of foil, molds, plate, tube, sheet, rods, pipe, wire and other aluminum products.
notation: 5120103010
valid from: 2020
is activity of: Aluminum

Primary Aluminum Production
type: NamedIndividual
type: Activity
type: BusinessClassification
is contemporary version of: http://data.ga-group.nl/ics/trbc/5120103011
is version of: http://data.ga-group.nl/ics/trbc/5120103011
replaces: http://data.ga-group.nl/ics/trbc/2012/5120103011
imported on: 2023-04-07T16:52:39.364811Z
last refreshed on: 2026-06-05T07:16:11.699Z
source accessed on: 2017-12-31T07:04:19Z
source last accessed on: 2021-08-01T01:06:53Z
definition: Companies engaged in making aluminum from alumina, and rolling, drawing, extruding, or casting the aluminum they make into primary forms (bar, billet, ingot, plate, rod, sheet, strip).
notation: 5120103011
valid from: 2020
is activity of: Aluminum

Secondary Smelting & Alloying of Aluminum
type: NamedIndividual
type: Activity
type: BusinessClassification
is contemporary version of: http://data.ga-group.nl/ics/trbc/5120103012
is version of: http://data.ga-group.nl/ics/trbc/5120103012
replaces: http://data.ga-group.nl/ics/trbc/2012/5120103012
imported on: 2023-04-07T16:52:39.364811Z
last refreshed on: 2026-06-05T07:16:11.699Z
source accessed on: 2017-12-31T07:04:19Z
source last accessed on: 2021-08-01T01:06:53Z
definition: Companies engaged in recovering aluminum and aluminum alloys from scrap and/or dross (i.e. secondary smelting) and making billet or ingot (except by rolling) and/or manufacturing alloys, powder, paste, or flake from purchased aluminum.
notation: 5120103012
valid from: 2020
is activity of: Aluminum

Aluminum Rolling
type: NamedIndividual
type: Activity
type: BusinessClassification
is contemporary version of: http://data.ga-group.nl/ics/trbc/5120103013
is version of: http://data.ga-group.nl/ics/trbc/5120103013
replaces: http://data.ga-group.nl/ics/trbc/2012/5120103013
imported on: 2023-04-07T16:52:39.364811Z
last refreshed on: 2026-06-05T07:16:11.699Z
source accessed on: 2017-12-31T07:04:19Z
source last accessed on: 2021-08-01T01:06:53Z
definition: Companies engaged in flat rolling or continuous casting sheet, plate, foil and welded tube from purchased aluminum and/or recovering aluminum from scrap and flat rolling or continuous casting sheet, plate, foil, and welded tube in integrated mills.
notation: 5120103013
valid from: 2020
is activity of: Aluminum

Aluminum Refining
type: NamedIndividual
type: Activity
type: BusinessClassification
is contemporary version of: http://data.ga-group.nl/ics/trbc/5120103014
is version of: http://data.ga-group.nl/ics/trbc/5120103014
replaces: http://data.ga-group.nl/ics/trbc/2012/5120103014
imported on: 2023-04-07T16:52:39.364811Z
last refreshed on: 2026-06-05T07:16:11.699Z
source accessed on: 2017-12-31T07:04:19Z
source last accessed on: 2021-08-01T01:06:53Z
definition: Companies engaged in refining alumina (aluminum oxide) generally from bauxite.
notation: 5120103014
valid from: 2020
is activity of: Aluminum

Aluminum Wholesale
type: NamedIndividual
type: Activity
type: BusinessClassification
is contemporary version of: http://data.ga-group.nl/ics/trbc/5120103015
is version of: http://data.ga-group.nl/ics/trbc/5120103015
replaces: http://data.ga-group.nl/ics/trbc/2012/5120103015
imported on: 2023-04-07T16:52:39.364811Z
last refreshed on: 2026-06-05T07:16:11.699Z
source accessed on: 2017-12-31T07:04:19Z
source last accessed on: 2021-08-01T01:06:53Z
definition: Companies engaged in wholesaling aluminum.
notation: 5120103015
valid from: 2020
is activity of: Aluminum

Bauxite Mining
type: NamedIndividual
type: Activity
type: BusinessClassification
is contemporary version of: http://data.ga-group.nl/ics/trbc/5120103016
is version of: http://data.ga-group.nl/ics/trbc/5120103016
replaces: http://data.ga-group.nl/ics/trbc/2012/5120103016
imported on: 2023-04-07T16:52:39.364811Z
last refreshed on: 2026-06-05T07:16:11.699Z
source accessed on: 2017-12-31T07:04:19Z
source last accessed on: 2021-08-01T01:06:53Z
definition: Companies engaged in mining Bauxite.
notation: 5120103016
valid from: 2020
is activity of: Aluminum

Aluminum
type: NamedIndividual
type: BusinessClassification
type: Industry
is contemporary version of: http://data.ga-group.nl/ics/trbc/51201030
is version of: http://data.ga-group.nl/ics/trbc/51201030
replaces: http://data.ga-group.nl/ics/trbc/2012/51201030
imported on: 2023-04-07T16:52:39.364811Z
last refreshed on: 2026-06-05T07:16:11.699Z
source accessed on: 2017-12-31T07:04:19Z
source last accessed on: 2021-08-01T01:06:53Z
definition: Miners and processers of bauxite, including primary processing, secondary smelting, alloying, rolling refining of alumina and aluminum alloys. Includes also operators of recycling and die-casting plants, and foundries, as well as producers of foil, molds, plate, tube, sheet, rods, pipe, wire and other aluminum products, and wholesalers of aluminum products.
notation: 51201030
valid from: 2020
is industry of: Metals & Mining

Specialty Mining & Metals (NEC)
type: NamedIndividual
type: Activity
type: BusinessClassification
is contemporary version of: http://data.ga-group.nl/ics/trbc/5120105010
is version of: http://data.ga-group.nl/ics/trbc/5120105010
replaces: http://data.ga-group.nl/ics/trbc/2012/5120105010
imported on: 2023-04-07T16:52:39.364811Z
last refreshed on: 2026-06-05T07:16:11.699Z
source accessed on: 2017-12-31T07:04:19Z
source last accessed on: 2021-08-01T01:06:53Z
definition: Companies engaged in the mining, beneficiating and basic processing of non-ferrous metals such as copper, zinc, lead, tin, nickel, cobalt, graphite, titanium and other non-ferrous metals for the manufacturing of foils, pipes, tubes, rods, sheets, plates, powders and wires. Includes also non-metallic minerals.
notation: 5120105010
valid from: 2020
is activity of: Specialty Mining & Metals

Lead Ore Mining
type: NamedIndividual
type: Activity
type: BusinessClassification
is contemporary version of: http://data.ga-group.nl/ics/trbc/5120105011
is version of: http://data.ga-group.nl/ics/trbc/5120105011
replaces: http://data.ga-group.nl/ics/trbc/2012/5120105011
imported on: 2023-04-07T16:52:39.364811Z
last refreshed on: 2026-06-05T07:16:11.699Z
source accessed on: 2017-12-31T07:04:19Z
source last accessed on: 2021-08-01T01:06:53Z
definition: Companies engaged in developing the mine site, mining, and/or beneficiating of lead ores or lead-zinc ores.
notation: 5120105011
valid from: 2020
is activity of: Specialty Mining & Metals

Copper Ore Mining
type: NamedIndividual
type: Activity
type: BusinessClassification
is contemporary version of: http://data.ga-group.nl/ics/trbc/5120105012
is version of: http://data.ga-group.nl/ics/trbc/5120105012
replaces: http://data.ga-group.nl/ics/trbc/2012/5120105012
imported on: 2023-04-07T16:52:39.364811Z
last refreshed on: 2026-06-05T07:16:11.699Z
source accessed on: 2017-12-31T07:04:19Z
source last accessed on: 2021-08-01T01:06:53Z
definition: Companies engaged in developing the mine site, mining, and/or beneficiating of copper.
notation: 5120105012
valid from: 2020
is activity of: Specialty Mining & Metals

Nickel Ore Mining
type: NamedIndividual
type: Activity
type: BusinessClassification
is contemporary version of: http://data.ga-group.nl/ics/trbc/5120105013
is version of: http://data.ga-group.nl/ics/trbc/5120105013
replaces: http://data.ga-group.nl/ics/trbc/2012/5120105013
imported on: 2023-04-07T16:52:39.364811Z
last refreshed on: 2026-06-05T07:16:11.699Z
source accessed on: 2017-12-31T07:04:19Z
source last accessed on: 2021-08-01T01:06:53Z
definition: Companies engaged in developing the mine site, mining, and/or beneficiating of nickel ores.
notation: 5120105013
valid from: 2020
is activity of: Specialty Mining & Metals

Zinc Ore Mining
type: NamedIndividual
type: Activity
type: BusinessClassification
is contemporary version of: http://data.ga-group.nl/ics/trbc/5120105014
is version of: http://data.ga-group.nl/ics/trbc/5120105014
replaces: http://data.ga-group.nl/ics/trbc/2012/5120105014
imported on: 2023-04-07T16:52:39.364811Z
last refreshed on: 2026-06-05T07:16:11.699Z
source accessed on: 2017-12-31T07:04:19Z
source last accessed on: 2021-08-01T01:06:53Z
definition: Companies engaged in developing the mine site, mining, and/or beneficiating of zinc ores.
notation: 5120105014
valid from: 2020
is activity of: Specialty Mining & Metals

Nonferrous Metal Mining
type: NamedIndividual
type: Activity
type: BusinessClassification
is contemporary version of: http://data.ga-group.nl/ics/trbc/5120105015
is version of: http://data.ga-group.nl/ics/trbc/5120105015
replaces: http://data.ga-group.nl/ics/trbc/2012/5120105015
imported on: 2023-04-07T16:52:39.364811Z
last refreshed on: 2026-06-05T07:16:11.699Z
source accessed on: 2017-12-31T07:04:19Z
source last accessed on: 2021-08-01T01:06:53Z
definition: Companies engaged in mining nonferrous metals, such as tin and titanium. Includes also mining of all minerals. Excludes mining such nonferrous metals as zinc, lead and copper, classified in Zinc Mining, Lead Mining and Copper Mining, respectively.
notation: 5120105015
valid from: 2020
is activity of: Specialty Mining & Metals

Nonferrous Metal Processing
type: NamedIndividual
type: Activity
type: BusinessClassification
is contemporary version of: http://data.ga-group.nl/ics/trbc/5120105016
is version of: http://data.ga-group.nl/ics/trbc/5120105016
replaces: http://data.ga-group.nl/ics/trbc/2012/5120105016
imported on: 2023-04-07T16:52:39.364811Z
last refreshed on: 2026-06-05T07:16:11.699Z
source accessed on: 2017-12-31T07:04:19Z
source last accessed on: 2021-08-01T01:06:53Z
definition: Companies engaged in making (i.e. the primary production of) nonferrous metals by smelting ore and/or the primary refining of nonferrous metals by electrolytic methods or other processes.
notation: 5120105016
valid from: 2020
is activity of: Specialty Mining & Metals

Specialty Mining & Metals Wholesale
type: NamedIndividual
type: Activity
type: BusinessClassification
is contemporary version of: http://data.ga-group.nl/ics/trbc/5120105017
is version of: http://data.ga-group.nl/ics/trbc/5120105017
replaces: http://data.ga-group.nl/ics/trbc/2012/5120105017
imported on: 2023-04-07T16:52:39.364811Z
last refreshed on: 2026-06-05T07:16:11.699Z
source accessed on: 2017-12-31T07:04:19Z
source last accessed on: 2021-08-01T01:06:53Z
definition: Companies engaged in wholesaling products of the specialty metals industries.
notation: 5120105017
valid from: 2020
is activity of: Specialty Mining & Metals

Specialty Mining & Metals
type: NamedIndividual
type: BusinessClassification
type: Industry
is contemporary version of: http://data.ga-group.nl/ics/trbc/51201050
is version of: http://data.ga-group.nl/ics/trbc/51201050
replaces: http://data.ga-group.nl/ics/trbc/2012/51201050
imported on: 2023-04-07T16:52:39.364811Z
last refreshed on: 2026-06-05T07:16:11.699Z
source accessed on: 2017-12-31T07:04:19Z
source last accessed on: 2021-08-01T01:06:53Z
definition: Miners, processors and wholesalers of non-ferrous metals such as copper, zinc, lead, tin, nickel, cobalt, graphite, titanium and other non-ferrous metals. Includes non-metallic minerals.
notation: 51201050
valid from: 2020
is industry of: Metals & Mining

Gold (NEC)
type: NamedIndividual
type: Activity
type: BusinessClassification
is contemporary version of: http://data.ga-group.nl/ics/trbc/5120106010
is version of: http://data.ga-group.nl/ics/trbc/5120106010
replaces: http://data.ga-group.nl/ics/trbc/2012/5120106010
imported on: 2023-04-07T16:52:39.364811Z
last refreshed on: 2026-06-05T07:16:11.699Z
source accessed on: 2017-12-31T07:04:19Z
source last accessed on: 2021-08-01T01:06:53Z
definition: Companies engaged in the extraction and primary processing of gold.
notation: 5120106010
valid from: 2020
is activity of: Gold

Gold Mining
type: NamedIndividual
type: Activity
type: BusinessClassification
is contemporary version of: http://data.ga-group.nl/ics/trbc/5120106011
is version of: http://data.ga-group.nl/ics/trbc/5120106011
replaces: http://data.ga-group.nl/ics/trbc/2012/5120106011
imported on: 2023-04-07T16:52:39.364811Z
last refreshed on: 2026-06-05T07:16:11.699Z
source accessed on: 2017-12-31T07:04:19Z
source last accessed on: 2021-08-01T01:06:53Z
definition: Companies engaged in the extraction of gold.
notation: 5120106011
valid from: 2020
is activity of: Gold

Gold Refining
type: NamedIndividual
type: Activity
type: BusinessClassification
is contemporary version of: http://data.ga-group.nl/ics/trbc/5120106012
is version of: http://data.ga-group.nl/ics/trbc/5120106012
replaces: http://data.ga-group.nl/ics/trbc/2012/5120106012
imported on: 2023-04-07T16:52:39.364811Z
last refreshed on: 2026-06-05T07:16:11.699Z
source accessed on: 2017-12-31T07:04:19Z
source last accessed on: 2021-08-01T01:06:53Z
definition: Companies engaged in the refining, processing of gold.
notation: 5120106012
valid from: 2020
is activity of: Gold

Gold
type: NamedIndividual
type: BusinessClassification
type: Industry
is contemporary version of: http://data.ga-group.nl/ics/trbc/51201060
is version of: http://data.ga-group.nl/ics/trbc/51201060
replaces: http://data.ga-group.nl/ics/trbc/2012/51201060
imported on: 2023-04-07T16:52:39.364811Z
last refreshed on: 2026-06-05T07:16:11.699Z
source accessed on: 2017-12-31T07:04:19Z
source last accessed on: 2021-08-01T01:06:53Z
definition: Extraction and primary processing of gold. Companies primarily engaged in transformation of the gold into bullion in combination with mining activities.
notation: 51201060
valid from: 2020
is industry of: Metals & Mining

Mining Support Services & Equipment (NEC)
type: NamedIndividual
type: Activity
type: BusinessClassification
is contemporary version of: http://data.ga-group.nl/ics/trbc/5120107010
is version of: http://data.ga-group.nl/ics/trbc/5120107010
replaces: http://data.ga-group.nl/ics/trbc/2012/5120107010
imported on: 2023-04-07T16:52:39.364811Z
last refreshed on: 2026-06-05T07:16:11.699Z
source accessed on: 2017-12-31T07:04:19Z
source last accessed on: 2021-08-01T01:06:53Z
definition: Companies engaged in providing support services, on a fee, required for the mining and quarrying of minerals. Includes also equipment manufacturers for mining industry.
notation: 5120107010
valid from: 2020
is activity of: Mining Support Services & Equipment

Geophysical Surveying & Mapping Services
type: NamedIndividual
type: Activity
type: BusinessClassification
is contemporary version of: http://data.ga-group.nl/ics/trbc/5120107011
is version of: http://data.ga-group.nl/ics/trbc/5120107011
replaces: http://data.ga-group.nl/ics/trbc/2012/5120107011
imported on: 2023-04-07T16:52:39.364811Z
last refreshed on: 2026-06-05T07:16:11.699Z
source accessed on: 2017-12-31T07:04:19Z
source last accessed on: 2021-08-01T01:06:53Z
definition: Companies engaged in gathering, interpreting, and mapping geophysical data.
notation: 5120107011
valid from: 2020
is activity of: Mining Support Services & Equipment

Mining Support Services
type: NamedIndividual
type: Activity
type: BusinessClassification
is contemporary version of: http://data.ga-group.nl/ics/trbc/5120107012
is version of: http://data.ga-group.nl/ics/trbc/5120107012
replaces: http://data.ga-group.nl/ics/trbc/2012/5120107012
imported on: 2023-04-07T16:52:39.364811Z
last refreshed on: 2026-06-05T07:16:11.699Z
source accessed on: 2017-12-31T07:04:19Z
source last accessed on: 2021-08-01T01:06:53Z
definition: Companies primarily engaged in providing support services, on a fee or contract basis, required for the mining and quarrying of minerals.
notation: 5120107012
valid from: 2020
is activity of: Mining Support Services & Equipment

Mining Machinery & Equipment Manufacturing
type: NamedIndividual
type: Activity
type: BusinessClassification
is contemporary version of: http://data.ga-group.nl/ics/trbc/5120107013
is version of: http://data.ga-group.nl/ics/trbc/5120107013
replaces: http://data.ga-group.nl/ics/trbc/2012/5120107013
imported on: 2023-04-07T16:52:39.364811Z
last refreshed on: 2026-06-05T07:16:11.699Z
source accessed on: 2017-12-31T07:04:19Z
source last accessed on: 2021-08-01T01:06:53Z
definition: Companies engaged in manufacturing underground mining machinery and equipment, such as coal breakers, mining cars, core drills, coal cutters, and rock drills.
notation: 5120107013
valid from: 2020
is activity of: Mining Support Services & Equipment

Mining Support Services & Equipment
type: NamedIndividual
type: BusinessClassification
type: Industry
is contemporary version of: http://data.ga-group.nl/ics/trbc/51201070
is version of: http://data.ga-group.nl/ics/trbc/51201070
replaces: http://data.ga-group.nl/ics/trbc/2012/51201070
imported on: 2023-04-07T16:52:39.364811Z
last refreshed on: 2026-06-05T07:16:11.699Z
source accessed on: 2017-12-31T07:04:19Z
source last accessed on: 2021-08-01T01:06:53Z
definition: Providers of support services and equipment manufactures for the mining and quarrying of minerals.
notation: 51201070
valid from: 2020
is industry of: Metals & Mining

Diversified Mining
type: NamedIndividual
type: Activity
type: BusinessClassification
is contemporary version of: http://data.ga-group.nl/ics/trbc/5120108010
is version of: http://data.ga-group.nl/ics/trbc/5120108010
replaces: http://data.ga-group.nl/ics/trbc/2012/5120108010
imported on: 2023-04-07T16:52:39.364811Z
last refreshed on: 2026-06-05T07:16:11.699Z
source accessed on: 2017-12-31T07:04:19Z
source last accessed on: 2021-08-01T01:06:53Z
definition: Companies significantly engaged in at least two of the following industries: Precious Metals & Minerals, Gold, Mining Support Services & Equipment, Steel, Aluminum and Specialty Mining Metals.
notation: 5120108010
valid from: 2020
is activity of: Diversified Mining

Diversified Mining
type: NamedIndividual
type: BusinessClassification
type: Industry
is contemporary version of: http://data.ga-group.nl/ics/trbc/51201080
is version of: http://data.ga-group.nl/ics/trbc/51201080
replaces: http://data.ga-group.nl/ics/trbc/2012/51201080
imported on: 2023-04-07T16:52:39.364811Z
last refreshed on: 2026-06-05T07:16:11.699Z
source accessed on: 2017-12-31T07:04:19Z
source last accessed on: 2021-08-01T01:06:53Z
definition: Organizations significantly engaged in at least two of the following industries: Precious Metals & Minerals, Gold, Mining Support Services & Equipment, Steel, Aluminum and Specialty Mining Metals.
notation: 51201080
valid from: 2020
is industry of: Metals & Mining

Metals & Mining
type: NamedIndividual
type: BusinessClassification
type: IndustryGroup
is contemporary version of: http://data.ga-group.nl/ics/trbc/512010
is version of: http://data.ga-group.nl/ics/trbc/512010
replaces: http://data.ga-group.nl/ics/trbc/2012/512010
imported on: 2023-04-07T16:52:39.364811Z
last refreshed on: 2026-06-05T07:16:11.699Z
source accessed on: 2017-12-31T07:04:19Z
source last accessed on: 2021-08-01T01:06:53Z
definition: Miners and processors of precious metals & minerals, steel, aluminum and specialty metals and minerals. Includes integrated mining, and mining support services & equipment companies.
notation: 512010
valid from: 2020
is industry group of: Mineral Resources

Construction Materials (NEC)
type: NamedIndividual
type: Activity
type: BusinessClassification
is contemporary version of: http://data.ga-group.nl/ics/trbc/5120201010
is version of: http://data.ga-group.nl/ics/trbc/5120201010
replaces: http://data.ga-group.nl/ics/trbc/2012/5120201010
imported on: 2023-04-07T16:52:39.364811Z
last refreshed on: 2026-06-05T07:16:11.699Z
source accessed on: 2017-12-31T07:04:19Z
source last accessed on: 2021-08-01T01:06:53Z
definition: Companies engaged in the mining, quarrying and primary processing of raw materials involved in road and building construction. Includes the extraction of sand, gravel, rock, clay, gneiss, granite, limestone, marble, slate, gypsum, lime, cement, concrete, fiberglass and bricks, as well as filtering, bleaching, crushing, cutting, sizing and other stone processing operations.
notation: 5120201010
valid from: 2020
is activity of: Construction Materials

Construction Material Processing
type: NamedIndividual
type: Activity
type: BusinessClassification
is contemporary version of: http://data.ga-group.nl/ics/trbc/5120201011
is version of: http://data.ga-group.nl/ics/trbc/5120201011
replaces: http://data.ga-group.nl/ics/trbc/2012/5120201011
imported on: 2023-04-07T16:52:39.364811Z
last refreshed on: 2026-06-05T07:16:11.699Z
source accessed on: 2017-12-31T07:04:19Z
source last accessed on: 2021-08-01T01:06:53Z
definition: Companies engaged in providing stone, lime, construction sand, gravel, brick, asphalt and concrete mixtures, and/or concrete, stone, and structural clay products.
notation: 5120201011
valid from: 2020
is activity of: Construction Materials

Cement & Concrete Manufacturing
type: NamedIndividual
type: Activity
type: BusinessClassification
is contemporary version of: http://data.ga-group.nl/ics/trbc/5120201012
is version of: http://data.ga-group.nl/ics/trbc/5120201012
replaces: http://data.ga-group.nl/ics/trbc/2012/5120201012
imported on: 2023-04-07T16:52:39.364811Z
last refreshed on: 2026-06-05T07:16:11.699Z
source accessed on: 2017-12-31T07:04:19Z
source last accessed on: 2021-08-01T01:06:53Z
definition: Companies engaged in manufacturing Portland, natural, masonry, pozzalanic, and other hydraulic cements. Cement manufacturing establishments may calcine earths or mine, quarry, manufacture, or purchase lime.
notation: 5120201012
valid from: 2020
is activity of: Construction Materials

Tile & Paving Material Manufacturing
type: NamedIndividual
type: Activity
type: BusinessClassification
is contemporary version of: http://data.ga-group.nl/ics/trbc/5120201013
is version of: http://data.ga-group.nl/ics/trbc/5120201013
replaces: http://data.ga-group.nl/ics/trbc/2012/5120201013
imported on: 2023-04-07T16:52:39.364811Z
last refreshed on: 2026-06-05T07:16:11.699Z
source accessed on: 2017-12-31T07:04:19Z
source last accessed on: 2021-08-01T01:06:53Z
definition: Companies engaged in manufacturing asphalt and tar paving mixtures and blocks and roofing cements and coatings from purchased asphaltic materials.
notation: 5120201013
valid from: 2020
is activity of: Construction Materials

Rock Mining
type: NamedIndividual
type: Activity
type: BusinessClassification
is contemporary version of: http://data.ga-group.nl/ics/trbc/5120201014
is version of: http://data.ga-group.nl/ics/trbc/5120201014
replaces: http://data.ga-group.nl/ics/trbc/2012/5120201014
imported on: 2023-04-07T16:52:39.364811Z
last refreshed on: 2026-06-05T07:16:11.699Z
source accessed on: 2017-12-31T07:04:19Z
source last accessed on: 2021-08-01T01:06:53Z
definition: Companies engaged in providing mining techniques used to excavate hard minerals, mainly those containing metals, such as ore containing gold, silver, iron, copper, zinc, nickel and lead.
notation: 5120201014
valid from: 2020
is activity of: Construction Materials

Construction Material Wholesale
type: NamedIndividual
type: Activity
type: BusinessClassification
is contemporary version of: http://data.ga-group.nl/ics/trbc/5120201015
is version of: http://data.ga-group.nl/ics/trbc/5120201015
replaces: http://data.ga-group.nl/ics/trbc/2012/5120201015
imported on: 2023-04-07T16:52:39.364811Z
last refreshed on: 2026-06-05T07:16:11.699Z
source accessed on: 2017-12-31T07:04:19Z
source last accessed on: 2021-08-01T01:06:53Z
definition: Companies engaged in wholesaling stone, cement, lime, construction sand, gravel, brick, asphalt, concrete mixtures, concrete, stone, and structural clay products.
notation: 5120201015
valid from: 2020
is activity of: Construction Materials

Construction Materials
type: NamedIndividual
type: BusinessClassification
type: Industry
is contemporary version of: http://data.ga-group.nl/ics/trbc/51202010
is version of: http://data.ga-group.nl/ics/trbc/51202010
replaces: http://data.ga-group.nl/ics/trbc/2012/51202010
imported on: 2023-04-07T16:52:39.364811Z
last refreshed on: 2026-06-05T07:16:11.699Z
source accessed on: 2017-12-31T07:04:19Z
source last accessed on: 2021-08-01T01:06:53Z
definition: Miners, producers and wholesalers of raw materials for roads and construction. Includes extractors of sand, gravel, rock, clay, granite, limestone, marble, slate, gypsum, lime, and producers of cement, concrete, and bricks, as well as operators of filtering, bleaching, crushing, cutting, sizing and processing services.
notation: 51202010
valid from: 2020
is industry of: Construction Materials

Construction Materials
type: NamedIndividual
type: BusinessClassification
type: IndustryGroup
is contemporary version of: http://data.ga-group.nl/ics/trbc/512020
is version of: http://data.ga-group.nl/ics/trbc/512020
replaces: http://data.ga-group.nl/ics/trbc/2012/512020
imported on: 2023-04-07T16:52:39.364811Z
last refreshed on: 2026-06-05T07:16:11.699Z
source accessed on: 2017-12-31T07:04:19Z
source last accessed on: 2021-08-01T01:06:53Z
definition: Miners and producers of raw materials for road and building construction. Includes extractors of sand, gravel, rock, clay, granite, limestone, marble, slate, gypsum, lime, and producers of cement, concrete, and bricks, as well as operators of filtering, bleaching, crushing, cutting, sizing and processing services.
notation: 512020
valid from: 2020
is industry group of: Mineral Resources

Mineral Resources
type: NamedIndividual
type: BusinessClassification
type: BusinessSector
is contemporary version of: http://data.ga-group.nl/ics/trbc/5120
is version of: http://data.ga-group.nl/ics/trbc/5120
replaces: http://data.ga-group.nl/ics/trbc/2012/5120
imported on: 2023-04-07T16:52:39.364811Z
last refreshed on: 2026-06-05T07:16:11.699Z
source accessed on: 2017-12-31T07:04:19Z
source last accessed on: 2021-08-01T01:06:53Z
definition: Miners and processors of steel, aluminum, precious and specialty metals and minerals, and construction related materials. Includes integrated mining companies.
notation: 5120
valid from: 2020
is business sector of: Basic Materials

Forest & Wood Products (NEC)
type: NamedIndividual
type: Activity
type: BusinessClassification
is contemporary version of: http://data.ga-group.nl/ics/trbc/5130101010
is version of: http://data.ga-group.nl/ics/trbc/5130101010
replaces: http://data.ga-group.nl/ics/trbc/2012/5130101010
imported on: 2023-04-07T16:52:39.364811Z
last refreshed on: 2026-06-05T07:16:11.699Z
source accessed on: 2017-12-31T07:04:19Z
source last accessed on: 2021-08-01T01:06:53Z
definition: Companies engaged in operating timber tracks, nurseries, seeding, reforestation and harvesting timber and other forest products. Includes also related services, such as cutting, logging, transporting, estimating and other forest management services. Products include: lumber, plywood, flake board, chips, sawdust, wood flooring, shingles, tiles, millwork, laminated veneer, fencing and other primary wood products. Excludes: (paper products, classified in Paper Products or Paper Packaging), (value added wood products, doors, window frames, stairs, classified in Construction - Supplies and Fixtures).
notation: 5130101010
valid from: 2020
is activity of: Forest & Wood Products

Timber Tract Operations
type: NamedIndividual
type: Activity
type: BusinessClassification
is contemporary version of: http://data.ga-group.nl/ics/trbc/5130101011
is version of: http://data.ga-group.nl/ics/trbc/5130101011
replaces: http://data.ga-group.nl/ics/trbc/2012/5130101011
imported on: 2023-04-07T16:52:39.364811Z
last refreshed on: 2026-06-05T07:16:11.699Z
source accessed on: 2017-12-31T07:04:19Z
source last accessed on: 2021-08-01T01:06:53Z
definition: Companies engaged in the operation of timber tracts for the purpose of selling standing timber.
notation: 5130101011
valid from: 2020
is activity of: Forest & Wood Products

Forest Nurseries & Gathering of Forest Products
type: NamedIndividual
type: Activity
type: BusinessClassification
is contemporary version of: http://data.ga-group.nl/ics/trbc/5130101012
is version of: http://data.ga-group.nl/ics/trbc/5130101012
replaces: http://data.ga-group.nl/ics/trbc/2012/5130101012
imported on: 2023-04-07T16:52:39.364811Z
last refreshed on: 2026-06-05T07:16:11.699Z
source accessed on: 2017-12-31T07:04:19Z
source last accessed on: 2021-08-01T01:06:53Z
definition: Companies engaged in growing trees for reforestation and/or gathering forest products, such as gums, barks, balsam needles, rhizomes, fibers, Spanish moss, ginseng, and truffles.
notation: 5130101012
valid from: 2020
is activity of: Forest & Wood Products

Logging & Sawmills
type: NamedIndividual
type: Activity
type: BusinessClassification
is contemporary version of: http://data.ga-group.nl/ics/trbc/5130101013
is version of: http://data.ga-group.nl/ics/trbc/5130101013
replaces: http://data.ga-group.nl/ics/trbc/2012/5130101013
imported on: 2023-04-07T16:52:39.364811Z
last refreshed on: 2026-06-05T07:16:11.699Z
source accessed on: 2017-12-31T07:04:19Z
source last accessed on: 2021-08-01T01:06:53Z
definition: Companies engaged in cutting timber, cutting and transporting timber and producing wood chips in the field.
notation: 5130101013
valid from: 2020
is activity of: Forest & Wood Products

Forest Support & Services
type: NamedIndividual
type: Activity
type: BusinessClassification
is contemporary version of: http://data.ga-group.nl/ics/trbc/5130101014
is version of: http://data.ga-group.nl/ics/trbc/5130101014
replaces: http://data.ga-group.nl/ics/trbc/2012/5130101014
imported on: 2023-04-07T16:52:39.364811Z
last refreshed on: 2026-06-05T07:16:11.699Z
source accessed on: 2017-12-31T07:04:19Z
source last accessed on: 2021-08-01T01:06:53Z
definition: Companies engaged in providing support activities for forestry, such as estimating timber, forest firefighting, forest pest control, and consulting on wood attributes and reforestation.
notation: 5130101014
valid from: 2020
is activity of: Forest & Wood Products

Wood Products
type: NamedIndividual
type: Activity
type: BusinessClassification
is contemporary version of: http://data.ga-group.nl/ics/trbc/5130101015
is version of: http://data.ga-group.nl/ics/trbc/5130101015
replaces: http://data.ga-group.nl/ics/trbc/2012/5130101015
imported on: 2023-04-07T16:52:39.364811Z
last refreshed on: 2026-06-05T07:16:11.699Z
source accessed on: 2017-12-31T07:04:19Z
source last accessed on: 2021-08-01T01:06:53Z
definition: Companies engaged in providing wood products, such as lumber, plywood, veneers, wood containers, wood flooring, wood trusses, manufactured homes (i.e. mobile homes), and prefabricated wood buildings.
notation: 5130101015
valid from: 2020
is activity of: Forest & Wood Products

Wood Product Wholesale
type: NamedIndividual
type: Activity
type: BusinessClassification
is contemporary version of: http://data.ga-group.nl/ics/trbc/5130101016
is version of: http://data.ga-group.nl/ics/trbc/5130101016
replaces: http://data.ga-group.nl/ics/trbc/2012/5130101016
imported on: 2023-04-07T16:52:39.364811Z
last refreshed on: 2026-06-05T07:16:11.699Z
source accessed on: 2017-12-31T07:04:19Z
source last accessed on: 2021-08-01T01:06:53Z
definition: Companies engaged in wholesaling wood products such as chips, posts, shavings and ties.
notation: 5130101016
valid from: 2020
is activity of: Forest & Wood Products

Forest & Wood Products
type: NamedIndividual
type: BusinessClassification
type: Industry
is contemporary version of: http://data.ga-group.nl/ics/trbc/51301010
is version of: http://data.ga-group.nl/ics/trbc/51301010
replaces: http://data.ga-group.nl/ics/trbc/2012/51301010
imported on: 2023-04-07T16:52:39.364811Z
last refreshed on: 2026-06-05T07:16:11.699Z
source accessed on: 2017-12-31T07:04:19Z
source last accessed on: 2021-08-01T01:06:53Z
definition: Producers and wholesalers of lumber, plywood, sawdust, wood flooring, shingles, tiles, laminated veneer, fencing and other primary wood products. Includes operators of timber tracks and nurseries and providers of cutting, logging, transporting, as well as other forest management services.
notation: 51301010
valid from: 2020
is industry of: Paper & Forest Products

Paper Products (NEC)
type: NamedIndividual
type: Activity
type: BusinessClassification
is contemporary version of: http://data.ga-group.nl/ics/trbc/5130102010
is version of: http://data.ga-group.nl/ics/trbc/5130102010
replaces: http://data.ga-group.nl/ics/trbc/2012/5130102010
imported on: 2023-04-07T16:52:39.364811Z
last refreshed on: 2026-06-05T07:16:11.699Z
source accessed on: 2017-12-31T07:04:19Z
source last accessed on: 2021-08-01T01:06:53Z
definition: Companies engaged in pulp mill and paper manufacturing operations. The activity includes, loose-leaf, computer, construction and stationary paper, bond, book and newsprint.
notation: 5130102010
valid from: 2020
is activity of: Paper Products

Paper Mills & Products
type: NamedIndividual
type: Activity
type: BusinessClassification
is contemporary version of: http://data.ga-group.nl/ics/trbc/5130102011
is version of: http://data.ga-group.nl/ics/trbc/5130102011
replaces: http://data.ga-group.nl/ics/trbc/2012/5130102011
imported on: 2023-04-07T16:52:39.364811Z
last refreshed on: 2026-06-05T07:16:11.699Z
source accessed on: 2017-12-31T07:04:19Z
source last accessed on: 2021-08-01T01:06:53Z
definition: Companies engaged in manufacturing paper (except newsprint and uncoated ground wood paper) from pulp.
notation: 5130102011
valid from: 2020
is activity of: Paper Products

Newsprint Mills
type: NamedIndividual
type: Activity
type: BusinessClassification
is contemporary version of: http://data.ga-group.nl/ics/trbc/5130102012
is version of: http://data.ga-group.nl/ics/trbc/5130102012
replaces: http://data.ga-group.nl/ics/trbc/2012/5130102012
imported on: 2023-04-07T16:52:39.364811Z
last refreshed on: 2026-06-05T07:16:11.699Z
source accessed on: 2017-12-31T07:04:19Z
source last accessed on: 2021-08-01T01:06:53Z
definition: Companies engaged in manufacturing newsprint and uncoated ground wood paper from pulp.
notation: 5130102012
valid from: 2020
is activity of: Paper Products

Pulp Mills
type: NamedIndividual
type: Activity
type: BusinessClassification
is contemporary version of: http://data.ga-group.nl/ics/trbc/5130102013
is version of: http://data.ga-group.nl/ics/trbc/5130102013
replaces: http://data.ga-group.nl/ics/trbc/2012/5130102013
imported on: 2023-04-07T16:52:39.364811Z
last refreshed on: 2026-06-05T07:16:11.699Z
source accessed on: 2017-12-31T07:04:19Z
source last accessed on: 2021-08-01T01:06:53Z
definition: Companies engaged in manufacturing pulp without manufacturing paper or paperboard.
notation: 5130102013
valid from: 2020
is activity of: Paper Products

Paper Product Wholesale
type: NamedIndividual
type: Activity
type: BusinessClassification
is contemporary version of: http://data.ga-group.nl/ics/trbc/5130102014
is version of: http://data.ga-group.nl/ics/trbc/5130102014
replaces: http://data.ga-group.nl/ics/trbc/2012/5130102014
imported on: 2023-04-07T16:52:39.364811Z
last refreshed on: 2026-06-05T07:16:11.699Z
source accessed on: 2017-12-31T07:04:19Z
source last accessed on: 2021-08-01T01:06:53Z
definition: Companies engaged in wholesaling bulk printing and/or writing paper generally on rolls for further processing.
notation: 5130102014
valid from: 2020
is activity of: Paper Products

Paper Products
type: NamedIndividual
type: BusinessClassification
type: Industry
is contemporary version of: http://data.ga-group.nl/ics/trbc/51301020
is version of: http://data.ga-group.nl/ics/trbc/51301020
replaces: http://data.ga-group.nl/ics/trbc/2012/51301020
imported on: 2023-04-07T16:52:39.364811Z
last refreshed on: 2026-06-05T07:16:11.699Z
source accessed on: 2017-12-31T07:04:19Z
source last accessed on: 2021-08-01T01:06:53Z
definition: Operators of pulp and paper mills. Includes manufacturers of stationery, computer and construction paper, book and newsprint.
notation: 51301020
valid from: 2020
is industry of: Paper & Forest Products

Paper & Forest Products
type: NamedIndividual
type: BusinessClassification
type: IndustryGroup
is contemporary version of: http://data.ga-group.nl/ics/trbc/513010
is version of: http://data.ga-group.nl/ics/trbc/513010
replaces: http://data.ga-group.nl/ics/trbc/2012/513010
imported on: 2023-04-07T16:52:39.364811Z
last refreshed on: 2026-06-05T07:16:11.699Z
source accessed on: 2017-12-31T07:04:19Z
source last accessed on: 2021-08-01T01:06:53Z
definition: Operators of forests, pulp and paper mills, producers and manufacturers of wood and paper products, and providers of related services.
notation: 513010
valid from: 2020
is industry group of: Applied Resources

Non-Paper Containers & Packaging (NEC)
type: NamedIndividual
type: Activity
type: BusinessClassification
is contemporary version of: http://data.ga-group.nl/ics/trbc/5130201010
is version of: http://data.ga-group.nl/ics/trbc/5130201010
replaces: http://data.ga-group.nl/ics/trbc/2012/5130201010
imported on: 2023-04-07T16:52:39.364811Z
last refreshed on: 2026-06-05T07:16:11.699Z
source accessed on: 2017-12-31T07:04:19Z
source last accessed on: 2021-08-01T01:06:53Z
definition: Companies engaged in the manufacturing of containers, primarily metal, glass and plastic containers, as well as companies offering packaging services. Includes diversified containers and packaging companies in cases where paper packaging also comprises a substantial part of the operation.
notation: 5130201010
valid from: 2020
is activity of: Non-Paper Containers & Packaging

Textile Containers & Packaging
type: NamedIndividual
type: Activity
type: BusinessClassification
is contemporary version of: http://data.ga-group.nl/ics/trbc/5130201011
is version of: http://data.ga-group.nl/ics/trbc/5130201011
replaces: http://data.ga-group.nl/ics/trbc/2012/5130201011
imported on: 2023-04-07T16:52:39.364811Z
last refreshed on: 2026-06-05T07:16:11.699Z
source accessed on: 2017-12-31T07:04:19Z
source last accessed on: 2021-08-01T01:06:53Z
definition: Companies engaged in manufacturing textile containers & packaging materials.
notation: 5130201011
valid from: 2020
is activity of: Non-Paper Containers & Packaging

Glass Containers & Packaging
type: NamedIndividual
type: Activity
type: BusinessClassification
is contemporary version of: http://data.ga-group.nl/ics/trbc/5130201012
is version of: http://data.ga-group.nl/ics/trbc/5130201012
replaces: http://data.ga-group.nl/ics/trbc/2012/5130201012
imported on: 2023-04-07T16:52:39.364811Z
last refreshed on: 2026-06-05T07:16:11.699Z
source accessed on: 2017-12-31T07:04:19Z
source last accessed on: 2021-08-01T01:06:53Z
definition: Companies engaged in manufacturing glass packaging containers & glass packaging materials.
notation: 5130201012
valid from: 2020
is activity of: Non-Paper Containers & Packaging

Metal Containers & Packaging
type: NamedIndividual
type: Activity
type: BusinessClassification
is contemporary version of: http://data.ga-group.nl/ics/trbc/5130201013
is version of: http://data.ga-group.nl/ics/trbc/5130201013
replaces: http://data.ga-group.nl/ics/trbc/2012/5130201013
imported on: 2023-04-07T16:52:39.364811Z
last refreshed on: 2026-06-05T07:16:11.699Z
source accessed on: 2017-12-31T07:04:19Z
source last accessed on: 2021-08-01T01:06:53Z
definition: Companies engaged in manufacturing metal (light gauge) containers (except cans).
notation: 5130201013
valid from: 2020
is activity of: Non-Paper Containers & Packaging

Plastic Containers & Packaging
type: NamedIndividual
type: Activity
type: BusinessClassification
is contemporary version of: http://data.ga-group.nl/ics/trbc/5130201014
is version of: http://data.ga-group.nl/ics/trbc/5130201014
replaces: http://data.ga-group.nl/ics/trbc/2012/5130201014
imported on: 2023-04-07T16:52:39.364811Z
last refreshed on: 2026-06-05T07:16:11.699Z
source accessed on: 2017-12-31T07:04:19Z
source last accessed on: 2021-08-01T01:06:53Z
definition: Companies engaged in manufacturing paperboard, converted paper (except stationery and office supplies), and/or related disposable plastics products.
notation: 5130201014
valid from: 2020
is activity of: Non-Paper Containers & Packaging

Wood Container & Packaging
type: NamedIndividual
type: Activity
type: BusinessClassification
is contemporary version of: http://data.ga-group.nl/ics/trbc/5130201015
is version of: http://data.ga-group.nl/ics/trbc/5130201015
replaces: http://data.ga-group.nl/ics/trbc/2012/5130201015
imported on: 2023-04-07T16:52:39.364811Z
last refreshed on: 2026-06-05T07:16:11.699Z
source accessed on: 2017-12-31T07:04:19Z
source last accessed on: 2021-08-01T01:06:53Z
definition: Companies engaged in manufacturing wood pallets, wood box shook, wood boxes, other wood containers, wood parts for pallets and containers, and wood packaging materials.
notation: 5130201015
valid from: 2020
is activity of: Non-Paper Containers & Packaging

Container & Packaging Material Wholesale
type: NamedIndividual
type: Activity
type: BusinessClassification
is contemporary version of: http://data.ga-group.nl/ics/trbc/5130201016
is version of: http://data.ga-group.nl/ics/trbc/5130201016
replaces: http://data.ga-group.nl/ics/trbc/2012/5130201016
imported on: 2023-04-07T16:52:39.364811Z
last refreshed on: 2026-06-05T07:16:11.699Z
source accessed on: 2017-12-31T07:04:19Z
source last accessed on: 2021-08-01T01:06:53Z
definition: Companies engaged in wholesaling all types of containers and packaging materials.
notation: 5130201016
valid from: 2020
is activity of: Non-Paper Containers & Packaging

Non-Paper Containers & Packaging
type: NamedIndividual
type: BusinessClassification
type: Industry
is contemporary version of: http://data.ga-group.nl/ics/trbc/51302010
is version of: http://data.ga-group.nl/ics/trbc/51302010
replaces: http://data.ga-group.nl/ics/trbc/2012/51302010
imported on: 2023-04-07T16:52:39.364811Z
last refreshed on: 2026-06-05T07:16:11.699Z
source accessed on: 2017-12-31T07:04:19Z
source last accessed on: 2021-08-01T01:06:53Z
definition: Manufacturers and wholesalers of metal, glass and plastic containers, and providers of diversified, paper and non-paper container and packaging services.
notation: 51302010
valid from: 2020
is industry of: Containers & Packaging

Paper Packaging (NEC)
type: NamedIndividual
type: Activity
type: BusinessClassification
is contemporary version of: http://data.ga-group.nl/ics/trbc/5130202010
is version of: http://data.ga-group.nl/ics/trbc/5130202010
replaces: http://data.ga-group.nl/ics/trbc/2012/5130202010
imported on: 2023-04-07T16:52:39.364811Z
last refreshed on: 2026-06-05T07:16:11.699Z
source accessed on: 2017-12-31T07:04:19Z
source last accessed on: 2021-08-01T01:06:53Z
definition: Companies engaged in paper packaging manufacturing and paper packaging operations concentrated around cardboard, laminated paper containers, and paper fiber based boxes, bags and wrapping paper.
notation: 5130202010
valid from: 2020
is activity of: Paper Packaging

Paper Packaging Wholesale
type: NamedIndividual
type: Activity
type: BusinessClassification
is contemporary version of: http://data.ga-group.nl/ics/trbc/5130202011
is version of: http://data.ga-group.nl/ics/trbc/5130202011
replaces: http://data.ga-group.nl/ics/trbc/2012/5130202011
imported on: 2023-04-07T16:52:39.364811Z
last refreshed on: 2026-06-05T07:16:11.699Z
source accessed on: 2017-12-31T07:04:19Z
source last accessed on: 2021-08-01T01:06:53Z
definition: Companies engaged in wholesaling paper manufacturing and paper packaging operations concentrated around cardboard, laminated paper containers, and paper fiber based boxes, bags and wrapping paper.
notation: 5130202011
valid from: 2020
is activity of: Paper Packaging

Paper Packaging
type: NamedIndividual
type: BusinessClassification
type: Industry
is contemporary version of: http://data.ga-group.nl/ics/trbc/51302020
is version of: http://data.ga-group.nl/ics/trbc/51302020
replaces: http://data.ga-group.nl/ics/trbc/2012/51302020
imported on: 2023-04-07T16:52:39.364811Z
last refreshed on: 2026-06-05T07:16:11.699Z
source accessed on: 2017-12-31T07:04:19Z
source last accessed on: 2021-08-01T01:06:53Z
definition: Manufacturers and wholesalers of paper packaging including cardboard, laminated paper containers, and wood-fiber boxes, bags and wrapping paper.
notation: 51302020
valid from: 2020
is industry of: Containers & Packaging

Containers & Packaging
type: NamedIndividual
type: BusinessClassification
type: IndustryGroup
is contemporary version of: http://data.ga-group.nl/ics/trbc/513020
is version of: http://data.ga-group.nl/ics/trbc/513020
replaces: http://data.ga-group.nl/ics/trbc/2012/513020
imported on: 2023-04-07T16:52:39.364811Z
last refreshed on: 2026-06-05T07:16:11.699Z
source accessed on: 2017-12-31T07:04:19Z
source last accessed on: 2021-08-01T01:06:53Z
definition: Manufacturers of containers, as well as providers of packaging services.
notation: 513020
valid from: 2020
is industry group of: Applied Resources

Applied Resources
type: NamedIndividual
type: BusinessClassification
type: BusinessSector
is contemporary version of: http://data.ga-group.nl/ics/trbc/5130
is version of: http://data.ga-group.nl/ics/trbc/5130
replaces: http://data.ga-group.nl/ics/trbc/2012/5130
imported on: 2023-04-07T16:52:39.364811Z
last refreshed on: 2026-06-05T07:16:11.699Z
source accessed on: 2017-12-31T07:04:19Z
source last accessed on: 2021-08-01T01:06:53Z
definition: Producers of wood-based products and providers of related services, as well as manufacturers of paper and non-paper products, containers and packaging.
notation: 5130
valid from: 2020
is business sector of: Basic Materials

Basic Materials
type: NamedIndividual
type: BusinessClassification
type: EconomicSector
is contemporary version of: http://data.ga-group.nl/ics/trbc/51
is version of: http://data.ga-group.nl/ics/trbc/51
replaces: http://data.ga-group.nl/ics/trbc/2012/51
imported on: 2023-04-07T16:52:39.364811Z
last refreshed on: 2026-06-05T07:16:11.699Z
source accessed on: 2017-12-31T07:04:19Z
source last accessed on: 2021-08-01T01:06:53Z
definition: Manufacturers, extractors and refiners of chemicals, minerals, precious metals, steel, aluminum, forest products, and construction and other raw materials.
notation: 51
valid from: 2020

Aerospace & Defense (NEC)
type: NamedIndividual
type: Activity
type: BusinessClassification
is contemporary version of: http://data.ga-group.nl/ics/trbc/5210101010
is version of: http://data.ga-group.nl/ics/trbc/5210101010
replaces: http://data.ga-group.nl/ics/trbc/2012/5210101010
imported on: 2023-04-07T16:52:39.364811Z
last refreshed on: 2026-06-05T07:16:11.699Z
source accessed on: 2017-12-31T07:04:19Z
source last accessed on: 2021-08-01T01:06:53Z
definition: Companies engaged in the production of commercial, military and private aircraft, and spacecraft. Includes manufacturers of military equipment, such as tanks and related vehicles, bombs, missiles, associated navigational and guidance systems, artillery, ammunition and other related weaponry. Includes also manufacturers of military, weather, navigational and astronomical satellites.
notation: 5210101010
valid from: 2020
is activity of: Aerospace & Defense

Arms & Ammunitions Manufacturing
type: NamedIndividual
type: Activity
type: BusinessClassification
is contemporary version of: http://data.ga-group.nl/ics/trbc/5210101011
is version of: http://data.ga-group.nl/ics/trbc/5210101011
replaces: http://data.ga-group.nl/ics/trbc/2012/5210101011
imported on: 2023-04-07T16:52:39.364811Z
last refreshed on: 2026-06-05T07:16:11.699Z
source accessed on: 2017-12-31T07:04:19Z
source last accessed on: 2021-08-01T01:06:53Z
definition: Companies engaged in the manufacturing of ammunition. Includes bombs, depth charges, rockets (except guided missiles), grenades, mines, and torpedoes.
notation: 5210101011
valid from: 2020
is activity of: Aerospace & Defense

Commercial Aircraft Manufacturing
type: NamedIndividual
type: Activity
type: BusinessClassification
is contemporary version of: http://data.ga-group.nl/ics/trbc/5210101012
is version of: http://data.ga-group.nl/ics/trbc/5210101012
replaces: http://data.ga-group.nl/ics/trbc/2012/5210101012
imported on: 2023-04-07T16:52:39.364811Z
last refreshed on: 2026-06-05T07:16:11.699Z
source accessed on: 2017-12-31T07:04:19Z
source last accessed on: 2021-08-01T01:06:53Z
definition: Companies engaged in manufacturing of aircraft for transporting passengers and cargo.
notation: 5210101012
valid from: 2020
is activity of: Aerospace & Defense

Military Aircraft Manufacturing
type: NamedIndividual
type: Activity
type: BusinessClassification
is contemporary version of: http://data.ga-group.nl/ics/trbc/5210101013
is version of: http://data.ga-group.nl/ics/trbc/5210101013
replaces: http://data.ga-group.nl/ics/trbc/2012/5210101013
imported on: 2023-04-07T16:52:39.364811Z
last refreshed on: 2026-06-05T07:16:11.699Z
source accessed on: 2017-12-31T07:04:19Z
source last accessed on: 2021-08-01T01:06:53Z
definition: Companies engaged in manufacturing any fixed-wing or rotary-wing aircraft that is owned and operated by military. It can be either combat or non-combat.
notation: 5210101013
valid from: 2020
is activity of: Aerospace & Defense

Aircraft Parts Manufacturing
type: NamedIndividual
type: Activity
type: BusinessClassification
is contemporary version of: http://data.ga-group.nl/ics/trbc/5210101014
is version of: http://data.ga-group.nl/ics/trbc/5210101014
replaces: http://data.ga-group.nl/ics/trbc/2012/5210101014
imported on: 2023-04-07T16:52:39.364811Z
last refreshed on: 2026-06-05T07:16:11.699Z
source accessed on: 2017-12-31T07:04:19Z
source last accessed on: 2021-08-01T01:06:53Z
definition: Companies engaged in manufacturing all aircraft related parts and accessories.
notation: 5210101014
valid from: 2020
is activity of: Aerospace & Defense

Military Vehicles Manufacturing
type: NamedIndividual
type: Activity
type: BusinessClassification
is contemporary version of: http://data.ga-group.nl/ics/trbc/5210101015
is version of: http://data.ga-group.nl/ics/trbc/5210101015
replaces: http://data.ga-group.nl/ics/trbc/2012/5210101015
imported on: 2023-04-07T16:52:39.364811Z
last refreshed on: 2026-06-05T07:16:11.699Z
source accessed on: 2017-12-31T07:04:19Z
source last accessed on: 2021-08-01T01:06:53Z
definition: Companies engaged in manufacturing land combat and transportation vehicles, excluding rail-based, which are designed for or are in use by military forces.
notation: 5210101015
valid from: 2020
is activity of: Aerospace & Defense

Satellite Design & Manufacture
type: NamedIndividual
type: Activity
type: BusinessClassification
is contemporary version of: http://data.ga-group.nl/ics/trbc/5210101016
is version of: http://data.ga-group.nl/ics/trbc/5210101016
replaces: http://data.ga-group.nl/ics/trbc/2012/5210101016
imported on: 2023-04-07T16:52:39.364811Z
last refreshed on: 2026-06-05T07:16:11.699Z
source accessed on: 2017-12-31T07:04:19Z
source last accessed on: 2021-08-01T01:06:53Z
definition: Companies engaged in designing, manufacturing and launching satellites and satellite components for commercial, scientific and military uses.
notation: 5210101016
valid from: 2020
is activity of: Aerospace & Defense

Spacecraft Manufacturing
type: NamedIndividual
type: Activity
type: BusinessClassification
is contemporary version of: http://data.ga-group.nl/ics/trbc/5210101017
is version of: http://data.ga-group.nl/ics/trbc/5210101017
replaces: http://data.ga-group.nl/ics/trbc/2012/5210101017
imported on: 2023-04-07T16:52:39.364811Z
last refreshed on: 2026-06-05T07:16:11.699Z
source accessed on: 2017-12-31T07:04:19Z
source last accessed on: 2021-08-01T01:06:53Z
definition: Companies engaged in the manufacturing of a craft or machine designed for spaceflight.
notation: 5210101017
valid from: 2020
is activity of: Aerospace & Defense

Military Clothing & Accessories
type: NamedIndividual
type: Activity
type: BusinessClassification
is contemporary version of: http://data.ga-group.nl/ics/trbc/5210101018
is version of: http://data.ga-group.nl/ics/trbc/5210101018
replaces: http://data.ga-group.nl/ics/trbc/2012/5210101018
imported on: 2023-04-07T16:52:39.364811Z
last refreshed on: 2026-06-05T07:16:11.699Z
source accessed on: 2017-12-31T07:04:19Z
source last accessed on: 2021-08-01T01:06:53Z
definition: Companies engaged in manufacturing dress and accessories worn by members of the armed forces and paramilitary forces.
notation: 5210101018
valid from: 2020
is activity of: Aerospace & Defense

Aircraft Equipment Wholesale
type: NamedIndividual
type: Activity
type: BusinessClassification
is contemporary version of: http://data.ga-group.nl/ics/trbc/5210101019
is version of: http://data.ga-group.nl/ics/trbc/5210101019
replaces: http://data.ga-group.nl/ics/trbc/2012/5210101019
imported on: 2023-04-07T16:52:39.364811Z
last refreshed on: 2026-06-05T07:16:11.699Z
source accessed on: 2017-12-31T07:04:19Z
source last accessed on: 2021-08-01T01:06:53Z
definition: Companies engaged in wholesaling of aircraft related equipment and accessories.
notation: 5210101019
valid from: 2020
is activity of: Aerospace & Defense

Aerospace & Defense Electronics
type: NamedIndividual
type: Activity
type: BusinessClassification
is contemporary version of: http://data.ga-group.nl/ics/trbc/5210101020
is version of: http://data.ga-group.nl/ics/trbc/5210101020
imported on: 2023-04-07T17:17:07.492231Z
last refreshed on: 2026-06-05T07:16:11.699Z
source accessed on: 2021-04-25T05:48:36Z
source last accessed on: 2021-08-01T01:06:53Z
definition: Companies engaged in the production of electronic systems and applications, used in defense and aerospace sector.
notation: 5210101020
valid from: 2020
is activity of: Aerospace & Defense

Drone Manufacturing
type: NamedIndividual
type: Activity
type: BusinessClassification
is contemporary version of: http://data.ga-group.nl/ics/trbc/5210101021
is version of: http://data.ga-group.nl/ics/trbc/5210101021
imported on: 2023-04-07T17:17:07.492231Z
last refreshed on: 2026-06-05T07:16:11.699Z
source accessed on: 2021-04-25T05:48:36Z
source last accessed on: 2021-08-01T01:06:53Z
definition: Companies engaged in the production of military and commercial drones.
notation: 5210101021
valid from: 2020
is activity of: Aerospace & Defense

Aerospace & Defense
type: NamedIndividual
type: BusinessClassification
type: Industry
is contemporary version of: http://data.ga-group.nl/ics/trbc/52101010
is version of: http://data.ga-group.nl/ics/trbc/52101010
replaces: http://data.ga-group.nl/ics/trbc/2012/52101010
imported on: 2023-04-07T16:52:39.364811Z
last refreshed on: 2026-06-05T07:16:11.699Z
source accessed on: 2017-12-31T07:04:19Z
source last accessed on: 2021-08-01T01:06:53Z
definition: Producers of commercial, military and private aircraft and spacecraft. Includes manufacturers of military equipment, vehicles, explosive ordnance, guidance systems, artillery, ammunition and other related weaponry. Includes also manufacturers of satellites.
notation: 52101010
valid from: 2020
is industry of: Aerospace & Defense

Aerospace & Defense
type: NamedIndividual
type: BusinessClassification
type: IndustryGroup
is contemporary version of: http://data.ga-group.nl/ics/trbc/521010
is version of: http://data.ga-group.nl/ics/trbc/521010
replaces: http://data.ga-group.nl/ics/trbc/2012/521010
imported on: 2023-04-07T16:52:39.364811Z
last refreshed on: 2026-06-05T07:16:11.699Z
source accessed on: 2017-12-31T07:04:19Z
source last accessed on: 2021-08-01T01:06:53Z
definition: Producers of commercial, military and private aircraft and spacecraft. Includes manufacturers of military equipment, vehicles, explosive ordnance, guidance systems, artillery, ammunition and other related weaponry. Includes also manufacturers of satellites.
notation: 521010
valid from: 2020
is industry group of: Industrial Goods

Industrial Machinery & Equipment (NEC)
type: NamedIndividual
type: Activity
type: BusinessClassification
is contemporary version of: http://data.ga-group.nl/ics/trbc/5210201010
is version of: http://data.ga-group.nl/ics/trbc/5210201010
replaces: http://data.ga-group.nl/ics/trbc/2012/5210201010
imported on: 2023-04-07T16:52:39.364811Z
last refreshed on: 2026-06-05T07:16:11.699Z
source accessed on: 2017-12-31T07:04:19Z
source last accessed on: 2021-08-01T01:06:53Z
definition: Companies involved in at least two activities under Industrial Machinery & Equipment, none being dominant. Includes producers of industrial machinery ranging from basic power and hand tools to advanced factory machinery; industrial components, such as drills, nuts, bolts, screws, springs; bearings; testing and measuring equipment; pumping equipment; compressors; welding and soldering equipment; industrial process furnaces; cyliners and actuators; vending machinery; industrial moulds and valves, and machine tools, such as metal working machines. Excludes cables, batteries, motors and small electrical equipment, classified in Electrical Components & Equipment; heavy generators, conveyors and other large electrical equipment, classified in Heavy Electrical Equipment, and permanently installed machinery, classified in Construction & Engineering.
notation: 5210201010
valid from: 2020
is activity of: Industrial Machinery & Equipment

Industrial Components
type: NamedIndividual
type: Activity
type: BusinessClassification
is contemporary version of: http://data.ga-group.nl/ics/trbc/5210201011
is version of: http://data.ga-group.nl/ics/trbc/5210201011
replaces: http://data.ga-group.nl/ics/trbc/2012/5210201011
imported on: 2023-04-07T16:52:39.364811Z
last refreshed on: 2026-06-05T07:16:11.699Z
source accessed on: 2017-12-31T07:04:19Z
source last accessed on: 2021-08-01T01:06:53Z
definition: Companies engaged in manufacturing all industrial parts or components. Includes also manufacturers of non-electrical diesel or petrol engines used in industrial machinery.
notation: 5210201011
valid from: 2020
is activity of: Industrial Machinery & Equipment

Industrial Machinery
type: NamedIndividual
type: Activity
type: BusinessClassification
is contemporary version of: http://data.ga-group.nl/ics/trbc/5210201012
is version of: http://data.ga-group.nl/ics/trbc/5210201012
replaces: http://data.ga-group.nl/ics/trbc/2012/5210201012
imported on: 2023-04-07T16:52:39.364811Z
last refreshed on: 2026-06-05T07:16:11.699Z
source accessed on: 2017-12-31T07:04:19Z
source last accessed on: 2021-08-01T01:06:53Z
definition: Companies engaged in manufacturing industrial machineries, such as sawmill and wood- working machinery, plastic machinery manufacturing, rubber industry machinery, and any other industrial machine manufacturing Companies.
notation: 5210201012
valid from: 2020
is activity of: Industrial Machinery & Equipment

Ball & Roller Bearings
type: NamedIndividual
type: Activity
type: BusinessClassification
is contemporary version of: http://data.ga-group.nl/ics/trbc/5210201013
is version of: http://data.ga-group.nl/ics/trbc/5210201013
replaces: http://data.ga-group.nl/ics/trbc/2012/5210201013
imported on: 2023-04-07T16:52:39.364811Z
last refreshed on: 2026-06-05T07:16:11.699Z
source accessed on: 2017-12-31T07:04:19Z
source last accessed on: 2021-08-01T01:06:53Z
definition: Companies engaged in manufacturing ball and roller bearings.
notation: 5210201013
valid from: 2020
is activity of: Industrial Machinery & Equipment

Testing & Measuring Equipment
type: NamedIndividual
type: Activity
type: BusinessClassification
is contemporary version of: http://data.ga-group.nl/ics/trbc/5210201014
is version of: http://data.ga-group.nl/ics/trbc/5210201014
replaces: http://data.ga-group.nl/ics/trbc/2012/5210201014
imported on: 2023-04-07T16:52:39.364811Z
last refreshed on: 2026-06-05T07:16:11.699Z
source accessed on: 2017-12-31T07:04:19Z
source last accessed on: 2021-08-01T01:06:53Z
definition: Companies engaged in manufacturing measuring and controlling devices. Includes also manufacturers of testing equipment.
notation: 5210201014
valid from: 2020
is activity of: Industrial Machinery & Equipment

Pump & Pumping Equipment
type: NamedIndividual
type: Activity
type: BusinessClassification
is contemporary version of: http://data.ga-group.nl/ics/trbc/5210201015
is version of: http://data.ga-group.nl/ics/trbc/5210201015
replaces: http://data.ga-group.nl/ics/trbc/2012/5210201015
imported on: 2023-04-07T16:52:39.364811Z
last refreshed on: 2026-06-05T07:16:11.699Z
source accessed on: 2017-12-31T07:04:19Z
source last accessed on: 2021-08-01T01:06:53Z
definition: Companies engaged in manufacturing general purpose pumps and pumping equipment.
notation: 5210201015
valid from: 2020
is activity of: Industrial Machinery & Equipment

Air & Gas Compressors
type: NamedIndividual
type: Activity
type: BusinessClassification
is contemporary version of: http://data.ga-group.nl/ics/trbc/5210201016
is version of: http://data.ga-group.nl/ics/trbc/5210201016
replaces: http://data.ga-group.nl/ics/trbc/2012/5210201016
imported on: 2023-04-07T16:52:39.364811Z
last refreshed on: 2026-06-05T07:16:11.699Z
source accessed on: 2017-12-31T07:04:19Z
source last accessed on: 2021-08-01T01:06:53Z
definition: Companies engaged in manufacturing general purpose air and gas compressors, such as reciprocating compressors, centrifugal compressors, vacuum pumps, and non-agricultural spraying and dusting compressors and spray gun units.
notation: 5210201016
valid from: 2020
is activity of: Industrial Machinery & Equipment

Welding & Soldering Equipment
type: NamedIndividual
type: Activity
type: BusinessClassification
is contemporary version of: http://data.ga-group.nl/ics/trbc/5210201017
is version of: http://data.ga-group.nl/ics/trbc/5210201017
replaces: http://data.ga-group.nl/ics/trbc/2012/5210201017
imported on: 2023-04-07T16:52:39.364811Z
last refreshed on: 2026-06-05T07:16:11.699Z
source accessed on: 2017-12-31T07:04:19Z
source last accessed on: 2021-08-01T01:06:53Z
definition: Companies engaged in manufacturing welding and soldering equipment and accessories, such as arc, resistance, gas, plasma, laser, electron beam, ultrasonic welding equipment, and soldering equipment.
notation: 5210201017
valid from: 2020
is activity of: Industrial Machinery & Equipment

Industrial Process Furnace & Ovens
type: NamedIndividual
type: Activity
type: BusinessClassification
is contemporary version of: http://data.ga-group.nl/ics/trbc/5210201018
is version of: http://data.ga-group.nl/ics/trbc/5210201018
replaces: http://data.ga-group.nl/ics/trbc/2012/5210201018
imported on: 2023-04-07T16:52:39.364811Z
last refreshed on: 2026-06-05T07:16:11.699Z
source accessed on: 2017-12-31T07:04:19Z
source last accessed on: 2021-08-01T01:06:53Z
definition: Companies manufacturing industrial process furnaces, ovens, induction and dielectric heating equipment, and kilns.
notation: 5210201018
valid from: 2020
is activity of: Industrial Machinery & Equipment

Fluid Power Cylinder & Actuators
type: NamedIndividual
type: Activity
type: BusinessClassification
is contemporary version of: http://data.ga-group.nl/ics/trbc/5210201019
is version of: http://data.ga-group.nl/ics/trbc/5210201019
replaces: http://data.ga-group.nl/ics/trbc/2012/5210201019
imported on: 2023-04-07T16:52:39.364811Z
last refreshed on: 2026-06-05T07:16:11.699Z
source accessed on: 2017-12-31T07:04:19Z
source last accessed on: 2021-08-01T01:06:53Z
definition: Companies engaged in fluid power (hydraulic and pneumatic) cylinders and actuators (motors).
notation: 5210201019
valid from: 2020
is activity of: Industrial Machinery & Equipment

Automatic Vending Machines
type: NamedIndividual
type: Activity
type: BusinessClassification
is contemporary version of: http://data.ga-group.nl/ics/trbc/5210201020
is version of: http://data.ga-group.nl/ics/trbc/5210201020
replaces: http://data.ga-group.nl/ics/trbc/2012/5210201020
imported on: 2023-04-07T16:52:39.364811Z
last refreshed on: 2026-06-05T07:16:11.699Z
source accessed on: 2017-12-31T07:04:19Z
source last accessed on: 2021-08-01T01:06:53Z
definition: Companies engaged in manufacturing coin, token, currency or magnetic card operated vending machines.
notation: 5210201020
valid from: 2020
is activity of: Industrial Machinery & Equipment

Industrial Moulds
type: NamedIndividual
type: Activity
type: BusinessClassification
is contemporary version of: http://data.ga-group.nl/ics/trbc/5210201021
is version of: http://data.ga-group.nl/ics/trbc/5210201021
replaces: http://data.ga-group.nl/ics/trbc/2012/5210201021
imported on: 2023-04-07T16:52:39.364811Z
last refreshed on: 2026-06-05T07:16:11.699Z
source accessed on: 2017-12-31T07:04:19Z
source last accessed on: 2021-08-01T01:06:53Z
definition: Companies engaged in manufacturing industrial molds for casting metals or forming other materials, such as plastics, glass, or rubber.
notation: 5210201021
valid from: 2020
is activity of: Industrial Machinery & Equipment

Machine Tools
type: NamedIndividual
type: Activity
type: BusinessClassification
is contemporary version of: http://data.ga-group.nl/ics/trbc/5210201022
is version of: http://data.ga-group.nl/ics/trbc/5210201022
replaces: http://data.ga-group.nl/ics/trbc/2012/5210201022
imported on: 2023-04-07T16:52:39.364811Z
last refreshed on: 2026-06-05T07:16:11.699Z
source accessed on: 2017-12-31T07:04:19Z
source last accessed on: 2021-08-01T01:06:53Z
definition: Companies engaged in manufacturing metal cutting machine tools, such as cutting machines, drilling machines, power saws, polishing, and metal working machines.
notation: 5210201022
valid from: 2020
is activity of: Industrial Machinery & Equipment

Industrial Valve Manufacturing
type: NamedIndividual
type: Activity
type: BusinessClassification
is contemporary version of: http://data.ga-group.nl/ics/trbc/5210201023
is version of: http://data.ga-group.nl/ics/trbc/5210201023
replaces: http://data.ga-group.nl/ics/trbc/2012/5210201023
imported on: 2023-04-07T16:52:39.364811Z
last refreshed on: 2026-06-05T07:16:11.699Z
source accessed on: 2017-12-31T07:04:19Z
source last accessed on: 2021-08-01T01:06:53Z
definition: Companies engaged in manufacturing industrial valves, such as check valves, manual valves, control and safety valves, pressure reducing valves, rotary type valves and needle valves, among others.
notation: 5210201023
valid from: 2020
is activity of: Industrial Machinery & Equipment

Industrial Machinery & Equipment Wholesale
type: NamedIndividual
type: Activity
type: BusinessClassification
is contemporary version of: http://data.ga-group.nl/ics/trbc/5210201024
is version of: http://data.ga-group.nl/ics/trbc/5210201024
replaces: http://data.ga-group.nl/ics/trbc/2012/5210201024
imported on: 2023-04-07T16:52:39.364811Z
last refreshed on: 2026-06-05T07:16:11.699Z
source accessed on: 2017-12-31T07:04:19Z
source last accessed on: 2021-08-01T01:06:53Z
definition: Companies engaged in wholesaling industrial machinery ranging from basic power and hand tools to advanced factory machinery; industrial components, such as drills, nuts, bolts, screws, springs; bearings; testing and measuring equipment; pumping equipment; compressors; welding and soldering equipment; industrial process furnaces; cylinders and actuators; vending machinery; industrial moulds and valves, and machine tools, such as polishing, wood and metal working machines.
notation: 5210201024
valid from: 2020
is activity of: Industrial Machinery & Equipment

Commercial Equipment
type: NamedIndividual
type: Activity
type: BusinessClassification
is contemporary version of: http://data.ga-group.nl/ics/trbc/5210201025
is version of: http://data.ga-group.nl/ics/trbc/5210201025
imported on: 2023-04-07T17:17:07.492231Z
last refreshed on: 2026-06-05T07:16:11.699Z
source accessed on: 2021-04-25T05:48:36Z
source last accessed on: 2021-08-01T01:06:53Z
definition: Companies engaged in the production of food and beverage manufacturing and processing machinery.
notation: 5210201025
valid from: 2020
is activity of: Industrial Machinery & Equipment

Industrial Machinery & Equipment
type: NamedIndividual
type: BusinessClassification
type: Industry
is contemporary version of: http://data.ga-group.nl/ics/trbc/52102010
is version of: http://data.ga-group.nl/ics/trbc/52102010
replaces: http://data.ga-group.nl/ics/trbc/2012/52102010
imported on: 2023-04-07T16:52:39.364811Z
last refreshed on: 2026-06-05T07:16:11.699Z
source accessed on: 2017-12-31T07:04:19Z
source last accessed on: 2021-08-01T01:06:53Z
definition: Manufacturers of industrial machinery ranging from basic power and hand tools to advanced factory machinery; industrial components, such as drills, nuts, bolts, screws, springs; bearings; testing and measuring equipment; pumping equipment; compressors; welding and soldering equipment; industrial process furnaces; cylinders and actuators; vending machinery; industrial moulds and valves, and machine tools, such as metal working machines.
notation: 52102010
valid from: 2020
is industry of: Machinery, Tools, Heavy Vehicles, Trains & Ships

Heavy Machinery & Vehicles (NEC)
type: NamedIndividual
type: Activity
type: BusinessClassification
is contemporary version of: http://data.ga-group.nl/ics/trbc/5210202010
is version of: http://data.ga-group.nl/ics/trbc/5210202010
replaces: http://data.ga-group.nl/ics/trbc/2012/5210202010
imported on: 2023-04-07T16:52:39.364811Z
last refreshed on: 2026-06-05T07:16:11.699Z
source accessed on: 2017-12-31T07:04:19Z
source last accessed on: 2021-08-01T01:06:53Z
definition: Companies engaged in the manufacture of heavy trucks, road paving and earth moving machinery, tractors, bulldozers, cranes, planting and harvesting machinery, such as balers, graders, cotton ginning machinery, locomotives and rolling stock, as well as commercial shovels, lawn mowers and other commercial landscaping equipment.
notation: 5210202010
valid from: 2020
is activity of: Heavy Machinery & Vehicles

Construction Machinery
type: NamedIndividual
type: Activity
type: BusinessClassification
is contemporary version of: http://data.ga-group.nl/ics/trbc/5210202011
is version of: http://data.ga-group.nl/ics/trbc/5210202011
replaces: http://data.ga-group.nl/ics/trbc/2012/5210202011
imported on: 2023-04-07T16:52:39.364811Z
last refreshed on: 2026-06-05T07:16:11.699Z
source accessed on: 2017-12-31T07:04:19Z
source last accessed on: 2021-08-01T01:06:53Z
definition: Companies engaged in manufacturing construction machinery, such as road paving and earth moving machinery, bulldozers, and cranes.
notation: 5210202011
valid from: 2020
is activity of: Heavy Machinery & Vehicles

Heavy Trucks
type: NamedIndividual
type: Activity
type: BusinessClassification
is contemporary version of: http://data.ga-group.nl/ics/trbc/5210202012
is version of: http://data.ga-group.nl/ics/trbc/5210202012
replaces: http://data.ga-group.nl/ics/trbc/2012/5210202012
imported on: 2023-04-07T16:52:39.364811Z
last refreshed on: 2026-06-05T07:16:11.699Z
source accessed on: 2017-12-31T07:04:19Z
source last accessed on: 2021-08-01T01:06:53Z
definition: Companies engaged in manufacturing heavy duty truck chassis and assembling complete heavy duty trucks, and other special purpose heavy duty motor vehicles.
notation: 5210202012
valid from: 2020
is activity of: Heavy Machinery & Vehicles

Heavy Buses & Coaches
type: NamedIndividual
type: Activity
type: BusinessClassification
is contemporary version of: http://data.ga-group.nl/ics/trbc/5210202013
is version of: http://data.ga-group.nl/ics/trbc/5210202013
replaces: http://data.ga-group.nl/ics/trbc/2012/5210202013
imported on: 2023-04-07T16:52:39.364811Z
last refreshed on: 2026-06-05T07:16:11.699Z
source accessed on: 2017-12-31T07:04:19Z
source last accessed on: 2021-08-01T01:06:53Z
definition: Companies engaged in manufacturing heavy duty buses or coaches, chassis and assembling complete heavy duty buses or coaches.
notation: 5210202013
valid from: 2020
is activity of: Heavy Machinery & Vehicles

Locomotive Engines & Rolling Stock
type: NamedIndividual
type: Activity
type: BusinessClassification
is contemporary version of: http://data.ga-group.nl/ics/trbc/5210202014
is version of: http://data.ga-group.nl/ics/trbc/5210202014
replaces: http://data.ga-group.nl/ics/trbc/2012/5210202014
imported on: 2023-04-07T16:52:39.364811Z
last refreshed on: 2026-06-05T07:16:11.699Z
source accessed on: 2017-12-31T07:04:19Z
source last accessed on: 2021-08-01T01:06:53Z
definition: Companies engaged in manufacturing or rebuilding locomotives, locomotive frames and parts. Includes also manufacturers of rolling stock.
notation: 5210202014
valid from: 2020
is activity of: Heavy Machinery & Vehicles

Agricultural Machinery
type: NamedIndividual
type: Activity
type: BusinessClassification
is contemporary version of: http://data.ga-group.nl/ics/trbc/5210202015
is version of: http://data.ga-group.nl/ics/trbc/5210202015
replaces: http://data.ga-group.nl/ics/trbc/2012/5210202015
imported on: 2023-04-07T16:52:39.364811Z
last refreshed on: 2026-06-05T07:16:11.699Z
source accessed on: 2017-12-31T07:04:19Z
source last accessed on: 2021-08-01T01:06:53Z
definition: Companies engaged in manufacturing machineries, such as cultivator, power tiller, planters, manure spreader or sprayer, and harvesters.
notation: 5210202015
valid from: 2020
is activity of: Heavy Machinery & Vehicles

Commercial Landscaping Equipment
type: NamedIndividual
type: Activity
type: BusinessClassification
is contemporary version of: http://data.ga-group.nl/ics/trbc/5210202016
is version of: http://data.ga-group.nl/ics/trbc/5210202016
replaces: http://data.ga-group.nl/ics/trbc/2012/5210202016
imported on: 2023-04-07T16:52:39.364811Z
last refreshed on: 2026-06-05T07:16:11.699Z
source accessed on: 2017-12-31T07:04:19Z
source last accessed on: 2021-08-01T01:06:53Z
definition: Companies engaged in manufacturing commercial equipment, such as pruners, string trimmers, and hedgers.
notation: 5210202016
valid from: 2020
is activity of: Heavy Machinery & Vehicles

Heavy Machinery & Vehicles Wholesale
type: NamedIndividual
type: Activity
type: BusinessClassification
is contemporary version of: http://data.ga-group.nl/ics/trbc/5210202017
is version of: http://data.ga-group.nl/ics/trbc/5210202017
replaces: http://data.ga-group.nl/ics/trbc/2012/5210202017
imported on: 2023-04-07T16:52:39.364811Z
last refreshed on: 2026-06-05T07:16:11.699Z
source accessed on: 2017-12-31T07:04:19Z
source last accessed on: 2021-08-01T01:06:53Z
definition: Companies engaged in wholesaling heavy trucks, road paving and earth moving machinery, tractors, bulldozers, cranes, planting and harvesting machinery, such as balers, graders, cotton ginning machinery, locomotives and rolling stock, as well as commercial shovels, lawn mowers and other commercial landscaping equipment.
notation: 5210202017
valid from: 2020
is activity of: Heavy Machinery & Vehicles

Heavy Machinery & Vehicles
type: NamedIndividual
type: BusinessClassification
type: Industry
is contemporary version of: http://data.ga-group.nl/ics/trbc/52102020
is version of: http://data.ga-group.nl/ics/trbc/52102020
replaces: http://data.ga-group.nl/ics/trbc/2012/52102020
imported on: 2023-04-07T16:52:39.364811Z
last refreshed on: 2026-06-05T07:16:11.699Z
source accessed on: 2017-12-31T07:04:19Z
source last accessed on: 2021-08-01T01:06:53Z
definition: Manufacturers of heavy trucks, road paving and earth movers, tractors, cranes, planting and harvesting machinery, such as balers, graders, cotton ginning machinery, locomotives and rolling stock, as well as commercial shovels, lawnmowers and landscaping equipment.
notation: 52102020
valid from: 2020
is industry of: Machinery, Tools, Heavy Vehicles, Trains & Ships

Electrical Components & Equipment (NEC)
type: NamedIndividual
type: Activity
type: BusinessClassification
is contemporary version of: http://data.ga-group.nl/ics/trbc/5210203010
is version of: http://data.ga-group.nl/ics/trbc/5210203010
replaces: http://data.ga-group.nl/ics/trbc/2012/5210203010
imported on: 2023-04-07T16:52:39.364811Z
last refreshed on: 2026-06-05T07:16:11.699Z
source accessed on: 2017-12-31T07:04:19Z
source last accessed on: 2021-08-01T01:06:53Z
definition: Companies involved in at least two activities under Electrical Components & Equipment. Includes companies engaged in the manufacturing of small scale electrical equipment, such as motors, electric heating and cooling systems, small generators, storage batteries and related equipment. Includes also manufacturers of electrical components, such as wires, cables transistors, electron tubes and insulators.
notation: 5210203010
valid from: 2020
is activity of: Electrical Components & Equipment

Batteries & Uninterruptable Power Supplies
type: NamedIndividual
type: Activity
type: BusinessClassification
is contemporary version of: http://data.ga-group.nl/ics/trbc/5210203011
is version of: http://data.ga-group.nl/ics/trbc/5210203011
replaces: http://data.ga-group.nl/ics/trbc/2012/5210203011
imported on: 2023-04-07T16:52:39.364811Z
last refreshed on: 2026-06-05T07:16:11.699Z
source accessed on: 2017-12-31T07:04:19Z
source last accessed on: 2021-08-01T01:06:53Z
definition: Companies engaged in manufacturing storage batteries, and uninterruptable power supply apparatus. Excludes the manufacture of vehicle batteries, including those used to provide electric propulsion, classified in Automotive Batteries.
notation: 5210203011
valid from: 2020
is activity of: Electrical Components & Equipment

Wires & Cables
type: NamedIndividual
type: Activity
type: BusinessClassification
is contemporary version of: http://data.ga-group.nl/ics/trbc/5210203012
is version of: http://data.ga-group.nl/ics/trbc/5210203012
replaces: http://data.ga-group.nl/ics/trbc/2012/5210203012
imported on: 2023-04-07T16:52:39.364811Z
last refreshed on: 2026-06-05T07:16:11.699Z
source accessed on: 2017-12-31T07:04:19Z
source last accessed on: 2021-08-01T01:06:53Z
definition: Companies engaged in manufacturing all types of electrical wires and cables.
notation: 5210203012
valid from: 2020
is activity of: Electrical Components & Equipment

Electrical Components
type: NamedIndividual
type: Activity
type: BusinessClassification
is contemporary version of: http://data.ga-group.nl/ics/trbc/5210203013
is version of: http://data.ga-group.nl/ics/trbc/5210203013
replaces: http://data.ga-group.nl/ics/trbc/2012/5210203013
imported on: 2023-04-07T16:52:39.364811Z
last refreshed on: 2026-06-05T07:16:11.699Z
source accessed on: 2017-12-31T07:04:19Z
source last accessed on: 2021-08-01T01:06:53Z
definition: Companies engaged in manufacturing industrial electrical components, such as connectors, resistors, and capacitors.
notation: 5210203013
valid from: 2020
is activity of: Electrical Components & Equipment

Lighting Equipment
type: NamedIndividual
type: Activity
type: BusinessClassification
is contemporary version of: http://data.ga-group.nl/ics/trbc/5210203014
is version of: http://data.ga-group.nl/ics/trbc/5210203014
replaces: http://data.ga-group.nl/ics/trbc/2012/5210203014
imported on: 2023-04-07T16:52:39.364811Z
last refreshed on: 2026-06-05T07:16:11.699Z
source accessed on: 2017-12-31T07:04:19Z
source last accessed on: 2021-08-01T01:06:53Z
definition: Companies engaged in manufacturing electric light bulbs and tubes, and parts and components.
notation: 5210203014
valid from: 2020
is activity of: Electrical Components & Equipment

Heating, Ventilation & Air Conditioning Systems
type: NamedIndividual
type: Activity
type: BusinessClassification
is contemporary version of: http://data.ga-group.nl/ics/trbc/5210203015
is version of: http://data.ga-group.nl/ics/trbc/5210203015
replaces: http://data.ga-group.nl/ics/trbc/2012/5210203015
imported on: 2023-04-07T16:52:39.364811Z
last refreshed on: 2026-06-05T07:16:11.699Z
source accessed on: 2017-12-31T07:04:19Z
source last accessed on: 2021-08-01T01:06:53Z
definition: Companies engaged in manufacturing heating equipment, such as heating boilers, heating stoves, floor and wall furnaces, and wall and baseboard heating units. Includes also companies manufacturing ventilating, heating and air-conditioning.
notation: 5210203015
valid from: 2020
is activity of: Electrical Components & Equipment

Electrical Insulators
type: NamedIndividual
type: Activity
type: BusinessClassification
is contemporary version of: http://data.ga-group.nl/ics/trbc/5210203016
is version of: http://data.ga-group.nl/ics/trbc/5210203016
replaces: http://data.ga-group.nl/ics/trbc/2012/5210203016
imported on: 2023-04-07T16:52:39.364811Z
last refreshed on: 2026-06-05T07:16:11.699Z
source accessed on: 2017-12-31T07:04:19Z
source last accessed on: 2021-08-01T01:06:53Z
definition: Companies engaged in manufacturing electrical insulators, such as porcelain glass polymer insulators.
notation: 5210203016
valid from: 2020
is activity of: Electrical Components & Equipment

Switchgear
type: NamedIndividual
type: Activity
type: BusinessClassification
is contemporary version of: http://data.ga-group.nl/ics/trbc/5210203017
is version of: http://data.ga-group.nl/ics/trbc/5210203017
replaces: http://data.ga-group.nl/ics/trbc/2012/5210203017
imported on: 2023-04-07T16:52:39.364811Z
last refreshed on: 2026-06-05T07:16:11.699Z
source accessed on: 2017-12-31T07:04:19Z
source last accessed on: 2021-08-01T01:06:53Z
definition: Companies engaged in manufacturing switchgear and switchboard apparatus, such as circuit breakers, fuse, switchboard, switches, and electric panels.
notation: 5210203017
valid from: 2020
is activity of: Electrical Components & Equipment

Portable Motors & Generators
type: NamedIndividual
type: Activity
type: BusinessClassification
is contemporary version of: http://data.ga-group.nl/ics/trbc/5210203018
is version of: http://data.ga-group.nl/ics/trbc/5210203018
replaces: http://data.ga-group.nl/ics/trbc/2012/5210203018
imported on: 2023-04-07T16:52:39.364811Z
last refreshed on: 2026-06-05T07:16:11.699Z
source accessed on: 2017-12-31T07:04:19Z
source last accessed on: 2021-08-01T01:06:53Z
definition: Companies engaged in manufacturing devices, such as portable generators, motors and related accessories.
notation: 5210203018
valid from: 2020
is activity of: Electrical Components & Equipment

Electrical Measuring & Testing Instruments
type: NamedIndividual
type: Activity
type: BusinessClassification
is contemporary version of: http://data.ga-group.nl/ics/trbc/5210203019
is version of: http://data.ga-group.nl/ics/trbc/5210203019
replaces: http://data.ga-group.nl/ics/trbc/2012/5210203019
imported on: 2023-04-07T16:52:39.364811Z
last refreshed on: 2026-06-05T07:16:11.699Z
source accessed on: 2017-12-31T07:04:19Z
source last accessed on: 2021-08-01T01:06:53Z
definition: Companies engaged in manufacturing measuring and controlling devices, such as testers, volt meters, ohm meters, wattmeters, and multimeters.
notation: 5210203019
valid from: 2020
is activity of: Electrical Components & Equipment

Electric Equipment Wholesale
type: NamedIndividual
type: Activity
type: BusinessClassification
is contemporary version of: http://data.ga-group.nl/ics/trbc/5210203020
is version of: http://data.ga-group.nl/ics/trbc/5210203020
replaces: http://data.ga-group.nl/ics/trbc/2012/5210203020
imported on: 2023-04-07T16:52:39.364811Z
last refreshed on: 2026-06-05T07:16:11.699Z
source accessed on: 2017-12-31T07:04:19Z
source last accessed on: 2021-08-01T01:06:53Z
definition: Companies engaged in wholesaling electrical materials, such as wiring supplies, electric light fixtures, light bulbs, and/or electrical power equipment for the generation, transmission, distribution, or control of electric energy.
notation: 5210203020
valid from: 2020
is activity of: Electrical Components & Equipment

Electrical Components & Equipment
type: NamedIndividual
type: BusinessClassification
type: Industry
is contemporary version of: http://data.ga-group.nl/ics/trbc/52102030
is version of: http://data.ga-group.nl/ics/trbc/52102030
replaces: http://data.ga-group.nl/ics/trbc/2012/52102030
imported on: 2023-04-07T16:52:39.364811Z
last refreshed on: 2026-06-05T07:16:11.699Z
source accessed on: 2017-12-31T07:04:19Z
source last accessed on: 2021-08-01T01:06:53Z
definition: Manufacturers of small scale electrical equipment, such as motors, electric heating and cooling systems, small generators, storage batteries and related equipment. Including producers of electrical components, such as wires, cables transistors, electron tubes and insulators.
notation: 52102030
valid from: 2020
is industry of: Machinery, Tools, Heavy Vehicles, Trains & Ships

Heavy Electrical Equipment (NEC)
type: NamedIndividual
type: Activity
type: BusinessClassification
is contemporary version of: http://data.ga-group.nl/ics/trbc/5210204010
is version of: http://data.ga-group.nl/ics/trbc/5210204010
replaces: http://data.ga-group.nl/ics/trbc/2012/5210204010
imported on: 2023-04-07T16:52:39.364811Z
last refreshed on: 2026-06-05T07:16:11.699Z
source accessed on: 2017-12-31T07:04:19Z
source last accessed on: 2021-08-01T01:06:53Z
definition: Companies involved in at least two activities under Heavy Electrical Equipment. Includes companies engaged in the manufacturing of large scale electrical equipment, such as elevators, escalators, industrial conveyor belt systems and electrical machinery. Includes also manufacturers of hydraulic, steam, gas turbines, large generators and power grid equipment, such as transformers.
notation: 5210204010
valid from: 2020
is activity of: Heavy Electrical Equipment

Electrical Transmission & Grid Equipment
type: NamedIndividual
type: Activity
type: BusinessClassification
is contemporary version of: http://data.ga-group.nl/ics/trbc/5210204011
is version of: http://data.ga-group.nl/ics/trbc/5210204011
replaces: http://data.ga-group.nl/ics/trbc/2012/5210204011
imported on: 2023-04-07T16:52:39.364811Z
last refreshed on: 2026-06-05T07:16:11.699Z
source accessed on: 2017-12-31T07:04:19Z
source last accessed on: 2021-08-01T01:06:53Z
definition: Companies engaged in manufacturing equipment used in smart grids and electrical transmission.
notation: 5210204011
valid from: 2020
is activity of: Heavy Electrical Equipment

Elevator & Conveying Equipment
type: NamedIndividual
type: Activity
type: BusinessClassification
is contemporary version of: http://data.ga-group.nl/ics/trbc/5210204012
is version of: http://data.ga-group.nl/ics/trbc/5210204012
replaces: http://data.ga-group.nl/ics/trbc/2012/5210204012
imported on: 2023-04-07T16:52:39.364811Z
last refreshed on: 2026-06-05T07:16:11.699Z
source accessed on: 2017-12-31T07:04:19Z
source last accessed on: 2021-08-01T01:06:53Z
definition: Companies engaged in manufacturing elevators, moving stairways, conveyors, and conveying equipment.
notation: 5210204012
valid from: 2020
is activity of: Heavy Electrical Equipment

Turbine Manufacturing
type: NamedIndividual
type: Activity
type: BusinessClassification
is contemporary version of: http://data.ga-group.nl/ics/trbc/5210204013
is version of: http://data.ga-group.nl/ics/trbc/5210204013
replaces: http://data.ga-group.nl/ics/trbc/2012/5210204013
imported on: 2023-04-07T16:52:39.364811Z
last refreshed on: 2026-06-05T07:16:11.699Z
source accessed on: 2017-12-31T07:04:19Z
source last accessed on: 2021-08-01T01:06:53Z
definition: Companies engaged in manufacturing turbines (except aircraft); and complete turbine generator set units, such as steam, hydraulic, gas, and wind.
notation: 5210204013
valid from: 2020
is activity of: Heavy Electrical Equipment

Heavy Motors & Generators
type: NamedIndividual
type: Activity
type: BusinessClassification
is contemporary version of: http://data.ga-group.nl/ics/trbc/5210204014
is version of: http://data.ga-group.nl/ics/trbc/5210204014
replaces: http://data.ga-group.nl/ics/trbc/2012/5210204014
imported on: 2023-04-07T16:52:39.364811Z
last refreshed on: 2026-06-05T07:16:11.699Z
source accessed on: 2017-12-31T07:04:19Z
source last accessed on: 2021-08-01T01:06:53Z
definition: Companies engaged in manufacturing electric motors (except internal combustion engine starting motors), power generators (except battery charging alternators for internal combustion engines), and motor generator sets (except turbine generator set units).
notation: 5210204014
valid from: 2020
is activity of: Heavy Electrical Equipment

Industrial Electrical Switchgear
type: NamedIndividual
type: Activity
type: BusinessClassification
is contemporary version of: http://data.ga-group.nl/ics/trbc/5210204015
is version of: http://data.ga-group.nl/ics/trbc/5210204015
replaces: http://data.ga-group.nl/ics/trbc/2012/5210204015
imported on: 2023-04-07T16:52:39.364811Z
last refreshed on: 2026-06-05T07:16:11.699Z
source accessed on: 2017-12-31T07:04:19Z
source last accessed on: 2021-08-01T01:06:53Z
definition: Companies engaged in manufacturing switchgear and switchboard apparatus. Includes electric switchboard equipment, power circuit breakers, panel boards, and electric power distribution.
notation: 5210204015
valid from: 2020
is activity of: Heavy Electrical Equipment

Nuclear Generators & Components
type: NamedIndividual
type: Activity
type: BusinessClassification
is contemporary version of: http://data.ga-group.nl/ics/trbc/5210204016
is version of: http://data.ga-group.nl/ics/trbc/5210204016
replaces: http://data.ga-group.nl/ics/trbc/2012/5210204016
imported on: 2023-04-07T16:52:39.364811Z
last refreshed on: 2026-06-05T07:16:11.699Z
source accessed on: 2017-12-31T07:04:19Z
source last accessed on: 2021-08-01T01:06:53Z
definition: Companies engaged in manufacturing nuclear generators and components.
notation: 5210204016
valid from: 2020
is activity of: Heavy Electrical Equipment

Heavy Electrical Equipment
type: NamedIndividual
type: BusinessClassification
type: Industry
is contemporary version of: http://data.ga-group.nl/ics/trbc/52102040
is version of: http://data.ga-group.nl/ics/trbc/52102040
replaces: http://data.ga-group.nl/ics/trbc/2012/52102040
imported on: 2023-04-07T16:52:39.364811Z
last refreshed on: 2026-06-05T07:16:11.699Z
source accessed on: 2017-12-31T07:04:19Z
source last accessed on: 2021-08-01T01:06:53Z
definition: Manufacturers of large scale electrical equipment, such as elevators, escalators, industrial conveyor belt systems and electrical machinery. Includes producers of hydraulic, steam and gas turbines, large generators and power grid equipment, such as transformers.
notation: 52102040
valid from: 2020
is industry of: Machinery, Tools, Heavy Vehicles, Trains & Ships

Shipbuilding (NEC)
type: NamedIndividual
type: Activity
type: BusinessClassification
is contemporary version of: http://data.ga-group.nl/ics/trbc/5210205010
is version of: http://data.ga-group.nl/ics/trbc/5210205010
replaces: http://data.ga-group.nl/ics/trbc/2012/5210205010
imported on: 2023-04-07T16:52:39.364811Z
last refreshed on: 2026-06-05T07:16:11.699Z
source accessed on: 2017-12-31T07:04:19Z
source last accessed on: 2021-08-01T01:06:53Z
definition: Companies involved in at least two activities under Shipbuilding, none being dominant: Ship Parts Manufacturers and Ship Repairing & Maintenance. Includes companies engaged in construction of ships, and ship-related repair services. Excludes manufacturers of ship parts, classified in Ship Parts Manufacturers .
notation: 5210205010
valid from: 2020
is activity of: Shipbuilding

Ship Parts Manufacturers
type: NamedIndividual
type: Activity
type: BusinessClassification
is contemporary version of: http://data.ga-group.nl/ics/trbc/5210205011
is version of: http://data.ga-group.nl/ics/trbc/5210205011
replaces: http://data.ga-group.nl/ics/trbc/2012/5210205011
imported on: 2023-04-07T16:52:39.364811Z
last refreshed on: 2026-06-05T07:16:11.699Z
source accessed on: 2017-12-31T07:04:19Z
source last accessed on: 2021-08-01T01:06:53Z
definition: Companies engaged in manufacturing ship parts, including marine engines.
notation: 5210205011
valid from: 2020
is activity of: Shipbuilding

Ship Repairing & Maintenance
type: NamedIndividual
type: Activity
type: BusinessClassification
is contemporary version of: http://data.ga-group.nl/ics/trbc/5210205012
is version of: http://data.ga-group.nl/ics/trbc/5210205012
replaces: http://data.ga-group.nl/ics/trbc/2012/5210205012
imported on: 2023-04-07T16:52:39.364811Z
last refreshed on: 2026-06-05T07:16:11.699Z
source accessed on: 2017-12-31T07:04:19Z
source last accessed on: 2021-08-01T01:06:53Z
definition: Companies engaged in construction of ships, their repair, conversion and alteration, the production of prefabricated ship and barge sections, and specialized services, such as ship scaling.
notation: 5210205012
valid from: 2020
is activity of: Shipbuilding

Shipbuilding
type: NamedIndividual
type: BusinessClassification
type: Industry
is contemporary version of: http://data.ga-group.nl/ics/trbc/52102050
is version of: http://data.ga-group.nl/ics/trbc/52102050
replaces: http://data.ga-group.nl/ics/trbc/2012/52102050
imported on: 2023-04-07T16:52:39.364811Z
last refreshed on: 2026-06-05T07:16:11.699Z
source accessed on: 2017-12-31T07:04:19Z
source last accessed on: 2021-08-01T01:06:53Z
definition: Builders of ships, ship parts and ship related repair services.
notation: 52102050
valid from: 2020
is industry of: Machinery, Tools, Heavy Vehicles, Trains & Ships

Machinery, Tools, Heavy Vehicles, Trains & Ships
type: NamedIndividual
type: BusinessClassification
type: IndustryGroup
is contemporary version of: http://data.ga-group.nl/ics/trbc/521020
is version of: http://data.ga-group.nl/ics/trbc/521020
replaces: http://data.ga-group.nl/ics/trbc/2012/521020
imported on: 2023-04-07T16:52:39.364811Z
last refreshed on: 2026-06-05T07:16:11.699Z
source accessed on: 2017-12-31T07:04:19Z
source last accessed on: 2021-08-01T01:06:53Z
definition: Manufacturers of industrial, construction, agricultural and electrical machinery, equipment & components, and shipbuilders.
notation: 521020
valid from: 2020
is industry group of: Industrial Goods

Industrial Goods
type: NamedIndividual
type: BusinessClassification
type: BusinessSector
is contemporary version of: http://data.ga-group.nl/ics/trbc/5210
is version of: http://data.ga-group.nl/ics/trbc/5210
replaces: http://data.ga-group.nl/ics/trbc/2012/5210
imported on: 2023-04-07T16:52:39.364811Z
last refreshed on: 2026-06-05T07:16:11.699Z
source accessed on: 2017-12-31T07:04:19Z
source last accessed on: 2021-08-01T01:06:53Z
definition: Manufacturers of aerospace & defense equipment, as well as industrial vehicles, machinery, equipment & components, and shipbuilders.
notation: 5210
valid from: 2020
is business sector of: Industrials

Construction & Engineering (NEC)
type: NamedIndividual
type: Activity
type: BusinessClassification
is contemporary version of: http://data.ga-group.nl/ics/trbc/5220102010
is version of: http://data.ga-group.nl/ics/trbc/5220102010
replaces: http://data.ga-group.nl/ics/trbc/2012/5220102010
imported on: 2023-04-07T16:52:39.364811Z
last refreshed on: 2026-06-05T07:16:11.699Z
source accessed on: 2017-12-31T07:04:19Z
source last accessed on: 2021-08-01T01:06:53Z
definition: Companies involved in at least two activities under Construction & Engineering, none being dominant. Includes companies engaged in the construction of commercial buildings, civil engineering projects and utility and other industrial plant construction. Includes also highway, tunnel, bridge, dam, water works and other civil engineering operations, as well as hotel, office buildings, industrial plants, utility plant, and heavy machinery for permanent installation.
notation: 5220102010
valid from: 2020
is activity of: Construction & Engineering

Commercial Buildings
type: NamedIndividual
type: Activity
type: BusinessClassification
is contemporary version of: http://data.ga-group.nl/ics/trbc/5220102011
is version of: http://data.ga-group.nl/ics/trbc/5220102011
replaces: http://data.ga-group.nl/ics/trbc/2012/5220102011
imported on: 2023-04-07T16:52:39.364811Z
last refreshed on: 2026-06-05T07:16:11.699Z
source accessed on: 2017-12-31T07:04:19Z
source last accessed on: 2021-08-01T01:06:53Z
definition: Companies engaged in constructing buildings that are used for commercial use. Includes office buildings, warehouses and retail (convenience stores, big box stores, shopping malls) construction.
notation: 5220102011
valid from: 2020
is activity of: Construction & Engineering

Highway & Bridge Construction
type: NamedIndividual
type: Activity
type: BusinessClassification
is contemporary version of: http://data.ga-group.nl/ics/trbc/5220102012
is version of: http://data.ga-group.nl/ics/trbc/5220102012
replaces: http://data.ga-group.nl/ics/trbc/2012/5220102012
imported on: 2023-04-07T16:52:39.364811Z
last refreshed on: 2026-06-05T07:16:11.699Z
source accessed on: 2017-12-31T07:04:19Z
source last accessed on: 2021-08-01T01:06:53Z
definition: Companies engaged in the construction (new work, reconstruction, or repairs) of highways (except elevated), streets, roads, bridges, tunnel, dam or airport runways; establishments identified as highway and street construction management firms, and engaged in performing subcontract work primarily related to highway and street construction (grading for highways, installing guardrails, public sidewalk construction).
notation: 5220102012
valid from: 2020
is activity of: Construction & Engineering

Railway Construction
type: NamedIndividual
type: Activity
type: BusinessClassification
is contemporary version of: http://data.ga-group.nl/ics/trbc/5220102013
is version of: http://data.ga-group.nl/ics/trbc/5220102013
replaces: http://data.ga-group.nl/ics/trbc/2012/5220102013
imported on: 2023-04-07T16:52:39.364811Z
last refreshed on: 2026-06-05T07:16:11.699Z
source accessed on: 2017-12-31T07:04:19Z
source last accessed on: 2021-08-01T01:06:53Z
definition: Companies engaged in construction related to railways industry. Includes also underground, subway and metro construction.
notation: 5220102013
valid from: 2020
is activity of: Construction & Engineering

Power & Communications Network Construction
type: NamedIndividual
type: Activity
type: BusinessClassification
is contemporary version of: http://data.ga-group.nl/ics/trbc/5220102014
is version of: http://data.ga-group.nl/ics/trbc/5220102014
replaces: http://data.ga-group.nl/ics/trbc/2012/5220102014
imported on: 2023-04-07T16:52:39.364811Z
last refreshed on: 2026-06-05T07:16:11.699Z
source accessed on: 2017-12-31T07:04:19Z
source last accessed on: 2021-08-01T01:06:53Z
definition: Companies engaged in the entire construction (new work, reconstruction, or repairs) of electric power and communication transmission lines and towers, radio and television transmitting/receiving towers, cable laying, and cable television lines. Includes also power and communication transmission line construction.
notation: 5220102014
valid from: 2020
is activity of: Construction & Engineering

Civil Engineers & Architects
type: NamedIndividual
type: Activity
type: BusinessClassification
is contemporary version of: http://data.ga-group.nl/ics/trbc/5220102015
is version of: http://data.ga-group.nl/ics/trbc/5220102015
replaces: http://data.ga-group.nl/ics/trbc/2012/5220102015
imported on: 2023-04-07T16:52:39.364811Z
last refreshed on: 2026-06-05T07:16:11.699Z
source accessed on: 2017-12-31T07:04:19Z
source last accessed on: 2021-08-01T01:06:53Z
definition: Companies engaged in providing the design, construction, and maintenance of the physical and naturally built environment, including works like roads, bridges, canals, dams, and buildings. Includes the planning, design and oversight of the construction of buildings. Includes also interior design consultants who work in areas, such as hospitality design, health care design, institutional design, commercial and corporate design.
notation: 5220102015
valid from: 2020
is activity of: Construction & Engineering

Building Contractors
type: NamedIndividual
type: Activity
type: BusinessClassification
is contemporary version of: http://data.ga-group.nl/ics/trbc/5220102016
is version of: http://data.ga-group.nl/ics/trbc/5220102016
replaces: http://data.ga-group.nl/ics/trbc/2012/5220102016
imported on: 2023-04-07T16:52:39.364811Z
last refreshed on: 2026-06-05T07:16:11.699Z
source accessed on: 2017-12-31T07:04:19Z
source last accessed on: 2021-08-01T01:06:53Z
definition: Companies engaged in providing the day-to-day oversight of a construction site, management of vendors and trades, and communication of information to involved parties throughout the course of a building project.
notation: 5220102016
valid from: 2020
is activity of: Construction & Engineering

Industrial Plant Construction
type: NamedIndividual
type: Activity
type: BusinessClassification
is contemporary version of: http://data.ga-group.nl/ics/trbc/5220102017
is version of: http://data.ga-group.nl/ics/trbc/5220102017
replaces: http://data.ga-group.nl/ics/trbc/2012/5220102017
imported on: 2023-04-07T16:52:39.364811Z
last refreshed on: 2026-06-05T07:16:11.699Z
source accessed on: 2017-12-31T07:04:19Z
source last accessed on: 2021-08-01T01:06:53Z
definition: Companies engaged in providing the necessary infrastructure used in support and maintenance of a given facility. Includes also construction of industrial manufacturing plants, such as chemical plants, industrial factories and facilities.
notation: 5220102017
valid from: 2020
is activity of: Construction & Engineering

Water & Sewage Construction
type: NamedIndividual
type: Activity
type: BusinessClassification
is contemporary version of: http://data.ga-group.nl/ics/trbc/5220102018
is version of: http://data.ga-group.nl/ics/trbc/5220102018
replaces: http://data.ga-group.nl/ics/trbc/2012/5220102018
imported on: 2023-04-07T16:52:39.364811Z
last refreshed on: 2026-06-05T07:16:11.699Z
source accessed on: 2017-12-31T07:04:19Z
source last accessed on: 2021-08-01T01:06:53Z
definition: Companies engaged in providing the entire construction (new work, reconstruction, rehabilitation, or repairs) of water mains, sewers, and drains.
notation: 5220102018
valid from: 2020
is activity of: Construction & Engineering

Land Division & Subdivision
type: NamedIndividual
type: Activity
type: BusinessClassification
is contemporary version of: http://data.ga-group.nl/ics/trbc/5220102019
is version of: http://data.ga-group.nl/ics/trbc/5220102019
replaces: http://data.ga-group.nl/ics/trbc/2012/5220102019
imported on: 2023-04-07T16:52:39.364811Z
last refreshed on: 2026-06-05T07:16:11.699Z
source accessed on: 2017-12-31T07:04:19Z
source last accessed on: 2021-08-01T01:06:53Z
definition: Companies engaged in the act of dividing land into pieces that are easier to sell or otherwise develop.
notation: 5220102019
valid from: 2020
is activity of: Construction & Engineering

Gas Infrastructure Construction
type: NamedIndividual
type: Activity
type: BusinessClassification
is contemporary version of: http://data.ga-group.nl/ics/trbc/5220102020
is version of: http://data.ga-group.nl/ics/trbc/5220102020
replaces: http://data.ga-group.nl/ics/trbc/2012/5220102020
imported on: 2023-04-07T16:52:39.364811Z
last refreshed on: 2026-06-05T07:16:11.699Z
source accessed on: 2017-12-31T07:04:19Z
source last accessed on: 2021-08-01T01:06:53Z
definition: Companies engaged in the entire construction (new work, reconstruction, or repairs) of infrastructure related to gas. Includes also construction of gas refining plant, gas distribution system and network, and gas utility plants.
notation: 5220102020
valid from: 2020
is activity of: Construction & Engineering

Electric Power Plant Construction
type: NamedIndividual
type: Activity
type: BusinessClassification
is contemporary version of: http://data.ga-group.nl/ics/trbc/5220102021
is version of: http://data.ga-group.nl/ics/trbc/5220102021
replaces: http://data.ga-group.nl/ics/trbc/2012/5220102021
imported on: 2023-04-07T16:52:39.364811Z
last refreshed on: 2026-06-05T07:16:11.699Z
source accessed on: 2017-12-31T07:04:19Z
source last accessed on: 2021-08-01T01:06:53Z
definition: Companies engaged in the entire construction (new work, reconstruction, or repairs) of electric power plant and electrical infrastructure. Excludes nuclear reactor and nuclear power plant construction, classified in Nuclear Power Plant Construction.
notation: 5220102021
valid from: 2020
is activity of: Construction & Engineering

Nuclear Power Plant Construction
type: NamedIndividual
type: Activity
type: BusinessClassification
is contemporary version of: http://data.ga-group.nl/ics/trbc/5220102022
is version of: http://data.ga-group.nl/ics/trbc/5220102022
replaces: http://data.ga-group.nl/ics/trbc/2012/5220102022
imported on: 2023-04-07T16:52:39.364811Z
last refreshed on: 2026-06-05T07:16:11.699Z
source accessed on: 2017-12-31T07:04:19Z
source last accessed on: 2021-08-01T01:06:53Z
definition: Companies engaged in the entire construction (new work, reconstruction, or repairs) of heavy industrial non-building structures, and nuclear reactor containment structures.
notation: 5220102022
valid from: 2020
is activity of: Construction & Engineering

Telecommunication Construction
type: NamedIndividual
type: Activity
type: BusinessClassification
is contemporary version of: http://data.ga-group.nl/ics/trbc/5220102023
is version of: http://data.ga-group.nl/ics/trbc/5220102023
replaces: http://data.ga-group.nl/ics/trbc/2012/5220102023
imported on: 2023-04-07T16:52:39.364811Z
last refreshed on: 2026-06-05T07:16:11.699Z
source accessed on: 2017-12-31T07:04:19Z
source last accessed on: 2021-08-01T01:06:53Z
definition: Companies engaged in the entire construction (new work, reconstruction, or repairs) of communication transmission lines and towers, radio and television transmitting/receiving towers, and cable laying.
notation: 5220102023
valid from: 2020
is activity of: Construction & Engineering

Construction & Engineering
type: NamedIndividual
type: BusinessClassification
type: Industry
is contemporary version of: http://data.ga-group.nl/ics/trbc/52201020
is version of: http://data.ga-group.nl/ics/trbc/52201020
replaces: http://data.ga-group.nl/ics/trbc/2012/52201020
imported on: 2023-04-07T16:52:39.364811Z
last refreshed on: 2026-06-05T07:16:11.699Z
source accessed on: 2017-12-31T07:04:19Z
source last accessed on: 2021-08-01T01:06:53Z
definition: Builders and engineers that undertake commercial building, civil engineering, utility and other industrial plant construction projects. Includes builders of transport infrastructure, dam and water works as well as hotel, and office buildings. Includes also manufacturers of heavy machinery for permanent installation.
notation: 52201020
valid from: 2020
is industry of: Construction & Engineering

Construction & Engineering
type: NamedIndividual
type: BusinessClassification
type: IndustryGroup
is contemporary version of: http://data.ga-group.nl/ics/trbc/522010
is version of: http://data.ga-group.nl/ics/trbc/522010
replaces: http://data.ga-group.nl/ics/trbc/2012/522010
imported on: 2023-04-07T16:52:39.364811Z
last refreshed on: 2026-06-05T07:16:11.699Z
source accessed on: 2017-12-31T07:04:19Z
source last accessed on: 2021-08-01T01:06:53Z
definition: Builders and engineers that undertake commercial building, civil engineering, utility and other industrial plant construction projects. Includes builders of transportation infrastructure, dam and water works, as well as hotel, office buildings. Includes also manufacturers of heavy machinery for permanent installation.
notation: 522010
valid from: 2020
is industry group of: Industrial & Commercial Services

Diversified Industrial Goods Wholesale
type: NamedIndividual
type: Activity
type: BusinessClassification
is contemporary version of: http://data.ga-group.nl/ics/trbc/5220201010
is version of: http://data.ga-group.nl/ics/trbc/5220201010
replaces: http://data.ga-group.nl/ics/trbc/2012/5220201010
imported on: 2023-04-07T16:52:39.364811Z
last refreshed on: 2026-06-05T07:16:11.699Z
source accessed on: 2017-12-31T07:04:19Z
source last accessed on: 2021-08-01T01:06:53Z
definition: Companies engaged in the wholesaling and distribution of multiple lines of mainly industrial goods. Excludes wholesaling and distribution of single product lines which are classified into their appropriate manufacturing class.
notation: 5220201010
valid from: 2020
is activity of: Diversified Industrial Goods Wholesale

Diversified Industrial Goods Wholesale
type: NamedIndividual
type: BusinessClassification
type: Industry
is contemporary version of: http://data.ga-group.nl/ics/trbc/52202010
is version of: http://data.ga-group.nl/ics/trbc/52202010
replaces: http://data.ga-group.nl/ics/trbc/2012/52202010
imported on: 2023-04-07T16:52:39.364811Z
last refreshed on: 2026-06-05T07:16:11.699Z
source accessed on: 2017-12-31T07:04:19Z
source last accessed on: 2021-08-01T01:06:53Z
definition: Wholesalers and distributors of multiple lines of mainly industrial goods.
notation: 52202010
valid from: 2020
is industry of: Diversified Industrial Goods Wholesale

Diversified Industrial Goods Wholesale
type: NamedIndividual
type: BusinessClassification
type: IndustryGroup
is contemporary version of: http://data.ga-group.nl/ics/trbc/522020
is version of: http://data.ga-group.nl/ics/trbc/522020
replaces: http://data.ga-group.nl/ics/trbc/2012/522020
imported on: 2023-04-07T16:52:39.364811Z
last refreshed on: 2026-06-05T07:16:11.699Z
source accessed on: 2017-12-31T07:04:19Z
source last accessed on: 2021-08-01T01:06:53Z
definition: Wholesalers and distributors of multiple lines of mainly industrial goods.
notation: 522020
valid from: 2020
is industry group of: Industrial & Commercial Services

Environmental Services & Equipment (NEC)
type: NamedIndividual
type: Activity
type: BusinessClassification
is contemporary version of: http://data.ga-group.nl/ics/trbc/5220301010
is version of: http://data.ga-group.nl/ics/trbc/5220301010
replaces: http://data.ga-group.nl/ics/trbc/2012/5220301010
imported on: 2023-04-07T16:52:39.364811Z
last refreshed on: 2026-06-05T07:16:11.699Z
source accessed on: 2017-12-31T07:04:19Z
source last accessed on: 2021-08-01T01:06:53Z
definition: Companies engaged in the manufacturing of air, water and soil purification equipment, waste disposal of solids, as well as filtration systems and other pollution reducing control equipment. Includes also manufacturers of commercial climate control and regulator systems and plastic, paper, metal and glass recycling equipment and services.
notation: 5220301010
valid from: 2020
is activity of: Environmental Services & Equipment

Purification & Treatment Equipment
type: NamedIndividual
type: Activity
type: BusinessClassification
is contemporary version of: http://data.ga-group.nl/ics/trbc/5220301011
is version of: http://data.ga-group.nl/ics/trbc/5220301011
replaces: http://data.ga-group.nl/ics/trbc/2012/5220301011
imported on: 2023-04-07T16:52:39.364811Z
last refreshed on: 2026-06-05T07:16:11.699Z
source accessed on: 2017-12-31T07:04:19Z
source last accessed on: 2021-08-01T01:06:53Z
definition: Companies engaged in manufacturing soil purification equipment, filtration systems and other pollution reducing control equipment.
notation: 5220301011
valid from: 2020
is activity of: Environmental Services & Equipment

Waste Management, Disposal & Recycling Services
type: NamedIndividual
type: Activity
type: BusinessClassification
is contemporary version of: http://data.ga-group.nl/ics/trbc/5220301012
is version of: http://data.ga-group.nl/ics/trbc/5220301012
replaces: http://data.ga-group.nl/ics/trbc/2012/5220301012
imported on: 2023-04-07T16:52:39.364811Z
last refreshed on: 2026-06-05T07:16:11.699Z
source accessed on: 2017-12-31T07:04:19Z
source last accessed on: 2021-08-01T01:06:53Z
definition: Companies engaged in the collection, transport, processing or disposal, managing and monitoring of waste materials. Includes also the process used to convert materials (waste) into new products.
notation: 5220301012
valid from: 2020
is activity of: Environmental Services & Equipment

Environmental Consultancy Services
type: NamedIndividual
type: Activity
type: BusinessClassification
is contemporary version of: http://data.ga-group.nl/ics/trbc/5220301013
is version of: http://data.ga-group.nl/ics/trbc/5220301013
replaces: http://data.ga-group.nl/ics/trbc/2012/5220301013
imported on: 2023-04-07T16:52:39.364811Z
last refreshed on: 2026-06-05T07:16:11.699Z
source accessed on: 2017-12-31T07:04:19Z
source last accessed on: 2021-08-01T01:06:53Z
definition: Companies engaged in the provision of consultancy services and solutions related to environment, such as advice on hazardous materials, pollution, remediation, sanitation, radiation, materials recovery and recycling and toxic agents.
notation: 5220301013
valid from: 2020
is activity of: Environmental Services & Equipment

Environmental R&D Services & Biotechnology
type: NamedIndividual
type: Activity
type: BusinessClassification
is contemporary version of: http://data.ga-group.nl/ics/trbc/5220301014
is version of: http://data.ga-group.nl/ics/trbc/5220301014
replaces: http://data.ga-group.nl/ics/trbc/2012/5220301014
imported on: 2023-04-07T16:52:39.364811Z
last refreshed on: 2026-06-05T07:16:11.699Z
source accessed on: 2017-12-31T07:04:19Z
source last accessed on: 2021-08-01T01:06:53Z
definition: Companies engaged in environmental R&D activities, such as pollution testing, toxicity measuring, radiation control and other laboratories, green technologies research as well as research and development on machinery and devices for the environmental sector.
notation: 5220301014
valid from: 2020
is activity of: Environmental Services & Equipment

Carbon Capture & Storage
type: NamedIndividual
type: Activity
type: BusinessClassification
is contemporary version of: http://data.ga-group.nl/ics/trbc/5220301015
is version of: http://data.ga-group.nl/ics/trbc/5220301015
replaces: http://data.ga-group.nl/ics/trbc/2012/5220301015
imported on: 2023-04-07T16:52:39.364811Z
last refreshed on: 2026-06-05T07:16:11.699Z
source accessed on: 2017-12-31T07:04:19Z
source last accessed on: 2021-08-01T01:06:53Z
definition: Companies engaged in separating carbon dioxide from emissions and storing it in order to prevent global warning.
notation: 5220301015
valid from: 2020
is activity of: Environmental Services & Equipment

Environmental Services & Equipment
type: NamedIndividual
type: BusinessClassification
type: Industry
is contemporary version of: http://data.ga-group.nl/ics/trbc/52203010
is version of: http://data.ga-group.nl/ics/trbc/52203010
replaces: http://data.ga-group.nl/ics/trbc/2012/52203010
imported on: 2023-04-07T16:52:39.364811Z
last refreshed on: 2026-06-05T07:16:11.699Z
source accessed on: 2017-12-31T07:04:19Z
source last accessed on: 2021-08-01T01:06:53Z
definition: Providers of air, water and soil purification equipment, solid waste disposal, filtration systems and other pollution-reducing control equipment and environmental consulting services. Includes producers of commercial climate control and regulator systems, and plastic, paper, metal and glass recycling equipment and services. Includes also carbon capture and storage.
notation: 52203010
valid from: 2020
is industry of: Professional & Commercial Services

Commercial Printing Services (NEC)
type: NamedIndividual
type: Activity
type: BusinessClassification
is contemporary version of: http://data.ga-group.nl/ics/trbc/5220302010
is version of: http://data.ga-group.nl/ics/trbc/5220302010
replaces: http://data.ga-group.nl/ics/trbc/2012/5220302010
imported on: 2023-04-07T16:52:39.364811Z
last refreshed on: 2026-06-05T07:16:11.699Z
source accessed on: 2017-12-31T07:04:19Z
source last accessed on: 2021-08-01T01:06:53Z
definition: Companies engaged in printing activities that support the publishing, advertising and other commercial businesses. Includes printers of business forms, directories, catalogs, books, magazines, greeting cards, art prints, newspapers and other printing services without proprietary publishing rights.
notation: 5220302010
valid from: 2020
is activity of: Commercial Printing Services

Specialized Printing Services
type: NamedIndividual
type: Activity
type: BusinessClassification
is contemporary version of: http://data.ga-group.nl/ics/trbc/5220302011
is version of: http://data.ga-group.nl/ics/trbc/5220302011
replaces: http://data.ga-group.nl/ics/trbc/2012/5220302011
imported on: 2023-04-07T16:52:39.364811Z
last refreshed on: 2026-06-05T07:16:11.699Z
source accessed on: 2017-12-31T07:04:19Z
source last accessed on: 2021-08-01T01:06:53Z
definition: Companies engaged in greeting and business cards printing, catalogs, telephone directories, maps, posters and postcards printing, among others.
notation: 5220302011
valid from: 2020
is activity of: Commercial Printing Services

Newspaper & Magazine Printing Services
type: NamedIndividual
type: Activity
type: BusinessClassification
is contemporary version of: http://data.ga-group.nl/ics/trbc/5220302012
is version of: http://data.ga-group.nl/ics/trbc/5220302012
replaces: http://data.ga-group.nl/ics/trbc/2012/5220302012
imported on: 2023-04-07T16:52:39.364811Z
last refreshed on: 2026-06-05T07:16:11.699Z
source accessed on: 2017-12-31T07:04:19Z
source last accessed on: 2021-08-01T01:06:53Z
definition: Companies engaged in printing newspapers, magazines, periodicals and newsletters.
notation: 5220302012
valid from: 2020
is activity of: Commercial Printing Services

Book Printing Services
type: NamedIndividual
type: Activity
type: BusinessClassification
is contemporary version of: http://data.ga-group.nl/ics/trbc/5220302013
is version of: http://data.ga-group.nl/ics/trbc/5220302013
replaces: http://data.ga-group.nl/ics/trbc/2012/5220302013
imported on: 2023-04-07T16:52:39.364811Z
last refreshed on: 2026-06-05T07:16:11.699Z
source accessed on: 2017-12-31T07:04:19Z
source last accessed on: 2021-08-01T01:06:53Z
definition: Companies engaged in book, manuals, encyclopedias printing without publishing.
notation: 5220302013
valid from: 2020
is activity of: Commercial Printing Services

Commercial Printing Services
type: NamedIndividual
type: BusinessClassification
type: Industry
is contemporary version of: http://data.ga-group.nl/ics/trbc/52203020
is version of: http://data.ga-group.nl/ics/trbc/52203020
replaces: http://data.ga-group.nl/ics/trbc/2012/52203020
imported on: 2023-04-07T16:52:39.364811Z
last refreshed on: 2026-06-05T07:16:11.699Z
source accessed on: 2017-12-31T07:04:19Z
source last accessed on: 2021-08-01T01:06:53Z
definition: Printers and providers of supporting services to publishers, advertisers and other commercial businesses. Includes printers of business forms, directories, catalogs, books, magazines, greeting cards, art prints, newspapers and other printing services without proprietary publishing rights.
notation: 52203020
valid from: 2020
is industry of: Professional & Commercial Services

Employment Services (NEC)
type: NamedIndividual
type: Activity
type: BusinessClassification
is contemporary version of: http://data.ga-group.nl/ics/trbc/5220303010
is version of: http://data.ga-group.nl/ics/trbc/5220303010
replaces: http://data.ga-group.nl/ics/trbc/2012/5220303010
imported on: 2023-04-07T16:52:39.364811Z
last refreshed on: 2026-06-05T07:16:11.699Z
source accessed on: 2017-12-31T07:04:19Z
source last accessed on: 2021-08-01T01:06:53Z
definition: Companies engaged in human resources, employment and staff management services. Includes online job portals.
notation: 5220303010
valid from: 2020
is activity of: Employment Services

Human Resources Consulting Services
type: NamedIndividual
type: Activity
type: BusinessClassification
is contemporary version of: http://data.ga-group.nl/ics/trbc/5220303011
is version of: http://data.ga-group.nl/ics/trbc/5220303011
replaces: http://data.ga-group.nl/ics/trbc/2012/5220303011
imported on: 2023-04-07T16:52:39.364811Z
last refreshed on: 2026-06-05T07:16:11.699Z
source accessed on: 2017-12-31T07:04:19Z
source last accessed on: 2021-08-01T01:06:53Z
definition: Companies engaged in providing HR advisory services, such as human capital management consulting, compensation and benefit scheme advice, among others.
notation: 5220303011
valid from: 2020
is activity of: Employment Services

Outsourcing & Staffing Services
type: NamedIndividual
type: Activity
type: BusinessClassification
is contemporary version of: http://data.ga-group.nl/ics/trbc/5220303012
is version of: http://data.ga-group.nl/ics/trbc/5220303012
replaces: http://data.ga-group.nl/ics/trbc/2012/5220303012
imported on: 2023-04-07T16:52:39.364811Z
last refreshed on: 2026-06-05T07:16:11.699Z
source accessed on: 2017-12-31T07:04:19Z
source last accessed on: 2021-08-01T01:06:53Z
definition: Companies engaged in the provision of human resources management and staffing services, including employment, payroll and tax administration, employee incentive/bonus plan management, among others.
notation: 5220303012
valid from: 2020
is activity of: Employment Services

Executive Search Services
type: NamedIndividual
type: Activity
type: BusinessClassification
is contemporary version of: http://data.ga-group.nl/ics/trbc/5220303013
is version of: http://data.ga-group.nl/ics/trbc/5220303013
replaces: http://data.ga-group.nl/ics/trbc/2012/5220303013
imported on: 2023-04-07T16:52:39.364811Z
last refreshed on: 2026-06-05T07:16:11.699Z
source accessed on: 2017-12-31T07:04:19Z
source last accessed on: 2021-08-01T01:06:53Z
definition: Companies engaged in the senior executive search.
notation: 5220303013
valid from: 2020
is activity of: Employment Services

Online Job Portals
type: NamedIndividual
type: Activity
type: BusinessClassification
is contemporary version of: http://data.ga-group.nl/ics/trbc/5220303014
is version of: http://data.ga-group.nl/ics/trbc/5220303014
replaces: http://data.ga-group.nl/ics/trbc/2012/5220303014
imported on: 2023-04-07T16:52:39.364811Z
last refreshed on: 2026-06-05T07:16:11.699Z
source accessed on: 2017-12-31T07:04:19Z
source last accessed on: 2021-08-01T01:06:53Z
definition: Companies engaged in operating Internet-based job portals.
notation: 5220303014
valid from: 2020
is activity of: Employment Services

Employment Services
type: NamedIndividual
type: BusinessClassification
type: Industry
is contemporary version of: http://data.ga-group.nl/ics/trbc/52203030
is version of: http://data.ga-group.nl/ics/trbc/52203030
replaces: http://data.ga-group.nl/ics/trbc/2012/52203030
imported on: 2023-04-07T16:52:39.364811Z
last refreshed on: 2026-06-05T07:16:11.699Z
source accessed on: 2017-12-31T07:04:19Z
source last accessed on: 2021-08-01T01:06:53Z
definition: Providers of human resource, employment and staff management services. Includes online job portals.
notation: 52203030
valid from: 2020
is industry of: Professional & Commercial Services

Business Support Services (NEC)
type: NamedIndividual
type: Activity
type: BusinessClassification
is contemporary version of: http://data.ga-group.nl/ics/trbc/5220304010
is version of: http://data.ga-group.nl/ics/trbc/5220304010
replaces: http://data.ga-group.nl/ics/trbc/2012/5220304010
imported on: 2023-04-07T16:52:39.364811Z
last refreshed on: 2026-06-05T07:16:11.699Z
source accessed on: 2017-12-31T07:04:19Z
source last accessed on: 2021-08-01T01:06:53Z
definition: Companies engaged in commercial support services such as legal, cleaning, educational, accounting, security, office equipment rental, management consulting, basic data processing and other widely used services. Includes also ATM operators that are not banks, as well as data processing Companies.
notation: 5220304010
valid from: 2020
is activity of: Business Support Services

Corporate Accounting Services
type: NamedIndividual
type: Activity
type: BusinessClassification
is contemporary version of: http://data.ga-group.nl/ics/trbc/5220304011
is version of: http://data.ga-group.nl/ics/trbc/5220304011
replaces: http://data.ga-group.nl/ics/trbc/2012/5220304011
imported on: 2023-04-07T16:52:39.364811Z
last refreshed on: 2026-06-05T07:16:11.699Z
source accessed on: 2017-12-31T07:04:19Z
source last accessed on: 2021-08-01T01:06:53Z
definition: Companies engaged in the provision of auditing, accounting (including offices of CPAs, Certified Public Accountants) and corporate tax preparation services to Companies.
notation: 5220304011
valid from: 2020
is activity of: Business Support Services

Legal Services
type: NamedIndividual
type: Activity
type: BusinessClassification
is contemporary version of: http://data.ga-group.nl/ics/trbc/5220304012
is version of: http://data.ga-group.nl/ics/trbc/5220304012
replaces: http://data.ga-group.nl/ics/trbc/2012/5220304012
imported on: 2023-04-07T16:52:39.364811Z
last refreshed on: 2026-06-05T07:16:11.699Z
source accessed on: 2017-12-31T07:04:19Z
source last accessed on: 2021-08-01T01:06:53Z
definition: Companies engaged in the provision of legal services to other businesses. These will include corporate law offices, patent law offices, tax law offices, among others.
notation: 5220304012
valid from: 2020
is activity of: Business Support Services

Management Consulting Services
type: NamedIndividual
type: Activity
type: BusinessClassification
is contemporary version of: http://data.ga-group.nl/ics/trbc/5220304013
is version of: http://data.ga-group.nl/ics/trbc/5220304013
replaces: http://data.ga-group.nl/ics/trbc/2012/5220304013
imported on: 2023-04-07T16:52:39.364811Z
last refreshed on: 2026-06-05T07:16:11.699Z
source accessed on: 2017-12-31T07:04:19Z
source last accessed on: 2021-08-01T01:06:53Z
definition: Companies engaged in the provision of general management, strategic planning, financial (apart from investment services) administration, reorganization and other consulting services to businesses.
notation: 5220304013
valid from: 2020
is activity of: Business Support Services

Security Services
type: NamedIndividual
type: Activity
type: BusinessClassification
is contemporary version of: http://data.ga-group.nl/ics/trbc/5220304014
is version of: http://data.ga-group.nl/ics/trbc/5220304014
replaces: http://data.ga-group.nl/ics/trbc/2012/5220304014
imported on: 2023-04-07T16:52:39.364811Z
last refreshed on: 2026-06-05T07:16:11.699Z
source accessed on: 2017-12-31T07:04:19Z
source last accessed on: 2021-08-01T01:06:53Z
definition: Companies engaged in the provision of security guard services, commercial property protection services, security patrol services, facility monitoring services and others.
notation: 5220304014
valid from: 2020
is activity of: Business Support Services

Cleaning Services
type: NamedIndividual
type: Activity
type: BusinessClassification
is contemporary version of: http://data.ga-group.nl/ics/trbc/5220304016
is version of: http://data.ga-group.nl/ics/trbc/5220304016
replaces: http://data.ga-group.nl/ics/trbc/2012/5220304016
imported on: 2023-04-07T16:52:39.364811Z
last refreshed on: 2026-06-05T07:16:11.699Z
source accessed on: 2017-12-31T07:04:19Z
source last accessed on: 2021-08-01T01:06:53Z
definition: Companies engaged in the provision of commercial cleaning services, such as office and commercial space cleaning, janitorial services to businesses, office furniture cleaning, among others.
notation: 5220304016
valid from: 2020
is activity of: Business Support Services

Data Processing Services
type: NamedIndividual
type: Activity
type: BusinessClassification
is contemporary version of: http://data.ga-group.nl/ics/trbc/5220304017
is version of: http://data.ga-group.nl/ics/trbc/5220304017
replaces: http://data.ga-group.nl/ics/trbc/2012/5220304017
imported on: 2023-04-07T16:52:39.364811Z
last refreshed on: 2026-06-05T07:16:11.699Z
source accessed on: 2017-12-31T07:04:19Z
source last accessed on: 2021-08-01T01:06:53Z
definition: Companies engaged in the provision of basic data processing services.
notation: 5220304017
valid from: 2020
is activity of: Business Support Services

Industrial Equipment Rental
type: NamedIndividual
type: Activity
type: BusinessClassification
is contemporary version of: http://data.ga-group.nl/ics/trbc/5220304018
is version of: http://data.ga-group.nl/ics/trbc/5220304018
replaces: http://data.ga-group.nl/ics/trbc/2012/5220304018
imported on: 2023-04-07T16:52:39.364811Z
last refreshed on: 2026-06-05T07:16:11.699Z
source accessed on: 2017-12-31T07:04:19Z
source last accessed on: 2021-08-01T01:06:53Z
definition: Companies engaged in the rental of industrial equipment, such as machinery rental.
notation: 5220304018
valid from: 2020
is activity of: Business Support Services

Office Equipment & Supplies Rental
type: NamedIndividual
type: Activity
type: BusinessClassification
is contemporary version of: http://data.ga-group.nl/ics/trbc/5220304019
is version of: http://data.ga-group.nl/ics/trbc/5220304019
replaces: http://data.ga-group.nl/ics/trbc/2012/5220304019
imported on: 2023-04-07T16:52:39.364811Z
last refreshed on: 2026-06-05T07:16:11.699Z
source accessed on: 2017-12-31T07:04:19Z
source last accessed on: 2021-08-01T01:06:53Z
definition: Companies engaged in the rental of office equipment, such as computers and peripherals, fax machines, copiers, facsimiles, cash registers, bar code readers, electronic tags, coin and currency counting devices, as well as scientific, laboratory and analytical equipment and precision instruments.
notation: 5220304019
valid from: 2020
is activity of: Business Support Services

Pest Control Services
type: NamedIndividual
type: Activity
type: BusinessClassification
is contemporary version of: http://data.ga-group.nl/ics/trbc/5220304020
is version of: http://data.ga-group.nl/ics/trbc/5220304020
replaces: http://data.ga-group.nl/ics/trbc/2012/5220304020
imported on: 2023-04-07T16:52:39.364811Z
last refreshed on: 2026-06-05T07:16:11.699Z
source accessed on: 2017-12-31T07:04:19Z
source last accessed on: 2021-08-01T01:06:53Z
definition: Companies engaged in exterminating rodents, pests and insects, among others.
notation: 5220304020
valid from: 2020
is activity of: Business Support Services

Maintenance & Repair Services
type: NamedIndividual
type: Activity
type: BusinessClassification
is contemporary version of: http://data.ga-group.nl/ics/trbc/5220304021
is version of: http://data.ga-group.nl/ics/trbc/5220304021
replaces: http://data.ga-group.nl/ics/trbc/2012/5220304021
imported on: 2023-04-07T16:52:39.364811Z
last refreshed on: 2026-06-05T07:16:11.699Z
source accessed on: 2017-12-31T07:04:19Z
source last accessed on: 2021-08-01T01:06:53Z
definition: Companies engaged in the provision of maintenance and repair services to commercial equipment, such as computers, office machines, industrial machinery and electronic equipment, among others. Excludes automotive repair, classified in Personal Services Industry.
notation: 5220304021
valid from: 2020
is activity of: Business Support Services

Industrial Design Services
type: NamedIndividual
type: Activity
type: BusinessClassification
is contemporary version of: http://data.ga-group.nl/ics/trbc/5220304022
is version of: http://data.ga-group.nl/ics/trbc/5220304022
replaces: http://data.ga-group.nl/ics/trbc/2012/5220304022
imported on: 2023-04-07T16:52:39.364811Z
last refreshed on: 2026-06-05T07:16:11.699Z
source accessed on: 2017-12-31T07:04:19Z
source last accessed on: 2021-08-01T01:06:53Z
definition: Companies engaged in the provision of industrial design services, machinery and automobile design, office and commercial interior and furniture design services, graphic design and commercial art services, among others.
notation: 5220304022
valid from: 2020
is activity of: Business Support Services

Translation & Interpretation Services
type: NamedIndividual
type: Activity
type: BusinessClassification
is contemporary version of: http://data.ga-group.nl/ics/trbc/5220304023
is version of: http://data.ga-group.nl/ics/trbc/5220304023
replaces: http://data.ga-group.nl/ics/trbc/2012/5220304023
imported on: 2023-04-07T16:52:39.364811Z
last refreshed on: 2026-06-05T07:16:11.699Z
source accessed on: 2017-12-31T07:04:19Z
source last accessed on: 2021-08-01T01:06:53Z
definition: Companies engaged in the provision of language translation and interpretation services in speech and writing for all languages, including sign language.
notation: 5220304023
valid from: 2020
is activity of: Business Support Services

Testing Laboratories
type: NamedIndividual
type: Activity
type: BusinessClassification
is contemporary version of: http://data.ga-group.nl/ics/trbc/5220304024
is version of: http://data.ga-group.nl/ics/trbc/5220304024
replaces: http://data.ga-group.nl/ics/trbc/2012/5220304024
imported on: 2023-04-07T16:52:39.364811Z
last refreshed on: 2026-06-05T07:16:11.699Z
source accessed on: 2017-12-31T07:04:19Z
source last accessed on: 2021-08-01T01:06:53Z
definition: Companies engaged in the operation of industrial machinery and automobile testing laboratories, thermal testing, radiation and mechanical inspection services, among others.
notation: 5220304024
valid from: 2020
is activity of: Business Support Services

Call Center Services
type: NamedIndividual
type: Activity
type: BusinessClassification
is contemporary version of: http://data.ga-group.nl/ics/trbc/5220304025
is version of: http://data.ga-group.nl/ics/trbc/5220304025
replaces: http://data.ga-group.nl/ics/trbc/2012/5220304025
imported on: 2023-04-07T16:52:39.364811Z
last refreshed on: 2026-06-05T07:16:11.699Z
source accessed on: 2017-12-31T07:04:19Z
source last accessed on: 2021-08-01T01:06:53Z
definition: Companies engaged in the operation of call service centers, message and answering services.
notation: 5220304025
valid from: 2020
is activity of: Business Support Services

Exhibition & Conference Services
type: NamedIndividual
type: Activity
type: BusinessClassification
is contemporary version of: http://data.ga-group.nl/ics/trbc/5220304026
is version of: http://data.ga-group.nl/ics/trbc/5220304026
replaces: http://data.ga-group.nl/ics/trbc/2012/5220304026
imported on: 2023-04-07T16:52:39.364811Z
last refreshed on: 2026-06-05T07:16:11.699Z
source accessed on: 2017-12-31T07:04:19Z
source last accessed on: 2021-08-01T01:06:53Z
definition: Companies engaged in the organization of fairs, exhibitions, trade shows, conferences and conventions.
notation: 5220304026
valid from: 2020
is activity of: Business Support Services

Transaction & Payment Services
type: NamedIndividual
type: Activity
type: BusinessClassification
is contemporary version of: http://data.ga-group.nl/ics/trbc/5220304027
is version of: http://data.ga-group.nl/ics/trbc/5220304027
replaces: http://data.ga-group.nl/ics/trbc/2012/5220304027
imported on: 2023-04-07T16:52:39.364811Z
last refreshed on: 2026-06-05T07:16:11.699Z
source accessed on: 2017-12-31T07:04:19Z
source last accessed on: 2021-08-01T01:06:53Z
definition: Companies engaged in processing financial transactions and payment services.
notation: 5220304027
valid from: 2020
is activity of: Business Support Services

Business Support Services
type: NamedIndividual
type: BusinessClassification
type: Industry
is contemporary version of: http://data.ga-group.nl/ics/trbc/52203040
is version of: http://data.ga-group.nl/ics/trbc/52203040
replaces: http://data.ga-group.nl/ics/trbc/2012/52203040
imported on: 2023-04-07T16:52:39.364811Z
last refreshed on: 2026-06-05T07:16:11.699Z
source accessed on: 2017-12-31T07:04:19Z
source last accessed on: 2021-08-01T01:06:53Z
definition: Providers of commercial support services such as legal, cleaning, educational, accounting, security, office equipment rental, management consulting, basic data processing and other related services. Includes ATM operators that are not banks.
notation: 52203040
valid from: 2020
is industry of: Professional & Commercial Services

Business Support Supplies (NEC)
type: NamedIndividual
type: Activity
type: BusinessClassification
is contemporary version of: http://data.ga-group.nl/ics/trbc/5220306010
is version of: http://data.ga-group.nl/ics/trbc/5220306010
replaces: http://data.ga-group.nl/ics/trbc/2012/5220306010
imported on: 2023-04-07T16:52:39.364811Z
last refreshed on: 2026-06-05T07:16:11.699Z
source accessed on: 2017-12-31T07:04:19Z
source last accessed on: 2021-08-01T01:06:53Z
definition: Companies engaged in the manufacturing of office furniture and supplies such as desks, cabinets, display shelves, writing utensils, staplers and other commercial supplies. Excludes electronic office equipment, such as photocopiers and facsimile machines (classified under Office Equipment).
notation: 5220306010
valid from: 2020
is activity of: Business Support Supplies

Office Furniture
type: NamedIndividual
type: Activity
type: BusinessClassification
is contemporary version of: http://data.ga-group.nl/ics/trbc/5220306011
is version of: http://data.ga-group.nl/ics/trbc/5220306011
replaces: http://data.ga-group.nl/ics/trbc/2012/5220306011
imported on: 2023-04-07T16:52:39.364811Z
last refreshed on: 2026-06-05T07:16:11.699Z
source accessed on: 2017-12-31T07:04:19Z
source last accessed on: 2021-08-01T01:06:53Z
definition: Companies engaged in the production of office furniture, including cabinets, desks, chairs, bookcases, shelves, among others. Includes also producers of store and magazine furniture.
notation: 5220306011
valid from: 2020
is activity of: Business Support Supplies

Office Supplies
type: NamedIndividual
type: Activity
type: BusinessClassification
is contemporary version of: http://data.ga-group.nl/ics/trbc/5220306012
is version of: http://data.ga-group.nl/ics/trbc/5220306012
replaces: http://data.ga-group.nl/ics/trbc/2012/5220306012
imported on: 2023-04-07T16:52:39.364811Z
last refreshed on: 2026-06-05T07:16:11.699Z
source accessed on: 2017-12-31T07:04:19Z
source last accessed on: 2021-08-01T01:06:53Z
definition: Companies engaged in the production of writing utensils, staplers, carbon paper, markers, among others.
notation: 5220306012
valid from: 2020
is activity of: Business Support Supplies

Health, Safety & Fire Protection Equipment
type: NamedIndividual
type: Activity
type: BusinessClassification
is contemporary version of: http://data.ga-group.nl/ics/trbc/5220306013
is version of: http://data.ga-group.nl/ics/trbc/5220306013
replaces: http://data.ga-group.nl/ics/trbc/2012/5220306013
imported on: 2023-04-07T16:52:39.364811Z
last refreshed on: 2026-06-05T07:16:11.699Z
source accessed on: 2017-12-31T07:04:19Z
source last accessed on: 2021-08-01T01:06:53Z
definition: Companies engaged in the production of heath and safety equipment as well as fire protection equipment, such as helmets, life vests, safety signs, specific clothing and other personal protective equipment, fire extinguishers, fire alarms, smoke detection devices, among others.
notation: 5220306013
valid from: 2020
is activity of: Business Support Supplies

Office Supplies Wholesale
type: NamedIndividual
type: Activity
type: BusinessClassification
is contemporary version of: http://data.ga-group.nl/ics/trbc/5220306014
is version of: http://data.ga-group.nl/ics/trbc/5220306014
replaces: http://data.ga-group.nl/ics/trbc/2012/5220306014
imported on: 2023-04-07T16:52:39.364811Z
last refreshed on: 2026-06-05T07:16:11.699Z
source accessed on: 2017-12-31T07:04:19Z
source last accessed on: 2021-08-01T01:06:53Z
definition: Companies engaged in the wholesale of computers, computer peripherals, fax and copy machines, office furniture and other office equipment wholesale.
notation: 5220306014
valid from: 2020
is activity of: Business Support Supplies

Business Support Supplies
type: NamedIndividual
type: BusinessClassification
type: Industry
is contemporary version of: http://data.ga-group.nl/ics/trbc/52203060
is version of: http://data.ga-group.nl/ics/trbc/52203060
replaces: http://data.ga-group.nl/ics/trbc/2012/52203060
imported on: 2023-04-07T16:52:39.364811Z
last refreshed on: 2026-06-05T07:16:11.699Z
source accessed on: 2017-12-31T07:04:19Z
source last accessed on: 2021-08-01T01:06:53Z
definition: Manufacturers of office furniture and supplies such as desks, cabinets, display shelves, writing utensils, staplers and other commercial supplies.
notation: 52203060
valid from: 2020
is industry of: Professional & Commercial Services

Professional Information Services (NEC)
type: NamedIndividual
type: Activity
type: BusinessClassification
is contemporary version of: http://data.ga-group.nl/ics/trbc/5220307010
is version of: http://data.ga-group.nl/ics/trbc/5220307010
replaces: http://data.ga-group.nl/ics/trbc/2012/5220307010
imported on: 2023-04-07T16:52:39.364811Z
last refreshed on: 2026-06-05T07:16:11.699Z
source accessed on: 2017-12-31T07:04:19Z
source last accessed on: 2021-08-01T01:06:53Z
definition: Companies engaged in providing financial information, compliance & investor communication services, rating agencies, trade & business publishing, legal, tax, education information providers, journals, as well as news agencies.
notation: 5220307010
valid from: 2020
is activity of: Professional Information Services

Financial Information Providers
type: NamedIndividual
type: Activity
type: BusinessClassification
is contemporary version of: http://data.ga-group.nl/ics/trbc/5220307011
is version of: http://data.ga-group.nl/ics/trbc/5220307011
replaces: http://data.ga-group.nl/ics/trbc/2012/5220307011
imported on: 2023-04-07T16:52:39.364811Z
last refreshed on: 2026-06-05T07:16:11.699Z
source accessed on: 2017-12-31T07:04:19Z
source last accessed on: 2021-08-01T01:06:53Z
definition: Companies engaged in providing financial information.
notation: 5220307011
valid from: 2020
is activity of: Professional Information Services

Compliance & Investor Communication
type: NamedIndividual
type: Activity
type: BusinessClassification
is contemporary version of: http://data.ga-group.nl/ics/trbc/5220307012
is version of: http://data.ga-group.nl/ics/trbc/5220307012
replaces: http://data.ga-group.nl/ics/trbc/2012/5220307012
imported on: 2023-04-07T16:52:39.364811Z
last refreshed on: 2026-06-05T07:16:11.699Z
source accessed on: 2017-12-31T07:04:19Z
source last accessed on: 2021-08-01T01:06:53Z
definition: Companies that provide services to corporate boards, investor relations and competitive intelligence and risk & compliance professionals. Services include regulatory disclosure systems, board communications, investor communication and other shareholder services.
notation: 5220307012
valid from: 2020
is activity of: Professional Information Services

Rating Agencies
type: NamedIndividual
type: Activity
type: BusinessClassification
is contemporary version of: http://data.ga-group.nl/ics/trbc/5220307013
is version of: http://data.ga-group.nl/ics/trbc/5220307013
replaces: http://data.ga-group.nl/ics/trbc/2012/5220307013
imported on: 2023-04-07T16:52:39.364811Z
last refreshed on: 2026-06-05T07:16:11.699Z
source accessed on: 2017-12-31T07:04:19Z
source last accessed on: 2021-08-01T01:06:53Z
definition: Companies engaged in providing rating/evaluation services to Companies and countries in order to give investors insight into the level of risk associated with investing in a particular company/country.
notation: 5220307013
valid from: 2020
is activity of: Professional Information Services

Trade & Business Publishing
type: NamedIndividual
type: Activity
type: BusinessClassification
is contemporary version of: http://data.ga-group.nl/ics/trbc/5220307014
is version of: http://data.ga-group.nl/ics/trbc/5220307014
replaces: http://data.ga-group.nl/ics/trbc/2012/5220307014
imported on: 2023-04-07T16:52:39.364811Z
last refreshed on: 2026-06-05T07:16:11.699Z
source accessed on: 2017-12-31T07:04:19Z
source last accessed on: 2021-08-01T01:06:53Z
definition: Traditional and online publishers of trade and business content. Includes publishers of trade and business newspapers, periodicals and magazines.
notation: 5220307014
valid from: 2020
is activity of: Professional Information Services

Legal & Tax Information Providers
type: NamedIndividual
type: Activity
type: BusinessClassification
is contemporary version of: http://data.ga-group.nl/ics/trbc/5220307015
is version of: http://data.ga-group.nl/ics/trbc/5220307015
replaces: http://data.ga-group.nl/ics/trbc/2012/5220307015
imported on: 2023-04-07T16:52:39.364811Z
last refreshed on: 2026-06-05T07:16:11.699Z
source accessed on: 2017-12-31T07:04:19Z
source last accessed on: 2021-08-01T01:06:53Z
definition: Companies engaged in the provision of legal and tax information and consultancy.
notation: 5220307015
valid from: 2020
is activity of: Professional Information Services

Education & Training Information Providers
type: NamedIndividual
type: Activity
type: BusinessClassification
is contemporary version of: http://data.ga-group.nl/ics/trbc/5220307016
is version of: http://data.ga-group.nl/ics/trbc/5220307016
replaces: http://data.ga-group.nl/ics/trbc/2012/5220307016
imported on: 2023-04-07T16:52:39.364811Z
last refreshed on: 2026-06-05T07:16:11.699Z
source accessed on: 2017-12-31T07:04:19Z
source last accessed on: 2021-08-01T01:06:53Z
definition: Companies engaged in the provision of education and training information, such as online education portals and search machines, training selection portals, among others.
notation: 5220307016
valid from: 2020
is activity of: Professional Information Services

Journals & Scholarly Research
type: NamedIndividual
type: Activity
type: BusinessClassification
is contemporary version of: http://data.ga-group.nl/ics/trbc/5220307017
is version of: http://data.ga-group.nl/ics/trbc/5220307017
replaces: http://data.ga-group.nl/ics/trbc/2012/5220307017
imported on: 2023-04-07T16:52:39.364811Z
last refreshed on: 2026-06-05T07:16:11.699Z
source accessed on: 2017-12-31T07:04:19Z
source last accessed on: 2021-08-01T01:06:53Z
definition: Companies engaged in the provision of technical, medical and scientific journals and scholarly research publishers.
notation: 5220307017
valid from: 2020
is activity of: Professional Information Services

News Agencies
type: NamedIndividual
type: Activity
type: BusinessClassification
is contemporary version of: http://data.ga-group.nl/ics/trbc/5220307018
is version of: http://data.ga-group.nl/ics/trbc/5220307018
replaces: http://data.ga-group.nl/ics/trbc/2012/5220307018
imported on: 2023-04-07T16:52:39.364811Z
last refreshed on: 2026-06-05T07:16:11.699Z
source accessed on: 2017-12-31T07:04:19Z
source last accessed on: 2021-08-01T01:06:53Z
definition: Companies engaged in the provision of news to such media as television, radio, newspapers, magazines and online publishers.
notation: 5220307018
valid from: 2020
is activity of: Professional Information Services

Libraries & Archives
type: NamedIndividual
type: Activity
type: BusinessClassification
is contemporary version of: http://data.ga-group.nl/ics/trbc/5220307019
is version of: http://data.ga-group.nl/ics/trbc/5220307019
imported on: 2023-04-07T17:17:07.492231Z
last refreshed on: 2026-06-05T07:16:11.699Z
source accessed on: 2021-04-25T05:48:36Z
source last accessed on: 2021-08-01T01:06:53Z
definition: Companies engaged in the provision of access to collections of media.
notation: 5220307019
valid from: 2020
is activity of: Professional Information Services

Professional Information Services
type: NamedIndividual
type: BusinessClassification
type: Industry
is contemporary version of: http://data.ga-group.nl/ics/trbc/52203070
is version of: http://data.ga-group.nl/ics/trbc/52203070
replaces: http://data.ga-group.nl/ics/trbc/2012/52203070
imported on: 2023-04-07T16:52:39.364811Z
last refreshed on: 2026-06-05T07:16:11.699Z
source accessed on: 2017-12-31T07:04:19Z
source last accessed on: 2021-08-01T01:06:53Z
definition: Providers of financial information, investor communication/compliance services, rating agencies, trade & business publishing, legal, tax, education information providers, journals, as well as news agencies.
notation: 52203070
valid from: 2020
is industry of: Professional & Commercial Services

Professional & Commercial Services
type: NamedIndividual
type: BusinessClassification
type: IndustryGroup
is contemporary version of: http://data.ga-group.nl/ics/trbc/522030
is version of: http://data.ga-group.nl/ics/trbc/522030
replaces: http://data.ga-group.nl/ics/trbc/2012/522030
imported on: 2023-04-07T16:52:39.364811Z
last refreshed on: 2026-06-05T07:16:11.699Z
source accessed on: 2017-12-31T07:04:19Z
source last accessed on: 2021-08-01T01:06:53Z
definition: Providers of environmental, employment, business support, professional information, and commercial printing services and supplies.
notation: 522030
valid from: 2020
is industry group of: Industrial & Commercial Services

Industrial & Commercial Services
type: NamedIndividual
type: BusinessClassification
type: BusinessSector
is contemporary version of: http://data.ga-group.nl/ics/trbc/5220
is version of: http://data.ga-group.nl/ics/trbc/5220
replaces: http://data.ga-group.nl/ics/trbc/2012/5220
imported on: 2023-04-07T16:52:39.364811Z
last refreshed on: 2026-06-05T07:16:11.699Z
source accessed on: 2017-12-31T07:04:19Z
source last accessed on: 2021-08-01T01:06:53Z
definition: Providers of construction, engineering, commercial supply services, professional information services, as well as diversified trading and distribution operations.
notation: 5220
valid from: 2020
is business sector of: Industrials

Courier, Postal, Air Freight & Land-based Logistics (NEC)
type: NamedIndividual
type: Activity
type: BusinessClassification
is contemporary version of: http://data.ga-group.nl/ics/trbc/5240501010
is version of: http://data.ga-group.nl/ics/trbc/5240501010
replaces: http://data.ga-group.nl/ics/trbc/2012/5240501010
imported on: 2023-04-07T16:52:39.364811Z
last refreshed on: 2026-06-05T07:16:11.699Z
source accessed on: 2017-12-31T07:04:19Z
source last accessed on: 2021-08-01T01:06:53Z
definition: Companies engaged in the carriage of air cargo and mail, provision of courier and postal services, packaging and logistic air freight services, postal delivery services on a contract basis, as well as land based courier services. Excludes: (marine freight transportation, classified in Marine Freight & Logistics), (freight storage facilities, unless specified as air freight, classified in Ground Freight & Logistics).
notation: 5240501010
valid from: 2020
is activity of: Courier, Postal, Air Freight & Land-based Logistics

Freight Logistics
type: NamedIndividual
type: Activity
type: BusinessClassification
is contemporary version of: http://data.ga-group.nl/ics/trbc/5240501011
is version of: http://data.ga-group.nl/ics/trbc/5240501011
replaces: http://data.ga-group.nl/ics/trbc/2012/5240501011
imported on: 2023-04-07T16:52:39.364811Z
last refreshed on: 2026-06-05T07:16:11.699Z
source accessed on: 2017-12-31T07:04:19Z
source last accessed on: 2021-08-01T01:06:53Z
definition: Companies engaged in the freight/cargo transportation management process, supply chain planning and supervision, inventory, warehousing, packing and other activities management, arranged in order to optimize the process of transporting goods from the place of origin to the final destination. Excludes operators of multimodal transportation, such as air, marine and road/rails transportation combined whenever none type is dominant, classified in Integrated Logistics Operators; freight logistics concentrated on marine cargo only, classified in Marine Freight Logistics.
notation: 5240501011
valid from: 2020
is activity of: Courier, Postal, Air Freight & Land-based Logistics

Air Freight
type: NamedIndividual
type: Activity
type: BusinessClassification
is contemporary version of: http://data.ga-group.nl/ics/trbc/5240501012
is version of: http://data.ga-group.nl/ics/trbc/5240501012
replaces: http://data.ga-group.nl/ics/trbc/2012/5240501012
imported on: 2023-04-07T16:52:39.364811Z
last refreshed on: 2026-06-05T07:16:11.699Z
source accessed on: 2017-12-31T07:04:19Z
source last accessed on: 2021-08-01T01:06:53Z
definition: Companies engaged in the provision of scheduled and chartered air freight services.
notation: 5240501012
valid from: 2020
is activity of: Courier, Postal, Air Freight & Land-based Logistics

Courier Services
type: NamedIndividual
type: Activity
type: BusinessClassification
is contemporary version of: http://data.ga-group.nl/ics/trbc/5240501013
is version of: http://data.ga-group.nl/ics/trbc/5240501013
replaces: http://data.ga-group.nl/ics/trbc/2012/5240501013
imported on: 2023-04-07T16:52:39.364811Z
last refreshed on: 2026-06-05T07:16:11.699Z
source accessed on: 2017-12-31T07:04:19Z
source last accessed on: 2021-08-01T01:06:53Z
definition: Companies engaged in the provision of postal and other courier services, such as local goods and parcel delivery services.
notation: 5240501013
valid from: 2020
is activity of: Courier, Postal, Air Freight & Land-based Logistics

Integrated Logistics Operators
type: NamedIndividual
type: Activity
type: BusinessClassification
is contemporary version of: http://data.ga-group.nl/ics/trbc/5240501014
is version of: http://data.ga-group.nl/ics/trbc/5240501014
replaces: http://data.ga-group.nl/ics/trbc/2012/5240501014
imported on: 2023-04-07T16:52:39.364811Z
last refreshed on: 2026-06-05T07:16:11.699Z
source accessed on: 2017-12-31T07:04:19Z
source last accessed on: 2021-08-01T01:06:53Z
definition: operators of multimodal transportation, such as air, marine and road/rails transportation combined whenever none type is dominant.
notation: 5240501014
valid from: 2020
is activity of: Courier, Postal, Air Freight & Land-based Logistics

Courier, Postal, Air Freight & Land-based Logistics
type: NamedIndividual
type: BusinessClassification
type: Industry
is contemporary version of: http://data.ga-group.nl/ics/trbc/52405010
is version of: http://data.ga-group.nl/ics/trbc/52405010
replaces: http://data.ga-group.nl/ics/trbc/2012/52405010
imported on: 2023-04-07T16:52:39.364811Z
last refreshed on: 2026-06-05T07:16:11.699Z
source accessed on: 2017-12-31T07:04:19Z
source last accessed on: 2021-08-01T01:06:53Z
definition: Air cargo and mail carriers, packaging and logistic air freight services, courier and postal delivery services, as well as land-based logistics and courier services.
notation: 52405010
valid from: 2020
is industry of: Freight & Logistics Services

Marine Freight & Logistics (NEC)
type: NamedIndividual
type: Activity
type: BusinessClassification
is contemporary version of: http://data.ga-group.nl/ics/trbc/5240502010
is version of: http://data.ga-group.nl/ics/trbc/5240502010
replaces: http://data.ga-group.nl/ics/trbc/2012/5240502010
imported on: 2023-04-07T16:52:39.364811Z
last refreshed on: 2026-06-05T07:16:11.699Z
source accessed on: 2017-12-31T07:04:19Z
source last accessed on: 2021-08-01T01:06:53Z
definition: Companies engaged in marine and inland water transportation services for freight and passengers. Includes deep sea freight and cargo, barge, inland water, vessel chartering and other freight transportation operations. Excludes: (passenger cruise lines, classified in Hotels, Motels & Cruise Lines), (short distance commuter ferry transportation, classified in Passenger Transportation, Ground & Sea), (recreational charter and sightseeing boat services, classified in Leisure & Recreation).
notation: 5240502010
valid from: 2020
is activity of: Marine Freight & Logistics

Marine Logistics
type: NamedIndividual
type: Activity
type: BusinessClassification
is contemporary version of: http://data.ga-group.nl/ics/trbc/5240502011
is version of: http://data.ga-group.nl/ics/trbc/5240502011
replaces: http://data.ga-group.nl/ics/trbc/2012/5240502011
imported on: 2023-04-07T16:52:39.364811Z
last refreshed on: 2026-06-05T07:16:11.699Z
source accessed on: 2017-12-31T07:04:19Z
source last accessed on: 2021-08-01T01:06:53Z
definition: Companies engaged in the provision of marine logistics solutions, such as marine transportation management process, supply chain planning and supervision, inventory, warehousing, packing and other activities arranged in order to optimize the process of transporting goods by sea from the place of origin to the final destination.
notation: 5240502011
valid from: 2020
is activity of: Marine Freight & Logistics

Inland Water Freight
type: NamedIndividual
type: Activity
type: BusinessClassification
is contemporary version of: http://data.ga-group.nl/ics/trbc/5240502012
is version of: http://data.ga-group.nl/ics/trbc/5240502012
replaces: http://data.ga-group.nl/ics/trbc/2012/5240502012
imported on: 2023-04-07T16:52:39.364811Z
last refreshed on: 2026-06-05T07:16:11.699Z
source accessed on: 2017-12-31T07:04:19Z
source last accessed on: 2021-08-01T01:06:53Z
definition: Companies engaged in the provision of Inland Water Freight services, such as river, canal and lake freight transportation services.
notation: 5240502012
valid from: 2020
is activity of: Marine Freight & Logistics

Deep Sea Freight
type: NamedIndividual
type: Activity
type: BusinessClassification
is contemporary version of: http://data.ga-group.nl/ics/trbc/5240502013
is version of: http://data.ga-group.nl/ics/trbc/5240502013
replaces: http://data.ga-group.nl/ics/trbc/2012/5240502013
imported on: 2023-04-07T16:52:39.364811Z
last refreshed on: 2026-06-05T07:16:11.699Z
source accessed on: 2017-12-31T07:04:19Z
source last accessed on: 2021-08-01T01:06:53Z
definition: Companies engaged in the provision of deep sea freight transportation services to or from foreign destinations.
notation: 5240502013
valid from: 2020
is activity of: Marine Freight & Logistics

Marine Freight & Logistics
type: NamedIndividual
type: BusinessClassification
type: Industry
is contemporary version of: http://data.ga-group.nl/ics/trbc/52405020
is version of: http://data.ga-group.nl/ics/trbc/52405020
replaces: http://data.ga-group.nl/ics/trbc/2012/52405020
imported on: 2023-04-07T16:52:39.364811Z
last refreshed on: 2026-06-05T07:16:11.699Z
source accessed on: 2017-12-31T07:04:19Z
source last accessed on: 2021-08-01T01:06:53Z
definition: Operators of marine and inland water transportation services for freight. Includes deep-sea freight and cargo, barge, inland water, vessel chartering and other freight transportation operations.
notation: 52405020
valid from: 2020
is industry of: Freight & Logistics Services

Ground Freight & Logistics (NEC)
type: NamedIndividual
type: Activity
type: BusinessClassification
is contemporary version of: http://data.ga-group.nl/ics/trbc/5240503010
is version of: http://data.ga-group.nl/ics/trbc/5240503010
replaces: http://data.ga-group.nl/ics/trbc/2012/5240503010
imported on: 2023-04-07T16:52:39.364811Z
last refreshed on: 2026-06-05T07:16:11.699Z
source accessed on: 2017-12-31T07:04:19Z
source last accessed on: 2021-08-01T01:06:53Z
definition: Companies engaged in railroad and freight trucking transportation services. Includes also the short term rental of trucks and trailers as well as freight warehousing and crating services.
notation: 5240503010
valid from: 2020
is activity of: Ground Freight & Logistics

Railway Freight Operators
type: NamedIndividual
type: Activity
type: BusinessClassification
is contemporary version of: http://data.ga-group.nl/ics/trbc/5240503011
is version of: http://data.ga-group.nl/ics/trbc/5240503011
replaces: http://data.ga-group.nl/ics/trbc/2012/5240503011
imported on: 2023-04-07T16:52:39.364811Z
last refreshed on: 2026-06-05T07:16:11.699Z
source accessed on: 2017-12-31T07:04:19Z
source last accessed on: 2021-08-01T01:06:53Z
definition: Companies engaged in railway freight transportation.
notation: 5240503011
valid from: 2020
is activity of: Ground Freight & Logistics

Freight Trucking
type: NamedIndividual
type: Activity
type: BusinessClassification
is contemporary version of: http://data.ga-group.nl/ics/trbc/5240503012
is version of: http://data.ga-group.nl/ics/trbc/5240503012
replaces: http://data.ga-group.nl/ics/trbc/2012/5240503012
imported on: 2023-04-07T16:52:39.364811Z
last refreshed on: 2026-06-05T07:16:11.699Z
source accessed on: 2017-12-31T07:04:19Z
source last accessed on: 2021-08-01T01:06:53Z
definition: Companies engaged in truck and heavy truck transportation of freight.
notation: 5240503012
valid from: 2020
is activity of: Ground Freight & Logistics

Warehousing
type: NamedIndividual
type: Activity
type: BusinessClassification
is contemporary version of: http://data.ga-group.nl/ics/trbc/5240503013
is version of: http://data.ga-group.nl/ics/trbc/5240503013
replaces: http://data.ga-group.nl/ics/trbc/2012/5240503013
imported on: 2023-04-07T16:52:39.364811Z
last refreshed on: 2026-06-05T07:16:11.699Z
source accessed on: 2017-12-31T07:04:19Z
source last accessed on: 2021-08-01T01:06:53Z
definition: Companies engaged in the general warehousing and storage services.
notation: 5240503013
valid from: 2020
is activity of: Ground Freight & Logistics

Truck Rental
type: NamedIndividual
type: Activity
type: BusinessClassification
is contemporary version of: http://data.ga-group.nl/ics/trbc/5240503014
is version of: http://data.ga-group.nl/ics/trbc/5240503014
replaces: http://data.ga-group.nl/ics/trbc/2012/5240503014
imported on: 2023-04-07T16:52:39.364811Z
last refreshed on: 2026-06-05T07:16:11.699Z
source accessed on: 2017-12-31T07:04:19Z
source last accessed on: 2021-08-01T01:06:53Z
definition: Companies engaged in the rental of trucks for commercial use.
notation: 5240503014
valid from: 2020
is activity of: Ground Freight & Logistics

Ground Freight & Logistics
type: NamedIndividual
type: BusinessClassification
type: Industry
is contemporary version of: http://data.ga-group.nl/ics/trbc/52405030
is version of: http://data.ga-group.nl/ics/trbc/52405030
replaces: http://data.ga-group.nl/ics/trbc/2012/52405030
imported on: 2023-04-07T16:52:39.364811Z
last refreshed on: 2026-06-05T07:16:11.699Z
source accessed on: 2017-12-31T07:04:19Z
source last accessed on: 2021-08-01T01:06:53Z
definition: Providers of railroad and trucking freight transportation services. Includes operators of short-term truck and trailer rental, as well as freight warehousing and crating.
notation: 52405030
valid from: 2020
is industry of: Freight & Logistics Services

Freight & Logistics Services
type: NamedIndividual
type: BusinessClassification
type: IndustryGroup
is contemporary version of: http://data.ga-group.nl/ics/trbc/524050
is version of: http://data.ga-group.nl/ics/trbc/524050
replaces: http://data.ga-group.nl/ics/trbc/2012/524050
imported on: 2023-04-07T16:52:39.364811Z
last refreshed on: 2026-06-05T07:16:11.699Z
source accessed on: 2017-12-31T07:04:19Z
source last accessed on: 2021-08-01T01:06:53Z
definition: Providers of freight and logistics services by all means, such as air, marine and ground.
notation: 524050
valid from: 2020
is industry group of: Transportation

Airlines (NEC)
type: NamedIndividual
type: Activity
type: BusinessClassification
is contemporary version of: http://data.ga-group.nl/ics/trbc/5240601010
is version of: http://data.ga-group.nl/ics/trbc/5240601010
replaces: http://data.ga-group.nl/ics/trbc/2012/5240601010
imported on: 2023-04-07T16:52:39.364811Z
last refreshed on: 2026-06-05T07:16:11.699Z
source accessed on: 2017-12-31T07:04:19Z
source last accessed on: 2021-08-01T01:06:53Z
definition: Companies engaged in the operation of airline transportation primarily for consumer and business passengers. Excludes: (airline operators primarily for cargo transportation, classified in Air Freight & Logistics), (fueling, maintenance, airline catering and airport landing services, classified in Airport Services).
notation: 5240601010
valid from: 2020
is activity of: Airlines

Regional Airlines
type: NamedIndividual
type: Activity
type: BusinessClassification
is contemporary version of: http://data.ga-group.nl/ics/trbc/5240601011
is version of: http://data.ga-group.nl/ics/trbc/5240601011
replaces: http://data.ga-group.nl/ics/trbc/2012/5240601011
imported on: 2023-04-07T16:52:39.364811Z
last refreshed on: 2026-06-05T07:16:11.699Z
source accessed on: 2017-12-31T07:04:19Z
source last accessed on: 2021-08-01T01:06:53Z
definition: Companies engaged in the operation of regional airlines. Regional airlines are typically short-distance airlines, operators of short-haul flights (under 3 hours), usually having a fleet of small aircraft, and can be trans-border, but the key is the distance covered, aircraft size and flight duration. These are either subsidiaries of larger airlines or independent small operators. Excludes operators of long-distance flights, long-haul (over 3 hours) flights and operators of large aircraft, classified in Airlines (NEC).
notation: 5240601011
valid from: 2020
is activity of: Airlines

Charter & Private Air Services
type: NamedIndividual
type: Activity
type: BusinessClassification
is contemporary version of: http://data.ga-group.nl/ics/trbc/5240601012
is version of: http://data.ga-group.nl/ics/trbc/5240601012
replaces: http://data.ga-group.nl/ics/trbc/2012/5240601012
imported on: 2023-04-07T16:52:39.364811Z
last refreshed on: 2026-06-05T07:16:11.699Z
source accessed on: 2017-12-31T07:04:19Z
source last accessed on: 2021-08-01T01:06:53Z
definition: Companies engaged in the operation of charter and private flights as well as aviation clubs.
notation: 5240601012
valid from: 2020
is activity of: Airlines

Specialized Aviation Services
type: NamedIndividual
type: Activity
type: BusinessClassification
is contemporary version of: http://data.ga-group.nl/ics/trbc/5240601013
is version of: http://data.ga-group.nl/ics/trbc/5240601013
replaces: http://data.ga-group.nl/ics/trbc/2012/5240601013
imported on: 2023-04-07T16:52:39.364811Z
last refreshed on: 2026-06-05T07:16:11.699Z
source accessed on: 2017-12-31T07:04:19Z
source last accessed on: 2021-08-01T01:06:53Z
definition: Companies engaged in the operation of Specialized Aviation Services, such as helicopter rescue/medical/ crew transportation services.
notation: 5240601013
valid from: 2020
is activity of: Airlines

Inter-Modal Passenger Transportation
type: NamedIndividual
type: Activity
type: BusinessClassification
is contemporary version of: http://data.ga-group.nl/ics/trbc/5240601014
is version of: http://data.ga-group.nl/ics/trbc/5240601014
replaces: http://data.ga-group.nl/ics/trbc/2012/5240601014
imported on: 2023-04-07T16:52:39.364811Z
last refreshed on: 2026-06-05T07:16:11.699Z
source accessed on: 2017-12-31T07:04:19Z
source last accessed on: 2021-08-01T01:06:53Z
definition: Companies engaged in transporting passengers via multiple modes, such as train, bus, tram, subway and others, whenever a company operates at least two modes and none is dominant.
notation: 5240601014
valid from: 2020
is activity of: Airlines

Airlines
type: NamedIndividual
type: BusinessClassification
type: Industry
is contemporary version of: http://data.ga-group.nl/ics/trbc/52406010
is version of: http://data.ga-group.nl/ics/trbc/52406010
replaces: http://data.ga-group.nl/ics/trbc/2012/52406010
imported on: 2023-04-07T16:52:39.364811Z
last refreshed on: 2026-06-05T07:16:11.699Z
source accessed on: 2017-12-31T07:04:19Z
source last accessed on: 2021-08-01T01:06:53Z
definition: Providers of airline transportation services for consumer and business passengers.
notation: 52406010
valid from: 2020
is industry of: Passenger Transportation Services

Passenger Transportation, Ground & Sea (NEC)
type: NamedIndividual
type: Activity
type: BusinessClassification
is contemporary version of: http://data.ga-group.nl/ics/trbc/5240602010
is version of: http://data.ga-group.nl/ics/trbc/5240602010
replaces: http://data.ga-group.nl/ics/trbc/2012/5240602010
imported on: 2023-04-07T16:52:39.364811Z
last refreshed on: 2026-06-05T07:16:11.699Z
source accessed on: 2017-12-31T07:04:19Z
source last accessed on: 2021-08-01T01:06:53Z
definition: Companies engaged in urban transit, bus, subway and rail transit, taxi and school bus service, short term car rental, as well as marine passenger transportation services. Excludes: (long-term lease of passenger cars, classified in Consumer Lending), (transportation services where freight is the dominant operation, classified in Ground Freight & Logistics).
notation: 5240602010
valid from: 2020
is activity of: Passenger Transportation, Ground & Sea

Commuting Services
type: NamedIndividual
type: Activity
type: BusinessClassification
is contemporary version of: http://data.ga-group.nl/ics/trbc/5240602011
is version of: http://data.ga-group.nl/ics/trbc/5240602011
replaces: http://data.ga-group.nl/ics/trbc/2012/5240602011
imported on: 2023-04-07T16:52:39.364811Z
last refreshed on: 2026-06-05T07:16:11.699Z
source accessed on: 2017-12-31T07:04:19Z
source last accessed on: 2021-08-01T01:06:53Z
definition: Companies engaged in the provision of urban and suburban commuter services, such as rail, bus, subway, tramway, trolley, mixed mode and other urban and suburban transit systems. Excludes commuter ferry services, classified in Commuter Ferry.
notation: 5240602011
valid from: 2020
is activity of: Passenger Transportation, Ground & Sea

Charter Bus Services
type: NamedIndividual
type: Activity
type: BusinessClassification
is contemporary version of: http://data.ga-group.nl/ics/trbc/5240602012
is version of: http://data.ga-group.nl/ics/trbc/5240602012
replaces: http://data.ga-group.nl/ics/trbc/2012/5240602012
imported on: 2023-04-07T16:52:39.364811Z
last refreshed on: 2026-06-05T07:16:11.699Z
source accessed on: 2017-12-31T07:04:19Z
source last accessed on: 2021-08-01T01:06:53Z
definition: Companies engaged in the provision of bus charter services, except sightseeing tours.
notation: 5240602012
valid from: 2020
is activity of: Passenger Transportation, Ground & Sea

Rail Services
type: NamedIndividual
type: Activity
type: BusinessClassification
is contemporary version of: http://data.ga-group.nl/ics/trbc/5240602013
is version of: http://data.ga-group.nl/ics/trbc/5240602013
replaces: http://data.ga-group.nl/ics/trbc/2012/5240602013
imported on: 2023-04-07T16:52:39.364811Z
last refreshed on: 2026-06-05T07:16:11.699Z
source accessed on: 2017-12-31T07:04:19Z
source last accessed on: 2021-08-01T01:06:53Z
definition: Companies engaged in the provision of short- and long-distance passenger rail transportation services, except railway commuter services, classified in Commuting Services.
notation: 5240602013
valid from: 2020
is activity of: Passenger Transportation, Ground & Sea

Marine Passenger Transportation
type: NamedIndividual
type: Activity
type: BusinessClassification
is contemporary version of: http://data.ga-group.nl/ics/trbc/5240602014
is version of: http://data.ga-group.nl/ics/trbc/5240602014
replaces: http://data.ga-group.nl/ics/trbc/2012/5240602014
imported on: 2023-04-07T16:52:39.364811Z
last refreshed on: 2026-06-05T07:16:11.699Z
source accessed on: 2017-12-31T07:04:19Z
source last accessed on: 2021-08-01T01:06:53Z
definition: Companies engaged in the provision of passenger marine transportation. Includes ferry transportation via sea. Excludes: fresh water (lakes, rivers) ferry transportation, classified in Commuter Ferry Operators.
notation: 5240602014
valid from: 2020
is activity of: Passenger Transportation, Ground & Sea

Commuter Ferry Operators
type: NamedIndividual
type: Activity
type: BusinessClassification
is contemporary version of: http://data.ga-group.nl/ics/trbc/5240602015
is version of: http://data.ga-group.nl/ics/trbc/5240602015
replaces: http://data.ga-group.nl/ics/trbc/2012/5240602015
imported on: 2023-04-07T16:52:39.364811Z
last refreshed on: 2026-06-05T07:16:11.699Z
source accessed on: 2017-12-31T07:04:19Z
source last accessed on: 2021-08-01T01:06:53Z
definition: Companies engaged in operation of commuter ferries on fresh waters, such as rivers and lakes. Excludes marine ferries, classified in Marine Passenger Transportation, and cruise ferries, classified in Hotels, Motels & Cruise Lines.
notation: 5240602015
valid from: 2020
is activity of: Passenger Transportation, Ground & Sea

Taxis & Limousines
type: NamedIndividual
type: Activity
type: BusinessClassification
is contemporary version of: http://data.ga-group.nl/ics/trbc/5240602016
is version of: http://data.ga-group.nl/ics/trbc/5240602016
replaces: http://data.ga-group.nl/ics/trbc/2012/5240602016
imported on: 2023-04-07T16:52:39.364811Z
last refreshed on: 2026-06-05T07:16:11.699Z
source accessed on: 2017-12-31T07:04:19Z
source last accessed on: 2021-08-01T01:06:53Z
definition: Companies engaged in the provision of taxi and limousine passenger transportation.
notation: 5240602016
valid from: 2020
is activity of: Passenger Transportation, Ground & Sea

Passenger Car Rental
type: NamedIndividual
type: Activity
type: BusinessClassification
is contemporary version of: http://data.ga-group.nl/ics/trbc/5240602017
is version of: http://data.ga-group.nl/ics/trbc/5240602017
replaces: http://data.ga-group.nl/ics/trbc/2012/5240602017
imported on: 2023-04-07T16:52:39.364811Z
last refreshed on: 2026-06-05T07:16:11.699Z
source accessed on: 2017-12-31T07:04:19Z
source last accessed on: 2021-08-01T01:06:53Z
definition: Companies engaged in the provision of passenger car rental services.
notation: 5240602017
valid from: 2020
is activity of: Passenger Transportation, Ground & Sea

Passenger Transportation, Ground & Sea
type: NamedIndividual
type: BusinessClassification
type: Industry
is contemporary version of: http://data.ga-group.nl/ics/trbc/52406020
is version of: http://data.ga-group.nl/ics/trbc/52406020
replaces: http://data.ga-group.nl/ics/trbc/2012/52406020
imported on: 2023-04-07T16:52:39.364811Z
last refreshed on: 2026-06-05T07:16:11.699Z
source accessed on: 2017-12-31T07:04:19Z
source last accessed on: 2021-08-01T01:06:53Z
definition: Providers of transportation services including urban transit, bus, subway and rail operators, taxi, school bus and short-term car rental services, as well as marine passenger transportation services.
notation: 52406020
valid from: 2020
is industry of: Passenger Transportation Services

Passenger Transportation Services
type: NamedIndividual
type: BusinessClassification
type: IndustryGroup
is contemporary version of: http://data.ga-group.nl/ics/trbc/524060
is version of: http://data.ga-group.nl/ics/trbc/524060
replaces: http://data.ga-group.nl/ics/trbc/2012/524060
imported on: 2023-04-07T16:52:39.364811Z
last refreshed on: 2026-06-05T07:16:11.699Z
source accessed on: 2017-12-31T07:04:19Z
source last accessed on: 2021-08-01T01:06:53Z
definition: Providers of transportation services to passengers via air, ground and sea.
notation: 524060
valid from: 2020
is industry group of: Transportation

Airport Operators & Services (NEC)
type: NamedIndividual
type: Activity
type: BusinessClassification
is contemporary version of: http://data.ga-group.nl/ics/trbc/5240701010
is version of: http://data.ga-group.nl/ics/trbc/5240701010
replaces: http://data.ga-group.nl/ics/trbc/2012/5240701010
imported on: 2023-04-07T16:52:39.364811Z
last refreshed on: 2026-06-05T07:16:11.699Z
source accessed on: 2017-12-31T07:04:19Z
source last accessed on: 2021-08-01T01:06:53Z
definition: Companies engaged in the operation of fueling, repair, inspection, runway maintenance, hangar rental, passenger parking fields, landing services, catering, duty-free shops and other airport services.
notation: 5240701010
valid from: 2020
is activity of: Airport Operators & Services

Airport Operators
type: NamedIndividual
type: Activity
type: BusinessClassification
is contemporary version of: http://data.ga-group.nl/ics/trbc/5240701011
is version of: http://data.ga-group.nl/ics/trbc/5240701011
replaces: http://data.ga-group.nl/ics/trbc/2012/5240701011
imported on: 2023-04-07T16:52:39.364811Z
last refreshed on: 2026-06-05T07:16:11.699Z
source accessed on: 2017-12-31T07:04:19Z
source last accessed on: 2021-08-01T01:06:53Z
definition: Companies engaged in the operation of airports, including such services as fueling, repair, inspection, runway maintenance, hangar rental, passenger parking fields, landing services, baggage handling, air traffic control, among others.
notation: 5240701011
valid from: 2020
is activity of: Airport Operators & Services

Duty Free Shops
type: NamedIndividual
type: Activity
type: BusinessClassification
is contemporary version of: http://data.ga-group.nl/ics/trbc/5240701012
is version of: http://data.ga-group.nl/ics/trbc/5240701012
replaces: http://data.ga-group.nl/ics/trbc/2012/5240701012
imported on: 2023-04-07T16:52:39.364811Z
last refreshed on: 2026-06-05T07:16:11.699Z
source accessed on: 2017-12-31T07:04:19Z
source last accessed on: 2021-08-01T01:06:53Z
definition: Companies engaged in the operation of duty free shops located at the airport, such as liquor stores, perfume shops and luxury stores, among others.
notation: 5240701012
valid from: 2020
is activity of: Airport Operators & Services

Airport Fueling Services
type: NamedIndividual
type: Activity
type: BusinessClassification
is contemporary version of: http://data.ga-group.nl/ics/trbc/5240701013
is version of: http://data.ga-group.nl/ics/trbc/5240701013
replaces: http://data.ga-group.nl/ics/trbc/2012/5240701013
imported on: 2023-04-07T16:52:39.364811Z
last refreshed on: 2026-06-05T07:16:11.699Z
source accessed on: 2017-12-31T07:04:19Z
source last accessed on: 2021-08-01T01:06:53Z
definition: Companies engaged in the provision of aircraft fueling services.
notation: 5240701013
valid from: 2020
is activity of: Airport Operators & Services

Airline Catering Services
type: NamedIndividual
type: Activity
type: BusinessClassification
is contemporary version of: http://data.ga-group.nl/ics/trbc/5240701014
is version of: http://data.ga-group.nl/ics/trbc/5240701014
replaces: http://data.ga-group.nl/ics/trbc/2012/5240701014
imported on: 2023-04-07T16:52:39.364811Z
last refreshed on: 2026-06-05T07:16:11.699Z
source accessed on: 2017-12-31T07:04:19Z
source last accessed on: 2021-08-01T01:06:53Z
definition: Companies engaged in the provision of airline catering services.
notation: 5240701014
valid from: 2020
is activity of: Airport Operators & Services

Airport Operators & Services
type: NamedIndividual
type: BusinessClassification
type: Industry
is contemporary version of: http://data.ga-group.nl/ics/trbc/52407010
is version of: http://data.ga-group.nl/ics/trbc/52407010
replaces: http://data.ga-group.nl/ics/trbc/2012/52407010
imported on: 2023-04-07T16:52:39.364811Z
last refreshed on: 2026-06-05T07:16:11.699Z
source accessed on: 2017-12-31T07:04:19Z
source last accessed on: 2021-08-01T01:06:53Z
definition: Owners and operators of airports and supporting services including fueling, repair, inspection, runway maintenance, hangar rental, passenger parking fields, landing services, catering, duty-free shops and other airport services.
notation: 52407010
valid from: 2020
is industry of: Transport Infrastructure

Marine Port Services (NEC)
type: NamedIndividual
type: Activity
type: BusinessClassification
is contemporary version of: http://data.ga-group.nl/ics/trbc/5240702010
is version of: http://data.ga-group.nl/ics/trbc/5240702010
replaces: http://data.ga-group.nl/ics/trbc/2012/5240702010
imported on: 2023-04-07T16:52:39.364811Z
last refreshed on: 2026-06-05T07:16:11.699Z
source accessed on: 2017-12-31T07:04:19Z
source last accessed on: 2021-08-01T01:06:53Z
definition: Companies engaged in providing marine freight support services such as port loading and unloading, canal, harbor and docking services, longshoreman support, tugboat, navigational control and other related services.
notation: 5240702010
valid from: 2020
is activity of: Marine Port Services

Port Warehousing Services
type: NamedIndividual
type: Activity
type: BusinessClassification
is contemporary version of: http://data.ga-group.nl/ics/trbc/5240702011
is version of: http://data.ga-group.nl/ics/trbc/5240702011
replaces: http://data.ga-group.nl/ics/trbc/2012/5240702011
imported on: 2023-04-07T16:52:39.364811Z
last refreshed on: 2026-06-05T07:16:11.699Z
source accessed on: 2017-12-31T07:04:19Z
source last accessed on: 2021-08-01T01:06:53Z
definition: Companies engaged in the operation of port warehouse and storage facilities.
notation: 5240702011
valid from: 2020
is activity of: Marine Port Services

Port Operators
type: NamedIndividual
type: Activity
type: BusinessClassification
is contemporary version of: http://data.ga-group.nl/ics/trbc/5240702012
is version of: http://data.ga-group.nl/ics/trbc/5240702012
replaces: http://data.ga-group.nl/ics/trbc/2012/5240702012
imported on: 2023-04-07T16:52:39.364811Z
last refreshed on: 2026-06-05T07:16:11.699Z
source accessed on: 2017-12-31T07:04:19Z
source last accessed on: 2021-08-01T01:06:53Z
definition: Companies engaged in providing marine freight support services, such as port facility operation; canal, harbor and wharf operation as well as the provision of tugboat, marine salvaging, navigational control and other related services.
notation: 5240702012
valid from: 2020
is activity of: Marine Port Services

Marine Cargo Handling Services
type: NamedIndividual
type: Activity
type: BusinessClassification
is contemporary version of: http://data.ga-group.nl/ics/trbc/5240702013
is version of: http://data.ga-group.nl/ics/trbc/5240702013
replaces: http://data.ga-group.nl/ics/trbc/2012/5240702013
imported on: 2023-04-07T16:52:39.364811Z
last refreshed on: 2026-06-05T07:16:11.699Z
source accessed on: 2017-12-31T07:04:19Z
source last accessed on: 2021-08-01T01:06:53Z
definition: Companies engaged in providing ship loading and unloading, docking, stevedoring and longshoreman support services.
notation: 5240702013
valid from: 2020
is activity of: Marine Port Services

Marine Port Services
type: NamedIndividual
type: BusinessClassification
type: Industry
is contemporary version of: http://data.ga-group.nl/ics/trbc/52407020
is version of: http://data.ga-group.nl/ics/trbc/52407020
replaces: http://data.ga-group.nl/ics/trbc/2012/52407020
imported on: 2023-04-07T16:52:39.364811Z
last refreshed on: 2026-06-05T07:16:11.699Z
source accessed on: 2017-12-31T07:04:19Z
source last accessed on: 2021-08-01T01:06:53Z
definition: Owners and operators of marine ports and supporting services such as port loading and unloading, canal, harbor and docking services, longshoreman support, tugboat, navigational control and other related services.
notation: 52407020
valid from: 2020
is industry of: Transport Infrastructure

Highways & Rail Tracks (NEC)
type: NamedIndividual
type: Activity
type: BusinessClassification
is contemporary version of: http://data.ga-group.nl/ics/trbc/5240703010
is version of: http://data.ga-group.nl/ics/trbc/5240703010
replaces: http://data.ga-group.nl/ics/trbc/2012/5240703010
imported on: 2023-04-07T16:52:39.364811Z
last refreshed on: 2026-06-05T07:16:11.699Z
source accessed on: 2017-12-31T07:04:19Z
source last accessed on: 2021-08-01T01:06:53Z
definition: Companies engaged in the ownership, management and toll collection of rail tracks, tunnels, bridges and roads. Includes also parking lot operations, emergency road services and towing, street cleaning, road snow removal and independent bus terminal operators.
notation: 5240703010
valid from: 2020
is activity of: Highways & Rail Tracks

Highway Operators
type: NamedIndividual
type: Activity
type: BusinessClassification
is contemporary version of: http://data.ga-group.nl/ics/trbc/5240703011
is version of: http://data.ga-group.nl/ics/trbc/5240703011
replaces: http://data.ga-group.nl/ics/trbc/2012/5240703011
imported on: 2023-04-07T16:52:39.364811Z
last refreshed on: 2026-06-05T07:16:11.699Z
source accessed on: 2017-12-31T07:04:19Z
source last accessed on: 2021-08-01T01:06:53Z
definition: Companies engaged in the ownership, management and toll collection of highways and roads. Includes also emergency road services and towing, street cleaning and road snow removal services.
notation: 5240703011
valid from: 2020
is activity of: Highways & Rail Tracks

Railway Operators
type: NamedIndividual
type: Activity
type: BusinessClassification
is contemporary version of: http://data.ga-group.nl/ics/trbc/5240703012
is version of: http://data.ga-group.nl/ics/trbc/5240703012
replaces: http://data.ga-group.nl/ics/trbc/2012/5240703012
imported on: 2023-04-07T16:52:39.364811Z
last refreshed on: 2026-06-05T07:16:11.699Z
source accessed on: 2017-12-31T07:04:19Z
source last accessed on: 2021-08-01T01:06:53Z
definition: Companies engaged in the ownership and management of rail tracks. Includes also railway maintenance, emergency services, cleaning and snow removal services.
notation: 5240703012
valid from: 2020
is activity of: Highways & Rail Tracks

Parking Lot Operators
type: NamedIndividual
type: Activity
type: BusinessClassification
is contemporary version of: http://data.ga-group.nl/ics/trbc/5240703013
is version of: http://data.ga-group.nl/ics/trbc/5240703013
replaces: http://data.ga-group.nl/ics/trbc/2012/5240703013
imported on: 2023-04-07T16:52:39.364811Z
last refreshed on: 2026-06-05T07:16:11.699Z
source accessed on: 2017-12-31T07:04:19Z
source last accessed on: 2021-08-01T01:06:53Z
definition: Companies engaged in the operation of parking lots and garages.
notation: 5240703013
valid from: 2020
is activity of: Highways & Rail Tracks

Highways & Rail Tracks
type: NamedIndividual
type: BusinessClassification
type: Industry
is contemporary version of: http://data.ga-group.nl/ics/trbc/52407030
is version of: http://data.ga-group.nl/ics/trbc/52407030
replaces: http://data.ga-group.nl/ics/trbc/2012/52407030
imported on: 2023-04-07T16:52:39.364811Z
last refreshed on: 2026-06-05T07:16:11.699Z
source accessed on: 2017-12-31T07:04:19Z
source last accessed on: 2021-08-01T01:06:53Z
definition: Owners and operators of transport infrastructure such as rail tracks, tunnels, bridges and roads. Includes toll collection, parking lot operations, emergency road services and towing, street cleaning, and independent bus terminal operators.
notation: 52407030
valid from: 2020
is industry of: Transport Infrastructure

Transport Infrastructure
type: NamedIndividual
type: BusinessClassification
type: IndustryGroup
is contemporary version of: http://data.ga-group.nl/ics/trbc/524070
is version of: http://data.ga-group.nl/ics/trbc/524070
replaces: http://data.ga-group.nl/ics/trbc/2012/524070
imported on: 2023-04-07T16:52:39.364811Z
last refreshed on: 2026-06-05T07:16:11.699Z
source accessed on: 2017-12-31T07:04:19Z
source last accessed on: 2021-08-01T01:06:53Z
definition: Owners and operators of highways, rail tracks, airports, and marine ports.
notation: 524070
valid from: 2020
is industry group of: Transportation

Transportation
type: NamedIndividual
type: BusinessClassification
type: BusinessSector
is contemporary version of: http://data.ga-group.nl/ics/trbc/5240
is version of: http://data.ga-group.nl/ics/trbc/5240
replaces: http://data.ga-group.nl/ics/trbc/2012/5240
imported on: 2023-04-07T16:52:39.364811Z
last refreshed on: 2026-06-05T07:16:11.699Z
source accessed on: 2017-12-31T07:04:19Z
source last accessed on: 2021-08-01T01:06:53Z
definition: Transporters of freight and passengers by air, land and sea, and operators of supporting services.
notation: 5240
valid from: 2020
is business sector of: Industrials

Industrials
type: NamedIndividual
type: BusinessClassification
type: EconomicSector
is contemporary version of: http://data.ga-group.nl/ics/trbc/52
is version of: http://data.ga-group.nl/ics/trbc/52
replaces: http://data.ga-group.nl/ics/trbc/2012/52
imported on: 2023-04-07T16:52:39.364811Z
last refreshed on: 2026-06-05T07:16:11.699Z
source accessed on: 2017-12-31T07:04:19Z
source last accessed on: 2021-08-01T01:06:53Z
definition: Manufacturers of industrial equipment and commercial supplies, providers of related services, such as diversified trading, distribution operations and transportation services as well as providers of professional information services.
notation: 52
valid from: 2020

Auto & Truck Manufacturers (NEC)
type: NamedIndividual
type: Activity
type: BusinessClassification
is contemporary version of: http://data.ga-group.nl/ics/trbc/5310101010
is version of: http://data.ga-group.nl/ics/trbc/5310101010
replaces: http://data.ga-group.nl/ics/trbc/2012/5310101010
imported on: 2023-04-07T16:52:39.364811Z
last refreshed on: 2026-06-05T07:16:11.699Z
source accessed on: 2017-12-31T07:04:19Z
source last accessed on: 2021-08-01T01:06:53Z
definition: Companies involved in at least two activities under the Auto and Truck Manufacturers Industry, none being dominant: the production of automobiles, consumer oriented light trucks, minivans, sports utility vehicles, motorcycles, snowmobiles and all-terrain vehicles. Excludes: (heavy trucks, classified in Heavy Machinery & Vehicles), (bicycles and Recreational vehicle (RVs), classified in Recreational Products).
notation: 5310101010
valid from: 2020
is activity of: Auto & Truck Manufacturers

Motorcycles & Scooters
type: NamedIndividual
type: Activity
type: BusinessClassification
is contemporary version of: http://data.ga-group.nl/ics/trbc/5310101011
is version of: http://data.ga-group.nl/ics/trbc/5310101011
replaces: http://data.ga-group.nl/ics/trbc/2012/5310101011
imported on: 2023-04-07T16:52:39.364811Z
last refreshed on: 2026-06-05T07:16:11.699Z
source accessed on: 2017-12-31T07:04:19Z
source last accessed on: 2021-08-01T01:06:53Z
definition: Companies engaged in the production of motorcycles, scooters and snowmobiles.
notation: 5310101011
valid from: 2020
is activity of: Auto & Truck Manufacturers

Automobiles & Multi Utility Vehicles
type: NamedIndividual
type: Activity
type: BusinessClassification
is contemporary version of: http://data.ga-group.nl/ics/trbc/5310101012
is version of: http://data.ga-group.nl/ics/trbc/5310101012
replaces: http://data.ga-group.nl/ics/trbc/2012/5310101012
imported on: 2023-04-07T16:52:39.364811Z
last refreshed on: 2026-06-05T07:16:11.699Z
source accessed on: 2017-12-31T07:04:19Z
source last accessed on: 2021-08-01T01:06:53Z
definition: Companies engaged in the production of consumer cars, minivans and all-terrain vehicles.
notation: 5310101012
valid from: 2020
is activity of: Auto & Truck Manufacturers

Light Trucks
type: NamedIndividual
type: Activity
type: BusinessClassification
is contemporary version of: http://data.ga-group.nl/ics/trbc/5310101013
is version of: http://data.ga-group.nl/ics/trbc/5310101013
replaces: http://data.ga-group.nl/ics/trbc/2012/5310101013
imported on: 2023-04-07T16:52:39.364811Z
last refreshed on: 2026-06-05T07:16:11.699Z
source accessed on: 2017-12-31T07:04:19Z
source last accessed on: 2021-08-01T01:06:53Z
definition: Companies engaged in the production of light duty consumer trucks.
notation: 5310101013
valid from: 2020
is activity of: Auto & Truck Manufacturers

Electric (Alternative) Vehicles
type: NamedIndividual
type: Activity
type: BusinessClassification
is contemporary version of: http://data.ga-group.nl/ics/trbc/5310101014
is version of: http://data.ga-group.nl/ics/trbc/5310101014
replaces: http://data.ga-group.nl/ics/trbc/2012/5310101014
imported on: 2023-04-07T16:52:39.364811Z
last refreshed on: 2026-06-05T07:16:11.699Z
source accessed on: 2017-12-31T07:04:19Z
source last accessed on: 2021-08-01T01:06:53Z
definition: Companies engaged in the production of electric cars and other vehicles using alternative propulsion systems powered by rechargeable battery packs, such as hydrogen fuel cars.
notation: 5310101014
valid from: 2020
is activity of: Auto & Truck Manufacturers

Luxury Vehicles
type: NamedIndividual
type: Activity
type: BusinessClassification
is contemporary version of: http://data.ga-group.nl/ics/trbc/5310101015
is version of: http://data.ga-group.nl/ics/trbc/5310101015
replaces: http://data.ga-group.nl/ics/trbc/2012/5310101015
imported on: 2023-04-07T16:52:39.364811Z
last refreshed on: 2026-06-05T07:16:11.699Z
source accessed on: 2017-12-31T07:04:19Z
source last accessed on: 2021-08-01T01:06:53Z
definition: Companies engaged in the production of sports cars, limousines and other luxury vehicles.
notation: 5310101015
valid from: 2020
is activity of: Auto & Truck Manufacturers

Auto & Truck Wholesale
type: NamedIndividual
type: Activity
type: BusinessClassification
is contemporary version of: http://data.ga-group.nl/ics/trbc/5310101016
is version of: http://data.ga-group.nl/ics/trbc/5310101016
replaces: http://data.ga-group.nl/ics/trbc/2012/5310101016
imported on: 2023-04-07T16:52:39.364811Z
last refreshed on: 2026-06-05T07:16:11.699Z
source accessed on: 2017-12-31T07:04:19Z
source last accessed on: 2021-08-01T01:06:53Z
definition: Companies engaged in the wholesale of automobiles, consumer oriented light trucks, minivans, sports utility vehicles, motorcycles, snowmobiles and all-terrain vehicles.
notation: 5310101016
valid from: 2020
is activity of: Auto & Truck Manufacturers

Auto & Truck Manufacturers
type: NamedIndividual
type: BusinessClassification
type: Industry
is contemporary version of: http://data.ga-group.nl/ics/trbc/53101010
is version of: http://data.ga-group.nl/ics/trbc/53101010
replaces: http://data.ga-group.nl/ics/trbc/2012/53101010
imported on: 2023-04-07T16:52:39.364811Z
last refreshed on: 2026-06-05T07:16:11.699Z
source accessed on: 2017-12-31T07:04:19Z
source last accessed on: 2021-08-01T01:06:53Z
definition: Manufacturers of automobiles, consumer-oriented light trucks, minivans, sports utility vehicles, motorcycles, snowmobiles and all-terrain vehicles.
notation: 53101010
valid from: 2020
is industry of: Automobiles & Auto Parts

Auto, Truck & Motorcycle Parts (NEC)
type: NamedIndividual
type: Activity
type: BusinessClassification
is contemporary version of: http://data.ga-group.nl/ics/trbc/5310102010
is version of: http://data.ga-group.nl/ics/trbc/5310102010
replaces: http://data.ga-group.nl/ics/trbc/2012/5310102010
imported on: 2023-04-07T16:52:39.364811Z
last refreshed on: 2026-06-05T07:16:11.699Z
source accessed on: 2017-12-31T07:04:19Z
source last accessed on: 2021-08-01T01:06:53Z
definition: Companies involved in at least two activities under the Auto, Truck & Motorcycle Parts Industry, none being dominant: Includes manufacturing of original and replacement parts for cars, light trucks and motorcycles. Excludes: (tires, classified in Tires & Rubber Products).
notation: 5310102010
valid from: 2020
is activity of: Auto, Truck & Motorcycle Parts

Automotive Body Parts
type: NamedIndividual
type: Activity
type: BusinessClassification
is contemporary version of: http://data.ga-group.nl/ics/trbc/5310102011
is version of: http://data.ga-group.nl/ics/trbc/5310102011
replaces: http://data.ga-group.nl/ics/trbc/2012/5310102011
imported on: 2023-04-07T16:52:39.364811Z
last refreshed on: 2026-06-05T07:16:11.699Z
source accessed on: 2017-12-31T07:04:19Z
source last accessed on: 2021-08-01T01:06:53Z
definition: Companies engaged in the manufacturing of automotive bodies for consumer cars and light trucks.
notation: 5310102011
valid from: 2020
is activity of: Auto, Truck & Motorcycle Parts

Engine & Powertrain Systems
type: NamedIndividual
type: Activity
type: BusinessClassification
is contemporary version of: http://data.ga-group.nl/ics/trbc/5310102012
is version of: http://data.ga-group.nl/ics/trbc/5310102012
replaces: http://data.ga-group.nl/ics/trbc/2012/5310102012
imported on: 2023-04-07T16:52:39.364811Z
last refreshed on: 2026-06-05T07:16:11.699Z
source accessed on: 2017-12-31T07:04:19Z
source last accessed on: 2021-08-01T01:06:53Z
definition: Companies engaged in the manufacturing of gasoline engine and engine parts, such as pistons, valves, carburetors, fuel injection elements, among others.
notation: 5310102012
valid from: 2020
is activity of: Auto, Truck & Motorcycle Parts

Automotive Batteries
type: NamedIndividual
type: Activity
type: BusinessClassification
is contemporary version of: http://data.ga-group.nl/ics/trbc/5310102013
is version of: http://data.ga-group.nl/ics/trbc/5310102013
replaces: http://data.ga-group.nl/ics/trbc/2012/5310102013
imported on: 2023-04-07T16:52:39.364811Z
last refreshed on: 2026-06-05T07:16:11.699Z
source accessed on: 2017-12-31T07:04:19Z
source last accessed on: 2021-08-01T01:06:53Z
definition: Companies engaged in the manufacture of vehicle batteries, including those used to provide electric propulsion.
notation: 5310102013
valid from: 2020
is activity of: Auto, Truck & Motorcycle Parts

Automotive Systems
type: NamedIndividual
type: Activity
type: BusinessClassification
is contemporary version of: http://data.ga-group.nl/ics/trbc/5310102014
is version of: http://data.ga-group.nl/ics/trbc/5310102014
replaces: http://data.ga-group.nl/ics/trbc/2012/5310102014
imported on: 2023-04-07T16:52:39.364811Z
last refreshed on: 2026-06-05T07:16:11.699Z
source accessed on: 2017-12-31T07:04:19Z
source last accessed on: 2021-08-01T01:06:53Z
definition: Companies engaged in the manufacturing of automotive brake systems, steering, transmission and suspension systems, air-conditioning systems, navigation systems, among others. Excludes powertrain systems, classified in Engine & Powertrain Systems.
notation: 5310102014
valid from: 2020
is activity of: Auto, Truck & Motorcycle Parts

Automotive Accessories
type: NamedIndividual
type: Activity
type: BusinessClassification
is contemporary version of: http://data.ga-group.nl/ics/trbc/5310102015
is version of: http://data.ga-group.nl/ics/trbc/5310102015
replaces: http://data.ga-group.nl/ics/trbc/2012/5310102015
imported on: 2023-04-07T16:52:39.364811Z
last refreshed on: 2026-06-05T07:16:11.699Z
source accessed on: 2017-12-31T07:04:19Z
source last accessed on: 2021-08-01T01:06:53Z
definition: Companies engaged in the manufacturing of automotive accessories, such as seats, mirrors, spoilers, bicycle carriers, among others.
notation: 5310102015
valid from: 2020
is activity of: Auto, Truck & Motorcycle Parts

Motorcycle Parts & Accessories
type: NamedIndividual
type: Activity
type: BusinessClassification
is contemporary version of: http://data.ga-group.nl/ics/trbc/5310102016
is version of: http://data.ga-group.nl/ics/trbc/5310102016
replaces: http://data.ga-group.nl/ics/trbc/2012/5310102016
imported on: 2023-04-07T16:52:39.364811Z
last refreshed on: 2026-06-05T07:16:11.699Z
source accessed on: 2017-12-31T07:04:19Z
source last accessed on: 2021-08-01T01:06:53Z
definition: Companies engaged in the manufacturing of motorcycle, scooter and snowmobile parts and accessories.
notation: 5310102016
valid from: 2020
is activity of: Auto, Truck & Motorcycle Parts

Auto & Truck Parts Wholesale
type: NamedIndividual
type: Activity
type: BusinessClassification
is contemporary version of: http://data.ga-group.nl/ics/trbc/5310102017
is version of: http://data.ga-group.nl/ics/trbc/5310102017
replaces: http://data.ga-group.nl/ics/trbc/2012/5310102017
imported on: 2023-04-07T16:52:39.364811Z
last refreshed on: 2026-06-05T07:16:11.699Z
source accessed on: 2017-12-31T07:04:19Z
source last accessed on: 2021-08-01T01:06:53Z
definition: Companies engaged in the wholesale of original and replacement parts for cars, light trucks and motorcycles.
notation: 5310102017
valid from: 2020
is activity of: Auto, Truck & Motorcycle Parts

Auto, Truck & Motorcycle Parts
type: NamedIndividual
type: BusinessClassification
type: Industry
is contemporary version of: http://data.ga-group.nl/ics/trbc/53101020
is version of: http://data.ga-group.nl/ics/trbc/53101020
replaces: http://data.ga-group.nl/ics/trbc/2012/53101020
imported on: 2023-04-07T16:52:39.364811Z
last refreshed on: 2026-06-05T07:16:11.699Z
source accessed on: 2017-12-31T07:04:19Z
source last accessed on: 2021-08-01T01:06:53Z
definition: Manufacturers of original and replacement parts for cars, light trucks and motorcycles.
notation: 53101020
valid from: 2020
is industry of: Automobiles & Auto Parts

Tires & Rubber Products (NEC)
type: NamedIndividual
type: Activity
type: BusinessClassification
is contemporary version of: http://data.ga-group.nl/ics/trbc/5310103010
is version of: http://data.ga-group.nl/ics/trbc/5310103010
replaces: http://data.ga-group.nl/ics/trbc/2012/5310103010
imported on: 2023-04-07T16:52:39.364811Z
last refreshed on: 2026-06-05T07:16:11.699Z
source accessed on: 2017-12-31T07:04:19Z
source last accessed on: 2021-08-01T01:06:53Z
definition: Companies involved in at least two activities under the Tires and Rubber Products Industry, none being dominant: Includes the manufacturing of tires, basic rubber products and rubber plantation operations. Includes also wholesaling of new and used tires, tire retreading and repairing materials, as well as molded and mechanical rubber goods production.
notation: 5310103010
valid from: 2020
is activity of: Tires & Rubber Products

Tire & Tube Manufacturers
type: NamedIndividual
type: Activity
type: BusinessClassification
is contemporary version of: http://data.ga-group.nl/ics/trbc/5310103011
is version of: http://data.ga-group.nl/ics/trbc/5310103011
replaces: http://data.ga-group.nl/ics/trbc/2012/5310103011
imported on: 2023-04-07T16:52:39.364811Z
last refreshed on: 2026-06-05T07:16:11.699Z
source accessed on: 2017-12-31T07:04:19Z
source last accessed on: 2021-08-01T01:06:53Z
definition: Companies engaged in the manufacturing of tires and tubes.
notation: 5310103011
valid from: 2020
is activity of: Tires & Rubber Products

Tire Retreading
type: NamedIndividual
type: Activity
type: BusinessClassification
is contemporary version of: http://data.ga-group.nl/ics/trbc/5310103012
is version of: http://data.ga-group.nl/ics/trbc/5310103012
replaces: http://data.ga-group.nl/ics/trbc/2012/5310103012
imported on: 2023-04-07T16:52:39.364811Z
last refreshed on: 2026-06-05T07:16:11.699Z
source accessed on: 2017-12-31T07:04:19Z
source last accessed on: 2021-08-01T01:06:53Z
definition: Companies engaged in the provision of retreading, recapping or rebuilding tires.
notation: 5310103012
valid from: 2020
is activity of: Tires & Rubber Products

Industrial Rubber Products
type: NamedIndividual
type: Activity
type: BusinessClassification
is contemporary version of: http://data.ga-group.nl/ics/trbc/5310103013
is version of: http://data.ga-group.nl/ics/trbc/5310103013
replaces: http://data.ga-group.nl/ics/trbc/2012/5310103013
imported on: 2023-04-07T16:52:39.364811Z
last refreshed on: 2026-06-05T07:16:11.699Z
source accessed on: 2017-12-31T07:04:19Z
source last accessed on: 2021-08-01T01:06:53Z
definition: Companies engaged in the provision of industrial equipment and parts made of rubber.
notation: 5310103013
valid from: 2020
is activity of: Tires & Rubber Products

Rubber Plantations
type: NamedIndividual
type: Activity
type: BusinessClassification
is contemporary version of: http://data.ga-group.nl/ics/trbc/5310103014
is version of: http://data.ga-group.nl/ics/trbc/5310103014
replaces: http://data.ga-group.nl/ics/trbc/2012/5310103014
imported on: 2023-04-07T16:52:39.364811Z
last refreshed on: 2026-06-05T07:16:11.699Z
source accessed on: 2017-12-31T07:04:19Z
source last accessed on: 2021-08-01T01:06:53Z
definition: Companies engaged in the operation of natural rubber plantations and producing rubber from latex sheets.
notation: 5310103014
valid from: 2020
is activity of: Tires & Rubber Products

Tires & Rubber Products Wholesale
type: NamedIndividual
type: Activity
type: BusinessClassification
is contemporary version of: http://data.ga-group.nl/ics/trbc/5310103015
is version of: http://data.ga-group.nl/ics/trbc/5310103015
replaces: http://data.ga-group.nl/ics/trbc/2012/5310103015
imported on: 2023-04-07T16:52:39.364811Z
last refreshed on: 2026-06-05T07:16:11.699Z
source accessed on: 2017-12-31T07:04:19Z
source last accessed on: 2021-08-01T01:06:53Z
definition: Companies engaged in the wholesale of new and used tires, basic rubber and rubber plantation products.
notation: 5310103015
valid from: 2020
is activity of: Tires & Rubber Products

Tires & Rubber Products
type: NamedIndividual
type: BusinessClassification
type: Industry
is contemporary version of: http://data.ga-group.nl/ics/trbc/53101030
is version of: http://data.ga-group.nl/ics/trbc/53101030
replaces: http://data.ga-group.nl/ics/trbc/2012/53101030
imported on: 2023-04-07T16:52:39.364811Z
last refreshed on: 2026-06-05T07:16:11.699Z
source accessed on: 2017-12-31T07:04:19Z
source last accessed on: 2021-08-01T01:06:53Z
definition: Manufacturers of tires, basic rubber products and rubber plantation operations. Includes wholesalers of new and used tires and providers of tire retreading and repairing materials, as well as producers of molded and mechanical rubber goods.
notation: 53101030
valid from: 2020
is industry of: Automobiles & Auto Parts

Automobiles & Auto Parts
type: NamedIndividual
type: BusinessClassification
type: IndustryGroup
is contemporary version of: http://data.ga-group.nl/ics/trbc/531010
is version of: http://data.ga-group.nl/ics/trbc/531010
replaces: http://data.ga-group.nl/ics/trbc/2012/531010
imported on: 2023-04-07T16:52:39.364811Z
last refreshed on: 2026-06-05T07:16:11.699Z
source accessed on: 2017-12-31T07:04:19Z
source last accessed on: 2021-08-01T01:06:53Z
definition: Manufacturers of automobiles, light trucks, motorcycles, as well as related vehicle parts, tires and primary rubber products.
notation: 531010
valid from: 2020
is industry group of: Automobiles & Auto Parts

Automobiles & Auto Parts
type: NamedIndividual
type: BusinessClassification
type: BusinessSector
is contemporary version of: http://data.ga-group.nl/ics/trbc/5310
is version of: http://data.ga-group.nl/ics/trbc/5310
replaces: http://data.ga-group.nl/ics/trbc/2012/5310
imported on: 2023-04-07T16:52:39.364811Z
last refreshed on: 2026-06-05T07:16:11.699Z
source accessed on: 2017-12-31T07:04:19Z
source last accessed on: 2021-08-01T01:06:53Z
definition: Manufacturers of automobiles, light trucks, motorcycles, as well as related vehicle parts, tires and primary rubber products.
notation: 5310
valid from: 2020
is business sector of: Consumer Cyclicals

Textiles & Leather Goods (NEC)
type: NamedIndividual
type: Activity
type: BusinessClassification
is contemporary version of: http://data.ga-group.nl/ics/trbc/5320201010
is version of: http://data.ga-group.nl/ics/trbc/5320201010
replaces: http://data.ga-group.nl/ics/trbc/2012/5320201010
imported on: 2023-04-07T16:52:39.364811Z
last refreshed on: 2026-06-05T07:16:11.699Z
source accessed on: 2017-12-31T07:04:19Z
source last accessed on: 2021-08-01T01:06:53Z
definition: Companies involved in at least two activities under the Textiles and Leather Goods Industry, none being dominant: Includes the operation of cotton farming, woven and non-woven fabric mills, and the manufacturing of basic leather goods. Includes manufacturers of stock and primary leather goods, operators of cotton, wool, rayon, polyester, silk, velvet, hemp, lace and other fabric mills, fur bearing animal production and basic textile goods, such as linens, cloths, rags and bed sheets. Excludes: (leather shoes, classified in Footwear), (leather handbags, wallets and clothing, classified in Apparel & Accessories).
notation: 5320201010
valid from: 2020
is activity of: Textiles & Leather Goods

Synthetic Fabrics
type: NamedIndividual
type: Activity
type: BusinessClassification
is contemporary version of: http://data.ga-group.nl/ics/trbc/5320201011
is version of: http://data.ga-group.nl/ics/trbc/5320201011
replaces: http://data.ga-group.nl/ics/trbc/2012/5320201011
imported on: 2023-04-07T16:52:39.364811Z
last refreshed on: 2026-06-05T07:16:11.699Z
source accessed on: 2017-12-31T07:04:19Z
source last accessed on: 2021-08-01T01:06:53Z
definition: Companies engaged in the production of nylon, acrylic and polyester fabrics.
notation: 5320201011
valid from: 2020
is activity of: Textiles & Leather Goods

Natural Fabrics
type: NamedIndividual
type: Activity
type: BusinessClassification
is contemporary version of: http://data.ga-group.nl/ics/trbc/5320201012
is version of: http://data.ga-group.nl/ics/trbc/5320201012
replaces: http://data.ga-group.nl/ics/trbc/2012/5320201012
imported on: 2023-04-07T16:52:39.364811Z
last refreshed on: 2026-06-05T07:16:11.699Z
source accessed on: 2017-12-31T07:04:19Z
source last accessed on: 2021-08-01T01:06:53Z
definition: Companies engaged in the production of wool, cotton, flax, silk, linen, natural fur, cashmere and other natural fabrics.
notation: 5320201012
valid from: 2020
is activity of: Textiles & Leather Goods

Organic & Ecologically Produced Fabric
type: NamedIndividual
type: Activity
type: BusinessClassification
is contemporary version of: http://data.ga-group.nl/ics/trbc/5320201013
is version of: http://data.ga-group.nl/ics/trbc/5320201013
replaces: http://data.ga-group.nl/ics/trbc/2012/5320201013
imported on: 2023-04-07T16:52:39.364811Z
last refreshed on: 2026-06-05T07:16:11.699Z
source accessed on: 2017-12-31T07:04:19Z
source last accessed on: 2021-08-01T01:06:53Z
definition: Companies engaged in the production of natural fabrics, such as wool, cotton, flax, silk, linen in compliance with organic agriculture/farming requirements (such as low environmental impact, use of biological fertilizers only, recyclable, no synthetic chemicals added).
notation: 5320201013
valid from: 2020
is activity of: Textiles & Leather Goods

Leather Goods
type: NamedIndividual
type: Activity
type: BusinessClassification
is contemporary version of: http://data.ga-group.nl/ics/trbc/5320201014
is version of: http://data.ga-group.nl/ics/trbc/5320201014
replaces: http://data.ga-group.nl/ics/trbc/2012/5320201014
imported on: 2023-04-07T16:52:39.364811Z
last refreshed on: 2026-06-05T07:16:11.699Z
source accessed on: 2017-12-31T07:04:19Z
source last accessed on: 2021-08-01T01:06:53Z
definition: Companies engaged in the production of leather goods. Excludes leather handbags and luggage, classified under Handbags & Luggage.
notation: 5320201014
valid from: 2020
is activity of: Textiles & Leather Goods

Fur Goods
type: NamedIndividual
type: Activity
type: BusinessClassification
is contemporary version of: http://data.ga-group.nl/ics/trbc/5320201015
is version of: http://data.ga-group.nl/ics/trbc/5320201015
replaces: http://data.ga-group.nl/ics/trbc/2012/5320201015
imported on: 2023-04-07T16:52:39.364811Z
last refreshed on: 2026-06-05T07:16:11.699Z
source accessed on: 2017-12-31T07:04:19Z
source last accessed on: 2021-08-01T01:06:53Z
definition: Companies engaged in the production of fur goods.
notation: 5320201015
valid from: 2020
is activity of: Textiles & Leather Goods

Fabric Dyeing & Finishing
type: NamedIndividual
type: Activity
type: BusinessClassification
is contemporary version of: http://data.ga-group.nl/ics/trbc/5320201016
is version of: http://data.ga-group.nl/ics/trbc/5320201016
replaces: http://data.ga-group.nl/ics/trbc/2012/5320201016
imported on: 2023-04-07T16:52:39.364811Z
last refreshed on: 2026-06-05T07:16:11.699Z
source accessed on: 2017-12-31T07:04:19Z
source last accessed on: 2021-08-01T01:06:53Z
definition: Companies engaged in dyeing, finishing, bleaching, sizing of fabrics.
notation: 5320201016
valid from: 2020
is activity of: Textiles & Leather Goods

Yarn Goods
type: NamedIndividual
type: Activity
type: BusinessClassification
is contemporary version of: http://data.ga-group.nl/ics/trbc/5320201017
is version of: http://data.ga-group.nl/ics/trbc/5320201017
replaces: http://data.ga-group.nl/ics/trbc/2012/5320201017
imported on: 2023-04-07T16:52:39.364811Z
last refreshed on: 2026-06-05T07:16:11.699Z
source accessed on: 2017-12-31T07:04:19Z
source last accessed on: 2021-08-01T01:06:53Z
definition: Companies engaged in the production of yarn goods, such as knitting yarns, hemp, rayon spun yarns, hard fiber yarns, among others.
notation: 5320201017
valid from: 2020
is activity of: Textiles & Leather Goods

Cotton Farming
type: NamedIndividual
type: Activity
type: BusinessClassification
is contemporary version of: http://data.ga-group.nl/ics/trbc/5320201018
is version of: http://data.ga-group.nl/ics/trbc/5320201018
replaces: http://data.ga-group.nl/ics/trbc/2012/5320201018
imported on: 2023-04-07T16:52:39.364811Z
last refreshed on: 2026-06-05T07:16:11.699Z
source accessed on: 2017-12-31T07:04:19Z
source last accessed on: 2021-08-01T01:06:53Z
definition: Companies engaged in growing cotton.
notation: 5320201018
valid from: 2020
is activity of: Textiles & Leather Goods

Textiles & Leather Goods Wholesale
type: NamedIndividual
type: Activity
type: BusinessClassification
is contemporary version of: http://data.ga-group.nl/ics/trbc/5320201019
is version of: http://data.ga-group.nl/ics/trbc/5320201019
replaces: http://data.ga-group.nl/ics/trbc/2012/5320201019
imported on: 2023-04-07T16:52:39.364811Z
last refreshed on: 2026-06-05T07:16:11.699Z
source accessed on: 2017-12-31T07:04:19Z
source last accessed on: 2021-08-01T01:06:53Z
definition: Companies engaged in the wholesale of cotton products, woven and non-woven fabric mill products, and the wholesale of basic leather goods. Includes wholesalers of stock and primary leather goods, cotton, wool, rayon, polyester, silk, velvet, hemp, lace and other fabric mills, fur bearing animal production and basic textile goods such as linens, cloths, rags and bed sheets.
notation: 5320201019
valid from: 2020
is activity of: Textiles & Leather Goods

Textiles & Leather Goods
type: NamedIndividual
type: BusinessClassification
type: Industry
is contemporary version of: http://data.ga-group.nl/ics/trbc/53202010
is version of: http://data.ga-group.nl/ics/trbc/53202010
replaces: http://data.ga-group.nl/ics/trbc/2012/53202010
imported on: 2023-04-07T16:52:39.364811Z
last refreshed on: 2026-06-05T07:16:11.699Z
source accessed on: 2017-12-31T07:04:19Z
source last accessed on: 2021-08-01T01:06:53Z
definition: Operators of cotton farms, and woven and non-woven fabric mills, as well as manufacturers of basic leather goods. Includes producers of stock and primary leather goods, cotton, wool, rayon, polyester, silk, velvet, hemp, lace and other fabric mills, fur bearing animal production and basic textile goods such as linens, cloths, rags and bed sheets.
notation: 53202010
valid from: 2020
is industry of: Textiles & Apparel

Apparel & Accessories (NEC)
type: NamedIndividual
type: Activity
type: BusinessClassification
is contemporary version of: http://data.ga-group.nl/ics/trbc/5320202010
is version of: http://data.ga-group.nl/ics/trbc/5320202010
replaces: http://data.ga-group.nl/ics/trbc/2012/5320202010
imported on: 2023-04-07T16:52:39.364811Z
last refreshed on: 2026-06-05T07:16:11.699Z
source accessed on: 2017-12-31T07:04:19Z
source last accessed on: 2021-08-01T01:06:53Z
definition: Companies involved in at least two activities under the Apparel and Accessories industry, none being dominant: includes manufacturing of clothing, such as men, women and children's clothing, uniforms, jackets, hats, socks, gloves, robes, hosiery and swim suits. Includes also manufacturers of accessories such as handbags, attaché cases, umbrellas, cosmetic bags, jewelry, watches, luggage, dog collars and leashes. Excludes: (shoes, sneakers and slippers, classified in Footwear).
notation: 5320202010
valid from: 2020
is activity of: Apparel & Accessories

Men's Clothing
type: NamedIndividual
type: Activity
type: BusinessClassification
is contemporary version of: http://data.ga-group.nl/ics/trbc/5320202011
is version of: http://data.ga-group.nl/ics/trbc/5320202011
replaces: http://data.ga-group.nl/ics/trbc/2012/5320202011
imported on: 2023-04-07T16:52:39.364811Z
last refreshed on: 2026-06-05T07:16:11.699Z
source accessed on: 2017-12-31T07:04:19Z
source last accessed on: 2021-08-01T01:06:53Z
definition: Companies engaged in the production of men's and boys' apparel, such as suits, coats, work clothing, underwear, outerwear, trousers, among others.
notation: 5320202011
valid from: 2020
is activity of: Apparel & Accessories

Women's Clothing
type: NamedIndividual
type: Activity
type: BusinessClassification
is contemporary version of: http://data.ga-group.nl/ics/trbc/5320202012
is version of: http://data.ga-group.nl/ics/trbc/5320202012
replaces: http://data.ga-group.nl/ics/trbc/2012/5320202012
imported on: 2023-04-07T16:52:39.364811Z
last refreshed on: 2026-06-05T07:16:11.699Z
source accessed on: 2017-12-31T07:04:19Z
source last accessed on: 2021-08-01T01:06:53Z
definition: Companies engaged in the production of women and girls' apparel, such as coats, suits, underwear, outerwear, trousers, among others.
notation: 5320202012
valid from: 2020
is activity of: Apparel & Accessories

Children's & Infants' Clothing
type: NamedIndividual
type: Activity
type: BusinessClassification
is contemporary version of: http://data.ga-group.nl/ics/trbc/5320202013
is version of: http://data.ga-group.nl/ics/trbc/5320202013
replaces: http://data.ga-group.nl/ics/trbc/2012/5320202013
imported on: 2023-04-07T16:52:39.364811Z
last refreshed on: 2026-06-05T07:16:11.699Z
source accessed on: 2017-12-31T07:04:19Z
source last accessed on: 2021-08-01T01:06:53Z
definition: Companies engaged in the production of apparel for children and infants.
notation: 5320202013
valid from: 2020
is activity of: Apparel & Accessories

Sportswear & Outdoors Clothing
type: NamedIndividual
type: Activity
type: BusinessClassification
is contemporary version of: http://data.ga-group.nl/ics/trbc/5320202014
is version of: http://data.ga-group.nl/ics/trbc/5320202014
replaces: http://data.ga-group.nl/ics/trbc/2012/5320202014
imported on: 2023-04-07T16:52:39.364811Z
last refreshed on: 2026-06-05T07:16:11.699Z
source accessed on: 2017-12-31T07:04:19Z
source last accessed on: 2021-08-01T01:06:53Z
definition: Companies engaged in the production of sporting/athletic and outdoor apparel.
notation: 5320202014
valid from: 2020
is activity of: Apparel & Accessories

Jeans
type: NamedIndividual
type: Activity
type: BusinessClassification
is contemporary version of: http://data.ga-group.nl/ics/trbc/5320202015
is version of: http://data.ga-group.nl/ics/trbc/5320202015
replaces: http://data.ga-group.nl/ics/trbc/2012/5320202015
imported on: 2023-04-07T16:52:39.364811Z
last refreshed on: 2026-06-05T07:16:11.699Z
source accessed on: 2017-12-31T07:04:19Z
source last accessed on: 2021-08-01T01:06:53Z
definition: Companies engaged in the production of trousers made from denim.
notation: 5320202015
valid from: 2020
is activity of: Apparel & Accessories

Knitwear
type: NamedIndividual
type: Activity
type: BusinessClassification
is contemporary version of: http://data.ga-group.nl/ics/trbc/5320202016
is version of: http://data.ga-group.nl/ics/trbc/5320202016
replaces: http://data.ga-group.nl/ics/trbc/2012/5320202016
imported on: 2023-04-07T16:52:39.364811Z
last refreshed on: 2026-06-05T07:16:11.699Z
source accessed on: 2017-12-31T07:04:19Z
source last accessed on: 2021-08-01T01:06:53Z
definition: Companies engaged in the production of all types of women's and men's knitwear.
notation: 5320202016
valid from: 2020
is activity of: Apparel & Accessories

Lingerie
type: NamedIndividual
type: Activity
type: BusinessClassification
is contemporary version of: http://data.ga-group.nl/ics/trbc/5320202017
is version of: http://data.ga-group.nl/ics/trbc/5320202017
replaces: http://data.ga-group.nl/ics/trbc/2012/5320202017
imported on: 2023-04-07T16:52:39.364811Z
last refreshed on: 2026-06-05T07:16:11.699Z
source accessed on: 2017-12-31T07:04:19Z
source last accessed on: 2021-08-01T01:06:53Z
definition: Companies engaged in the production of all types of women's lingerie.
notation: 5320202017
valid from: 2020
is activity of: Apparel & Accessories

Hosiery & Socks
type: NamedIndividual
type: Activity
type: BusinessClassification
is contemporary version of: http://data.ga-group.nl/ics/trbc/5320202018
is version of: http://data.ga-group.nl/ics/trbc/5320202018
replaces: http://data.ga-group.nl/ics/trbc/2012/5320202018
imported on: 2023-04-07T16:52:39.364811Z
last refreshed on: 2026-06-05T07:16:11.699Z
source accessed on: 2017-12-31T07:04:19Z
source last accessed on: 2021-08-01T01:06:53Z
definition: Companies engaged in the production of hosiery and socks.
notation: 5320202018
valid from: 2020
is activity of: Apparel & Accessories

Industrial Clothing & Uniforms
type: NamedIndividual
type: Activity
type: BusinessClassification
is contemporary version of: http://data.ga-group.nl/ics/trbc/5320202019
is version of: http://data.ga-group.nl/ics/trbc/5320202019
replaces: http://data.ga-group.nl/ics/trbc/2012/5320202019
imported on: 2023-04-07T16:52:39.364811Z
last refreshed on: 2026-06-05T07:16:11.699Z
source accessed on: 2017-12-31T07:04:19Z
source last accessed on: 2021-08-01T01:06:53Z
definition: Companies engaged in the production of work and industrial clothing, as well as various uniforms, such us military, police, firefighters' or civil servants' uniforms. Excludes sport uniforms, classified in Sportswear & Outdoors Clothing.
notation: 5320202019
valid from: 2020
is activity of: Apparel & Accessories

Fair Trade & Ethical Clothing
type: NamedIndividual
type: Activity
type: BusinessClassification
is contemporary version of: http://data.ga-group.nl/ics/trbc/5320202020
is version of: http://data.ga-group.nl/ics/trbc/5320202020
replaces: http://data.ga-group.nl/ics/trbc/2012/5320202020
imported on: 2023-04-07T16:52:39.364811Z
last refreshed on: 2026-06-05T07:16:11.699Z
source accessed on: 2017-12-31T07:04:19Z
source last accessed on: 2021-08-01T01:06:53Z
definition: Companies engaged in the distribution of clothing directly from producers in developing countries at prices considered economically fair.
notation: 5320202020
valid from: 2020
is activity of: Apparel & Accessories

Luxury Clothing
type: NamedIndividual
type: Activity
type: BusinessClassification
is contemporary version of: http://data.ga-group.nl/ics/trbc/5320202021
is version of: http://data.ga-group.nl/ics/trbc/5320202021
replaces: http://data.ga-group.nl/ics/trbc/2012/5320202021
imported on: 2023-04-07T16:52:39.364811Z
last refreshed on: 2026-06-05T07:16:11.699Z
source accessed on: 2017-12-31T07:04:19Z
source last accessed on: 2021-08-01T01:06:53Z
definition: Companies engaged in the production of Luxury Clothing.
notation: 5320202021
valid from: 2020
is activity of: Apparel & Accessories

Theatrical Costumes
type: NamedIndividual
type: Activity
type: BusinessClassification
is contemporary version of: http://data.ga-group.nl/ics/trbc/5320202022
is version of: http://data.ga-group.nl/ics/trbc/5320202022
replaces: http://data.ga-group.nl/ics/trbc/2012/5320202022
imported on: 2023-04-07T16:52:39.364811Z
last refreshed on: 2026-06-05T07:16:11.699Z
source accessed on: 2017-12-31T07:04:19Z
source last accessed on: 2021-08-01T01:06:53Z
definition: Companies engaged in the production of theatrical and masquerade costumes.
notation: 5320202022
valid from: 2020
is activity of: Apparel & Accessories

Animal & Pet Clothing
type: NamedIndividual
type: Activity
type: BusinessClassification
is contemporary version of: http://data.ga-group.nl/ics/trbc/5320202023
is version of: http://data.ga-group.nl/ics/trbc/5320202023
replaces: http://data.ga-group.nl/ics/trbc/2012/5320202023
imported on: 2023-04-07T16:52:39.364811Z
last refreshed on: 2026-06-05T07:16:11.699Z
source accessed on: 2017-12-31T07:04:19Z
source last accessed on: 2021-08-01T01:06:53Z
definition: Companies engaged in the production of clothing for pets and animals.
notation: 5320202023
valid from: 2020
is activity of: Apparel & Accessories

Luxury Accessories
type: NamedIndividual
type: Activity
type: BusinessClassification
is contemporary version of: http://data.ga-group.nl/ics/trbc/5320202024
is version of: http://data.ga-group.nl/ics/trbc/5320202024
replaces: http://data.ga-group.nl/ics/trbc/2012/5320202024
imported on: 2023-04-07T16:52:39.364811Z
last refreshed on: 2026-06-05T07:16:11.699Z
source accessed on: 2017-12-31T07:04:19Z
source last accessed on: 2021-08-01T01:06:53Z
definition: Companies engaged in the production of luxury accessories, such as luxury handbags and purses, glasses, umbrellas, watches, jewelry and other luxury apparel accessories.
notation: 5320202024
valid from: 2020
is activity of: Apparel & Accessories

Accessories
type: NamedIndividual
type: Activity
type: BusinessClassification
is contemporary version of: http://data.ga-group.nl/ics/trbc/5320202025
is version of: http://data.ga-group.nl/ics/trbc/5320202025
replaces: http://data.ga-group.nl/ics/trbc/2012/5320202025
imported on: 2023-04-07T16:52:39.364811Z
last refreshed on: 2026-06-05T07:16:11.699Z
source accessed on: 2017-12-31T07:04:19Z
source last accessed on: 2021-08-01T01:06:53Z
definition: Companies engaged in the production of apparel accessories, such as hats, caps, gloves, buttons, zippers, glasses, umbrellas and other apparel accessories.
notation: 5320202025
valid from: 2020
is activity of: Apparel & Accessories

Jewelry
type: NamedIndividual
type: Activity
type: BusinessClassification
is contemporary version of: http://data.ga-group.nl/ics/trbc/5320202026
is version of: http://data.ga-group.nl/ics/trbc/5320202026
replaces: http://data.ga-group.nl/ics/trbc/2012/5320202026
imported on: 2023-04-07T16:52:39.364811Z
last refreshed on: 2026-06-05T07:16:11.699Z
source accessed on: 2017-12-31T07:04:19Z
source last accessed on: 2021-08-01T01:06:53Z
definition: Companies engaged in the production of jewelry items, such as bracelets, earrings, key cases, pins and brooches, necklaces and other jewelry products.
notation: 5320202026
valid from: 2020
is activity of: Apparel & Accessories

Watches
type: NamedIndividual
type: Activity
type: BusinessClassification
is contemporary version of: http://data.ga-group.nl/ics/trbc/5320202027
is version of: http://data.ga-group.nl/ics/trbc/5320202027
replaces: http://data.ga-group.nl/ics/trbc/2012/5320202027
imported on: 2023-04-07T16:52:39.364811Z
last refreshed on: 2026-06-05T07:16:11.699Z
source accessed on: 2017-12-31T07:04:19Z
source last accessed on: 2021-08-01T01:06:53Z
definition: Companies engaged in the production of hand watches and watch parts manufacturing.
notation: 5320202027
valid from: 2020
is activity of: Apparel & Accessories

Handbags & Luggage
type: NamedIndividual
type: Activity
type: BusinessClassification
is contemporary version of: http://data.ga-group.nl/ics/trbc/5320202028
is version of: http://data.ga-group.nl/ics/trbc/5320202028
replaces: http://data.ga-group.nl/ics/trbc/2012/5320202028
imported on: 2023-04-07T16:52:39.364811Z
last refreshed on: 2026-06-05T07:16:11.699Z
source accessed on: 2017-12-31T07:04:19Z
source last accessed on: 2021-08-01T01:06:53Z
definition: Companies engaged in the production of handbags, purses and hand luggage.
notation: 5320202028
valid from: 2020
is activity of: Apparel & Accessories

Fashion Eyewear
type: NamedIndividual
type: Activity
type: BusinessClassification
is contemporary version of: http://data.ga-group.nl/ics/trbc/5320202029
is version of: http://data.ga-group.nl/ics/trbc/5320202029
replaces: http://data.ga-group.nl/ics/trbc/2012/5320202029
imported on: 2023-04-07T16:52:39.364811Z
last refreshed on: 2026-06-05T07:16:11.699Z
source accessed on: 2017-12-31T07:04:19Z
source last accessed on: 2021-08-01T01:06:53Z
definition: Companies engaged in the production of fashion glasses. Excludes producers of correction glasses (medical), classified in Glasses, Spectacles & Contact Lenses.
notation: 5320202029
valid from: 2020
is activity of: Apparel & Accessories

Apparel Wholesale
type: NamedIndividual
type: Activity
type: BusinessClassification
is contemporary version of: http://data.ga-group.nl/ics/trbc/5320202030
is version of: http://data.ga-group.nl/ics/trbc/5320202030
replaces: http://data.ga-group.nl/ics/trbc/2012/5320202030
imported on: 2023-04-07T16:52:39.364811Z
last refreshed on: 2026-06-05T07:16:11.699Z
source accessed on: 2017-12-31T07:04:19Z
source last accessed on: 2021-08-01T01:06:53Z
definition: Companies engaged in the wholesale of all kind of apparel.
notation: 5320202030
valid from: 2020
is activity of: Apparel & Accessories

Apparel & Accessories
type: NamedIndividual
type: BusinessClassification
type: Industry
is contemporary version of: http://data.ga-group.nl/ics/trbc/53202020
is version of: http://data.ga-group.nl/ics/trbc/53202020
replaces: http://data.ga-group.nl/ics/trbc/2012/53202020
imported on: 2023-04-07T16:52:39.364811Z
last refreshed on: 2026-06-05T07:16:11.699Z
source accessed on: 2017-12-31T07:04:19Z
source last accessed on: 2021-08-01T01:06:53Z
definition: Manufacturers of clothing such as, men's, women's, children's and pet clothing, uniforms, jackets, hats, socks, gloves, robes, hosiery and swim suits. Includes producers of accessories such as handbags, attache cases, umbrellas, cosmetic bags, jewelry, watches, luggage.
notation: 53202020
valid from: 2020
is industry of: Textiles & Apparel

Footwear (NEC)
type: NamedIndividual
type: Activity
type: BusinessClassification
is contemporary version of: http://data.ga-group.nl/ics/trbc/5320203010
is version of: http://data.ga-group.nl/ics/trbc/5320203010
replaces: http://data.ga-group.nl/ics/trbc/2012/5320203010
imported on: 2023-04-07T16:52:39.364811Z
last refreshed on: 2026-06-05T07:16:11.699Z
source accessed on: 2017-12-31T07:04:19Z
source last accessed on: 2021-08-01T01:06:53Z
definition: Companies involved in at least two activities under the Footwear industry, none being dominant: includes manufacturing of footwear such as dress shoes, sneakers, slippers, boots, galoshes, sandals and athletic and trade related footwear. Includes also manufacturers of footwear parts such as shoe laces, buckles, clasps, inner soles, heels and padding. Excludes: (leather stock for shoes, classified in Textiles and Leather Goods).
notation: 5320203010
valid from: 2020
is activity of: Footwear

Men's Footwear
type: NamedIndividual
type: Activity
type: BusinessClassification
is contemporary version of: http://data.ga-group.nl/ics/trbc/5320203011
is version of: http://data.ga-group.nl/ics/trbc/5320203011
replaces: http://data.ga-group.nl/ics/trbc/2012/5320203011
imported on: 2023-04-07T16:52:39.364811Z
last refreshed on: 2026-06-05T07:16:11.699Z
source accessed on: 2017-12-31T07:04:19Z
source last accessed on: 2021-08-01T01:06:53Z
definition: Companies engaged in the manufacturing of men's and boys' footwear.
notation: 5320203011
valid from: 2020
is activity of: Footwear

Women's Footwear
type: NamedIndividual
type: Activity
type: BusinessClassification
is contemporary version of: http://data.ga-group.nl/ics/trbc/5320203012
is version of: http://data.ga-group.nl/ics/trbc/5320203012
replaces: http://data.ga-group.nl/ics/trbc/2012/5320203012
imported on: 2023-04-07T16:52:39.364811Z
last refreshed on: 2026-06-05T07:16:11.699Z
source accessed on: 2017-12-31T07:04:19Z
source last accessed on: 2021-08-01T01:06:53Z
definition: Companies engaged in the manufacturing of women's and girls' footwear.
notation: 5320203012
valid from: 2020
is activity of: Footwear

Children's & Infants' Footwear
type: NamedIndividual
type: Activity
type: BusinessClassification
is contemporary version of: http://data.ga-group.nl/ics/trbc/5320203013
is version of: http://data.ga-group.nl/ics/trbc/5320203013
replaces: http://data.ga-group.nl/ics/trbc/2012/5320203013
imported on: 2023-04-07T16:52:39.364811Z
last refreshed on: 2026-06-05T07:16:11.699Z
source accessed on: 2017-12-31T07:04:19Z
source last accessed on: 2021-08-01T01:06:53Z
definition: Companies engaged in the manufacturing of Children & Infants Footwear.
notation: 5320203013
valid from: 2020
is activity of: Footwear

Sports & Outdoor Footwear
type: NamedIndividual
type: Activity
type: BusinessClassification
is contemporary version of: http://data.ga-group.nl/ics/trbc/5320203014
is version of: http://data.ga-group.nl/ics/trbc/5320203014
replaces: http://data.ga-group.nl/ics/trbc/2012/5320203014
imported on: 2023-04-07T16:52:39.364811Z
last refreshed on: 2026-06-05T07:16:11.699Z
source accessed on: 2017-12-31T07:04:19Z
source last accessed on: 2021-08-01T01:06:53Z
definition: Companies engaged in the manufacturing of Sports & Outdoor Footwear.
notation: 5320203014
valid from: 2020
is activity of: Footwear

Luxury Footwear
type: NamedIndividual
type: Activity
type: BusinessClassification
is contemporary version of: http://data.ga-group.nl/ics/trbc/5320203015
is version of: http://data.ga-group.nl/ics/trbc/5320203015
replaces: http://data.ga-group.nl/ics/trbc/2012/5320203015
imported on: 2023-04-07T16:52:39.364811Z
last refreshed on: 2026-06-05T07:16:11.699Z
source accessed on: 2017-12-31T07:04:19Z
source last accessed on: 2021-08-01T01:06:53Z
definition: Companies engaged in the manufacturing of Luxury Footwear.
notation: 5320203015
valid from: 2020
is activity of: Footwear

Functional Footwear
type: NamedIndividual
type: Activity
type: BusinessClassification
is contemporary version of: http://data.ga-group.nl/ics/trbc/5320203016
is version of: http://data.ga-group.nl/ics/trbc/5320203016
replaces: http://data.ga-group.nl/ics/trbc/2012/5320203016
imported on: 2023-04-07T16:52:39.364811Z
last refreshed on: 2026-06-05T07:16:11.699Z
source accessed on: 2017-12-31T07:04:19Z
source last accessed on: 2021-08-01T01:06:53Z
definition: Companies engaged in the manufacturing of special function footwear, such as massage shoes, magnetic shoes, weight loss and diabetic shoes.
notation: 5320203016
valid from: 2020
is activity of: Footwear

Footwear Wholesale
type: NamedIndividual
type: Activity
type: BusinessClassification
is contemporary version of: http://data.ga-group.nl/ics/trbc/5320203017
is version of: http://data.ga-group.nl/ics/trbc/5320203017
replaces: http://data.ga-group.nl/ics/trbc/2012/5320203017
imported on: 2023-04-07T16:52:39.364811Z
last refreshed on: 2026-06-05T07:16:11.699Z
source accessed on: 2017-12-31T07:04:19Z
source last accessed on: 2021-08-01T01:06:53Z
definition: Companies engaged in the wholesale of all kinds of footwear.
notation: 5320203017
valid from: 2020
is activity of: Footwear

Footwear
type: NamedIndividual
type: BusinessClassification
type: Industry
is contemporary version of: http://data.ga-group.nl/ics/trbc/53202030
is version of: http://data.ga-group.nl/ics/trbc/53202030
replaces: http://data.ga-group.nl/ics/trbc/2012/53202030
imported on: 2023-04-07T16:52:39.364811Z
last refreshed on: 2026-06-05T07:16:11.699Z
source accessed on: 2017-12-31T07:04:19Z
source last accessed on: 2021-08-01T01:06:53Z
definition: Manufacturers of footwear such as dress shoes, sneakers, slippers, boots, galoshes, sandals and athletic and trade related footwear. Includes producers of footwear parts such as shoe laces, buckles, clasps, inner soles, heels and padding.
notation: 53202030
valid from: 2020
is industry of: Textiles & Apparel

Textiles & Apparel
type: NamedIndividual
type: BusinessClassification
type: IndustryGroup
is contemporary version of: http://data.ga-group.nl/ics/trbc/532020
is version of: http://data.ga-group.nl/ics/trbc/532020
replaces: http://data.ga-group.nl/ics/trbc/2012/532020
imported on: 2023-04-07T16:52:39.364811Z
last refreshed on: 2026-06-05T07:16:11.699Z
source accessed on: 2017-12-31T07:04:19Z
source last accessed on: 2021-08-01T01:06:53Z
definition: Manufacturers of fabrics, leather and other textiles, apparel, accessories and footwear.
notation: 532020
valid from: 2020
is industry group of: Cyclical Consumer Products

Homebuilding (NEC)
type: NamedIndividual
type: Activity
type: BusinessClassification
is contemporary version of: http://data.ga-group.nl/ics/trbc/5320301010
is version of: http://data.ga-group.nl/ics/trbc/5320301010
replaces: http://data.ga-group.nl/ics/trbc/2012/5320301010
imported on: 2023-04-07T16:52:39.364811Z
last refreshed on: 2026-06-05T07:16:11.699Z
source accessed on: 2017-12-31T07:04:19Z
source last accessed on: 2021-08-01T01:06:53Z
definition: Companies involved in at least two activities under the Homebuilding Industry, none being dominant: includes construction of residential homes, mobile homes and prefabricated homes. Includes centralized homebuilding operations where work is channeled to specialized contractors. Excludes: (homebuilding and improvement fixtures such as plumbing supplies, door and window frames, classified in Construction Supplies & Fixtures), (hotel and office building construction, classified in Construction & Engineering).
notation: 5320301010
valid from: 2020
is activity of: Homebuilding

Residential Builders - Single Homes
type: NamedIndividual
type: Activity
type: BusinessClassification
is contemporary version of: http://data.ga-group.nl/ics/trbc/5320301011
is version of: http://data.ga-group.nl/ics/trbc/5320301011
replaces: http://data.ga-group.nl/ics/trbc/2012/5320301011
imported on: 2023-04-07T16:52:39.364811Z
last refreshed on: 2026-06-05T07:16:11.699Z
source accessed on: 2017-12-31T07:04:19Z
source last accessed on: 2021-08-01T01:06:53Z
definition: Companies engaged in the construction of single residential homes.
notation: 5320301011
valid from: 2020
is activity of: Homebuilding

Residential Builders - Multifamily Homes
type: NamedIndividual
type: Activity
type: BusinessClassification
is contemporary version of: http://data.ga-group.nl/ics/trbc/5320301012
is version of: http://data.ga-group.nl/ics/trbc/5320301012
replaces: http://data.ga-group.nl/ics/trbc/2012/5320301012
imported on: 2023-04-07T16:52:39.364811Z
last refreshed on: 2026-06-05T07:16:11.699Z
source accessed on: 2017-12-31T07:04:19Z
source last accessed on: 2021-08-01T01:06:53Z
definition: Companies engaged in the construction of multifamily residential homes.
notation: 5320301012
valid from: 2020
is activity of: Homebuilding

Prefabricated Homes
type: NamedIndividual
type: Activity
type: BusinessClassification
is contemporary version of: http://data.ga-group.nl/ics/trbc/5320301013
is version of: http://data.ga-group.nl/ics/trbc/5320301013
replaces: http://data.ga-group.nl/ics/trbc/2012/5320301013
imported on: 2023-04-07T16:52:39.364811Z
last refreshed on: 2026-06-05T07:16:11.699Z
source accessed on: 2017-12-31T07:04:19Z
source last accessed on: 2021-08-01T01:06:53Z
definition: Companies engaged in the construction of prefabricated (produced off-site) residential homes.
notation: 5320301013
valid from: 2020
is activity of: Homebuilding

Sustainable & Energy Efficient Home Builders
type: NamedIndividual
type: Activity
type: BusinessClassification
is contemporary version of: http://data.ga-group.nl/ics/trbc/5320301014
is version of: http://data.ga-group.nl/ics/trbc/5320301014
replaces: http://data.ga-group.nl/ics/trbc/2012/5320301014
imported on: 2023-04-07T16:52:39.364811Z
last refreshed on: 2026-06-05T07:16:11.699Z
source accessed on: 2017-12-31T07:04:19Z
source last accessed on: 2021-08-01T01:06:53Z
definition: Companies engaged in the construction of sustainable and energy efficient residential homes.
notation: 5320301014
valid from: 2020
is activity of: Homebuilding

Retirement Home Builders
type: NamedIndividual
type: Activity
type: BusinessClassification
is contemporary version of: http://data.ga-group.nl/ics/trbc/5320301015
is version of: http://data.ga-group.nl/ics/trbc/5320301015
replaces: http://data.ga-group.nl/ics/trbc/2012/5320301015
imported on: 2023-04-07T16:52:39.364811Z
last refreshed on: 2026-06-05T07:16:11.699Z
source accessed on: 2017-12-31T07:04:19Z
source last accessed on: 2021-08-01T01:06:53Z
definition: Companies engaged in the construction of retirement homes, retirement flats, retirement communities, elderly homes and social homes. Includes also building of independent and assisted living. Excludes builders of nursing homes, classified in Commercial Buildings.
notation: 5320301015
valid from: 2020
is activity of: Homebuilding

Residential Architectural & Interior Design Services
type: NamedIndividual
type: Activity
type: BusinessClassification
is contemporary version of: http://data.ga-group.nl/ics/trbc/5320301016
is version of: http://data.ga-group.nl/ics/trbc/5320301016
replaces: http://data.ga-group.nl/ics/trbc/2012/5320301016
imported on: 2023-04-07T16:52:39.364811Z
last refreshed on: 2026-06-05T07:16:11.699Z
source accessed on: 2017-12-31T07:04:19Z
source last accessed on: 2021-08-01T01:06:53Z
definition: Companies engaged in the provision of residential architectural and interior design services. Includes also interior decoration services with purchased interior supplies.
notation: 5320301016
valid from: 2020
is activity of: Homebuilding

Homebuilding
type: NamedIndividual
type: BusinessClassification
type: Industry
is contemporary version of: http://data.ga-group.nl/ics/trbc/53203010
is version of: http://data.ga-group.nl/ics/trbc/53203010
replaces: http://data.ga-group.nl/ics/trbc/2012/53203010
imported on: 2023-04-07T16:52:39.364811Z
last refreshed on: 2026-06-05T07:16:11.699Z
source accessed on: 2017-12-31T07:04:19Z
source last accessed on: 2021-08-01T01:06:53Z
definition: Builders of residential homes, mobile homes and prefabricated homes. Includes centralized homebuilding operators where work is channeled to specialized contractors.
notation: 53203010
valid from: 2020
is industry of: Homebuilding & Construction Supplies

Construction Supplies & Fixtures (NEC)
type: NamedIndividual
type: Activity
type: BusinessClassification
is contemporary version of: http://data.ga-group.nl/ics/trbc/5320302010
is version of: http://data.ga-group.nl/ics/trbc/5320302010
replaces: http://data.ga-group.nl/ics/trbc/2012/5320302010
imported on: 2023-04-07T16:52:39.364811Z
last refreshed on: 2026-06-05T07:16:11.699Z
source accessed on: 2017-12-31T07:04:19Z
source last accessed on: 2021-08-01T01:06:53Z
definition: Companies involved in at least two activities under the Construction Supplies & Fixtures Industry, none being dominant: includes manufacturing of value added building products and home improvement components. Includes also manufacturers of door and window frames, moldings and trims, tile, roofing, gutters, floorboards, insulating material, plumbing fixtures, cabinets and other building supplies. Excludes: (basic materials such as raw cement, concrete and bricks, classified in Construction Materials), (lumber, plywood and other primary processed wood materials, classified in Forest & Wood Products).
notation: 5320302010
valid from: 2020
is activity of: Construction Supplies & Fixtures

Construction Supplies
type: NamedIndividual
type: Activity
type: BusinessClassification
is contemporary version of: http://data.ga-group.nl/ics/trbc/5320302011
is version of: http://data.ga-group.nl/ics/trbc/5320302011
replaces: http://data.ga-group.nl/ics/trbc/2012/5320302011
imported on: 2023-04-07T16:52:39.364811Z
last refreshed on: 2026-06-05T07:16:11.699Z
source accessed on: 2017-12-31T07:04:19Z
source last accessed on: 2021-08-01T01:06:53Z
definition: Companies engaged in the manufacturing of value added building products and home improvement components, such as door and window frames, moldings and trims, tile, roofing, gutters, floorboards, insulating material and others.
notation: 5320302011
valid from: 2020
is activity of: Construction Supplies & Fixtures

Luxury Construction Supplies & Fixtures
type: NamedIndividual
type: Activity
type: BusinessClassification
is contemporary version of: http://data.ga-group.nl/ics/trbc/5320302012
is version of: http://data.ga-group.nl/ics/trbc/5320302012
replaces: http://data.ga-group.nl/ics/trbc/2012/5320302012
imported on: 2023-04-07T16:52:39.364811Z
last refreshed on: 2026-06-05T07:16:11.699Z
source accessed on: 2017-12-31T07:04:19Z
source last accessed on: 2021-08-01T01:06:53Z
definition: Companies engaged in the manufacturing of luxury value added building products and home improvement components. Includes manufacturers of luxury door and window frames, moldings and trims, tile, roofing, gutters, floorboards, insulating material, plumbing fixtures, cabinets and other luxury building supplies.
notation: 5320302012
valid from: 2020
is activity of: Construction Supplies & Fixtures

Doors & Window Frames
type: NamedIndividual
type: Activity
type: BusinessClassification
is contemporary version of: http://data.ga-group.nl/ics/trbc/5320302013
is version of: http://data.ga-group.nl/ics/trbc/5320302013
replaces: http://data.ga-group.nl/ics/trbc/2012/5320302013
imported on: 2023-04-07T16:52:39.364811Z
last refreshed on: 2026-06-05T07:16:11.699Z
source accessed on: 2017-12-31T07:04:19Z
source last accessed on: 2021-08-01T01:06:53Z
definition: Companies engaged in the manufacturing of doors and window frames. Includes manufacturing of window and door units, sash, window and door frames, and doors from wood or wood clad with metal or plastics.
notation: 5320302013
valid from: 2020
is activity of: Construction Supplies & Fixtures

Flooring & Interior Tile Manufacturers
type: NamedIndividual
type: Activity
type: BusinessClassification
is contemporary version of: http://data.ga-group.nl/ics/trbc/5320302014
is version of: http://data.ga-group.nl/ics/trbc/5320302014
replaces: http://data.ga-group.nl/ics/trbc/2012/5320302014
imported on: 2023-04-07T16:52:39.364811Z
last refreshed on: 2026-06-05T07:16:11.699Z
source accessed on: 2017-12-31T07:04:19Z
source last accessed on: 2021-08-01T01:06:53Z
definition: Companies engaged in the manufacturing of flooring and interior tiles.
notation: 5320302014
valid from: 2020
is activity of: Construction Supplies & Fixtures

Plumbing Fixtures & Fittings
type: NamedIndividual
type: Activity
type: BusinessClassification
is contemporary version of: http://data.ga-group.nl/ics/trbc/5320302015
is version of: http://data.ga-group.nl/ics/trbc/5320302015
replaces: http://data.ga-group.nl/ics/trbc/2012/5320302015
imported on: 2023-04-07T16:52:39.364811Z
last refreshed on: 2026-06-05T07:16:11.699Z
source accessed on: 2017-12-31T07:04:19Z
source last accessed on: 2021-08-01T01:06:53Z
definition: Companies engaged in the manufacturing of plumbing fixtures and fittings. Includes manufacturers of products such as stainless steel pipe fittings, copper fittings, couplings, drainage pipe fittings, elbow fittings flanges, industrial pipe fitting, PVC Fittings, PVC Pipe fitting, pipe couplings, pipe elbows, pipe fittings, pipe reducers, pipe tees, pipe unions and plastic pipe fittings.
notation: 5320302015
valid from: 2020
is activity of: Construction Supplies & Fixtures

Kitchen Cabinets
type: NamedIndividual
type: Activity
type: BusinessClassification
is contemporary version of: http://data.ga-group.nl/ics/trbc/5320302016
is version of: http://data.ga-group.nl/ics/trbc/5320302016
replaces: http://data.ga-group.nl/ics/trbc/2012/5320302016
imported on: 2023-04-07T16:52:39.364811Z
last refreshed on: 2026-06-05T07:16:11.699Z
source accessed on: 2017-12-31T07:04:19Z
source last accessed on: 2021-08-01T01:06:53Z
definition: Companies engaged in the manufacturing of kitchen cabinets, such as metal household-type furniture and freestanding cabinets. The furniture may be made on a stock or custom basis and may be assembled or unassembled (i.e. knockdown).
notation: 5320302016
valid from: 2020
is activity of: Construction Supplies & Fixtures

Bathroom Fixtures
type: NamedIndividual
type: Activity
type: BusinessClassification
is contemporary version of: http://data.ga-group.nl/ics/trbc/5320302017
is version of: http://data.ga-group.nl/ics/trbc/5320302017
replaces: http://data.ga-group.nl/ics/trbc/2012/5320302017
imported on: 2023-04-07T16:52:39.364811Z
last refreshed on: 2026-06-05T07:16:11.699Z
source accessed on: 2017-12-31T07:04:19Z
source last accessed on: 2021-08-01T01:06:53Z
definition: Companies engaged in the manufacturing of bathroom fixtures, such as washbasins, baths, shower cabinets, faucets, among others.
notation: 5320302017
valid from: 2020
is activity of: Construction Supplies & Fixtures

Roofing Supplies
type: NamedIndividual
type: Activity
type: BusinessClassification
is contemporary version of: http://data.ga-group.nl/ics/trbc/5320302018
is version of: http://data.ga-group.nl/ics/trbc/5320302018
replaces: http://data.ga-group.nl/ics/trbc/2012/5320302018
imported on: 2023-04-07T16:52:39.364811Z
last refreshed on: 2026-06-05T07:16:11.699Z
source accessed on: 2017-12-31T07:04:19Z
source last accessed on: 2021-08-01T01:06:53Z
definition: Companies engaged in the manufacturing of roofing supplies, such as roof tiles and gutters.
notation: 5320302018
valid from: 2020
is activity of: Construction Supplies & Fixtures

Lighting Fixtures
type: NamedIndividual
type: Activity
type: BusinessClassification
is contemporary version of: http://data.ga-group.nl/ics/trbc/5320302019
is version of: http://data.ga-group.nl/ics/trbc/5320302019
replaces: http://data.ga-group.nl/ics/trbc/2012/5320302019
imported on: 2023-04-07T16:52:39.364811Z
last refreshed on: 2026-06-05T07:16:11.699Z
source accessed on: 2017-12-31T07:04:19Z
source last accessed on: 2021-08-01T01:06:53Z
definition: Companies engaged in the manufacturing of lighting fixtures, such as all kind of lamps and illuminations.
notation: 5320302019
valid from: 2020
is activity of: Construction Supplies & Fixtures

Construction Supplies & Fixtures Wholesale
type: NamedIndividual
type: Activity
type: BusinessClassification
is contemporary version of: http://data.ga-group.nl/ics/trbc/5320302020
is version of: http://data.ga-group.nl/ics/trbc/5320302020
replaces: http://data.ga-group.nl/ics/trbc/2012/5320302020
imported on: 2023-04-07T16:52:39.364811Z
last refreshed on: 2026-06-05T07:16:11.699Z
source accessed on: 2017-12-31T07:04:19Z
source last accessed on: 2021-08-01T01:06:53Z
definition: Companies engaged in the wholesale of construction supplies and fixtures.
notation: 5320302020
valid from: 2020
is activity of: Construction Supplies & Fixtures

Construction Supplies & Fixtures
type: NamedIndividual
type: BusinessClassification
type: Industry
is contemporary version of: http://data.ga-group.nl/ics/trbc/53203020
is version of: http://data.ga-group.nl/ics/trbc/53203020
replaces: http://data.ga-group.nl/ics/trbc/2012/53203020
imported on: 2023-04-07T16:52:39.364811Z
last refreshed on: 2026-06-05T07:16:11.699Z
source accessed on: 2017-12-31T07:04:19Z
source last accessed on: 2021-08-01T01:06:53Z
definition: Manufacturers of value-added building products and home improvement components. Includes, door and window frames, moldings and trims, tile, roofing, gutters, floorboards, insulating material, plumbing fixtures, cabinets and other building supplies.
notation: 53203020
valid from: 2020
is industry of: Homebuilding & Construction Supplies

Homebuilding & Construction Supplies
type: NamedIndividual
type: BusinessClassification
type: IndustryGroup
is contemporary version of: http://data.ga-group.nl/ics/trbc/532030
is version of: http://data.ga-group.nl/ics/trbc/532030
replaces: http://data.ga-group.nl/ics/trbc/2012/532030
imported on: 2023-04-07T16:52:39.364811Z
last refreshed on: 2026-06-05T07:16:11.699Z
source accessed on: 2017-12-31T07:04:19Z
source last accessed on: 2021-08-01T01:06:53Z
definition: Builders of residential homes, mobile homes and prefabricated homes, and manufacturers of value-added building products and home improvement components.
notation: 532030
valid from: 2020
is industry group of: Cyclical Consumer Products

Appliances, Tools & Housewares (NEC)
type: NamedIndividual
type: Activity
type: BusinessClassification
is contemporary version of: http://data.ga-group.nl/ics/trbc/5320403010
is version of: http://data.ga-group.nl/ics/trbc/5320403010
replaces: http://data.ga-group.nl/ics/trbc/2012/5320403010
imported on: 2023-04-07T16:52:39.364811Z
last refreshed on: 2026-06-05T07:16:11.699Z
source accessed on: 2017-12-31T07:04:19Z
source last accessed on: 2021-08-01T01:06:53Z
definition: Companies involved in at least two activities under the Appliances, Tools & Housewares industry, none being dominant: includes manufacturing of kitchen appliances, hand and light power tools, gardening tools, cookware, silverware and other household goods. Includes manufacturers of stoves, refrigerators, blenders, washer/dryers, vacuum cleaners, pottery, hairdryers, clocks, home use drills, lawnmowers, rakes, shovels, as well as silverware, china, cutlery, cooking utensils and other related housewares. Excludes: (commercial use power tools, classified in Industrial Machinery & Equipment), (audio/video equipment, classified in Household Electronics), (furniture and carpets, classified in Home Furnishing).
notation: 5320403010
valid from: 2020
is activity of: Appliances, Tools & Housewares

Household Appliances
type: NamedIndividual
type: Activity
type: BusinessClassification
is contemporary version of: http://data.ga-group.nl/ics/trbc/5320403011
is version of: http://data.ga-group.nl/ics/trbc/5320403011
replaces: http://data.ga-group.nl/ics/trbc/2012/5320403011
imported on: 2023-04-07T16:52:39.364811Z
last refreshed on: 2026-06-05T07:16:11.699Z
source accessed on: 2017-12-31T07:04:19Z
source last accessed on: 2021-08-01T01:06:53Z
definition: Companies engaged in the manufacturing of household appliances, such as washer/dryers, vacuum cleaners, hairdryers, home use drills, lawnmowers, among others.
notation: 5320403011
valid from: 2020
is activity of: Appliances, Tools & Housewares

Tools & Housewares
type: NamedIndividual
type: Activity
type: BusinessClassification
is contemporary version of: http://data.ga-group.nl/ics/trbc/5320403012
is version of: http://data.ga-group.nl/ics/trbc/5320403012
replaces: http://data.ga-group.nl/ics/trbc/2012/5320403012
imported on: 2023-04-07T16:52:39.364811Z
last refreshed on: 2026-06-05T07:16:11.699Z
source accessed on: 2017-12-31T07:04:19Z
source last accessed on: 2021-08-01T01:06:53Z
definition: Companies engaged in the manufacturing of hand, light power and gardening tools, cookware, pottery, china, cooking utensils and others.
notation: 5320403012
valid from: 2020
is activity of: Appliances, Tools & Housewares

Kitchen Appliances
type: NamedIndividual
type: Activity
type: BusinessClassification
is contemporary version of: http://data.ga-group.nl/ics/trbc/5320403013
is version of: http://data.ga-group.nl/ics/trbc/5320403013
replaces: http://data.ga-group.nl/ics/trbc/2012/5320403013
imported on: 2023-04-07T16:52:39.364811Z
last refreshed on: 2026-06-05T07:16:11.699Z
source accessed on: 2017-12-31T07:04:19Z
source last accessed on: 2021-08-01T01:06:53Z
definition: Companies engaged in the manufacturing of kitchen appliances, such as refrigerators, blenders, cookers, stoves, ovens, microwaves, juice extractors, among others.
notation: 5320403013
valid from: 2020
is activity of: Appliances, Tools & Housewares

Cutlery & Flatware
type: NamedIndividual
type: Activity
type: BusinessClassification
is contemporary version of: http://data.ga-group.nl/ics/trbc/5320403014
is version of: http://data.ga-group.nl/ics/trbc/5320403014
replaces: http://data.ga-group.nl/ics/trbc/2012/5320403014
imported on: 2023-04-07T16:52:39.364811Z
last refreshed on: 2026-06-05T07:16:11.699Z
source accessed on: 2017-12-31T07:04:19Z
source last accessed on: 2021-08-01T01:06:53Z
definition: Companies engaged in the manufacturing of cutlery and flatware. Some of the common types of cutlery are knives, spoons and forks and related cutting instruments. Includes also manufacturers of dishes, bowls, cups, mugs, and glasses.
notation: 5320403014
valid from: 2020
is activity of: Appliances, Tools & Housewares

Appliance & Houseware Wholesale
type: NamedIndividual
type: Activity
type: BusinessClassification
is contemporary version of: http://data.ga-group.nl/ics/trbc/5320403015
is version of: http://data.ga-group.nl/ics/trbc/5320403015
replaces: http://data.ga-group.nl/ics/trbc/2012/5320403015
imported on: 2023-04-07T16:52:39.364811Z
last refreshed on: 2026-06-05T07:16:11.699Z
source accessed on: 2017-12-31T07:04:19Z
source last accessed on: 2021-08-01T01:06:53Z
definition: Companies engaged in the wholesale of household appliances and housewares.
notation: 5320403015
valid from: 2020
is activity of: Appliances, Tools & Housewares

Luxury Appliances
type: NamedIndividual
type: Activity
type: BusinessClassification
is contemporary version of: http://data.ga-group.nl/ics/trbc/5320403016
is version of: http://data.ga-group.nl/ics/trbc/5320403016
replaces: http://data.ga-group.nl/ics/trbc/2012/5320403016
imported on: 2023-04-07T16:52:39.364811Z
last refreshed on: 2026-06-05T07:16:11.699Z
source accessed on: 2017-12-31T07:04:19Z
source last accessed on: 2021-08-01T01:06:53Z
definition: Companies engaged in the manufacture of luxury household appliances, such as luxury kitchen appliances, stoves, refrigerators, blenders, washer/dryers, vacuum cleaners, hairdryers, home use drills, lawnmowers, among others.
notation: 5320403016
valid from: 2020
is activity of: Appliances, Tools & Housewares

Appliances, Tools & Housewares
type: NamedIndividual
type: BusinessClassification
type: Industry
is contemporary version of: http://data.ga-group.nl/ics/trbc/53204030
is version of: http://data.ga-group.nl/ics/trbc/53204030
replaces: http://data.ga-group.nl/ics/trbc/2012/53204030
imported on: 2023-04-07T16:52:39.364811Z
last refreshed on: 2026-06-05T07:16:11.699Z
source accessed on: 2017-12-31T07:04:19Z
source last accessed on: 2021-08-01T01:06:53Z
definition: Manufacturers of kitchen appliances, hand and light power tools, gardening tools, cookware, silverware and other household goods. Includes manufacturers of stoves, refrigerators, blenders, washer/dryers, vacuum cleaners, pottery, hairdryers, clocks, home use drills, lawnmowers, rakes, shovels, as well as silverware, china, cutlery, cooking utensils and other related house wares.
notation: 53204030
valid from: 2020
is industry of: Household Goods

Home Furnishings (NEC)
type: NamedIndividual
type: Activity
type: BusinessClassification
is contemporary version of: http://data.ga-group.nl/ics/trbc/5320404010
is version of: http://data.ga-group.nl/ics/trbc/5320404010
replaces: http://data.ga-group.nl/ics/trbc/2012/5320404010
imported on: 2023-04-07T16:52:39.364811Z
last refreshed on: 2026-06-05T07:16:11.699Z
source accessed on: 2017-12-31T07:04:19Z
source last accessed on: 2021-08-01T01:06:53Z
definition: Companies involved in at least two activities under the Home Furnishing Industry, none being dominant: includes manufacturing of furniture, non-upholstered kitchenware, floor coverings, wall coverings and related furnishings. Includes also manufacturers of couches, mattresses, bed frames and headboards, desks, tables, chairs, tables, draws, entertainment centers and stands, wall units, outdoor furniture, carpets, rugs, wall paper, blinds, shades and curtains. Excludes: (tiles, classified in Construction Supplies & Fixtures), (pianos, classified in Recreational Products).
notation: 5320404010
valid from: 2020
is activity of: Home Furnishings

Carpets & Curtains
type: NamedIndividual
type: Activity
type: BusinessClassification
is contemporary version of: http://data.ga-group.nl/ics/trbc/5320404011
is version of: http://data.ga-group.nl/ics/trbc/5320404011
replaces: http://data.ga-group.nl/ics/trbc/2012/5320404011
imported on: 2023-04-07T16:52:39.364811Z
last refreshed on: 2026-06-05T07:16:11.699Z
source accessed on: 2017-12-31T07:04:19Z
source last accessed on: 2021-08-01T01:06:53Z
definition: Companies engaged in the manufacturing of carpets, rugs and curtains, blinds and shades.
notation: 5320404011
valid from: 2020
is activity of: Home Furnishings

Wallpaper
type: NamedIndividual
type: Activity
type: BusinessClassification
is contemporary version of: http://data.ga-group.nl/ics/trbc/5320404012
is version of: http://data.ga-group.nl/ics/trbc/5320404012
replaces: http://data.ga-group.nl/ics/trbc/2012/5320404012
imported on: 2023-04-07T16:52:39.364811Z
last refreshed on: 2026-06-05T07:16:11.699Z
source accessed on: 2017-12-31T07:04:19Z
source last accessed on: 2021-08-01T01:06:53Z
definition: Companies engaged in the manufacturing of wallpaper. Wallpaper is a kind of material used to cover and decorate the interior walls of homes, offices, and other buildings. Wallpapers can come plain (so that it can be painted), textured (such as Anaglypta), or with patterned graphics.
notation: 5320404012
valid from: 2020
is activity of: Home Furnishings

Furniture & Art
type: NamedIndividual
type: Activity
type: BusinessClassification
is contemporary version of: http://data.ga-group.nl/ics/trbc/5320404013
is version of: http://data.ga-group.nl/ics/trbc/5320404013
replaces: http://data.ga-group.nl/ics/trbc/2012/5320404013
imported on: 2023-04-07T16:52:39.364811Z
last refreshed on: 2023-04-07T17:12:26.910158Z
source accessed on: 2017-12-31T07:04:19Z
source last accessed on: 2020-09-13T08:40:59Z
definition: Companies engaged in the manufacturing of home furniture, such as couches, mattresses, bed frames and headboards, desks, tables, chairs, tables, draws and others. Includes also the designers and providers of applied art items, paintings, sculptures and other pieces of art.
notation: 5320404013
valid from: 2020
is activity of: Home Furnishings

Luxury Furnishing
type: NamedIndividual
type: Activity
type: BusinessClassification
is contemporary version of: http://data.ga-group.nl/ics/trbc/5320404014
is version of: http://data.ga-group.nl/ics/trbc/5320404014
replaces: http://data.ga-group.nl/ics/trbc/2012/5320404014
imported on: 2023-04-07T16:52:39.364811Z
last refreshed on: 2026-06-05T07:16:11.699Z
source accessed on: 2017-12-31T07:04:19Z
source last accessed on: 2021-08-01T01:06:53Z
definition: Companies engaged in the manufacturing of luxury furniture, non-upholstered kitchenware, floor coverings, wall coverings and related furnishings. Includes manufacturers of luxury couches, mattresses, bed frames and headboards, desks, tables, chairs, tables, draws, entertainment centers and stands, wall units, outdoor furniture, carpets, rugs, wall paper, blinds, shades and curtains.
notation: 5320404014
valid from: 2020
is activity of: Home Furnishings

Antiques
type: NamedIndividual
type: Activity
type: BusinessClassification
is contemporary version of: http://data.ga-group.nl/ics/trbc/5320404015
is version of: http://data.ga-group.nl/ics/trbc/5320404015
replaces: http://data.ga-group.nl/ics/trbc/2012/5320404015
imported on: 2023-04-07T16:52:39.364811Z
last refreshed on: 2026-06-05T07:16:11.699Z
source accessed on: 2017-12-31T07:04:19Z
source last accessed on: 2021-08-01T01:06:53Z
definition: Companies engaged in the renovation and distribution of antiques, as well as the production of antique-style furniture. Antique furniture is collectible interior furnishings of considerable age.
notation: 5320404015
valid from: 2020
is activity of: Home Furnishings

Home Furnishings Wholesale
type: NamedIndividual
type: Activity
type: BusinessClassification
is contemporary version of: http://data.ga-group.nl/ics/trbc/5320404016
is version of: http://data.ga-group.nl/ics/trbc/5320404016
replaces: http://data.ga-group.nl/ics/trbc/2012/5320404016
imported on: 2023-04-07T16:52:39.364811Z
last refreshed on: 2026-06-05T07:16:11.699Z
source accessed on: 2017-12-31T07:04:19Z
source last accessed on: 2021-08-01T01:06:53Z
definition: Companies engaged in the wholesale of home furniture, non-upholstered kitchenware, floor coverings, wall coverings and related furnishings. Includes wholesale of couches, mattresses, bed frames and headboards, desks, tables, chairs, tables, draws, entertainment centers and stands, wall units, outdoor furniture, carpets, rugs, wall paper, blinds, shades and curtains.
notation: 5320404016
valid from: 2020
is activity of: Home Furnishings

Furniture
type: NamedIndividual
type: Activity
type: BusinessClassification
is contemporary version of: http://data.ga-group.nl/ics/trbc/5320404017
is version of: http://data.ga-group.nl/ics/trbc/5320404017
imported on: 2023-04-07T17:17:07.492231Z
last refreshed on: 2026-06-05T07:16:11.699Z
source accessed on: 2021-04-25T05:48:36Z
source last accessed on: 2021-08-01T01:06:53Z
definition: Companies engaged in the manufacturing of home furniture, such as couches, mattresses, bed frames and headboards, desks, tables, chairs, tables, draws and others.
notation: 5320404017
valid from: 2020
is activity of: Home Furnishings

Art & Craftwork
type: NamedIndividual
type: Activity
type: BusinessClassification
is contemporary version of: http://data.ga-group.nl/ics/trbc/5320404018
is version of: http://data.ga-group.nl/ics/trbc/5320404018
imported on: 2023-04-07T17:17:07.492231Z
last refreshed on: 2026-06-05T07:16:11.699Z
source accessed on: 2021-04-25T05:48:36Z
source last accessed on: 2021-08-01T01:06:53Z
definition: Companies engaged in the design and provision of art pieces, such as paintings, sculptures, carvings, and craftwork, such as decorative handicraft, pottery, metal works, glass works, home décor items, among others.
notation: 5320404018
valid from: 2020
is activity of: Home Furnishings

Home Furnishings
type: NamedIndividual
type: BusinessClassification
type: Industry
is contemporary version of: http://data.ga-group.nl/ics/trbc/53204040
is version of: http://data.ga-group.nl/ics/trbc/53204040
replaces: http://data.ga-group.nl/ics/trbc/2012/53204040
imported on: 2023-04-07T16:52:39.364811Z
last refreshed on: 2026-06-05T07:16:11.699Z
source accessed on: 2017-12-31T07:04:19Z
source last accessed on: 2021-08-01T01:06:53Z
definition: Manufacturers of furniture, non-upholstered kitchenware, floor coverings, wall coverings and related furnishings. Includes producers of couches, mattresses, bed frames and headboards, desks, tables, chairs, tables, draws, entertainment centers and stands, wall units, outdoor furniture, carpets, rugs, wall paper, blinds, shades and curtains.
notation: 53204040
valid from: 2020
is industry of: Household Goods

Household Goods
type: NamedIndividual
type: BusinessClassification
type: IndustryGroup
is contemporary version of: http://data.ga-group.nl/ics/trbc/532040
is version of: http://data.ga-group.nl/ics/trbc/532040
replaces: http://data.ga-group.nl/ics/trbc/2012/532040
imported on: 2023-04-07T16:52:39.364811Z
last refreshed on: 2026-06-05T07:16:11.699Z
source accessed on: 2017-12-31T07:04:19Z
source last accessed on: 2021-08-01T01:06:53Z
definition: Manufacturers of household appliances, tools, house wares and home furnishing goods.
notation: 532040
valid from: 2020
is industry group of: Cyclical Consumer Products

Toys & Children's Products (NEC)
type: NamedIndividual
type: Activity
type: BusinessClassification
is contemporary version of: http://data.ga-group.nl/ics/trbc/5320501010
is version of: http://data.ga-group.nl/ics/trbc/5320501010
replaces: http://data.ga-group.nl/ics/trbc/2012/5320501010
imported on: 2023-04-07T16:52:39.364811Z
last refreshed on: 2026-06-05T07:16:11.699Z
source accessed on: 2017-12-31T07:04:19Z
source last accessed on: 2021-08-01T01:06:53Z
definition: Companies involved in at least two activities under the Toys & Children's Products industry, none being dominant: includes production of toys, games, computer games and consoles. Excludes: (motorcycles and snowmobiles, classified in Auto & Truck Manufacturers ), (digital cameras and peripherals, classified in Household Electronics).
notation: 5320501010
valid from: 2020
is activity of: Toys & Children's Products

Dolls & Stuffed Toys
type: NamedIndividual
type: Activity
type: BusinessClassification
is contemporary version of: http://data.ga-group.nl/ics/trbc/5320501011
is version of: http://data.ga-group.nl/ics/trbc/5320501011
replaces: http://data.ga-group.nl/ics/trbc/2012/5320501011
imported on: 2023-04-07T16:52:39.364811Z
last refreshed on: 2026-06-05T07:16:11.699Z
source accessed on: 2017-12-31T07:04:19Z
source last accessed on: 2021-08-01T01:06:53Z
definition: Companies engaged in the production of dolls and stuffed toys.
notation: 5320501011
valid from: 2020
is activity of: Toys & Children's Products

Games, Toys & Children's Vehicles
type: NamedIndividual
type: Activity
type: BusinessClassification
is contemporary version of: http://data.ga-group.nl/ics/trbc/5320501012
is version of: http://data.ga-group.nl/ics/trbc/5320501012
replaces: http://data.ga-group.nl/ics/trbc/2012/5320501012
imported on: 2023-04-07T16:52:39.364811Z
last refreshed on: 2026-06-05T07:16:11.699Z
source accessed on: 2017-12-31T07:04:19Z
source last accessed on: 2021-08-01T01:06:53Z
definition: Companies engaged in the production of traditional games, toys and vehicles for children.
notation: 5320501012
valid from: 2020
is activity of: Toys & Children's Products

Children's Safety Products
type: NamedIndividual
type: Activity
type: BusinessClassification
is contemporary version of: http://data.ga-group.nl/ics/trbc/5320501013
is version of: http://data.ga-group.nl/ics/trbc/5320501013
replaces: http://data.ga-group.nl/ics/trbc/2012/5320501013
imported on: 2023-04-07T16:52:39.364811Z
last refreshed on: 2026-06-05T07:16:11.699Z
source accessed on: 2017-12-31T07:04:19Z
source last accessed on: 2021-08-01T01:06:53Z
definition: Companies engaged in the production of children's safety products, such as child safety seats, child safety locks, baby safety bumper pads and corner pads, baby monitors, baby safety gates and others.
notation: 5320501013
valid from: 2020
is activity of: Toys & Children's Products

Children's Furniture
type: NamedIndividual
type: Activity
type: BusinessClassification
is contemporary version of: http://data.ga-group.nl/ics/trbc/5320501014
is version of: http://data.ga-group.nl/ics/trbc/5320501014
replaces: http://data.ga-group.nl/ics/trbc/2012/5320501014
imported on: 2023-04-07T16:52:39.364811Z
last refreshed on: 2026-06-05T07:16:11.699Z
source accessed on: 2017-12-31T07:04:19Z
source last accessed on: 2021-08-01T01:06:53Z
definition: Companies engaged in the production of children's furniture, such as baby cribs, cradles, toddler beds, playpens, nursery furniture and other children's furniture.
notation: 5320501014
valid from: 2020
is activity of: Toys & Children's Products

Children's Products & Accessories
type: NamedIndividual
type: Activity
type: BusinessClassification
is contemporary version of: http://data.ga-group.nl/ics/trbc/5320501015
is version of: http://data.ga-group.nl/ics/trbc/5320501015
replaces: http://data.ga-group.nl/ics/trbc/2012/5320501015
imported on: 2023-04-07T16:52:39.364811Z
last refreshed on: 2026-06-05T07:16:11.699Z
source accessed on: 2017-12-31T07:04:19Z
source last accessed on: 2021-08-01T01:06:53Z
definition: Companies engaged in the production of baby carriages and strollers, baby walkers, baby crockery and cutlery, baby pacifiers, children's cosmetics and care products.
notation: 5320501015
valid from: 2020
is activity of: Toys & Children's Products

Toys & Children's Products Wholesale
type: NamedIndividual
type: Activity
type: BusinessClassification
is contemporary version of: http://data.ga-group.nl/ics/trbc/5320501016
is version of: http://data.ga-group.nl/ics/trbc/5320501016
replaces: http://data.ga-group.nl/ics/trbc/2012/5320501016
imported on: 2023-04-07T16:52:39.364811Z
last refreshed on: 2026-06-05T07:16:11.699Z
source accessed on: 2017-12-31T07:04:19Z
source last accessed on: 2021-08-01T01:06:53Z
definition: Companies engaged in the wholesale of toys and children's products.
notation: 5320501016
valid from: 2020
is activity of: Toys & Children's Products

Toys & Children's Products
type: NamedIndividual
type: BusinessClassification
type: Industry
is contemporary version of: http://data.ga-group.nl/ics/trbc/53205010
is version of: http://data.ga-group.nl/ics/trbc/53205010
replaces: http://data.ga-group.nl/ics/trbc/2012/53205010
imported on: 2023-04-07T16:52:39.364811Z
last refreshed on: 2026-06-05T07:16:11.699Z
source accessed on: 2017-12-31T07:04:19Z
source last accessed on: 2021-08-01T01:06:53Z
definition: Manufacturers of toys, games, computer games and consoles. Includes also producers of prenatal and preschool products such as prams, carriers and cots.
notation: 53205010
valid from: 2020
is industry of: Leisure Products

Recreational Products (NEC)
type: NamedIndividual
type: Activity
type: BusinessClassification
is contemporary version of: http://data.ga-group.nl/ics/trbc/5320502010
is version of: http://data.ga-group.nl/ics/trbc/5320502010
replaces: http://data.ga-group.nl/ics/trbc/2012/5320502010
imported on: 2023-04-07T16:52:39.364811Z
last refreshed on: 2026-06-05T07:16:11.699Z
source accessed on: 2017-12-31T07:04:19Z
source last accessed on: 2021-08-01T01:06:53Z
definition: Companies involved in at least two activities under the Recreational Products industry, none being dominant: includes manufacturing of sporting goods, camping equipment, RVs, bicycles and musical instruments. Excludes: (motorcycles and snowmobiles, classified in Auto & Truck Manufacturers), (digital cameras and peripherals, classified in Household Electronics), (golf courses, travel agencies and amusement parks, classified in Leisure & Recreation).
notation: 5320502010
valid from: 2020
is activity of: Recreational Products

Sailing Yachts & Motorboats
type: NamedIndividual
type: Activity
type: BusinessClassification
is contemporary version of: http://data.ga-group.nl/ics/trbc/5320502011
is version of: http://data.ga-group.nl/ics/trbc/5320502011
replaces: http://data.ga-group.nl/ics/trbc/2012/5320502011
imported on: 2023-04-07T16:52:39.364811Z
last refreshed on: 2026-06-05T07:16:11.699Z
source accessed on: 2017-12-31T07:04:19Z
source last accessed on: 2021-08-01T01:06:53Z
definition: Companies engaged in the manufacturing of sailing yachts and motorboats.
notation: 5320502011
valid from: 2020
is activity of: Recreational Products

Bicycle Manufacturing
type: NamedIndividual
type: Activity
type: BusinessClassification
is contemporary version of: http://data.ga-group.nl/ics/trbc/5320502012
is version of: http://data.ga-group.nl/ics/trbc/5320502012
replaces: http://data.ga-group.nl/ics/trbc/2012/5320502012
imported on: 2023-04-07T16:52:39.364811Z
last refreshed on: 2026-06-05T07:16:11.699Z
source accessed on: 2017-12-31T07:04:19Z
source last accessed on: 2021-08-01T01:06:53Z
definition: Companies engaged in the manufacturing of bicycles and bicycle accessories. Excluding electric scooters and bicycles covered under the Electric Scooters & Bicycles activity.
notation: 5320502012
valid from: 2020
is activity of: Recreational Products

Sporting & Outdoor Goods
type: NamedIndividual
type: Activity
type: BusinessClassification
is contemporary version of: http://data.ga-group.nl/ics/trbc/5320502013
is version of: http://data.ga-group.nl/ics/trbc/5320502013
replaces: http://data.ga-group.nl/ics/trbc/2012/5320502013
imported on: 2023-04-07T16:52:39.364811Z
last refreshed on: 2026-06-05T07:16:11.699Z
source accessed on: 2017-12-31T07:04:19Z
source last accessed on: 2021-08-01T01:06:53Z
definition: Companies engaged in the manufacturing of sporting goods, such as athletic goods, gymnasium and playground equipment, swimming pools as well as outdoor goods, such as tents, camping, mountain and diving equipment, among others.
notation: 5320502013
valid from: 2020
is activity of: Recreational Products

Musical Instruments
type: NamedIndividual
type: Activity
type: BusinessClassification
is contemporary version of: http://data.ga-group.nl/ics/trbc/5320502014
is version of: http://data.ga-group.nl/ics/trbc/5320502014
replaces: http://data.ga-group.nl/ics/trbc/2012/5320502014
imported on: 2023-04-07T16:52:39.364811Z
last refreshed on: 2026-06-05T07:16:11.699Z
source accessed on: 2017-12-31T07:04:19Z
source last accessed on: 2021-08-01T01:06:53Z
definition: Companies engaged in the manufacturing of musical instruments, including Autophones, Banjos, Bells, Chimes and parts, Drums (musical instruments), parts, and accessories, Electric musical instruments, Flutes and parts, Guitars and parts, Hammers, Piano, Keyboards, Mandolins, Mouthpieces for musical instruments, Percussion musical instruments, Saxophones and parts, Trumpets and parts, Violins and Xylophones.
notation: 5320502014
valid from: 2020
is activity of: Recreational Products

Luxury Recreational Products
type: NamedIndividual
type: Activity
type: BusinessClassification
is contemporary version of: http://data.ga-group.nl/ics/trbc/5320502015
is version of: http://data.ga-group.nl/ics/trbc/5320502015
replaces: http://data.ga-group.nl/ics/trbc/2012/5320502015
imported on: 2023-04-07T16:52:39.364811Z
last refreshed on: 2026-06-05T07:16:11.699Z
source accessed on: 2017-12-31T07:04:19Z
source last accessed on: 2021-08-01T01:06:53Z
definition: Companies engaged in the manufacturing of luxury sporting goods, such as luxury yachts, camping equipment, RVs, bicycles and musical instruments.
notation: 5320502015
valid from: 2020
is activity of: Recreational Products

Leisure Products Wholesale
type: NamedIndividual
type: Activity
type: BusinessClassification
is contemporary version of: http://data.ga-group.nl/ics/trbc/5320502016
is version of: http://data.ga-group.nl/ics/trbc/5320502016
replaces: http://data.ga-group.nl/ics/trbc/2012/5320502016
imported on: 2023-04-07T16:52:39.364811Z
last refreshed on: 2026-06-05T07:16:11.699Z
source accessed on: 2017-12-31T07:04:19Z
source last accessed on: 2021-08-01T01:06:53Z
definition: Companies engaged in the wholesale of sporting goods, camping equipment, RVs, bicycles and musical instruments.
notation: 5320502016
valid from: 2020
is activity of: Recreational Products

Electric Scooters & Bicycles
type: NamedIndividual
type: Activity
type: BusinessClassification
is contemporary version of: http://data.ga-group.nl/ics/trbc/5320502017
is version of: http://data.ga-group.nl/ics/trbc/5320502017
imported on: 2023-04-07T17:17:07.492231Z
last refreshed on: 2026-06-05T07:16:11.699Z
source accessed on: 2021-04-25T05:48:36Z
source last accessed on: 2021-08-01T01:06:53Z
definition: Companies engaged in the manufacturing of electric-powered scooters and bicycles, including their parts and accessories.
notation: 5320502017
valid from: 2020
is activity of: Recreational Products

Recreational Products
type: NamedIndividual
type: BusinessClassification
type: Industry
is contemporary version of: http://data.ga-group.nl/ics/trbc/53205020
is version of: http://data.ga-group.nl/ics/trbc/53205020
replaces: http://data.ga-group.nl/ics/trbc/2012/53205020
imported on: 2023-04-07T16:52:39.364811Z
last refreshed on: 2026-06-05T07:16:11.699Z
source accessed on: 2017-12-31T07:04:19Z
source last accessed on: 2021-08-01T01:06:53Z
definition: Manufacturers of sporting goods, camping equipment, motor homes, caravans, bicycles and musical instruments.
notation: 53205020
valid from: 2020
is industry of: Leisure Products

Leisure Products
type: NamedIndividual
type: BusinessClassification
type: IndustryGroup
is contemporary version of: http://data.ga-group.nl/ics/trbc/532050
is version of: http://data.ga-group.nl/ics/trbc/532050
replaces: http://data.ga-group.nl/ics/trbc/2012/532050
imported on: 2023-04-07T16:52:39.364811Z
last refreshed on: 2026-06-05T07:16:11.699Z
source accessed on: 2017-12-31T07:04:19Z
source last accessed on: 2021-08-01T01:06:53Z
definition: Manufacturers of toys, games, computer games and consoles, as well as recreational products, such as sporting goods, camping equipment, musical instruments and bicycles.
notation: 532050
valid from: 2020
is industry group of: Cyclical Consumer Products

Cyclical Consumer Products
type: NamedIndividual
type: BusinessClassification
type: BusinessSector
is contemporary version of: http://data.ga-group.nl/ics/trbc/5320
is version of: http://data.ga-group.nl/ics/trbc/5320
replaces: http://data.ga-group.nl/ics/trbc/2012/5320
imported on: 2023-04-07T16:52:39.364811Z
last refreshed on: 2026-06-05T07:16:11.699Z
source accessed on: 2017-12-31T07:04:19Z
source last accessed on: 2021-08-01T01:06:53Z
definition: Manufacturers and producers of durable goods such as household goods, as well as textiles, Apparel & Accessories. Includes homebuilders.
notation: 5320
valid from: 2020
is business sector of: Consumer Cyclicals

Hotels, Motels & Cruise Lines (NEC)
type: NamedIndividual
type: Activity
type: BusinessClassification
is contemporary version of: http://data.ga-group.nl/ics/trbc/5330101010
is version of: http://data.ga-group.nl/ics/trbc/5330101010
replaces: http://data.ga-group.nl/ics/trbc/2012/5330101010
imported on: 2023-04-07T16:52:39.364811Z
last refreshed on: 2026-06-05T07:16:11.699Z
source accessed on: 2017-12-31T07:04:19Z
source last accessed on: 2021-08-01T01:06:53Z
definition: Companies involved in at least two activities under the Hotels, Motels & Cruise Lines Industry, none being dominant: operation of hotels, bed and breakfast inns, motels, cabins, cottages, youth hostels, cruise lines and other tourist and boarding lodges. Excludes: (hotels with casino operations, classified as Casinos & Gaming), (ski resorts and amusement parks with resort owned hotel service, where the ski or amusement operation comprises the dominant operation, classified in Leisure & Recreation).
notation: 5330101010
valid from: 2020
is activity of: Hotels, Motels & Cruise Lines

Hotels & Motels
type: NamedIndividual
type: Activity
type: BusinessClassification
is contemporary version of: http://data.ga-group.nl/ics/trbc/5330101011
is version of: http://data.ga-group.nl/ics/trbc/5330101011
replaces: http://data.ga-group.nl/ics/trbc/2012/5330101011
imported on: 2023-04-07T16:52:39.364811Z
last refreshed on: 2026-06-05T07:16:11.699Z
source accessed on: 2017-12-31T07:04:19Z
source last accessed on: 2021-08-01T01:06:53Z
definition: Companies engaged in the operation of hotels, bed and breakfast inns, motels, cabins, cottages, youth hostels and others.
notation: 5330101011
valid from: 2020
is activity of: Hotels, Motels & Cruise Lines

Cruise Lines
type: NamedIndividual
type: Activity
type: BusinessClassification
is contemporary version of: http://data.ga-group.nl/ics/trbc/5330101012
is version of: http://data.ga-group.nl/ics/trbc/5330101012
replaces: http://data.ga-group.nl/ics/trbc/2012/5330101012
imported on: 2023-04-07T16:52:39.364811Z
last refreshed on: 2026-06-05T07:16:11.699Z
source accessed on: 2017-12-31T07:04:19Z
source last accessed on: 2021-08-01T01:06:53Z
definition: Companies engaged in the operation of scenic and sightseeing cruise lines.
notation: 5330101012
valid from: 2020
is activity of: Hotels, Motels & Cruise Lines

Luxury Hotels
type: NamedIndividual
type: Activity
type: BusinessClassification
is contemporary version of: http://data.ga-group.nl/ics/trbc/5330101013
is version of: http://data.ga-group.nl/ics/trbc/5330101013
replaces: http://data.ga-group.nl/ics/trbc/2012/5330101013
imported on: 2023-04-07T16:52:39.364811Z
last refreshed on: 2026-06-05T07:16:11.699Z
source accessed on: 2017-12-31T07:04:19Z
source last accessed on: 2021-08-01T01:06:53Z
definition: Companies engaged in the operation of upscale luxury and full service hotels.
notation: 5330101013
valid from: 2020
is activity of: Hotels, Motels & Cruise Lines

Resort Operators
type: NamedIndividual
type: Activity
type: BusinessClassification
is contemporary version of: http://data.ga-group.nl/ics/trbc/5330101014
is version of: http://data.ga-group.nl/ics/trbc/5330101014
replaces: http://data.ga-group.nl/ics/trbc/2012/5330101014
imported on: 2023-04-07T16:52:39.364811Z
last refreshed on: 2026-06-05T07:16:11.699Z
source accessed on: 2017-12-31T07:04:19Z
source last accessed on: 2021-08-01T01:06:53Z
definition: Companies engaged in the operation of holiday resorts that combine hotels, restaurants and sports & entertainment centers in one place, such as ski, seaside, spa, golf, all-inclusive resorts.
notation: 5330101014
valid from: 2020
is activity of: Hotels, Motels & Cruise Lines

Bed & Breakfast
type: NamedIndividual
type: Activity
type: BusinessClassification
is contemporary version of: http://data.ga-group.nl/ics/trbc/5330101015
is version of: http://data.ga-group.nl/ics/trbc/5330101015
replaces: http://data.ga-group.nl/ics/trbc/2012/5330101015
imported on: 2023-04-07T16:52:39.364811Z
last refreshed on: 2026-06-05T07:16:11.699Z
source accessed on: 2017-12-31T07:04:19Z
source last accessed on: 2021-08-01T01:06:53Z
definition: Companies engaged in the operation of bed and breakfast inns.
notation: 5330101015
valid from: 2020
is activity of: Hotels, Motels & Cruise Lines

Self-Catering Accommodation
type: NamedIndividual
type: Activity
type: BusinessClassification
is contemporary version of: http://data.ga-group.nl/ics/trbc/5330101016
is version of: http://data.ga-group.nl/ics/trbc/5330101016
replaces: http://data.ga-group.nl/ics/trbc/2012/5330101016
imported on: 2023-04-07T16:52:39.364811Z
last refreshed on: 2026-06-05T07:16:11.699Z
source accessed on: 2017-12-31T07:04:19Z
source last accessed on: 2021-08-01T01:06:53Z
definition: Companies engaged in the operation of self-catering holiday cottages, houses, flats and apartments.
notation: 5330101016
valid from: 2020
is activity of: Hotels, Motels & Cruise Lines

Campsite Operators
type: NamedIndividual
type: Activity
type: BusinessClassification
is contemporary version of: http://data.ga-group.nl/ics/trbc/5330101017
is version of: http://data.ga-group.nl/ics/trbc/5330101017
replaces: http://data.ga-group.nl/ics/trbc/2012/5330101017
imported on: 2023-04-07T16:52:39.364811Z
last refreshed on: 2026-06-05T07:16:11.699Z
source accessed on: 2017-12-31T07:04:19Z
source last accessed on: 2021-08-01T01:06:53Z
definition: Companies engaged in the operation of campsites, primarily to accommodate campers and their equipment, including tents, tent trailers, travel trailers, and RVs (recreational vehicles). These establishments may provide access to facilities, such as washrooms, laundry rooms, recreation halls and playgrounds, stores, and snack bars.
notation: 5330101017
valid from: 2020
is activity of: Hotels, Motels & Cruise Lines

Hotels, Motels & Cruise Lines
type: NamedIndividual
type: BusinessClassification
type: Industry
is contemporary version of: http://data.ga-group.nl/ics/trbc/53301010
is version of: http://data.ga-group.nl/ics/trbc/53301010
replaces: http://data.ga-group.nl/ics/trbc/2012/53301010
imported on: 2023-04-07T16:52:39.364811Z
last refreshed on: 2026-06-05T07:16:11.699Z
source accessed on: 2017-12-31T07:04:19Z
source last accessed on: 2021-08-01T01:06:53Z
definition: Operators of accommodation services including hotels, bed and breakfast inns, motels, cabins, cottages, youth hostels, cruise lines and other tourist and boarding lodges.
notation: 53301010
valid from: 2020
is industry of: Hotels & Entertainment Services

Restaurants & Bars (NEC)
type: NamedIndividual
type: Activity
type: BusinessClassification
is contemporary version of: http://data.ga-group.nl/ics/trbc/5330102010
is version of: http://data.ga-group.nl/ics/trbc/5330102010
replaces: http://data.ga-group.nl/ics/trbc/2012/5330102010
imported on: 2023-04-07T16:52:39.364811Z
last refreshed on: 2026-06-05T07:16:11.699Z
source accessed on: 2017-12-31T07:04:19Z
source last accessed on: 2021-08-01T01:06:53Z
definition: Companies involved in at least two activities under the Restaurants & Bars industry, none being dominant: operation of restaurants, diners, taverns, pubs, bars, nightclubs, banquet halls, fixed location snack bars, food cart vendors, food service contractors and companies engaged in commercial food service equipment wholesaling. Excludes: (catering services for airlines, classified in Airport Services).
notation: 5330102010
valid from: 2020
is activity of: Restaurants & Bars

Pubs, Bars & Night Clubs
type: NamedIndividual
type: Activity
type: BusinessClassification
is contemporary version of: http://data.ga-group.nl/ics/trbc/5330102011
is version of: http://data.ga-group.nl/ics/trbc/5330102011
replaces: http://data.ga-group.nl/ics/trbc/2012/5330102011
imported on: 2023-04-07T16:52:39.364811Z
last refreshed on: 2026-06-05T07:16:11.699Z
source accessed on: 2017-12-31T07:04:19Z
source last accessed on: 2021-08-01T01:06:53Z
definition: Companies engaged in the operation of pubs, bars and nightclubs.
notation: 5330102011
valid from: 2020
is activity of: Restaurants & Bars

Commercial Food Services
type: NamedIndividual
type: Activity
type: BusinessClassification
is contemporary version of: http://data.ga-group.nl/ics/trbc/5330102012
is version of: http://data.ga-group.nl/ics/trbc/5330102012
replaces: http://data.ga-group.nl/ics/trbc/2012/5330102012
imported on: 2023-04-07T16:52:39.364811Z
last refreshed on: 2026-06-05T07:16:11.699Z
source accessed on: 2017-12-31T07:04:19Z
source last accessed on: 2021-08-01T01:06:53Z
definition: Companies engaged in food service operations in lodging properties, clubs, restaurants, and other business that exist to make a profit from the sales of food and beverage products.
notation: 5330102012
valid from: 2020
is activity of: Restaurants & Bars

Quick Service Restaurants
type: NamedIndividual
type: Activity
type: BusinessClassification
is contemporary version of: http://data.ga-group.nl/ics/trbc/5330102013
is version of: http://data.ga-group.nl/ics/trbc/5330102013
replaces: http://data.ga-group.nl/ics/trbc/2012/5330102013
imported on: 2023-04-07T16:52:39.364811Z
last refreshed on: 2026-06-05T07:16:11.699Z
source accessed on: 2017-12-31T07:04:19Z
source last accessed on: 2021-08-01T01:06:53Z
definition: Companies engaged in the operation of quick service restaurants.
notation: 5330102013
valid from: 2020
is activity of: Restaurants & Bars

Mobile Caterers
type: NamedIndividual
type: Activity
type: BusinessClassification
is contemporary version of: http://data.ga-group.nl/ics/trbc/5330102014
is version of: http://data.ga-group.nl/ics/trbc/5330102014
replaces: http://data.ga-group.nl/ics/trbc/2012/5330102014
imported on: 2023-04-07T16:52:39.364811Z
last refreshed on: 2026-06-05T07:16:11.699Z
source accessed on: 2017-12-31T07:04:19Z
source last accessed on: 2021-08-01T01:06:53Z
definition: Companies engaged in the provision of mobile catering services, including selling prepared food from some sort of vehicle. It can be through a food cart, which is a motor less trailer that can be hauled by automobile, bicycle, or hand to the point of sale, often a public sidewalk or park.
notation: 5330102014
valid from: 2020
is activity of: Restaurants & Bars

Banquet Halls & Catering
type: NamedIndividual
type: Activity
type: BusinessClassification
is contemporary version of: http://data.ga-group.nl/ics/trbc/5330102015
is version of: http://data.ga-group.nl/ics/trbc/5330102015
replaces: http://data.ga-group.nl/ics/trbc/2012/5330102015
imported on: 2023-04-07T16:52:39.364811Z
last refreshed on: 2026-06-05T07:16:11.699Z
source accessed on: 2017-12-31T07:04:19Z
source last accessed on: 2021-08-01T01:06:53Z
definition: Companies engaged in the provision of banquet organization and associated services.
notation: 5330102015
valid from: 2020
is activity of: Restaurants & Bars

Cafés
type: NamedIndividual
type: Activity
type: BusinessClassification
is contemporary version of: http://data.ga-group.nl/ics/trbc/5330102016
is version of: http://data.ga-group.nl/ics/trbc/5330102016
replaces: http://data.ga-group.nl/ics/trbc/2012/5330102016
imported on: 2023-04-07T16:52:39.364811Z
last refreshed on: 2026-06-05T07:16:11.699Z
source accessed on: 2017-12-31T07:04:19Z
source last accessed on: 2021-08-01T01:06:53Z
definition: Companies engaged in the operation of cafes, coffee houses and coffee shops, often offering auxiliary snacks, such as prepared food, cakes, sandwiches.
notation: 5330102016
valid from: 2020
is activity of: Restaurants & Bars

Restaurants & Bars
type: NamedIndividual
type: BusinessClassification
type: Industry
is contemporary version of: http://data.ga-group.nl/ics/trbc/53301020
is version of: http://data.ga-group.nl/ics/trbc/53301020
replaces: http://data.ga-group.nl/ics/trbc/2012/53301020
imported on: 2023-04-07T16:52:39.364811Z
last refreshed on: 2026-06-05T07:16:11.699Z
source accessed on: 2017-12-31T07:04:19Z
source last accessed on: 2021-08-01T01:06:53Z
definition: Operators of restaurants, diners, taverns, pubs, nightclubs, banquet halls, fixed location snack bars, food cart vendors, food service contractors and wholesalers of commercial food service equipment.
notation: 53301020
valid from: 2020
is industry of: Hotels & Entertainment Services

Casinos & Gaming (NEC)
type: NamedIndividual
type: Activity
type: BusinessClassification
is contemporary version of: http://data.ga-group.nl/ics/trbc/5330103010
is version of: http://data.ga-group.nl/ics/trbc/5330103010
replaces: http://data.ga-group.nl/ics/trbc/2012/5330103010
imported on: 2023-04-07T16:52:39.364811Z
last refreshed on: 2026-06-05T07:16:11.699Z
source accessed on: 2017-12-31T07:04:19Z
source last accessed on: 2021-08-01T01:06:53Z
definition: Companies involved in at least two activities under the Casinos and Gaming industry, none being dominant: casinos and gambling operations. Companies classified as casinos will often engage in auxiliary restaurant and hotel services. Includes stand alone casinos, casino hotels, riverboat casinos, bingo halls, gambling machine manufacturers, lottery services, internet gambling services, bookmaking and other gambling services. Excludes: (horse and dog race tracks, classified in Leisure & Recreation), (cruise lines with auxiliary gambling operations, classified in Hotels, Motels & Cruise Lines).
notation: 5330103010
valid from: 2020
is activity of: Casinos & Gaming

Gambling & Gaming Machine Manufacturers
type: NamedIndividual
type: Activity
type: BusinessClassification
is contemporary version of: http://data.ga-group.nl/ics/trbc/5330103011
is version of: http://data.ga-group.nl/ics/trbc/5330103011
replaces: http://data.ga-group.nl/ics/trbc/2012/5330103011
imported on: 2023-04-07T16:52:39.364811Z
last refreshed on: 2026-06-05T07:16:11.699Z
source accessed on: 2017-12-31T07:04:19Z
source last accessed on: 2021-08-01T01:06:53Z
definition: Companies engaged in the manufacture of gambling and gaming machines, such as slots, roulette machines, blackjack machines and others.
notation: 5330103011
valid from: 2020
is activity of: Casinos & Gaming

Gaming Machine Operators
type: NamedIndividual
type: Activity
type: BusinessClassification
is contemporary version of: http://data.ga-group.nl/ics/trbc/5330103012
is version of: http://data.ga-group.nl/ics/trbc/5330103012
replaces: http://data.ga-group.nl/ics/trbc/2012/5330103012
imported on: 2023-04-07T16:52:39.364811Z
last refreshed on: 2026-06-05T07:16:11.699Z
source accessed on: 2017-12-31T07:04:19Z
source last accessed on: 2021-08-01T01:06:53Z
definition: Companies engaged in the operating of gambling and gaming machines, such as slots, roulette machines, blackjack machines and others.
notation: 5330103012
valid from: 2020
is activity of: Casinos & Gaming

Casinos
type: NamedIndividual
type: Activity
type: BusinessClassification
is contemporary version of: http://data.ga-group.nl/ics/trbc/5330103013
is version of: http://data.ga-group.nl/ics/trbc/5330103013
replaces: http://data.ga-group.nl/ics/trbc/2012/5330103013
imported on: 2023-04-07T16:52:39.364811Z
last refreshed on: 2026-06-05T07:16:11.699Z
source accessed on: 2017-12-31T07:04:19Z
source last accessed on: 2021-08-01T01:06:53Z
definition: Companies engaged in the operation Casinos and Casino Hotels.
notation: 5330103013
valid from: 2020
is activity of: Casinos & Gaming

Horse & Dog Race Tracks
type: NamedIndividual
type: Activity
type: BusinessClassification
is contemporary version of: http://data.ga-group.nl/ics/trbc/5330103014
is version of: http://data.ga-group.nl/ics/trbc/5330103014
replaces: http://data.ga-group.nl/ics/trbc/2012/5330103014
imported on: 2023-04-07T16:52:39.364811Z
last refreshed on: 2026-06-05T07:16:11.699Z
source accessed on: 2017-12-31T07:04:19Z
source last accessed on: 2021-08-01T01:06:53Z
definition: Companies engaged in operation of racetracks for horse races or dog races.
notation: 5330103014
valid from: 2020
is activity of: Casinos & Gaming

Lottery Operators
type: NamedIndividual
type: Activity
type: BusinessClassification
is contemporary version of: http://data.ga-group.nl/ics/trbc/5330103015
is version of: http://data.ga-group.nl/ics/trbc/5330103015
replaces: http://data.ga-group.nl/ics/trbc/2012/5330103015
imported on: 2023-04-07T16:52:39.364811Z
last refreshed on: 2026-06-05T07:16:11.699Z
source accessed on: 2017-12-31T07:04:19Z
source last accessed on: 2021-08-01T01:06:53Z
definition: Companies engaged in operation, organization, implementation of lotteries or sales agency services.
notation: 5330103015
valid from: 2020
is activity of: Casinos & Gaming

Casinos & Gaming
type: NamedIndividual
type: BusinessClassification
type: Industry
is contemporary version of: http://data.ga-group.nl/ics/trbc/53301030
is version of: http://data.ga-group.nl/ics/trbc/53301030
replaces: http://data.ga-group.nl/ics/trbc/2012/53301030
imported on: 2023-04-07T16:52:39.364811Z
last refreshed on: 2026-06-05T07:16:11.699Z
source accessed on: 2017-12-31T07:04:19Z
source last accessed on: 2021-08-01T01:06:53Z
definition: Operators of casinos and gambling operations. Includes stand-alone casinos, casino hotels, riverboat casinos, bingo halls, gambling machine manufacturers, lottery services, internet gambling services, bookmaking and other gambling services.
notation: 53301030
valid from: 2020
is industry of: Hotels & Entertainment Services

Leisure & Recreation (NEC)
type: NamedIndividual
type: Activity
type: BusinessClassification
is contemporary version of: http://data.ga-group.nl/ics/trbc/5330104010
is version of: http://data.ga-group.nl/ics/trbc/5330104010
replaces: http://data.ga-group.nl/ics/trbc/2012/5330104010
imported on: 2023-04-07T16:52:39.364811Z
last refreshed on: 2026-06-05T07:16:11.699Z
source accessed on: 2017-12-31T07:04:19Z
source last accessed on: 2021-08-01T01:06:53Z
definition: Companies involved in at least two activities under the Leisure & Recreation industry, none being dominant: tour operations, travel agencies, amusement parks, golf courses, gaming and fishing preserves, sport stadiums, sports teams, movie theaters, dance and theatrical companies, recreational goods rentals and other leisure services. Excludes: (casinos, classified in Casinos & Gaming), (manufacturers of recreational products, classified in Recreational Products).
notation: 5330104010
valid from: 2020
is activity of: Leisure & Recreation

Movie Theaters & Movie Products
type: NamedIndividual
type: Activity
type: BusinessClassification
is contemporary version of: http://data.ga-group.nl/ics/trbc/5330104011
is version of: http://data.ga-group.nl/ics/trbc/5330104011
replaces: http://data.ga-group.nl/ics/trbc/2012/5330104011
imported on: 2023-04-07T16:52:39.364811Z
last refreshed on: 2026-06-05T07:16:11.699Z
source accessed on: 2017-12-31T07:04:19Z
source last accessed on: 2021-08-01T01:06:53Z
definition: Companies engaged in operation of movie theaters and organization of film festivals.
notation: 5330104011
valid from: 2020
is activity of: Leisure & Recreation

Theatres & Performing Arts
type: NamedIndividual
type: Activity
type: BusinessClassification
is contemporary version of: http://data.ga-group.nl/ics/trbc/5330104012
is version of: http://data.ga-group.nl/ics/trbc/5330104012
replaces: http://data.ga-group.nl/ics/trbc/2012/5330104012
imported on: 2023-04-07T16:52:39.364811Z
last refreshed on: 2026-06-05T07:16:11.699Z
source accessed on: 2017-12-31T07:04:19Z
source last accessed on: 2021-08-01T01:06:53Z
definition: Companies engaged in operation of theaters and performing arts. Performing arts include dance, music, opera, theatre, magic, Spoken word, circus arts and musical theatre.
notation: 5330104012
valid from: 2020
is activity of: Leisure & Recreation

Museums & Historic Places
type: NamedIndividual
type: Activity
type: BusinessClassification
is contemporary version of: http://data.ga-group.nl/ics/trbc/5330104013
is version of: http://data.ga-group.nl/ics/trbc/5330104013
replaces: http://data.ga-group.nl/ics/trbc/2012/5330104013
imported on: 2023-04-07T16:52:39.364811Z
last refreshed on: 2026-06-05T07:16:11.699Z
source accessed on: 2017-12-31T07:04:19Z
source last accessed on: 2021-08-01T01:06:53Z
definition: Companies engaged in preservation and exhibition of museums and historic places.
notation: 5330104013
valid from: 2020
is activity of: Leisure & Recreation

Travel Agents
type: NamedIndividual
type: Activity
type: BusinessClassification
is contemporary version of: http://data.ga-group.nl/ics/trbc/5330104014
is version of: http://data.ga-group.nl/ics/trbc/5330104014
replaces: http://data.ga-group.nl/ics/trbc/2012/5330104014
imported on: 2023-04-07T16:52:39.364811Z
last refreshed on: 2026-06-05T07:16:11.699Z
source accessed on: 2017-12-31T07:04:19Z
source last accessed on: 2021-08-01T01:06:53Z
definition: Companies engaged in provision of travel services.
notation: 5330104014
valid from: 2020
is activity of: Leisure & Recreation

Amusement Parks and Zoos
type: NamedIndividual
type: Activity
type: BusinessClassification
is contemporary version of: http://data.ga-group.nl/ics/trbc/5330104015
is version of: http://data.ga-group.nl/ics/trbc/5330104015
replaces: http://data.ga-group.nl/ics/trbc/2012/5330104015
imported on: 2023-04-07T16:52:39.364811Z
last refreshed on: 2026-06-05T07:16:11.699Z
source accessed on: 2017-12-31T07:04:19Z
source last accessed on: 2021-08-01T01:06:53Z
definition: Companies engaged in operation of amusement parks, theme parks and zoos.
notation: 5330104015
valid from: 2020
is activity of: Leisure & Recreation

Gyms, Fitness and Spa Centers
type: NamedIndividual
type: Activity
type: BusinessClassification
is contemporary version of: http://data.ga-group.nl/ics/trbc/5330104016
is version of: http://data.ga-group.nl/ics/trbc/5330104016
replaces: http://data.ga-group.nl/ics/trbc/2012/5330104016
imported on: 2023-04-07T16:52:39.364811Z
last refreshed on: 2026-06-05T07:16:11.699Z
source accessed on: 2017-12-31T07:04:19Z
source last accessed on: 2021-08-01T01:06:53Z
definition: Companies engaged in operation of gyms, fitness and spa centers.
notation: 5330104016
valid from: 2020
is activity of: Leisure & Recreation

Adventure Sports Facilities & Ski Resorts
type: NamedIndividual
type: Activity
type: BusinessClassification
is contemporary version of: http://data.ga-group.nl/ics/trbc/5330104017
is version of: http://data.ga-group.nl/ics/trbc/5330104017
replaces: http://data.ga-group.nl/ics/trbc/2012/5330104017
imported on: 2023-04-07T16:52:39.364811Z
last refreshed on: 2026-06-05T07:16:11.699Z
source accessed on: 2017-12-31T07:04:19Z
source last accessed on: 2021-08-01T01:06:53Z
definition: Companies engaged in operation of adventure sports facilities and ski resorts.
notation: 5330104017
valid from: 2020
is activity of: Leisure & Recreation

Public Sport Facilities
type: NamedIndividual
type: Activity
type: BusinessClassification
is contemporary version of: http://data.ga-group.nl/ics/trbc/5330104018
is version of: http://data.ga-group.nl/ics/trbc/5330104018
replaces: http://data.ga-group.nl/ics/trbc/2012/5330104018
imported on: 2023-04-07T16:52:39.364811Z
last refreshed on: 2026-06-05T07:16:11.699Z
source accessed on: 2017-12-31T07:04:19Z
source last accessed on: 2021-08-01T01:06:53Z
definition: Companies engaged in operation of public sport facilities.
notation: 5330104018
valid from: 2020
is activity of: Leisure & Recreation

Professional Sports Venues
type: NamedIndividual
type: Activity
type: BusinessClassification
is contemporary version of: http://data.ga-group.nl/ics/trbc/5330104019
is version of: http://data.ga-group.nl/ics/trbc/5330104019
replaces: http://data.ga-group.nl/ics/trbc/2012/5330104019
imported on: 2023-04-07T16:52:39.364811Z
last refreshed on: 2026-06-05T07:16:11.699Z
source accessed on: 2017-12-31T07:04:19Z
source last accessed on: 2021-08-01T01:06:53Z
definition: Companies engaged in operation of professional sports venues. Includes sports teams engaged in playing professional football, rugby, cricket and baseball. Includes companies offering venues, such as stadiums or playing grounds, for the sports teams to operate from.
notation: 5330104019
valid from: 2020
is activity of: Leisure & Recreation

Golf Courses
type: NamedIndividual
type: Activity
type: BusinessClassification
is contemporary version of: http://data.ga-group.nl/ics/trbc/5330104020
is version of: http://data.ga-group.nl/ics/trbc/5330104020
replaces: http://data.ga-group.nl/ics/trbc/2012/5330104020
imported on: 2023-04-07T16:52:39.364811Z
last refreshed on: 2026-06-05T07:16:11.699Z
source accessed on: 2017-12-31T07:04:19Z
source last accessed on: 2021-08-01T01:06:53Z
definition: Companies engaged in operation of golf courses.
notation: 5330104020
valid from: 2020
is activity of: Leisure & Recreation

Hunting & Fishing
type: NamedIndividual
type: Activity
type: BusinessClassification
is contemporary version of: http://data.ga-group.nl/ics/trbc/5330104021
is version of: http://data.ga-group.nl/ics/trbc/5330104021
replaces: http://data.ga-group.nl/ics/trbc/2012/5330104021
imported on: 2023-04-07T16:52:39.364811Z
last refreshed on: 2026-06-05T07:16:11.699Z
source accessed on: 2017-12-31T07:04:19Z
source last accessed on: 2021-08-01T01:06:53Z
definition: Companies engaged in operation of hunting and fishing area.
notation: 5330104021
valid from: 2020
is activity of: Leisure & Recreation

Marinas
type: NamedIndividual
type: Activity
type: BusinessClassification
is contemporary version of: http://data.ga-group.nl/ics/trbc/5330104022
is version of: http://data.ga-group.nl/ics/trbc/5330104022
replaces: http://data.ga-group.nl/ics/trbc/2012/5330104022
imported on: 2023-04-07T16:52:39.364811Z
last refreshed on: 2026-06-05T07:16:11.699Z
source accessed on: 2017-12-31T07:04:19Z
source last accessed on: 2021-08-01T01:06:53Z
definition: Companies engaged in operation of boating, sailing and yacht clubs.
notation: 5330104022
valid from: 2020
is activity of: Leisure & Recreation

Guided Tour Operators
type: NamedIndividual
type: Activity
type: BusinessClassification
is contemporary version of: http://data.ga-group.nl/ics/trbc/5330104023
is version of: http://data.ga-group.nl/ics/trbc/5330104023
replaces: http://data.ga-group.nl/ics/trbc/2012/5330104023
imported on: 2023-04-07T16:52:39.364811Z
last refreshed on: 2026-06-05T07:16:11.699Z
source accessed on: 2017-12-31T07:04:19Z
source last accessed on: 2021-08-01T01:06:53Z
definition: Companies engaged in providing of tours products with guided services.
notation: 5330104023
valid from: 2020
is activity of: Leisure & Recreation

Leisure & Recreation
type: NamedIndividual
type: BusinessClassification
type: Industry
is contemporary version of: http://data.ga-group.nl/ics/trbc/53301040
is version of: http://data.ga-group.nl/ics/trbc/53301040
replaces: http://data.ga-group.nl/ics/trbc/2012/53301040
imported on: 2023-04-07T16:52:39.364811Z
last refreshed on: 2026-06-05T07:16:11.699Z
source accessed on: 2017-12-31T07:04:19Z
source last accessed on: 2021-08-01T01:06:53Z
definition: Tour operators, travel agencies, amusement parks, golf courses, gaming and fishing preserves, sport stadiums, sports teams, movie theaters, dance and theatrical Companies, recreational goods rentals and other leisure services.
notation: 53301040
valid from: 2020
is industry of: Hotels & Entertainment Services

Hotels & Entertainment Services
type: NamedIndividual
type: BusinessClassification
type: IndustryGroup
is contemporary version of: http://data.ga-group.nl/ics/trbc/533010
is version of: http://data.ga-group.nl/ics/trbc/533010
replaces: http://data.ga-group.nl/ics/trbc/2012/533010
imported on: 2023-04-07T16:52:39.364811Z
last refreshed on: 2026-06-05T07:16:11.699Z
source accessed on: 2017-12-31T07:04:19Z
source last accessed on: 2021-08-01T01:06:53Z
definition: Operators of hotels, motels, cruise lines, restaurants, casinos, gaming operations, sports stadiums, golf courses, amusement parks and other recreational services.
notation: 533010
valid from: 2020
is industry group of: Cyclical Consumer Services

Advertising & Marketing (NEC)
type: NamedIndividual
type: Activity
type: BusinessClassification
is contemporary version of: http://data.ga-group.nl/ics/trbc/5330201010
is version of: http://data.ga-group.nl/ics/trbc/5330201010
replaces: http://data.ga-group.nl/ics/trbc/2012/5330201010
imported on: 2023-04-07T16:52:39.364811Z
last refreshed on: 2026-06-05T07:16:11.699Z
source accessed on: 2017-12-31T07:04:19Z
source last accessed on: 2021-08-01T01:06:53Z
definition: Companies involved in at least two activities under the Advertising & Marketing Industry, none being dominant: print and broadcast media advertising agencies, marketing research, public opinion research, public relations and other marketing and consulting services.
notation: 5330201010
valid from: 2020
is activity of: Advertising & Marketing

Advertising Agency
type: NamedIndividual
type: Activity
type: BusinessClassification
is contemporary version of: http://data.ga-group.nl/ics/trbc/5330201011
is version of: http://data.ga-group.nl/ics/trbc/5330201011
replaces: http://data.ga-group.nl/ics/trbc/2012/5330201011
imported on: 2023-04-07T16:52:39.364811Z
last refreshed on: 2026-06-05T07:16:11.699Z
source accessed on: 2017-12-31T07:04:19Z
source last accessed on: 2021-08-01T01:06:53Z
definition: Companies engaged in creating, planning and handling advertising and placing the advertisement in various media.
notation: 5330201011
valid from: 2020
is activity of: Advertising & Marketing

Media Buying Agency
type: NamedIndividual
type: Activity
type: BusinessClassification
is contemporary version of: http://data.ga-group.nl/ics/trbc/5330201012
is version of: http://data.ga-group.nl/ics/trbc/5330201012
replaces: http://data.ga-group.nl/ics/trbc/2012/5330201012
imported on: 2023-04-07T16:52:39.364811Z
last refreshed on: 2026-06-05T07:16:11.699Z
source accessed on: 2017-12-31T07:04:19Z
source last accessed on: 2021-08-01T01:06:53Z
definition: Companies engaged in purchasing time and advertising space from media and selling it to advertising agencies.
notation: 5330201012
valid from: 2020
is activity of: Advertising & Marketing

Signs & Advertising Specialty Producers
type: NamedIndividual
type: Activity
type: BusinessClassification
is contemporary version of: http://data.ga-group.nl/ics/trbc/5330201013
is version of: http://data.ga-group.nl/ics/trbc/5330201013
replaces: http://data.ga-group.nl/ics/trbc/2012/5330201013
imported on: 2023-04-07T16:52:39.364811Z
last refreshed on: 2026-06-05T07:16:11.699Z
source accessed on: 2017-12-31T07:04:19Z
source last accessed on: 2021-08-01T01:06:53Z
definition: Companies engaged in manufacturing signs and specialty products for advertising purpose.
notation: 5330201013
valid from: 2020
is activity of: Advertising & Marketing

Outdoor Advertising
type: NamedIndividual
type: Activity
type: BusinessClassification
is contemporary version of: http://data.ga-group.nl/ics/trbc/5330201014
is version of: http://data.ga-group.nl/ics/trbc/5330201014
replaces: http://data.ga-group.nl/ics/trbc/2012/5330201014
imported on: 2023-04-07T16:52:39.364811Z
last refreshed on: 2026-06-05T07:16:11.699Z
source accessed on: 2017-12-31T07:04:19Z
source last accessed on: 2021-08-01T01:06:53Z
definition: Companies engaged in creating, planning and handling mainly outdoor advertisings.
notation: 5330201014
valid from: 2020
is activity of: Advertising & Marketing

Direct Marketing
type: NamedIndividual
type: Activity
type: BusinessClassification
is contemporary version of: http://data.ga-group.nl/ics/trbc/5330201015
is version of: http://data.ga-group.nl/ics/trbc/5330201015
replaces: http://data.ga-group.nl/ics/trbc/2012/5330201015
imported on: 2023-04-07T16:52:39.364811Z
last refreshed on: 2026-06-05T07:16:11.699Z
source accessed on: 2017-12-31T07:04:19Z
source last accessed on: 2021-08-01T01:06:53Z
definition: Companies engaged in planning and consulting on direct marketing and promotion solutions via various means.
notation: 5330201015
valid from: 2020
is activity of: Advertising & Marketing

Sales Promotions & Events Management
type: NamedIndividual
type: Activity
type: BusinessClassification
is contemporary version of: http://data.ga-group.nl/ics/trbc/5330201016
is version of: http://data.ga-group.nl/ics/trbc/5330201016
replaces: http://data.ga-group.nl/ics/trbc/2012/5330201016
imported on: 2023-04-07T16:52:39.364811Z
last refreshed on: 2026-06-05T07:16:11.699Z
source accessed on: 2017-12-31T07:04:19Z
source last accessed on: 2021-08-01T01:06:53Z
definition: Companies engaged in promoting and increasing in sales, usage or trial of a product or service, or managing to create and develop festivals, events and conferences for other entities.
notation: 5330201016
valid from: 2020
is activity of: Advertising & Marketing

Guerrilla & Sensory Marketing
type: NamedIndividual
type: Activity
type: BusinessClassification
is contemporary version of: http://data.ga-group.nl/ics/trbc/5330201017
is version of: http://data.ga-group.nl/ics/trbc/5330201017
replaces: http://data.ga-group.nl/ics/trbc/2012/5330201017
imported on: 2023-04-07T16:52:39.364811Z
last refreshed on: 2026-06-05T07:16:11.699Z
source accessed on: 2017-12-31T07:04:19Z
source last accessed on: 2021-08-01T01:06:53Z
definition: Companies engaged in providing unconventional system of promotions that relies on time, energy, imagination and the senses.
notation: 5330201017
valid from: 2020
is activity of: Advertising & Marketing

Public Relations
type: NamedIndividual
type: Activity
type: BusinessClassification
is contemporary version of: http://data.ga-group.nl/ics/trbc/5330201018
is version of: http://data.ga-group.nl/ics/trbc/5330201018
replaces: http://data.ga-group.nl/ics/trbc/2012/5330201018
imported on: 2023-04-07T16:52:39.364811Z
last refreshed on: 2026-06-05T07:16:11.699Z
source accessed on: 2017-12-31T07:04:19Z
source last accessed on: 2021-08-01T01:06:53Z
definition: Companies engaged in consultancy service providing campaigns that promote interests and image of corporations, individuals, and governments.
notation: 5330201018
valid from: 2020
is activity of: Advertising & Marketing

Digital Media Agencies
type: NamedIndividual
type: Activity
type: BusinessClassification
is contemporary version of: http://data.ga-group.nl/ics/trbc/5330201019
is version of: http://data.ga-group.nl/ics/trbc/5330201019
replaces: http://data.ga-group.nl/ics/trbc/2012/5330201019
imported on: 2023-04-07T16:52:39.364811Z
last refreshed on: 2026-06-05T07:16:11.699Z
source accessed on: 2017-12-31T07:04:19Z
source last accessed on: 2021-08-01T01:06:53Z
definition: Companies engaged in providing services related to digital media.
notation: 5330201019
valid from: 2020
is activity of: Advertising & Marketing

Branding & Naming
type: NamedIndividual
type: Activity
type: BusinessClassification
is contemporary version of: http://data.ga-group.nl/ics/trbc/5330201020
is version of: http://data.ga-group.nl/ics/trbc/5330201020
replaces: http://data.ga-group.nl/ics/trbc/2012/5330201020
imported on: 2023-04-07T16:52:39.364811Z
last refreshed on: 2026-06-05T07:16:11.699Z
source accessed on: 2017-12-31T07:04:19Z
source last accessed on: 2021-08-01T01:06:53Z
definition: Companies engaged in creating, launching and managing brands as well as rebranding, or planning of branding strategy for others.
notation: 5330201020
valid from: 2020
is activity of: Advertising & Marketing

Market Research
type: NamedIndividual
type: Activity
type: BusinessClassification
is contemporary version of: http://data.ga-group.nl/ics/trbc/5330201021
is version of: http://data.ga-group.nl/ics/trbc/5330201021
replaces: http://data.ga-group.nl/ics/trbc/2012/5330201021
imported on: 2023-04-07T16:52:39.364811Z
last refreshed on: 2026-06-05T07:16:11.699Z
source accessed on: 2017-12-31T07:04:19Z
source last accessed on: 2021-08-01T01:06:53Z
definition: Companies engaged in gathering, researching and interpretation of market information or public opinion.
notation: 5330201021
valid from: 2020
is activity of: Advertising & Marketing

Marketing Consulting Services
type: NamedIndividual
type: Activity
type: BusinessClassification
is contemporary version of: http://data.ga-group.nl/ics/trbc/5330201022
is version of: http://data.ga-group.nl/ics/trbc/5330201022
replaces: http://data.ga-group.nl/ics/trbc/2012/5330201022
imported on: 2023-04-07T16:52:39.364811Z
last refreshed on: 2026-06-05T07:16:11.699Z
source accessed on: 2017-12-31T07:04:19Z
source last accessed on: 2021-08-01T01:06:53Z
definition: Companies engaged in providing marketing plans, advices and consultancy to businesses and entities.
notation: 5330201022
valid from: 2020
is activity of: Advertising & Marketing

Advertising & Marketing
type: NamedIndividual
type: BusinessClassification
type: Industry
is contemporary version of: http://data.ga-group.nl/ics/trbc/53302010
is version of: http://data.ga-group.nl/ics/trbc/53302010
replaces: http://data.ga-group.nl/ics/trbc/2012/53302010
imported on: 2023-04-07T16:52:39.364811Z
last refreshed on: 2026-06-05T07:16:11.699Z
source accessed on: 2017-12-31T07:04:19Z
source last accessed on: 2021-08-01T01:06:53Z
definition: Print, digital and broadcast media advertising agencies, marketing research, public opinion research, public relations and other marketing and consulting services.
notation: 53302010
valid from: 2020
is industry of: Media & Publishing

Broadcasting (NEC)
type: NamedIndividual
type: Activity
type: BusinessClassification
is contemporary version of: http://data.ga-group.nl/ics/trbc/5330202010
is version of: http://data.ga-group.nl/ics/trbc/5330202010
replaces: http://data.ga-group.nl/ics/trbc/2012/5330202010
imported on: 2023-04-07T16:52:39.364811Z
last refreshed on: 2026-06-05T07:16:11.699Z
source accessed on: 2017-12-31T07:04:19Z
source last accessed on: 2021-08-01T01:06:53Z
definition: Companies involved in at least two activities under the Broadcasting Industry, none being dominant: operation of television, radio, cable and satellite broadcasting services. Excludes: (satellite telecommunication services, classified in Wireless Telecommunication Services).
notation: 5330202010
valid from: 2020
is activity of: Broadcasting

Television Broadcasting
type: NamedIndividual
type: Activity
type: BusinessClassification
is contemporary version of: http://data.ga-group.nl/ics/trbc/5330202011
is version of: http://data.ga-group.nl/ics/trbc/5330202011
replaces: http://data.ga-group.nl/ics/trbc/2012/5330202011
imported on: 2023-04-07T16:52:39.364811Z
last refreshed on: 2026-06-05T07:16:11.699Z
source accessed on: 2017-12-31T07:04:19Z
source last accessed on: 2021-08-01T01:06:53Z
definition: Companies engaged in programming and distribution of audio and video content.
notation: 5330202011
valid from: 2020
is activity of: Broadcasting

Radio Broadcasting
type: NamedIndividual
type: Activity
type: BusinessClassification
is contemporary version of: http://data.ga-group.nl/ics/trbc/5330202012
is version of: http://data.ga-group.nl/ics/trbc/5330202012
replaces: http://data.ga-group.nl/ics/trbc/2012/5330202012
imported on: 2023-04-07T16:52:39.364811Z
last refreshed on: 2026-06-05T07:16:11.699Z
source accessed on: 2017-12-31T07:04:19Z
source last accessed on: 2021-08-01T01:06:53Z
definition: Companies engaged in radio broadcasting. The activity creates programs of its own or acquires from external sources.
notation: 5330202012
valid from: 2020
is activity of: Broadcasting

Cable Service Providers
type: NamedIndividual
type: Activity
type: BusinessClassification
is contemporary version of: http://data.ga-group.nl/ics/trbc/5330202013
is version of: http://data.ga-group.nl/ics/trbc/5330202013
replaces: http://data.ga-group.nl/ics/trbc/2012/5330202013
imported on: 2023-04-07T16:52:39.364811Z
last refreshed on: 2026-06-05T07:16:11.699Z
source accessed on: 2017-12-31T07:04:19Z
source last accessed on: 2021-08-01T01:06:53Z
definition: Companies engaged in distribution of broadcasting programs.
notation: 5330202013
valid from: 2020
is activity of: Broadcasting

Broadcasting
type: NamedIndividual
type: BusinessClassification
type: Industry
is contemporary version of: http://data.ga-group.nl/ics/trbc/53302020
is version of: http://data.ga-group.nl/ics/trbc/53302020
replaces: http://data.ga-group.nl/ics/trbc/2012/53302020
imported on: 2023-04-07T16:52:39.364811Z
last refreshed on: 2026-06-05T07:16:11.699Z
source accessed on: 2017-12-31T07:04:19Z
source last accessed on: 2021-08-01T01:06:53Z
definition: Providers of television, radio, cable internet, satellite/non-cable broadcasting services.
notation: 53302020
valid from: 2020
is industry of: Media & Publishing

Entertainment Production (NEC)
type: NamedIndividual
type: Activity
type: BusinessClassification
is contemporary version of: http://data.ga-group.nl/ics/trbc/5330203010
is version of: http://data.ga-group.nl/ics/trbc/5330203010
replaces: http://data.ga-group.nl/ics/trbc/2012/5330203010
imported on: 2023-04-07T16:52:39.364811Z
last refreshed on: 2026-06-05T07:16:11.699Z
source accessed on: 2017-12-31T07:04:19Z
source last accessed on: 2021-08-01T01:06:53Z
definition: Companies involved in at least two activities under the Entertainment Production Industry, none being dominant: motion picture, television syndicate, teleproduction, music and music video production, recording studio, theater and animated cartoon production.
notation: 5330203010
valid from: 2020
is activity of: Entertainment Production

Movie, TV Production & Distribution
type: NamedIndividual
type: Activity
type: BusinessClassification
is contemporary version of: http://data.ga-group.nl/ics/trbc/5330203011
is version of: http://data.ga-group.nl/ics/trbc/5330203011
replaces: http://data.ga-group.nl/ics/trbc/2012/5330203011
imported on: 2023-04-07T16:52:39.364811Z
last refreshed on: 2026-06-05T07:16:11.699Z
source accessed on: 2017-12-31T07:04:19Z
source last accessed on: 2021-08-01T01:06:53Z
definition: Companies engaged in creation, production, distribution and licensing and marketing of motion pictures and TV programs.
notation: 5330203011
valid from: 2020
is activity of: Entertainment Production

Music, Music Video Production & Distribution
type: NamedIndividual
type: Activity
type: BusinessClassification
is contemporary version of: http://data.ga-group.nl/ics/trbc/5330203012
is version of: http://data.ga-group.nl/ics/trbc/5330203012
replaces: http://data.ga-group.nl/ics/trbc/2012/5330203012
imported on: 2023-04-07T16:52:39.364811Z
last refreshed on: 2026-06-05T07:16:11.699Z
source accessed on: 2017-12-31T07:04:19Z
source last accessed on: 2021-08-01T01:06:53Z
definition: Companies engaged in creation, production, distribution and licensing and marketing of music records and other sound recordings.
notation: 5330203012
valid from: 2020
is activity of: Entertainment Production

Plays & Concert Production
type: NamedIndividual
type: Activity
type: BusinessClassification
is contemporary version of: http://data.ga-group.nl/ics/trbc/5330203013
is version of: http://data.ga-group.nl/ics/trbc/5330203013
replaces: http://data.ga-group.nl/ics/trbc/2012/5330203013
imported on: 2023-04-07T16:52:39.364811Z
last refreshed on: 2026-06-05T07:16:11.699Z
source accessed on: 2017-12-31T07:04:19Z
source last accessed on: 2021-08-01T01:06:53Z
definition: Companies engaged in production of live performances such as musicals, plays, operas, comedies, circus, magic shows and other performances.
notation: 5330203013
valid from: 2020
is activity of: Entertainment Production

Entertainment Production Equipment & Services
type: NamedIndividual
type: Activity
type: BusinessClassification
is contemporary version of: http://data.ga-group.nl/ics/trbc/5330203014
is version of: http://data.ga-group.nl/ics/trbc/5330203014
replaces: http://data.ga-group.nl/ics/trbc/2012/5330203014
imported on: 2023-04-07T16:52:39.364811Z
last refreshed on: 2026-06-05T07:16:11.699Z
source accessed on: 2017-12-31T07:04:19Z
source last accessed on: 2021-08-01T01:06:53Z
definition: Companies engaged in manufacturing of entertainment production instrument, equipment and facilities. Includes also companies providing technical services to film and TV program production, or organizing and promoting live performances, as well as independent agent service providers for various entertainers.
notation: 5330203014
valid from: 2020
is activity of: Entertainment Production

Copyright Management
type: NamedIndividual
type: Activity
type: BusinessClassification
is contemporary version of: http://data.ga-group.nl/ics/trbc/5330203015
is version of: http://data.ga-group.nl/ics/trbc/5330203015
replaces: http://data.ga-group.nl/ics/trbc/2012/5330203015
imported on: 2023-04-07T16:52:39.364811Z
last refreshed on: 2026-06-05T07:16:11.699Z
source accessed on: 2017-12-31T07:04:19Z
source last accessed on: 2021-08-01T01:06:53Z
definition: Companies engaged in management and licensing of copyrights on behalf of rights owners such as authors, composers, publishers, writers, photographers, musicians and performers.
notation: 5330203015
valid from: 2020
is activity of: Entertainment Production

Adult Entertainment Production & Broadcasting
type: NamedIndividual
type: Activity
type: BusinessClassification
is contemporary version of: http://data.ga-group.nl/ics/trbc/5330203016
is version of: http://data.ga-group.nl/ics/trbc/5330203016
replaces: http://data.ga-group.nl/ics/trbc/2012/5330203016
imported on: 2023-04-07T16:52:39.364811Z
last refreshed on: 2026-06-05T07:16:11.699Z
source accessed on: 2017-12-31T07:04:19Z
source last accessed on: 2021-08-01T01:06:53Z
definition: Companies engaged in production and broadcasting of adult entertainment contents.
notation: 5330203016
valid from: 2020
is activity of: Entertainment Production

Entertainment Production
type: NamedIndividual
type: BusinessClassification
type: Industry
is contemporary version of: http://data.ga-group.nl/ics/trbc/53302030
is version of: http://data.ga-group.nl/ics/trbc/53302030
replaces: http://data.ga-group.nl/ics/trbc/2012/53302030
imported on: 2023-04-07T16:52:39.364811Z
last refreshed on: 2026-06-05T07:16:11.699Z
source accessed on: 2017-12-31T07:04:19Z
source last accessed on: 2021-08-01T01:06:53Z
definition: Producers of motion pictures, syndicated television, teleproduction, music and music videos. Includes operators of recording studios, theaters and providers of production services such as editing, special effects contracting, video conversion, as well as distribution services.
notation: 53302030
valid from: 2020
is industry of: Media & Publishing

Consumer Publishing (NEC)
type: NamedIndividual
type: Activity
type: BusinessClassification
is contemporary version of: http://data.ga-group.nl/ics/trbc/5330204010
is version of: http://data.ga-group.nl/ics/trbc/5330204010
replaces: http://data.ga-group.nl/ics/trbc/2012/5330204010
imported on: 2023-04-07T16:52:39.364811Z
last refreshed on: 2026-06-05T07:16:11.699Z
source accessed on: 2017-12-31T07:04:19Z
source last accessed on: 2021-08-01T01:06:53Z
definition: Companies involved in at least two activities under the Consumer Publishing Industry, none being dominant: publishing of books, magazines, newspapers, directories, maps, catalogs, as well as printed and electronic database publishers. Excludes: (information retrieval services without proprietary content, classified in IT Services & Consulting), (information service providers of financial content, classified in Professional Information Services, (contract-based magazine, book and newsprint printing, classified in Commercial Printing Services).
notation: 5330204010
valid from: 2020
is activity of: Consumer Publishing

Newspaper Publishing
type: NamedIndividual
type: Activity
type: BusinessClassification
is contemporary version of: http://data.ga-group.nl/ics/trbc/5330204011
is version of: http://data.ga-group.nl/ics/trbc/5330204011
replaces: http://data.ga-group.nl/ics/trbc/2012/5330204011
imported on: 2023-04-07T16:52:39.364811Z
last refreshed on: 2026-06-05T07:16:11.699Z
source accessed on: 2017-12-31T07:04:19Z
source last accessed on: 2021-08-01T01:06:53Z
definition: Companies engaged in publishing newspapers.
notation: 5330204011
valid from: 2020
is activity of: Consumer Publishing

Magazine Publishing
type: NamedIndividual
type: Activity
type: BusinessClassification
is contemporary version of: http://data.ga-group.nl/ics/trbc/5330204012
is version of: http://data.ga-group.nl/ics/trbc/5330204012
replaces: http://data.ga-group.nl/ics/trbc/2012/5330204012
imported on: 2023-04-07T16:52:39.364811Z
last refreshed on: 2026-06-05T07:16:11.699Z
source accessed on: 2017-12-31T07:04:19Z
source last accessed on: 2021-08-01T01:06:53Z
definition: Companies engaged in publishing magazines.
notation: 5330204012
valid from: 2020
is activity of: Consumer Publishing

Book Publishing
type: NamedIndividual
type: Activity
type: BusinessClassification
is contemporary version of: http://data.ga-group.nl/ics/trbc/5330204013
is version of: http://data.ga-group.nl/ics/trbc/5330204013
replaces: http://data.ga-group.nl/ics/trbc/2012/5330204013
imported on: 2023-04-07T16:52:39.364811Z
last refreshed on: 2026-06-05T07:16:11.699Z
source accessed on: 2017-12-31T07:04:19Z
source last accessed on: 2021-08-01T01:06:53Z
definition: Companies engaged in publishing of books in print, electronic, or audio form.
notation: 5330204013
valid from: 2020
is activity of: Consumer Publishing

Directory Publishing
type: NamedIndividual
type: Activity
type: BusinessClassification
is contemporary version of: http://data.ga-group.nl/ics/trbc/5330204014
is version of: http://data.ga-group.nl/ics/trbc/5330204014
replaces: http://data.ga-group.nl/ics/trbc/2012/5330204014
imported on: 2023-04-07T16:52:39.364811Z
last refreshed on: 2026-06-05T07:16:11.699Z
source accessed on: 2017-12-31T07:04:19Z
source last accessed on: 2021-08-01T01:06:53Z
definition: Companies engaged in publishing of directory content ranging from mailing addresses, telephone directories to directories of businesses in print or electronic form.
notation: 5330204014
valid from: 2020
is activity of: Consumer Publishing

Digital Publishing
type: NamedIndividual
type: Activity
type: BusinessClassification
is contemporary version of: http://data.ga-group.nl/ics/trbc/5330204015
is version of: http://data.ga-group.nl/ics/trbc/5330204015
replaces: http://data.ga-group.nl/ics/trbc/2012/5330204015
imported on: 2023-04-07T16:52:39.364811Z
last refreshed on: 2026-06-05T07:16:11.699Z
source accessed on: 2017-12-31T07:04:19Z
source last accessed on: 2021-08-01T01:06:53Z
definition: Companies engaged in digital publication of e-books and electronic articles, and the development of digital libraries and catalogues.
notation: 5330204015
valid from: 2020
is activity of: Consumer Publishing

Adult Publishing
type: NamedIndividual
type: Activity
type: BusinessClassification
is contemporary version of: http://data.ga-group.nl/ics/trbc/5330204016
is version of: http://data.ga-group.nl/ics/trbc/5330204016
replaces: http://data.ga-group.nl/ics/trbc/2012/5330204016
imported on: 2023-04-07T16:52:39.364811Z
last refreshed on: 2026-06-05T07:16:11.699Z
source accessed on: 2017-12-31T07:04:19Z
source last accessed on: 2021-08-01T01:06:53Z
definition: Companies engaged in publication of adult magazines.
notation: 5330204016
valid from: 2020
is activity of: Consumer Publishing

Books, Newspapers & Magazines Wholesale
type: NamedIndividual
type: Activity
type: BusinessClassification
is contemporary version of: http://data.ga-group.nl/ics/trbc/5330204017
is version of: http://data.ga-group.nl/ics/trbc/5330204017
imported on: 2023-04-07T17:17:07.492231Z
last refreshed on: 2026-06-05T07:16:11.699Z
source accessed on: 2021-04-25T05:48:36Z
source last accessed on: 2021-08-01T01:06:53Z
definition: Companies engaged in the wholesale of books and periodicals, such as newspapers, magazines, and other published materials.
notation: 5330204017
valid from: 2020
is activity of: Consumer Publishing

Consumer Publishing
type: NamedIndividual
type: BusinessClassification
type: Industry
is contemporary version of: http://data.ga-group.nl/ics/trbc/53302040
is version of: http://data.ga-group.nl/ics/trbc/53302040
replaces: http://data.ga-group.nl/ics/trbc/2012/53302040
imported on: 2023-04-07T16:52:39.364811Z
last refreshed on: 2026-06-05T07:16:11.699Z
source accessed on: 2017-12-31T07:04:19Z
source last accessed on: 2021-08-01T01:06:53Z
definition: Publishers of books, magazines, newspapers, directories, maps and catalogs, as well as printed and electronic databases.
notation: 53302040
valid from: 2020
is industry of: Media & Publishing

Media & Publishing
type: NamedIndividual
type: BusinessClassification
type: IndustryGroup
is contemporary version of: http://data.ga-group.nl/ics/trbc/533020
is version of: http://data.ga-group.nl/ics/trbc/533020
replaces: http://data.ga-group.nl/ics/trbc/2012/533020
imported on: 2023-04-07T16:52:39.364811Z
last refreshed on: 2026-06-05T07:16:11.699Z
source accessed on: 2017-12-31T07:04:19Z
source last accessed on: 2021-08-01T01:06:53Z
definition: Providers of advertising, marketing, broadcasting, entertainment production and publishing services.
notation: 533020
valid from: 2020
is industry group of: Cyclical Consumer Services

Cyclical Consumer Services
type: NamedIndividual
type: BusinessClassification
type: BusinessSector
is contemporary version of: http://data.ga-group.nl/ics/trbc/5330
is version of: http://data.ga-group.nl/ics/trbc/5330
replaces: http://data.ga-group.nl/ics/trbc/2012/5330
imported on: 2023-04-07T16:52:39.364811Z
last refreshed on: 2026-06-05T07:16:11.699Z
source accessed on: 2017-12-31T07:04:19Z
source last accessed on: 2021-08-01T01:06:53Z
definition: Providers of accommodation, entertainment and leisure services, marketing and advertising services and media & publishing services.
notation: 5330
valid from: 2020
is business sector of: Consumer Cyclicals

Department Stores (NEC)
type: NamedIndividual
type: Activity
type: BusinessClassification
is contemporary version of: http://data.ga-group.nl/ics/trbc/5340201010
is version of: http://data.ga-group.nl/ics/trbc/5340201010
replaces: http://data.ga-group.nl/ics/trbc/2012/5340201010
imported on: 2023-04-07T16:52:39.364811Z
last refreshed on: 2026-06-05T07:16:11.699Z
source accessed on: 2017-12-31T07:04:19Z
source last accessed on: 2021-08-01T01:06:53Z
definition: Companies involved in at least two activities under the Department Stores Industry, none being dominant: the operation of department store chains including auxiliary internet and mail order facilities.
notation: 5340201010
valid from: 2020
is activity of: Department Stores

General Department Stores
type: NamedIndividual
type: Activity
type: BusinessClassification
is contemporary version of: http://data.ga-group.nl/ics/trbc/5340201011
is version of: http://data.ga-group.nl/ics/trbc/5340201011
replaces: http://data.ga-group.nl/ics/trbc/2012/5340201011
imported on: 2023-04-07T16:52:39.364811Z
last refreshed on: 2026-06-05T07:16:11.699Z
source accessed on: 2017-12-31T07:04:19Z
source last accessed on: 2021-08-01T01:06:53Z
definition: Companies engaged in operation of retail stores offering multiple lines of personal and residential goods such as apparel, jewelry, home furnishings, electronics and appliances.
notation: 5340201011
valid from: 2020
is activity of: Department Stores

Luxury Department Stores
type: NamedIndividual
type: Activity
type: BusinessClassification
is contemporary version of: http://data.ga-group.nl/ics/trbc/5340201012
is version of: http://data.ga-group.nl/ics/trbc/5340201012
replaces: http://data.ga-group.nl/ics/trbc/2012/5340201012
imported on: 2023-04-07T16:52:39.364811Z
last refreshed on: 2026-06-05T07:16:11.699Z
source accessed on: 2017-12-31T07:04:19Z
source last accessed on: 2021-08-01T01:06:53Z
definition: Companies engaged in operation of retail stores offering multiple lines of high-end and luxury brands.
notation: 5340201012
valid from: 2020
is activity of: Department Stores

Internet & Mail Order Department Stores
type: NamedIndividual
type: Activity
type: BusinessClassification
is contemporary version of: http://data.ga-group.nl/ics/trbc/5340201013
is version of: http://data.ga-group.nl/ics/trbc/5340201013
replaces: http://data.ga-group.nl/ics/trbc/2012/5340201013
imported on: 2023-04-07T16:52:39.364811Z
last refreshed on: 2026-06-05T07:16:11.699Z
source accessed on: 2017-12-31T07:04:19Z
source last accessed on: 2021-08-01T01:06:53Z
definition: Companies engaged in retail of all types of merchandise through Internet.
notation: 5340201013
valid from: 2020
is activity of: Department Stores

Department Stores
type: NamedIndividual
type: BusinessClassification
type: Industry
is contemporary version of: http://data.ga-group.nl/ics/trbc/53402010
is version of: http://data.ga-group.nl/ics/trbc/53402010
replaces: http://data.ga-group.nl/ics/trbc/2012/53402010
imported on: 2023-04-07T16:52:39.364811Z
last refreshed on: 2026-06-05T07:16:11.699Z
source accessed on: 2017-12-31T07:04:19Z
source last accessed on: 2021-08-01T01:06:53Z
definition: Retailers operating department store chains offering a diversified product line. Includes auxiliary internet and mail order facilities.
notation: 53402010
valid from: 2020
is industry of: Diversified Retail

Discount Stores (NEC)
type: NamedIndividual
type: Activity
type: BusinessClassification
is contemporary version of: http://data.ga-group.nl/ics/trbc/5340202010
is version of: http://data.ga-group.nl/ics/trbc/5340202010
replaces: http://data.ga-group.nl/ics/trbc/2012/5340202010
imported on: 2023-04-07T16:52:39.364811Z
last refreshed on: 2026-06-05T07:16:11.699Z
source accessed on: 2017-12-31T07:04:19Z
source last accessed on: 2021-08-01T01:06:53Z
definition: Companies involved in at least two activities under the Discount Stores industry, none being dominant: operation of stores offering a diversified product line at a discount. Includes also discount stores with auxiliary internet and mail order facilities.
notation: 5340202010
valid from: 2020
is activity of: Discount Stores

Internet & Mail Order Discount Stores
type: NamedIndividual
type: Activity
type: BusinessClassification
is contemporary version of: http://data.ga-group.nl/ics/trbc/5340202011
is version of: http://data.ga-group.nl/ics/trbc/5340202011
replaces: http://data.ga-group.nl/ics/trbc/2012/5340202011
imported on: 2023-04-07T16:52:39.364811Z
last refreshed on: 2026-06-05T07:16:11.699Z
source accessed on: 2017-12-31T07:04:19Z
source last accessed on: 2021-08-01T01:06:53Z
definition: Companies engaged in online retail of diversified product line at a discount.
notation: 5340202011
valid from: 2020
is activity of: Discount Stores

Discount Stores with Grocery
type: NamedIndividual
type: Activity
type: BusinessClassification
is contemporary version of: http://data.ga-group.nl/ics/trbc/5340202012
is version of: http://data.ga-group.nl/ics/trbc/5340202012
replaces: http://data.ga-group.nl/ics/trbc/2012/5340202012
imported on: 2023-04-07T16:52:39.364811Z
last refreshed on: 2026-06-05T07:16:11.699Z
source accessed on: 2017-12-31T07:04:19Z
source last accessed on: 2021-08-01T01:06:53Z
definition: Companies engaged in operation of discount stores with grocery. Includes companies offering a diversified line of products with none being dominant. Excludes operators of stores that are majority in food retailing, classified in Food Retail & Distribution.
notation: 5340202012
valid from: 2020
is activity of: Discount Stores

Discount Stores without Grocery
type: NamedIndividual
type: Activity
type: BusinessClassification
is contemporary version of: http://data.ga-group.nl/ics/trbc/5340202013
is version of: http://data.ga-group.nl/ics/trbc/5340202013
replaces: http://data.ga-group.nl/ics/trbc/2012/5340202013
imported on: 2023-04-07T16:52:39.364811Z
last refreshed on: 2026-06-05T07:16:11.699Z
source accessed on: 2017-12-31T07:04:19Z
source last accessed on: 2021-08-01T01:06:53Z
definition: Companies engaged in operation of discount stores without grocery. Includes companies offering a diversified line of products with none being dominant. Excludes operators of stores that are majority in food retailing, classified in Food Retail & Distribution.
notation: 5340202013
valid from: 2020
is activity of: Discount Stores

Discount Stores with Gasoline
type: NamedIndividual
type: Activity
type: BusinessClassification
is contemporary version of: http://data.ga-group.nl/ics/trbc/5340202014
is version of: http://data.ga-group.nl/ics/trbc/5340202014
replaces: http://data.ga-group.nl/ics/trbc/2012/5340202014
imported on: 2023-04-07T16:52:39.364811Z
last refreshed on: 2026-06-05T07:16:11.699Z
source accessed on: 2017-12-31T07:04:19Z
source last accessed on: 2021-08-01T01:06:53Z
definition: Companies engaged in operation of discount stores with gasoline store.
notation: 5340202014
valid from: 2020
is activity of: Discount Stores

Discount Stores without Gasoline
type: NamedIndividual
type: Activity
type: BusinessClassification
is contemporary version of: http://data.ga-group.nl/ics/trbc/5340202015
is version of: http://data.ga-group.nl/ics/trbc/5340202015
replaces: http://data.ga-group.nl/ics/trbc/2012/5340202015
imported on: 2023-04-07T16:52:39.364811Z
last refreshed on: 2026-06-05T07:16:11.699Z
source accessed on: 2017-12-31T07:04:19Z
source last accessed on: 2021-08-01T01:06:53Z
definition: Companies engaged in operation of discount stores without gasoline store.
notation: 5340202015
valid from: 2020
is activity of: Discount Stores

Discount Stores
type: NamedIndividual
type: BusinessClassification
type: Industry
is contemporary version of: http://data.ga-group.nl/ics/trbc/53402020
is version of: http://data.ga-group.nl/ics/trbc/53402020
replaces: http://data.ga-group.nl/ics/trbc/2012/53402020
imported on: 2023-04-07T16:52:39.364811Z
last refreshed on: 2026-06-05T07:16:11.699Z
source accessed on: 2017-12-31T07:04:19Z
source last accessed on: 2021-08-01T01:06:53Z
definition: Retailers operating stores with a diversified product lines at a discount. Includes discount stores with auxiliary or primarily internet and mail order facilities.
notation: 53402020
valid from: 2020
is industry of: Diversified Retail

Diversified Retail
type: NamedIndividual
type: BusinessClassification
type: IndustryGroup
is contemporary version of: http://data.ga-group.nl/ics/trbc/534020
is version of: http://data.ga-group.nl/ics/trbc/534020
replaces: http://data.ga-group.nl/ics/trbc/2012/534020
imported on: 2023-04-07T16:52:39.364811Z
last refreshed on: 2026-06-05T07:16:11.699Z
source accessed on: 2017-12-31T07:04:19Z
source last accessed on: 2021-08-01T01:06:53Z
definition: Retailers offering diversified product lines through department, discount and online or mail order stores.
notation: 534020
valid from: 2020
is industry group of: Retailers

Auto Vehicles, Parts & Service Retailers (NEC)
type: NamedIndividual
type: Activity
type: BusinessClassification
is contemporary version of: http://data.ga-group.nl/ics/trbc/5340301010
is version of: http://data.ga-group.nl/ics/trbc/5340301010
replaces: http://data.ga-group.nl/ics/trbc/2012/5340301010
imported on: 2023-04-07T16:52:39.364811Z
last refreshed on: 2026-06-05T07:16:11.699Z
source accessed on: 2017-12-31T07:04:19Z
source last accessed on: 2021-08-01T01:06:53Z
definition: Companies involved in at least two activities under the Auto Vehicles, Parts & Service Retailers industry, none being dominant: retailers of auto vehicles, parts and services.
notation: 5340301010
valid from: 2020
is activity of: Auto Vehicles, Parts & Service Retailers

New Car Dealers
type: NamedIndividual
type: Activity
type: BusinessClassification
is contemporary version of: http://data.ga-group.nl/ics/trbc/5340301011
is version of: http://data.ga-group.nl/ics/trbc/5340301011
replaces: http://data.ga-group.nl/ics/trbc/2012/5340301011
imported on: 2023-04-07T16:52:39.364811Z
last refreshed on: 2026-06-05T07:16:11.699Z
source accessed on: 2017-12-31T07:04:19Z
source last accessed on: 2021-08-01T01:06:53Z
definition: Companies engaged in retailing of new cars, consumer oriented light trucks, minivans, sports utility vehicles based on a dealership contract with automobile makers. Includes also the provision of maintenance services for cars.
notation: 5340301011
valid from: 2020
is activity of: Auto Vehicles, Parts & Service Retailers

Used Car Dealers
type: NamedIndividual
type: Activity
type: BusinessClassification
is contemporary version of: http://data.ga-group.nl/ics/trbc/5340301012
is version of: http://data.ga-group.nl/ics/trbc/5340301012
replaces: http://data.ga-group.nl/ics/trbc/2012/5340301012
imported on: 2023-04-07T16:52:39.364811Z
last refreshed on: 2026-06-05T07:16:11.699Z
source accessed on: 2017-12-31T07:04:19Z
source last accessed on: 2021-08-01T01:06:53Z
definition: Companies engaged in retailing of used cars, consumer oriented light trucks, minivans, sports utility vehicles.
notation: 5340301012
valid from: 2020
is activity of: Auto Vehicles, Parts & Service Retailers

Motorcycle Dealers
type: NamedIndividual
type: Activity
type: BusinessClassification
is contemporary version of: http://data.ga-group.nl/ics/trbc/5340301013
is version of: http://data.ga-group.nl/ics/trbc/5340301013
replaces: http://data.ga-group.nl/ics/trbc/2012/5340301013
imported on: 2023-04-07T16:52:39.364811Z
last refreshed on: 2026-06-05T07:16:11.699Z
source accessed on: 2017-12-31T07:04:19Z
source last accessed on: 2021-08-01T01:06:53Z
definition: Companies engaged in retailing of new and used motorcycles, electric bikes and motor scooters. Includes also the provision of maintenance services for motorcycle.
notation: 5340301013
valid from: 2020
is activity of: Auto Vehicles, Parts & Service Retailers

Automotive Parts & Accessories Retailers
type: NamedIndividual
type: Activity
type: BusinessClassification
is contemporary version of: http://data.ga-group.nl/ics/trbc/5340301014
is version of: http://data.ga-group.nl/ics/trbc/5340301014
replaces: http://data.ga-group.nl/ics/trbc/2012/5340301014
imported on: 2023-04-07T16:52:39.364811Z
last refreshed on: 2026-06-05T07:16:11.699Z
source accessed on: 2017-12-31T07:04:19Z
source last accessed on: 2021-08-01T01:06:53Z
definition: Companies engaged in retailing of parts and accessories for automobiles and motorcycles along with repair services.
notation: 5340301014
valid from: 2020
is activity of: Auto Vehicles, Parts & Service Retailers

Tire Dealers
type: NamedIndividual
type: Activity
type: BusinessClassification
is contemporary version of: http://data.ga-group.nl/ics/trbc/5340301015
is version of: http://data.ga-group.nl/ics/trbc/5340301015
replaces: http://data.ga-group.nl/ics/trbc/2012/5340301015
imported on: 2023-04-07T16:52:39.364811Z
last refreshed on: 2026-06-05T07:16:11.699Z
source accessed on: 2017-12-31T07:04:19Z
source last accessed on: 2021-08-01T01:06:53Z
definition: Companies engaged in retailing of new and used tires and tubes along with repair services.
notation: 5340301015
valid from: 2020
is activity of: Auto Vehicles, Parts & Service Retailers

Luxury Car Dealers
type: NamedIndividual
type: Activity
type: BusinessClassification
is contemporary version of: http://data.ga-group.nl/ics/trbc/5340301016
is version of: http://data.ga-group.nl/ics/trbc/5340301016
replaces: http://data.ga-group.nl/ics/trbc/2012/5340301016
imported on: 2023-04-07T16:52:39.364811Z
last refreshed on: 2026-06-05T07:16:11.699Z
source accessed on: 2017-12-31T07:04:19Z
source last accessed on: 2021-08-01T01:06:53Z
definition: Companies engaged in retailing of luxury cars.
notation: 5340301016
valid from: 2020
is activity of: Auto Vehicles, Parts & Service Retailers

Auto Vehicles, Parts & Service Retailers
type: NamedIndividual
type: BusinessClassification
type: Industry
is contemporary version of: http://data.ga-group.nl/ics/trbc/53403010
is version of: http://data.ga-group.nl/ics/trbc/53403010
replaces: http://data.ga-group.nl/ics/trbc/2012/53403010
imported on: 2023-04-07T16:52:39.364811Z
last refreshed on: 2026-06-05T07:16:11.699Z
source accessed on: 2017-12-31T07:04:19Z
source last accessed on: 2021-08-01T01:06:53Z
definition: Retailers of auto vehicles, parts and services.
notation: 53403010
valid from: 2020
is industry of: Specialty Retailers

Home Improvement Products & Services Retailers (NEC)
type: NamedIndividual
type: Activity
type: BusinessClassification
is contemporary version of: http://data.ga-group.nl/ics/trbc/5340302010
is version of: http://data.ga-group.nl/ics/trbc/5340302010
replaces: http://data.ga-group.nl/ics/trbc/2012/5340302010
imported on: 2023-04-07T16:52:39.364811Z
last refreshed on: 2026-06-05T07:16:11.699Z
source accessed on: 2017-12-31T07:04:19Z
source last accessed on: 2021-08-01T01:06:53Z
definition: Companies involved in at least two activities under the Home Improvement Products & Services Retailers industry, none being dominant: retailers of home and garden improvement products and services, as well as building materials.
notation: 5340302010
valid from: 2020
is activity of: Home Improvement Products & Services Retailers

Paint & Wallpaper Retailers
type: NamedIndividual
type: Activity
type: BusinessClassification
is contemporary version of: http://data.ga-group.nl/ics/trbc/5340302011
is version of: http://data.ga-group.nl/ics/trbc/5340302011
replaces: http://data.ga-group.nl/ics/trbc/2012/5340302011
imported on: 2023-04-07T16:52:39.364811Z
last refreshed on: 2026-06-05T07:16:11.699Z
source accessed on: 2017-12-31T07:04:19Z
source last accessed on: 2021-08-01T01:06:53Z
definition: Retailers of paint, wallpaper and related products.
notation: 5340302011
valid from: 2020
is activity of: Home Improvement Products & Services Retailers

Builder Merchants
type: NamedIndividual
type: Activity
type: BusinessClassification
is contemporary version of: http://data.ga-group.nl/ics/trbc/5340302012
is version of: http://data.ga-group.nl/ics/trbc/5340302012
replaces: http://data.ga-group.nl/ics/trbc/2012/5340302012
imported on: 2023-04-07T16:52:39.364811Z
last refreshed on: 2026-06-05T07:16:11.699Z
source accessed on: 2017-12-31T07:04:19Z
source last accessed on: 2021-08-01T01:06:53Z
definition: Companies engaged in retail of value added building products such as door and window frames, moldings and trims, roofing, gutters, floorboards, tiles, insulating materials, plumbing fixtures, electrical supplies, prefabricated buildings and kits, and other supplies.
notation: 5340302012
valid from: 2020
is activity of: Home Improvement Products & Services Retailers

Nursery & Garden Centers
type: NamedIndividual
type: Activity
type: BusinessClassification
is contemporary version of: http://data.ga-group.nl/ics/trbc/5340302013
is version of: http://data.ga-group.nl/ics/trbc/5340302013
replaces: http://data.ga-group.nl/ics/trbc/2012/5340302013
imported on: 2023-04-07T16:52:39.364811Z
last refreshed on: 2026-06-05T07:16:11.699Z
source accessed on: 2017-12-31T07:04:19Z
source last accessed on: 2021-08-01T01:06:53Z
definition: Retailers of nursery products such as trees, shrubs, plants, seeds, sod, fertilizers, as well as lawn care and gardening supplies and tools.
notation: 5340302013
valid from: 2020
is activity of: Home Improvement Products & Services Retailers

Kitchen & Bathroom Retailers
type: NamedIndividual
type: Activity
type: BusinessClassification
is contemporary version of: http://data.ga-group.nl/ics/trbc/5340302014
is version of: http://data.ga-group.nl/ics/trbc/5340302014
replaces: http://data.ga-group.nl/ics/trbc/2012/5340302014
imported on: 2023-04-07T16:52:39.364811Z
last refreshed on: 2026-06-05T07:16:11.699Z
source accessed on: 2017-12-31T07:04:19Z
source last accessed on: 2021-08-01T01:06:53Z
definition: Retailers of kitchen and bathroom fixtures and supplies such as cabinets, sinks, faucets, pipes and bathtubs.
notation: 5340302014
valid from: 2020
is activity of: Home Improvement Products & Services Retailers

Home Décor Retailers
type: NamedIndividual
type: Activity
type: BusinessClassification
is contemporary version of: http://data.ga-group.nl/ics/trbc/5340302015
is version of: http://data.ga-group.nl/ics/trbc/5340302015
replaces: http://data.ga-group.nl/ics/trbc/2012/5340302015
imported on: 2023-04-07T16:52:39.364811Z
last refreshed on: 2026-06-05T07:16:11.699Z
source accessed on: 2017-12-31T07:04:19Z
source last accessed on: 2021-08-01T01:06:53Z
definition: Retailers of home décor products, such as handicraft, artforms, paintings, sculptures, applied art pieces, artificial flora, artwork and other home decoration products.
notation: 5340302015
valid from: 2020
is activity of: Home Improvement Products & Services Retailers

Interior Design Services
type: NamedIndividual
type: Activity
type: BusinessClassification
is contemporary version of: http://data.ga-group.nl/ics/trbc/5340302016
is version of: http://data.ga-group.nl/ics/trbc/5340302016
replaces: http://data.ga-group.nl/ics/trbc/2012/5340302016
imported on: 2023-04-07T16:52:39.364811Z
last refreshed on: 2026-06-05T07:16:11.699Z
source accessed on: 2017-12-31T07:04:19Z
source last accessed on: 2021-08-01T01:06:53Z
definition: Companies engaged in planning, designing, and decoration of interior spaces of houses and offices.
notation: 5340302016
valid from: 2020
is activity of: Home Improvement Products & Services Retailers

Luxury Home Improvement Product Retailers
type: NamedIndividual
type: Activity
type: BusinessClassification
is contemporary version of: http://data.ga-group.nl/ics/trbc/5340302017
is version of: http://data.ga-group.nl/ics/trbc/5340302017
replaces: http://data.ga-group.nl/ics/trbc/2012/5340302017
imported on: 2023-04-07T16:52:39.364811Z
last refreshed on: 2026-06-05T07:16:11.699Z
source accessed on: 2017-12-31T07:04:19Z
source last accessed on: 2021-08-01T01:06:53Z
definition: Retailers of luxury home and garden improvement products, as well as luxury building materials.
notation: 5340302017
valid from: 2020
is activity of: Home Improvement Products & Services Retailers

Home Improvement Products & Services Retailers
type: NamedIndividual
type: BusinessClassification
type: Industry
is contemporary version of: http://data.ga-group.nl/ics/trbc/53403020
is version of: http://data.ga-group.nl/ics/trbc/53403020
replaces: http://data.ga-group.nl/ics/trbc/2012/53403020
imported on: 2023-04-07T16:52:39.364811Z
last refreshed on: 2026-06-05T07:16:11.699Z
source accessed on: 2017-12-31T07:04:19Z
source last accessed on: 2021-08-01T01:06:53Z
definition: Retailers of home and garden improvement products and services, as well as building materials.
notation: 53403020
valid from: 2020
is industry of: Specialty Retailers

Home Furnishings Retailers (NEC)
type: NamedIndividual
type: Activity
type: BusinessClassification
is contemporary version of: http://data.ga-group.nl/ics/trbc/5340303010
is version of: http://data.ga-group.nl/ics/trbc/5340303010
replaces: http://data.ga-group.nl/ics/trbc/2012/5340303010
imported on: 2023-04-07T16:52:39.364811Z
last refreshed on: 2026-06-05T07:16:11.699Z
source accessed on: 2017-12-31T07:04:19Z
source last accessed on: 2021-08-01T01:06:53Z
definition: Companies involved in at least two activities under the Home Furnishings Retailers industry, none being dominant: retailers of home furnishings and furniture. Excludes kitchen and bathroom improvement specialists (classified in Home Improvement Products & Services Retailers).
notation: 5340303010
valid from: 2020
is activity of: Home Furnishings Retailers

Furniture Retailers
type: NamedIndividual
type: Activity
type: BusinessClassification
is contemporary version of: http://data.ga-group.nl/ics/trbc/5340303011
is version of: http://data.ga-group.nl/ics/trbc/5340303011
replaces: http://data.ga-group.nl/ics/trbc/2012/5340303011
imported on: 2023-04-07T16:52:39.364811Z
last refreshed on: 2026-06-05T07:16:11.699Z
source accessed on: 2017-12-31T07:04:19Z
source last accessed on: 2021-08-01T01:06:53Z
definition: Retailers of furniture such as desks, tables, chairs, cabinets, drawers, bed frames and headboards, entertainment centers and stands and outdoor furniture.
notation: 5340303011
valid from: 2020
is activity of: Home Furnishings Retailers

Floor Covering Retailers
type: NamedIndividual
type: Activity
type: BusinessClassification
is contemporary version of: http://data.ga-group.nl/ics/trbc/5340303012
is version of: http://data.ga-group.nl/ics/trbc/5340303012
replaces: http://data.ga-group.nl/ics/trbc/2012/5340303012
imported on: 2023-04-07T16:52:39.364811Z
last refreshed on: 2026-06-05T07:16:11.699Z
source accessed on: 2017-12-31T07:04:19Z
source last accessed on: 2021-08-01T01:06:53Z
definition: Retailers of carpets, rugs, wood or vinyl floor coverings, and floor tiles.
notation: 5340303012
valid from: 2020
is activity of: Home Furnishings Retailers

Soft Furnishing Retailers
type: NamedIndividual
type: Activity
type: BusinessClassification
is contemporary version of: http://data.ga-group.nl/ics/trbc/5340303013
is version of: http://data.ga-group.nl/ics/trbc/5340303013
replaces: http://data.ga-group.nl/ics/trbc/2012/5340303013
imported on: 2023-04-07T16:52:39.364811Z
last refreshed on: 2026-06-05T07:16:11.699Z
source accessed on: 2017-12-31T07:04:19Z
source last accessed on: 2021-08-01T01:06:53Z
definition: Retailers of couches, mattresses, cushions, beddings, bathroom textiles, curtains, blinds, shades.
notation: 5340303013
valid from: 2020
is activity of: Home Furnishings Retailers

Luxury Furnishing Retailers
type: NamedIndividual
type: Activity
type: BusinessClassification
is contemporary version of: http://data.ga-group.nl/ics/trbc/5340303014
is version of: http://data.ga-group.nl/ics/trbc/5340303014
replaces: http://data.ga-group.nl/ics/trbc/2012/5340303014
imported on: 2023-04-07T16:52:39.364811Z
last refreshed on: 2026-06-05T07:16:11.699Z
source accessed on: 2017-12-31T07:04:19Z
source last accessed on: 2021-08-01T01:06:53Z
definition: Retailers of luxury home furnishings and furniture.
notation: 5340303014
valid from: 2020
is activity of: Home Furnishings Retailers

Antique Dealers
type: NamedIndividual
type: Activity
type: BusinessClassification
is contemporary version of: http://data.ga-group.nl/ics/trbc/5340303015
is version of: http://data.ga-group.nl/ics/trbc/5340303015
replaces: http://data.ga-group.nl/ics/trbc/2012/5340303015
imported on: 2023-04-07T16:52:39.364811Z
last refreshed on: 2026-06-05T07:16:11.699Z
source accessed on: 2017-12-31T07:04:19Z
source last accessed on: 2021-08-01T01:06:53Z
definition: Retailers of antiques including frescos, sculptures, porcelains, handicrafts and other antiques.
notation: 5340303015
valid from: 2020
is activity of: Home Furnishings Retailers

Art & Craftwork Retailers
type: NamedIndividual
type: Activity
type: BusinessClassification
is contemporary version of: http://data.ga-group.nl/ics/trbc/5340303016
is version of: http://data.ga-group.nl/ics/trbc/5340303016
imported on: 2023-04-07T17:17:07.492231Z
last refreshed on: 2026-06-05T07:16:11.699Z
source accessed on: 2021-04-25T05:48:36Z
source last accessed on: 2021-08-01T01:06:53Z
definition: Retailers of art pieces, such as paintings, sculptures, carvings, and craftwork, such as decorative handicraft, pottery, metal works, glass works, home décor items.
notation: 5340303016
valid from: 2020
is activity of: Home Furnishings Retailers

Home Furnishings Retailers
type: NamedIndividual
type: BusinessClassification
type: Industry
is contemporary version of: http://data.ga-group.nl/ics/trbc/53403030
is version of: http://data.ga-group.nl/ics/trbc/53403030
replaces: http://data.ga-group.nl/ics/trbc/2012/53403030
imported on: 2023-04-07T16:52:39.364811Z
last refreshed on: 2026-06-05T07:16:11.699Z
source accessed on: 2017-12-31T07:04:19Z
source last accessed on: 2021-08-01T01:06:53Z
definition: Retailers of home furnishings and furniture.
notation: 53403030
valid from: 2020
is industry of: Specialty Retailers

Apparel & Accessories Retailers (NEC)
type: NamedIndividual
type: Activity
type: BusinessClassification
is contemporary version of: http://data.ga-group.nl/ics/trbc/5340304010
is version of: http://data.ga-group.nl/ics/trbc/5340304010
replaces: http://data.ga-group.nl/ics/trbc/2012/5340304010
imported on: 2023-04-07T16:52:39.364811Z
last refreshed on: 2026-06-05T07:16:11.699Z
source accessed on: 2017-12-31T07:04:19Z
source last accessed on: 2021-08-01T01:06:53Z
definition: Companies involved in at least two activities under the Apparel & Accessories Retailers industry, none being dominant: operation of men, women and children's clothing and accessories stores, as well as retailers of handbags, footwear, leather goods, luggage, jewelry and watches.
notation: 5340304010
valid from: 2020
is activity of: Apparel & Accessories Retailers

Footwear Retailers
type: NamedIndividual
type: Activity
type: BusinessClassification
is contemporary version of: http://data.ga-group.nl/ics/trbc/5340304011
is version of: http://data.ga-group.nl/ics/trbc/5340304011
replaces: http://data.ga-group.nl/ics/trbc/2012/5340304011
imported on: 2023-04-07T16:52:39.364811Z
last refreshed on: 2026-06-05T07:16:11.699Z
source accessed on: 2017-12-31T07:04:19Z
source last accessed on: 2021-08-01T01:06:53Z
definition: Retailers of men's, women's, children's footwear, as well as sporting footwear. Includes also companies engaged in footwear and leather goods.
notation: 5340304011
valid from: 2020
is activity of: Apparel & Accessories Retailers

Jewelry & Watch Retailers
type: NamedIndividual
type: Activity
type: BusinessClassification
is contemporary version of: http://data.ga-group.nl/ics/trbc/5340304012
is version of: http://data.ga-group.nl/ics/trbc/5340304012
replaces: http://data.ga-group.nl/ics/trbc/2012/5340304012
imported on: 2023-04-07T16:52:39.364811Z
last refreshed on: 2026-06-05T07:16:11.699Z
source accessed on: 2017-12-31T07:04:19Z
source last accessed on: 2021-08-01T01:06:53Z
definition: Retailers of jewelry, watches and clocks. Includes also jewelry and watch repair services.
notation: 5340304012
valid from: 2020
is activity of: Apparel & Accessories Retailers

Men's Apparel Retailers
type: NamedIndividual
type: Activity
type: BusinessClassification
is contemporary version of: http://data.ga-group.nl/ics/trbc/5340304013
is version of: http://data.ga-group.nl/ics/trbc/5340304013
replaces: http://data.ga-group.nl/ics/trbc/2012/5340304013
imported on: 2023-04-07T16:52:39.364811Z
last refreshed on: 2026-06-05T07:16:11.699Z
source accessed on: 2017-12-31T07:04:19Z
source last accessed on: 2021-08-01T01:06:53Z
definition: Retailers of men's and boy's outerwear and underwear.
notation: 5340304013
valid from: 2020
is activity of: Apparel & Accessories Retailers

Women's Apparel Retailers
type: NamedIndividual
type: Activity
type: BusinessClassification
is contemporary version of: http://data.ga-group.nl/ics/trbc/5340304014
is version of: http://data.ga-group.nl/ics/trbc/5340304014
replaces: http://data.ga-group.nl/ics/trbc/2012/5340304014
imported on: 2023-04-07T16:52:39.364811Z
last refreshed on: 2026-06-05T07:16:11.699Z
source accessed on: 2017-12-31T07:04:19Z
source last accessed on: 2021-08-01T01:06:53Z
definition: Retailers of women's and girls' outwear, underwear and hosiery. Includes also retailers of maternity products.
notation: 5340304014
valid from: 2020
is activity of: Apparel & Accessories Retailers

Children's & Infants' Clothing Retailers
type: NamedIndividual
type: Activity
type: BusinessClassification
is contemporary version of: http://data.ga-group.nl/ics/trbc/5340304015
is version of: http://data.ga-group.nl/ics/trbc/5340304015
replaces: http://data.ga-group.nl/ics/trbc/2012/5340304015
imported on: 2023-04-07T16:52:39.364811Z
last refreshed on: 2026-06-05T07:16:11.699Z
source accessed on: 2017-12-31T07:04:19Z
source last accessed on: 2021-08-01T01:06:53Z
definition: Retailers of children's and infants clothing's, as well as infant bedding, bibs, infant soft goods and accessories.
notation: 5340304015
valid from: 2020
is activity of: Apparel & Accessories Retailers

Teen Fashion Retailers
type: NamedIndividual
type: Activity
type: BusinessClassification
is contemporary version of: http://data.ga-group.nl/ics/trbc/5340304016
is version of: http://data.ga-group.nl/ics/trbc/5340304016
replaces: http://data.ga-group.nl/ics/trbc/2012/5340304016
imported on: 2023-04-07T16:52:39.364811Z
last refreshed on: 2026-06-05T07:16:11.699Z
source accessed on: 2017-12-31T07:04:19Z
source last accessed on: 2021-08-01T01:06:53Z
definition: Retailers of apparels and related accessories for teenagers.
notation: 5340304016
valid from: 2020
is activity of: Apparel & Accessories Retailers

Handbags & Luggage Retailers
type: NamedIndividual
type: Activity
type: BusinessClassification
is contemporary version of: http://data.ga-group.nl/ics/trbc/5340304017
is version of: http://data.ga-group.nl/ics/trbc/5340304017
replaces: http://data.ga-group.nl/ics/trbc/2012/5340304017
imported on: 2023-04-07T16:52:39.364811Z
last refreshed on: 2026-06-05T07:16:11.699Z
source accessed on: 2017-12-31T07:04:19Z
source last accessed on: 2021-08-01T01:06:53Z
definition: Retailers of handbags, purses, wallets, suitcases and other luggage.
notation: 5340304017
valid from: 2020
is activity of: Apparel & Accessories Retailers

Luxury Apparel Retailers
type: NamedIndividual
type: Activity
type: BusinessClassification
is contemporary version of: http://data.ga-group.nl/ics/trbc/5340304018
is version of: http://data.ga-group.nl/ics/trbc/5340304018
replaces: http://data.ga-group.nl/ics/trbc/2012/5340304018
imported on: 2023-04-07T16:52:39.364811Z
last refreshed on: 2026-06-05T07:16:11.699Z
source accessed on: 2017-12-31T07:04:19Z
source last accessed on: 2021-08-01T01:06:53Z
definition: Retailers of luxury apparel brands and luxury handbag & luggage brands.
notation: 5340304018
valid from: 2020
is activity of: Apparel & Accessories Retailers

Sports & Outdoors Retailers
type: NamedIndividual
type: Activity
type: BusinessClassification
is contemporary version of: http://data.ga-group.nl/ics/trbc/5340304019
is version of: http://data.ga-group.nl/ics/trbc/5340304019
replaces: http://data.ga-group.nl/ics/trbc/2012/5340304019
imported on: 2023-04-07T16:52:39.364811Z
last refreshed on: 2026-06-05T07:16:11.699Z
source accessed on: 2017-12-31T07:04:19Z
source last accessed on: 2021-08-01T01:06:53Z
definition: Retailers of sports wears and outdoor wears, such as tracksuits, swimsuits and wind pants.
notation: 5340304019
valid from: 2020
is activity of: Apparel & Accessories Retailers

Apparel & Accessories Retailers
type: NamedIndividual
type: BusinessClassification
type: Industry
is contemporary version of: http://data.ga-group.nl/ics/trbc/53403040
is version of: http://data.ga-group.nl/ics/trbc/53403040
replaces: http://data.ga-group.nl/ics/trbc/2012/53403040
imported on: 2023-04-07T16:52:39.364811Z
last refreshed on: 2026-06-05T07:16:11.699Z
source accessed on: 2017-12-31T07:04:19Z
source last accessed on: 2021-08-01T01:06:53Z
definition: Retailers of men, women and children's clothing and accessories stores, including retailers of handbags, footwear, leather goods, luggage, jewelry and watches.
notation: 53403040
valid from: 2020
is industry of: Specialty Retailers

Computer & Electronics Retailers (NEC)
type: NamedIndividual
type: Activity
type: BusinessClassification
is contemporary version of: http://data.ga-group.nl/ics/trbc/5340305010
is version of: http://data.ga-group.nl/ics/trbc/5340305010
replaces: http://data.ga-group.nl/ics/trbc/2012/5340305010
imported on: 2023-04-07T16:52:39.364811Z
last refreshed on: 2026-06-05T07:16:11.699Z
source accessed on: 2017-12-31T07:04:19Z
source last accessed on: 2021-08-01T01:06:53Z
definition: Companies involved in at least two activities under the Computer & Electronics Retailers industry, none being dominant: retailing of computers and peripherals, consumer electronics and other technology products. Includes retail of household appliances, audio and video equipment, consumer software, digital cameras, cell phones and components and other electronic goods.
notation: 5340305010
valid from: 2020
is activity of: Computer & Electronics Retailers

Computer Hardware & Software Retailers
type: NamedIndividual
type: Activity
type: BusinessClassification
is contemporary version of: http://data.ga-group.nl/ics/trbc/5340305011
is version of: http://data.ga-group.nl/ics/trbc/5340305011
replaces: http://data.ga-group.nl/ics/trbc/2012/5340305011
imported on: 2023-04-07T16:52:39.364811Z
last refreshed on: 2026-06-05T07:16:11.699Z
source accessed on: 2017-12-31T07:04:19Z
source last accessed on: 2021-08-01T01:06:53Z
definition: Retailers of desktop computers, notebook computers, handheld computers, computer peripherals and computer software products.
notation: 5340305011
valid from: 2020
is activity of: Computer & Electronics Retailers

Consumer Electronics Retailers
type: NamedIndividual
type: Activity
type: BusinessClassification
is contemporary version of: http://data.ga-group.nl/ics/trbc/5340305012
is version of: http://data.ga-group.nl/ics/trbc/5340305012
replaces: http://data.ga-group.nl/ics/trbc/2012/5340305012
imported on: 2023-04-07T16:52:39.364811Z
last refreshed on: 2026-06-05T07:16:11.699Z
source accessed on: 2017-12-31T07:04:19Z
source last accessed on: 2021-08-01T01:06:53Z
definition: Retailers of consumer electronics such as home audio and video products and household appliances.
notation: 5340305012
valid from: 2020
is activity of: Computer & Electronics Retailers

Mobile Phone Retailers
type: NamedIndividual
type: Activity
type: BusinessClassification
is contemporary version of: http://data.ga-group.nl/ics/trbc/5340305013
is version of: http://data.ga-group.nl/ics/trbc/5340305013
replaces: http://data.ga-group.nl/ics/trbc/2012/5340305013
imported on: 2023-04-07T16:52:39.364811Z
last refreshed on: 2026-06-05T07:16:11.699Z
source accessed on: 2017-12-31T07:04:19Z
source last accessed on: 2021-08-01T01:06:53Z
definition: Retailers of mobile phones, pagers, and accessories.
notation: 5340305013
valid from: 2020
is activity of: Computer & Electronics Retailers

Computer & Electronics Retailers
type: NamedIndividual
type: BusinessClassification
type: Industry
is contemporary version of: http://data.ga-group.nl/ics/trbc/53403050
is version of: http://data.ga-group.nl/ics/trbc/53403050
replaces: http://data.ga-group.nl/ics/trbc/2012/53403050
imported on: 2023-04-07T16:52:39.364811Z
last refreshed on: 2026-06-05T07:16:11.699Z
source accessed on: 2017-12-31T07:04:19Z
source last accessed on: 2021-08-01T01:06:53Z
definition: Retailers of computers and peripherals, consumer electronics and other technology products. Includes retailers of household appliances, audio and video equipment, consumer software, digital cameras, cell phones and components, and other electronic goods.
notation: 53403050
valid from: 2020
is industry of: Specialty Retailers

Miscellaneous Specialty Retailers (NEC)
type: NamedIndividual
type: Activity
type: BusinessClassification
is contemporary version of: http://data.ga-group.nl/ics/trbc/5340309010
is version of: http://data.ga-group.nl/ics/trbc/5340309010
replaces: http://data.ga-group.nl/ics/trbc/2012/5340309010
imported on: 2023-04-07T16:52:39.364811Z
last refreshed on: 2026-06-05T07:16:11.699Z
source accessed on: 2017-12-31T07:04:19Z
source last accessed on: 2021-08-01T01:06:53Z
definition: Companies involved in at least two activities under the Miscellaneous Specialty Retailers Industry, none being dominant: operation of specialized stores and dealerships. Includes operators of office supply, book, toy, vision care, video rental, sporting equipment and other focused retail outlets. Excludes: (stores specializing in computers and other technology products, classified in Computers & Electronics Retailers), (stores specializing in jewelry, luggage, men, women, and children's clothing, classified in Apparel & Accessories Retailers), (stores specializing in home and garden improvement products and services, classified in Home Improvement Products & Services Retailers), (home furnishings and furniture, classified in Home Furnishings Retailers) and (auto vehicles, parts and services, classified in Auto Vehicles, Parts & Services Retailers).
notation: 5340309010
valid from: 2020
is activity of: Miscellaneous Specialty Retailers

Luxury Beauty Supply Retailers
type: NamedIndividual
type: Activity
type: BusinessClassification
is contemporary version of: http://data.ga-group.nl/ics/trbc/5340309011
is version of: http://data.ga-group.nl/ics/trbc/5340309011
replaces: http://data.ga-group.nl/ics/trbc/2012/5340309011
imported on: 2023-04-07T16:52:39.364811Z
last refreshed on: 2026-06-05T07:16:11.699Z
source accessed on: 2017-12-31T07:04:19Z
source last accessed on: 2021-08-01T01:06:53Z
definition: Retailers of luxury cosmetics, perfumes, toiletries, and personal grooming products.
notation: 5340309011
valid from: 2020
is activity of: Miscellaneous Specialty Retailers

Personal Care Products Retailers
type: NamedIndividual
type: Activity
type: BusinessClassification
is contemporary version of: http://data.ga-group.nl/ics/trbc/5340309012
is version of: http://data.ga-group.nl/ics/trbc/5340309012
replaces: http://data.ga-group.nl/ics/trbc/2012/5340309012
imported on: 2023-04-07T16:52:39.364811Z
last refreshed on: 2026-06-05T07:16:11.699Z
source accessed on: 2017-12-31T07:04:19Z
source last accessed on: 2021-08-01T01:06:53Z
definition: Retailers of cosmetics, perfumes, toiletries, and personal grooming products.
notation: 5340309012
valid from: 2020
is activity of: Miscellaneous Specialty Retailers

Optical Goods Stores
type: NamedIndividual
type: Activity
type: BusinessClassification
is contemporary version of: http://data.ga-group.nl/ics/trbc/5340309013
is version of: http://data.ga-group.nl/ics/trbc/5340309013
replaces: http://data.ga-group.nl/ics/trbc/2012/5340309013
imported on: 2023-04-07T16:52:39.364811Z
last refreshed on: 2026-06-05T07:16:11.699Z
source accessed on: 2017-12-31T07:04:19Z
source last accessed on: 2021-08-01T01:06:53Z
definition: Companies engaged in retailing and fitting eyeglasses, frames, lenses, sunglasses and contact lenses.
notation: 5340309013
valid from: 2020
is activity of: Miscellaneous Specialty Retailers

Health Food Stores
type: NamedIndividual
type: Activity
type: BusinessClassification
is contemporary version of: http://data.ga-group.nl/ics/trbc/5340309014
is version of: http://data.ga-group.nl/ics/trbc/5340309014
replaces: http://data.ga-group.nl/ics/trbc/2012/5340309014
imported on: 2023-04-07T16:52:39.364811Z
last refreshed on: 2026-06-05T07:16:11.699Z
source accessed on: 2017-12-31T07:04:19Z
source last accessed on: 2021-08-01T01:06:53Z
definition: Retailers of health food such as vitamins, nutritional supplements and special dietary foods.
notation: 5340309014
valid from: 2020
is activity of: Miscellaneous Specialty Retailers

Musical Instrument Retailers
type: NamedIndividual
type: Activity
type: BusinessClassification
is contemporary version of: http://data.ga-group.nl/ics/trbc/5340309015
is version of: http://data.ga-group.nl/ics/trbc/5340309015
replaces: http://data.ga-group.nl/ics/trbc/2012/5340309015
imported on: 2023-04-07T16:52:39.364811Z
last refreshed on: 2026-06-05T07:16:11.699Z
source accessed on: 2017-12-31T07:04:19Z
source last accessed on: 2021-08-01T01:06:53Z
definition: Retailers of string instruments, wind instruments and percussion instruments. Includes also the provision of repair and maintenance services.
notation: 5340309015
valid from: 2020
is activity of: Miscellaneous Specialty Retailers

Hobby & Craft Product Retailers
type: NamedIndividual
type: Activity
type: BusinessClassification
is contemporary version of: http://data.ga-group.nl/ics/trbc/5340309016
is version of: http://data.ga-group.nl/ics/trbc/5340309016
replaces: http://data.ga-group.nl/ics/trbc/2012/5340309016
imported on: 2023-04-07T16:52:39.364811Z
last refreshed on: 2026-06-05T07:16:11.699Z
source accessed on: 2017-12-31T07:04:19Z
source last accessed on: 2021-08-01T01:06:53Z
definition: Retailers of radio-controlled airplanes, boats, cars and helicopters, model cars, trains, rockets, scale figures based on anime or film, as well as craft supplies.
notation: 5340309016
valid from: 2020
is activity of: Miscellaneous Specialty Retailers

Toys & Games Retailers
type: NamedIndividual
type: Activity
type: BusinessClassification
is contemporary version of: http://data.ga-group.nl/ics/trbc/5340309017
is version of: http://data.ga-group.nl/ics/trbc/5340309017
replaces: http://data.ga-group.nl/ics/trbc/2012/5340309017
imported on: 2023-04-07T16:52:39.364811Z
last refreshed on: 2026-06-05T07:16:11.699Z
source accessed on: 2017-12-31T07:04:19Z
source last accessed on: 2021-08-01T01:06:53Z
definition: Retailers of dolls, stuffed toys, games, computer games and consoles.
notation: 5340309017
valid from: 2020
is activity of: Miscellaneous Specialty Retailers

Book & Magazine Retailers
type: NamedIndividual
type: Activity
type: BusinessClassification
is contemporary version of: http://data.ga-group.nl/ics/trbc/5340309018
is version of: http://data.ga-group.nl/ics/trbc/5340309018
replaces: http://data.ga-group.nl/ics/trbc/2012/5340309018
imported on: 2023-04-07T16:52:39.364811Z
last refreshed on: 2026-06-05T07:16:11.699Z
source accessed on: 2017-12-31T07:04:19Z
source last accessed on: 2021-08-01T01:06:53Z
definition: Retailers of new books, magazines and newspapers, along with CDs and DVDs. Includes also retail of second-hand books as well as the rental of books and videos.
notation: 5340309018
valid from: 2020
is activity of: Miscellaneous Specialty Retailers

Florists
type: NamedIndividual
type: Activity
type: BusinessClassification
is contemporary version of: http://data.ga-group.nl/ics/trbc/5340309019
is version of: http://data.ga-group.nl/ics/trbc/5340309019
replaces: http://data.ga-group.nl/ics/trbc/2012/5340309019
imported on: 2023-04-07T16:52:39.364811Z
last refreshed on: 2026-06-05T07:16:11.699Z
source accessed on: 2017-12-31T07:04:19Z
source last accessed on: 2021-08-01T01:06:53Z
definition: Retailers of cut flowers, floral arrangements, and potted plants.
notation: 5340309019
valid from: 2020
is activity of: Miscellaneous Specialty Retailers

Office Supplies & Stationery Stores
type: NamedIndividual
type: Activity
type: BusinessClassification
is contemporary version of: http://data.ga-group.nl/ics/trbc/5340309020
is version of: http://data.ga-group.nl/ics/trbc/5340309020
replaces: http://data.ga-group.nl/ics/trbc/2012/5340309020
imported on: 2023-04-07T16:52:39.364811Z
last refreshed on: 2026-06-05T07:16:11.699Z
source accessed on: 2017-12-31T07:04:19Z
source last accessed on: 2021-08-01T01:06:53Z
definition: Retailers of stationery, school and office supplies.
notation: 5340309020
valid from: 2020
is activity of: Miscellaneous Specialty Retailers

Gift, Novelty & Souvenir Stores
type: NamedIndividual
type: Activity
type: BusinessClassification
is contemporary version of: http://data.ga-group.nl/ics/trbc/5340309021
is version of: http://data.ga-group.nl/ics/trbc/5340309021
replaces: http://data.ga-group.nl/ics/trbc/2012/5340309021
imported on: 2023-04-07T16:52:39.364811Z
last refreshed on: 2026-06-05T07:16:11.699Z
source accessed on: 2017-12-31T07:04:19Z
source last accessed on: 2021-08-01T01:06:53Z
definition: Retailers of gifts, novelty, souvenir, seasonal and holiday decorations and greeting cards.
notation: 5340309021
valid from: 2020
is activity of: Miscellaneous Specialty Retailers

Used Merchandise Stores
type: NamedIndividual
type: Activity
type: BusinessClassification
is contemporary version of: http://data.ga-group.nl/ics/trbc/5340309022
is version of: http://data.ga-group.nl/ics/trbc/5340309022
replaces: http://data.ga-group.nl/ics/trbc/2012/5340309022
imported on: 2023-04-07T16:52:39.364811Z
last refreshed on: 2026-06-05T07:16:11.699Z
source accessed on: 2017-12-31T07:04:19Z
source last accessed on: 2021-08-01T01:06:53Z
definition: Retailers of used merchandise and secondhand goods. Excludes : (used motor vehicle retailer, classified under Used Car Dealers), (used book retailer, classified under Book & Magazine Retailers).
notation: 5340309022
valid from: 2020
is activity of: Miscellaneous Specialty Retailers

Sporting Goods Stores
type: NamedIndividual
type: Activity
type: BusinessClassification
is contemporary version of: http://data.ga-group.nl/ics/trbc/5340309023
is version of: http://data.ga-group.nl/ics/trbc/5340309023
replaces: http://data.ga-group.nl/ics/trbc/2012/5340309023
imported on: 2023-04-07T16:52:39.364811Z
last refreshed on: 2026-06-05T07:16:11.699Z
source accessed on: 2017-12-31T07:04:19Z
source last accessed on: 2021-08-01T01:06:53Z
definition: Retailers of sporting goods such as sports equipment and accessories.
notation: 5340309023
valid from: 2020
is activity of: Miscellaneous Specialty Retailers

Pet & Pet Supplies Retailers
type: NamedIndividual
type: Activity
type: BusinessClassification
is contemporary version of: http://data.ga-group.nl/ics/trbc/5340309024
is version of: http://data.ga-group.nl/ics/trbc/5340309024
replaces: http://data.ga-group.nl/ics/trbc/2012/5340309024
imported on: 2023-04-07T16:52:39.364811Z
last refreshed on: 2026-06-05T07:16:11.699Z
source accessed on: 2017-12-31T07:04:19Z
source last accessed on: 2021-08-01T01:06:53Z
definition: Retailers of pets, pet foods and other supplies.
notation: 5340309024
valid from: 2020
is activity of: Miscellaneous Specialty Retailers

Adult Products Retailers
type: NamedIndividual
type: Activity
type: BusinessClassification
is contemporary version of: http://data.ga-group.nl/ics/trbc/5340309025
is version of: http://data.ga-group.nl/ics/trbc/5340309025
replaces: http://data.ga-group.nl/ics/trbc/2012/5340309025
imported on: 2023-04-07T16:52:39.364811Z
last refreshed on: 2026-06-05T07:16:11.699Z
source accessed on: 2017-12-31T07:04:19Z
source last accessed on: 2021-08-01T01:06:53Z
definition: Retailers of sex toys, pornography and other adult products. Includes also adult video stores and adult book stores.
notation: 5340309025
valid from: 2020
is activity of: Miscellaneous Specialty Retailers

Miscellaneous Specialty Retailers
type: NamedIndividual
type: BusinessClassification
type: Industry
is contemporary version of: http://data.ga-group.nl/ics/trbc/53403090
is version of: http://data.ga-group.nl/ics/trbc/53403090
replaces: http://data.ga-group.nl/ics/trbc/2012/53403090
imported on: 2023-04-07T16:52:39.364811Z
last refreshed on: 2026-06-05T07:16:11.699Z
source accessed on: 2017-12-31T07:04:19Z
source last accessed on: 2021-08-01T01:06:53Z
definition: Retailers operating specialized stores and dealerships. Includes operators of office supply, book, toy, vision care, video rental, sporting equipment and other focused retail outlets.
notation: 53403090
valid from: 2020
is industry of: Specialty Retailers

Specialty Retailers
type: NamedIndividual
type: BusinessClassification
type: IndustryGroup
is contemporary version of: http://data.ga-group.nl/ics/trbc/534030
is version of: http://data.ga-group.nl/ics/trbc/534030
replaces: http://data.ga-group.nl/ics/trbc/2012/534030
imported on: 2026-06-05T07:16:11.699Z
last refreshed on: 2026-06-05T07:16:11.699Z
source accessed on: 2021-07-28T17:27:51Z
source last accessed on: 2021-07-28T17:27:51Z
definition: Retailers operating stores and dealerships focused on a single area. Includes auto part, home improvement, home furnishing, office supply, toy, sporting equipment, book, kitchenware and houseware retailers. Includes also garden centers, car and truck dealerships.
notation: 534030
valid from: 2020
is industry group of: Retailers

Retailers
type: NamedIndividual
type: BusinessClassification
type: BusinessSector
is contemporary version of: http://data.ga-group.nl/ics/trbc/5340
is version of: http://data.ga-group.nl/ics/trbc/5340
replaces: http://data.ga-group.nl/ics/trbc/2012/5340
imported on: 2023-04-07T16:52:39.364811Z
last refreshed on: 2026-06-05T07:16:11.699Z
source accessed on: 2017-12-31T07:04:19Z
source last accessed on: 2021-08-01T01:06:53Z
definition: Retailers that operate department, discount, catalog and internet, apparel & accessories, computers and electronics and other specialty stores.
notation: 5340
valid from: 2020
is business sector of: Consumer Cyclicals

Consumer Cyclicals
type: NamedIndividual
type: BusinessClassification
type: EconomicSector
is contemporary version of: http://data.ga-group.nl/ics/trbc/53
is version of: http://data.ga-group.nl/ics/trbc/53
replaces: http://data.ga-group.nl/ics/trbc/2012/53
imported on: 2023-04-07T16:52:39.364811Z
last refreshed on: 2026-06-05T07:16:11.699Z
source accessed on: 2017-12-31T07:04:19Z
source last accessed on: 2021-08-01T01:06:53Z
definition: Manufacturers of automobiles, household goods, textiles and other products, as well as homebuilders and retailers, and providers of consumer services, such as hotel, entertainment and media services.
notation: 53
valid from: 2020

Brewers (NEC)
type: NamedIndividual
type: Activity
type: BusinessClassification
is contemporary version of: http://data.ga-group.nl/ics/trbc/5410101010
is version of: http://data.ga-group.nl/ics/trbc/5410101010
replaces: http://data.ga-group.nl/ics/trbc/2012/5410101010
imported on: 2023-04-07T16:52:39.364811Z
last refreshed on: 2026-06-05T07:16:11.699Z
source accessed on: 2017-12-31T07:04:19Z
source last accessed on: 2021-08-01T01:06:53Z
definition: Companies involved in at least two activities under the Brewers Industry, none being dominant. Includes manufacturing of beer and malt liquor.
notation: 5410101010
valid from: 2020
is activity of: Brewers

Craft & Micro Brewers
type: NamedIndividual
type: Activity
type: BusinessClassification
is contemporary version of: http://data.ga-group.nl/ics/trbc/5410101011
is version of: http://data.ga-group.nl/ics/trbc/5410101011
replaces: http://data.ga-group.nl/ics/trbc/2012/5410101011
imported on: 2023-04-07T16:52:39.364811Z
last refreshed on: 2026-06-05T07:16:11.699Z
source accessed on: 2017-12-31T07:04:19Z
source last accessed on: 2021-08-01T01:06:53Z
definition: Small and independent manufacturers of beer and malt liquor. Micro brewers are breweries which produce a limited amount of beer.
notation: 5410101011
valid from: 2020
is activity of: Brewers

Brewers
type: NamedIndividual
type: BusinessClassification
type: Industry
is contemporary version of: http://data.ga-group.nl/ics/trbc/54101010
is version of: http://data.ga-group.nl/ics/trbc/54101010
replaces: http://data.ga-group.nl/ics/trbc/2012/54101010
imported on: 2023-04-07T16:52:39.364811Z
last refreshed on: 2026-06-05T07:16:11.699Z
source accessed on: 2017-12-31T07:04:19Z
source last accessed on: 2021-08-01T01:06:53Z
definition: Manufacturers of beer and malt liquor.
notation: 54101010
valid from: 2020
is industry of: Beverages

Distillers & Wineries (NEC)
type: NamedIndividual
type: Activity
type: BusinessClassification
is contemporary version of: http://data.ga-group.nl/ics/trbc/5410102010
is version of: http://data.ga-group.nl/ics/trbc/5410102010
replaces: http://data.ga-group.nl/ics/trbc/2012/5410102010
imported on: 2023-04-07T16:52:39.364811Z
last refreshed on: 2026-06-05T07:16:11.699Z
source accessed on: 2017-12-31T07:04:19Z
source last accessed on: 2021-08-01T01:06:53Z
definition: Companies involved in at least two activities under the Distillers & Wineries Industry, none being dominant: manufacturing wine, champagne and sparkling wine, as well as distilled alcoholic beverages such as vodka, brandy, whisky, gin, sake and other malt and blended alcoholic beverages.
notation: 5410102010
valid from: 2020
is activity of: Distillers & Wineries

Wineries
type: NamedIndividual
type: Activity
type: BusinessClassification
is contemporary version of: http://data.ga-group.nl/ics/trbc/5410102011
is version of: http://data.ga-group.nl/ics/trbc/5410102011
replaces: http://data.ga-group.nl/ics/trbc/2012/5410102011
imported on: 2023-04-07T16:52:39.364811Z
last refreshed on: 2026-06-05T07:16:11.699Z
source accessed on: 2017-12-31T07:04:19Z
source last accessed on: 2021-08-01T01:06:53Z
definition: Companies engaged in manufacturing, wine, champagne and sparkling wine.
notation: 5410102011
valid from: 2020
is activity of: Distillers & Wineries

Distilleries
type: NamedIndividual
type: Activity
type: BusinessClassification
is contemporary version of: http://data.ga-group.nl/ics/trbc/5410102012
is version of: http://data.ga-group.nl/ics/trbc/5410102012
replaces: http://data.ga-group.nl/ics/trbc/2012/5410102012
imported on: 2023-04-07T16:52:39.364811Z
last refreshed on: 2026-06-05T07:16:11.699Z
source accessed on: 2017-12-31T07:04:19Z
source last accessed on: 2021-08-01T01:06:53Z
definition: Companies engaged in manufacturing distilled alcoholic beverages such as vodka, brandy, whisky, gin, and sake.
notation: 5410102012
valid from: 2020
is activity of: Distillers & Wineries

Malt Producers
type: NamedIndividual
type: Activity
type: BusinessClassification
is contemporary version of: http://data.ga-group.nl/ics/trbc/5410102013
is version of: http://data.ga-group.nl/ics/trbc/5410102013
replaces: http://data.ga-group.nl/ics/trbc/2012/5410102013
imported on: 2023-04-07T16:52:39.364811Z
last refreshed on: 2026-06-05T07:16:11.699Z
source accessed on: 2017-12-31T07:04:19Z
source last accessed on: 2021-08-01T01:06:53Z
definition: Companies engaged in manufacturing malts. Malt is mostly used as the basic raw material in beer and whisky. Grain malt is also used in food products, which include breakfast cereals, confectionary, baked goods, malt vinegar and malt extracts which are a primary ingredients many food and soft drink product.
notation: 5410102013
valid from: 2020
is activity of: Distillers & Wineries

Distillers & Wineries
type: NamedIndividual
type: BusinessClassification
type: Industry
is contemporary version of: http://data.ga-group.nl/ics/trbc/54101020
is version of: http://data.ga-group.nl/ics/trbc/54101020
replaces: http://data.ga-group.nl/ics/trbc/2012/54101020
imported on: 2023-04-07T16:52:39.364811Z
last refreshed on: 2026-06-05T07:16:11.699Z
source accessed on: 2017-12-31T07:04:19Z
source last accessed on: 2021-08-01T01:06:53Z
definition: Manufacturers of wine, champagne and sparkling wine, as well as distilled alcoholic beverages such as vodka, brandy, whisky, gin, sake and other malt and blended alcoholic beverages.
notation: 54101020
valid from: 2020
is industry of: Beverages

Non-Alcoholic Beverages (NEC)
type: NamedIndividual
type: Activity
type: BusinessClassification
is contemporary version of: http://data.ga-group.nl/ics/trbc/5410103010
is version of: http://data.ga-group.nl/ics/trbc/5410103010
replaces: http://data.ga-group.nl/ics/trbc/2012/5410103010
imported on: 2023-04-07T16:52:39.364811Z
last refreshed on: 2026-06-05T07:16:11.699Z
source accessed on: 2017-12-31T07:04:19Z
source last accessed on: 2021-08-01T01:06:53Z
definition: Companies involved in at least two activities under the Non-Alcoholic Beverages Industry, none being dominant: manufacturing non-alcoholic beverages such as water, fruit drinks, soft drinks, iced coffee and tea as well as other flavored beverages. Excludes: (tea bags and instant coffee manufacturing, fruit juices and concentrates, classified in Food Processing).
notation: 5410103010
valid from: 2020
is activity of: Non-Alcoholic Beverages

Carbonated Soft Drinks
type: NamedIndividual
type: Activity
type: BusinessClassification
is contemporary version of: http://data.ga-group.nl/ics/trbc/5410103011
is version of: http://data.ga-group.nl/ics/trbc/5410103011
replaces: http://data.ga-group.nl/ics/trbc/2012/5410103011
imported on: 2023-04-07T16:52:39.364811Z
last refreshed on: 2026-06-05T07:16:11.699Z
source accessed on: 2017-12-31T07:04:19Z
source last accessed on: 2021-08-01T01:06:53Z
definition: Companies engaged in manufacturing carbonated beverages, such as soda, coke and other carbonated soft drinks.
notation: 5410103011
valid from: 2020
is activity of: Non-Alcoholic Beverages

Fruit Drinks
type: NamedIndividual
type: Activity
type: BusinessClassification
is contemporary version of: http://data.ga-group.nl/ics/trbc/5410103012
is version of: http://data.ga-group.nl/ics/trbc/5410103012
replaces: http://data.ga-group.nl/ics/trbc/2012/5410103012
imported on: 2023-04-07T16:52:39.364811Z
last refreshed on: 2026-06-05T07:16:11.699Z
source accessed on: 2017-12-31T07:04:19Z
source last accessed on: 2021-08-01T01:06:53Z
definition: Companies engaged in manufacturing juice and other fruit-flavored drinks.
notation: 5410103012
valid from: 2020
is activity of: Non-Alcoholic Beverages

Energy Drinks
type: NamedIndividual
type: Activity
type: BusinessClassification
is contemporary version of: http://data.ga-group.nl/ics/trbc/5410103013
is version of: http://data.ga-group.nl/ics/trbc/5410103013
replaces: http://data.ga-group.nl/ics/trbc/2012/5410103013
imported on: 2023-04-07T16:52:39.364811Z
last refreshed on: 2026-06-05T07:16:11.699Z
source accessed on: 2017-12-31T07:04:19Z
source last accessed on: 2021-08-01T01:06:53Z
definition: Companies engaged in manufacturing energy drinks containing caffeine and sugar with additional ingredients.
notation: 5410103013
valid from: 2020
is activity of: Non-Alcoholic Beverages

Bottled Water & Ice
type: NamedIndividual
type: Activity
type: BusinessClassification
is contemporary version of: http://data.ga-group.nl/ics/trbc/5410103014
is version of: http://data.ga-group.nl/ics/trbc/5410103014
replaces: http://data.ga-group.nl/ics/trbc/2012/5410103014
imported on: 2023-04-07T16:52:39.364811Z
last refreshed on: 2026-06-05T07:16:11.699Z
source accessed on: 2017-12-31T07:04:19Z
source last accessed on: 2021-08-01T01:06:53Z
definition: Companies engaged in manufacturing purified water, mineral water and ice.
notation: 5410103014
valid from: 2020
is activity of: Non-Alcoholic Beverages

Non-Alcoholic Beverages
type: NamedIndividual
type: BusinessClassification
type: Industry
is contemporary version of: http://data.ga-group.nl/ics/trbc/54101030
is version of: http://data.ga-group.nl/ics/trbc/54101030
replaces: http://data.ga-group.nl/ics/trbc/2012/54101030
imported on: 2023-04-07T16:52:39.364811Z
last refreshed on: 2026-06-05T07:16:11.699Z
source accessed on: 2017-12-31T07:04:19Z
source last accessed on: 2021-08-01T01:06:53Z
definition: Manufacturers of non-alcoholic beverages such as water, fruit drinks, soft drinks, coffee and tea, as well as other flavored beverages.
notation: 54101030
valid from: 2020
is industry of: Beverages

Beverages
type: NamedIndividual
type: BusinessClassification
type: IndustryGroup
is contemporary version of: http://data.ga-group.nl/ics/trbc/541010
is version of: http://data.ga-group.nl/ics/trbc/541010
replaces: http://data.ga-group.nl/ics/trbc/2012/541010
imported on: 2023-04-07T16:52:39.364811Z
last refreshed on: 2026-06-05T07:16:11.699Z
source accessed on: 2017-12-31T07:04:19Z
source last accessed on: 2021-08-01T01:06:53Z
definition: Brewers, distillers, producers and distributors of beer and malt liquor, wine and distilled liquors, as well as non-alcoholic beverages including water, fruit drinks, sodas and other flavored beverages.
notation: 541010
valid from: 2020
is industry group of: Food & Beverages

Fishing & Farming (NEC)
type: NamedIndividual
type: Activity
type: BusinessClassification
is contemporary version of: http://data.ga-group.nl/ics/trbc/5410201010
is version of: http://data.ga-group.nl/ics/trbc/5410201010
replaces: http://data.ga-group.nl/ics/trbc/2012/5410201010
imported on: 2023-04-07T16:52:39.364811Z
last refreshed on: 2026-06-05T07:16:11.699Z
source accessed on: 2017-12-31T07:04:19Z
source last accessed on: 2021-08-01T01:06:53Z
definition: Companies involved in at least two activities under the Fishing & Farming Industry, none being dominant. Includes commercial farming of fruits, vegetables, seeds, grains, sugarcane, animal feeds and other farm produce. Includes also commercial ocean and fresh water fishing, shell fish harvesting, as well as the raising of livestock such as cattle, pigs, poultry, goats and domesticated animal breeding and raising; and companies engaged in genetic research and modification for agricultural purposes. Excludes: (tobacco farming, classified in Tobacco), (farming and fishing operation that engage in processing, canning and packaging of produce, fish and animal products, classified in Food Processing).
notation: 5410201010
valid from: 2020
is activity of: Fishing & Farming

Grain (Crop) Production
type: NamedIndividual
type: Activity
type: BusinessClassification
is contemporary version of: http://data.ga-group.nl/ics/trbc/5410201011
is version of: http://data.ga-group.nl/ics/trbc/5410201011
replaces: http://data.ga-group.nl/ics/trbc/2012/5410201011
imported on: 2023-04-07T16:52:39.364811Z
last refreshed on: 2026-06-05T07:16:11.699Z
source accessed on: 2017-12-31T07:04:19Z
source last accessed on: 2021-08-01T01:06:53Z
definition: Companies engaged in growing, farming and harvesting grains such as corn, rice, wheat, soybean, barley, millet, oats, hay and other crops. Excludes :(cotton farming, classified under Cotton Farming activity).
notation: 5410201011
valid from: 2020
is activity of: Fishing & Farming

Poultry Farming
type: NamedIndividual
type: Activity
type: BusinessClassification
is contemporary version of: http://data.ga-group.nl/ics/trbc/5410201012
is version of: http://data.ga-group.nl/ics/trbc/5410201012
replaces: http://data.ga-group.nl/ics/trbc/2012/5410201012
imported on: 2023-04-07T16:52:39.364811Z
last refreshed on: 2026-06-05T07:16:11.699Z
source accessed on: 2017-12-31T07:04:19Z
source last accessed on: 2021-08-01T01:06:53Z
definition: Companies engaged in raising, breeding and hatching meat-type chickens, turkeys, ducks and geese, as well as production of related eggs.
notation: 5410201012
valid from: 2020
is activity of: Fishing & Farming

Sheep & Specialty Livestock Farming
type: NamedIndividual
type: Activity
type: BusinessClassification
is contemporary version of: http://data.ga-group.nl/ics/trbc/5410201013
is version of: http://data.ga-group.nl/ics/trbc/5410201013
replaces: http://data.ga-group.nl/ics/trbc/2012/5410201013
imported on: 2023-04-07T16:52:39.364811Z
last refreshed on: 2026-06-05T07:16:11.699Z
source accessed on: 2017-12-31T07:04:19Z
source last accessed on: 2021-08-01T01:06:53Z
definition: Companies engaged in raising animals other than cattle, pigs, poultry and fish, such as lambs/sheep, elk, crocodiles and horses, for meat.
notation: 5410201013
valid from: 2020
is activity of: Fishing & Farming

Vegetable, Fruit & Nut Farming
type: NamedIndividual
type: Activity
type: BusinessClassification
is contemporary version of: http://data.ga-group.nl/ics/trbc/5410201014
is version of: http://data.ga-group.nl/ics/trbc/5410201014
replaces: http://data.ga-group.nl/ics/trbc/2012/5410201014
imported on: 2023-04-07T16:52:39.364811Z
last refreshed on: 2026-06-05T07:16:11.699Z
source accessed on: 2017-12-31T07:04:19Z
source last accessed on: 2021-08-01T01:06:53Z
definition: Companies engaged in farming vegetables, fruits and nuts, and producing related seeds.
notation: 5410201014
valid from: 2020
is activity of: Fishing & Farming

Coffee, Tea & Cocoa Farming
type: NamedIndividual
type: Activity
type: BusinessClassification
is contemporary version of: http://data.ga-group.nl/ics/trbc/5410201015
is version of: http://data.ga-group.nl/ics/trbc/5410201015
replaces: http://data.ga-group.nl/ics/trbc/2012/5410201015
imported on: 2023-04-07T16:52:39.364811Z
last refreshed on: 2026-06-05T07:16:11.699Z
source accessed on: 2017-12-31T07:04:19Z
source last accessed on: 2021-08-01T01:06:53Z
definition: Companies engaged in coffee, tea and cocoa farming and producing related seeds.
notation: 5410201015
valid from: 2020
is activity of: Fishing & Farming

Sugarcane Farming
type: NamedIndividual
type: Activity
type: BusinessClassification
is contemporary version of: http://data.ga-group.nl/ics/trbc/5410201016
is version of: http://data.ga-group.nl/ics/trbc/5410201016
replaces: http://data.ga-group.nl/ics/trbc/2012/5410201016
imported on: 2023-04-07T16:52:39.364811Z
last refreshed on: 2026-06-05T07:16:11.699Z
source accessed on: 2017-12-31T07:04:19Z
source last accessed on: 2021-08-01T01:06:53Z
definition: Companies engaged in farming sugarcane. Includes also cane farming, sugar and field production.
notation: 5410201016
valid from: 2020
is activity of: Fishing & Farming

Commercial Nurseries
type: NamedIndividual
type: Activity
type: BusinessClassification
is contemporary version of: http://data.ga-group.nl/ics/trbc/5410201017
is version of: http://data.ga-group.nl/ics/trbc/5410201017
replaces: http://data.ga-group.nl/ics/trbc/2012/5410201017
imported on: 2023-04-07T16:52:39.364811Z
last refreshed on: 2026-06-05T07:16:11.699Z
source accessed on: 2017-12-31T07:04:19Z
source last accessed on: 2021-08-01T01:06:53Z
definition: Companies engaged in growing farm nursery products and garden nursery products such as flowers and plants. Excludes: (nurseries for trees, classified in Forest Nurseries & Gathering of Forest Products).
notation: 5410201017
valid from: 2020
is activity of: Fishing & Farming

Commercial Fishing
type: NamedIndividual
type: Activity
type: BusinessClassification
is contemporary version of: http://data.ga-group.nl/ics/trbc/5410201018
is version of: http://data.ga-group.nl/ics/trbc/5410201018
replaces: http://data.ga-group.nl/ics/trbc/2012/5410201018
imported on: 2023-04-07T16:52:39.364811Z
last refreshed on: 2026-06-05T07:16:11.699Z
source accessed on: 2017-12-31T07:04:19Z
source last accessed on: 2021-08-01T01:06:53Z
definition: Companies engaged in catching fish, shellfish and other seafood from wild fisheries. Includes also immediate processing of fish and seafood in fisheries.
notation: 5410201018
valid from: 2020
is activity of: Fishing & Farming

Aquaculture
type: NamedIndividual
type: Activity
type: BusinessClassification
is contemporary version of: http://data.ga-group.nl/ics/trbc/5410201019
is version of: http://data.ga-group.nl/ics/trbc/5410201019
replaces: http://data.ga-group.nl/ics/trbc/2012/5410201019
imported on: 2023-04-07T16:52:39.364811Z
last refreshed on: 2026-06-05T07:16:11.699Z
source accessed on: 2017-12-31T07:04:19Z
source last accessed on: 2021-08-01T01:06:53Z
definition: Companies engaged in cultivating and harvesting fish, shellfish and aquatic plants.
notation: 5410201019
valid from: 2020
is activity of: Fishing & Farming

Fur Farming
type: NamedIndividual
type: Activity
type: BusinessClassification
is contemporary version of: http://data.ga-group.nl/ics/trbc/5410201020
is version of: http://data.ga-group.nl/ics/trbc/5410201020
replaces: http://data.ga-group.nl/ics/trbc/2012/5410201020
imported on: 2023-04-07T16:52:39.364811Z
last refreshed on: 2026-06-05T07:16:11.699Z
source accessed on: 2017-12-31T07:04:19Z
source last accessed on: 2021-08-01T01:06:53Z
definition: Companies engaged in raising fur-bearing animals. Includes the practice of breeding or raising certain types of animals for their fur.
notation: 5410201020
valid from: 2020
is activity of: Fishing & Farming

Animal Breeding
type: NamedIndividual
type: Activity
type: BusinessClassification
is contemporary version of: http://data.ga-group.nl/ics/trbc/5410201021
is version of: http://data.ga-group.nl/ics/trbc/5410201021
replaces: http://data.ga-group.nl/ics/trbc/2012/5410201021
imported on: 2023-04-07T16:52:39.364811Z
last refreshed on: 2026-06-05T07:16:11.699Z
source accessed on: 2017-12-31T07:04:19Z
source last accessed on: 2021-08-01T01:06:53Z
definition: Companies engaged in providing breeding services for farm animals as well as pets.
notation: 5410201021
valid from: 2020
is activity of: Fishing & Farming

Agriculture Support Services
type: NamedIndividual
type: Activity
type: BusinessClassification
is contemporary version of: http://data.ga-group.nl/ics/trbc/5410201022
is version of: http://data.ga-group.nl/ics/trbc/5410201022
replaces: http://data.ga-group.nl/ics/trbc/2012/5410201022
imported on: 2023-04-07T16:52:39.364811Z
last refreshed on: 2026-06-05T07:16:11.699Z
source accessed on: 2017-12-31T07:04:19Z
source last accessed on: 2021-08-01T01:06:53Z
definition: Companies engaged in providing agriculture supporting services such as soil preparation, planting, and cultivating services, crop harvesting, postharvest crop activities, farm labor contractors and farm management services.
notation: 5410201022
valid from: 2020
is activity of: Fishing & Farming

Organic Farming
type: NamedIndividual
type: Activity
type: BusinessClassification
is contemporary version of: http://data.ga-group.nl/ics/trbc/5410201023
is version of: http://data.ga-group.nl/ics/trbc/5410201023
replaces: http://data.ga-group.nl/ics/trbc/2012/5410201023
imported on: 2023-04-07T16:52:39.364811Z
last refreshed on: 2026-06-05T07:16:11.699Z
source accessed on: 2017-12-31T07:04:19Z
source last accessed on: 2021-08-01T01:06:53Z
definition: Companies engaged in farming which promotes and enhances agro-ecosystem health, including biodiversity, biological cycles, and soil biological activity.
notation: 5410201023
valid from: 2020
is activity of: Fishing & Farming

Animal Feed
type: NamedIndividual
type: Activity
type: BusinessClassification
is contemporary version of: http://data.ga-group.nl/ics/trbc/5410201024
is version of: http://data.ga-group.nl/ics/trbc/5410201024
replaces: http://data.ga-group.nl/ics/trbc/2012/5410201024
imported on: 2023-04-07T16:52:39.364811Z
last refreshed on: 2026-06-05T07:16:11.699Z
source accessed on: 2017-12-31T07:04:19Z
source last accessed on: 2021-08-01T01:06:53Z
definition: Companies engaged in manufacturing feedstuffs, feed supplements and compound feeds for farm animals such as cows, pigs, sheep, chickens, turkeys, geese and others.
notation: 5410201024
valid from: 2020
is activity of: Fishing & Farming

Agricultural Consultancy Services
type: NamedIndividual
type: Activity
type: BusinessClassification
is contemporary version of: http://data.ga-group.nl/ics/trbc/5410201025
is version of: http://data.ga-group.nl/ics/trbc/5410201025
replaces: http://data.ga-group.nl/ics/trbc/2012/5410201025
imported on: 2023-04-07T16:52:39.364811Z
last refreshed on: 2026-06-05T07:16:11.699Z
source accessed on: 2017-12-31T07:04:19Z
source last accessed on: 2021-08-01T01:06:53Z
definition: Companies engaged in providing agricultural consultancy services integrating two or more services in the following: farm mapping, soil and plant analysis, fertilizer recommendations, pest management, weed control, crop residue management, laboratory services, and environmental services.
notation: 5410201025
valid from: 2020
is activity of: Fishing & Farming

Fishing & Farming Wholesale
type: NamedIndividual
type: Activity
type: BusinessClassification
is contemporary version of: http://data.ga-group.nl/ics/trbc/5410201026
is version of: http://data.ga-group.nl/ics/trbc/5410201026
replaces: http://data.ga-group.nl/ics/trbc/2012/5410201026
imported on: 2023-04-07T16:52:39.364811Z
last refreshed on: 2026-06-05T07:16:11.699Z
source accessed on: 2017-12-31T07:04:19Z
source last accessed on: 2021-08-01T01:06:53Z
definition: Companies engaged in wholesale distribution of grains, livestock, raw milk, live poultry, fresh fruits, vegetables, nuts, fishery products, animal feeds, fur and hairs, fertilizers, pesticides, plant seeds and bulbs.
notation: 5410201026
valid from: 2020
is activity of: Fishing & Farming

Agricultural Biotechnology
type: NamedIndividual
type: Activity
type: BusinessClassification
is contemporary version of: http://data.ga-group.nl/ics/trbc/5410201027
is version of: http://data.ga-group.nl/ics/trbc/5410201027
replaces: http://data.ga-group.nl/ics/trbc/2012/5410201027
imported on: 2023-04-07T16:52:39.364811Z
last refreshed on: 2026-06-05T07:16:11.699Z
source accessed on: 2017-12-31T07:04:19Z
source last accessed on: 2021-08-01T01:06:53Z
definition: Companies engaged in development of genetically modified foods and other agricultural biotechnology products.
notation: 5410201027
valid from: 2020
is activity of: Fishing & Farming

Hog & Pig Farming
type: NamedIndividual
type: Activity
type: BusinessClassification
is contemporary version of: http://data.ga-group.nl/ics/trbc/5410201028
is version of: http://data.ga-group.nl/ics/trbc/5410201028
replaces: http://data.ga-group.nl/ics/trbc/2012/5410201028
imported on: 2023-04-07T16:52:39.364811Z
last refreshed on: 2026-06-05T07:16:11.699Z
source accessed on: 2017-12-31T07:04:19Z
source last accessed on: 2021-08-01T01:06:53Z
definition: Companies engaged in breeding, farrowing, and raising hogs and pigs.
notation: 5410201028
valid from: 2020
is activity of: Fishing & Farming

Cattle Farming
type: NamedIndividual
type: Activity
type: BusinessClassification
is contemporary version of: http://data.ga-group.nl/ics/trbc/5410201029
is version of: http://data.ga-group.nl/ics/trbc/5410201029
replaces: http://data.ga-group.nl/ics/trbc/2012/5410201029
imported on: 2023-04-07T16:52:39.364811Z
last refreshed on: 2026-06-05T07:16:11.699Z
source accessed on: 2017-12-31T07:04:19Z
source last accessed on: 2021-08-01T01:06:53Z
definition: Companies engaged in breeding and raising beef cattle, veal calf and dairy cattle. Includes also milking dairy cattle.
notation: 5410201029
valid from: 2020
is activity of: Fishing & Farming

Fair Trade & Ethical Fishing & Farming
type: NamedIndividual
type: Activity
type: BusinessClassification
is contemporary version of: http://data.ga-group.nl/ics/trbc/5410201030
is version of: http://data.ga-group.nl/ics/trbc/5410201030
imported on: 2023-04-07T17:17:07.492231Z
last refreshed on: 2026-06-05T07:16:11.699Z
source accessed on: 2021-04-25T05:48:36Z
source last accessed on: 2021-08-01T01:06:53Z
definition: Companies engaged in fishing and farming activities holding a fair trade and/or ethical practices certificate.
notation: 5410201030
valid from: 2020
is activity of: Fishing & Farming

Fishing & Farming
type: NamedIndividual
type: BusinessClassification
type: Industry
is contemporary version of: http://data.ga-group.nl/ics/trbc/54102010
is version of: http://data.ga-group.nl/ics/trbc/54102010
replaces: http://data.ga-group.nl/ics/trbc/2012/54102010
imported on: 2023-04-07T16:52:39.364811Z
last refreshed on: 2026-06-05T07:16:11.699Z
source accessed on: 2017-12-31T07:04:19Z
source last accessed on: 2021-08-01T01:06:53Z
definition: Operators of commercial farms and fisheries, as well as providers of genetic research and modification for agricultural purposes. Includes growers of fruits, vegetables, grains, animal feeds and other produce. Includes also harvesters of fish and operators of aquaculture, as well as raisers of livestock such as cattle, pigs and poultry.
notation: 54102010
valid from: 2020
is industry of: Food & Tobacco

Food Processing (NEC)
type: NamedIndividual
type: Activity
type: BusinessClassification
is contemporary version of: http://data.ga-group.nl/ics/trbc/5410202010
is version of: http://data.ga-group.nl/ics/trbc/5410202010
replaces: http://data.ga-group.nl/ics/trbc/2012/5410202010
imported on: 2023-04-07T16:52:39.364811Z
last refreshed on: 2026-06-05T07:16:11.699Z
source accessed on: 2017-12-31T07:04:19Z
source last accessed on: 2021-08-01T01:06:53Z
definition: Companies involved in at least two activities under the Food Processing industry, none being dominant: processing and packaging produce, meats, fish, animal feeds, fruit juices and dairy products. Includes grain milling, crop cleaning, grading and packaging, animal slaughtering and packaging operations, seafood processing, freezing, canning operations, juice, coffee, tea, dairy and all other food manufacturers, including pet foods. Excludes: (primary crop growers, classified in Fishing & Farming).
notation: 5410202010
valid from: 2020
is activity of: Food Processing

Flour Milling
type: NamedIndividual
type: Activity
type: BusinessClassification
is contemporary version of: http://data.ga-group.nl/ics/trbc/5410202011
is version of: http://data.ga-group.nl/ics/trbc/5410202011
replaces: http://data.ga-group.nl/ics/trbc/2012/5410202011
imported on: 2023-04-07T16:52:39.364811Z
last refreshed on: 2026-06-05T07:16:11.699Z
source accessed on: 2017-12-31T07:04:19Z
source last accessed on: 2021-08-01T01:06:53Z
definition: Companies engaged in milling flour or blending flour mixes or doughs.
notation: 5410202011
valid from: 2020
is activity of: Food Processing

Bread & Bakery Product Manufacturing
type: NamedIndividual
type: Activity
type: BusinessClassification
is contemporary version of: http://data.ga-group.nl/ics/trbc/5410202012
is version of: http://data.ga-group.nl/ics/trbc/5410202012
replaces: http://data.ga-group.nl/ics/trbc/2012/5410202012
imported on: 2023-04-07T16:52:39.364811Z
last refreshed on: 2026-06-05T07:16:11.699Z
source accessed on: 2017-12-31T07:04:19Z
source last accessed on: 2021-08-01T01:06:53Z
definition: Companies engaged in manufacturing fresh or packaged bread and bakery product.
notation: 5410202012
valid from: 2020
is activity of: Food Processing

Breakfast Cereal Manufacturing
type: NamedIndividual
type: Activity
type: BusinessClassification
is contemporary version of: http://data.ga-group.nl/ics/trbc/5410202013
is version of: http://data.ga-group.nl/ics/trbc/5410202013
replaces: http://data.ga-group.nl/ics/trbc/2012/5410202013
imported on: 2023-04-07T16:52:39.364811Z
last refreshed on: 2026-06-05T07:16:11.699Z
source accessed on: 2017-12-31T07:04:19Z
source last accessed on: 2021-08-01T01:06:53Z
definition: Companies engaged in manufacturing breakfast cereal foods made from grains such as wheat, corn and oat cereals.
notation: 5410202013
valid from: 2020
is activity of: Food Processing

Cookie, Cracker & Pasta Manufacturing
type: NamedIndividual
type: Activity
type: BusinessClassification
is contemporary version of: http://data.ga-group.nl/ics/trbc/5410202014
is version of: http://data.ga-group.nl/ics/trbc/5410202014
replaces: http://data.ga-group.nl/ics/trbc/2012/5410202014
imported on: 2023-04-07T16:52:39.364811Z
last refreshed on: 2026-06-05T07:16:11.699Z
source accessed on: 2017-12-31T07:04:19Z
source last accessed on: 2021-08-01T01:06:53Z
definition: Companies engaged in manufacturing cookies, crackers and pasta.
notation: 5410202014
valid from: 2020
is activity of: Food Processing

Fruit & Vegetable Processing
type: NamedIndividual
type: Activity
type: BusinessClassification
is contemporary version of: http://data.ga-group.nl/ics/trbc/5410202015
is version of: http://data.ga-group.nl/ics/trbc/5410202015
replaces: http://data.ga-group.nl/ics/trbc/2012/5410202015
imported on: 2023-04-07T16:52:39.364811Z
last refreshed on: 2026-06-05T07:16:11.699Z
source accessed on: 2017-12-31T07:04:19Z
source last accessed on: 2021-08-01T01:06:53Z
definition: Companies engaged in manufacturing canned, pickled, dried and brined fruits and vegetables.
notation: 5410202015
valid from: 2020
is activity of: Food Processing

Meat Processing
type: NamedIndividual
type: Activity
type: BusinessClassification
is contemporary version of: http://data.ga-group.nl/ics/trbc/5410202016
is version of: http://data.ga-group.nl/ics/trbc/5410202016
replaces: http://data.ga-group.nl/ics/trbc/2012/5410202016
imported on: 2023-04-07T16:52:39.364811Z
last refreshed on: 2026-06-05T07:16:11.699Z
source accessed on: 2017-12-31T07:04:19Z
source last accessed on: 2021-08-01T01:06:53Z
definition: Companies engaged in slaughtering animals, and processing meat such as pork, beef, lamb, chicken, and meat by-products, as well as the production of sausage, ham and other meat products. Excludes slaughtering and processing animals according to Islamic law, classified in Halal Meat Processing.
notation: 5410202016
valid from: 2020
is activity of: Food Processing

Halal Meat Processing
type: NamedIndividual
type: Activity
type: BusinessClassification
is contemporary version of: http://data.ga-group.nl/ics/trbc/5410202017
is version of: http://data.ga-group.nl/ics/trbc/5410202017
replaces: http://data.ga-group.nl/ics/trbc/2012/5410202017
imported on: 2023-04-07T16:52:39.364811Z
last refreshed on: 2026-06-05T07:16:11.699Z
source accessed on: 2017-12-31T07:04:19Z
source last accessed on: 2021-08-01T01:06:53Z
definition: Companies engaged in slaughtering and processing Halal animals according to Islamic law.
notation: 5410202017
valid from: 2020
is activity of: Food Processing

Seafood Product Preparation & Packaging
type: NamedIndividual
type: Activity
type: BusinessClassification
is contemporary version of: http://data.ga-group.nl/ics/trbc/5410202018
is version of: http://data.ga-group.nl/ics/trbc/5410202018
replaces: http://data.ga-group.nl/ics/trbc/2012/5410202018
imported on: 2023-04-07T16:52:39.364811Z
last refreshed on: 2026-06-05T07:16:11.699Z
source accessed on: 2017-12-31T07:04:19Z
source last accessed on: 2021-08-01T01:06:53Z
definition: Companies engaged in processing and canning fresh and frozen seafood, as well as smoked, salted or dried seafood.
notation: 5410202018
valid from: 2020
is activity of: Food Processing

Dairy Products
type: NamedIndividual
type: Activity
type: BusinessClassification
is contemporary version of: http://data.ga-group.nl/ics/trbc/5410202019
is version of: http://data.ga-group.nl/ics/trbc/5410202019
replaces: http://data.ga-group.nl/ics/trbc/2012/5410202019
imported on: 2023-04-07T16:52:39.364811Z
last refreshed on: 2026-06-05T07:16:11.699Z
source accessed on: 2017-12-31T07:04:19Z
source last accessed on: 2021-08-01T01:06:53Z
definition: Companies engaged in manufacturing fluid milk, dried or condensed milk, as well as dairy byproducts such as cheese, butter and yogurt.
notation: 5410202019
valid from: 2020
is activity of: Food Processing

Starch, Vegetable Fat & Oil Manufacturing
type: NamedIndividual
type: Activity
type: BusinessClassification
is contemporary version of: http://data.ga-group.nl/ics/trbc/5410202020
is version of: http://data.ga-group.nl/ics/trbc/5410202020
replaces: http://data.ga-group.nl/ics/trbc/2012/5410202020
imported on: 2023-04-07T16:52:39.364811Z
last refreshed on: 2026-06-05T07:16:11.699Z
source accessed on: 2017-12-31T07:04:19Z
source last accessed on: 2021-08-01T01:06:53Z
definition: Companies engaged in manufacture of edible oil from starch, vegetables, nuts and sunflowers.
notation: 5410202020
valid from: 2020
is activity of: Food Processing

Coffee & Tea
type: NamedIndividual
type: Activity
type: BusinessClassification
is contemporary version of: http://data.ga-group.nl/ics/trbc/5410202021
is version of: http://data.ga-group.nl/ics/trbc/5410202021
replaces: http://data.ga-group.nl/ics/trbc/2012/5410202021
imported on: 2023-04-07T16:52:39.364811Z
last refreshed on: 2026-06-05T07:16:11.699Z
source accessed on: 2017-12-31T07:04:19Z
source last accessed on: 2021-08-01T01:06:53Z
definition: Companies engaged in manufacturing roasted coffee, coffee and tea concentrates, herbal tea, and coffee extracts, flavorings, and syrups.
notation: 5410202021
valid from: 2020
is activity of: Food Processing

Sugar & Artificial Sweeteners
type: NamedIndividual
type: Activity
type: BusinessClassification
is contemporary version of: http://data.ga-group.nl/ics/trbc/5410202022
is version of: http://data.ga-group.nl/ics/trbc/5410202022
replaces: http://data.ga-group.nl/ics/trbc/2012/5410202022
imported on: 2023-04-07T16:52:39.364811Z
last refreshed on: 2026-06-05T07:16:11.699Z
source accessed on: 2017-12-31T07:04:19Z
source last accessed on: 2021-08-01T01:06:53Z
definition: Companies engaged in processing and refining sugar and artificial sweeteners.
notation: 5410202022
valid from: 2020
is activity of: Food Processing

Chocolate & Confectionery
type: NamedIndividual
type: Activity
type: BusinessClassification
is contemporary version of: http://data.ga-group.nl/ics/trbc/5410202023
is version of: http://data.ga-group.nl/ics/trbc/5410202023
replaces: http://data.ga-group.nl/ics/trbc/2012/5410202023
imported on: 2023-04-07T16:52:39.364811Z
last refreshed on: 2026-06-05T07:16:11.699Z
source accessed on: 2017-12-31T07:04:19Z
source last accessed on: 2021-08-01T01:06:53Z
definition: Companies engaged in manufacture of chocolate cacao products and chocolate confectioneries.
notation: 5410202023
valid from: 2020
is activity of: Food Processing

Snack Food & Non-Chocolate Confectionary
type: NamedIndividual
type: Activity
type: BusinessClassification
is contemporary version of: http://data.ga-group.nl/ics/trbc/5410202024
is version of: http://data.ga-group.nl/ics/trbc/5410202024
replaces: http://data.ga-group.nl/ics/trbc/2012/5410202024
imported on: 2023-04-07T16:52:39.364811Z
last refreshed on: 2026-06-05T07:16:11.699Z
source accessed on: 2017-12-31T07:04:19Z
source last accessed on: 2021-08-01T01:06:53Z
definition: Companies engaged in manufacturing non-chocolate confectioneries and snack foods.
notation: 5410202024
valid from: 2020
is activity of: Food Processing

Special Foods & Wellbeing Products
type: NamedIndividual
type: Activity
type: BusinessClassification
is contemporary version of: http://data.ga-group.nl/ics/trbc/5410202025
is version of: http://data.ga-group.nl/ics/trbc/5410202025
replaces: http://data.ga-group.nl/ics/trbc/2012/5410202025
imported on: 2023-04-07T16:52:39.364811Z
last refreshed on: 2026-06-05T07:16:11.699Z
source accessed on: 2017-12-31T07:04:19Z
source last accessed on: 2021-08-01T01:06:53Z
definition: Companies engaged in manufacture of healthcare and food supplement such as nutrition supplements, and body enhancing supplements.
notation: 5410202025
valid from: 2020
is activity of: Food Processing

Food Ingredients
type: NamedIndividual
type: Activity
type: BusinessClassification
is contemporary version of: http://data.ga-group.nl/ics/trbc/5410202026
is version of: http://data.ga-group.nl/ics/trbc/5410202026
replaces: http://data.ga-group.nl/ics/trbc/2012/5410202026
imported on: 2023-04-07T16:52:39.364811Z
last refreshed on: 2026-06-05T07:16:11.699Z
source accessed on: 2017-12-31T07:04:19Z
source last accessed on: 2021-08-01T01:06:53Z
definition: Companies engaged in manufacturing food ingredients such as mayonnaise, dressing, spice, seasonings, extracts other prepared food ingredients.
notation: 5410202026
valid from: 2020
is activity of: Food Processing

Baby Food
type: NamedIndividual
type: Activity
type: BusinessClassification
is contemporary version of: http://data.ga-group.nl/ics/trbc/5410202027
is version of: http://data.ga-group.nl/ics/trbc/5410202027
replaces: http://data.ga-group.nl/ics/trbc/2012/5410202027
imported on: 2023-04-07T16:52:39.364811Z
last refreshed on: 2026-06-05T07:16:11.699Z
source accessed on: 2017-12-31T07:04:19Z
source last accessed on: 2021-08-01T01:06:53Z
definition: Companies engaged in manufacturing baby food such as infant milk, cereals, infant nutritional foods and others.
notation: 5410202027
valid from: 2020
is activity of: Food Processing

Ready-Made Meals
type: NamedIndividual
type: Activity
type: BusinessClassification
is contemporary version of: http://data.ga-group.nl/ics/trbc/5410202028
is version of: http://data.ga-group.nl/ics/trbc/5410202028
replaces: http://data.ga-group.nl/ics/trbc/2012/5410202028
imported on: 2023-04-07T16:52:39.364811Z
last refreshed on: 2026-06-05T07:16:11.699Z
source accessed on: 2017-12-31T07:04:19Z
source last accessed on: 2021-08-01T01:06:53Z
definition: Companies engaged in manufacturing ready-made meals such as instant rice, noodles, and dumplings.
notation: 5410202028
valid from: 2020
is activity of: Food Processing

All Other Food Manufacturing
type: NamedIndividual
type: Activity
type: BusinessClassification
is contemporary version of: http://data.ga-group.nl/ics/trbc/5410202029
is version of: http://data.ga-group.nl/ics/trbc/5410202029
replaces: http://data.ga-group.nl/ics/trbc/2012/5410202029
imported on: 2023-04-07T16:52:39.364811Z
last refreshed on: 2023-04-07T17:12:26.910158Z
source accessed on: 2017-12-31T07:04:19Z
source last accessed on: 2020-09-13T08:40:59Z
definition: Companies engaged in manufacturing foods, other than flour, bread, cereal, cookie, processed fruit and vegetables, meat, seafood, dairy, starch, coffee, chocolate, confectionary, food ingredients, baby food, readymade meals, frozen food and pet food.
notation: 5410202029
valid from: 2020
is activity of: Food Processing

Frozen Food Manufacturing
type: NamedIndividual
type: Activity
type: BusinessClassification
is contemporary version of: http://data.ga-group.nl/ics/trbc/5410202030
is version of: http://data.ga-group.nl/ics/trbc/5410202030
replaces: http://data.ga-group.nl/ics/trbc/2012/5410202030
imported on: 2023-04-07T16:52:39.364811Z
last refreshed on: 2026-06-05T07:16:11.699Z
source accessed on: 2017-12-31T07:04:19Z
source last accessed on: 2021-08-01T01:06:53Z
definition: Companies engaged in manufacturing frozen food and snacks such as ice-cream, milkshakes, sundaes, frozen fruits and vegetables, and frozen fruit juices, drinks, cocktail mixes and concentrates.
notation: 5410202030
valid from: 2020
is activity of: Food Processing

Pet Food Manufacturing
type: NamedIndividual
type: Activity
type: BusinessClassification
is contemporary version of: http://data.ga-group.nl/ics/trbc/5410202031
is version of: http://data.ga-group.nl/ics/trbc/5410202031
replaces: http://data.ga-group.nl/ics/trbc/2012/5410202031
imported on: 2023-04-07T16:52:39.364811Z
last refreshed on: 2026-06-05T07:16:11.699Z
source accessed on: 2017-12-31T07:04:19Z
source last accessed on: 2021-08-01T01:06:53Z
definition: Companies engaged in manufacturing food for pets and companion animals. Includes manufacturing of animal food (except dog and cat) from ingredients, such as grains, oilseed mill products, and meat products.
notation: 5410202031
valid from: 2020
is activity of: Food Processing

Vegan & Vegetarian Food Manufacturing
type: NamedIndividual
type: Activity
type: BusinessClassification
is contemporary version of: http://data.ga-group.nl/ics/trbc/5410202032
is version of: http://data.ga-group.nl/ics/trbc/5410202032
imported on: 2023-04-07T17:17:07.492231Z
last refreshed on: 2026-06-05T07:16:11.699Z
source accessed on: 2021-04-25T05:48:36Z
source last accessed on: 2021-08-01T01:06:53Z
definition: Companies engaged in manufacturing vegan, vegetarian and plant based food products.
notation: 5410202032
valid from: 2020
is activity of: Food Processing

Food Processing
type: NamedIndividual
type: BusinessClassification
type: Industry
is contemporary version of: http://data.ga-group.nl/ics/trbc/54102020
is version of: http://data.ga-group.nl/ics/trbc/54102020
replaces: http://data.ga-group.nl/ics/trbc/2012/54102020
imported on: 2023-04-07T16:52:39.364811Z
last refreshed on: 2026-06-05T07:16:11.699Z
source accessed on: 2017-12-31T07:04:19Z
source last accessed on: 2021-08-01T01:06:53Z
definition: Processers and packagers of produce, meats, fish, animal feeds, fruit juices, coffee, tea and dairy products. Includes grain milling, crop cleaning, grading and packaging, animal slaughtering and packaging operations, seafood processing, freezing, canning operations and all other food manufacturers, including pet foods.
notation: 54102020
valid from: 2020
is industry of: Food & Tobacco

Tobacco (NEC)
type: NamedIndividual
type: Activity
type: BusinessClassification
is contemporary version of: http://data.ga-group.nl/ics/trbc/5410203010
is version of: http://data.ga-group.nl/ics/trbc/5410203010
replaces: http://data.ga-group.nl/ics/trbc/2012/5410203010
imported on: 2023-04-07T16:52:39.364811Z
last refreshed on: 2026-06-05T07:16:11.699Z
source accessed on: 2017-12-31T07:04:19Z
source last accessed on: 2021-08-01T01:06:53Z
definition: Companies involved in at least two activities under the Tobacco industry, none being dominant. Includes farming, processing and manufacturing tobacco products. Includes also producers of e-cigarettes and vaporisers.
notation: 5410203010
valid from: 2020
is activity of: Tobacco

Tobacco Farming
type: NamedIndividual
type: Activity
type: BusinessClassification
is contemporary version of: http://data.ga-group.nl/ics/trbc/5410203011
is version of: http://data.ga-group.nl/ics/trbc/5410203011
replaces: http://data.ga-group.nl/ics/trbc/2012/5410203011
imported on: 2023-04-07T16:52:39.364811Z
last refreshed on: 2026-06-05T07:16:11.699Z
source accessed on: 2017-12-31T07:04:19Z
source last accessed on: 2021-08-01T01:06:53Z
definition: Companies engaged in farming tobacco and producing tobacco seeds.
notation: 5410203011
valid from: 2020
is activity of: Tobacco

Tobacco Stemming & Redrying
type: NamedIndividual
type: Activity
type: BusinessClassification
is contemporary version of: http://data.ga-group.nl/ics/trbc/5410203012
is version of: http://data.ga-group.nl/ics/trbc/5410203012
replaces: http://data.ga-group.nl/ics/trbc/2012/5410203012
imported on: 2023-04-07T16:52:39.364811Z
last refreshed on: 2026-06-05T07:16:11.699Z
source accessed on: 2017-12-31T07:04:19Z
source last accessed on: 2021-08-01T01:06:53Z
definition: Companies engaged in stemming and redrying of tobacco.
notation: 5410203012
valid from: 2020
is activity of: Tobacco

Cigars & Cigarette Manufacturing
type: NamedIndividual
type: Activity
type: BusinessClassification
is contemporary version of: http://data.ga-group.nl/ics/trbc/5410203013
is version of: http://data.ga-group.nl/ics/trbc/5410203013
replaces: http://data.ga-group.nl/ics/trbc/2012/5410203013
imported on: 2023-04-07T16:52:39.364811Z
last refreshed on: 2026-06-05T07:16:11.699Z
source accessed on: 2017-12-31T07:04:19Z
source last accessed on: 2021-08-01T01:06:53Z
definition: Companies engaged in manufacturing cigars and cigarettes. Includes also manufacturers of cigar paper.
notation: 5410203013
valid from: 2020
is activity of: Tobacco

Chewing Tobacco Products
type: NamedIndividual
type: Activity
type: BusinessClassification
is contemporary version of: http://data.ga-group.nl/ics/trbc/5410203014
is version of: http://data.ga-group.nl/ics/trbc/5410203014
replaces: http://data.ga-group.nl/ics/trbc/2012/5410203014
imported on: 2023-04-07T16:52:39.364811Z
last refreshed on: 2026-06-05T07:16:11.699Z
source accessed on: 2017-12-31T07:04:19Z
source last accessed on: 2021-08-01T01:06:53Z
definition: Companies engaged in manufacturing chewing tobacco products.
notation: 5410203014
valid from: 2020
is activity of: Tobacco

Tobacco
type: NamedIndividual
type: BusinessClassification
type: Industry
is contemporary version of: http://data.ga-group.nl/ics/trbc/54102030
is version of: http://data.ga-group.nl/ics/trbc/54102030
replaces: http://data.ga-group.nl/ics/trbc/2012/54102030
imported on: 2023-04-07T16:52:39.364811Z
last refreshed on: 2026-06-05T07:16:11.699Z
source accessed on: 2017-12-31T07:04:19Z
source last accessed on: 2021-08-01T01:06:53Z
definition: Farmers, processors and manufacturers of tobacco and tobacco products. Includes also producers of e-cigarettes and vaporisers.
notation: 54102030
valid from: 2020
is industry of: Food & Tobacco

Food & Tobacco
type: NamedIndividual
type: BusinessClassification
type: IndustryGroup
is contemporary version of: http://data.ga-group.nl/ics/trbc/541020
is version of: http://data.ga-group.nl/ics/trbc/541020
replaces: http://data.ga-group.nl/ics/trbc/2012/541020
imported on: 2023-04-07T16:52:39.364811Z
last refreshed on: 2026-06-05T07:16:11.699Z
source accessed on: 2017-12-31T07:04:19Z
source last accessed on: 2021-08-01T01:06:53Z
definition: Producers and processors of Food & Tobacco. Includes operators of farms, aquaculture and fisheries.
notation: 541020
valid from: 2020
is industry group of: Food & Beverages

Food & Beverages
type: NamedIndividual
type: BusinessClassification
type: BusinessSector
is contemporary version of: http://data.ga-group.nl/ics/trbc/5410
is version of: http://data.ga-group.nl/ics/trbc/5410
replaces: http://data.ga-group.nl/ics/trbc/2012/5410
imported on: 2023-04-07T16:52:39.364811Z
last refreshed on: 2026-06-05T07:16:11.699Z
source accessed on: 2017-12-31T07:04:19Z
source last accessed on: 2021-08-01T01:06:53Z
definition: Producers and processors of food, beverages and tobacco. Includes operators of farms and fisheries, as well as brewers, distillers and distributors, and packagers of Food & Beverages.
notation: 5410
valid from: 2020
is business sector of: Consumer Non-Cyclicals

Household Products (NEC)
type: NamedIndividual
type: Activity
type: BusinessClassification
is contemporary version of: http://data.ga-group.nl/ics/trbc/5420101010
is version of: http://data.ga-group.nl/ics/trbc/5420101010
replaces: http://data.ga-group.nl/ics/trbc/2012/5420101010
imported on: 2023-04-07T16:52:39.364811Z
last refreshed on: 2026-06-05T07:16:11.699Z
source accessed on: 2017-12-31T07:04:19Z
source last accessed on: 2021-08-01T01:06:53Z
definition: Companies engaged in the manufacturing of non-durable goods such as cleaning products, detergents, disinfectants, brooms, mops, towels and rags, disposable plates and cutlery. Excludes: (cosmetics, toiletries, paper towels, napkins, disposable diapers and sanitary napkins, classified in classified in Personal Products).
notation: 5420101010
valid from: 2020
is activity of: Household Products

Laundry Supplies
type: NamedIndividual
type: Activity
type: BusinessClassification
is contemporary version of: http://data.ga-group.nl/ics/trbc/5420101011
is version of: http://data.ga-group.nl/ics/trbc/5420101011
replaces: http://data.ga-group.nl/ics/trbc/2012/5420101011
imported on: 2023-04-07T16:52:39.364811Z
last refreshed on: 2026-06-05T07:16:11.699Z
source accessed on: 2017-12-31T07:04:19Z
source last accessed on: 2021-08-01T01:06:53Z
definition: Companies engaged in manufacturing laundry supplies such as detergent, bleach, stain removers and fabric softeners, as well as hangers, laundry bags, carts and other supplies.
notation: 5420101011
valid from: 2020
is activity of: Household Products

Cleaning Supplies
type: NamedIndividual
type: Activity
type: BusinessClassification
is contemporary version of: http://data.ga-group.nl/ics/trbc/5420101012
is version of: http://data.ga-group.nl/ics/trbc/5420101012
replaces: http://data.ga-group.nl/ics/trbc/2012/5420101012
imported on: 2023-04-07T16:52:39.364811Z
last refreshed on: 2026-06-05T07:16:11.699Z
source accessed on: 2017-12-31T07:04:19Z
source last accessed on: 2021-08-01T01:06:53Z
definition: Companies engaged in manufacturing cleaning supplies such as detergents, soaps, wash and toilet cleaners plus brooms, brushes, mops, dustpans and other tools for cleaning house.
notation: 5420101012
valid from: 2020
is activity of: Household Products

Air Fresheners
type: NamedIndividual
type: Activity
type: BusinessClassification
is contemporary version of: http://data.ga-group.nl/ics/trbc/5420101013
is version of: http://data.ga-group.nl/ics/trbc/5420101013
replaces: http://data.ga-group.nl/ics/trbc/2012/5420101013
imported on: 2023-04-07T16:52:39.364811Z
last refreshed on: 2026-06-05T07:16:11.699Z
source accessed on: 2017-12-31T07:04:19Z
source last accessed on: 2021-08-01T01:06:53Z
definition: Companies engaged in manufacturing air fresheners for home use.
notation: 5420101013
valid from: 2020
is activity of: Household Products

Brooms, Brushes & Dustpans
type: NamedIndividual
type: Activity
type: BusinessClassification
is contemporary version of: http://data.ga-group.nl/ics/trbc/5420101014
is version of: http://data.ga-group.nl/ics/trbc/5420101014
replaces: http://data.ga-group.nl/ics/trbc/2012/5420101014
imported on: 2023-04-07T16:52:39.364811Z
last refreshed on: 2023-04-07T17:12:26.910158Z
source accessed on: 2017-12-31T07:04:19Z
source last accessed on: 2020-09-13T08:40:59Z
definition: Companies engaged in manufacturing brooms, brushes, mops, dustpans and other tools for cleaning house.
notation: 5420101014
valid from: 2020
is activity of: Household Products

Pet & Plant Protection Agents
type: NamedIndividual
type: Activity
type: BusinessClassification
is contemporary version of: http://data.ga-group.nl/ics/trbc/5420101015
is version of: http://data.ga-group.nl/ics/trbc/5420101015
replaces: http://data.ga-group.nl/ics/trbc/2012/5420101015
imported on: 2023-04-07T16:52:39.364811Z
last refreshed on: 2026-06-05T07:16:11.699Z
source accessed on: 2017-12-31T07:04:19Z
source last accessed on: 2021-08-01T01:06:53Z
definition: Companies engaged in manufacturing pet and plant protection agents.
notation: 5420101015
valid from: 2020
is activity of: Household Products

Auto Cleaning Products
type: NamedIndividual
type: Activity
type: BusinessClassification
is contemporary version of: http://data.ga-group.nl/ics/trbc/5420101016
is version of: http://data.ga-group.nl/ics/trbc/5420101016
replaces: http://data.ga-group.nl/ics/trbc/2012/5420101016
imported on: 2023-04-07T16:52:39.364811Z
last refreshed on: 2026-06-05T07:16:11.699Z
source accessed on: 2017-12-31T07:04:19Z
source last accessed on: 2021-08-01T01:06:53Z
definition: Companies engaged in manufacturing automobile cleaning products.
notation: 5420101016
valid from: 2020
is activity of: Household Products

Household Products
type: NamedIndividual
type: BusinessClassification
type: Industry
is contemporary version of: http://data.ga-group.nl/ics/trbc/54201010
is version of: http://data.ga-group.nl/ics/trbc/54201010
replaces: http://data.ga-group.nl/ics/trbc/2012/54201010
imported on: 2023-04-07T16:52:39.364811Z
last refreshed on: 2026-06-05T07:16:11.699Z
source accessed on: 2017-12-31T07:04:19Z
source last accessed on: 2021-08-01T01:06:53Z
definition: Manufacturers of non-durable goods such as cleaning products, detergents, disinfectants, brooms, mops, towels and rags, disposable plates and cutlery.
notation: 54201010
valid from: 2020
is industry of: Personal & Household Products & Services

Personal Products (NEC)
type: NamedIndividual
type: Activity
type: BusinessClassification
is contemporary version of: http://data.ga-group.nl/ics/trbc/5420102010
is version of: http://data.ga-group.nl/ics/trbc/5420102010
replaces: http://data.ga-group.nl/ics/trbc/2012/5420102010
imported on: 2023-04-07T16:52:39.364811Z
last refreshed on: 2026-06-05T07:16:11.699Z
source accessed on: 2017-12-31T07:04:19Z
source last accessed on: 2021-08-01T01:06:53Z
definition: Companies engaged in the manufacturing of toiletries, personal hygienic and birth control products. Includes manufacturers of combs, toothbrushes, mouthwash, perfumes, cosmetics, deodorants, hand and body soaps, sunscreen lotion, walking canes, burial caskets, hair pieces, prophylactics, spectacles, contact lenses and other personal products. Excludes: (clothing, jewelry and accessories, classified in Apparel & Accessories), (disposable diapers and sanitary napkins, classified in Paper Products).
notation: 5420102010
valid from: 2020
is activity of: Personal Products

Cosmetics & Perfumes
type: NamedIndividual
type: Activity
type: BusinessClassification
is contemporary version of: http://data.ga-group.nl/ics/trbc/5420102011
is version of: http://data.ga-group.nl/ics/trbc/5420102011
replaces: http://data.ga-group.nl/ics/trbc/2012/5420102011
imported on: 2023-04-07T16:52:39.364811Z
last refreshed on: 2026-06-05T07:16:11.699Z
source accessed on: 2017-12-31T07:04:19Z
source last accessed on: 2021-08-01T01:06:53Z
definition: Companies engaged in manufacturing face creams, lotions, make-ups, bath products, grooming kits and other supplies. Excludes producers of soap and toothpaste, classified in Sanitary Products.
notation: 5420102011
valid from: 2020
is activity of: Personal Products

Luxury Cosmetics
type: NamedIndividual
type: Activity
type: BusinessClassification
is contemporary version of: http://data.ga-group.nl/ics/trbc/5420102012
is version of: http://data.ga-group.nl/ics/trbc/5420102012
replaces: http://data.ga-group.nl/ics/trbc/2012/5420102012
imported on: 2023-04-07T16:52:39.364811Z
last refreshed on: 2026-06-05T07:16:11.699Z
source accessed on: 2017-12-31T07:04:19Z
source last accessed on: 2021-08-01T01:06:53Z
definition: Companies engaged in manufacturing luxury cosmetic and perfume brands.
notation: 5420102012
valid from: 2020
is activity of: Personal Products

Sanitary Products
type: NamedIndividual
type: Activity
type: BusinessClassification
is contemporary version of: http://data.ga-group.nl/ics/trbc/5420102013
is version of: http://data.ga-group.nl/ics/trbc/5420102013
replaces: http://data.ga-group.nl/ics/trbc/2012/5420102013
imported on: 2023-04-07T16:52:39.364811Z
last refreshed on: 2026-06-05T07:16:11.699Z
source accessed on: 2017-12-31T07:04:19Z
source last accessed on: 2021-08-01T01:06:53Z
definition: Companies engaged in manufacturing shaving preparations, hand and body soap, toothpaste, toothbrush, toilet paper, and facial tissue paper. Excludes producers of cosmetics and perfumes, face creams, lotions, make-up and bath products, classified in Cosmetics & Perfumes.
notation: 5420102013
valid from: 2020
is activity of: Personal Products

Hair Accessories
type: NamedIndividual
type: Activity
type: BusinessClassification
is contemporary version of: http://data.ga-group.nl/ics/trbc/5420102014
is version of: http://data.ga-group.nl/ics/trbc/5420102014
replaces: http://data.ga-group.nl/ics/trbc/2012/5420102014
imported on: 2023-04-07T16:52:39.364811Z
last refreshed on: 2026-06-05T07:16:11.699Z
source accessed on: 2017-12-31T07:04:19Z
source last accessed on: 2021-08-01T01:06:53Z
definition: Companies engaged in manufacturing hair pieces, wigs, and related hair styling accessories.
notation: 5420102014
valid from: 2020
is activity of: Personal Products

Birth Control Products
type: NamedIndividual
type: Activity
type: BusinessClassification
is contemporary version of: http://data.ga-group.nl/ics/trbc/5420102015
is version of: http://data.ga-group.nl/ics/trbc/5420102015
replaces: http://data.ga-group.nl/ics/trbc/2012/5420102015
imported on: 2023-04-07T16:52:39.364811Z
last refreshed on: 2026-06-05T07:16:11.699Z
source accessed on: 2017-12-31T07:04:19Z
source last accessed on: 2021-08-01T01:06:53Z
definition: Companies engaged in manufacturing birth control products such as condoms, prophylactics, pregnancy test kits and others.
notation: 5420102015
valid from: 2020
is activity of: Personal Products

Halal Personal Products
type: NamedIndividual
type: Activity
type: BusinessClassification
is contemporary version of: http://data.ga-group.nl/ics/trbc/5420102016
is version of: http://data.ga-group.nl/ics/trbc/5420102016
imported on: 2023-04-07T17:17:07.492231Z
last refreshed on: 2026-06-05T07:16:11.699Z
source accessed on: 2021-04-25T05:48:36Z
source last accessed on: 2021-08-01T01:06:53Z
definition: Companies engaged in manufacturing halal cosmetics, perfumes and other halal personal products.
notation: 5420102016
valid from: 2020
is activity of: Personal Products

Personal Products
type: NamedIndividual
type: BusinessClassification
type: Industry
is contemporary version of: http://data.ga-group.nl/ics/trbc/54201020
is version of: http://data.ga-group.nl/ics/trbc/54201020
replaces: http://data.ga-group.nl/ics/trbc/2012/54201020
imported on: 2023-04-07T16:52:39.364811Z
last refreshed on: 2026-06-05T07:16:11.699Z
source accessed on: 2017-12-31T07:04:19Z
source last accessed on: 2021-08-01T01:06:53Z
definition: Manufacturers of toiletries, personal hygienic and birth control products. Includes producers of combs, toothbrushes, mouthwash, perfumes, cosmetics, deodorants, hand and body soaps, sunscreen lotion, walking canes, burial caskets, hair pieces, prophylactics, spectacles, contact lenses and other personal products.
notation: 54201020
valid from: 2020
is industry of: Personal & Household Products & Services

Personal Services (NEC)
type: NamedIndividual
type: Activity
type: BusinessClassification
is contemporary version of: http://data.ga-group.nl/ics/trbc/5420103010
is version of: http://data.ga-group.nl/ics/trbc/5420103010
replaces: http://data.ga-group.nl/ics/trbc/2012/5420103010
imported on: 2023-04-07T16:52:39.364811Z
last refreshed on: 2026-06-05T07:16:11.699Z
source accessed on: 2017-12-31T07:04:19Z
source last accessed on: 2021-08-01T01:06:53Z
definition: Companies engaged in accounting, counseling and rehabilitation, legal, laundry, automotive repair, lawn maintenance, funeral and daycare services, as well as personal enrichment services such as test preparation, colleges and dance classes. Includes also rental services for tuxedos and gowns, furniture, consumer electronics and video cassette movies and games. Excludes: (computer and IT schools, classified in IT Services & Consulting), (vocational schools, classified in Business Support Services ), (travel agencies and recreational rentals such as water crafts, classified in Leisure & Recreation).
notation: 5420103010
valid from: 2020
is activity of: Personal Services

Consumer Goods Rental
type: NamedIndividual
type: Activity
type: BusinessClassification
is contemporary version of: http://data.ga-group.nl/ics/trbc/5420103011
is version of: http://data.ga-group.nl/ics/trbc/5420103011
replaces: http://data.ga-group.nl/ics/trbc/2012/5420103011
imported on: 2023-04-07T16:52:39.364811Z
last refreshed on: 2026-06-05T07:16:11.699Z
source accessed on: 2017-12-31T07:04:19Z
source last accessed on: 2021-08-01T01:06:53Z
definition: Companies engaged in rental of tuxedos and gowns, furniture, consumer electronics and video cassette movies and games.
notation: 5420103011
valid from: 2020
is activity of: Personal Services

Accounting & Tax Preparation
type: NamedIndividual
type: Activity
type: BusinessClassification
is contemporary version of: http://data.ga-group.nl/ics/trbc/5420103012
is version of: http://data.ga-group.nl/ics/trbc/5420103012
replaces: http://data.ga-group.nl/ics/trbc/2012/5420103012
imported on: 2023-04-07T16:52:39.364811Z
last refreshed on: 2026-06-05T07:16:11.699Z
source accessed on: 2017-12-31T07:04:19Z
source last accessed on: 2021-08-01T01:06:53Z
definition: Companies engaged in providing accounting and tax preparation services for individual clients.
notation: 5420103012
valid from: 2020
is activity of: Personal Services

Personal Legal Services
type: NamedIndividual
type: Activity
type: BusinessClassification
is contemporary version of: http://data.ga-group.nl/ics/trbc/5420103013
is version of: http://data.ga-group.nl/ics/trbc/5420103013
replaces: http://data.ga-group.nl/ics/trbc/2012/5420103013
imported on: 2023-04-07T16:52:39.364811Z
last refreshed on: 2026-06-05T07:16:11.699Z
source accessed on: 2017-12-31T07:04:19Z
source last accessed on: 2021-08-01T01:06:53Z
definition: Companies engaged in providing legal services to individual clients.
notation: 5420103013
valid from: 2020
is activity of: Personal Services

Child Care & Family Services
type: NamedIndividual
type: Activity
type: BusinessClassification
is contemporary version of: http://data.ga-group.nl/ics/trbc/5420103015
is version of: http://data.ga-group.nl/ics/trbc/5420103015
replaces: http://data.ga-group.nl/ics/trbc/2012/5420103015
imported on: 2023-04-07T16:52:39.364811Z
last refreshed on: 2026-06-05T07:16:11.699Z
source accessed on: 2017-12-31T07:04:19Z
source last accessed on: 2021-08-01T01:06:53Z
definition: Companies engaged in providing Child Care & Family Services.
notation: 5420103015
valid from: 2020
is activity of: Personal Services

Consumer Repair Services
type: NamedIndividual
type: Activity
type: BusinessClassification
is contemporary version of: http://data.ga-group.nl/ics/trbc/5420103016
is version of: http://data.ga-group.nl/ics/trbc/5420103016
replaces: http://data.ga-group.nl/ics/trbc/2012/5420103016
imported on: 2023-04-07T16:52:39.364811Z
last refreshed on: 2026-06-05T07:16:11.699Z
source accessed on: 2017-12-31T07:04:19Z
source last accessed on: 2021-08-01T01:06:53Z
definition: Companies engaged in providing repair services for consumers goods such as electronics, home appliances, garden equipment, furniture, automobiles and other consumer goods.
notation: 5420103016
valid from: 2020
is activity of: Personal Services

Personal Care Services
type: NamedIndividual
type: Activity
type: BusinessClassification
is contemporary version of: http://data.ga-group.nl/ics/trbc/5420103017
is version of: http://data.ga-group.nl/ics/trbc/5420103017
replaces: http://data.ga-group.nl/ics/trbc/2012/5420103017
imported on: 2023-04-07T16:52:39.364811Z
last refreshed on: 2026-06-05T07:16:11.699Z
source accessed on: 2017-12-31T07:04:19Z
source last accessed on: 2021-08-01T01:06:53Z
definition: Companies engaged in providing personal care services such as nail bar, beauty salons, hair salons, and massage services.
notation: 5420103017
valid from: 2020
is activity of: Personal Services

Funeral Services
type: NamedIndividual
type: Activity
type: BusinessClassification
is contemporary version of: http://data.ga-group.nl/ics/trbc/5420103018
is version of: http://data.ga-group.nl/ics/trbc/5420103018
replaces: http://data.ga-group.nl/ics/trbc/2012/5420103018
imported on: 2023-04-07T16:52:39.364811Z
last refreshed on: 2026-06-05T07:16:11.699Z
source accessed on: 2017-12-31T07:04:19Z
source last accessed on: 2021-08-01T01:06:53Z
definition: Companies engaged in providing funeral services.
notation: 5420103018
valid from: 2020
is activity of: Personal Services

Personal Services
type: NamedIndividual
type: BusinessClassification
type: Industry
is contemporary version of: http://data.ga-group.nl/ics/trbc/54201030
is version of: http://data.ga-group.nl/ics/trbc/54201030
replaces: http://data.ga-group.nl/ics/trbc/2012/54201030
imported on: 2023-04-07T16:52:39.364811Z
last refreshed on: 2026-06-05T07:16:11.699Z
source accessed on: 2017-12-31T07:04:19Z
source last accessed on: 2021-08-01T01:06:53Z
definition: Providers of accounting, counseling and rehabilitation, childcare, legal, marriage, laundry, lawn maintenance and funeral services, as well as personal enrichment services, such as test preparation, colleges and dance classes. Includes rental services for tuxedos and gowns, furniture, consumer electronics, movies and games.
notation: 54201030
valid from: 2020
is industry of: Personal & Household Products & Services

Personal & Household Products & Services
type: NamedIndividual
type: BusinessClassification
type: IndustryGroup
is contemporary version of: http://data.ga-group.nl/ics/trbc/542010
is version of: http://data.ga-group.nl/ics/trbc/542010
replaces: http://data.ga-group.nl/ics/trbc/2012/542010
imported on: 2023-04-07T16:52:39.364811Z
last refreshed on: 2026-06-05T07:16:11.699Z
source accessed on: 2017-12-31T07:04:19Z
source last accessed on: 2021-08-01T01:06:53Z
definition: Manufacturers of non-durable household goods, personal products and providers of personal services.
notation: 542010
valid from: 2020
is industry group of: Personal & Household Products & Services

Personal & Household Products & Services
type: NamedIndividual
type: BusinessClassification
type: BusinessSector
is contemporary version of: http://data.ga-group.nl/ics/trbc/5420
is version of: http://data.ga-group.nl/ics/trbc/5420
replaces: http://data.ga-group.nl/ics/trbc/2012/5420
imported on: 2023-04-07T16:52:39.364811Z
last refreshed on: 2026-06-05T07:16:11.699Z
source accessed on: 2017-12-31T07:04:19Z
source last accessed on: 2021-08-01T01:06:53Z
definition: Manufacturers of non-durable household goods, personal products and providers of personal services.
notation: 5420
valid from: 2020
is business sector of: Consumer Non-Cyclicals

Drug Retailers (NEC)
type: NamedIndividual
type: Activity
type: BusinessClassification
is contemporary version of: http://data.ga-group.nl/ics/trbc/5430101010
is version of: http://data.ga-group.nl/ics/trbc/5430101010
replaces: http://data.ga-group.nl/ics/trbc/2012/5430101010
imported on: 2023-04-07T16:52:39.364811Z
last refreshed on: 2026-06-05T07:16:11.699Z
source accessed on: 2017-12-31T07:04:19Z
source last accessed on: 2021-08-01T01:06:53Z
definition: Companies engaged in the operation of pharmacies. Includes also retail drug operations with auxiliary food and household good product lines.
notation: 5430101010
valid from: 2020
is activity of: Drug Retailers

Retail - Drugs with Grocery
type: NamedIndividual
type: Activity
type: BusinessClassification
is contemporary version of: http://data.ga-group.nl/ics/trbc/5430101011
is version of: http://data.ga-group.nl/ics/trbc/5430101011
replaces: http://data.ga-group.nl/ics/trbc/2012/5430101011
imported on: 2023-04-07T16:52:39.364811Z
last refreshed on: 2026-06-05T07:16:11.699Z
source accessed on: 2017-12-31T07:04:19Z
source last accessed on: 2021-08-01T01:06:53Z
definition: Retailers of prescription or non-prescription drugs and medicines together with grocery.
notation: 5430101011
valid from: 2020
is activity of: Drug Retailers

Retail - Drugs without Grocery
type: NamedIndividual
type: Activity
type: BusinessClassification
is contemporary version of: http://data.ga-group.nl/ics/trbc/5430101012
is version of: http://data.ga-group.nl/ics/trbc/5430101012
replaces: http://data.ga-group.nl/ics/trbc/2012/5430101012
imported on: 2023-04-07T16:52:39.364811Z
last refreshed on: 2026-06-05T07:16:11.699Z
source accessed on: 2017-12-31T07:04:19Z
source last accessed on: 2021-08-01T01:06:53Z
definition: Retailers of prescription or non-prescription drugs and medicines without grocery.
notation: 5430101012
valid from: 2020
is activity of: Drug Retailers

Cannabis Product Retailers
type: NamedIndividual
type: Activity
type: BusinessClassification
is contemporary version of: http://data.ga-group.nl/ics/trbc/5430101013
is version of: http://data.ga-group.nl/ics/trbc/5430101013
imported on: 2023-04-07T17:17:07.492231Z
last refreshed on: 2026-06-05T07:16:11.699Z
source accessed on: 2021-04-25T05:48:36Z
source last accessed on: 2021-08-01T01:06:53Z
definition: Retailers primarily selling cannabis or cannabis derived products.
notation: 5430101013
valid from: 2020
is activity of: Drug Retailers

Non-Cannabis Recreational Drug Retailers
type: NamedIndividual
type: Activity
type: BusinessClassification
is contemporary version of: http://data.ga-group.nl/ics/trbc/5430101014
is version of: http://data.ga-group.nl/ics/trbc/5430101014
imported on: 2023-04-07T17:17:07.492231Z
last refreshed on: 2026-06-05T07:16:11.699Z
source accessed on: 2021-04-25T05:48:36Z
source last accessed on: 2021-08-01T01:06:53Z
definition: Retailers primarily selling recreational drug products, excluding primarily cannabis or cannabis derived products.
notation: 5430101014
valid from: 2020
is activity of: Drug Retailers

Drug Retailers
type: NamedIndividual
type: BusinessClassification
type: Industry
is contemporary version of: http://data.ga-group.nl/ics/trbc/54301010
is version of: http://data.ga-group.nl/ics/trbc/54301010
replaces: http://data.ga-group.nl/ics/trbc/2012/54301010
imported on: 2023-04-07T16:52:39.364811Z
last refreshed on: 2026-06-05T07:16:11.699Z
source accessed on: 2017-12-31T07:04:19Z
source last accessed on: 2021-08-01T01:06:53Z
definition: Retailers operating pharmacies. Includes retail drug operators with auxiliary food and household good product lines.
notation: 54301010
valid from: 2020
is industry of: Food & Drug Retailing

Food Retail & Distribution (NEC)
type: NamedIndividual
type: Activity
type: BusinessClassification
is contemporary version of: http://data.ga-group.nl/ics/trbc/5430102010
is version of: http://data.ga-group.nl/ics/trbc/5430102010
replaces: http://data.ga-group.nl/ics/trbc/2012/5430102010
imported on: 2023-04-07T16:52:39.364811Z
last refreshed on: 2026-06-05T07:16:11.699Z
source accessed on: 2017-12-31T07:04:19Z
source last accessed on: 2021-08-01T01:06:53Z
definition: Companies engaged in the operation of grocery, convenience, liquor and specialty food stores. Includes also grocery stores with an auxiliary drug department and vending machine operators.
notation: 5430102010
valid from: 2020
is activity of: Food Retail & Distribution

Food Wholesale
type: NamedIndividual
type: Activity
type: BusinessClassification
is contemporary version of: http://data.ga-group.nl/ics/trbc/5430102011
is version of: http://data.ga-group.nl/ics/trbc/5430102011
replaces: http://data.ga-group.nl/ics/trbc/2012/5430102011
imported on: 2023-04-07T16:52:39.364811Z
last refreshed on: 2026-06-05T07:16:11.699Z
source accessed on: 2017-12-31T07:04:19Z
source last accessed on: 2021-08-01T01:06:53Z
definition: Companies engaged in merchant wholesale of various packaged food. Excludes wholesale of fresh vegetables, fruits, fish, classified in Fishing & Farming Wholesale.
notation: 5430102011
valid from: 2020
is activity of: Food Retail & Distribution

Supermarkets & Convenience Stores
type: NamedIndividual
type: Activity
type: BusinessClassification
is contemporary version of: http://data.ga-group.nl/ics/trbc/5430102012
is version of: http://data.ga-group.nl/ics/trbc/5430102012
replaces: http://data.ga-group.nl/ics/trbc/2012/5430102012
imported on: 2023-04-07T16:52:39.364811Z
last refreshed on: 2026-06-05T07:16:11.699Z
source accessed on: 2017-12-31T07:04:19Z
source last accessed on: 2021-08-01T01:06:53Z
definition: Companies engaged in operation of supermarkets, hypermarkets, convenience stores and grocery stores.
notation: 5430102012
valid from: 2020
is activity of: Food Retail & Distribution

Beer, Wine & Liquor Stores
type: NamedIndividual
type: Activity
type: BusinessClassification
is contemporary version of: http://data.ga-group.nl/ics/trbc/5430102013
is version of: http://data.ga-group.nl/ics/trbc/5430102013
replaces: http://data.ga-group.nl/ics/trbc/2012/5430102013
imported on: 2023-04-07T16:52:39.364811Z
last refreshed on: 2026-06-05T07:16:11.699Z
source accessed on: 2017-12-31T07:04:19Z
source last accessed on: 2021-08-01T01:06:53Z
definition: Companies engaged in retailing alcohols such as beer, wine and liquor.
notation: 5430102013
valid from: 2020
is activity of: Food Retail & Distribution

Vending Machine Providers
type: NamedIndividual
type: Activity
type: BusinessClassification
is contemporary version of: http://data.ga-group.nl/ics/trbc/5430102014
is version of: http://data.ga-group.nl/ics/trbc/5430102014
replaces: http://data.ga-group.nl/ics/trbc/2012/5430102014
imported on: 2023-04-07T16:52:39.364811Z
last refreshed on: 2026-06-05T07:16:11.699Z
source accessed on: 2017-12-31T07:04:19Z
source last accessed on: 2021-08-01T01:06:53Z
definition: Companies engaged in operation of vending machine for retailing packaged foods and beverages.
notation: 5430102014
valid from: 2020
is activity of: Food Retail & Distribution

Tobacco Stores
type: NamedIndividual
type: Activity
type: BusinessClassification
is contemporary version of: http://data.ga-group.nl/ics/trbc/5430102015
is version of: http://data.ga-group.nl/ics/trbc/5430102015
replaces: http://data.ga-group.nl/ics/trbc/2012/5430102015
imported on: 2023-04-07T16:52:39.364811Z
last refreshed on: 2026-06-05T07:16:11.699Z
source accessed on: 2017-12-31T07:04:19Z
source last accessed on: 2021-08-01T01:06:53Z
definition: Companies engaged in retailing tobaccos and cigarettes. Includes also retailers of e-cigarettes and vaporisers.
notation: 5430102015
valid from: 2020
is activity of: Food Retail & Distribution

Food Markets
type: NamedIndividual
type: Activity
type: BusinessClassification
is contemporary version of: http://data.ga-group.nl/ics/trbc/5430102016
is version of: http://data.ga-group.nl/ics/trbc/5430102016
replaces: http://data.ga-group.nl/ics/trbc/2012/5430102016
imported on: 2023-04-07T16:52:39.364811Z
last refreshed on: 2026-06-05T07:16:11.699Z
source accessed on: 2017-12-31T07:04:19Z
source last accessed on: 2021-08-01T01:06:53Z
definition: Companies engaged in operation of food markets such as meat markets, fish markets, vegetable and fruit markets.
notation: 5430102016
valid from: 2020
is activity of: Food Retail & Distribution

Food Retail & Distribution
type: NamedIndividual
type: BusinessClassification
type: Industry
is contemporary version of: http://data.ga-group.nl/ics/trbc/54301020
is version of: http://data.ga-group.nl/ics/trbc/54301020
replaces: http://data.ga-group.nl/ics/trbc/2012/54301020
imported on: 2023-04-07T16:52:39.364811Z
last refreshed on: 2026-06-05T07:16:11.699Z
source accessed on: 2017-12-31T07:04:19Z
source last accessed on: 2021-08-01T01:06:53Z
definition: Retailers operating grocery, convenience, liquor and specialty food stores. Includes operators of grocery stores with an auxiliary drug department and vending machines.
notation: 54301020
valid from: 2020
is industry of: Food & Drug Retailing

Food & Drug Retailing
type: NamedIndividual
type: BusinessClassification
type: IndustryGroup
is contemporary version of: http://data.ga-group.nl/ics/trbc/543010
is version of: http://data.ga-group.nl/ics/trbc/543010
replaces: http://data.ga-group.nl/ics/trbc/2012/543010
imported on: 2023-04-07T16:52:39.364811Z
last refreshed on: 2026-06-05T07:16:11.699Z
source accessed on: 2017-12-31T07:04:19Z
source last accessed on: 2021-08-01T01:06:53Z
definition: Retailers operating pharmacies, grocery, convenience, liquor and specialty food stores.
notation: 543010
valid from: 2020
is industry group of: Food & Drug Retailing

Food & Drug Retailing
type: NamedIndividual
type: BusinessClassification
type: BusinessSector
is contemporary version of: http://data.ga-group.nl/ics/trbc/5430
is version of: http://data.ga-group.nl/ics/trbc/5430
replaces: http://data.ga-group.nl/ics/trbc/2012/5430
imported on: 2023-04-07T16:52:39.364811Z
last refreshed on: 2026-06-05T07:16:11.699Z
source accessed on: 2017-12-31T07:04:19Z
source last accessed on: 2021-08-01T01:06:53Z
definition: Retailers operating pharmacies, grocery, convenience, liquor and specialty food stores.
notation: 5430
valid from: 2020
is business sector of: Consumer Non-Cyclicals

Consumer Goods Conglomerates
type: NamedIndividual
type: Activity
type: BusinessClassification
is contemporary version of: http://data.ga-group.nl/ics/trbc/5440101010
is version of: http://data.ga-group.nl/ics/trbc/5440101010
imported on: 2023-04-07T16:52:39.364811Z
last refreshed on: 2026-06-05T07:16:11.699Z
source accessed on: 2017-12-31T07:04:19Z
source last accessed on: 2021-08-01T01:06:53Z
definition: Large organizations, engaged in multiple business lines within the consumer goods sectors, including non-cyclical consumer goods and cyclical consumer goods.
notation: 5440101010
valid from: 2020
is activity of: Consumer Goods Conglomerates

Consumer Goods Conglomerates
type: NamedIndividual
type: BusinessClassification
type: Industry
is contemporary version of: http://data.ga-group.nl/ics/trbc/54401010
is version of: http://data.ga-group.nl/ics/trbc/54401010
imported on: 2026-06-05T07:16:11.699Z
last refreshed on: 2026-06-05T07:16:11.699Z
source accessed on: 2021-07-28T17:27:51Z
source last accessed on: 2021-07-28T17:27:51Z
definition: Large organizations, engaged in multiple business lines within the consumer goods sectors, including non-cyclical consumer goods and cyclical consumer goods.
notation: 54401010
valid from: 2020
is industry of: Consumer Goods Conglomerates

Consumer Goods Conglomerates
type: NamedIndividual
type: BusinessClassification
type: IndustryGroup
is contemporary version of: http://data.ga-group.nl/ics/trbc/544010
is version of: http://data.ga-group.nl/ics/trbc/544010
imported on: 2023-04-07T16:52:39.364811Z
last refreshed on: 2026-06-05T07:16:11.699Z
source accessed on: 2017-12-31T07:04:19Z
source last accessed on: 2021-08-01T01:06:53Z
definition: Large organizations, engaged in multiple business lines within the consumer goods sectors, including non-cyclical consumer goods and cyclical consumer goods.
notation: 544010
valid from: 2020
is industry group of: Consumer Goods Conglomerates

Consumer Goods Conglomerates
type: NamedIndividual
type: BusinessClassification
type: BusinessSector
is contemporary version of: http://data.ga-group.nl/ics/trbc/5440
is version of: http://data.ga-group.nl/ics/trbc/5440
imported on: 2023-04-07T16:52:39.364811Z
last refreshed on: 2026-06-05T07:16:11.699Z
source accessed on: 2017-12-31T07:04:19Z
source last accessed on: 2021-08-01T01:06:53Z
definition: Large organizations, engaged in multiple business lines within the consumer goods sectors, including non-cyclical consumer goods and cyclical consumer goods.
notation: 5440
valid from: 2020
is business sector of: Consumer Non-Cyclicals

Consumer Non-Cyclicals
type: NamedIndividual
type: BusinessClassification
type: EconomicSector
is contemporary version of: http://data.ga-group.nl/ics/trbc/54
is version of: http://data.ga-group.nl/ics/trbc/54
replaces: http://data.ga-group.nl/ics/trbc/2012/54
imported on: 2023-04-07T16:52:39.364811Z
last refreshed on: 2026-06-05T07:16:11.699Z
source accessed on: 2017-12-31T07:04:19Z
source last accessed on: 2021-08-01T01:06:53Z
definition: Producers, processors and Retailers of food, tobacco and beverages, and manufacturers of household and personal products, as well as providers of personal services.
notation: 54
valid from: 2020

Banks (NEC)
type: NamedIndividual
type: Activity
type: BusinessClassification
is contemporary version of: http://data.ga-group.nl/ics/trbc/5510101010
is version of: http://data.ga-group.nl/ics/trbc/5510101010
replaces: http://data.ga-group.nl/ics/trbc/2012/5510101010
imported on: 2023-04-07T16:52:39.364811Z
last refreshed on: 2026-06-05T07:16:11.699Z
source accessed on: 2017-12-31T07:04:19Z
source last accessed on: 2021-08-01T01:06:53Z
definition: Deposit-taking institutions involved in at least two of activities within Banks Industry, none being dominant: Corporate Banks, Retail & Mortgage Banks, Money Center Banks, Private Banks and Islamic Banks. Includes also banking entities not classified elsewhere in the Banks industry, and bank holding companies. Excludes providers of investment banking services, classified in Investment Banking & Brokerage Services (NEC).
notation: 5510101010
valid from: 2020
is activity of: Banks

Corporate Banks
type: NamedIndividual
type: Activity
type: BusinessClassification
is contemporary version of: http://data.ga-group.nl/ics/trbc/5510101011
is version of: http://data.ga-group.nl/ics/trbc/5510101011
replaces: http://data.ga-group.nl/ics/trbc/2012/5510101011
imported on: 2023-04-07T16:52:39.364811Z
last refreshed on: 2026-06-05T07:16:11.699Z
source accessed on: 2017-12-31T07:04:19Z
source last accessed on: 2021-08-01T01:06:53Z
definition: Companies that provide business-to-business (B2B) banking services, such as business loans, industrial loans, savings accounts for corporate clients and deposits to businesses. Excludes retail banks offering services to individuals only, classified in Retail & Mortgage Banks; mortgage banks, classified in Retail & Mortgage Banks; universal (B2B plus B2C) banks, classified in Banks (NEC); purely investment/merchant banks, classified in Investment Banking and Merchant Banks, respectively; banks serving exclusively importers and exporters, classified as Import-Export Banks; and providers of investment banking services, classified in Investment Banking & Brokerage Services (NEC).
notation: 5510101011
valid from: 2020
is activity of: Banks

Retail & Mortgage Banks
type: NamedIndividual
type: Activity
type: BusinessClassification
is contemporary version of: http://data.ga-group.nl/ics/trbc/5510101012
is version of: http://data.ga-group.nl/ics/trbc/5510101012
replaces: http://data.ga-group.nl/ics/trbc/2012/5510101012
imported on: 2023-04-07T16:52:39.364811Z
last refreshed on: 2026-06-05T07:16:11.699Z
source accessed on: 2017-12-31T07:04:19Z
source last accessed on: 2021-08-01T01:06:53Z
definition: Mortgage banks and/or retail banks. Mortgage banks are banking entities providing mortgage loans directly to consumers. Retail banks are mass-market banking entities focused on consumers, offering such services as savings and checking accounts, personal loans, debit/credit cards.
notation: 5510101012
valid from: 2020
is activity of: Banks

Money Center Banks
type: NamedIndividual
type: Activity
type: BusinessClassification
is contemporary version of: http://data.ga-group.nl/ics/trbc/5510101013
is version of: http://data.ga-group.nl/ics/trbc/5510101013
replaces: http://data.ga-group.nl/ics/trbc/2012/5510101013
imported on: 2023-04-07T16:52:39.364811Z
last refreshed on: 2026-06-05T07:16:11.699Z
source accessed on: 2017-12-31T07:04:19Z
source last accessed on: 2021-08-01T01:06:53Z
definition: Large regional banks with multiline banking operations, including commercial banking, investment banking, portfolio management, among others. Money Center Banks are usually located in in major economic centers, such as New York, London, Shanghai and Tokyo.
notation: 5510101013
valid from: 2020
is activity of: Banks

Private Banks
type: NamedIndividual
type: Activity
type: BusinessClassification
is contemporary version of: http://data.ga-group.nl/ics/trbc/5510101014
is version of: http://data.ga-group.nl/ics/trbc/5510101014
replaces: http://data.ga-group.nl/ics/trbc/2012/5510101014
imported on: 2023-04-07T16:52:39.364811Z
last refreshed on: 2026-06-05T07:16:11.699Z
source accessed on: 2017-12-31T07:04:19Z
source last accessed on: 2021-08-01T01:06:53Z
definition: Companies engaged in providing banking, investment and other financial services to private individuals investing sizable assets. These clients are often referred to as high net worth individuals (HNWIs). The private banks usually do not form networks and might provide additional services, such as tax and estate planning, commercial banking, wealth management and foreign exchange services.
notation: 5510101014
valid from: 2020
is activity of: Banks

Islamic Banks
type: NamedIndividual
type: Activity
type: BusinessClassification
is contemporary version of: http://data.ga-group.nl/ics/trbc/5510101015
is version of: http://data.ga-group.nl/ics/trbc/5510101015
replaces: http://data.ga-group.nl/ics/trbc/2012/5510101015
imported on: 2023-04-07T16:52:39.364811Z
last refreshed on: 2026-06-05T07:16:11.699Z
source accessed on: 2017-12-31T07:04:19Z
source last accessed on: 2021-08-01T01:06:53Z
definition: Companies engaged in banking activities consistent with the principles of Islamic law (Sharia) and its practical application through the development of Islamic economics.
notation: 5510101015
valid from: 2020
is activity of: Banks

Banks
type: NamedIndividual
type: BusinessClassification
type: Industry
is contemporary version of: http://data.ga-group.nl/ics/trbc/55101010
is version of: http://data.ga-group.nl/ics/trbc/55101010
replaces: http://data.ga-group.nl/ics/trbc/2012/55101010
imported on: 2023-04-07T16:52:39.364811Z
last refreshed on: 2026-06-05T07:16:11.699Z
source accessed on: 2017-12-31T07:04:19Z
source last accessed on: 2021-08-01T01:06:53Z
definition: Deposit-taking institutions such as commercial banks, savings and loans banks, credit institutions, universal banking institutions, retail banks, mortgage banks, Money Center Banks, private banks and Islamic banks. Excludes providers of investment banking services classified in Investment Banking.
notation: 55101010
valid from: 2020
is industry of: Banking Services

Consumer Lending (NEC)
type: NamedIndividual
type: Activity
type: BusinessClassification
is contemporary version of: http://data.ga-group.nl/ics/trbc/5510103010
is version of: http://data.ga-group.nl/ics/trbc/5510103010
replaces: http://data.ga-group.nl/ics/trbc/2012/5510103010
imported on: 2023-04-07T16:52:39.364811Z
last refreshed on: 2026-06-05T07:16:11.699Z
source accessed on: 2017-12-31T07:04:19Z
source last accessed on: 2021-08-01T01:06:53Z
definition: Companies involved in at least two activities under Consumer Lending industry, none being dominant: Personal & Car Loans, Consumer Credit Cards Services, Consumer Leasing, Credit Unions and Microfinancing. Includes also consumer financial services not elsewhere classified under the Consumer Lending industry.
notation: 5510103010
valid from: 2020
is activity of: Consumer Lending

Personal & Car Loans
type: NamedIndividual
type: Activity
type: BusinessClassification
is contemporary version of: http://data.ga-group.nl/ics/trbc/5510103011
is version of: http://data.ga-group.nl/ics/trbc/5510103011
replaces: http://data.ga-group.nl/ics/trbc/2012/5510103011
imported on: 2023-04-07T16:52:39.364811Z
last refreshed on: 2026-06-05T07:16:11.699Z
source accessed on: 2017-12-31T07:04:19Z
source last accessed on: 2021-08-01T01:06:53Z
definition: Companies engaged in personal loan services such as student loans and car loans.
notation: 5510103011
valid from: 2020
is activity of: Consumer Lending

Consumer Credit Cards Services
type: NamedIndividual
type: Activity
type: BusinessClassification
is contemporary version of: http://data.ga-group.nl/ics/trbc/5510103012
is version of: http://data.ga-group.nl/ics/trbc/5510103012
replaces: http://data.ga-group.nl/ics/trbc/2012/5510103012
imported on: 2023-04-07T16:52:39.364811Z
last refreshed on: 2026-06-05T07:16:11.699Z
source accessed on: 2017-12-31T07:04:19Z
source last accessed on: 2021-08-01T01:06:53Z
definition: Companies engaged in issuing credit cards and providing related services.
notation: 5510103012
valid from: 2020
is activity of: Consumer Lending

Consumer Leasing
type: NamedIndividual
type: Activity
type: BusinessClassification
is contemporary version of: http://data.ga-group.nl/ics/trbc/5510103013
is version of: http://data.ga-group.nl/ics/trbc/5510103013
replaces: http://data.ga-group.nl/ics/trbc/2012/5510103013
imported on: 2023-04-07T16:52:39.364811Z
last refreshed on: 2026-06-05T07:16:11.699Z
source accessed on: 2017-12-31T07:04:19Z
source last accessed on: 2021-08-01T01:06:53Z
definition: Companies engaged in lending money for the purpose of providing collateralized goods such as automobiles, electronics and appliances through a contractual installment sales agreement.
notation: 5510103013
valid from: 2020
is activity of: Consumer Lending

Credit Unions
type: NamedIndividual
type: Activity
type: BusinessClassification
is contemporary version of: http://data.ga-group.nl/ics/trbc/5510103014
is version of: http://data.ga-group.nl/ics/trbc/5510103014
replaces: http://data.ga-group.nl/ics/trbc/2012/5510103014
imported on: 2023-04-07T16:52:39.364811Z
last refreshed on: 2026-06-05T07:16:11.699Z
source accessed on: 2017-12-31T07:04:19Z
source last accessed on: 2021-08-01T01:06:53Z
definition: Companies engaged in accepting members' share deposits in cooperatives that are organized to offer consumer loans to their members.
notation: 5510103014
valid from: 2020
is activity of: Consumer Lending

Microfinancing
type: NamedIndividual
type: Activity
type: BusinessClassification
is contemporary version of: http://data.ga-group.nl/ics/trbc/5510103015
is version of: http://data.ga-group.nl/ics/trbc/5510103015
replaces: http://data.ga-group.nl/ics/trbc/2012/5510103015
imported on: 2023-04-07T16:52:39.364811Z
last refreshed on: 2026-06-05T07:16:11.699Z
source accessed on: 2017-12-31T07:04:19Z
source last accessed on: 2021-08-01T01:06:53Z
definition: Companies engaged in provision of financial services to low-income clients or solidarity lending groups including consumers and the self-employed, who traditionally lack access to banking and related services.
notation: 5510103015
valid from: 2020
is activity of: Consumer Lending

Consumer Lending
type: NamedIndividual
type: BusinessClassification
type: Industry
is contemporary version of: http://data.ga-group.nl/ics/trbc/55101030
is version of: http://data.ga-group.nl/ics/trbc/55101030
replaces: http://data.ga-group.nl/ics/trbc/2012/55101030
imported on: 2023-04-07T16:52:39.364811Z
last refreshed on: 2026-06-05T07:16:11.699Z
source accessed on: 2017-12-31T07:04:19Z
source last accessed on: 2021-08-01T01:06:53Z
definition: Providers of personal loans, car loans, consumer credit card services, consumer leasing, credit unions and microfinancing.
notation: 55101030
valid from: 2020
is industry of: Banking Services

Corporate Financial Services (NEC)
type: NamedIndividual
type: Activity
type: BusinessClassification
is contemporary version of: http://data.ga-group.nl/ics/trbc/5510105010
is version of: http://data.ga-group.nl/ics/trbc/5510105010
replaces: http://data.ga-group.nl/ics/trbc/2012/5510105010
imported on: 2023-04-07T16:52:39.364811Z
last refreshed on: 2026-06-05T07:16:11.699Z
source accessed on: 2017-12-31T07:04:19Z
source last accessed on: 2021-08-01T01:06:53Z
definition: Companies involved in at least two activities under the Corporate Financial Services industry, none being dominant: Commercial Loans, Import-Export Banks, International Trade Financing, Factoring and Commercial Leasing. Includes also entities not classified elsewhere under the Corporate Financial Services industry.
notation: 5510105010
valid from: 2020
is activity of: Corporate Financial Services

Commercial Loans
type: NamedIndividual
type: Activity
type: BusinessClassification
is contemporary version of: http://data.ga-group.nl/ics/trbc/5510105011
is version of: http://data.ga-group.nl/ics/trbc/5510105011
replaces: http://data.ga-group.nl/ics/trbc/2012/5510105011
imported on: 2023-04-07T16:52:39.364811Z
last refreshed on: 2026-06-05T07:16:11.699Z
source accessed on: 2017-12-31T07:04:19Z
source last accessed on: 2021-08-01T01:06:53Z
definition: Companies engaged in providing debt-based funding arrangements to businesses. Commercial lenders get financing from the wholesale markets (borrowing money from the banks) instead of taking deposits, and are not formed as banks.
notation: 5510105011
valid from: 2020
is activity of: Corporate Financial Services

Import-Export Banks
type: NamedIndividual
type: Activity
type: BusinessClassification
is contemporary version of: http://data.ga-group.nl/ics/trbc/5510105012
is version of: http://data.ga-group.nl/ics/trbc/5510105012
replaces: http://data.ga-group.nl/ics/trbc/2012/5510105012
imported on: 2023-04-07T16:52:39.364811Z
last refreshed on: 2026-06-05T07:16:11.699Z
source accessed on: 2017-12-31T07:04:19Z
source last accessed on: 2021-08-01T01:06:53Z
definition: Companies, usually banks, engaged in providing long -term financing and guarantees to companies engaged in import and export of goods. Includes governmental and semi-governmental banks. Excludes import-export agencies and other entities, engaged in the provision of short-term financing, shipment, insurance and other basic services, classified in International Trade Financing.
notation: 5510105012
valid from: 2020
is activity of: Corporate Financial Services

International Trade Financing
type: NamedIndividual
type: Activity
type: BusinessClassification
is contemporary version of: http://data.ga-group.nl/ics/trbc/5510105013
is version of: http://data.ga-group.nl/ics/trbc/5510105013
replaces: http://data.ga-group.nl/ics/trbc/2012/5510105013
imported on: 2023-04-07T16:52:39.364811Z
last refreshed on: 2026-06-05T07:16:11.699Z
source accessed on: 2017-12-31T07:04:19Z
source last accessed on: 2021-08-01T01:06:53Z
definition: Companies engaged in short-term financing of international trade transactions, documentary collection, trade insurance, export factoring, forfeiting and others. These companies usually are not banks. Excludes companies, usually banks, engaged in providing long -term financing and guarantees to companies engaged in import and export of goods, classified in Import-Export Banks.
notation: 5510105013
valid from: 2020
is activity of: Corporate Financial Services

Factoring
type: NamedIndividual
type: Activity
type: BusinessClassification
is contemporary version of: http://data.ga-group.nl/ics/trbc/5510105014
is version of: http://data.ga-group.nl/ics/trbc/5510105014
replaces: http://data.ga-group.nl/ics/trbc/2012/5510105014
imported on: 2023-04-07T16:52:39.364811Z
last refreshed on: 2026-06-05T07:16:11.699Z
source accessed on: 2017-12-31T07:04:19Z
source last accessed on: 2021-08-01T01:06:53Z
definition: Companies engaged in providing a financial transaction whereby a business job sells its accounts receivable (i.e. invoices) to a third party (called a factor) in order to get in exchange for immediate money to finance business.
notation: 5510105014
valid from: 2020
is activity of: Corporate Financial Services

Commercial Leasing
type: NamedIndividual
type: Activity
type: BusinessClassification
is contemporary version of: http://data.ga-group.nl/ics/trbc/5510105015
is version of: http://data.ga-group.nl/ics/trbc/5510105015
replaces: http://data.ga-group.nl/ics/trbc/2012/5510105015
imported on: 2023-04-07T16:52:39.364811Z
last refreshed on: 2026-06-05T07:16:11.699Z
source accessed on: 2017-12-31T07:04:19Z
source last accessed on: 2021-08-01T01:06:53Z
definition: Companies providing leasing of commercial equipment, such as industrial/construction machinery leasing, office machinery and equipment leasing, commercial transportation equipment leasing, among others.
notation: 5510105015
valid from: 2020
is activity of: Corporate Financial Services

Corporate Financial Services
type: NamedIndividual
type: BusinessClassification
type: Industry
is contemporary version of: http://data.ga-group.nl/ics/trbc/55101050
is version of: http://data.ga-group.nl/ics/trbc/55101050
replaces: http://data.ga-group.nl/ics/trbc/2012/55101050
imported on: 2023-04-07T16:52:39.364811Z
last refreshed on: 2026-06-05T07:16:11.699Z
source accessed on: 2017-12-31T07:04:19Z
source last accessed on: 2021-08-01T01:06:53Z
definition: Providers of commercial loans for long-term equipment leases, import-export banks and international trade financing, factoring and commercial leasing.
notation: 55101050
valid from: 2020
is industry of: Banking Services

Banking Services
type: NamedIndividual
type: BusinessClassification
type: IndustryGroup
is contemporary version of: http://data.ga-group.nl/ics/trbc/551010
is version of: http://data.ga-group.nl/ics/trbc/551010
replaces: http://data.ga-group.nl/ics/trbc/2012/551010
imported on: 2023-04-07T16:52:39.364811Z
last refreshed on: 2026-06-05T07:16:11.699Z
source accessed on: 2017-12-31T07:04:19Z
source last accessed on: 2021-08-01T01:06:53Z
definition: Providers of retail and commercial banking, consumer financial services and commercial loans for long-term equipment leases. Includes bank holding companies. Excludes providers of investment banking services, classified in Investment Banking.
notation: 551010
valid from: 2020
is industry group of: Banking & Investment Services

Investment Banking & Brokerage Services (NEC)
type: NamedIndividual
type: Activity
type: BusinessClassification
is contemporary version of: http://data.ga-group.nl/ics/trbc/5510201010
is version of: http://data.ga-group.nl/ics/trbc/5510201010
replaces: http://data.ga-group.nl/ics/trbc/2012/5510201010
imported on: 2023-04-07T16:52:39.364811Z
last refreshed on: 2026-06-05T07:16:11.699Z
source accessed on: 2017-12-31T07:04:19Z
source last accessed on: 2021-08-01T01:06:53Z
definition: Companies involved in least two activities under the Investment Banking & Brokerage Services Industry, none being dominant: Investment Banking, Brokerage Services and Inter-Dealer Broker. Includes also entities not elsewhere classified under the Investment Banking & Brokerage Services industry.
notation: 5510201010
valid from: 2020
is activity of: Investment Banking & Brokerage Services

Investment Banking
type: NamedIndividual
type: Activity
type: BusinessClassification
is contemporary version of: http://data.ga-group.nl/ics/trbc/5510201011
is version of: http://data.ga-group.nl/ics/trbc/5510201011
replaces: http://data.ga-group.nl/ics/trbc/2012/5510201011
imported on: 2023-04-07T16:52:39.364811Z
last refreshed on: 2026-06-05T07:16:11.699Z
source accessed on: 2017-12-31T07:04:19Z
source last accessed on: 2021-08-01T01:06:53Z
definition: Companies engaged in facilitating corporate transactions, such as mergers and acquisitions; engaged in underwriting of debt and equities, capital raising by issuing new debt or equity (IPO proceedings), private placements and restructuring, among others, as well as auxiliary security brokerage services. Investment banks are often involved in market making, foreign exchange operations, equity, derivative and commodities trading. Excludes investment management services (managing investment/assets of corporations and institutions) and wealth management services (managing individual clients' assets/wealth), classified in Investment Management and Wealth Management, respectively.
notation: 5510201011
valid from: 2020
is activity of: Investment Banking & Brokerage Services

Brokerage Services
type: NamedIndividual
type: Activity
type: BusinessClassification
is contemporary version of: http://data.ga-group.nl/ics/trbc/5510201012
is version of: http://data.ga-group.nl/ics/trbc/5510201012
replaces: http://data.ga-group.nl/ics/trbc/2012/5510201012
imported on: 2023-04-07T16:52:39.364811Z
last refreshed on: 2026-06-05T07:16:11.699Z
source accessed on: 2017-12-31T07:04:19Z
source last accessed on: 2021-08-01T01:06:53Z
definition: Companies engaged in providing services which include buying and selling stocks for its clients. Includes companies offering services such as brokerage in equity, debts, warrants, commodities, foreign exchange, swaps, futures and options, and all other exchange, OTC or other bespoke securitised instruments. Includes also execution-only brokerage services. Excludes holding and managing assets on behalf of a client or a company, classified in Wealth Management and Investment Management, respectively.
notation: 5510201012
valid from: 2020
is activity of: Investment Banking & Brokerage Services

Inter-Dealer Broker
type: NamedIndividual
type: Activity
type: BusinessClassification
is contemporary version of: http://data.ga-group.nl/ics/trbc/5510201013
is version of: http://data.ga-group.nl/ics/trbc/5510201013
replaces: http://data.ga-group.nl/ics/trbc/2012/5510201013
imported on: 2023-04-07T16:52:39.364811Z
last refreshed on: 2026-06-05T07:16:11.699Z
source accessed on: 2017-12-31T07:04:19Z
source last accessed on: 2021-08-01T01:06:53Z
definition: Companies that act as intermediaries among major dealers and facilitate inter-dealer trades. The intermediary role involves joining other participants in capital markets (brokers and market makers). Excludes brokerage services provided to general public (institutions, corporations and individual clients), classified in Brokerage Services Activity.
notation: 5510201013
valid from: 2020
is activity of: Investment Banking & Brokerage Services

Islamic Investment Banking & Brokerage Services
type: NamedIndividual
type: Activity
type: BusinessClassification
is contemporary version of: http://data.ga-group.nl/ics/trbc/5510201014
is version of: http://data.ga-group.nl/ics/trbc/5510201014
replaces: http://data.ga-group.nl/ics/trbc/2012/5510201014
imported on: 2023-04-07T16:52:39.364811Z
last refreshed on: 2026-06-05T07:16:11.699Z
source accessed on: 2017-12-31T07:04:19Z
source last accessed on: 2021-08-01T01:06:53Z
definition: Companies engaged in providing a system that is based on the principles of Islamic law (also known Sharia) and that is guided by Islamic economics.
notation: 5510201014
valid from: 2020
is activity of: Investment Banking & Brokerage Services

Merchant Banks
type: NamedIndividual
type: Activity
type: BusinessClassification
is contemporary version of: http://data.ga-group.nl/ics/trbc/5510201015
is version of: http://data.ga-group.nl/ics/trbc/5510201015
replaces: http://data.ga-group.nl/ics/trbc/2012/5510201015
imported on: 2023-04-07T16:52:39.364811Z
last refreshed on: 2026-06-05T07:16:11.699Z
source accessed on: 2017-12-31T07:04:19Z
source last accessed on: 2021-08-01T01:06:53Z
definition: Banks engaged mostly in (but is not limited to) international finance, long-term loans for Companies and underwriting. Merchant banks do not provide regular banking services to the general public. The distinction between an investment bank and a merchant bank is that a merchant bank invests its own capital in a client company whereas an investment bank purely distributes (and trades) the securities of that company.
notation: 5510201015
valid from: 2020
is activity of: Investment Banking & Brokerage Services

Investment Banking & Brokerage Services
type: NamedIndividual
type: BusinessClassification
type: Industry
is contemporary version of: http://data.ga-group.nl/ics/trbc/55102010
is version of: http://data.ga-group.nl/ics/trbc/55102010
replaces: http://data.ga-group.nl/ics/trbc/2012/55102010
imported on: 2023-04-07T16:52:39.364811Z
last refreshed on: 2026-06-05T07:16:11.699Z
source accessed on: 2017-12-31T07:04:19Z
source last accessed on: 2021-08-01T01:06:53Z
definition: Providers of investment banking and security brokerage services without significant commercial banking operations, facilitating mergers and acquisitions; underwriting and capital raising via public debt or equity offerings, private placements and restructuring, as well as auxiliary security brokerage services.
notation: 55102010
valid from: 2020
is industry of: Investment Banking & Investment Services

Investment Management & Fund Operators (NEC)
type: NamedIndividual
type: Activity
type: BusinessClassification
is contemporary version of: http://data.ga-group.nl/ics/trbc/5510202010
is version of: http://data.ga-group.nl/ics/trbc/5510202010
replaces: http://data.ga-group.nl/ics/trbc/2012/5510202010
imported on: 2023-04-07T16:52:39.364811Z
last refreshed on: 2026-06-05T07:16:11.699Z
source accessed on: 2017-12-31T07:04:19Z
source last accessed on: 2021-08-01T01:06:53Z
definition: Companies involved in at least two activities under the Investment Management & Fund Operators industry; none being dominant: Investment Management, Hedge Funds, Collective Investment Fund Operators, Wealth Management, Venture Capital and Private Equity. Includes also entities not classified elsewhere under the Investment Management & Fund Operators industry.
notation: 5510202010
valid from: 2020
is activity of: Investment Management & Fund Operators

Investment Management
type: NamedIndividual
type: Activity
type: BusinessClassification
is contemporary version of: http://data.ga-group.nl/ics/trbc/5510202011
is version of: http://data.ga-group.nl/ics/trbc/5510202011
replaces: http://data.ga-group.nl/ics/trbc/2012/5510202011
imported on: 2023-04-07T16:52:39.364811Z
last refreshed on: 2026-06-05T07:16:11.699Z
source accessed on: 2017-12-31T07:04:19Z
source last accessed on: 2021-08-01T01:06:53Z
definition: Companies engaged in providing portfolio management services to corporate clients (businesses, B2B). Includes managers and operators of investment funds, including mutuals, unit trusts, investment trusts, hedge funds, and exchange-traded funds (ETFs), as well as operators of pension funds and life insurance funds. Excludes administrators of funds, providing back-office services to the funds, classified in Collective Investment Fund Operators.
notation: 5510202011
valid from: 2020
is activity of: Investment Management & Fund Operators

Hedge Funds
type: NamedIndividual
type: Activity
type: BusinessClassification
is contemporary version of: http://data.ga-group.nl/ics/trbc/5510202012
is version of: http://data.ga-group.nl/ics/trbc/5510202012
replaces: http://data.ga-group.nl/ics/trbc/2012/5510202012
imported on: 2023-04-07T16:52:39.364811Z
last refreshed on: 2026-06-05T07:16:11.699Z
source accessed on: 2017-12-31T07:04:19Z
source last accessed on: 2021-08-01T01:06:53Z
definition: Companies engaged in operating and/or managing hedge funds. Hedge funds are an aggressively managed portfolio of investments that uses advanced investment strategies such as leveraged, long, short and derivative positions in both domestic and international markets with the goal of generating high returns (either in an absolute sense or over a specified market benchmark). Hedge funds are often set up as private investment partnerships that are open to a limited number of investors and require a very large initial minimum investment.
notation: 5510202012
valid from: 2020
is activity of: Investment Management & Fund Operators

Collective Investment Fund Operators
type: NamedIndividual
type: Activity
type: BusinessClassification
is contemporary version of: http://data.ga-group.nl/ics/trbc/5510202013
is version of: http://data.ga-group.nl/ics/trbc/5510202013
replaces: http://data.ga-group.nl/ics/trbc/2012/5510202013
imported on: 2023-04-07T16:52:39.364811Z
last refreshed on: 2026-06-05T07:16:11.699Z
source accessed on: 2017-12-31T07:04:19Z
source last accessed on: 2021-08-01T01:06:53Z
definition: Companies engaged in operating and/or managing funds and/or trusts other than hedge funds, such as mutuals, unit trusts, investment trusts and exchange-traded funds (ETFs), as well as operators of pension funds and life insurance funds. Excludes REITs (classified in Residential & Commercial REITs).
notation: 5510202013
valid from: 2020
is activity of: Investment Management & Fund Operators

Wealth Management
type: NamedIndividual
type: Activity
type: BusinessClassification
is contemporary version of: http://data.ga-group.nl/ics/trbc/5510202014
is version of: http://data.ga-group.nl/ics/trbc/5510202014
replaces: http://data.ga-group.nl/ics/trbc/2012/5510202014
imported on: 2023-04-07T16:52:39.364811Z
last refreshed on: 2026-06-05T07:16:11.699Z
source accessed on: 2017-12-31T07:04:19Z
source last accessed on: 2021-08-01T01:06:53Z
definition: Companies engaged in providing portfolio management services to individual clients (B2C), often high-net-worth individuals.
notation: 5510202014
valid from: 2020
is activity of: Investment Management & Fund Operators

Venture Capital
type: NamedIndividual
type: Activity
type: BusinessClassification
is contemporary version of: http://data.ga-group.nl/ics/trbc/5510202015
is version of: http://data.ga-group.nl/ics/trbc/5510202015
replaces: http://data.ga-group.nl/ics/trbc/2012/5510202015
imported on: 2023-04-07T16:52:39.364811Z
last refreshed on: 2026-06-05T07:16:11.699Z
source accessed on: 2017-12-31T07:04:19Z
source last accessed on: 2021-08-01T01:06:53Z
definition: Companies engaged in providing financial capital to early-stage, high-potential, high risk, startup companies. Excludes investors that provide financial capital to private equity companies (unlisted companies or companies that become private as a result of investment), classified in Private Equity.
notation: 5510202015
valid from: 2020
is activity of: Investment Management & Fund Operators

Private Equity
type: NamedIndividual
type: Activity
type: BusinessClassification
is contemporary version of: http://data.ga-group.nl/ics/trbc/5510202016
is version of: http://data.ga-group.nl/ics/trbc/5510202016
replaces: http://data.ga-group.nl/ics/trbc/2012/5510202016
imported on: 2023-04-07T16:52:39.364811Z
last refreshed on: 2026-06-05T07:16:11.699Z
source accessed on: 2017-12-31T07:04:19Z
source last accessed on: 2021-08-01T01:06:53Z
definition: Companies engaged in investing in unlisted entities and/or conducting buyouts of public companies that result in a delisting of public equity. The private equity investment partnerships that are open to a limited number of investors and require a very large initial minimum investment. Private Equity companies usually get involved in the management of the acquired companies. Excludes investors who focus on venture capital, classified in Venture Capital.
notation: 5510202016
valid from: 2020
is activity of: Investment Management & Fund Operators

Islamic Investment Management & Fund Operators
type: NamedIndividual
type: Activity
type: BusinessClassification
is contemporary version of: http://data.ga-group.nl/ics/trbc/5510202017
is version of: http://data.ga-group.nl/ics/trbc/5510202017
replaces: http://data.ga-group.nl/ics/trbc/2012/5510202017
imported on: 2023-04-07T16:52:39.364811Z
last refreshed on: 2026-06-05T07:16:11.699Z
source accessed on: 2017-12-31T07:04:19Z
source last accessed on: 2021-08-01T01:06:53Z
definition: Companies offering asset management/fund administration services consistent with the principles of Islamic law (Sharia) and its practical application through the development of Islamic economics. Sharia prohibits the fixed or floating payment or acceptance of specific interest or fees (known as Riba or usury) for loans of money.
notation: 5510202017
valid from: 2020
is activity of: Investment Management & Fund Operators

Investment Management & Fund Operators
type: NamedIndividual
type: BusinessClassification
type: Industry
is contemporary version of: http://data.ga-group.nl/ics/trbc/55102020
is version of: http://data.ga-group.nl/ics/trbc/55102020
replaces: http://data.ga-group.nl/ics/trbc/2012/55102020
imported on: 2023-04-07T16:52:39.364811Z
last refreshed on: 2026-06-05T07:16:11.699Z
source accessed on: 2017-12-31T07:04:19Z
source last accessed on: 2021-08-01T01:06:53Z
definition: Operators and managers of individual and pooled assets via investment funds, including mutual funds, unit trusts, investment trusts, hedge funds, and exchange-traded funds (ETFs), as well as operators of pension funds, private equity firms and life insurance funds.
notation: 55102020
valid from: 2020
is industry of: Investment Banking & Investment Services

Diversified Investment Services
type: NamedIndividual
type: Activity
type: BusinessClassification
is contemporary version of: http://data.ga-group.nl/ics/trbc/5510203010
is version of: http://data.ga-group.nl/ics/trbc/5510203010
replaces: http://data.ga-group.nl/ics/trbc/2012/5510203010
imported on: 2023-04-07T16:52:39.364811Z
last refreshed on: 2026-06-05T07:16:11.699Z
source accessed on: 2017-12-31T07:04:19Z
source last accessed on: 2021-08-01T01:06:53Z
definition: Companies that combine investment banking/security brokerage services with investment management/ fund operating operations, none being dominant.
notation: 5510203010
valid from: 2020
is activity of: Diversified Investment Services

Diversified Investment Services
type: NamedIndividual
type: BusinessClassification
type: Industry
is contemporary version of: http://data.ga-group.nl/ics/trbc/55102030
is version of: http://data.ga-group.nl/ics/trbc/55102030
replaces: http://data.ga-group.nl/ics/trbc/2012/55102030
imported on: 2023-04-07T16:52:39.364811Z
last refreshed on: 2026-06-05T07:16:11.699Z
source accessed on: 2017-12-31T07:04:19Z
source last accessed on: 2021-08-01T01:06:53Z
definition: Providers of investment banking/security brokerage services and investment management/ fund operating operations, none being dominant.
notation: 55102030
valid from: 2020
is industry of: Investment Banking & Investment Services

Financial & Commodity Market Operators & Service Providers (NEC)
type: NamedIndividual
type: Activity
type: BusinessClassification
is contemporary version of: http://data.ga-group.nl/ics/trbc/5510205010
is version of: http://data.ga-group.nl/ics/trbc/5510205010
replaces: http://data.ga-group.nl/ics/trbc/2012/5510205010
imported on: 2023-04-07T16:52:39.364811Z
last refreshed on: 2026-06-05T07:16:11.699Z
source accessed on: 2017-12-31T07:04:19Z
source last accessed on: 2021-08-01T01:06:53Z
definition: Companies involved in at least two activities under the Securities & Commodity Exchanges industry, none being dominant: Securities & Commodity Exchanges; Clearing, Settlement & Custodial Service; Financial Technology & Infrastructure. Includes also entities not elsewhere classified under the Financial & Commodity Market Operators industry.
notation: 5510205010
valid from: 2020
is activity of: Financial & Commodity Market Operators & Service Providers

Securities & Commodity Exchanges
type: NamedIndividual
type: Activity
type: BusinessClassification
is contemporary version of: http://data.ga-group.nl/ics/trbc/5510205011
is version of: http://data.ga-group.nl/ics/trbc/5510205011
replaces: http://data.ga-group.nl/ics/trbc/2012/5510205011
imported on: 2023-04-07T16:52:39.364811Z
last refreshed on: 2026-06-05T07:16:11.699Z
source accessed on: 2017-12-31T07:04:19Z
source last accessed on: 2021-08-01T01:06:53Z
definition: Companies engaged in operating exchanges on which securities and/or commodities are traded.
notation: 5510205011
valid from: 2020
is activity of: Financial & Commodity Market Operators & Service Providers

Clearing, Settlement & Custodial Service
type: NamedIndividual
type: Activity
type: BusinessClassification
is contemporary version of: http://data.ga-group.nl/ics/trbc/5510205012
is version of: http://data.ga-group.nl/ics/trbc/5510205012
replaces: http://data.ga-group.nl/ics/trbc/2012/5510205012
imported on: 2023-04-07T16:52:39.364811Z
last refreshed on: 2026-06-05T07:16:11.699Z
source accessed on: 2017-12-31T07:04:19Z
source last accessed on: 2021-08-01T01:06:53Z
definition: Companies engaged in providing clearing and settlement services for securities and commodities traded.
notation: 5510205012
valid from: 2020
is activity of: Financial & Commodity Market Operators & Service Providers

Financial & Commodity Market Operators & Service Providers
type: NamedIndividual
type: BusinessClassification
type: Industry
is contemporary version of: http://data.ga-group.nl/ics/trbc/55102050
is version of: http://data.ga-group.nl/ics/trbc/55102050
replaces: http://data.ga-group.nl/ics/trbc/2012/55102050
imported on: 2026-06-05T07:16:11.699Z
last refreshed on: 2026-06-05T07:16:11.699Z
source accessed on: 2021-07-28T17:27:51Z
source last accessed on: 2021-07-28T17:27:51Z
definition: Operators of exchanges and markets where the trading of financial instruments, commodities and derivative instruments takes place. Includes operators of electronic markets and providers of clearing, settlement and security custodial services, as well as financial technology & infrastructure providers.
notation: 55102050
valid from: 2020
is industry of: Investment Banking & Investment Services

Investment Banking & Investment Services
type: NamedIndividual
type: BusinessClassification
type: IndustryGroup
is contemporary version of: http://data.ga-group.nl/ics/trbc/551020
is version of: http://data.ga-group.nl/ics/trbc/551020
replaces: http://data.ga-group.nl/ics/trbc/2012/551020
imported on: 2023-04-07T16:52:39.364811Z
last refreshed on: 2026-06-05T07:16:11.699Z
source accessed on: 2017-12-31T07:04:19Z
source last accessed on: 2021-08-01T01:06:53Z
definition: Providers of investment banking, brokerage and investment management services without significant commercial or retail banking operations.
notation: 551020
valid from: 2020
is industry group of: Banking & Investment Services

Banking & Investment Services
type: NamedIndividual
type: BusinessClassification
type: BusinessSector
is contemporary version of: http://data.ga-group.nl/ics/trbc/5510
is version of: http://data.ga-group.nl/ics/trbc/5510
replaces: http://data.ga-group.nl/ics/trbc/2012/5510
imported on: 2023-04-07T16:52:39.364811Z
last refreshed on: 2026-06-05T07:16:11.699Z
source accessed on: 2017-12-31T07:04:19Z
source last accessed on: 2021-08-01T01:06:53Z
definition: Providers of retail, commercial and investment banking, consumer financial services, investment services, commercial loans and diversified financial services.
notation: 5510
valid from: 2020
is business sector of: Financials

Multiline Insurance & Brokers (NEC)
type: NamedIndividual
type: Activity
type: BusinessClassification
is contemporary version of: http://data.ga-group.nl/ics/trbc/5530101010
is version of: http://data.ga-group.nl/ics/trbc/5530101010
replaces: http://data.ga-group.nl/ics/trbc/2012/5530101010
imported on: 2023-04-07T16:52:39.364811Z
last refreshed on: 2026-06-05T07:16:11.699Z
source accessed on: 2017-12-31T07:04:19Z
source last accessed on: 2021-08-01T01:06:53Z
definition: Companies involved in at least two activities under the Multiline Insurance & Brokers Industry, none being dominant: Property & Casualty Insurance, and Life and Health Insurance. Includes also entities not elsewhere classified under the Multiline Insurance & Brokers industry.
notation: 5530101010
valid from: 2020
is activity of: Multiline Insurance & Brokers

Islamic Insurance
type: NamedIndividual
type: Activity
type: BusinessClassification
is contemporary version of: http://data.ga-group.nl/ics/trbc/5530101011
is version of: http://data.ga-group.nl/ics/trbc/5530101011
replaces: http://data.ga-group.nl/ics/trbc/2012/5530101011
imported on: 2023-04-07T16:52:39.364811Z
last refreshed on: 2026-06-05T07:16:11.699Z
source accessed on: 2017-12-31T07:04:19Z
source last accessed on: 2021-08-01T01:06:53Z
definition: Companies engaged in providing an Islamic insurance concept which is grounded in Islamic muamalat (Islamic banking), observing the rules and regulations of Islamic law. Includes providers of three models: Mudharabah model (profit-sharing), Wakala model and a combination of both.
notation: 5530101011
valid from: 2020
is activity of: Multiline Insurance & Brokers

Insurance Brokers
type: NamedIndividual
type: Activity
type: BusinessClassification
is contemporary version of: http://data.ga-group.nl/ics/trbc/5530101012
is version of: http://data.ga-group.nl/ics/trbc/5530101012
replaces: http://data.ga-group.nl/ics/trbc/2012/5530101012
imported on: 2023-04-07T16:52:39.364811Z
last refreshed on: 2026-06-05T07:16:11.699Z
source accessed on: 2017-12-31T07:04:19Z
source last accessed on: 2021-08-01T01:06:53Z
definition: Companies engaged in acting as agents (i.e. brokers) in selling annuities and insurance policies.
notation: 5530101012
valid from: 2020
is activity of: Multiline Insurance & Brokers

Multiline Insurance & Brokers
type: NamedIndividual
type: BusinessClassification
type: Industry
is contemporary version of: http://data.ga-group.nl/ics/trbc/55301010
is version of: http://data.ga-group.nl/ics/trbc/55301010
replaces: http://data.ga-group.nl/ics/trbc/2012/55301010
imported on: 2023-04-07T16:52:39.364811Z
last refreshed on: 2026-06-05T07:16:11.699Z
source accessed on: 2017-12-31T07:04:19Z
source last accessed on: 2021-08-01T01:06:53Z
definition: Insurance underwriters carrying life and non-life policies.
notation: 55301010
valid from: 2020
is industry of: Insurance

Property & Casualty Insurance (NEC)
type: NamedIndividual
type: Activity
type: BusinessClassification
is contemporary version of: http://data.ga-group.nl/ics/trbc/5530102010
is version of: http://data.ga-group.nl/ics/trbc/5530102010
replaces: http://data.ga-group.nl/ics/trbc/2012/5530102010
imported on: 2023-04-07T16:52:39.364811Z
last refreshed on: 2026-06-05T07:16:11.699Z
source accessed on: 2017-12-31T07:04:19Z
source last accessed on: 2021-08-01T01:06:53Z
definition: Companies involved in at least two activities under the Property & Casualty Insurance industry, none being dominant: Property Insurance, Automobile Insurance, Travel Insurance, Casualty Insurance. Includes also entities providing property and casualty insurance not classified elsewhere under the Property & Casualty Insurance industry.
notation: 5530102010
valid from: 2020
is activity of: Property & Casualty Insurance

Property Insurance
type: NamedIndividual
type: Activity
type: BusinessClassification
is contemporary version of: http://data.ga-group.nl/ics/trbc/5530102011
is version of: http://data.ga-group.nl/ics/trbc/5530102011
replaces: http://data.ga-group.nl/ics/trbc/2012/5530102011
imported on: 2023-04-07T16:52:39.364811Z
last refreshed on: 2026-06-05T07:16:11.699Z
source accessed on: 2017-12-31T07:04:19Z
source last accessed on: 2021-08-01T01:06:53Z
definition: Companies engaged in providing protection against most risks to property, such as fire, theft and weather damage. Includes providers of insurance such as fire insurance, flood insurance, earthquake insurance, home insurance or boiler insurance. Excludes automobile insurance, classified in Insurance - Automobile, travel insurance, classified in Travel Insurance and casualty insurance, classified in Casualty Insurance.
notation: 5530102011
valid from: 2020
is activity of: Property & Casualty Insurance

Insurance - Automobile
type: NamedIndividual
type: Activity
type: BusinessClassification
is contemporary version of: http://data.ga-group.nl/ics/trbc/5530102012
is version of: http://data.ga-group.nl/ics/trbc/5530102012
replaces: http://data.ga-group.nl/ics/trbc/2012/5530102012
imported on: 2023-04-07T16:52:39.364811Z
last refreshed on: 2026-06-05T07:16:11.699Z
source accessed on: 2017-12-31T07:04:19Z
source last accessed on: 2021-08-01T01:06:53Z
definition: Companies engaged in providing insurance for cars, trucks, motorcycles, and other road vehicles.
notation: 5530102012
valid from: 2020
is activity of: Property & Casualty Insurance

Travel Insurance
type: NamedIndividual
type: Activity
type: BusinessClassification
is contemporary version of: http://data.ga-group.nl/ics/trbc/5530102013
is version of: http://data.ga-group.nl/ics/trbc/5530102013
replaces: http://data.ga-group.nl/ics/trbc/2012/5530102013
imported on: 2023-04-07T16:52:39.364811Z
last refreshed on: 2026-06-05T07:16:11.699Z
source accessed on: 2017-12-31T07:04:19Z
source last accessed on: 2021-08-01T01:06:53Z
definition: Companies engaged in providing coverage for medical expenses, financial default of travel suppliers, and other losses incurred while traveling.
notation: 5530102013
valid from: 2020
is activity of: Property & Casualty Insurance

Casualty Insurance
type: NamedIndividual
type: Activity
type: BusinessClassification
is contemporary version of: http://data.ga-group.nl/ics/trbc/5530102014
is version of: http://data.ga-group.nl/ics/trbc/5530102014
replaces: http://data.ga-group.nl/ics/trbc/2012/5530102014
imported on: 2023-04-07T16:52:39.364811Z
last refreshed on: 2026-06-05T07:16:11.699Z
source accessed on: 2017-12-31T07:04:19Z
source last accessed on: 2021-08-01T01:06:53Z
definition: Companies engaged in providing liability insurance, which is an insurance against claims from third parties, and providing coverage for negligent acts or omissions, for example injuries occurring during working hours in an enterprise. Casualty insurance protects a person or business against legal liability for losses caused by injury to other people or damage to the property of others. Excludes automobile casualty/damage insurance, classified in Insurance - Automobile, property damage insurance, classified in Property Insurance.
notation: 5530102014
valid from: 2020
is activity of: Property & Casualty Insurance

Property & Casualty Insurance
type: NamedIndividual
type: BusinessClassification
type: Industry
is contemporary version of: http://data.ga-group.nl/ics/trbc/55301020
is version of: http://data.ga-group.nl/ics/trbc/55301020
replaces: http://data.ga-group.nl/ics/trbc/2012/55301020
imported on: 2023-04-07T16:52:39.364811Z
last refreshed on: 2026-06-05T07:16:11.699Z
source accessed on: 2017-12-31T07:04:19Z
source last accessed on: 2021-08-01T01:06:53Z
definition: Insurance underwriters and carriers of property, fire, marine, auto, title, professional liability, funeral, bonding, fidelity and other surety policies.
notation: 55301020
valid from: 2020
is industry of: Insurance

Life & Health Insurance (NEC)
type: NamedIndividual
type: Activity
type: BusinessClassification
is contemporary version of: http://data.ga-group.nl/ics/trbc/5530103010
is version of: http://data.ga-group.nl/ics/trbc/5530103010
replaces: http://data.ga-group.nl/ics/trbc/2012/5530103010
imported on: 2023-04-07T16:52:39.364811Z
last refreshed on: 2026-06-05T07:16:11.699Z
source accessed on: 2017-12-31T07:04:19Z
source last accessed on: 2021-08-01T01:06:53Z
definition: Companies involved in two activities under the Life & Health Insurance industry: Life Insurance and Health Insurance, none being dominant. Includes also entities not elsewhere classified under the Life & Health Insurance industry.
notation: 5530103010
valid from: 2020
is activity of: Life & Health Insurance

Life Insurance
type: NamedIndividual
type: Activity
type: BusinessClassification
is contemporary version of: http://data.ga-group.nl/ics/trbc/5530103011
is version of: http://data.ga-group.nl/ics/trbc/5530103011
replaces: http://data.ga-group.nl/ics/trbc/2012/5530103011
imported on: 2023-04-07T16:52:39.364811Z
last refreshed on: 2026-06-05T07:16:11.699Z
source accessed on: 2017-12-31T07:04:19Z
source last accessed on: 2021-08-01T01:06:53Z
definition: Companies engaged in providing a contract between an insurance policy holder and an insurer, where the insurer promises to pay a designated beneficiary a sum of money (the benefits upon the death of the insured person.
notation: 5530103011
valid from: 2020
is activity of: Life & Health Insurance

Health Insurance
type: NamedIndividual
type: Activity
type: BusinessClassification
is contemporary version of: http://data.ga-group.nl/ics/trbc/5530103012
is version of: http://data.ga-group.nl/ics/trbc/5530103012
replaces: http://data.ga-group.nl/ics/trbc/2012/5530103012
imported on: 2023-04-07T16:52:39.364811Z
last refreshed on: 2026-06-05T07:16:11.699Z
source accessed on: 2017-12-31T07:04:19Z
source last accessed on: 2021-08-01T01:06:53Z
definition: Companies engaged in providing insurance against the risk of incurring medical expenses among individuals.
notation: 5530103012
valid from: 2020
is activity of: Life & Health Insurance

Life & Health Insurance
type: NamedIndividual
type: BusinessClassification
type: Industry
is contemporary version of: http://data.ga-group.nl/ics/trbc/55301030
is version of: http://data.ga-group.nl/ics/trbc/55301030
replaces: http://data.ga-group.nl/ics/trbc/2012/55301030
imported on: 2023-04-07T16:52:39.364811Z
last refreshed on: 2026-06-05T07:16:11.699Z
source accessed on: 2017-12-31T07:04:19Z
source last accessed on: 2021-08-01T01:06:53Z
definition: Insurance underwriters and carriers of accidental death and dismemberment, disability, dental, health, medical and life policies, as well as the management of annuity plans.
notation: 55301030
valid from: 2020
is industry of: Insurance

Reinsurance (NEC)
type: NamedIndividual
type: Activity
type: BusinessClassification
is contemporary version of: http://data.ga-group.nl/ics/trbc/5530105010
is version of: http://data.ga-group.nl/ics/trbc/5530105010
replaces: http://data.ga-group.nl/ics/trbc/2012/5530105010
imported on: 2023-04-07T16:52:39.364811Z
last refreshed on: 2026-06-05T07:16:11.699Z
source accessed on: 2017-12-31T07:04:19Z
source last accessed on: 2021-08-01T01:06:53Z
definition: Companies engaged in least two activities under the Reinsurance Industry, none being dominant: Life & Health Reinsurance and Property & Casualty Reinsurance. Includes also entities not elsewhere classified under the Reinsurance industry.
notation: 5530105010
valid from: 2020
is activity of: Reinsurance

Life & Health Reinsurance
type: NamedIndividual
type: Activity
type: BusinessClassification
is contemporary version of: http://data.ga-group.nl/ics/trbc/5530105011
is version of: http://data.ga-group.nl/ics/trbc/5530105011
replaces: http://data.ga-group.nl/ics/trbc/2012/5530105011
imported on: 2023-04-07T16:52:39.364811Z
last refreshed on: 2026-06-05T07:16:11.699Z
source accessed on: 2017-12-31T07:04:19Z
source last accessed on: 2021-08-01T01:06:53Z
definition: Companies engaged in providing reinsurance to life and health insurance Companies.
notation: 5530105011
valid from: 2020
is activity of: Reinsurance

Property & Casualty Reinsurance
type: NamedIndividual
type: Activity
type: BusinessClassification
is contemporary version of: http://data.ga-group.nl/ics/trbc/5530105012
is version of: http://data.ga-group.nl/ics/trbc/5530105012
replaces: http://data.ga-group.nl/ics/trbc/2012/5530105012
imported on: 2023-04-07T16:52:39.364811Z
last refreshed on: 2026-06-05T07:16:11.699Z
source accessed on: 2017-12-31T07:04:19Z
source last accessed on: 2021-08-01T01:06:53Z
definition: Companies engaged in providing reinsurance to property and casualty insurance Companies.
notation: 5530105012
valid from: 2020
is activity of: Reinsurance

Reinsurance
type: NamedIndividual
type: BusinessClassification
type: Industry
is contemporary version of: http://data.ga-group.nl/ics/trbc/55301050
is version of: http://data.ga-group.nl/ics/trbc/55301050
replaces: http://data.ga-group.nl/ics/trbc/2012/55301050
imported on: 2023-04-07T16:52:39.364811Z
last refreshed on: 2026-06-05T07:16:11.699Z
source accessed on: 2017-12-31T07:04:19Z
source last accessed on: 2021-08-01T01:06:53Z
definition: Property and casualty, and life and health reinsurance carriers.
notation: 55301050
valid from: 2020
is industry of: Insurance

Insurance
type: NamedIndividual
type: BusinessClassification
type: IndustryGroup
is contemporary version of: http://data.ga-group.nl/ics/trbc/553010
is version of: http://data.ga-group.nl/ics/trbc/553010
replaces: http://data.ga-group.nl/ics/trbc/2012/553010
imported on: 2023-04-07T16:52:39.364811Z
last refreshed on: 2026-06-05T07:16:11.699Z
source accessed on: 2017-12-31T07:04:19Z
source last accessed on: 2021-08-01T01:06:53Z
definition: Underwriters and carriers of property, casualty, life and health insurance policies, as well as reinsurance carriers.
notation: 553010
valid from: 2020
is industry group of: Insurance

Insurance
type: NamedIndividual
type: BusinessClassification
type: BusinessSector
is contemporary version of: http://data.ga-group.nl/ics/trbc/5530
is version of: http://data.ga-group.nl/ics/trbc/5530
replaces: http://data.ga-group.nl/ics/trbc/2012/5530
imported on: 2023-04-07T16:52:39.364811Z
last refreshed on: 2026-06-05T07:16:11.699Z
source accessed on: 2017-12-31T07:04:19Z
source last accessed on: 2021-08-01T01:06:53Z
definition: Underwriters and carriers of property, casualty, life and health insurance policies, as well as reinsurance carriers.
notation: 5530
valid from: 2020
is business sector of: Financials

UK Investment Trusts
type: NamedIndividual
type: Activity
type: BusinessClassification
is contemporary version of: http://data.ga-group.nl/ics/trbc/5550101010
is version of: http://data.ga-group.nl/ics/trbc/5550101010
replaces: http://data.ga-group.nl/ics/trbc/2012/5550101010
imported on: 2023-04-07T16:52:39.364811Z
last refreshed on: 2026-06-05T07:16:11.699Z
source accessed on: 2017-12-31T07:04:19Z
source last accessed on: 2021-08-01T01:06:53Z
definition: Investment vehicles that pool money from multiple investors and are managed by a professional investment advisor who invests in stocks, bonds, money market instruments, or other investable assets according to the investment objective. The fund issues a fixed number of shares and shares are traded on an exchange at market price, which can significantly differ from the net asset value. Excludes REITs, classified under Residential & Commercial REITs, and closed-end funds that are not domiciled in the UK or Commonwealth, classified in Closed End Funds.
notation: 5550101010
valid from: 2020
is activity of: UK Investment Trusts

UK Investment Trusts
type: NamedIndividual
type: BusinessClassification
type: Industry
is contemporary version of: http://data.ga-group.nl/ics/trbc/55501010
is version of: http://data.ga-group.nl/ics/trbc/55501010
replaces: http://data.ga-group.nl/ics/trbc/2012/55501010
imported on: 2023-04-07T16:52:39.364811Z
last refreshed on: 2026-06-05T07:16:11.699Z
source accessed on: 2017-12-31T07:04:19Z
source last accessed on: 2021-08-01T01:06:53Z
definition: Investment vehicles that pool money from multiple investors and are managed by a professional investment advisor who invests in stocks, bonds, money market instruments, or other investable assets according to the investment objective. The fund issues a fixed number of shares and shares are traded on an exchange at market price, which can significantly differ from the net asset value. Excludes REITs, classified under Residential & Commercial REITs, and closed-end funds that are not domiciled in the UK or Commonwealth, classified in Closed End Funds.
notation: 55501010
valid from: 2020
is industry of: Collective Investments

Mutual Funds (NEC)
type: NamedIndividual
type: Activity
type: BusinessClassification
is contemporary version of: http://data.ga-group.nl/ics/trbc/5550102010
is version of: http://data.ga-group.nl/ics/trbc/5550102010
replaces: http://data.ga-group.nl/ics/trbc/2012/5550102010
imported on: 2023-04-07T16:52:39.364811Z
last refreshed on: 2026-06-05T07:16:11.699Z
source accessed on: 2017-12-31T07:04:19Z
source last accessed on: 2021-08-01T01:06:53Z
definition: Companies engaged in providing a type of collective investment scheme that pools money from many investors to buy stocks, bonds, short-term money market instruments, and/or other securities.
notation: 5550102010
valid from: 2020
is activity of: Mutual Funds

Islamic Mutual Funds
type: NamedIndividual
type: Activity
type: BusinessClassification
is contemporary version of: http://data.ga-group.nl/ics/trbc/5550102011
is version of: http://data.ga-group.nl/ics/trbc/5550102011
replaces: http://data.ga-group.nl/ics/trbc/2012/5550102011
imported on: 2023-04-07T16:52:39.364811Z
last refreshed on: 2026-06-05T07:16:11.699Z
source accessed on: 2017-12-31T07:04:19Z
source last accessed on: 2021-08-01T01:06:53Z
definition: Investment vehicles adhering to the criteria developed by the Sharia Supervisory Board. These companies do not invest in interest-paying instruments (riba) frequently used by mutual funds as temporary investments, and instead may hold cash on a temporary basis.
notation: 5550102011
valid from: 2020
is activity of: Mutual Funds

Mutual Funds
type: NamedIndividual
type: BusinessClassification
type: Industry
is contemporary version of: http://data.ga-group.nl/ics/trbc/55501020
is version of: http://data.ga-group.nl/ics/trbc/55501020
replaces: http://data.ga-group.nl/ics/trbc/2012/55501020
imported on: 2023-04-07T16:52:39.364811Z
last refreshed on: 2026-06-05T07:16:11.699Z
source accessed on: 2017-12-31T07:04:19Z
source last accessed on: 2021-08-01T01:06:53Z
definition: Investment vehicles that pool money from multiple investors and are managed by professional investment advisors who invest in stocks, bonds, money market instruments or other assets according to the investment objective. Shares are issued and redeemed at the net asset value (NAV), which is determined by the fund management company.
notation: 55501020
valid from: 2020
is industry of: Collective Investments

Closed End Funds
type: NamedIndividual
type: Activity
type: BusinessClassification
is contemporary version of: http://data.ga-group.nl/ics/trbc/5550103010
is version of: http://data.ga-group.nl/ics/trbc/5550103010
replaces: http://data.ga-group.nl/ics/trbc/2012/5550103010
imported on: 2023-04-07T16:52:39.364811Z
last refreshed on: 2026-06-05T07:16:11.699Z
source accessed on: 2017-12-31T07:04:19Z
source last accessed on: 2021-08-01T01:06:53Z
definition: Investment vehicles that pool money from multiple investors and are managed by professional investment advisors who invest in stocks, bonds, money market instruments or other investable assets according to the investment objective. The fund issues a fixed number of shares and shares are traded on an exchange at market price, which can significantly differ from the net asset value. Excludes closed-end funds that are domiciled in the UK or Commonwealth, classified in UK Investment Trusts.
notation: 5550103010
valid from: 2020
is activity of: Closed End Funds

Closed End Funds
type: NamedIndividual
type: BusinessClassification
type: Industry
is contemporary version of: http://data.ga-group.nl/ics/trbc/55501030
is version of: http://data.ga-group.nl/ics/trbc/55501030
replaces: http://data.ga-group.nl/ics/trbc/2012/55501030
imported on: 2023-04-07T16:52:39.364811Z
last refreshed on: 2026-06-05T07:16:11.699Z
source accessed on: 2017-12-31T07:04:19Z
source last accessed on: 2021-08-01T01:06:53Z
definition: Investment vehicles that pool money from multiple investors and are managed by professional investment advisors who invest in stocks, bonds, money market instruments or other investable assets according to the investment objective. The fund issues a fixed number of shares and shares are traded on an exchange at market price, which can significantly differ from the net asset value. Excludes closed-end funds that are domiciled in the UK or Commonwealth, classified in UK Investment Trusts.
notation: 55501030
valid from: 2020
is industry of: Collective Investments

Exchange-Traded Funds (NEC)
type: NamedIndividual
type: Activity
type: BusinessClassification
is contemporary version of: http://data.ga-group.nl/ics/trbc/5550104010
is version of: http://data.ga-group.nl/ics/trbc/5550104010
replaces: http://data.ga-group.nl/ics/trbc/2012/5550104010
imported on: 2023-04-07T16:52:39.364811Z
last refreshed on: 2026-06-05T07:16:11.699Z
source accessed on: 2017-12-31T07:04:19Z
source last accessed on: 2021-08-01T01:06:53Z
definition: Investment funds that are traded on stock exchanges. ETFs hold assets such as stocks, commodities, or bonds, often tracking a market index, commodity price or basket of assets like an index fund.
notation: 5550104010
valid from: 2020
is activity of: Exchange-Traded Funds

Islamic ETFs
type: NamedIndividual
type: Activity
type: BusinessClassification
is contemporary version of: http://data.ga-group.nl/ics/trbc/5550104011
is version of: http://data.ga-group.nl/ics/trbc/5550104011
replaces: http://data.ga-group.nl/ics/trbc/2012/5550104011
imported on: 2023-04-07T16:52:39.364811Z
last refreshed on: 2026-06-05T07:16:11.699Z
source accessed on: 2017-12-31T07:04:19Z
source last accessed on: 2021-08-01T01:06:53Z
definition: Investment funds that invest in securities that do not contradict Sharia Law, meaning that none of the securities in the fund will be involved with products or services related to alcohol, pork, gambling, weapons, lending, or anything that does not follow Islamic Law. Includes ETFs invested in healthcare, energy, technology, and oil.
notation: 5550104011
valid from: 2020
is activity of: Exchange-Traded Funds

Islamic Commodity ETFs
type: NamedIndividual
type: Activity
type: BusinessClassification
is contemporary version of: http://data.ga-group.nl/ics/trbc/5550104012
is version of: http://data.ga-group.nl/ics/trbc/5550104012
replaces: http://data.ga-group.nl/ics/trbc/2012/5550104012
imported on: 2023-04-07T16:52:39.364811Z
last refreshed on: 2026-06-05T07:16:11.699Z
source accessed on: 2017-12-31T07:04:19Z
source last accessed on: 2021-08-01T01:06:53Z
definition: Investment funds that invest in commodities that do not contradict Sharia Law. Includes ETFs made up of futures or asset-backed contracts. These contracts represent the commodity and will track the performance of that particular product.
notation: 5550104012
valid from: 2020
is activity of: Exchange-Traded Funds

Exchange-Traded Funds
type: NamedIndividual
type: BusinessClassification
type: Industry
is contemporary version of: http://data.ga-group.nl/ics/trbc/55501040
is version of: http://data.ga-group.nl/ics/trbc/55501040
replaces: http://data.ga-group.nl/ics/trbc/2012/55501040
imported on: 2023-04-07T16:52:39.364811Z
last refreshed on: 2026-06-05T07:16:11.699Z
source accessed on: 2017-12-31T07:04:19Z
source last accessed on: 2021-08-01T01:06:53Z
definition: Investment vehicles that pool money from multiple investors and are managed by professional investment advisors who invest in stocks, bonds, money market instruments, or other assets according to its investment objective. ETFs often track a market index, commodity price or basket of assets like an index fund. Includes Exchange-Traded Commodities and other Exchange-Traded Products.
notation: 55501040
valid from: 2020
is industry of: Collective Investments

Pension Funds
type: NamedIndividual
type: Activity
type: BusinessClassification
is contemporary version of: http://data.ga-group.nl/ics/trbc/5550105010
is version of: http://data.ga-group.nl/ics/trbc/5550105010
replaces: http://data.ga-group.nl/ics/trbc/2012/5550105010
imported on: 2023-04-07T16:52:39.364811Z
last refreshed on: 2026-06-05T07:16:11.699Z
source accessed on: 2017-12-31T07:04:19Z
source last accessed on: 2021-08-01T01:06:53Z
definition: Employees' retirement funds, contributed by the employer and employees, aimed at generating stable growth over the long term.
notation: 5550105010
valid from: 2020
is activity of: Pension Funds

Pension Funds
type: NamedIndividual
type: BusinessClassification
type: Industry
is contemporary version of: http://data.ga-group.nl/ics/trbc/55501050
is version of: http://data.ga-group.nl/ics/trbc/55501050
replaces: http://data.ga-group.nl/ics/trbc/2012/55501050
imported on: 2023-04-07T16:52:39.364811Z
last refreshed on: 2026-06-05T07:16:11.699Z
source accessed on: 2017-12-31T07:04:19Z
source last accessed on: 2021-08-01T01:06:53Z
definition: Employees' retirement funds, contributed by the employer and employees, aimed at generating stable growth over the long term.
notation: 55501050
valid from: 2020
is industry of: Collective Investments

Insurance Funds
type: NamedIndividual
type: Activity
type: BusinessClassification
is contemporary version of: http://data.ga-group.nl/ics/trbc/5550106010
is version of: http://data.ga-group.nl/ics/trbc/5550106010
replaces: http://data.ga-group.nl/ics/trbc/2012/5550106010
imported on: 2023-04-07T16:52:39.364811Z
last refreshed on: 2026-06-05T07:16:11.699Z
source accessed on: 2017-12-31T07:04:19Z
source last accessed on: 2021-08-01T01:06:53Z
definition: Investment vehicles that pool money from multiple investors and are managed by a professional investment advisor who invests in stocks, bonds, money market instruments, or other investable assets according to the investment objective, offered through life insurance companies and typically linked to an insurance contract.
notation: 5550106010
valid from: 2020
is activity of: Insurance Funds

Insurance Funds
type: NamedIndividual
type: BusinessClassification
type: Industry
is contemporary version of: http://data.ga-group.nl/ics/trbc/55501060
is version of: http://data.ga-group.nl/ics/trbc/55501060
replaces: http://data.ga-group.nl/ics/trbc/2012/55501060
imported on: 2023-04-07T16:52:39.364811Z
last refreshed on: 2026-06-05T07:16:11.699Z
source accessed on: 2017-12-31T07:04:19Z
source last accessed on: 2021-08-01T01:06:53Z
definition: Investment vehicles that pool money from multiple investors and are managed by professional investment advisors who invest in stocks, bonds, money market instruments, or other investable assets according to its investment objective, offered through life insurance Companies and typically linked to an insurance contract.
notation: 55501060
valid from: 2020
is industry of: Collective Investments

Collective Investments
type: NamedIndividual
type: BusinessClassification
type: IndustryGroup
is contemporary version of: http://data.ga-group.nl/ics/trbc/555010
is version of: http://data.ga-group.nl/ics/trbc/555010
replaces: http://data.ga-group.nl/ics/trbc/2012/555010
imported on: 2023-04-07T16:52:39.364811Z
last refreshed on: 2026-06-05T07:16:11.699Z
source accessed on: 2017-12-31T07:04:19Z
source last accessed on: 2021-08-01T01:06:53Z
definition: Listed closed-end investment funds, as well as other funds where participation can be bought and sold as units or shares such as open-ended or mutual funds, exchange-traded funds, exchange traded products, unit trusts and unit investment trusts.
notation: 555010
valid from: 2020
is industry group of: Collective Investments

Collective Investments
type: NamedIndividual
type: BusinessClassification
type: BusinessSector
is contemporary version of: http://data.ga-group.nl/ics/trbc/5550
is version of: http://data.ga-group.nl/ics/trbc/5550
replaces: http://data.ga-group.nl/ics/trbc/2012/5550
imported on: 2023-04-07T16:52:39.364811Z
last refreshed on: 2026-06-05T07:16:11.699Z
source accessed on: 2017-12-31T07:04:19Z
source last accessed on: 2021-08-01T01:06:53Z
definition: Listed closed-end investment funds, as well as other funds where participation can be bought and sold as units or shares, such as open-ended or mutual funds, exchange-traded funds, exchange traded products, unit trusts and unit investment trusts.
notation: 5550
valid from: 2020
is business sector of: Financials

Investment Holding Companies (NEC)
type: NamedIndividual
type: Activity
type: BusinessClassification
is contemporary version of: http://data.ga-group.nl/ics/trbc/5560101010
is version of: http://data.ga-group.nl/ics/trbc/5560101010
replaces: http://data.ga-group.nl/ics/trbc/2012/5560101010
imported on: 2023-04-07T16:52:39.364811Z
last refreshed on: 2026-06-05T07:16:11.699Z
source accessed on: 2017-12-31T07:04:19Z
source last accessed on: 2021-08-01T01:06:53Z
definition: Companies primarily engaged in investing in securities/stakes of other companies and for their own profits. Investment Holding Companies might have both minority and majority stakes. Excludes companies investing in private equity firms, classified in Private Equity; companies investing in venture capital firms, classified in Venture Capital; companies operating through subsidiaries/majority-held entities in various economic segments, classified according to the dominant segment of activity or, in case of a significant size and lack of dominant segment, in Industrial Conglomerates; UK-type investment trusts, classified in UK Investment Trusts.
notation: 5560101010
valid from: 2020
is activity of: Investment Holding Companies

Shell Companies
type: NamedIndividual
type: Activity
type: BusinessClassification
is contemporary version of: http://data.ga-group.nl/ics/trbc/5560101011
is version of: http://data.ga-group.nl/ics/trbc/5560101011
replaces: http://data.ga-group.nl/ics/trbc/2012/5560101011
imported on: 2023-04-07T16:52:39.364811Z
last refreshed on: 2026-06-05T07:16:11.699Z
source accessed on: 2017-12-31T07:04:19Z
source last accessed on: 2021-08-01T01:06:53Z
definition: Companies that exist but do not actually do any business or have any assets. They are also known as blank check companies. Excludes: companies that have suspended/ceased their operations, classified per their last/previous activity.
notation: 5560101011
valid from: 2020
is activity of: Investment Holding Companies

Investment Holding Companies
type: NamedIndividual
type: BusinessClassification
type: Industry
is contemporary version of: http://data.ga-group.nl/ics/trbc/55601010
is version of: http://data.ga-group.nl/ics/trbc/55601010
replaces: http://data.ga-group.nl/ics/trbc/2012/55601010
imported on: 2023-04-07T16:52:39.364811Z
last refreshed on: 2026-06-05T07:16:11.699Z
source accessed on: 2017-12-31T07:04:19Z
source last accessed on: 2021-08-01T01:06:53Z
definition: Companies primarily engaged in investing in securities/stakes of other companies and for their own profits. Investment Holding Companies might have both minority and majority stakes. Excludes companies investing in private equity firms, classified in Private Equity; companies investing in venture capital firms, classified in Venture Capital; companies operating through subsidiaries/majority-held entities in various economic segments, classified according to the dominant segment of activity or, in case of a significant size and lack of dominant segment, in Industrial Conglomerates; UK-type investment trusts, classified in UK Investment Trusts.
notation: 55601010
valid from: 2020
is industry of: Investment Holding Companies

Investment Holding Companies
type: NamedIndividual
type: BusinessClassification
type: IndustryGroup
is contemporary version of: http://data.ga-group.nl/ics/trbc/556010
is version of: http://data.ga-group.nl/ics/trbc/556010
replaces: http://data.ga-group.nl/ics/trbc/2012/556010
imported on: 2023-04-07T16:52:39.364811Z
last refreshed on: 2026-06-05T07:16:11.699Z
source accessed on: 2017-12-31T07:04:19Z
source last accessed on: 2021-08-01T01:06:53Z
definition: Companies primarily engaged in investing in securities/stakes of other companies and for their own profits. Investment Holding Companies might have both minority and majority stakes. Excludes companies investing in private equity firms, classified in Private Equity; companies investing in venture capital firms, classified in Venture Capital; companies operating through subsidiaries/majority-held entities in various economic segments, classified according to the dominant segment of activity or, in case of a significant size and lack of dominant segment, in Industrial Conglomerates; UK-type investment trusts, classified in UK Investment Trusts.
notation: 556010
valid from: 2020
is industry group of: Investment Holding Companies

Investment Holding Companies
type: NamedIndividual
type: BusinessClassification
type: BusinessSector
is contemporary version of: http://data.ga-group.nl/ics/trbc/5560
is version of: http://data.ga-group.nl/ics/trbc/5560
replaces: http://data.ga-group.nl/ics/trbc/2012/5560
imported on: 2023-04-07T16:52:39.364811Z
last refreshed on: 2026-06-05T07:16:11.699Z
source accessed on: 2017-12-31T07:04:19Z
source last accessed on: 2021-08-01T01:06:53Z
definition: Organizations engaged in investing in securities/stakes of other companies and for their own profits. Investment Holding Companies might have both minority and majority stakes. Excludes companies investing in private equity firms, classified in Private Equity; companies investing in venture capital firms, classified in Venture Capital; companies operating through subsidiaries/majority-held entities in various economic segments, classified according to the dominant segment of activity or, in case of a significant size and lack of dominant segment, in Industrial Conglomerates; UK-type investment trusts, classified in UK Investment Trusts.
notation: 5560
valid from: 2020
is business sector of: Financials

Financials
type: NamedIndividual
type: BusinessClassification
type: EconomicSector
is contemporary version of: http://data.ga-group.nl/ics/trbc/55
is version of: http://data.ga-group.nl/ics/trbc/55
replaces: http://data.ga-group.nl/ics/trbc/2012/55
imported on: 2023-04-07T16:52:39.364811Z
last refreshed on: 2026-06-05T07:16:11.699Z
source accessed on: 2017-12-31T07:04:19Z
source last accessed on: 2021-08-01T01:06:53Z
definition: Operators of retail, commercial and investment banks, investment trusts and financial markets, as well as providers of investment and insurance services.
notation: 55
valid from: 2020

Advanced Medical Equipment & Technology (NEC)
type: NamedIndividual
type: Activity
type: BusinessClassification
is contemporary version of: http://data.ga-group.nl/ics/trbc/5610101010
is version of: http://data.ga-group.nl/ics/trbc/5610101010
replaces: http://data.ga-group.nl/ics/trbc/2012/5610101010
imported on: 2023-04-07T16:52:39.364811Z
last refreshed on: 2026-06-05T07:16:11.699Z
source accessed on: 2017-12-31T07:04:19Z
source last accessed on: 2021-08-01T01:06:53Z
definition: Companies involved in at least two activities under the Advanced Medical Equipment industry, none being dominant: Medical Diagnostic & Testing Equipment, Medical Monitoring Systems, Laser Equipment, Medical Imaging Systems, Medical Software & Technology Services. Includes also entities not classified elsewhere under the Advanced Medical Equipment & Technology industry.
notation: 5610101010
valid from: 2020
is activity of: Advanced Medical Equipment & Technology

Medical Diagnostic & Testing Equipment
type: NamedIndividual
type: Activity
type: BusinessClassification
is contemporary version of: http://data.ga-group.nl/ics/trbc/5610101011
is version of: http://data.ga-group.nl/ics/trbc/5610101011
replaces: http://data.ga-group.nl/ics/trbc/2012/5610101011
imported on: 2023-04-07T16:52:39.364811Z
last refreshed on: 2026-06-05T07:16:11.699Z
source accessed on: 2017-12-31T07:04:19Z
source last accessed on: 2021-08-01T01:06:53Z
definition: Companies engaged in providing non-imaging medical diagnostic equipment, such as ECG (electrocardiography) equipment, EEG (electroencephalography) equipment, advanced laboratory equipment, and pathology specimen locators. Excludes medical imaging systems, such as MRI, PET, CT, ultrasound, classified in Medical Imaging Systems; and laser-based diagnostic devices, classified in Laser Equipment.
notation: 5610101011
valid from: 2020
is activity of: Advanced Medical Equipment & Technology

Medical Monitoring Systems
type: NamedIndividual
type: Activity
type: BusinessClassification
is contemporary version of: http://data.ga-group.nl/ics/trbc/5610101012
is version of: http://data.ga-group.nl/ics/trbc/5610101012
replaces: http://data.ga-group.nl/ics/trbc/2012/5610101012
imported on: 2023-04-07T16:52:39.364811Z
last refreshed on: 2026-06-05T07:16:11.699Z
source accessed on: 2017-12-31T07:04:19Z
source last accessed on: 2021-08-01T01:06:53Z
definition: Companies engaged in providing electronic medical devices used in constant medical monitoring, such as bedside vital function monitors in hospitals, respiratory monitoring equipment, among others. Excludes medical diagnostic devices (used for immediate and one-stop diagnosis), classified in Medical Diagnostic & Testing Equipment, laser equipment, classified in Laser Equipment, and medical imaging systems, classified in Medical Imaging Systems.
notation: 5610101012
valid from: 2020
is activity of: Advanced Medical Equipment & Technology

Laser Equipment
type: NamedIndividual
type: Activity
type: BusinessClassification
is contemporary version of: http://data.ga-group.nl/ics/trbc/5610101013
is version of: http://data.ga-group.nl/ics/trbc/5610101013
replaces: http://data.ga-group.nl/ics/trbc/2012/5610101013
imported on: 2023-04-07T16:52:39.364811Z
last refreshed on: 2026-06-05T07:16:11.699Z
source accessed on: 2017-12-31T07:04:19Z
source last accessed on: 2021-08-01T01:06:53Z
definition: Companies engaged in manufacturing laser-based medical equipment, such as cyber knife used to remove tumors; ultraviolet laser for eye surgery. Lasers for treatment of vascular lesions, pigmented lesions , among others.
notation: 5610101013
valid from: 2020
is activity of: Advanced Medical Equipment & Technology

Medical Imaging Systems
type: NamedIndividual
type: Activity
type: BusinessClassification
is contemporary version of: http://data.ga-group.nl/ics/trbc/5610101014
is version of: http://data.ga-group.nl/ics/trbc/5610101014
replaces: http://data.ga-group.nl/ics/trbc/2012/5610101014
imported on: 2023-04-07T16:52:39.364811Z
last refreshed on: 2026-06-05T07:16:11.699Z
source accessed on: 2017-12-31T07:04:19Z
source last accessed on: 2021-08-01T01:06:53Z
definition: Companies engaged in providing body imaging equipment , such as MRI (magnetic resonance imaging), CT (computer tomography), PET (Positron emission tomography), ultrasound devices.
notation: 5610101014
valid from: 2020
is activity of: Advanced Medical Equipment & Technology

Medical Software & Technology Services
type: NamedIndividual
type: Activity
type: BusinessClassification
is contemporary version of: http://data.ga-group.nl/ics/trbc/5610101015
is version of: http://data.ga-group.nl/ics/trbc/5610101015
replaces: http://data.ga-group.nl/ics/trbc/2012/5610101015
imported on: 2023-04-07T16:52:39.364811Z
last refreshed on: 2026-06-05T07:16:11.699Z
source accessed on: 2017-12-31T07:04:19Z
source last accessed on: 2021-08-01T01:06:53Z
definition: Companies providing software that is permanent and core element of advanced medical equipment. Includes software for MRI, PET or CT equipment.
notation: 5610101015
valid from: 2020
is activity of: Advanced Medical Equipment & Technology

Advanced Medical Equipment Wholesale
type: NamedIndividual
type: Activity
type: BusinessClassification
is contemporary version of: http://data.ga-group.nl/ics/trbc/5610101016
is version of: http://data.ga-group.nl/ics/trbc/5610101016
replaces: http://data.ga-group.nl/ics/trbc/2012/5610101016
imported on: 2023-04-07T16:52:39.364811Z
last refreshed on: 2026-06-05T07:16:11.699Z
source accessed on: 2017-12-31T07:04:19Z
source last accessed on: 2021-08-01T01:06:53Z
definition: Companies engaged in wholesaling advanced medical professional equipment, instruments, and supplies.
notation: 5610101016
valid from: 2020
is activity of: Advanced Medical Equipment & Technology

Advanced Medical Equipment & Technology
type: NamedIndividual
type: BusinessClassification
type: Industry
is contemporary version of: http://data.ga-group.nl/ics/trbc/56101010
is version of: http://data.ga-group.nl/ics/trbc/56101010
replaces: http://data.ga-group.nl/ics/trbc/2012/56101010
imported on: 2023-04-07T16:52:39.364811Z
last refreshed on: 2026-06-05T07:16:11.699Z
source accessed on: 2017-12-31T07:04:19Z
source last accessed on: 2021-08-01T01:06:53Z
definition: Manufacturers of high-tech medical equipment. Includes producers of MRI, PET and CAT scanning diagnostic equipment, radiation therapy, x-ray, ultrasonic, electro medical, laser equipment, medical monitoring systems and providers of medical software & technology services.
notation: 56101010
valid from: 2020
is industry of: Healthcare Equipment & Supplies

Medical Equipment, Supplies & Distribution (NEC)
type: NamedIndividual
type: Activity
type: BusinessClassification
is contemporary version of: http://data.ga-group.nl/ics/trbc/5610102010
is version of: http://data.ga-group.nl/ics/trbc/5610102010
replaces: http://data.ga-group.nl/ics/trbc/2012/5610102010
imported on: 2023-04-07T16:52:39.364811Z
last refreshed on: 2026-06-05T07:16:11.699Z
source accessed on: 2017-12-31T07:04:19Z
source last accessed on: 2021-08-01T01:06:53Z
definition: Companies involved in at least two activities under the Medical Equipment, Supplies & Distribution industry, none being dominant: Medical Supplies, Medical Prosthetics, Medical Equipment, Medical Devices & Implants, Laboratory Diagnostic & Testing Substances, Veterinary Medical Equipment & Supplies, Drug Delivery Systems. Includes also entities not classified elsewhere under the Medical Equipment, Supplies & Distribution industry.
notation: 5610102010
valid from: 2020
is activity of: Medical Equipment, Supplies & Distribution

Medical Supplies
type: NamedIndividual
type: Activity
type: BusinessClassification
is contemporary version of: http://data.ga-group.nl/ics/trbc/5610102011
is version of: http://data.ga-group.nl/ics/trbc/5610102011
replaces: http://data.ga-group.nl/ics/trbc/2012/5610102011
imported on: 2023-04-07T16:52:39.364811Z
last refreshed on: 2026-06-05T07:16:11.699Z
source accessed on: 2017-12-31T07:04:19Z
source last accessed on: 2021-08-01T01:06:53Z
definition: Companies engaged in providing medical supplies, such as medical gloves, medical masks, forceps, surgical knives and devices, bandages and dressings, syringes, stethoscopes, x-ray films, dental drills, veterinarian instruments and other related supplies.
notation: 5610102011
valid from: 2020
is activity of: Medical Equipment, Supplies & Distribution

Medical Prosthetics
type: NamedIndividual
type: Activity
type: BusinessClassification
is contemporary version of: http://data.ga-group.nl/ics/trbc/5610102012
is version of: http://data.ga-group.nl/ics/trbc/5610102012
replaces: http://data.ga-group.nl/ics/trbc/2012/5610102012
imported on: 2023-04-07T16:52:39.364811Z
last refreshed on: 2026-06-05T07:16:11.699Z
source accessed on: 2017-12-31T07:04:19Z
source last accessed on: 2021-08-01T01:06:53Z
definition: Companies engaged in production and application of devices that replace external body parts, such as hearing aids, artificial eyes, orthotics, prosthetic limbs and dentures, among others. Excludes implants and other medical devices manufactured to replace a missing internal biological structure, such as heart valves, artificial pacemakers or cochlear implants, classified in Medical Devices & Implants.
notation: 5610102012
valid from: 2020
is activity of: Medical Equipment, Supplies & Distribution

Medical Equipment
type: NamedIndividual
type: Activity
type: BusinessClassification
is contemporary version of: http://data.ga-group.nl/ics/trbc/5610102013
is version of: http://data.ga-group.nl/ics/trbc/5610102013
replaces: http://data.ga-group.nl/ics/trbc/2012/5610102013
imported on: 2023-04-07T16:52:39.364811Z
last refreshed on: 2026-06-05T07:16:11.699Z
source accessed on: 2017-12-31T07:04:19Z
source last accessed on: 2021-08-01T01:06:53Z
definition: Companies engaged in providing electrical and electronic medical equipment, such as kidney dialysis equipment, glucometers, physiotherapy equipment, laboratory electrical/electronic devices. Excludes diagnostic equipment, such as ECG and EEG equipment, classified in Medical Diagnostic & Testing Equipment; medical imaging systems, such as MRI, PET, CT, ultrasound, classified in Medical Imaging Systems, and laser equipment, classified in Laser Equipment.
notation: 5610102013
valid from: 2020
is activity of: Medical Equipment, Supplies & Distribution

Medical Devices & Implants
type: NamedIndividual
type: Activity
type: BusinessClassification
is contemporary version of: http://data.ga-group.nl/ics/trbc/5610102014
is version of: http://data.ga-group.nl/ics/trbc/5610102014
replaces: http://data.ga-group.nl/ics/trbc/2012/5610102014
imported on: 2023-04-07T16:52:39.364811Z
last refreshed on: 2026-06-05T07:16:11.699Z
source accessed on: 2017-12-31T07:04:19Z
source last accessed on: 2021-08-01T01:06:53Z
definition: Companies engaged in providing medical devices manufactured to replace a missing internal biological structure, support a damaged biological structure, or enhance an existing biological structure. Includes manufacturers of devices used inside of the body, including orthopedic implants, heart valves, artificial pacemakers or cochlear implants. Excludes medical prosthetics and devices that replace external body parts, such as hearing aids, artificial eyes, orthotics, prosthetic limbs and dentures, classified in Medical Prosthetics.
notation: 5610102014
valid from: 2020
is activity of: Medical Equipment, Supplies & Distribution

Medical Equipment Wholesale
type: NamedIndividual
type: Activity
type: BusinessClassification
is contemporary version of: http://data.ga-group.nl/ics/trbc/5610102015
is version of: http://data.ga-group.nl/ics/trbc/5610102015
replaces: http://data.ga-group.nl/ics/trbc/2012/5610102015
imported on: 2023-04-07T16:52:39.364811Z
last refreshed on: 2026-06-05T07:16:11.699Z
source accessed on: 2017-12-31T07:04:19Z
source last accessed on: 2021-08-01T01:06:53Z
definition: Companies engaged in wholesaling medical professional equipment, instruments, and supplies.
notation: 5610102015
valid from: 2020
is activity of: Medical Equipment, Supplies & Distribution

Glasses, Spectacles & Contact Lenses
type: NamedIndividual
type: Activity
type: BusinessClassification
is contemporary version of: http://data.ga-group.nl/ics/trbc/5610102016
is version of: http://data.ga-group.nl/ics/trbc/5610102016
replaces: http://data.ga-group.nl/ics/trbc/2012/5610102016
imported on: 2023-04-07T16:52:39.364811Z
last refreshed on: 2026-06-05T07:16:11.699Z
source accessed on: 2017-12-31T07:04:19Z
source last accessed on: 2021-08-01T01:06:53Z
definition: Companies engaged in providing eyeglasses, spectacles or specs (informal) used for vision correction. Includes manufacturers of contact lens which are medical devices and can be worn to correct vision. Excludes sunglasses and fashion eyewear, classified in Fashion Eyewear.
notation: 5610102016
valid from: 2020
is activity of: Medical Equipment, Supplies & Distribution

Laboratory Diagnostic & Testing Substances
type: NamedIndividual
type: Activity
type: BusinessClassification
is contemporary version of: http://data.ga-group.nl/ics/trbc/5610102017
is version of: http://data.ga-group.nl/ics/trbc/5610102017
replaces: http://data.ga-group.nl/ics/trbc/2012/5610102017
imported on: 2023-04-07T16:52:39.364811Z
last refreshed on: 2026-06-05T07:16:11.699Z
source accessed on: 2017-12-31T07:04:19Z
source last accessed on: 2021-08-01T01:06:53Z
definition: Companies engaged in manufacturing in-vitro (in glass, not taken internally) diagnostic substances, such as chemical, biological, or radioactive substances. The substances are used for diagnostic tests that are performed in test tubes, petri dishes, machines, and other diagnostic test-type devices. These substances are used in laboratories, hospitals and do not require a patient's presence. Excludes in-vivo (inside the body) diagnostic substances, classified in In-Vivo Diagnostic & Testing Substances in the Pharmaceuticals Industry.
notation: 5610102017
valid from: 2020
is activity of: Medical Equipment, Supplies & Distribution

Veterinary Medical Equipment & Supplies
type: NamedIndividual
type: Activity
type: BusinessClassification
is contemporary version of: http://data.ga-group.nl/ics/trbc/5610102018
is version of: http://data.ga-group.nl/ics/trbc/5610102018
replaces: http://data.ga-group.nl/ics/trbc/2012/5610102018
imported on: 2023-04-07T16:52:39.364811Z
last refreshed on: 2026-06-05T07:16:11.699Z
source accessed on: 2017-12-31T07:04:19Z
source last accessed on: 2021-08-01T01:06:53Z
definition: Companies engaged in manufacturing veterinary instruments and devices intended for use in the diagnosis of disease or other conditions in the cure, mitigation, treatment, or prevention of disease in animals.
notation: 5610102018
valid from: 2020
is activity of: Medical Equipment, Supplies & Distribution

Drug Delivery Systems
type: NamedIndividual
type: Activity
type: BusinessClassification
is contemporary version of: http://data.ga-group.nl/ics/trbc/5610102019
is version of: http://data.ga-group.nl/ics/trbc/5610102019
replaces: http://data.ga-group.nl/ics/trbc/2012/5610102019
imported on: 2023-04-07T16:52:39.364811Z
last refreshed on: 2026-06-05T07:16:11.699Z
source accessed on: 2017-12-31T07:04:19Z
source last accessed on: 2021-08-01T01:06:53Z
definition: Companies engaged in providing systems for administering drugs to achieve a therapeutic effect in humans, such as drip/infusion systems for intravenous drug supply, inhalation equipment. Includes also producers of targeted delivery systems in which the drug is only active in the target area of the body (for example, in cancerous tissues), such as liposomes.
notation: 5610102019
valid from: 2020
is activity of: Medical Equipment, Supplies & Distribution

Medical Equipment, Supplies & Distribution
type: NamedIndividual
type: BusinessClassification
type: Industry
is contemporary version of: http://data.ga-group.nl/ics/trbc/56101020
is version of: http://data.ga-group.nl/ics/trbc/56101020
replaces: http://data.ga-group.nl/ics/trbc/2012/56101020
imported on: 2023-04-07T16:52:39.364811Z
last refreshed on: 2026-06-05T07:16:11.699Z
source accessed on: 2017-12-31T07:04:19Z
source last accessed on: 2021-08-01T01:06:53Z
definition: Manufacturers and distributors of medical equipment and supplies. Includes manufacturers of forceps, surgical knives and gloves, bandages and dressings, syringes, stethoscopes, medical laboratory equipment, x-ray films, dental drills, veterinarian instruments, medical prosthetics, medical devices & implants, glasses, spectacles & contact lenses, diagnostic & testing substances and other related supplies.
notation: 56101020
valid from: 2020
is industry of: Healthcare Equipment & Supplies

Healthcare Equipment & Supplies
type: NamedIndividual
type: BusinessClassification
type: IndustryGroup
is contemporary version of: http://data.ga-group.nl/ics/trbc/561010
is version of: http://data.ga-group.nl/ics/trbc/561010
replaces: http://data.ga-group.nl/ics/trbc/2012/561010
imported on: 2023-04-07T16:52:39.364811Z
last refreshed on: 2026-06-05T07:16:11.699Z
source accessed on: 2017-12-31T07:04:19Z
source last accessed on: 2021-08-01T01:06:53Z
definition: Manufacturers of advanced medical equipment, medical technology providers and basic medical supplies.
notation: 561010
valid from: 2020
is industry group of: Healthcare Services & Equipment

Healthcare Facilities & Services (NEC)
type: NamedIndividual
type: Activity
type: BusinessClassification
is contemporary version of: http://data.ga-group.nl/ics/trbc/5610201010
is version of: http://data.ga-group.nl/ics/trbc/5610201010
replaces: http://data.ga-group.nl/ics/trbc/2012/5610201010
imported on: 2023-04-07T16:52:39.364811Z
last refreshed on: 2026-06-05T07:16:11.699Z
source accessed on: 2017-12-31T07:04:19Z
source last accessed on: 2021-08-01T01:06:53Z
definition: Companies engaged in operating hospitals, physician and dental clinics, psychiatric facilities, nursing homes, consultancy services (nutritionists, homeopathic therapies) and home healthcare agencies. Includes also medical laboratories that support healthcare facilities such as blood analysis, pathology, urinalysis, medical x-ray and other diagnostic laboratories, and veterinary services.
notation: 5610201010
valid from: 2020
is activity of: Healthcare Facilities & Services

Hospitals, Clinics & Primary Care Services
type: NamedIndividual
type: Activity
type: BusinessClassification
is contemporary version of: http://data.ga-group.nl/ics/trbc/5610201011
is version of: http://data.ga-group.nl/ics/trbc/5610201011
replaces: http://data.ga-group.nl/ics/trbc/2012/5610201011
imported on: 2023-04-07T16:52:39.364811Z
last refreshed on: 2026-06-05T07:16:11.699Z
source accessed on: 2017-12-31T07:04:19Z
source last accessed on: 2021-08-01T01:06:53Z
definition: Companies engaged in providing patient treatment by specialized staff and equipment, such as hospitals, clinics and outpatient care centers. Includes also the provision of diagnosis, treatment, and prevention of disease, illness, injury, and other physical and mental impairments in humans.
notation: 5610201011
valid from: 2020
is activity of: Healthcare Facilities & Services

Residential & Long-Term Care
type: NamedIndividual
type: Activity
type: BusinessClassification
is contemporary version of: http://data.ga-group.nl/ics/trbc/5610201012
is version of: http://data.ga-group.nl/ics/trbc/5610201012
replaces: http://data.ga-group.nl/ics/trbc/2012/5610201012
imported on: 2023-04-07T16:52:39.364811Z
last refreshed on: 2026-06-05T07:16:11.699Z
source accessed on: 2017-12-31T07:04:19Z
source last accessed on: 2021-08-01T01:06:53Z
definition: Companies engaged in providing long-term care given to adults or children in a residential setting rather than the patient's home, elderly homes and continuing care retirement communities.
notation: 5610201012
valid from: 2020
is activity of: Healthcare Facilities & Services

Ambulance & Emergency Services
type: NamedIndividual
type: Activity
type: BusinessClassification
is contemporary version of: http://data.ga-group.nl/ics/trbc/5610201013
is version of: http://data.ga-group.nl/ics/trbc/5610201013
replaces: http://data.ga-group.nl/ics/trbc/2012/5610201013
imported on: 2023-04-07T16:52:39.364811Z
last refreshed on: 2026-06-05T07:16:11.699Z
source accessed on: 2017-12-31T07:04:19Z
source last accessed on: 2021-08-01T01:06:53Z
definition: Companies engaged in providing a vehicle for transportation of sick or injured people to, from or between places of treatment for an illness or injury and in some instances will also provide out of hospital medical care to the patient. Includes also emergency services which ensure public safety and health by addressing different emergencies.
notation: 5610201013
valid from: 2020
is activity of: Healthcare Facilities & Services

Doctor's Office
type: NamedIndividual
type: Activity
type: BusinessClassification
is contemporary version of: http://data.ga-group.nl/ics/trbc/5610201014
is version of: http://data.ga-group.nl/ics/trbc/5610201014
replaces: http://data.ga-group.nl/ics/trbc/2012/5610201014
imported on: 2023-04-07T16:52:39.364811Z
last refreshed on: 2026-06-05T07:16:11.699Z
source accessed on: 2017-12-31T07:04:19Z
source last accessed on: 2021-08-01T01:06:53Z
definition: Doctors primarily engaged in the independent practice of general or specialized medicine (except psychiatry or psychoanalysis) or surgery. These practitioners operate private or group practices.
notation: 5610201014
valid from: 2020
is activity of: Healthcare Facilities & Services

Medical & Diagnostic Laboratories
type: NamedIndividual
type: Activity
type: BusinessClassification
is contemporary version of: http://data.ga-group.nl/ics/trbc/5610201015
is version of: http://data.ga-group.nl/ics/trbc/5610201015
replaces: http://data.ga-group.nl/ics/trbc/2012/5610201015
imported on: 2023-04-07T16:52:39.364811Z
last refreshed on: 2026-06-05T07:16:11.699Z
source accessed on: 2017-12-31T07:04:19Z
source last accessed on: 2021-08-01T01:06:53Z
definition: Companies engaged in operating laboratories where tests are conducted on patients for screening for suspected ailments.
notation: 5610201015
valid from: 2020
is activity of: Healthcare Facilities & Services

Veterinary Services
type: NamedIndividual
type: Activity
type: BusinessClassification
is contemporary version of: http://data.ga-group.nl/ics/trbc/5610201016
is version of: http://data.ga-group.nl/ics/trbc/5610201016
replaces: http://data.ga-group.nl/ics/trbc/2012/5610201016
imported on: 2023-04-07T16:52:39.364811Z
last refreshed on: 2026-06-05T07:16:11.699Z
source accessed on: 2017-12-31T07:04:19Z
source last accessed on: 2021-08-01T01:06:53Z
definition: Companies engaged in the provision of veterinary medicine services, dentistry, or surgery for animals. Includes also companies providing testing services for licensed veterinary practitioners.
notation: 5610201016
valid from: 2020
is activity of: Healthcare Facilities & Services

Telemedicine Services
type: NamedIndividual
type: Activity
type: BusinessClassification
is contemporary version of: http://data.ga-group.nl/ics/trbc/5610201017
is version of: http://data.ga-group.nl/ics/trbc/5610201017
replaces: http://data.ga-group.nl/ics/trbc/2012/5610201017
imported on: 2023-04-07T16:52:39.364811Z
last refreshed on: 2026-06-05T07:16:11.699Z
source accessed on: 2017-12-31T07:04:19Z
source last accessed on: 2021-08-01T01:06:53Z
definition: Companies engaged in the use of telecommunication and information technologies in order to provide clinical healthcare at a distance, usually over the phone/internet.
notation: 5610201017
valid from: 2020
is activity of: Healthcare Facilities & Services

Home Healthcare Services
type: NamedIndividual
type: Activity
type: BusinessClassification
is contemporary version of: http://data.ga-group.nl/ics/trbc/5610201018
is version of: http://data.ga-group.nl/ics/trbc/5610201018
replaces: http://data.ga-group.nl/ics/trbc/2012/5610201018
imported on: 2023-04-07T16:52:39.364811Z
last refreshed on: 2026-06-05T07:16:11.699Z
source accessed on: 2017-12-31T07:04:19Z
source last accessed on: 2021-08-01T01:06:53Z
definition: Companies engaged in providing private home care to seniors and/or people who are unable to fully care for themselves/people with physical or mental disabilities. Includes services range from patient home-based companionship, meals to round-the-clock nursing care.
notation: 5610201018
valid from: 2020
is activity of: Healthcare Facilities & Services

Alternative Medicine Facilities
type: NamedIndividual
type: Activity
type: BusinessClassification
is contemporary version of: http://data.ga-group.nl/ics/trbc/5610201019
is version of: http://data.ga-group.nl/ics/trbc/5610201019
replaces: http://data.ga-group.nl/ics/trbc/2012/5610201019
imported on: 2023-04-07T16:52:39.364811Z
last refreshed on: 2026-06-05T07:16:11.699Z
source accessed on: 2017-12-31T07:04:19Z
source last accessed on: 2021-08-01T01:06:53Z
definition: Companies operating non-conventional medicine facilities. Includes herbal, homeopathic and traditional Chinese medicine clinics and healthcare facilities.
notation: 5610201019
valid from: 2020
is activity of: Healthcare Facilities & Services

Medical Farming
type: NamedIndividual
type: Activity
type: BusinessClassification
is contemporary version of: http://data.ga-group.nl/ics/trbc/5610201020
is version of: http://data.ga-group.nl/ics/trbc/5610201020
imported on: 2023-04-07T17:17:07.492231Z
last refreshed on: 2026-06-05T07:16:11.699Z
source accessed on: 2021-04-25T05:48:36Z
source last accessed on: 2021-08-01T01:06:53Z
definition: Companies engaged in farming plants for medical purposes, such as medical marijuana/cannabis farming, herb farming, among others. It also includes medical molecular farming, production of antibodies, biopharmaceuticals and edible vaccines in plants.
notation: 5610201020
valid from: 2020
is activity of: Healthcare Facilities & Services

Healthcare Facilities & Services
type: NamedIndividual
type: BusinessClassification
type: Industry
is contemporary version of: http://data.ga-group.nl/ics/trbc/56102010
is version of: http://data.ga-group.nl/ics/trbc/56102010
replaces: http://data.ga-group.nl/ics/trbc/2012/56102010
imported on: 2023-04-07T16:52:39.364811Z
last refreshed on: 2026-06-05T07:16:11.699Z
source accessed on: 2017-12-31T07:04:19Z
source last accessed on: 2021-08-01T01:06:53Z
definition: Operators of hospitals, physician and dental clinics, psychiatric facilities, nursing homes, consultancy services (nutritionists), doctor's offices, residential & long term care facilities and home healthcare agencies. Includes medical laboratories that support healthcare facilities such as blood analysis, pathology, urinalysis, medical x-ray and other diagnostic laboratories. Includes also veterinary services, telemedicine services, ambulance & emergency services and alternative medicine facilities (homeopathic, acupuncture, herbal and traditional Chinese medicine facilities).
notation: 56102010
valid from: 2020
is industry of: Healthcare Providers & Services

Managed Healthcare (NEC)
type: NamedIndividual
type: Activity
type: BusinessClassification
is contemporary version of: http://data.ga-group.nl/ics/trbc/5610202010
is version of: http://data.ga-group.nl/ics/trbc/5610202010
replaces: http://data.ga-group.nl/ics/trbc/2012/5610202010
imported on: 2023-04-07T16:52:39.364811Z
last refreshed on: 2026-06-05T07:16:11.699Z
source accessed on: 2017-12-31T07:04:19Z
source last accessed on: 2021-08-01T01:06:53Z
definition: Companies engaged in providing managed healthcare, mainly operating in the United States.
notation: 5610202010
valid from: 2020
is activity of: Managed Healthcare

HMO Medical Centers
type: NamedIndividual
type: Activity
type: BusinessClassification
is contemporary version of: http://data.ga-group.nl/ics/trbc/5610202011
is version of: http://data.ga-group.nl/ics/trbc/5610202011
replaces: http://data.ga-group.nl/ics/trbc/2012/5610202011
imported on: 2023-04-07T16:52:39.364811Z
last refreshed on: 2026-06-05T07:16:11.699Z
source accessed on: 2017-12-31T07:04:19Z
source last accessed on: 2021-08-01T01:06:53Z
definition: Companies engaged in providing a range of outpatient medical services to the health maintenance organization (HMO) subscribers with a focus generally on primary healthcare.
notation: 5610202011
valid from: 2020
is activity of: Managed Healthcare

Managed Healthcare
type: NamedIndividual
type: BusinessClassification
type: Industry
is contemporary version of: http://data.ga-group.nl/ics/trbc/56102020
is version of: http://data.ga-group.nl/ics/trbc/56102020
replaces: http://data.ga-group.nl/ics/trbc/2012/56102020
imported on: 2023-04-07T16:52:39.364811Z
last refreshed on: 2026-06-05T07:16:11.699Z
source accessed on: 2017-12-31T07:04:19Z
source last accessed on: 2021-08-01T01:06:53Z
definition: Providers of managed healthcare, health maintenance organizations (HMOs), mainly operating in the United States.
notation: 56102020
valid from: 2020
is industry of: Healthcare Providers & Services

Healthcare Providers & Services
type: NamedIndividual
type: BusinessClassification
type: IndustryGroup
is contemporary version of: http://data.ga-group.nl/ics/trbc/561020
is version of: http://data.ga-group.nl/ics/trbc/561020
replaces: http://data.ga-group.nl/ics/trbc/2012/561020
imported on: 2023-04-07T16:52:39.364811Z
last refreshed on: 2026-06-05T07:16:11.699Z
source accessed on: 2017-12-31T07:04:19Z
source last accessed on: 2021-08-01T01:06:53Z
definition: Operators of healthcare facilities and providers of managed healthcare.
notation: 561020
valid from: 2020
is industry group of: Healthcare Services & Equipment

Healthcare Services & Equipment
type: NamedIndividual
type: BusinessClassification
type: BusinessSector
is contemporary version of: http://data.ga-group.nl/ics/trbc/5610
is version of: http://data.ga-group.nl/ics/trbc/5610
replaces: http://data.ga-group.nl/ics/trbc/2012/5610
imported on: 2023-04-07T16:52:39.364811Z
last refreshed on: 2026-06-05T07:16:11.699Z
source accessed on: 2017-12-31T07:04:19Z
source last accessed on: 2021-08-01T01:06:53Z
definition: Manufacturers of medical equipment and supplies, providers of medical technology/software, as well as operators of healthcare facilities and providers of managed healthcare.
notation: 5610
valid from: 2020
is business sector of: Healthcare

Pharmaceuticals (NEC)
type: NamedIndividual
type: Activity
type: BusinessClassification
is contemporary version of: http://data.ga-group.nl/ics/trbc/5620104010
is version of: http://data.ga-group.nl/ics/trbc/5620104010
replaces: http://data.ga-group.nl/ics/trbc/2012/5620104010
imported on: 2023-04-07T16:52:39.364811Z
last refreshed on: 2026-06-05T07:16:11.699Z
source accessed on: 2017-12-31T07:04:19Z
source last accessed on: 2021-08-01T01:06:53Z
definition: Companies involved in least two activities under the Pharmaceuticals industry, none being dominant: Specialty & Advanced Pharmaceuticals, Biopharmaceuticals, In-Vivo Diagnostic & Testing Substances Manufacturers, Veterinary Drugs, Generic Pharmaceuticals, Alternative Medicine. Includes also entities not elsewhere classified under the Pharmaceuticals industry.
notation: 5620104010
valid from: 2020
is activity of: Pharmaceuticals

Proprietary & Advanced Pharmaceuticals
type: NamedIndividual
type: Activity
type: BusinessClassification
is contemporary version of: http://data.ga-group.nl/ics/trbc/5620104011
is version of: http://data.ga-group.nl/ics/trbc/5620104011
replaces: http://data.ga-group.nl/ics/trbc/2012/5620104011
imported on: 2023-04-07T16:52:39.364811Z
last refreshed on: 2026-06-05T07:16:11.699Z
source accessed on: 2017-12-31T07:04:19Z
source last accessed on: 2021-08-01T01:06:53Z
definition: Companies engaged in manufacturing patented pharmaceuticals under license. These are usually branded drugs with valid patents.
notation: 5620104011
valid from: 2020
is activity of: Pharmaceuticals

Biopharmaceuticals
type: NamedIndividual
type: Activity
type: BusinessClassification
is contemporary version of: http://data.ga-group.nl/ics/trbc/5620104012
is version of: http://data.ga-group.nl/ics/trbc/5620104012
replaces: http://data.ga-group.nl/ics/trbc/2012/5620104012
imported on: 2023-04-07T16:52:39.364811Z
last refreshed on: 2026-06-05T07:16:11.699Z
source accessed on: 2017-12-31T07:04:19Z
source last accessed on: 2021-08-01T01:06:53Z
definition: Companies engaged in manufacturing medical drugs containing substances of human or animal origin, naturally present in living organisms (not obtained through recombinant biotechnology), such as hormones, blood factors, monoclonal antibodies, growth agents, stem cells, enzymes, used in the treatment of various diseases. Examples are interferon used in the treatment of leukemia and multiple sclerosis, erythropoietin (EPO) used in the treatment of anemia, monoclonal antibodies used in the treatment of arthritis, growth hormone (GH) for children's growth disorders. Excludes companies engaged in provision of drugs produced by means of recombinant biotechnology, classified in Bio Therapeutic Drugs.
notation: 5620104012
valid from: 2020
is activity of: Pharmaceuticals

In-Vivo Diagnostic & Testing Substances
type: NamedIndividual
type: Activity
type: BusinessClassification
is contemporary version of: http://data.ga-group.nl/ics/trbc/5620104013
is version of: http://data.ga-group.nl/ics/trbc/5620104013
replaces: http://data.ga-group.nl/ics/trbc/2012/5620104013
imported on: 2023-04-07T16:52:39.364811Z
last refreshed on: 2026-06-05T07:16:11.699Z
source accessed on: 2017-12-31T07:04:19Z
source last accessed on: 2021-08-01T01:06:53Z
definition: Companies engaged in manufacturing in-vivo (inside the human body) diagnostic substances, such as contrast media in-vivo diagnostic substances (iodine, barium), coagulation in-vivo diagnostic substances, among others. These substances should be approved by a country's official drug authority as pharmaceuticals (for example, FDA-approved in the US). Excludes in-vitro (in glass, not taken internally) diagnostic substances, classified in Laboratory Diagnostic & Testing Substances in the Medical Equipment, Supplies & Distribution industry.
notation: 5620104013
valid from: 2020
is activity of: Pharmaceuticals

Veterinary Drugs
type: NamedIndividual
type: Activity
type: BusinessClassification
is contemporary version of: http://data.ga-group.nl/ics/trbc/5620104014
is version of: http://data.ga-group.nl/ics/trbc/5620104014
replaces: http://data.ga-group.nl/ics/trbc/2012/5620104014
imported on: 2023-04-07T16:52:39.364811Z
last refreshed on: 2026-06-05T07:16:11.699Z
source accessed on: 2017-12-31T07:04:19Z
source last accessed on: 2021-08-01T01:06:53Z
definition: Companies engaged in the production of drugs for the medical or surgical treatment of animals, especially domestic animals.
notation: 5620104014
valid from: 2020
is activity of: Pharmaceuticals

Generic Pharmaceuticals
type: NamedIndividual
type: Activity
type: BusinessClassification
is contemporary version of: http://data.ga-group.nl/ics/trbc/5620104015
is version of: http://data.ga-group.nl/ics/trbc/5620104015
replaces: http://data.ga-group.nl/ics/trbc/2012/5620104015
imported on: 2023-04-07T16:52:39.364811Z
last refreshed on: 2026-06-05T07:16:11.699Z
source accessed on: 2017-12-31T07:04:19Z
source last accessed on: 2021-08-01T01:06:53Z
definition: Companies engaged in manufacturing drugs without a license from the innovator company and marketed after the expiry date of the patent or other exclusive rights. Generic drugs are marketed under a non-proprietary or approved name rather than a proprietary or brand name and are frequently much cheaper than brand-name drugs. Includes manufacturers of OTC (non-prescription) drugs.
notation: 5620104015
valid from: 2020
is activity of: Pharmaceuticals

Alternative Medicine
type: NamedIndividual
type: Activity
type: BusinessClassification
is contemporary version of: http://data.ga-group.nl/ics/trbc/5620104016
is version of: http://data.ga-group.nl/ics/trbc/5620104016
replaces: http://data.ga-group.nl/ics/trbc/2012/5620104016
imported on: 2023-04-07T16:52:39.364811Z
last refreshed on: 2026-06-05T07:16:11.699Z
source accessed on: 2017-12-31T07:04:19Z
source last accessed on: 2021-08-01T01:06:53Z
definition: Companies engaged in providing drugs not falling into the category of conventional medicine, such as herbal, homeopathic and traditional Chinese medicine, or Ayurveda pharmaceuticals.
notation: 5620104016
valid from: 2020
is activity of: Pharmaceuticals

Recreational Pharmaceuticals
type: NamedIndividual
type: Activity
type: BusinessClassification
is contemporary version of: http://data.ga-group.nl/ics/trbc/5620104017
is version of: http://data.ga-group.nl/ics/trbc/5620104017
imported on: 2023-04-07T17:17:07.492231Z
last refreshed on: 2026-06-05T07:16:11.699Z
source accessed on: 2021-04-25T05:48:36Z
source last accessed on: 2021-08-01T01:06:53Z
definition: Companies engaged in manufacturing of recreational drugs/pharmaceuticals, including but not limited to cannabis.
notation: 5620104017
valid from: 2020
is activity of: Pharmaceuticals

Pharmaceuticals Wholesale
type: NamedIndividual
type: Activity
type: BusinessClassification
is contemporary version of: http://data.ga-group.nl/ics/trbc/5620104018
is version of: http://data.ga-group.nl/ics/trbc/5620104018
imported on: 2023-04-07T17:17:07.492231Z
last refreshed on: 2026-06-05T07:16:11.699Z
source accessed on: 2021-04-25T05:48:36Z
source last accessed on: 2021-08-01T01:06:53Z
definition: Companies engaged in the wholesale of all types of pharmaceuticals, such as generic pharmaceuticals, veterinary pharmaceuticals, biopharmaceuticals, among others.
notation: 5620104018
valid from: 2020
is activity of: Pharmaceuticals

Pharmaceuticals
type: NamedIndividual
type: BusinessClassification
type: Industry
is contemporary version of: http://data.ga-group.nl/ics/trbc/56201040
is version of: http://data.ga-group.nl/ics/trbc/56201040
replaces: http://data.ga-group.nl/ics/trbc/2012/56201040
imported on: 2023-04-07T16:52:39.364811Z
last refreshed on: 2026-06-05T07:16:11.699Z
source accessed on: 2017-12-31T07:04:19Z
source last accessed on: 2021-08-01T01:06:53Z
definition: Companies engaged in the research, development, manufacturing and marketing of drugs, including prescription, over the counter (OTC), specialty & advanced pharmaceuticals, generic pharmaceuticals, biopharmaceuticals, veterinary drugs, alternative medicines (homeopathy, herbal, traditional Chinese medicine), and diagnostic & testing substances manufacturers.
notation: 56201040
valid from: 2020
is industry of: Pharmaceuticals

Pharmaceuticals
type: NamedIndividual
type: BusinessClassification
type: IndustryGroup
is contemporary version of: http://data.ga-group.nl/ics/trbc/562010
is version of: http://data.ga-group.nl/ics/trbc/562010
replaces: http://data.ga-group.nl/ics/trbc/2012/562010
imported on: 2023-04-07T16:52:39.364811Z
last refreshed on: 2026-06-05T07:16:11.699Z
source accessed on: 2017-12-31T07:04:19Z
source last accessed on: 2021-08-01T01:06:53Z
definition: Manufacturers and marketers of generic and specialty drugs, as well as researchers and developers of new drugs, medical products and procedures.
notation: 562010
valid from: 2020
is industry group of: Pharmaceuticals & Medical Research

Biotechnology & Medical Research (NEC)
type: NamedIndividual
type: Activity
type: BusinessClassification
is contemporary version of: http://data.ga-group.nl/ics/trbc/5620201010
is version of: http://data.ga-group.nl/ics/trbc/5620201010
replaces: http://data.ga-group.nl/ics/trbc/2012/5620201010
imported on: 2023-04-07T16:52:39.364811Z
last refreshed on: 2026-06-05T07:16:11.699Z
source accessed on: 2017-12-31T07:04:19Z
source last accessed on: 2021-08-01T01:06:53Z
definition: Companies involved in at least two activities under the Biotechnology & Medical Research Industry, none being dominant: Bio Therapeutic Drugs, Bio Diagnostics & Testing, Bio Medical Devices. Includes also entities not elsewhere classified under the Biotechnology & Medical Research industry.
notation: 5620201010
valid from: 2020
is activity of: Biotechnology & Medical Research

Bio Therapeutic Drugs
type: NamedIndividual
type: Activity
type: BusinessClassification
is contemporary version of: http://data.ga-group.nl/ics/trbc/5620201011
is version of: http://data.ga-group.nl/ics/trbc/5620201011
replaces: http://data.ga-group.nl/ics/trbc/2012/5620201011
imported on: 2023-04-07T16:52:39.364811Z
last refreshed on: 2026-06-05T07:16:11.699Z
source accessed on: 2017-12-31T07:04:19Z
source last accessed on: 2021-08-01T01:06:53Z
definition: Companies engaged in the research, development and production of biotech drugs or biologics, often having a pipeline of drugs in the clinical tests' phase (not yet on the market). Bio therapeutic drugs are derived from living organisms and trigger living cells to make or modify protein products (recombinant DNA technology) in order to treat illness/improve health. They are used to treat and prevent serious illnesses, such as cancer and multiple sclerosis. Includes human insulin produced through the use of modified bacteria, the manufacture of erythropoietin in hamster ovary cells. Excludes companies that produce drugs of human origin, but not as a result of recombinant biotechnology in cell, but naturally present in human body, such as some hormones, blood factors, monoclonal antibodies, growth agents, stem cells, enzymes, classified in Biopharmaceuticals.
notation: 5620201011
valid from: 2020
is activity of: Biotechnology & Medical Research

Bio Diagnostics & Testing
type: NamedIndividual
type: Activity
type: BusinessClassification
is contemporary version of: http://data.ga-group.nl/ics/trbc/5620201012
is version of: http://data.ga-group.nl/ics/trbc/5620201012
replaces: http://data.ga-group.nl/ics/trbc/2012/5620201012
imported on: 2023-04-07T16:52:39.364811Z
last refreshed on: 2026-06-05T07:16:11.699Z
source accessed on: 2017-12-31T07:04:19Z
source last accessed on: 2021-08-01T01:06:53Z
definition: Companies engaged n the provision of biological (non-synthetic) equipment and solutions for medical diagnosis, such as biomarkers used to detect cancer cells.
notation: 5620201012
valid from: 2020
is activity of: Biotechnology & Medical Research

Bio Medical Devices
type: NamedIndividual
type: Activity
type: BusinessClassification
is contemporary version of: http://data.ga-group.nl/ics/trbc/5620201013
is version of: http://data.ga-group.nl/ics/trbc/5620201013
replaces: http://data.ga-group.nl/ics/trbc/2012/5620201013
imported on: 2023-04-07T16:52:39.364811Z
last refreshed on: 2026-06-05T07:16:11.699Z
source accessed on: 2017-12-31T07:04:19Z
source last accessed on: 2021-08-01T01:06:53Z
definition: Companies engaged in research, development and production of solutions by means of biomedical engineering and tissue engineering. Examples are artificial organs, created via biological material, for patients who need organs transplantation, such as urinary bladders grown in laboratories, hepatic assist devices that use liver cells, jawbones and tracheas derived from human stem cells.
notation: 5620201013
valid from: 2020
is activity of: Biotechnology & Medical Research

Biotechnology & Medical Research
type: NamedIndividual
type: BusinessClassification
type: Industry
is contemporary version of: http://data.ga-group.nl/ics/trbc/56202010
is version of: http://data.ga-group.nl/ics/trbc/56202010
replaces: http://data.ga-group.nl/ics/trbc/2012/56202010
imported on: 2023-04-07T16:52:39.364811Z
last refreshed on: 2026-06-05T07:16:11.699Z
source accessed on: 2017-12-31T07:04:19Z
source last accessed on: 2021-08-01T01:06:53Z
definition: Researchers and developers of new drugs, bio therapeutic drugs, bio diagnostics & testing substances, bio medical devices and procedures, usually having a pipeline of drugs in the clinical tests' phase (not yet on the market).
notation: 56202010
valid from: 2020
is industry of: Biotechnology & Medical Research

Biotechnology & Medical Research
type: NamedIndividual
type: BusinessClassification
type: IndustryGroup
is contemporary version of: http://data.ga-group.nl/ics/trbc/562020
is version of: http://data.ga-group.nl/ics/trbc/562020
replaces: http://data.ga-group.nl/ics/trbc/2012/562020
imported on: 2023-04-07T16:52:39.364811Z
last refreshed on: 2026-06-05T07:16:11.699Z
source accessed on: 2017-12-31T07:04:19Z
source last accessed on: 2021-08-01T01:06:53Z
definition: Researchers and developers of biotechnology based drugs and therapies as well as medical devices and procedures that are at an early (non-commercial) stage.
notation: 562020
valid from: 2020
is industry group of: Pharmaceuticals & Medical Research

Pharmaceuticals & Medical Research
type: NamedIndividual
type: BusinessClassification
type: BusinessSector
is contemporary version of: http://data.ga-group.nl/ics/trbc/5620
is version of: http://data.ga-group.nl/ics/trbc/5620
replaces: http://data.ga-group.nl/ics/trbc/2012/5620
imported on: 2023-04-07T16:52:39.364811Z
last refreshed on: 2026-06-05T07:16:11.699Z
source accessed on: 2017-12-31T07:04:19Z
source last accessed on: 2021-08-01T01:06:53Z
definition: Manufacturers and marketers of generic and specialty drugs, as well as researchers and developers of new drugs, medical products and procedures.
notation: 5620
valid from: 2020
is business sector of: Healthcare

Healthcare
type: NamedIndividual
type: BusinessClassification
type: EconomicSector
is contemporary version of: http://data.ga-group.nl/ics/trbc/56
is version of: http://data.ga-group.nl/ics/trbc/56
replaces: http://data.ga-group.nl/ics/trbc/2012/56
imported on: 2023-04-07T16:52:39.364811Z
last refreshed on: 2026-06-05T07:16:11.699Z
source accessed on: 2017-12-31T07:04:19Z
source last accessed on: 2021-08-01T01:06:53Z
definition: Manufacturers, developers and marketers of pharmaceuticals, medical equipment and supplies, as well as advanced therapeutic treatments and devices, and providers of healthcare facilities and medical research and development.
notation: 56
valid from: 2020

Semiconductors (NEC)
type: NamedIndividual
type: Activity
type: BusinessClassification
is contemporary version of: http://data.ga-group.nl/ics/trbc/5710101010
is version of: http://data.ga-group.nl/ics/trbc/5710101010
replaces: http://data.ga-group.nl/ics/trbc/2012/5710101010
imported on: 2023-04-07T16:52:39.364811Z
last refreshed on: 2026-06-05T07:16:11.699Z
source accessed on: 2017-12-31T07:04:19Z
source last accessed on: 2021-08-01T01:06:53Z
definition: Companies engaged in the design and fabrication of high-value microcircuits, microprocessor chips, integrated circuits, printed circuit boards and memory chips. Includes also producers of chip components designed for specific industries.
notation: 5710101010
valid from: 2020
is activity of: Semiconductors

Integrated Circuits
type: NamedIndividual
type: Activity
type: BusinessClassification
is contemporary version of: http://data.ga-group.nl/ics/trbc/5710101011
is version of: http://data.ga-group.nl/ics/trbc/5710101011
replaces: http://data.ga-group.nl/ics/trbc/2012/5710101011
imported on: 2023-04-07T16:52:39.364811Z
last refreshed on: 2026-06-05T07:16:11.699Z
source accessed on: 2017-12-31T07:04:19Z
source last accessed on: 2021-08-01T01:06:53Z
definition: Companies engaged in providing an electronic circuit manufactured by the patterned diffusion of trace elements into the surface of a thin substrate of semiconductor material.
notation: 5710101011
valid from: 2020
is activity of: Semiconductors

Memory Chips (RAM)
type: NamedIndividual
type: Activity
type: BusinessClassification
is contemporary version of: http://data.ga-group.nl/ics/trbc/5710101012
is version of: http://data.ga-group.nl/ics/trbc/5710101012
replaces: http://data.ga-group.nl/ics/trbc/2012/5710101012
imported on: 2023-04-07T16:52:39.364811Z
last refreshed on: 2026-06-05T07:16:11.699Z
source accessed on: 2017-12-31T07:04:19Z
source last accessed on: 2021-08-01T01:06:53Z
definition: Companies engaged in providing a form of computer data storage. Includes two main forms of modern RAM: static RAM (SRAM) and dynamic RAM (DRAM).
notation: 5710101012
valid from: 2020
is activity of: Semiconductors

Processors
type: NamedIndividual
type: Activity
type: BusinessClassification
is contemporary version of: http://data.ga-group.nl/ics/trbc/5710101013
is version of: http://data.ga-group.nl/ics/trbc/5710101013
replaces: http://data.ga-group.nl/ics/trbc/2012/5710101013
imported on: 2023-04-07T16:52:39.364811Z
last refreshed on: 2026-06-05T07:16:11.699Z
source accessed on: 2017-12-31T07:04:19Z
source last accessed on: 2021-08-01T01:06:53Z
definition: Companies engaged in providing processing unit, which includes Central processing unit (CPU), microprocessor, Graphics processing unit, Physics processing unit, Digital signal processor, Network processor, data processor and audio processors.
notation: 5710101013
valid from: 2020
is activity of: Semiconductors

Semiconductor Wholesale
type: NamedIndividual
type: Activity
type: BusinessClassification
is contemporary version of: http://data.ga-group.nl/ics/trbc/5710101014
is version of: http://data.ga-group.nl/ics/trbc/5710101014
replaces: http://data.ga-group.nl/ics/trbc/2012/5710101014
imported on: 2023-04-07T16:52:39.364811Z
last refreshed on: 2026-06-05T07:16:11.699Z
source accessed on: 2017-12-31T07:04:19Z
source last accessed on: 2021-08-01T01:06:53Z
definition: Companies engaged in wholesaling electronic parts and equipment.
notation: 5710101014
valid from: 2020
is activity of: Semiconductors

NFC & RFID Systems
type: NamedIndividual
type: Activity
type: BusinessClassification
is contemporary version of: http://data.ga-group.nl/ics/trbc/5710101015
is version of: http://data.ga-group.nl/ics/trbc/5710101015
replaces: http://data.ga-group.nl/ics/trbc/2012/5710101015
imported on: 2023-04-07T16:52:39.364811Z
last refreshed on: 2026-06-05T07:16:11.699Z
source accessed on: 2017-12-31T07:04:19Z
source last accessed on: 2021-08-01T01:06:53Z
definition: Companies engaged in providing near field communication (NFC) and radio frequency identification (RFID) technology devices. RFID uses radio waves to transfer data from an electronic tag, called RFID tag or label, attached to an object, through a reader for the purpose of identifying and tracking the object. NFC enables two electronic devices to establish communication if brought within 4 cm of each other and is used in contactless payment cards, among others.
notation: 5710101015
valid from: 2020
is activity of: Semiconductors

Semiconductors
type: NamedIndividual
type: BusinessClassification
type: Industry
is contemporary version of: http://data.ga-group.nl/ics/trbc/57101010
is version of: http://data.ga-group.nl/ics/trbc/57101010
replaces: http://data.ga-group.nl/ics/trbc/2012/57101010
imported on: 2023-04-07T16:52:39.364811Z
last refreshed on: 2026-06-05T07:16:11.699Z
source accessed on: 2017-12-31T07:04:19Z
source last accessed on: 2021-08-01T01:06:53Z
definition: Designers, fabricators and wholesalers of high-value integrated circuits, memory chips, microcircuits, microprocessor chips, and RFID systems. Includes operators of foundries and producers of chip components designed for specific industries.
notation: 57101010
valid from: 2020
is industry of: Semiconductors & Semiconductor Equipment

Semiconductor Equipment & Testing (NEC)
type: NamedIndividual
type: Activity
type: BusinessClassification
is contemporary version of: http://data.ga-group.nl/ics/trbc/5710102010
is version of: http://data.ga-group.nl/ics/trbc/5710102010
replaces: http://data.ga-group.nl/ics/trbc/2012/5710102010
imported on: 2023-04-07T16:52:39.364811Z
last refreshed on: 2026-06-05T07:16:11.699Z
source accessed on: 2017-12-31T07:04:19Z
source last accessed on: 2021-08-01T01:06:53Z
definition: Companies engaged in providing production of semiconductor testing equipment and semiconductor manufacturing equipment. Includes also companies engaged in semiconductor testing services.
notation: 5710102010
valid from: 2020
is activity of: Semiconductor Equipment & Testing

Semiconductor Machinery Manufacturing
type: NamedIndividual
type: Activity
type: BusinessClassification
is contemporary version of: http://data.ga-group.nl/ics/trbc/5710102011
is version of: http://data.ga-group.nl/ics/trbc/5710102011
replaces: http://data.ga-group.nl/ics/trbc/2012/5710102011
imported on: 2023-04-07T16:52:39.364811Z
last refreshed on: 2026-06-05T07:16:11.699Z
source accessed on: 2017-12-31T07:04:19Z
source last accessed on: 2021-08-01T01:06:53Z
definition: Companies engaged in the mechanical, physical, or chemical transformation of materials, substances, or components into new products.
notation: 5710102011
valid from: 2020
is activity of: Semiconductor Equipment & Testing

Semiconductor Testing Equipment & Service
type: NamedIndividual
type: Activity
type: BusinessClassification
is contemporary version of: http://data.ga-group.nl/ics/trbc/5710102012
is version of: http://data.ga-group.nl/ics/trbc/5710102012
replaces: http://data.ga-group.nl/ics/trbc/2012/5710102012
imported on: 2023-04-07T16:52:39.364811Z
last refreshed on: 2026-06-05T07:16:11.699Z
source accessed on: 2017-12-31T07:04:19Z
source last accessed on: 2021-08-01T01:06:53Z
definition: Companies engaged in providing a range of electronic devices and systems for semiconductor testing purposes. Includes also companies providing semiconductor testing services.
notation: 5710102012
valid from: 2020
is activity of: Semiconductor Equipment & Testing

Semiconductor Equipment Wholesale
type: NamedIndividual
type: Activity
type: BusinessClassification
is contemporary version of: http://data.ga-group.nl/ics/trbc/5710102013
is version of: http://data.ga-group.nl/ics/trbc/5710102013
replaces: http://data.ga-group.nl/ics/trbc/2012/5710102013
imported on: 2023-04-07T16:52:39.364811Z
last refreshed on: 2026-06-05T07:16:11.699Z
source accessed on: 2017-12-31T07:04:19Z
source last accessed on: 2021-08-01T01:06:53Z
definition: Companies engaged in wholesaling electronic parts and equipment.
notation: 5710102013
valid from: 2020
is activity of: Semiconductor Equipment & Testing

Semiconductor Equipment & Testing
type: NamedIndividual
type: BusinessClassification
type: Industry
is contemporary version of: http://data.ga-group.nl/ics/trbc/57101020
is version of: http://data.ga-group.nl/ics/trbc/57101020
replaces: http://data.ga-group.nl/ics/trbc/2012/57101020
imported on: 2023-04-07T16:52:39.364811Z
last refreshed on: 2026-06-05T07:16:11.699Z
source accessed on: 2017-12-31T07:04:19Z
source last accessed on: 2021-08-01T01:06:53Z
definition: Producers and wholesalers of semiconductor testing equipment and semiconductor manufacturing equipment. Includes providers of semiconductor testing services.
notation: 57101020
valid from: 2020
is industry of: Semiconductors & Semiconductor Equipment

Semiconductors & Semiconductor Equipment
type: NamedIndividual
type: BusinessClassification
type: IndustryGroup
is contemporary version of: http://data.ga-group.nl/ics/trbc/571010
is version of: http://data.ga-group.nl/ics/trbc/571010
replaces: http://data.ga-group.nl/ics/trbc/2012/571010
imported on: 2023-04-07T16:52:39.364811Z
last refreshed on: 2026-06-05T07:16:11.699Z
source accessed on: 2017-12-31T07:04:19Z
source last accessed on: 2021-08-01T01:06:53Z
definition: Designers and manufacturers of semiconductors, as well as producers of testing and manufacturing equipment for semiconductor manufacturers.
notation: 571010
valid from: 2020
is industry group of: Technology Equipment

Communications & Networking (NEC)
type: NamedIndividual
type: Activity
type: BusinessClassification
is contemporary version of: http://data.ga-group.nl/ics/trbc/5710201010
is version of: http://data.ga-group.nl/ics/trbc/5710201010
replaces: http://data.ga-group.nl/ics/trbc/2012/5710201010
imported on: 2023-04-07T16:52:39.364811Z
last refreshed on: 2026-06-05T07:16:11.699Z
source accessed on: 2017-12-31T07:04:19Z
source last accessed on: 2021-08-01T01:06:53Z
definition: Companies engaged in manufacturing telecommunications equipment such as modems, cable decoders, carrier switches, fiber cable, wireless and satellite communication equipment. Includes also manufacturers of cellular and voice-over-IP phones, as well as wholesalers of communications or network equipment.
notation: 5710201010
valid from: 2020
is activity of: Communications & Networking

Network Equipment
type: NamedIndividual
type: Activity
type: BusinessClassification
is contemporary version of: http://data.ga-group.nl/ics/trbc/5710201011
is version of: http://data.ga-group.nl/ics/trbc/5710201011
replaces: http://data.ga-group.nl/ics/trbc/2012/5710201011
imported on: 2023-04-07T16:52:39.364811Z
last refreshed on: 2026-06-05T07:16:11.699Z
source accessed on: 2017-12-31T07:04:19Z
source last accessed on: 2021-08-01T01:06:53Z
definition: Companies engaged in providing communication solutions to Service Providers like fixed or mobile operators as well as to Enterprise customers.
notation: 5710201011
valid from: 2020
is activity of: Communications & Networking

Security & Surveillance
type: NamedIndividual
type: Activity
type: BusinessClassification
is contemporary version of: http://data.ga-group.nl/ics/trbc/5710201012
is version of: http://data.ga-group.nl/ics/trbc/5710201012
replaces: http://data.ga-group.nl/ics/trbc/2012/5710201012
imported on: 2023-04-07T16:52:39.364811Z
last refreshed on: 2026-06-05T07:16:11.699Z
source accessed on: 2017-12-31T07:04:19Z
source last accessed on: 2021-08-01T01:06:53Z
definition: Companies engaged in providing intelligent IP surveillance and security solutions. Includes also development and manufacturing of digital recording systems, video content analysis and control center solutions.
notation: 5710201012
valid from: 2020
is activity of: Communications & Networking

Conferencing Tools & Systems
type: NamedIndividual
type: Activity
type: BusinessClassification
is contemporary version of: http://data.ga-group.nl/ics/trbc/5710201013
is version of: http://data.ga-group.nl/ics/trbc/5710201013
replaces: http://data.ga-group.nl/ics/trbc/2012/5710201013
imported on: 2023-04-07T16:52:39.364811Z
last refreshed on: 2026-06-05T07:16:11.699Z
source accessed on: 2017-12-31T07:04:19Z
source last accessed on: 2021-08-01T01:06:53Z
definition: Companies engaged in providing the holding of a series of meetings or conferences. Includes participation in a conference that involves use of a particular electronic technology: audio conferencing; computer conferencing, teleconferencing and videoconferencing.
notation: 5710201013
valid from: 2020
is activity of: Communications & Networking

VOIP Equipment & Systems
type: NamedIndividual
type: Activity
type: BusinessClassification
is contemporary version of: http://data.ga-group.nl/ics/trbc/5710201014
is version of: http://data.ga-group.nl/ics/trbc/5710201014
replaces: http://data.ga-group.nl/ics/trbc/2012/5710201014
imported on: 2023-04-07T16:52:39.364811Z
last refreshed on: 2026-06-05T07:16:11.699Z
source accessed on: 2017-12-31T07:04:19Z
source last accessed on: 2021-08-01T01:06:53Z
definition: Companies engaged in providing equipment and systems for voice-over-telephone protocol (VOIP) technology, such as telephone systems, VOIP-specific adapters and routers. Excludes providers of VOIP services, classified in VOIP Services.
notation: 5710201014
valid from: 2020
is activity of: Communications & Networking

Broadcasting Equipment
type: NamedIndividual
type: Activity
type: BusinessClassification
is contemporary version of: http://data.ga-group.nl/ics/trbc/5710201015
is version of: http://data.ga-group.nl/ics/trbc/5710201015
replaces: http://data.ga-group.nl/ics/trbc/2012/5710201015
imported on: 2023-04-07T16:52:39.364811Z
last refreshed on: 2026-06-05T07:16:11.699Z
source accessed on: 2017-12-31T07:04:19Z
source last accessed on: 2021-08-01T01:06:53Z
definition: Companies engaged in the manufacture of broadcasting and studio systems such as encoders, decoders, amplifiers, transmission and receiving equipment and any other related equipment for television broadcasting, radio broadcasting, cable radio and webcasting.
notation: 5710201015
valid from: 2020
is activity of: Communications & Networking

Satellite Communications Network
type: NamedIndividual
type: Activity
type: BusinessClassification
is contemporary version of: http://data.ga-group.nl/ics/trbc/5710201016
is version of: http://data.ga-group.nl/ics/trbc/5710201016
replaces: http://data.ga-group.nl/ics/trbc/2012/5710201016
imported on: 2023-04-07T16:52:39.364811Z
last refreshed on: 2026-06-05T07:16:11.699Z
source accessed on: 2017-12-31T07:04:19Z
source last accessed on: 2021-08-01T01:06:53Z
definition: Companies engaged in manufacturing equipment and providing services to support the use of satellite networks used in the point-to-point telecommunication and broadcasting industries for sending communication signals via a system of satellites. These firms will often build the ground based technology, and support communications networks and may include additional bespoke devices for corporations to be able to use the network. These firms may also own or lease the satellites.
notation: 5710201016
valid from: 2020
is activity of: Communications & Networking

Fiber Optic Cable Manufacturing
type: NamedIndividual
type: Activity
type: BusinessClassification
is contemporary version of: http://data.ga-group.nl/ics/trbc/5710201017
is version of: http://data.ga-group.nl/ics/trbc/5710201017
replaces: http://data.ga-group.nl/ics/trbc/2012/5710201017
imported on: 2023-04-07T16:52:39.364811Z
last refreshed on: 2026-06-05T07:16:11.699Z
source accessed on: 2017-12-31T07:04:19Z
source last accessed on: 2021-08-01T01:06:53Z
definition: Companies engaged in manufacturing insulated fiber- optic cable from purchased fiber-optic strand.
notation: 5710201017
valid from: 2020
is activity of: Communications & Networking

Communications & Networking
type: NamedIndividual
type: BusinessClassification
type: Industry
is contemporary version of: http://data.ga-group.nl/ics/trbc/57102010
is version of: http://data.ga-group.nl/ics/trbc/57102010
replaces: http://data.ga-group.nl/ics/trbc/2012/57102010
imported on: 2023-04-07T16:52:39.364811Z
last refreshed on: 2026-06-05T07:16:11.699Z
source accessed on: 2017-12-31T07:04:19Z
source last accessed on: 2021-08-01T01:06:53Z
definition: Manufacturers and wholesalers of network equipment, security and surveillance equipment, conferencing tools and systems, voice over internet protocol (VOIP) equipment and systems, broadcasting equipment, satellite communication network equipment and fiber optic cables.
notation: 57102010
valid from: 2020
is industry of: Communications & Networking

Communications & Networking
type: NamedIndividual
type: BusinessClassification
type: IndustryGroup
is contemporary version of: http://data.ga-group.nl/ics/trbc/571020
is version of: http://data.ga-group.nl/ics/trbc/571020
replaces: http://data.ga-group.nl/ics/trbc/2012/571020
imported on: 2023-04-07T16:52:39.364811Z
last refreshed on: 2026-06-05T07:16:11.699Z
source accessed on: 2017-12-31T07:04:19Z
source last accessed on: 2021-08-01T01:06:53Z
definition: Manufacturers of telecommunications equipment such as modems, cable decoders, carrier switches, fiber cable, wireless and satellite communication equipment.
notation: 571020
valid from: 2020
is industry group of: Technology Equipment

Electronic Equipment & Parts (NEC)
type: NamedIndividual
type: Activity
type: BusinessClassification
is contemporary version of: http://data.ga-group.nl/ics/trbc/5710401010
is version of: http://data.ga-group.nl/ics/trbc/5710401010
replaces: http://data.ga-group.nl/ics/trbc/2012/5710401010
imported on: 2023-04-07T16:52:39.364811Z
last refreshed on: 2026-06-05T07:16:11.699Z
source accessed on: 2017-12-31T07:04:19Z
source last accessed on: 2021-08-01T01:06:53Z
definition: Companies engaged in providing manufacturing electronic products, such as biometric, and display screen. Includes also companies providing electronic components.
notation: 5710401010
valid from: 2020
is activity of: Electronic Equipment & Parts

Biometric Products
type: NamedIndividual
type: Activity
type: BusinessClassification
is contemporary version of: http://data.ga-group.nl/ics/trbc/5710401011
is version of: http://data.ga-group.nl/ics/trbc/5710401011
replaces: http://data.ga-group.nl/ics/trbc/2012/5710401011
imported on: 2023-04-07T16:52:39.364811Z
last refreshed on: 2026-06-05T07:16:11.699Z
source accessed on: 2017-12-31T07:04:19Z
source last accessed on: 2021-08-01T01:06:53Z
definition: Companies engaged in providing a method for uniquely recognizing humans based upon one or more intrinsic physical or behavioral traits. Includes biometrics used as a form of identity access management and access control In computer science. It is also used to identify individuals in groups that are under surveillance.
notation: 5710401011
valid from: 2020
is activity of: Electronic Equipment & Parts

Advanced Electronic Equipment
type: NamedIndividual
type: Activity
type: BusinessClassification
is contemporary version of: http://data.ga-group.nl/ics/trbc/5710401012
is version of: http://data.ga-group.nl/ics/trbc/5710401012
replaces: http://data.ga-group.nl/ics/trbc/2012/5710401012
imported on: 2023-04-07T16:52:39.364811Z
last refreshed on: 2026-06-05T07:16:11.699Z
source accessed on: 2017-12-31T07:04:19Z
source last accessed on: 2021-08-01T01:06:53Z
definition: Companies manufacturing advanced robots, and other advanced electronic equipment that is using cutting edge and emerging technologies. Excludes industrial robots, included under Industrial Machinery activity.
notation: 5710401012
valid from: 2020
is activity of: Electronic Equipment & Parts

Display Screens
type: NamedIndividual
type: Activity
type: BusinessClassification
is contemporary version of: http://data.ga-group.nl/ics/trbc/5710401013
is version of: http://data.ga-group.nl/ics/trbc/5710401013
replaces: http://data.ga-group.nl/ics/trbc/2012/5710401013
imported on: 2023-04-07T16:52:39.364811Z
last refreshed on: 2026-06-05T07:16:11.699Z
source accessed on: 2017-12-31T07:04:19Z
source last accessed on: 2021-08-01T01:06:53Z
definition: Companies engaged in providing a flat panel display, electronic visual display, video display. Includes a range of applications, including computer monitors, television, instrument panels, aircraft cockpit displays, signage.
notation: 5710401013
valid from: 2020
is activity of: Electronic Equipment & Parts

Electronic Components
type: NamedIndividual
type: Activity
type: BusinessClassification
is contemporary version of: http://data.ga-group.nl/ics/trbc/5710401014
is version of: http://data.ga-group.nl/ics/trbc/5710401014
replaces: http://data.ga-group.nl/ics/trbc/2012/5710401014
imported on: 2023-04-07T16:52:39.364811Z
last refreshed on: 2026-06-05T07:16:11.699Z
source accessed on: 2017-12-31T07:04:19Z
source last accessed on: 2021-08-01T01:06:53Z
definition: Companies engaged in manufacturing electronic components such as connectors, signal processing components, resistors, capacitors, magnetic electronics, transducers, sensors, detectors, light guide panels, back light units, as well as non-electronic components such as metal or plastic parts of technology products. Includes also electronic manufacturing services (EMS) providers, as well as electronic assembly service providers of technology products not classified in Computer Hardware Component Assembly or Mobile Device Component Assembly.
notation: 5710401014
valid from: 2020
is activity of: Electronic Equipment & Parts

3D Printers
type: NamedIndividual
type: Activity
type: BusinessClassification
is contemporary version of: http://data.ga-group.nl/ics/trbc/5710401015
is version of: http://data.ga-group.nl/ics/trbc/5710401015
imported on: 2023-04-07T17:17:07.492231Z
last refreshed on: 2026-06-05T07:16:11.699Z
source accessed on: 2021-04-25T05:48:36Z
source last accessed on: 2021-08-01T01:06:53Z
definition: Companies engaged in manufacturing 3D printers and their parts, also referred to as additive manufacturing. Includes a range of applications such as aerospace, automotive, consumer goods, medical devices etc.
notation: 5710401015
valid from: 2020
is activity of: Electronic Equipment & Parts

Electronic Equipment & Parts
type: NamedIndividual
type: BusinessClassification
type: Industry
is contemporary version of: http://data.ga-group.nl/ics/trbc/57104010
is version of: http://data.ga-group.nl/ics/trbc/57104010
replaces: http://data.ga-group.nl/ics/trbc/2012/57104010
imported on: 2023-04-07T16:52:39.364811Z
last refreshed on: 2026-06-05T07:16:11.699Z
source accessed on: 2017-12-31T07:04:19Z
source last accessed on: 2021-08-01T01:06:53Z
definition: Manufacturers and wholesalers of electronic products such as biometric, advanced electronic equipment, display screens and electronic and non-electronic components for technology products. Includes companies providing electronic components, electronic manufacturing services (EMS), as well as electronic assembly service of technology products.
notation: 57104010
valid from: 2020
is industry of: Electronic Equipment & Parts

Electronic Equipment & Parts
type: NamedIndividual
type: BusinessClassification
type: IndustryGroup
is contemporary version of: http://data.ga-group.nl/ics/trbc/571040
is version of: http://data.ga-group.nl/ics/trbc/571040
replaces: http://data.ga-group.nl/ics/trbc/2012/571040
imported on: 2023-04-07T16:52:39.364811Z
last refreshed on: 2026-06-05T07:16:11.699Z
source accessed on: 2017-12-31T07:04:19Z
source last accessed on: 2021-08-01T01:06:53Z
definition: Manufacturers of electronic products, such as biometric products, electronic components and parts and display screens.
notation: 571040
valid from: 2020
is industry group of: Technology Equipment

Office Equipment (NEC)
type: NamedIndividual
type: Activity
type: BusinessClassification
is contemporary version of: http://data.ga-group.nl/ics/trbc/5710501010
is version of: http://data.ga-group.nl/ics/trbc/5710501010
replaces: http://data.ga-group.nl/ics/trbc/2012/5710501010
imported on: 2023-04-07T16:52:39.364811Z
last refreshed on: 2026-06-05T07:16:11.699Z
source accessed on: 2017-12-31T07:04:19Z
source last accessed on: 2021-08-01T01:06:53Z
definition: Companies engaged in manufacturing office technology equipment, such as photocopiers, facsimile, calculators, cash registers, bar code readers, electronic tags, coin and currency counting devices, as well as scientific and analytical equipment and precision instruments.
notation: 5710501010
valid from: 2020
is activity of: Office Equipment

Commercial Document Management
type: NamedIndividual
type: Activity
type: BusinessClassification
is contemporary version of: http://data.ga-group.nl/ics/trbc/5710501011
is version of: http://data.ga-group.nl/ics/trbc/5710501011
replaces: http://data.ga-group.nl/ics/trbc/2012/5710501011
imported on: 2023-04-07T16:52:39.364811Z
last refreshed on: 2026-06-05T07:16:11.699Z
source accessed on: 2017-12-31T07:04:19Z
source last accessed on: 2021-08-01T01:06:53Z
definition: Companies engaged in manufacturing hardware for printing, scanning, and photocopy equipment for commercial purposes.
notation: 5710501011
valid from: 2020
is activity of: Office Equipment

Office Technology Equipment
type: NamedIndividual
type: Activity
type: BusinessClassification
is contemporary version of: http://data.ga-group.nl/ics/trbc/5710501012
is version of: http://data.ga-group.nl/ics/trbc/5710501012
replaces: http://data.ga-group.nl/ics/trbc/2012/5710501012
imported on: 2023-04-07T16:52:39.364811Z
last refreshed on: 2026-06-05T07:16:11.699Z
source accessed on: 2017-12-31T07:04:19Z
source last accessed on: 2021-08-01T01:06:53Z
definition: Companies engaged in providing a range of equipment, such as calculator, and digital dictation recorder.
notation: 5710501012
valid from: 2020
is activity of: Office Equipment

Point of Sale Systems
type: NamedIndividual
type: Activity
type: BusinessClassification
is contemporary version of: http://data.ga-group.nl/ics/trbc/5710501013
is version of: http://data.ga-group.nl/ics/trbc/5710501013
replaces: http://data.ga-group.nl/ics/trbc/2012/5710501013
imported on: 2023-04-07T16:52:39.364811Z
last refreshed on: 2026-06-05T07:16:11.699Z
source accessed on: 2017-12-31T07:04:19Z
source last accessed on: 2021-08-01T01:06:53Z
definition: Companies engaged in providing a checkout for the location where a transaction occurs. A checkout refers to a POS terminal or more generally to the hardware and software used for checkouts.
notation: 5710501013
valid from: 2020
is activity of: Office Equipment

Scientific & Precision Equipment
type: NamedIndividual
type: Activity
type: BusinessClassification
is contemporary version of: http://data.ga-group.nl/ics/trbc/5710501014
is version of: http://data.ga-group.nl/ics/trbc/5710501014
replaces: http://data.ga-group.nl/ics/trbc/2012/5710501014
imported on: 2023-04-07T16:52:39.364811Z
last refreshed on: 2026-06-05T07:16:11.699Z
source accessed on: 2017-12-31T07:04:19Z
source last accessed on: 2021-08-01T01:06:53Z
definition: Companies engaged in providing scientific instruments that are part of laboratory equipment. Includes the integration of computers to improve and simplify control, enhance and extend instrumental functions, conditions, parameter adjustments and data sampling, collection, resolution, analysis (both during and post-process), storage and retrieval.
notation: 5710501014
valid from: 2020
is activity of: Office Equipment

Office Equipment Wholesale
type: NamedIndividual
type: Activity
type: BusinessClassification
is contemporary version of: http://data.ga-group.nl/ics/trbc/5710501015
is version of: http://data.ga-group.nl/ics/trbc/5710501015
replaces: http://data.ga-group.nl/ics/trbc/2012/5710501015
imported on: 2023-04-07T16:52:39.364811Z
last refreshed on: 2026-06-05T07:16:11.699Z
source accessed on: 2017-12-31T07:04:19Z
source last accessed on: 2021-08-01T01:06:53Z
definition: Companies engaged in wholesaling office machines and related equipment.
notation: 5710501015
valid from: 2020
is activity of: Office Equipment

Office Equipment
type: NamedIndividual
type: BusinessClassification
type: Industry
is contemporary version of: http://data.ga-group.nl/ics/trbc/57105010
is version of: http://data.ga-group.nl/ics/trbc/57105010
replaces: http://data.ga-group.nl/ics/trbc/2012/57105010
imported on: 2026-06-05T07:16:11.699Z
last refreshed on: 2026-06-05T07:16:11.699Z
source accessed on: 2021-07-28T17:27:51Z
source last accessed on: 2021-07-28T17:27:51Z
definition: Manufacturers and wholesalers of office equipment such as commercial document management equipment, office technology equipment, point of sale systems and scientific and precision equipment.
notation: 57105010
valid from: 2020
is industry of: Office Equipment

Office Equipment
type: NamedIndividual
type: BusinessClassification
type: IndustryGroup
is contemporary version of: http://data.ga-group.nl/ics/trbc/571050
is version of: http://data.ga-group.nl/ics/trbc/571050
replaces: http://data.ga-group.nl/ics/trbc/2012/571050
imported on: 2023-04-07T16:52:39.364811Z
last refreshed on: 2026-06-05T07:16:11.699Z
source accessed on: 2017-12-31T07:04:19Z
source last accessed on: 2021-08-01T01:06:53Z
definition: Manufacturers of office technology equipment, such as photocopiers, facsimile, calculators, cash registers, bar code readers, electronic tags, coin and currency counting devices, as well as scientific and analytical equipment and precision instruments.
notation: 571050
valid from: 2020
is industry group of: Technology Equipment

Computer Hardware (NEC)
type: NamedIndividual
type: Activity
type: BusinessClassification
is contemporary version of: http://data.ga-group.nl/ics/trbc/5710601010
is version of: http://data.ga-group.nl/ics/trbc/5710601010
replaces: http://data.ga-group.nl/ics/trbc/2012/5710601010
imported on: 2023-04-07T16:52:39.364811Z
last refreshed on: 2026-06-05T07:16:11.699Z
source accessed on: 2017-12-31T07:04:19Z
source last accessed on: 2021-08-01T01:06:53Z
definition: Companies engaged in assembling and manufacturing computers, computer hardware and computer peripherals. Includes manufacturers of storage devices, circuit boards, keyboards, printers, monitors, pointing devices, webcams and PC cameras, as well as ATM machines. Includes also wholesalers of computer goods.
notation: 5710601010
valid from: 2020
is activity of: Computer Hardware

Scientific & Super Computers
type: NamedIndividual
type: Activity
type: BusinessClassification
is contemporary version of: http://data.ga-group.nl/ics/trbc/5710601011
is version of: http://data.ga-group.nl/ics/trbc/5710601011
replaces: http://data.ga-group.nl/ics/trbc/2012/5710601011
imported on: 2023-04-07T16:52:39.364811Z
last refreshed on: 2026-06-05T07:16:11.699Z
source accessed on: 2017-12-31T07:04:19Z
source last accessed on: 2021-08-01T01:06:53Z
definition: Companies engaged in the field of study concerned with constructing mathematical models and quantitative analysis techniques and using computers to analyze and solve scientific problems.
notation: 5710601011
valid from: 2020
is activity of: Computer Hardware

Laptop & Desktop Computers
type: NamedIndividual
type: Activity
type: BusinessClassification
is contemporary version of: http://data.ga-group.nl/ics/trbc/5710601012
is version of: http://data.ga-group.nl/ics/trbc/5710601012
replaces: http://data.ga-group.nl/ics/trbc/2012/5710601012
imported on: 2023-04-07T16:52:39.364811Z
last refreshed on: 2026-06-05T07:16:11.699Z
source accessed on: 2017-12-31T07:04:19Z
source last accessed on: 2021-08-01T01:06:53Z
definition: Companies engaged in providing a personal computer (PC) in a form intended for regular use at a single location. Includes producers of notebooks, but excludes producers of netbooks, classified in Tablet & Netbook Computers.
notation: 5710601012
valid from: 2020
is activity of: Computer Hardware

Tablet & Netbook Computers
type: NamedIndividual
type: Activity
type: BusinessClassification
is contemporary version of: http://data.ga-group.nl/ics/trbc/5710601013
is version of: http://data.ga-group.nl/ics/trbc/5710601013
replaces: http://data.ga-group.nl/ics/trbc/2012/5710601013
imported on: 2023-04-07T16:52:39.364811Z
last refreshed on: 2026-06-05T07:16:11.699Z
source accessed on: 2017-12-31T07:04:19Z
source last accessed on: 2021-08-01T01:06:53Z
definition: Companies engaged in manufacturing mobile computers, which is generally operated by touching screen rather than using keyboard. Includes also producers of netbooks that are laptops which are small in size compared to notebooks.
notation: 5710601013
valid from: 2020
is activity of: Computer Hardware

Input Devices
type: NamedIndividual
type: Activity
type: BusinessClassification
is contemporary version of: http://data.ga-group.nl/ics/trbc/5710601014
is version of: http://data.ga-group.nl/ics/trbc/5710601014
replaces: http://data.ga-group.nl/ics/trbc/2012/5710601014
imported on: 2023-04-07T16:52:39.364811Z
last refreshed on: 2026-06-05T07:16:11.699Z
source accessed on: 2017-12-31T07:04:19Z
source last accessed on: 2021-08-01T01:06:53Z
definition: Companies engaged in manufacturing computer peripheral equipment used as input-only devices, such as keyboards, mice, touch screens, image scanners, microphones, web cameras, joysticks and light pens. Excludes manufacturing of computer output devices, such as computer monitors, loudspeakers, printers, tape drives, sound cards, video cards and others, classified in Output Devices.
notation: 5710601014
valid from: 2020
is activity of: Computer Hardware

Output Devices
type: NamedIndividual
type: Activity
type: BusinessClassification
is contemporary version of: http://data.ga-group.nl/ics/trbc/5710601015
is version of: http://data.ga-group.nl/ics/trbc/5710601015
replaces: http://data.ga-group.nl/ics/trbc/2012/5710601015
imported on: 2023-04-07T16:52:39.364811Z
last refreshed on: 2026-06-05T07:16:11.699Z
source accessed on: 2017-12-31T07:04:19Z
source last accessed on: 2021-08-01T01:06:53Z
definition: Companies engaged in manufacturing computer peripheral equipment used as output-only devices, such as computer monitors, loudspeakers, printers, tape drives, sound cards and video cards. Excludes manufacturing of computer input devices, such as keyboards, mice, touch screens, image scanners, microphones, web cameras, joysticks, light pens and others, classified in Input Devices.
notation: 5710601015
valid from: 2020
is activity of: Computer Hardware

Servers & Systems
type: NamedIndividual
type: Activity
type: BusinessClassification
is contemporary version of: http://data.ga-group.nl/ics/trbc/5710601016
is version of: http://data.ga-group.nl/ics/trbc/5710601016
replaces: http://data.ga-group.nl/ics/trbc/2012/5710601016
imported on: 2023-04-07T16:52:39.364811Z
last refreshed on: 2026-06-05T07:16:11.699Z
source accessed on: 2017-12-31T07:04:19Z
source last accessed on: 2021-08-01T01:06:53Z
definition: Companies engaged in providing and/or assembling computer servers, such as application servers, web servers, database servers, game servers, proxy servers, file servers, server farms and clusters, among others, together with or without associated operating systems (OS) among servers, such as open source distributions. Includes also providers of mainframes and workstations. Excludes companies that exclusively publish operating systems software (system software that manages software and hardware resources within the system), classified in System Software.
notation: 5710601016
valid from: 2020
is activity of: Computer Hardware

Storage Devices
type: NamedIndividual
type: Activity
type: BusinessClassification
is contemporary version of: http://data.ga-group.nl/ics/trbc/5710601017
is version of: http://data.ga-group.nl/ics/trbc/5710601017
replaces: http://data.ga-group.nl/ics/trbc/2012/5710601017
imported on: 2023-04-07T16:52:39.364811Z
last refreshed on: 2026-06-05T07:16:11.699Z
source accessed on: 2017-12-31T07:04:19Z
source last accessed on: 2021-08-01T01:06:53Z
definition: Companies engaged in manufacturing computer storage devices that allow the storage and retrieval of data from a phase change, magnetic, optical, or magnetic/optical media. Includes CD-ROM drives, floppy disk drives, hard disk drives, and tape storage and backup units.
notation: 5710601017
valid from: 2020
is activity of: Computer Hardware

Computer Hardware Component Assembly
type: NamedIndividual
type: Activity
type: BusinessClassification
is contemporary version of: http://data.ga-group.nl/ics/trbc/5710601018
is version of: http://data.ga-group.nl/ics/trbc/5710601018
replaces: http://data.ga-group.nl/ics/trbc/2012/5710601018
imported on: 2023-04-07T16:52:39.364811Z
last refreshed on: 2026-06-05T07:16:11.699Z
source accessed on: 2017-12-31T07:04:19Z
source last accessed on: 2021-08-01T01:06:53Z
definition: Companies engaged in providing component devices which are typically installed into or peripheral to a computer case to create a personal computer upon which system software is installed including a firmware interface such as a BIOS and an operating system which supports application software that performs the operator's desired functions.
notation: 5710601018
valid from: 2020
is activity of: Computer Hardware

Consumer Document Management
type: NamedIndividual
type: Activity
type: BusinessClassification
is contemporary version of: http://data.ga-group.nl/ics/trbc/5710601019
is version of: http://data.ga-group.nl/ics/trbc/5710601019
replaces: http://data.ga-group.nl/ics/trbc/2012/5710601019
imported on: 2023-04-07T16:52:39.364811Z
last refreshed on: 2026-06-05T07:16:11.699Z
source accessed on: 2017-12-31T07:04:19Z
source last accessed on: 2021-08-01T01:06:53Z
definition: Companies engaged in manufacturing hardware for printing, scanning, and photocopy equipment for consumers.
notation: 5710601019
valid from: 2020
is activity of: Computer Hardware

Computer Hardware
type: NamedIndividual
type: BusinessClassification
type: Industry
is contemporary version of: http://data.ga-group.nl/ics/trbc/57106010
is version of: http://data.ga-group.nl/ics/trbc/57106010
replaces: http://data.ga-group.nl/ics/trbc/2012/57106010
imported on: 2023-04-07T16:52:39.364811Z
last refreshed on: 2026-06-05T07:16:11.699Z
source accessed on: 2017-12-31T07:04:19Z
source last accessed on: 2021-08-01T01:06:53Z
definition: Assemblers, manufacturers and wholesalers of computers, computer hardware and computer peripherals. Includes producers of scientific and super computers, tablet and netbook computers, input devices, computer peripherals, servers and systems, storage devices, consumer document management equipment, as well as ATM machines.
notation: 57106010
valid from: 2020
is industry of: Computers, Phones & Household Electronics

Phones & Handheld Devices (NEC)
type: NamedIndividual
type: Activity
type: BusinessClassification
is contemporary version of: http://data.ga-group.nl/ics/trbc/5710602010
is version of: http://data.ga-group.nl/ics/trbc/5710602010
replaces: http://data.ga-group.nl/ics/trbc/2012/5710602010
imported on: 2023-04-07T16:52:39.364811Z
last refreshed on: 2026-06-05T07:16:11.699Z
source accessed on: 2017-12-31T07:04:19Z
source last accessed on: 2021-08-01T01:06:53Z
definition: Companies engaged in manufacturing cellular phones, and handheld devices, including handheld music players, and portable satellite navigation systems. Includes also wholesalers of phones or handheld devices.
notation: 5710602010
valid from: 2020
is activity of: Phones & Handheld Devices

Phones & Smart Phones
type: NamedIndividual
type: Activity
type: BusinessClassification
is contemporary version of: http://data.ga-group.nl/ics/trbc/5710602011
is version of: http://data.ga-group.nl/ics/trbc/5710602011
replaces: http://data.ga-group.nl/ics/trbc/2012/5710602011
imported on: 2023-04-07T16:52:39.364811Z
last refreshed on: 2026-06-05T07:16:11.699Z
source accessed on: 2017-12-31T07:04:19Z
source last accessed on: 2021-08-01T01:06:53Z
definition: Companies engaged in providing a mobile phone built on a mobile computing platform, with more advanced computing ability and connectivity than a contemporary feature phone.
notation: 5710602011
valid from: 2020
is activity of: Phones & Handheld Devices

Portable Satellite Navigation
type: NamedIndividual
type: Activity
type: BusinessClassification
is contemporary version of: http://data.ga-group.nl/ics/trbc/5710602012
is version of: http://data.ga-group.nl/ics/trbc/5710602012
replaces: http://data.ga-group.nl/ics/trbc/2012/5710602012
imported on: 2023-04-07T16:52:39.364811Z
last refreshed on: 2026-06-05T07:16:11.699Z
source accessed on: 2017-12-31T07:04:19Z
source last accessed on: 2021-08-01T01:06:53Z
definition: Companies engaged in providing a system of satellites that provide autonomous geo-spatial positioning with global coverage. Includes companies that allow small electronic receivers to determine their location (longitude, latitude, and altitude) to within a few meters using time signals transmitted along a line-of-sight by radio from satellites.
notation: 5710602012
valid from: 2020
is activity of: Phones & Handheld Devices

Personal Music Players
type: NamedIndividual
type: Activity
type: BusinessClassification
is contemporary version of: http://data.ga-group.nl/ics/trbc/5710602013
is version of: http://data.ga-group.nl/ics/trbc/5710602013
replaces: http://data.ga-group.nl/ics/trbc/2012/5710602013
imported on: 2023-04-07T16:52:39.364811Z
last refreshed on: 2026-06-05T07:16:11.699Z
source accessed on: 2017-12-31T07:04:19Z
source last accessed on: 2021-08-01T01:06:53Z
definition: Companies engaged in providing a consumer electronics device that is capable of storing and playing digital media such as audio, images, video, documents.
notation: 5710602013
valid from: 2020
is activity of: Phones & Handheld Devices

Electronic Books
type: NamedIndividual
type: Activity
type: BusinessClassification
is contemporary version of: http://data.ga-group.nl/ics/trbc/5710602014
is version of: http://data.ga-group.nl/ics/trbc/5710602014
replaces: http://data.ga-group.nl/ics/trbc/2012/5710602014
imported on: 2023-04-07T16:52:39.364811Z
last refreshed on: 2026-06-05T07:16:11.699Z
source accessed on: 2017-12-31T07:04:19Z
source last accessed on: 2021-08-01T01:06:53Z
definition: Companies engaged in providing a book-length publication in digital form, consisting of text, images, or both, and produced on, published through, and readable on computers or other electronic devices.
notation: 5710602014
valid from: 2020
is activity of: Phones & Handheld Devices

Mobile Device Component Assembly
type: NamedIndividual
type: Activity
type: BusinessClassification
is contemporary version of: http://data.ga-group.nl/ics/trbc/5710602015
is version of: http://data.ga-group.nl/ics/trbc/5710602015
replaces: http://data.ga-group.nl/ics/trbc/2012/5710602015
imported on: 2023-04-07T16:52:39.364811Z
last refreshed on: 2026-06-05T07:16:11.699Z
source accessed on: 2017-12-31T07:04:19Z
source last accessed on: 2021-08-01T01:06:53Z
definition: Companies engaged in providing a spacer that is used in a mobile device to fill the space between a component assembly and housing. The spacer includes a layer of compressible material for insertion between the component assembly and the housing.
notation: 5710602015
valid from: 2020
is activity of: Phones & Handheld Devices

Phones & Handheld Devices
type: NamedIndividual
type: BusinessClassification
type: Industry
is contemporary version of: http://data.ga-group.nl/ics/trbc/57106020
is version of: http://data.ga-group.nl/ics/trbc/57106020
replaces: http://data.ga-group.nl/ics/trbc/2012/57106020
imported on: 2023-04-07T16:52:39.364811Z
last refreshed on: 2026-06-05T07:16:11.699Z
source accessed on: 2017-12-31T07:04:19Z
source last accessed on: 2021-08-01T01:06:53Z
definition: Manufacturers, assemblers and wholesalers of cellular phones, and handheld devices. Includes handheld music players, and portable satellite navigation systems.
notation: 57106020
valid from: 2020
is industry of: Computers, Phones & Household Electronics

Household Electronics (NEC)
type: NamedIndividual
type: Activity
type: BusinessClassification
is contemporary version of: http://data.ga-group.nl/ics/trbc/5710603010
is version of: http://data.ga-group.nl/ics/trbc/5710603010
replaces: http://data.ga-group.nl/ics/trbc/2012/5710603010
imported on: 2023-04-07T16:52:39.364811Z
last refreshed on: 2026-06-05T07:16:11.699Z
source accessed on: 2017-12-31T07:04:19Z
source last accessed on: 2021-08-01T01:06:53Z
definition: Companies engaged in the manufacturing of home audio and video equipment such as television sets, VCR and DVD players, home projection equipment, stereo systems, consumer-oriented photographic equipment and other related electronics.
notation: 5710603010
valid from: 2020
is activity of: Household Electronics

Photographic Equipment
type: NamedIndividual
type: Activity
type: BusinessClassification
is contemporary version of: http://data.ga-group.nl/ics/trbc/5710603011
is version of: http://data.ga-group.nl/ics/trbc/5710603011
replaces: http://data.ga-group.nl/ics/trbc/2012/5710603011
imported on: 2023-04-07T16:52:39.364811Z
last refreshed on: 2026-06-05T07:16:11.699Z
source accessed on: 2017-12-31T07:04:19Z
source last accessed on: 2021-08-01T01:06:53Z
definition: Companies engaged in providing a range of products, such as cameras, photographic chemicals, flash photography, instant photography, lens mounts, photographic lenses, optical filters, photographic films and photographic shutters.
notation: 5710603011
valid from: 2020
is activity of: Household Electronics

TV & Video
type: NamedIndividual
type: Activity
type: BusinessClassification
is contemporary version of: http://data.ga-group.nl/ics/trbc/5710603012
is version of: http://data.ga-group.nl/ics/trbc/5710603012
replaces: http://data.ga-group.nl/ics/trbc/2012/5710603012
imported on: 2023-04-07T16:52:39.364811Z
last refreshed on: 2026-06-05T07:16:11.699Z
source accessed on: 2017-12-31T07:04:19Z
source last accessed on: 2021-08-01T01:06:53Z
definition: Companies engaged in providing a telecommunication medium for transmitting and receiving moving images that can be monochrome (black-and-white) or colored, with accompanying sound. Includes also providers of technology for electronically capturing, recording, processing, storing, transmitting, and reconstructing a sequence of still images representing scenes in motion.
notation: 5710603012
valid from: 2020
is activity of: Household Electronics

Home Audio
type: NamedIndividual
type: Activity
type: BusinessClassification
is contemporary version of: http://data.ga-group.nl/ics/trbc/5710603013
is version of: http://data.ga-group.nl/ics/trbc/5710603013
replaces: http://data.ga-group.nl/ics/trbc/2012/5710603013
imported on: 2023-04-07T16:52:39.364811Z
last refreshed on: 2026-06-05T07:16:11.699Z
source accessed on: 2017-12-31T07:04:19Z
source last accessed on: 2021-08-01T01:06:53Z
definition: Companies engaged in providing any audio electronics intended for home use, such as shelf stereos and surround sound receivers.
notation: 5710603013
valid from: 2020
is activity of: Household Electronics

Consumer Electronic Wholesale
type: NamedIndividual
type: Activity
type: BusinessClassification
is contemporary version of: http://data.ga-group.nl/ics/trbc/5710603014
is version of: http://data.ga-group.nl/ics/trbc/5710603014
replaces: http://data.ga-group.nl/ics/trbc/2012/5710603014
imported on: 2023-04-07T16:52:39.364811Z
last refreshed on: 2026-06-05T07:16:11.699Z
source accessed on: 2017-12-31T07:04:19Z
source last accessed on: 2021-08-01T01:06:53Z
definition: Companies engaged in wholesaling household-type electrical appliances, room air-conditioners, gas clothes dryers, and/or household-type audio or video equipment.
notation: 5710603014
valid from: 2020
is activity of: Household Electronics

Household Electronics
type: NamedIndividual
type: BusinessClassification
type: Industry
is contemporary version of: http://data.ga-group.nl/ics/trbc/57106030
is version of: http://data.ga-group.nl/ics/trbc/57106030
replaces: http://data.ga-group.nl/ics/trbc/2012/57106030
imported on: 2023-04-07T16:52:39.364811Z
last refreshed on: 2026-06-05T07:16:11.699Z
source accessed on: 2017-12-31T07:04:19Z
source last accessed on: 2021-08-01T01:06:53Z
definition: Manufacturers and wholesalers of home audio and video equipment, such as television sets, VCR and DVD players, home projection equipment, stereo systems, consumer-oriented photographic equipment and other related electronics.
notation: 57106030
valid from: 2020
is industry of: Computers, Phones & Household Electronics

Computers, Phones & Household Electronics
type: NamedIndividual
type: BusinessClassification
type: IndustryGroup
is contemporary version of: http://data.ga-group.nl/ics/trbc/571060
is version of: http://data.ga-group.nl/ics/trbc/571060
replaces: http://data.ga-group.nl/ics/trbc/2012/571060
imported on: 2023-04-07T16:52:39.364811Z
last refreshed on: 2026-06-05T07:16:11.699Z
source accessed on: 2017-12-31T07:04:19Z
source last accessed on: 2021-08-01T01:06:53Z
definition: Manufacturers of computer hardware and peripherals, phones & handheld devices, as well as household electronic equipment.
notation: 571060
valid from: 2020
is industry group of: Technology Equipment

Integrated Hardware & Software
type: NamedIndividual
type: Activity
type: BusinessClassification
is contemporary version of: http://data.ga-group.nl/ics/trbc/5710701010
is version of: http://data.ga-group.nl/ics/trbc/5710701010
imported on: 2023-04-07T17:17:07.492231Z
last refreshed on: 2026-06-05T07:16:11.699Z
source accessed on: 2021-04-25T05:48:36Z
source last accessed on: 2021-08-01T01:06:53Z
definition: Companies engaged in the provision of both software and hardware solutions, none being dominant, or integrated software/hardware solutions.
notation: 5710701010
valid from: 2020
is activity of: Integrated Hardware & Software

Integrated Hardware & Software
type: NamedIndividual
type: BusinessClassification
type: Industry
is contemporary version of: http://data.ga-group.nl/ics/trbc/57107010
is version of: http://data.ga-group.nl/ics/trbc/57107010
imported on: 2023-04-07T17:17:07.492231Z
last refreshed on: 2026-06-05T07:16:11.699Z
source accessed on: 2021-04-25T05:48:36Z
source last accessed on: 2021-08-01T01:06:53Z
definition: Companies engaged in the provision of both software and hardware solutions, or integrated software/hardware solutions.
notation: 57107010
valid from: 2020
is industry of: Integrated Hardware & Software

Integrated Hardware & Software
type: NamedIndividual
type: BusinessClassification
type: IndustryGroup
is contemporary version of: http://data.ga-group.nl/ics/trbc/571070
is version of: http://data.ga-group.nl/ics/trbc/571070
imported on: 2023-04-07T17:17:07.492231Z
last refreshed on: 2026-06-05T07:16:11.699Z
source accessed on: 2021-04-25T05:48:36Z
source last accessed on: 2021-08-01T01:06:53Z
definition: Companies engaged in the provision of both software and hardware solutions, or integrated software/hardware solutions.
notation: 571070
valid from: 2020
is industry group of: Technology Equipment

Technology Equipment
type: NamedIndividual
type: BusinessClassification
type: BusinessSector
is contemporary version of: http://data.ga-group.nl/ics/trbc/5710
is version of: http://data.ga-group.nl/ics/trbc/5710
replaces: http://data.ga-group.nl/ics/trbc/2012/5710
imported on: 2023-04-07T16:52:39.364811Z
last refreshed on: 2026-06-05T07:16:11.699Z
source accessed on: 2017-12-31T07:04:19Z
source last accessed on: 2021-08-01T01:06:53Z
definition: Manufacturers of semiconductors, communications equipment, computer hardware and software and technology-related office equipment, electronic equipment and components, household/consumer electronics, phones, handhelds, and related office equipment as well as providers of consulting and IT services.
notation: 5710
valid from: 2020
is business sector of: Technology

IT Services & Consulting (NEC)
type: NamedIndividual
type: Activity
type: BusinessClassification
is contemporary version of: http://data.ga-group.nl/ics/trbc/5720101010
is version of: http://data.ga-group.nl/ics/trbc/5720101010
replaces: http://data.ga-group.nl/ics/trbc/2012/5720101010
imported on: 2023-04-07T16:52:39.364811Z
last refreshed on: 2026-06-05T07:16:11.699Z
source accessed on: 2017-12-31T07:04:19Z
source last accessed on: 2021-08-01T01:06:53Z
definition: Companies engaged in providing customized software development, ISP providers, online support services, online database management, interactive data access and auctioning services.
notation: 5720101010
valid from: 2020
is activity of: IT Services & Consulting

Computer Programming
type: NamedIndividual
type: Activity
type: BusinessClassification
is contemporary version of: http://data.ga-group.nl/ics/trbc/5720101011
is version of: http://data.ga-group.nl/ics/trbc/5720101011
replaces: http://data.ga-group.nl/ics/trbc/2012/5720101011
imported on: 2023-04-07T16:52:39.364811Z
last refreshed on: 2026-06-05T07:16:11.699Z
source accessed on: 2017-12-31T07:04:19Z
source last accessed on: 2021-08-01T01:06:53Z
definition: Companies engaged in providing customized software development services. Excludes specialized testing services classified under Testing Services activity.
notation: 5720101011
valid from: 2020
is activity of: IT Services & Consulting

Computer Training
type: NamedIndividual
type: Activity
type: BusinessClassification
is contemporary version of: http://data.ga-group.nl/ics/trbc/5720101012
is version of: http://data.ga-group.nl/ics/trbc/5720101012
replaces: http://data.ga-group.nl/ics/trbc/2012/5720101012
imported on: 2023-04-07T16:52:39.364811Z
last refreshed on: 2026-06-05T07:16:11.699Z
source accessed on: 2017-12-31T07:04:19Z
source last accessed on: 2021-08-01T01:06:53Z
definition: Companies engaged in providing the knowledge and ability to use computers and related technology efficiently, with a range of skills covering levels from elementary use to programming and advanced problem solving.
notation: 5720101012
valid from: 2020
is activity of: IT Services & Consulting

Technology Consulting & Outsourcing Services
type: NamedIndividual
type: Activity
type: BusinessClassification
is contemporary version of: http://data.ga-group.nl/ics/trbc/5720101013
is version of: http://data.ga-group.nl/ics/trbc/5720101013
replaces: http://data.ga-group.nl/ics/trbc/2012/5720101013
imported on: 2023-04-07T16:52:39.364811Z
last refreshed on: 2026-06-05T07:16:11.699Z
source accessed on: 2017-12-31T07:04:19Z
source last accessed on: 2021-08-01T01:06:53Z
definition: Companies engaged in technology advising, computer facility management service, and system integration. Includes also outsourcing services, such as information technology outsourcing wherein a company outsources computer or Internet related work, such as programming, from other companies.
notation: 5720101013
valid from: 2020
is activity of: IT Services & Consulting

IT Testing Services
type: NamedIndividual
type: Activity
type: BusinessClassification
is contemporary version of: http://data.ga-group.nl/ics/trbc/5720101014
is version of: http://data.ga-group.nl/ics/trbc/5720101014
replaces: http://data.ga-group.nl/ics/trbc/2012/5720101014
imported on: 2023-04-07T16:52:39.364811Z
last refreshed on: 2026-06-05T07:16:11.699Z
source accessed on: 2017-12-31T07:04:19Z
source last accessed on: 2021-08-01T01:06:53Z
definition: Companies engaged in providing a set of principles and methodologies for designing and developing software in the form of interoperable services. Includes services that are business functionalities that are built as software components (discrete pieces of code and/or data structures) that can be reused for different purposes.
notation: 5720101014
valid from: 2020
is activity of: IT Services & Consulting

Cloud Computing Services
type: NamedIndividual
type: Activity
type: BusinessClassification
is contemporary version of: http://data.ga-group.nl/ics/trbc/5720101015
is version of: http://data.ga-group.nl/ics/trbc/5720101015
replaces: http://data.ga-group.nl/ics/trbc/2012/5720101015
imported on: 2023-04-07T16:52:39.364811Z
last refreshed on: 2026-06-05T07:16:11.699Z
source accessed on: 2017-12-31T07:04:19Z
source last accessed on: 2021-08-01T01:06:53Z
definition: Companies engaged in the delivery of computing as a service rather than a product, whereby shared resources, software, and information are provided to computers and other devices as a utility (like the electricity grid) over a network (typically the Internet).
notation: 5720101015
valid from: 2020
is activity of: IT Services & Consulting

Machine Learning & Artificial Intelligence (AI) Services
type: NamedIndividual
type: Activity
type: BusinessClassification
is contemporary version of: http://data.ga-group.nl/ics/trbc/5720101016
is version of: http://data.ga-group.nl/ics/trbc/5720101016
imported on: 2023-04-07T17:17:07.492231Z
last refreshed on: 2026-06-05T07:16:11.699Z
source accessed on: 2021-04-25T05:48:36Z
source last accessed on: 2021-08-01T01:06:53Z
definition: Companies engaged in the provision of machine learning or artificial intelligence services.
notation: 5720101016
valid from: 2020
is activity of: IT Services & Consulting

IT Services & Consulting
type: NamedIndividual
type: BusinessClassification
type: Industry
is contemporary version of: http://data.ga-group.nl/ics/trbc/57201010
is version of: http://data.ga-group.nl/ics/trbc/57201010
replaces: http://data.ga-group.nl/ics/trbc/2012/57201010
imported on: 2023-04-07T16:52:39.364811Z
last refreshed on: 2026-06-05T07:16:11.699Z
source accessed on: 2017-12-31T07:04:19Z
source last accessed on: 2021-08-01T01:06:53Z
definition: Providers of computer programming, computer training, technology consulting and outsourcing, testing and cloud computing services.
notation: 57201010
valid from: 2020
is industry of: Software & IT Services

Software (NEC)
type: NamedIndividual
type: Activity
type: BusinessClassification
is contemporary version of: http://data.ga-group.nl/ics/trbc/5720102010
is version of: http://data.ga-group.nl/ics/trbc/5720102010
replaces: http://data.ga-group.nl/ics/trbc/2012/5720102010
imported on: 2023-04-07T16:52:39.364811Z
last refreshed on: 2026-06-05T07:16:11.699Z
source accessed on: 2017-12-31T07:04:19Z
source last accessed on: 2021-08-01T01:06:53Z
definition: Companies engaged in developing and marketing system and application software. Includes developers of operating systems, word processors, spreadsheet applications, CAD and database engines.
notation: 5720102010
valid from: 2020
is activity of: Software

System Software
type: NamedIndividual
type: Activity
type: BusinessClassification
is contemporary version of: http://data.ga-group.nl/ics/trbc/5720102011
is version of: http://data.ga-group.nl/ics/trbc/5720102011
replaces: http://data.ga-group.nl/ics/trbc/2012/5720102011
imported on: 2023-04-07T16:52:39.364811Z
last refreshed on: 2026-06-05T07:16:11.699Z
source accessed on: 2017-12-31T07:04:19Z
source last accessed on: 2021-08-01T01:06:53Z
definition: Companies engaged in developing and marketing system software.
notation: 5720102011
valid from: 2020
is activity of: Software

Application Software
type: NamedIndividual
type: Activity
type: BusinessClassification
is contemporary version of: http://data.ga-group.nl/ics/trbc/5720102012
is version of: http://data.ga-group.nl/ics/trbc/5720102012
replaces: http://data.ga-group.nl/ics/trbc/2012/5720102012
imported on: 2023-04-07T16:52:39.364811Z
last refreshed on: 2026-06-05T07:16:11.699Z
source accessed on: 2017-12-31T07:04:19Z
source last accessed on: 2021-08-01T01:06:53Z
definition: Companies engaged in providing computer software designed to help the user to perform specific tasks. Includes enterprise software, accounting software, office suites, graphics software and media players.
notation: 5720102012
valid from: 2020
is activity of: Software

Enterprise Software
type: NamedIndividual
type: Activity
type: BusinessClassification
is contemporary version of: http://data.ga-group.nl/ics/trbc/5720102013
is version of: http://data.ga-group.nl/ics/trbc/5720102013
replaces: http://data.ga-group.nl/ics/trbc/2012/5720102013
imported on: 2023-04-07T16:52:39.364811Z
last refreshed on: 2026-06-05T07:16:11.699Z
source accessed on: 2017-12-31T07:04:19Z
source last accessed on: 2021-08-01T01:06:53Z
definition: Companies engaged in providing is software used in organizations, such as in a business or government. Includes online shopping and online payment processing, interactive product catalogue, automated billing systems, security, content management, IT service management, customer relationship management, resource planning, business intelligence, HR management, manufacturing, application integration, and forms automation.
notation: 5720102013
valid from: 2020
is activity of: Software

Mobile Application Software
type: NamedIndividual
type: Activity
type: BusinessClassification
is contemporary version of: http://data.ga-group.nl/ics/trbc/5720102014
is version of: http://data.ga-group.nl/ics/trbc/5720102014
replaces: http://data.ga-group.nl/ics/trbc/2012/5720102014
imported on: 2023-04-07T16:52:39.364811Z
last refreshed on: 2026-06-05T07:16:11.699Z
source accessed on: 2017-12-31T07:04:19Z
source last accessed on: 2021-08-01T01:06:53Z
definition: Companies engaged in the process by which application software is developed for small low-power handheld devices such as personal digital assistants, enterprise digital assistants or mobile phones.
notation: 5720102014
valid from: 2020
is activity of: Software

Mobile System Software
type: NamedIndividual
type: Activity
type: BusinessClassification
is contemporary version of: http://data.ga-group.nl/ics/trbc/5720102015
is version of: http://data.ga-group.nl/ics/trbc/5720102015
replaces: http://data.ga-group.nl/ics/trbc/2012/5720102015
imported on: 2023-04-07T16:52:39.364811Z
last refreshed on: 2026-06-05T07:16:11.699Z
source accessed on: 2017-12-31T07:04:19Z
source last accessed on: 2021-08-01T01:06:53Z
definition: Companies engaged in providing an operating system that controls a mobile device or information appliance.
notation: 5720102015
valid from: 2020
is activity of: Software

Programming Software & Testing Tools
type: NamedIndividual
type: Activity
type: BusinessClassification
is contemporary version of: http://data.ga-group.nl/ics/trbc/5720102016
is version of: http://data.ga-group.nl/ics/trbc/5720102016
replaces: http://data.ga-group.nl/ics/trbc/2012/5720102016
imported on: 2023-04-07T16:52:39.364811Z
last refreshed on: 2026-06-05T07:16:11.699Z
source accessed on: 2017-12-31T07:04:19Z
source last accessed on: 2021-08-01T01:06:53Z
definition: Companies engaged in providing a program or application that software developers use to create, debug, maintain, or otherwise support other programs and applications.
notation: 5720102016
valid from: 2020
is activity of: Software

Server & Database Software
type: NamedIndividual
type: Activity
type: BusinessClassification
is contemporary version of: http://data.ga-group.nl/ics/trbc/5720102017
is version of: http://data.ga-group.nl/ics/trbc/5720102017
replaces: http://data.ga-group.nl/ics/trbc/2012/5720102017
imported on: 2023-04-07T16:52:39.364811Z
last refreshed on: 2026-06-05T07:16:11.699Z
source accessed on: 2017-12-31T07:04:19Z
source last accessed on: 2021-08-01T01:06:53Z
definition: Companies engaged in providing a computer program that provides database services to other computer programs or computers, as defined by the client server model.
notation: 5720102017
valid from: 2020
is activity of: Software

Security Software
type: NamedIndividual
type: Activity
type: BusinessClassification
is contemporary version of: http://data.ga-group.nl/ics/trbc/5720102018
is version of: http://data.ga-group.nl/ics/trbc/5720102018
imported on: 2023-04-07T17:17:07.492231Z
last refreshed on: 2026-06-05T07:16:11.699Z
source accessed on: 2021-04-25T05:48:36Z
source last accessed on: 2021-08-01T01:06:53Z
definition: Companies engaged in access control, provides data protection, secures the system against viruses and network/Internet based intrusions.
notation: 5720102018
valid from: 2020
is activity of: Software

Software
type: NamedIndividual
type: BusinessClassification
type: Industry
is contemporary version of: http://data.ga-group.nl/ics/trbc/57201020
is version of: http://data.ga-group.nl/ics/trbc/57201020
replaces: http://data.ga-group.nl/ics/trbc/2012/57201020
imported on: 2023-04-07T16:52:39.364811Z
last refreshed on: 2026-06-05T07:16:11.699Z
source accessed on: 2017-12-31T07:04:19Z
source last accessed on: 2021-08-01T01:06:53Z
definition: Designers, developers and marketers of system software, application software, enterprise software, mobile application software, programming software and testing tools, and server and database software.
notation: 57201020
valid from: 2020
is industry of: Software & IT Services

Online Services (NEC)
type: NamedIndividual
type: Activity
type: BusinessClassification
is contemporary version of: http://data.ga-group.nl/ics/trbc/5720103010
is version of: http://data.ga-group.nl/ics/trbc/5720103010
replaces: http://data.ga-group.nl/ics/trbc/2012/5720103010
imported on: 2023-04-07T16:52:39.364811Z
last refreshed on: 2026-06-05T07:16:11.699Z
source accessed on: 2017-12-31T07:04:19Z
source last accessed on: 2021-08-01T01:06:53Z
definition: Companies engaged in providing various services via Internet, including Internet search engine operators, social websites, e-commerce service providers, Internet gaming companies, and web content management service providers.
notation: 5720103010
valid from: 2020
is activity of: Online Services

Search Engines
type: NamedIndividual
type: Activity
type: BusinessClassification
is contemporary version of: http://data.ga-group.nl/ics/trbc/5720103011
is version of: http://data.ga-group.nl/ics/trbc/5720103011
replaces: http://data.ga-group.nl/ics/trbc/2012/5720103011
imported on: 2023-04-07T16:52:39.364811Z
last refreshed on: 2026-06-05T07:16:11.699Z
source accessed on: 2017-12-31T07:04:19Z
source last accessed on: 2021-08-01T01:06:53Z
definition: Companies engaged in providing web search engine designed to search for information on the World Wide Web and FTP servers.
notation: 5720103011
valid from: 2020
is activity of: Online Services

Social Media & Networking
type: NamedIndividual
type: Activity
type: BusinessClassification
is contemporary version of: http://data.ga-group.nl/ics/trbc/5720103012
is version of: http://data.ga-group.nl/ics/trbc/5720103012
replaces: http://data.ga-group.nl/ics/trbc/2012/5720103012
imported on: 2023-04-07T16:52:39.364811Z
last refreshed on: 2026-06-05T07:16:11.699Z
source accessed on: 2017-12-31T07:04:19Z
source last accessed on: 2021-08-01T01:06:53Z
definition: Companies providing an online service, platform, or site that focuses on building and reflecting of social networks or social relations among people, who, for example, share interests and/or activities.
notation: 5720103012
valid from: 2020
is activity of: Online Services

E-commerce & Auction Services
type: NamedIndividual
type: Activity
type: BusinessClassification
is contemporary version of: http://data.ga-group.nl/ics/trbc/5720103013
is version of: http://data.ga-group.nl/ics/trbc/5720103013
replaces: http://data.ga-group.nl/ics/trbc/2012/5720103013
imported on: 2023-04-07T16:52:39.364811Z
last refreshed on: 2026-06-05T07:16:11.699Z
source accessed on: 2017-12-31T07:04:19Z
source last accessed on: 2021-08-01T01:06:53Z
definition: Companies engaged in providing buying and selling of products or services over electronic systems such as the Internet and other computer networks. Includes also the process of buying and selling goods or services by offering them up for bid, taking bids, and then selling the item to the highest bidder.
notation: 5720103013
valid from: 2020
is activity of: Online Services

Content & Site Management Services
type: NamedIndividual
type: Activity
type: BusinessClassification
is contemporary version of: http://data.ga-group.nl/ics/trbc/5720103014
is version of: http://data.ga-group.nl/ics/trbc/5720103014
replaces: http://data.ga-group.nl/ics/trbc/2012/5720103014
imported on: 2023-04-07T16:52:39.364811Z
last refreshed on: 2026-06-05T07:16:11.699Z
source accessed on: 2017-12-31T07:04:19Z
source last accessed on: 2021-08-01T01:06:53Z
definition: Companies engaged in providing a collection of procedures used to manage work flow in a collaborative environment.
notation: 5720103014
valid from: 2020
is activity of: Online Services

Internet Security & Transactions Services
type: NamedIndividual
type: Activity
type: BusinessClassification
is contemporary version of: http://data.ga-group.nl/ics/trbc/5720103015
is version of: http://data.ga-group.nl/ics/trbc/5720103015
replaces: http://data.ga-group.nl/ics/trbc/2012/5720103015
imported on: 2023-04-07T16:52:39.364811Z
last refreshed on: 2026-06-05T07:16:11.699Z
source accessed on: 2017-12-31T07:04:19Z
source last accessed on: 2021-08-01T01:06:53Z
definition: Companies engaged in providing computer security services related to the Internet. Includes also providers of systems that facilitate and manage transaction-oriented applications, typically for secure data entry and transaction processing.
notation: 5720103015
valid from: 2020
is activity of: Online Services

Internet Gaming
type: NamedIndividual
type: Activity
type: BusinessClassification
is contemporary version of: http://data.ga-group.nl/ics/trbc/5720103016
is version of: http://data.ga-group.nl/ics/trbc/5720103016
replaces: http://data.ga-group.nl/ics/trbc/2012/5720103016
imported on: 2023-04-07T16:52:39.364811Z
last refreshed on: 2026-06-05T07:16:11.699Z
source accessed on: 2017-12-31T07:04:19Z
source last accessed on: 2021-08-01T01:06:53Z
definition: Companies engaged in providing games played over some form of computer network. Includes online games that range from simple text based games to games incorporating complex graphics and virtual worlds populated by many players simultaneously.
notation: 5720103016
valid from: 2020
is activity of: Online Services

Online Services
type: NamedIndividual
type: BusinessClassification
type: Industry
is contemporary version of: http://data.ga-group.nl/ics/trbc/57201030
is version of: http://data.ga-group.nl/ics/trbc/57201030
replaces: http://data.ga-group.nl/ics/trbc/2012/57201030
imported on: 2023-04-07T16:52:39.364811Z
last refreshed on: 2026-06-05T07:16:11.699Z
source accessed on: 2017-12-31T07:04:19Z
source last accessed on: 2021-08-01T01:06:53Z
definition: Providers of various services via Internet, including Internet search engine operators, social websites, e-commerce service providers, Internet gaming companies, and web content management service providers.
notation: 57201030
valid from: 2020
is industry of: Software & IT Services

Software & IT Services
type: NamedIndividual
type: BusinessClassification
type: IndustryGroup
is contemporary version of: http://data.ga-group.nl/ics/trbc/572010
is version of: http://data.ga-group.nl/ics/trbc/572010
replaces: http://data.ga-group.nl/ics/trbc/2012/572010
imported on: 2023-04-07T16:52:39.364811Z
last refreshed on: 2026-06-05T07:16:11.699Z
source accessed on: 2017-12-31T07:04:19Z
source last accessed on: 2021-08-01T01:06:53Z
definition: Developers and marketers of generic system and application software, as well as providers of consulting and IT services.
notation: 572010
valid from: 2020
is industry group of: Software & IT Services

Software & IT Services
type: NamedIndividual
type: BusinessClassification
type: BusinessSector
is contemporary version of: http://data.ga-group.nl/ics/trbc/5720
is version of: http://data.ga-group.nl/ics/trbc/5720
replaces: http://data.ga-group.nl/ics/trbc/2012/5720
imported on: 2023-04-07T16:52:39.364811Z
last refreshed on: 2026-06-05T07:16:11.699Z
source accessed on: 2017-12-31T07:04:19Z
source last accessed on: 2021-08-01T01:06:53Z
definition: Developers and marketers of generic system and application software, as well as providers of consulting and IT services.
notation: 5720
valid from: 2020
is business sector of: Technology

Financial Technology (Fintech) (NEC)
type: NamedIndividual
type: Activity
type: BusinessClassification
is contemporary version of: http://data.ga-group.nl/ics/trbc/5730101010
is version of: http://data.ga-group.nl/ics/trbc/5730101010
imported on: 2023-04-07T16:52:39.364811Z
last refreshed on: 2026-06-05T07:16:11.699Z
source accessed on: 2017-12-31T07:04:19Z
source last accessed on: 2021-08-01T01:06:53Z
definition: Companies engaged in a variety of information technologies built to streamline financial services, used to automate insurance, trading and risk management, among others.
notation: 5730101010
valid from: 2020
is activity of: Financial Technology (Fintech)

Business to Business
type: NamedIndividual
type: Activity
type: BusinessClassification
is contemporary version of: http://data.ga-group.nl/ics/trbc/5730101020
is version of: http://data.ga-group.nl/ics/trbc/5730101020
imported on: 2023-04-07T17:17:07.492231Z
last refreshed on: 2026-06-05T07:16:11.699Z
source accessed on: 2021-04-25T05:48:36Z
source last accessed on: 2021-08-01T01:06:53Z
definition: Companies engaged in providing technologies and infrastructure, such as software applications, processes, business models for B2B Internet-based financial transactions/services.
notation: 5730101020
valid from: 2020
is activity of: Financial Technology (Fintech)

Business to Consumer
type: NamedIndividual
type: Activity
type: BusinessClassification
is contemporary version of: http://data.ga-group.nl/ics/trbc/5730101030
is version of: http://data.ga-group.nl/ics/trbc/5730101030
imported on: 2023-04-07T17:17:07.492231Z
last refreshed on: 2026-06-05T07:16:11.699Z
source accessed on: 2021-04-25T05:48:36Z
source last accessed on: 2021-08-01T01:06:53Z
definition: Companies engaged in providing technologies and infrastructure, such as software applications, processes, business models for B2C Internet-based financial transactions/services.
notation: 5730101030
valid from: 2020
is activity of: Financial Technology (Fintech)

Consumer to Consumer
type: NamedIndividual
type: Activity
type: BusinessClassification
is contemporary version of: http://data.ga-group.nl/ics/trbc/5730101040
is version of: http://data.ga-group.nl/ics/trbc/5730101040
imported on: 2023-04-07T17:17:07.492231Z
last refreshed on: 2026-06-05T07:16:11.699Z
source accessed on: 2021-04-25T05:48:36Z
source last accessed on: 2021-08-01T01:06:53Z
definition: Companies engaged in providing technologies and infrastructure, such as software applications, processes, business models for C2C Internet-based financial transactions/services.
notation: 5730101040
valid from: 2020
is activity of: Financial Technology (Fintech)

Financial Technology (Fintech)
type: NamedIndividual
type: BusinessClassification
type: Industry
is contemporary version of: http://data.ga-group.nl/ics/trbc/57301010
is version of: http://data.ga-group.nl/ics/trbc/57301010
imported on: 2023-04-07T17:17:07.492231Z
last refreshed on: 2026-06-05T07:16:11.699Z
source accessed on: 2021-04-25T05:48:36Z
source last accessed on: 2021-08-01T01:06:53Z
definition: Companies engaged in providing information technologies built to streamline financial services.
notation: 57301010
valid from: 2020
is industry of: Financial Technology (Fintech) & Infrastructure

Crowd Collaboration (NEC)
type: NamedIndividual
type: Activity
type: BusinessClassification
is contemporary version of: http://data.ga-group.nl/ics/trbc/5730102010
is version of: http://data.ga-group.nl/ics/trbc/5730102010
imported on: 2023-04-07T17:17:07.492231Z
last refreshed on: 2026-06-05T07:16:11.699Z
source accessed on: 2021-04-25T05:48:36Z
source last accessed on: 2021-08-01T01:06:53Z
definition: Companies engaged in operating crowdsourcing platforms, as well as organizing crowdfunding and crowdfinancing activities.
notation: 5730102010
valid from: 2020
is activity of: Crowd Collaboration

Crowdfinancing & Crowdfunding
type: NamedIndividual
type: Activity
type: BusinessClassification
is contemporary version of: http://data.ga-group.nl/ics/trbc/5730102020
is version of: http://data.ga-group.nl/ics/trbc/5730102020
imported on: 2023-04-07T17:17:07.492231Z
last refreshed on: 2026-06-05T07:16:11.699Z
source accessed on: 2021-04-25T05:48:36Z
source last accessed on: 2021-08-01T01:06:53Z
definition: Companies engaged in providing funding for a project/venture by raising small contributions from a large number of people, typically via the Internet.
notation: 5730102020
valid from: 2020
is activity of: Crowd Collaboration

Crowdsourcing Platforms
type: NamedIndividual
type: Activity
type: BusinessClassification
is contemporary version of: http://data.ga-group.nl/ics/trbc/5730102030
is version of: http://data.ga-group.nl/ics/trbc/5730102030
imported on: 2023-04-07T17:17:07.492231Z
last refreshed on: 2026-06-05T07:16:11.699Z
source accessed on: 2021-04-25T05:48:36Z
source last accessed on: 2021-08-01T01:06:53Z
definition: Companies engaged in operating technology platforms for outsourcing tasks to broad, external groups of people.
notation: 5730102030
valid from: 2020
is activity of: Crowd Collaboration

Crowd Collaboration
type: NamedIndividual
type: BusinessClassification
type: Industry
is contemporary version of: http://data.ga-group.nl/ics/trbc/57301020
is version of: http://data.ga-group.nl/ics/trbc/57301020
imported on: 2023-04-07T17:17:07.492231Z
last refreshed on: 2026-06-05T07:16:11.699Z
source accessed on: 2021-04-25T05:48:36Z
source last accessed on: 2021-08-01T01:06:53Z
definition: Companies engaged in operating crowdsourcing platforms, organizing crowdfunding or crowdfinancing activities.
notation: 57301020
valid from: 2020
is industry of: Financial Technology (Fintech) & Infrastructure

Blockchain & Cryptocurrency (NEC)
type: NamedIndividual
type: Activity
type: BusinessClassification
is contemporary version of: http://data.ga-group.nl/ics/trbc/5730103010
is version of: http://data.ga-group.nl/ics/trbc/5730103010
imported on: 2023-04-07T17:17:07.492231Z
last refreshed on: 2026-06-05T07:16:11.699Z
source accessed on: 2021-04-25T05:48:36Z
source last accessed on: 2021-08-01T01:06:53Z
definition: Companies engaged in blockchain and cryptocurrency activities including trading platforms, technology, hardware and mining.
notation: 5730103010
valid from: 2020
is activity of: Blockchain & Cryptocurrency

Cryptocurrency Trading Platforms (Exchanges)
type: NamedIndividual
type: Activity
type: BusinessClassification
is contemporary version of: http://data.ga-group.nl/ics/trbc/5730103020
is version of: http://data.ga-group.nl/ics/trbc/5730103020
imported on: 2023-04-07T17:17:07.492231Z
last refreshed on: 2026-06-05T07:16:11.699Z
source accessed on: 2021-04-25T05:48:36Z
source last accessed on: 2021-08-01T01:06:53Z
definition: Companies engaged in providing trading platforms to dominantly buy/sell/exchange cryptocurrencies.
notation: 5730103020
valid from: 2020
is activity of: Blockchain & Cryptocurrency

Blockchain Technology (Software)
type: NamedIndividual
type: Activity
type: BusinessClassification
is contemporary version of: http://data.ga-group.nl/ics/trbc/5730103030
is version of: http://data.ga-group.nl/ics/trbc/5730103030
imported on: 2023-04-07T17:17:07.492231Z
last refreshed on: 2026-06-05T07:16:11.699Z
source accessed on: 2021-04-25T05:48:36Z
source last accessed on: 2021-08-01T01:06:53Z
definition: Companies engaged in providing decentralized and distributed digital databases for secure online transactions.
notation: 5730103030
valid from: 2020
is activity of: Blockchain & Cryptocurrency

Cryptocurrency Hardware
type: NamedIndividual
type: Activity
type: BusinessClassification
is contemporary version of: http://data.ga-group.nl/ics/trbc/5730103040
is version of: http://data.ga-group.nl/ics/trbc/5730103040
imported on: 2023-04-07T17:17:07.492231Z
last refreshed on: 2026-06-05T07:16:11.699Z
source accessed on: 2021-04-25T05:48:36Z
source last accessed on: 2021-08-01T01:06:53Z
definition: Companies engaged in manufacturing devices specifically designed for the purposes of mining cryptocurrencies.
notation: 5730103040
valid from: 2020
is activity of: Blockchain & Cryptocurrency

Cryptocurrency Mining
type: NamedIndividual
type: Activity
type: BusinessClassification
is contemporary version of: http://data.ga-group.nl/ics/trbc/5730103050
is version of: http://data.ga-group.nl/ics/trbc/5730103050
imported on: 2023-04-07T17:17:07.492231Z
last refreshed on: 2026-06-05T07:16:11.699Z
source accessed on: 2021-04-25T05:48:36Z
source last accessed on: 2021-08-01T01:06:53Z
definition: Companies engaged in running, hosting or managing mining farms of hardware specifically designed for the purposes of mining cryptocurrencies.
notation: 5730103050
valid from: 2020
is activity of: Blockchain & Cryptocurrency

Blockchain & Cryptocurrency
type: NamedIndividual
type: BusinessClassification
type: Industry
is contemporary version of: http://data.ga-group.nl/ics/trbc/57301030
is version of: http://data.ga-group.nl/ics/trbc/57301030
imported on: 2023-04-07T17:17:07.492231Z
last refreshed on: 2026-06-05T07:16:11.699Z
source accessed on: 2021-04-25T05:48:36Z
source last accessed on: 2021-08-01T01:06:53Z
definition: Companies engaged in blockchain and cryptocurrency activities.
notation: 57301030
valid from: 2020
is industry of: Financial Technology (Fintech) & Infrastructure

Miscellaneous Fintech Infrastructure
type: NamedIndividual
type: Activity
type: BusinessClassification
is contemporary version of: http://data.ga-group.nl/ics/trbc/5730109010
is version of: http://data.ga-group.nl/ics/trbc/5730109010
imported on: 2023-04-07T17:17:07.492231Z
last refreshed on: 2026-06-05T07:16:11.699Z
source accessed on: 2021-04-25T05:48:36Z
source last accessed on: 2021-08-01T01:06:53Z
definition: Companies engaged in at least two activities under the Financial Technology (Fintech) & Infrastructure Industry Group, none being dominant.
notation: 5730109010
valid from: 2020
is activity of: Miscellaneous Fintech Infrastructure

Miscellaneous Fintech Infrastructure
type: NamedIndividual
type: BusinessClassification
type: Industry
is contemporary version of: http://data.ga-group.nl/ics/trbc/57301090
is version of: http://data.ga-group.nl/ics/trbc/57301090
imported on: 2023-04-07T17:17:07.492231Z
last refreshed on: 2026-06-05T07:16:11.699Z
source accessed on: 2021-04-25T05:48:36Z
source last accessed on: 2021-08-01T01:06:53Z
definition: Companies engaged in at least two activities under the Financial Technology (Fintech) & Infrastructure Industry Group, none being dominant.
notation: 57301090
valid from: 2020
is industry of: Financial Technology (Fintech) & Infrastructure

Financial Technology (Fintech) & Infrastructure
type: NamedIndividual
type: BusinessClassification
type: IndustryGroup
is contemporary version of: http://data.ga-group.nl/ics/trbc/573010
is version of: http://data.ga-group.nl/ics/trbc/573010
imported on: 2023-04-07T17:17:07.492231Z
last refreshed on: 2026-06-05T07:16:11.699Z
source accessed on: 2021-04-25T05:48:36Z
source last accessed on: 2021-08-01T01:06:53Z
definition: Providers of financial technology (Fintech) services and infrastructure.
notation: 573010
valid from: 2020
is industry group of: Financial Technology (Fintech) & Infrastructure

Financial Technology (Fintech) & Infrastructure
type: NamedIndividual
type: BusinessClassification
type: BusinessSector
is contemporary version of: http://data.ga-group.nl/ics/trbc/5730
is version of: http://data.ga-group.nl/ics/trbc/5730
imported on: 2023-04-07T17:17:07.492231Z
last refreshed on: 2026-06-05T07:16:11.699Z
source accessed on: 2021-04-25T05:48:36Z
source last accessed on: 2021-08-01T01:06:53Z
definition: Providers of financial technology (Fintech) services and infrastructure.
notation: 5730
valid from: 2020
is business sector of: Technology

Integrated Telecommunications Services (NEC)
type: NamedIndividual
type: Activity
type: BusinessClassification
is contemporary version of: http://data.ga-group.nl/ics/trbc/5740101010
is version of: http://data.ga-group.nl/ics/trbc/5740101010
imported on: 2023-04-07T16:52:39.364811Z
last refreshed on: 2026-06-05T07:16:11.699Z
source accessed on: 2017-12-31T07:04:19Z
source last accessed on: 2021-08-01T01:06:53Z
definition: Companies involved in at least two activities under the Integrated Telecommunications Industry, none being dominant: providing telecommunication services other than wireless only. Includes integrated providers of both fixed-line and wireless services offering voice, data and high-density data transmission services as well as Voice over Internet Protocol (VOIP) services.
notation: 5740101010
valid from: 2020
is activity of: Integrated Telecommunications Services

Wired Telecommunications Carriers
type: NamedIndividual
type: Activity
type: BusinessClassification
is contemporary version of: http://data.ga-group.nl/ics/trbc/5740101020
is version of: http://data.ga-group.nl/ics/trbc/5740101020
imported on: 2023-04-07T16:52:39.364811Z
last refreshed on: 2026-06-05T07:16:11.699Z
source accessed on: 2017-12-31T07:04:19Z
source last accessed on: 2021-08-01T01:06:53Z
definition: Companies engaged in providing of direct communication services (such as local calls and long distance national and international.
notation: 5740101020
valid from: 2020
is activity of: Integrated Telecommunications Services

Telecommunications Resellers
type: NamedIndividual
type: Activity
type: BusinessClassification
is contemporary version of: http://data.ga-group.nl/ics/trbc/5740101030
is version of: http://data.ga-group.nl/ics/trbc/5740101030
imported on: 2023-04-07T16:52:39.364811Z
last refreshed on: 2026-06-05T07:16:11.699Z
source accessed on: 2017-12-31T07:04:19Z
source last accessed on: 2021-08-01T01:06:53Z
definition: Companies engaged in purchasing access and network capacity from owners and operators of the networks and reselling wired and wireless telecommunications services to businesses and households. Includes telecommunication resellers, they do not operate and maintain telecommunications switching and transmission facilities.
notation: 5740101030
valid from: 2020
is activity of: Integrated Telecommunications Services

Internet Service Providers
type: NamedIndividual
type: Activity
type: BusinessClassification
is contemporary version of: http://data.ga-group.nl/ics/trbc/5740101040
is version of: http://data.ga-group.nl/ics/trbc/5740101040
imported on: 2023-04-07T16:52:39.364811Z
last refreshed on: 2026-06-05T07:16:11.699Z
source accessed on: 2017-12-31T07:04:19Z
source last accessed on: 2021-08-01T01:06:53Z
definition: Companies engaged in activity that comprises Internet access providers, Internet service providers. Includes also companies providing direct access through telecommunications networks to computer-held information compiled or published by others.
notation: 5740101040
valid from: 2020
is activity of: Integrated Telecommunications Services

Telecommunications Network Infrastructure
type: NamedIndividual
type: Activity
type: BusinessClassification
is contemporary version of: http://data.ga-group.nl/ics/trbc/5740101050
is version of: http://data.ga-group.nl/ics/trbc/5740101050
imported on: 2023-04-07T16:52:39.364811Z
last refreshed on: 2026-06-05T07:16:11.699Z
source accessed on: 2017-12-31T07:04:19Z
source last accessed on: 2021-08-01T01:06:53Z
definition: Companies engaged in providing a collection of terminals, links and nodes which connect together to enable telecommunication between users of the terminals. Includes communications platforms and solutions to carriers and service providers, cable/multiple system operators, wireless/cellular service providers, utilities and carrier of carriers, and government and defense entities.
notation: 5740101050
valid from: 2020
is activity of: Integrated Telecommunications Services

VOIP Services
type: NamedIndividual
type: Activity
type: BusinessClassification
is contemporary version of: http://data.ga-group.nl/ics/trbc/5740101060
is version of: http://data.ga-group.nl/ics/trbc/5740101060
imported on: 2023-04-07T16:52:39.364811Z
last refreshed on: 2026-06-05T07:16:11.699Z
source accessed on: 2017-12-31T07:04:19Z
source last accessed on: 2021-08-01T01:06:53Z
definition: Companies engaged in providing technologies, methodologies, communication protocols, and transmission techniques for the delivery of voice communications and multimedia sessions over Internet Protocol (IP) networks, such as the Internet. Excludes producers of VOIP equipment/devices, classified in VOIP Equipment & Systems.
notation: 5740101060
valid from: 2020
is activity of: Integrated Telecommunications Services

Integrated Telecommunications Services
type: NamedIndividual
type: BusinessClassification
type: Industry
is contemporary version of: http://data.ga-group.nl/ics/trbc/57401010
is version of: http://data.ga-group.nl/ics/trbc/57401010
imported on: 2023-04-07T16:52:39.364811Z
last refreshed on: 2026-06-05T07:16:11.699Z
source accessed on: 2017-12-31T07:04:19Z
source last accessed on: 2021-08-01T01:06:53Z
definition: Providers of integrated and fixed-line services offering voice, data and high-density data transmission services, as well as Voice over Internet Protocol (VoIP) services.
notation: 57401010
valid from: 2020
is industry of: Telecommunications Services

Wireless Telecommunications Services (NEC)
type: NamedIndividual
type: Activity
type: BusinessClassification
is contemporary version of: http://data.ga-group.nl/ics/trbc/5740102010
is version of: http://data.ga-group.nl/ics/trbc/5740102010
imported on: 2023-04-07T16:52:39.364811Z
last refreshed on: 2026-06-05T07:16:11.699Z
source accessed on: 2017-12-31T07:04:19Z
source last accessed on: 2021-08-01T01:06:53Z
definition: Companies involved in at least two activities under the Wireless Telecommunications industry, none being dominant: providing wireless communication services such as paging, cell phone and other satellite telecommunication services. Includes also mobile virtual network operators (MVNO) and mobile other licensed operators (MOLO) who do not own the telecommunication network infrastructure.
notation: 5740102010
valid from: 2020
is activity of: Wireless Telecommunications Services

Alternative Communications Services
type: NamedIndividual
type: Activity
type: BusinessClassification
is contemporary version of: http://data.ga-group.nl/ics/trbc/5740102020
is version of: http://data.ga-group.nl/ics/trbc/5740102020
imported on: 2023-04-07T16:52:39.364811Z
last refreshed on: 2026-06-05T07:16:11.699Z
source accessed on: 2017-12-31T07:04:19Z
source last accessed on: 2021-08-01T01:06:53Z
definition: Companies engaged in providing communication services such as paging, fax, internet to phone, data & voice business communications, as well as special services used to supplement or replace speech or writing for those with impairments in the production or comprehension of spoken or written language.
notation: 5740102020
valid from: 2020
is activity of: Wireless Telecommunications Services

Satellite Service Operators
type: NamedIndividual
type: Activity
type: BusinessClassification
is contemporary version of: http://data.ga-group.nl/ics/trbc/5740102030
is version of: http://data.ga-group.nl/ics/trbc/5740102030
imported on: 2023-04-07T16:52:39.364811Z
last refreshed on: 2026-06-05T07:16:11.699Z
source accessed on: 2017-12-31T07:04:19Z
source last accessed on: 2021-08-01T01:06:53Z
definition: Companies engaged in providing broadband satellite networks and services. Includes a range of broadband networking technologies, solutions, and services.
notation: 5740102030
valid from: 2020
is activity of: Wireless Telecommunications Services

Wi-Fi & Wi-Max Providers
type: NamedIndividual
type: Activity
type: BusinessClassification
is contemporary version of: http://data.ga-group.nl/ics/trbc/5740102040
is version of: http://data.ga-group.nl/ics/trbc/5740102040
imported on: 2023-04-07T16:52:39.364811Z
last refreshed on: 2026-06-05T07:16:11.699Z
source accessed on: 2017-12-31T07:04:19Z
source last accessed on: 2021-08-01T01:06:53Z
definition: Companies engaged in providing wirelessly connecting electronic devices, including personal computers, video game consoles, smartphones, or digital audio players, which can be connected to the Internet via a wireless network access point. Includes also providers of communications technology for wirelessly delivering high-speed Internet service to large geographical areas.
notation: 5740102040
valid from: 2020
is activity of: Wireless Telecommunications Services

Wireless Telecoms Service Providers
type: NamedIndividual
type: Activity
type: BusinessClassification
is contemporary version of: http://data.ga-group.nl/ics/trbc/5740102050
is version of: http://data.ga-group.nl/ics/trbc/5740102050
imported on: 2023-04-07T16:52:39.364811Z
last refreshed on: 2026-06-05T07:16:11.699Z
source accessed on: 2017-12-31T07:04:19Z
source last accessed on: 2021-08-01T01:06:53Z
definition: Companies engaged in operating and maintaining switching and transmission facilities that provide direct communications via airwaves. Includes companies providing wireless telecommunications network services, such as cellular telephone or paging services. Includes also mobile virtual network operators (MVNO) and mobile other licensed operators (MOLO) who do not own the telecommunication network infrastructure.
notation: 5740102050
valid from: 2020
is activity of: Wireless Telecommunications Services

Wireless Telecommunications Services
type: NamedIndividual
type: BusinessClassification
type: Industry
is contemporary version of: http://data.ga-group.nl/ics/trbc/57401020
is version of: http://data.ga-group.nl/ics/trbc/57401020
imported on: 2023-04-07T16:52:39.364811Z
last refreshed on: 2026-06-05T07:16:11.699Z
source accessed on: 2017-12-31T07:04:19Z
source last accessed on: 2021-08-01T01:06:53Z
definition: Providers of wireless communication services, such as paging, cell phone and other satellite telecommunication services, such as provided by mobile virtual network operators (MVNO) and mobile other licensed operators (MOLO) who do not own the telecommunication network infrastructure.
notation: 57401020
valid from: 2020
is industry of: Telecommunications Services

Telecommunications Services
type: NamedIndividual
type: BusinessClassification
type: IndustryGroup
is contemporary version of: http://data.ga-group.nl/ics/trbc/574010
is version of: http://data.ga-group.nl/ics/trbc/574010
imported on: 2026-06-05T07:16:11.699Z
last refreshed on: 2026-06-05T07:16:11.699Z
source accessed on: 2021-07-28T17:27:51Z
source last accessed on: 2021-07-28T17:27:51Z
definition: Owners and operators of fixed line and wireless telecommunication networks providing voice and data services.
notation: 574010
valid from: 2020
is industry group of: Telecommunications Services

Telecommunications Services
type: NamedIndividual
type: BusinessClassification
type: BusinessSector
is contemporary version of: http://data.ga-group.nl/ics/trbc/5740
is version of: http://data.ga-group.nl/ics/trbc/5740
imported on: 2023-04-07T16:52:39.364811Z
last refreshed on: 2026-06-05T07:16:11.699Z
source accessed on: 2017-12-31T07:04:19Z
source last accessed on: 2021-08-01T01:06:53Z
definition: Owners and operators of fixed line and wireless telecommunication networks providing voice and data services.
notation: 5740
valid from: 2020
is business sector of: Technology

Technology
type: NamedIndividual
type: BusinessClassification
type: EconomicSector
is contemporary version of: http://data.ga-group.nl/ics/trbc/57
is version of: http://data.ga-group.nl/ics/trbc/57
replaces: http://data.ga-group.nl/ics/trbc/2012/57
imported on: 2023-04-07T16:52:39.364811Z
last refreshed on: 2026-06-05T07:16:11.699Z
source accessed on: 2017-12-31T07:04:19Z
source last accessed on: 2021-08-01T01:06:53Z
definition: Manufacturers of semiconductors, communications equipment, computer hardware and technology related office equipment, providers of consulting, IT services & financial technology (Fintech) services and infrastructure. Owners and operators of fixed line and wireless telecommunication networks providing voice and data services.
notation: 57
valid from: 2020

Telecommunications Services
type: NamedIndividual
type: BusinessClassification
type: EconomicSector
is contemporary version of: http://data.ga-group.nl/ics/trbc/58
is version of: http://data.ga-group.nl/ics/trbc/58
replaces: http://data.ga-group.nl/ics/trbc/2012/58
imported on: 2023-04-07T16:52:39.364811Z
last refreshed on: 2023-04-07T17:12:26.910158Z
source accessed on: 2017-12-31T07:04:19Z
source last accessed on: 2020-09-13T08:40:59Z
definition: Owners and operators of fixed line and wireless telecommunication networks providing voice and data services.
notation: 58
valid from: 2020

Electric Utilities (NEC)
type: NamedIndividual
type: Activity
type: BusinessClassification
is contemporary version of: http://data.ga-group.nl/ics/trbc/5910101010
is version of: http://data.ga-group.nl/ics/trbc/5910101010
replaces: http://data.ga-group.nl/ics/trbc/2012/5910101010
imported on: 2023-04-07T16:52:39.364811Z
last refreshed on: 2026-06-05T07:16:11.699Z
source accessed on: 2017-12-31T07:04:19Z
source last accessed on: 2021-08-01T01:06:53Z
definition: Companies involved in at least two activities under the Electric Utilities industry, none being dominant: fossil fuel, nuclear, hydro, solar, wind, biomass & waste, alternative utilities. It also includes entities not elsewhere classified under the Electric Utilities industry.
notation: 5910101010
valid from: 2020
is activity of: Electric Utilities

Renewable Utilities
type: NamedIndividual
type: Activity
type: BusinessClassification
is contemporary version of: http://data.ga-group.nl/ics/trbc/5910101011
is version of: http://data.ga-group.nl/ics/trbc/5910101011
replaces: http://data.ga-group.nl/ics/trbc/2012/5910101011
imported on: 2023-04-07T16:52:39.364811Z
last refreshed on: 2023-04-07T17:12:26.910158Z
source accessed on: 2017-12-31T07:04:19Z
source last accessed on: 2020-09-13T08:40:59Z
definition: Companies engaged in producing and distributing electric power using alternative methods, such as hydro, solar, wind, and tidal waves.
notation: 5910101011
valid from: 2020
is activity of: Electric Utilities

Fossil Fuel Electric Utilities
type: NamedIndividual
type: Activity
type: BusinessClassification
is contemporary version of: http://data.ga-group.nl/ics/trbc/5910101012
is version of: http://data.ga-group.nl/ics/trbc/5910101012
replaces: http://data.ga-group.nl/ics/trbc/2012/5910101012
imported on: 2023-04-07T16:52:39.364811Z
last refreshed on: 2026-06-05T07:16:11.699Z
source accessed on: 2017-12-31T07:04:19Z
source last accessed on: 2021-08-01T01:06:53Z
definition: Companies engaged in producing electric power by burning fossil fuels, such as coal, and oil.
notation: 5910101012
valid from: 2020
is activity of: Electric Utilities

Nuclear Utilities
type: NamedIndividual
type: Activity
type: BusinessClassification
is contemporary version of: http://data.ga-group.nl/ics/trbc/5910101013
is version of: http://data.ga-group.nl/ics/trbc/5910101013
replaces: http://data.ga-group.nl/ics/trbc/2012/5910101013
imported on: 2023-04-07T16:52:39.364811Z
last refreshed on: 2026-06-05T07:16:11.699Z
source accessed on: 2017-12-31T07:04:19Z
source last accessed on: 2021-08-01T01:06:53Z
definition: Companies engaged in producing electric power by using sustained nuclear fission. Nuclear power plants are fueled by Uranium.
notation: 5910101013
valid from: 2020
is activity of: Electric Utilities

Power Charging Stations
type: NamedIndividual
type: Activity
type: BusinessClassification
is contemporary version of: http://data.ga-group.nl/ics/trbc/5910101014
is version of: http://data.ga-group.nl/ics/trbc/5910101014
imported on: 2023-04-07T17:17:07.492231Z
last refreshed on: 2026-06-05T07:16:11.699Z
source accessed on: 2021-04-25T05:48:36Z
source last accessed on: 2021-08-01T01:06:53Z
definition: Companies engaged in operating automotive power charging stations, electric vehicle charging stations, and electric vehicle supply equipment (EVSE).
notation: 5910101014
valid from: 2020
is activity of: Electric Utilities

Alternative Electric Utilities
type: NamedIndividual
type: Activity
type: BusinessClassification
is contemporary version of: http://data.ga-group.nl/ics/trbc/5910101020
is version of: http://data.ga-group.nl/ics/trbc/5910101020
imported on: 2023-04-07T17:17:07.492231Z
last refreshed on: 2026-06-05T07:16:11.699Z
source accessed on: 2021-04-25T05:48:36Z
source last accessed on: 2021-08-01T01:06:53Z
definition: Companies engaged in producing and distributing electric power using alternative methods other than those renewables covered in the Hydroelectric & Tidal, Solar, Wind, Biomass & Waste, and Geothermal classifications.
notation: 5910101020
valid from: 2020
is activity of: Electric Utilities

Hydroelectric & Tidal Utilities
type: NamedIndividual
type: Activity
type: BusinessClassification
is contemporary version of: http://data.ga-group.nl/ics/trbc/5910101021
is version of: http://data.ga-group.nl/ics/trbc/5910101021
imported on: 2023-04-07T17:17:07.492231Z
last refreshed on: 2026-06-05T07:16:11.699Z
source accessed on: 2021-04-25T05:48:36Z
source last accessed on: 2021-08-01T01:06:53Z
definition: Companies engaged in producing electric power by hydro or tidal powered methods.
notation: 5910101021
valid from: 2020
is activity of: Electric Utilities

Solar Electric Utilities
type: NamedIndividual
type: Activity
type: BusinessClassification
is contemporary version of: http://data.ga-group.nl/ics/trbc/5910101022
is version of: http://data.ga-group.nl/ics/trbc/5910101022
imported on: 2023-04-07T17:17:07.492231Z
last refreshed on: 2026-06-05T07:16:11.699Z
source accessed on: 2021-04-25T05:48:36Z
source last accessed on: 2021-08-01T01:06:53Z
definition: Companies engaged in producing electric power by solar powered methods.
notation: 5910101022
valid from: 2020
is activity of: Electric Utilities

Wind Electric Utilities
type: NamedIndividual
type: Activity
type: BusinessClassification
is contemporary version of: http://data.ga-group.nl/ics/trbc/5910101023
is version of: http://data.ga-group.nl/ics/trbc/5910101023
imported on: 2023-04-07T17:17:07.492231Z
last refreshed on: 2026-06-05T07:16:11.699Z
source accessed on: 2021-04-25T05:48:36Z
source last accessed on: 2021-08-01T01:06:53Z
definition: Companies engaged in producing electric power by wind powered methods.
notation: 5910101023
valid from: 2020
is activity of: Electric Utilities

Biomass & Waste to Energy Electric Utilities
type: NamedIndividual
type: Activity
type: BusinessClassification
is contemporary version of: http://data.ga-group.nl/ics/trbc/5910101024
is version of: http://data.ga-group.nl/ics/trbc/5910101024
imported on: 2023-04-07T17:17:07.492231Z
last refreshed on: 2026-06-05T07:16:11.699Z
source accessed on: 2021-04-25T05:48:36Z
source last accessed on: 2021-08-01T01:06:53Z
definition: Companies engaged in producing electric power by biomass or waste energy methods.
notation: 5910101024
valid from: 2020
is activity of: Electric Utilities

Geothermal Electric Utilities
type: NamedIndividual
type: Activity
type: BusinessClassification
is contemporary version of: http://data.ga-group.nl/ics/trbc/5910101025
is version of: http://data.ga-group.nl/ics/trbc/5910101025
imported on: 2023-04-07T17:17:07.492231Z
last refreshed on: 2026-06-05T07:16:11.699Z
source accessed on: 2021-04-25T05:48:36Z
source last accessed on: 2021-08-01T01:06:53Z
definition: Companies engaged in producing electric power by geothermal energy methods.
notation: 5910101025
valid from: 2020
is activity of: Electric Utilities

Electric Utilities
type: NamedIndividual
type: BusinessClassification
type: Industry
is contemporary version of: http://data.ga-group.nl/ics/trbc/59101010
is version of: http://data.ga-group.nl/ics/trbc/59101010
replaces: http://data.ga-group.nl/ics/trbc/2012/59101010
imported on: 2023-04-07T16:52:39.364811Z
last refreshed on: 2026-06-05T07:16:11.699Z
source accessed on: 2017-12-31T07:04:19Z
source last accessed on: 2021-08-01T01:06:53Z
definition: Generators and distributors of electric power, includes hydroelectric, fossil fuel, nuclear, solar, tidal, and wind power generators.
notation: 59101010
valid from: 2020
is industry of: Electric Utilities & IPPs

Independent Power Producers (NEC)
type: NamedIndividual
type: Activity
type: BusinessClassification
is contemporary version of: http://data.ga-group.nl/ics/trbc/5910102010
is version of: http://data.ga-group.nl/ics/trbc/5910102010
replaces: http://data.ga-group.nl/ics/trbc/2012/5910102010
imported on: 2023-04-07T16:52:39.364811Z
last refreshed on: 2026-06-05T07:16:11.699Z
source accessed on: 2017-12-31T07:04:19Z
source last accessed on: 2021-08-01T01:06:53Z
definition: Companies involved in at least two activities under Independent Power Producers, none being dominant: Fossil Fuel IPPs, Renewable IPPs and Nuclear IPPs.
notation: 5910102010
valid from: 2020
is activity of: Independent Power Producers

Fossil Fuel IPPs
type: NamedIndividual
type: Activity
type: BusinessClassification
is contemporary version of: http://data.ga-group.nl/ics/trbc/5910102011
is version of: http://data.ga-group.nl/ics/trbc/5910102011
replaces: http://data.ga-group.nl/ics/trbc/2012/5910102011
imported on: 2023-04-07T16:52:39.364811Z
last refreshed on: 2026-06-05T07:16:11.699Z
source accessed on: 2017-12-31T07:04:19Z
source last accessed on: 2021-08-01T01:06:53Z
definition: Companies engaged in producing electric power by burning fossil fuels and selling it to Utility Companies.
notation: 5910102011
valid from: 2020
is activity of: Independent Power Producers

Renewable IPPs
type: NamedIndividual
type: Activity
type: BusinessClassification
is contemporary version of: http://data.ga-group.nl/ics/trbc/5910102012
is version of: http://data.ga-group.nl/ics/trbc/5910102012
replaces: http://data.ga-group.nl/ics/trbc/2012/5910102012
imported on: 2023-04-07T16:52:39.364811Z
last refreshed on: 2026-06-05T07:16:11.699Z
source accessed on: 2017-12-31T07:04:19Z
source last accessed on: 2021-08-01T01:06:53Z
definition: Companies engaged in producing electric power using alternative methods, such as hydro, solar, wind, and tidal waves. The IPPs sell the generated electric power to Utility Companies.
notation: 5910102012
valid from: 2020
is activity of: Independent Power Producers

Nuclear IPPs
type: NamedIndividual
type: Activity
type: BusinessClassification
is contemporary version of: http://data.ga-group.nl/ics/trbc/5910102013
is version of: http://data.ga-group.nl/ics/trbc/5910102013
replaces: http://data.ga-group.nl/ics/trbc/2012/5910102013
imported on: 2023-04-07T16:52:39.364811Z
last refreshed on: 2026-06-05T07:16:11.699Z
source accessed on: 2017-12-31T07:04:19Z
source last accessed on: 2021-08-01T01:06:53Z
definition: Companies engaged in producing electric power using sustained nuclear fission (Uranium). The IPPs sell the generated electric power to Utility Companies.
notation: 5910102013
valid from: 2020
is activity of: Independent Power Producers

Independent Power Producers
type: NamedIndividual
type: BusinessClassification
type: Industry
is contemporary version of: http://data.ga-group.nl/ics/trbc/59101020
is version of: http://data.ga-group.nl/ics/trbc/59101020
replaces: http://data.ga-group.nl/ics/trbc/2012/59101020
imported on: 2023-04-07T16:52:39.364811Z
last refreshed on: 2026-06-05T07:16:11.699Z
source accessed on: 2017-12-31T07:04:19Z
source last accessed on: 2021-08-01T01:06:53Z
definition: Operators of power plants and suppliers of electricity into the wholesale market.
notation: 59101020
valid from: 2020
is industry of: Electric Utilities & IPPs

Electric Utilities & IPPs
type: NamedIndividual
type: BusinessClassification
type: IndustryGroup
is contemporary version of: http://data.ga-group.nl/ics/trbc/591010
is version of: http://data.ga-group.nl/ics/trbc/591010
replaces: http://data.ga-group.nl/ics/trbc/2012/591010
imported on: 2023-04-07T16:52:39.364811Z
last refreshed on: 2026-06-05T07:16:11.699Z
source accessed on: 2017-12-31T07:04:19Z
source last accessed on: 2021-08-01T01:06:53Z
definition: Generators and distributors of electric power. Includes hydroelectric, fossil fuel, nuclear, solar, tidal, wind and independent electric power generators.
notation: 591010
valid from: 2020
is industry group of: Utilities

Natural Gas Utilities (NEC)
type: NamedIndividual
type: Activity
type: BusinessClassification
is contemporary version of: http://data.ga-group.nl/ics/trbc/5910201010
is version of: http://data.ga-group.nl/ics/trbc/5910201010
replaces: http://data.ga-group.nl/ics/trbc/2012/5910201010
imported on: 2023-04-07T16:52:39.364811Z
last refreshed on: 2026-06-05T07:16:11.699Z
source accessed on: 2017-12-31T07:04:19Z
source last accessed on: 2021-08-01T01:06:53Z
definition: Companies involved in at least two activities under Natural Gas Utilities, none being dominant: Natural Gas Production, Natural Gas Distribution.
notation: 5910201010
valid from: 2020
is activity of: Natural Gas Utilities

Natural Gas Distribution
type: NamedIndividual
type: Activity
type: BusinessClassification
is contemporary version of: http://data.ga-group.nl/ics/trbc/5910201011
is version of: http://data.ga-group.nl/ics/trbc/5910201011
replaces: http://data.ga-group.nl/ics/trbc/2012/5910201011
imported on: 2023-04-07T16:52:39.364811Z
last refreshed on: 2026-06-05T07:16:11.699Z
source accessed on: 2017-12-31T07:04:19Z
source last accessed on: 2021-08-01T01:06:53Z
definition: Companies engaged in operating gas distribution systems (mains, meters).
notation: 5910201011
valid from: 2020
is activity of: Natural Gas Utilities

Natural Gas Utilities
type: NamedIndividual
type: BusinessClassification
type: Industry
is contemporary version of: http://data.ga-group.nl/ics/trbc/59102010
is version of: http://data.ga-group.nl/ics/trbc/59102010
replaces: http://data.ga-group.nl/ics/trbc/2012/59102010
imported on: 2023-04-07T16:52:39.364811Z
last refreshed on: 2026-06-05T07:16:11.699Z
source accessed on: 2017-12-31T07:04:19Z
source last accessed on: 2021-08-01T01:06:53Z
definition: Producers and distributors of natural gas.
notation: 59102010
valid from: 2020
is industry of: Natural Gas Utilities

Natural Gas Utilities
type: NamedIndividual
type: BusinessClassification
type: IndustryGroup
is contemporary version of: http://data.ga-group.nl/ics/trbc/591020
is version of: http://data.ga-group.nl/ics/trbc/591020
replaces: http://data.ga-group.nl/ics/trbc/2012/591020
imported on: 2023-04-07T16:52:39.364811Z
last refreshed on: 2026-06-05T07:16:11.699Z
source accessed on: 2017-12-31T07:04:19Z
source last accessed on: 2021-08-01T01:06:53Z
definition: Producers and distributors of natural gas.
notation: 591020
valid from: 2020
is industry group of: Utilities

Water & Related Utilities (NEC)
type: NamedIndividual
type: Activity
type: BusinessClassification
is contemporary version of: http://data.ga-group.nl/ics/trbc/5910301010
is version of: http://data.ga-group.nl/ics/trbc/5910301010
replaces: http://data.ga-group.nl/ics/trbc/2012/5910301010
imported on: 2023-04-07T16:52:39.364811Z
last refreshed on: 2026-06-05T07:16:11.699Z
source accessed on: 2017-12-31T07:04:19Z
source last accessed on: 2021-08-01T01:06:53Z
definition: Companies involved in at least two activities under Water & Related Utilities, none being dominant: Water Supply & Irrigation Systems, Sewage Treatment Facilities and Heating & Air-Conditioning Supply.
notation: 5910301010
valid from: 2020
is activity of: Water & Related Utilities

Water Supply & Irrigation Systems
type: NamedIndividual
type: Activity
type: BusinessClassification
is contemporary version of: http://data.ga-group.nl/ics/trbc/5910301011
is version of: http://data.ga-group.nl/ics/trbc/5910301011
replaces: http://data.ga-group.nl/ics/trbc/2012/5910301011
imported on: 2023-04-07T16:52:39.364811Z
last refreshed on: 2026-06-05T07:16:11.699Z
source accessed on: 2017-12-31T07:04:19Z
source last accessed on: 2021-08-01T01:06:53Z
definition: Companies engaged in operating water treatment plants and/or operating water supply systems. Includes water supply system may include pumping stations, aqueducts, and/or distribution mains.
notation: 5910301011
valid from: 2020
is activity of: Water & Related Utilities

Sewage Treatment Facilities
type: NamedIndividual
type: Activity
type: BusinessClassification
is contemporary version of: http://data.ga-group.nl/ics/trbc/5910301012
is version of: http://data.ga-group.nl/ics/trbc/5910301012
replaces: http://data.ga-group.nl/ics/trbc/2012/5910301012
imported on: 2023-04-07T16:52:39.364811Z
last refreshed on: 2026-06-05T07:16:11.699Z
source accessed on: 2017-12-31T07:04:19Z
source last accessed on: 2021-08-01T01:06:53Z
definition: Companies engaged in operating sewer systems or sewage treatment facilities that collect, treat, and dispose of waste.
notation: 5910301012
valid from: 2020
is activity of: Water & Related Utilities

Heating & Air-Conditioning Supply
type: NamedIndividual
type: Activity
type: BusinessClassification
is contemporary version of: http://data.ga-group.nl/ics/trbc/5910301013
is version of: http://data.ga-group.nl/ics/trbc/5910301013
replaces: http://data.ga-group.nl/ics/trbc/2012/5910301013
imported on: 2023-04-07T16:52:39.364811Z
last refreshed on: 2026-06-05T07:16:11.699Z
source accessed on: 2017-12-31T07:04:19Z
source last accessed on: 2021-08-01T01:06:53Z
definition: Companies engaged in distribution of steam, heated air, hot water for the central heating purposes, and cooled air for the air-conditioning purposes.
notation: 5910301013
valid from: 2020
is activity of: Water & Related Utilities

Water & Related Utilities
type: NamedIndividual
type: BusinessClassification
type: Industry
is contemporary version of: http://data.ga-group.nl/ics/trbc/59103010
is version of: http://data.ga-group.nl/ics/trbc/59103010
replaces: http://data.ga-group.nl/ics/trbc/2012/59103010
imported on: 2023-04-07T16:52:39.364811Z
last refreshed on: 2026-06-05T07:16:11.699Z
source accessed on: 2017-12-31T07:04:19Z
source last accessed on: 2021-08-01T01:06:53Z
definition: Operators of water delivery infrastructure, water treatment, filtration and sewage disposal plants. Includes operators supplying geothermal, steam heat and cooled air, as well as providers of hot water for district heating purposes.
notation: 59103010
valid from: 2020
is industry of: Water & Related Utilities

Water & Related Utilities
type: NamedIndividual
type: BusinessClassification
type: IndustryGroup
is contemporary version of: http://data.ga-group.nl/ics/trbc/591030
is version of: http://data.ga-group.nl/ics/trbc/591030
replaces: http://data.ga-group.nl/ics/trbc/2012/591030
imported on: 2023-04-07T16:52:39.364811Z
last refreshed on: 2026-06-05T07:16:11.699Z
source accessed on: 2017-12-31T07:04:19Z
source last accessed on: 2021-08-01T01:06:53Z
definition: Operators of water delivery infrastructure, water treatment, filtration and sewage disposal plants. Includes operators supplying geothermal, steam heat and cooled air, as well as providers of hot water for district heating purposes.
notation: 591030
valid from: 2020
is industry group of: Utilities

Multiline Utilities
type: NamedIndividual
type: Activity
type: BusinessClassification
is contemporary version of: http://data.ga-group.nl/ics/trbc/5910401010
is version of: http://data.ga-group.nl/ics/trbc/5910401010
replaces: http://data.ga-group.nl/ics/trbc/2012/5910401010
imported on: 2023-04-07T16:52:39.364811Z
last refreshed on: 2026-06-05T07:16:11.699Z
source accessed on: 2017-12-31T07:04:19Z
source last accessed on: 2021-08-01T01:06:53Z
definition: Companies involved in at least two activities in the Utilities Business Sector, none being dominant: Electric Utilities & IPPs, Natural Gas Utilities, and Water & Related Utilities.
notation: 5910401010
valid from: 2020
is activity of: Multiline Utilities

Multiline Utilities
type: NamedIndividual
type: BusinessClassification
type: Industry
is contemporary version of: http://data.ga-group.nl/ics/trbc/59104010
is version of: http://data.ga-group.nl/ics/trbc/59104010
replaces: http://data.ga-group.nl/ics/trbc/2012/59104010
imported on: 2026-06-05T07:16:11.699Z
last refreshed on: 2026-06-05T07:16:11.699Z
source accessed on: 2021-07-28T17:27:51Z
source last accessed on: 2021-07-28T17:27:51Z
definition: Producers and distributors of electric power, natural gas and combined heat and power. Includes utility companies with multiple operations in the supply of electricity; natural gas; water and district heating and cooling services, and other utility operations. Includes also utility infrastructure operators.
notation: 59104010
valid from: 2020
is industry of: Multiline Utilities

Multiline Utilities
type: NamedIndividual
type: BusinessClassification
type: IndustryGroup
is contemporary version of: http://data.ga-group.nl/ics/trbc/591040
is version of: http://data.ga-group.nl/ics/trbc/591040
replaces: http://data.ga-group.nl/ics/trbc/2012/591040
imported on: 2023-04-07T16:52:39.364811Z
last refreshed on: 2026-06-05T07:16:11.699Z
source accessed on: 2017-12-31T07:04:19Z
source last accessed on: 2021-08-01T01:06:53Z
definition: Producers and distributors of electric power, natural gas and combined heat and power. Includes utility companies with multiple operations in the supply of electricity; natural gas; water and district heating and cooling services, and other utility operations. Includes also utility infrastructure operators.
notation: 591040
valid from: 2020
is industry group of: Utilities

Utilities
type: NamedIndividual
type: BusinessClassification
type: BusinessSector
is contemporary version of: http://data.ga-group.nl/ics/trbc/5910
is version of: http://data.ga-group.nl/ics/trbc/5910
replaces: http://data.ga-group.nl/ics/trbc/2012/5910
imported on: 2023-04-07T16:52:39.364811Z
last refreshed on: 2026-06-05T07:16:11.699Z
source accessed on: 2017-12-31T07:04:19Z
source last accessed on: 2021-08-01T01:06:53Z
definition: Producers and distributors of electricity, natural gas, water, steam and utility infrastructure operators.
notation: 5910
valid from: 2020
is business sector of: Utilities

Utilities
type: NamedIndividual
type: BusinessClassification
type: EconomicSector
is contemporary version of: http://data.ga-group.nl/ics/trbc/59
is version of: http://data.ga-group.nl/ics/trbc/59
replaces: http://data.ga-group.nl/ics/trbc/2012/59
imported on: 2023-04-07T16:52:39.364811Z
last refreshed on: 2026-06-05T07:16:11.699Z
source accessed on: 2017-12-31T07:04:19Z
source last accessed on: 2021-08-01T01:06:53Z
definition: Producers and distributors of electricity, natural gas, water and steam, among other utility services.
notation: 59
valid from: 2020

Real Estate Rental, Development & Operations (NEC)
type: NamedIndividual
type: Activity
type: BusinessClassification
is contemporary version of: http://data.ga-group.nl/ics/trbc/6010101010
is version of: http://data.ga-group.nl/ics/trbc/6010101010
imported on: 2023-04-07T16:52:39.364811Z
last refreshed on: 2026-06-05T07:16:11.699Z
source accessed on: 2017-12-31T07:04:19Z
source last accessed on: 2021-08-01T01:06:53Z
definition: Companies involved in at least two activities under the Real Estate Rental, Development & Operations Industry, none being dominant: Office Real Estate Rental Operations, Retail Real Estate Rental Operations, Industrial Real Estate Rental Operations, Residential Real Estate Rental Operations. Includes also entities not classified elsewhere under the Real Estate Rental, Development & Operations industry.
notation: 6010101010
valid from: 2020
is activity of: Real Estate Rental, Development & Operations

Office Real Estate Rental & Development
type: NamedIndividual
type: Activity
type: BusinessClassification
is contemporary version of: http://data.ga-group.nl/ics/trbc/6010101020
is version of: http://data.ga-group.nl/ics/trbc/6010101020
imported on: 2023-04-07T16:52:39.364811Z
last refreshed on: 2026-06-05T07:16:11.699Z
source accessed on: 2017-12-31T07:04:19Z
source last accessed on: 2021-08-01T01:06:53Z
definition: Companies engaged in the rental of office buildings. Includes also companies involved in developing buildings exclusively for the purpose of rental and subsequently renting them.
notation: 6010101020
valid from: 2020
is activity of: Real Estate Rental, Development & Operations

Retail Real Estate Rental & Development
type: NamedIndividual
type: Activity
type: BusinessClassification
is contemporary version of: http://data.ga-group.nl/ics/trbc/6010101030
is version of: http://data.ga-group.nl/ics/trbc/6010101030
imported on: 2023-04-07T16:52:39.364811Z
last refreshed on: 2026-06-05T07:16:11.699Z
source accessed on: 2017-12-31T07:04:19Z
source last accessed on: 2021-08-01T01:06:53Z
definition: Companies engaged in the rental of commercial (business) real estate, including retail stores, malls, shopping centers, restaurants, self storage properties. Includes also companies developing retail real estate exclusively for the purpose of rental and subsequently renting it. Excludes companies engaged in rental of office space, classified in Office Real Estate Rental Development.
notation: 6010101030
valid from: 2020
is activity of: Real Estate Rental, Development & Operations

Industrial Real Estate Rental & Development
type: NamedIndividual
type: Activity
type: BusinessClassification
is contemporary version of: http://data.ga-group.nl/ics/trbc/6010101040
is version of: http://data.ga-group.nl/ics/trbc/6010101040
imported on: 2023-04-07T16:52:39.364811Z
last refreshed on: 2026-06-05T07:16:11.699Z
source accessed on: 2017-12-31T07:04:19Z
source last accessed on: 2021-08-01T01:06:53Z
definition: Companies engaged in the rental of industrial properties (properties used for production), warehouses and other industrial space. Includes also companies involved in developing industrial properties exclusively for the purpose of rental and subsequently renting them.
notation: 6010101040
valid from: 2020
is activity of: Real Estate Rental, Development & Operations

Residential Real Estate Rental & Development
type: NamedIndividual
type: Activity
type: BusinessClassification
is contemporary version of: http://data.ga-group.nl/ics/trbc/6010101050
is version of: http://data.ga-group.nl/ics/trbc/6010101050
imported on: 2023-04-07T16:52:39.364811Z
last refreshed on: 2026-06-05T07:16:11.699Z
source accessed on: 2017-12-31T07:04:19Z
source last accessed on: 2021-08-01T01:06:53Z
definition: Companies engaged in the rental or sale of residential properties, such as single- and multi-family houses, flats and apartments. Includes also entities involved in developing residential properties exclusively for the rental purposes and subsequently renting them.
notation: 6010101050
valid from: 2020
is activity of: Real Estate Rental, Development & Operations

Real Estate Rental, Development & Operations
type: NamedIndividual
type: BusinessClassification
type: Industry
is contemporary version of: http://data.ga-group.nl/ics/trbc/60101010
is version of: http://data.ga-group.nl/ics/trbc/60101010
imported on: 2026-06-05T07:16:11.699Z
last refreshed on: 2026-06-05T07:16:11.699Z
source accessed on: 2021-07-28T17:27:51Z
source last accessed on: 2021-07-28T17:27:51Z
definition: Companies engaged in developing, renting and leasing residential, retail, office, industrial and commercial properties.
notation: 60101010
valid from: 2020
is industry of: Real Estate Operations

Real Estate Services (NEC)
type: NamedIndividual
type: Activity
type: BusinessClassification
is contemporary version of: http://data.ga-group.nl/ics/trbc/6010102010
is version of: http://data.ga-group.nl/ics/trbc/6010102010
imported on: 2023-04-07T16:52:39.364811Z
last refreshed on: 2026-06-05T07:16:11.699Z
source accessed on: 2017-12-31T07:04:19Z
source last accessed on: 2021-08-01T01:06:53Z
definition: Companies engaged in providing real estate brokerage and agency services, real estate appraisal services, consulting services and management services.
notation: 6010102010
valid from: 2020
is activity of: Real Estate Services

Office Real Estate Services
type: NamedIndividual
type: Activity
type: BusinessClassification
is contemporary version of: http://data.ga-group.nl/ics/trbc/6010102020
is version of: http://data.ga-group.nl/ics/trbc/6010102020
imported on: 2023-04-07T16:52:39.364811Z
last refreshed on: 2026-06-05T07:16:11.699Z
source accessed on: 2017-12-31T07:04:19Z
source last accessed on: 2021-08-01T01:06:53Z
definition: Companies providing office property brokerage/agency, appraisal, consultancy and management/administration services.
notation: 6010102020
valid from: 2020
is activity of: Real Estate Services

Retail Real Estate Services
type: NamedIndividual
type: Activity
type: BusinessClassification
is contemporary version of: http://data.ga-group.nl/ics/trbc/6010102030
is version of: http://data.ga-group.nl/ics/trbc/6010102030
imported on: 2023-04-07T16:52:39.364811Z
last refreshed on: 2026-06-05T07:16:11.699Z
source accessed on: 2017-12-31T07:04:19Z
source last accessed on: 2021-08-01T01:06:53Z
definition: Companies providing commercial property brokerage/agency, appraisal, consultancy and management/administration services.
notation: 6010102030
valid from: 2020
is activity of: Real Estate Services

Industrial Real Estate Services
type: NamedIndividual
type: Activity
type: BusinessClassification
is contemporary version of: http://data.ga-group.nl/ics/trbc/6010102040
is version of: http://data.ga-group.nl/ics/trbc/6010102040
imported on: 2023-04-07T16:52:39.364811Z
last refreshed on: 2026-06-05T07:16:11.699Z
source accessed on: 2017-12-31T07:04:19Z
source last accessed on: 2021-08-01T01:06:53Z
definition: Companies providing industrial property brokerage/agency, appraisal, consultancy and management/administration services.
notation: 6010102040
valid from: 2020
is activity of: Real Estate Services

Residential Real Estate Services
type: NamedIndividual
type: Activity
type: BusinessClassification
is contemporary version of: http://data.ga-group.nl/ics/trbc/6010102050
is version of: http://data.ga-group.nl/ics/trbc/6010102050
imported on: 2023-04-07T16:52:39.364811Z
last refreshed on: 2026-06-05T07:16:11.699Z
source accessed on: 2017-12-31T07:04:19Z
source last accessed on: 2021-08-01T01:06:53Z
definition: Companies providing residential property brokerage/agency, appraisal, consultancy and management/administration services.
notation: 6010102050
valid from: 2020
is activity of: Real Estate Services

Real Estate Services
type: NamedIndividual
type: BusinessClassification
type: Industry
is contemporary version of: http://data.ga-group.nl/ics/trbc/60101020
is version of: http://data.ga-group.nl/ics/trbc/60101020
imported on: 2023-04-07T16:52:39.364811Z
last refreshed on: 2026-06-05T07:16:11.699Z
source accessed on: 2017-12-31T07:04:19Z
source last accessed on: 2021-08-01T01:06:53Z
definition: Real estate brokers, agency services, real estate appraisal services, consulting services and management services.
notation: 60101020
valid from: 2020
is industry of: Real Estate Operations

Real Estate Operations
type: NamedIndividual
type: BusinessClassification
type: IndustryGroup
is contemporary version of: http://data.ga-group.nl/ics/trbc/601010
is version of: http://data.ga-group.nl/ics/trbc/601010
imported on: 2023-04-07T16:52:39.364811Z
last refreshed on: 2026-06-05T07:16:11.699Z
source accessed on: 2017-12-31T07:04:19Z
source last accessed on: 2021-08-01T01:06:53Z
definition: Developers and managers of real estate who build, rent and lease residential and commercial properties. Includes real estate brokerage and agency services, real estate appraisal services and consulting services.
notation: 601010
valid from: 2020
is industry group of: Real Estate

Diversified REITs
type: NamedIndividual
type: Activity
type: BusinessClassification
is contemporary version of: http://data.ga-group.nl/ics/trbc/6010201010
is version of: http://data.ga-group.nl/ics/trbc/6010201010
imported on: 2023-04-07T16:52:39.364811Z
last refreshed on: 2026-06-05T07:16:11.699Z
source accessed on: 2017-12-31T07:04:19Z
source last accessed on: 2021-08-01T01:06:53Z
definition: Companies engaged in providing securitization of interests related to residential and commercial real estate.
notation: 6010201010
valid from: 2020
is activity of: Diversified REITs

Diversified REITs
type: NamedIndividual
type: BusinessClassification
type: Industry
is contemporary version of: http://data.ga-group.nl/ics/trbc/60102010
is version of: http://data.ga-group.nl/ics/trbc/60102010
imported on: 2023-04-07T16:52:39.364811Z
last refreshed on: 2026-06-05T07:16:11.699Z
source accessed on: 2017-12-31T07:04:19Z
source last accessed on: 2021-08-01T01:06:53Z
definition: Operators of investment trusts that secure interests related to residential and commercial real estate.
notation: 60102010
valid from: 2020
is industry of: Residential & Commercial REITs

Commercial REITs (NEC)
type: NamedIndividual
type: Activity
type: BusinessClassification
is contemporary version of: http://data.ga-group.nl/ics/trbc/6010202010
is version of: http://data.ga-group.nl/ics/trbc/6010202010
imported on: 2023-04-07T16:52:39.364811Z
last refreshed on: 2026-06-05T07:16:11.699Z
source accessed on: 2017-12-31T07:04:19Z
source last accessed on: 2021-08-01T01:06:53Z
definition: Companies involved in at least two activities under the Commercial REITs industry, none being dominant: Office REITs, Retail REITs and Industrial REITs. Includes also entities not classified elsewhere under the Commercial REITs industry. Excludes companies that invest in commercial real estate assets, but do not have REIT status, classified under the Real Estate Rental, Operations and Development industry.
notation: 6010202010
valid from: 2020
is activity of: Commercial REITs

Office REITs
type: NamedIndividual
type: Activity
type: BusinessClassification
is contemporary version of: http://data.ga-group.nl/ics/trbc/6010202020
is version of: http://data.ga-group.nl/ics/trbc/6010202020
imported on: 2023-04-07T16:52:39.364811Z
last refreshed on: 2026-06-05T07:16:11.699Z
source accessed on: 2017-12-31T07:04:19Z
source last accessed on: 2021-08-01T01:06:53Z
definition: Companies engaged in securization of interest related to office properties. Excludes companies that invest in office real estate assets, but do not have REIT status, classified under the Real Estate Rental, Operations and Development industry.
notation: 6010202020
valid from: 2020
is activity of: Commercial REITs

Retail REITs
type: NamedIndividual
type: Activity
type: BusinessClassification
is contemporary version of: http://data.ga-group.nl/ics/trbc/6010202030
is version of: http://data.ga-group.nl/ics/trbc/6010202030
imported on: 2023-04-07T16:52:39.364811Z
last refreshed on: 2026-06-05T07:16:11.699Z
source accessed on: 2017-12-31T07:04:19Z
source last accessed on: 2021-08-01T01:06:53Z
definition: Companies engaged in securization of interest related to commercial properties, such as retail stores, restaurants, gas stations, shopping centers and malls. Excludes companies that invest in retail real estate assets, but do not have REIT status, classified in respective activity under Real Estate Rental, Operations and Development industry. Excludes REITs involved in investing in hotels, classified as Hospitality REITs; investing in healthcare facilities, classified as Healthcare REITs; investing in self -storage facilities, classified as Self-Storage REITs.
notation: 6010202030
valid from: 2020
is activity of: Commercial REITs

Industrial REITs
type: NamedIndividual
type: Activity
type: BusinessClassification
is contemporary version of: http://data.ga-group.nl/ics/trbc/6010202040
is version of: http://data.ga-group.nl/ics/trbc/6010202040
imported on: 2023-04-07T16:52:39.364811Z
last refreshed on: 2026-06-05T07:16:11.699Z
source accessed on: 2017-12-31T07:04:19Z
source last accessed on: 2021-08-01T01:06:53Z
definition: Companies engaged in securization of interest related to industrial properties, such as factories, warehouses, among others. Excludes companies that invest in industrial real estate assets, but do not have REIT status, classified under the Real Estate Rental, Operations and Development industry.
notation: 6010202040
valid from: 2020
is activity of: Commercial REITs

Commercial REITs
type: NamedIndividual
type: BusinessClassification
type: Industry
is contemporary version of: http://data.ga-group.nl/ics/trbc/60102020
is version of: http://data.ga-group.nl/ics/trbc/60102020
imported on: 2023-04-07T16:52:39.364811Z
last refreshed on: 2026-06-05T07:16:11.699Z
source accessed on: 2017-12-31T07:04:19Z
source last accessed on: 2021-08-01T01:06:53Z
definition: Operators of investment trusts that secure interests related to commercial real estate, such as office, retail and industrial properties.
notation: 60102020
valid from: 2020
is industry of: Residential & Commercial REITs

Residential REITs
type: NamedIndividual
type: Activity
type: BusinessClassification
is contemporary version of: http://data.ga-group.nl/ics/trbc/6010203010
is version of: http://data.ga-group.nl/ics/trbc/6010203010
imported on: 2023-04-07T16:52:39.364811Z
last refreshed on: 2026-06-05T07:16:11.699Z
source accessed on: 2017-12-31T07:04:19Z
source last accessed on: 2021-08-01T01:06:53Z
definition: Companies engaged in securization of interest related to residential properties, such as single- and multi-family houses, flats and apartments. Excludes companies that invest in residential real estate assets, but do not have REIT status, classified in respective activity under Real Estate Rental, Operations and Development industry.
notation: 6010203010
valid from: 2020
is activity of: Residential REITs

Residential REITs
type: NamedIndividual
type: BusinessClassification
type: Industry
is contemporary version of: http://data.ga-group.nl/ics/trbc/60102030
is version of: http://data.ga-group.nl/ics/trbc/60102030
imported on: 2023-04-07T16:52:39.364811Z
last refreshed on: 2026-06-05T07:16:11.699Z
source accessed on: 2017-12-31T07:04:19Z
source last accessed on: 2021-08-01T01:06:53Z
definition: Operators of investment trusts that secure interests related to residential real estate, such as single- and multi-family homes, apartment complexes and condominiums.
notation: 60102030
valid from: 2020
is industry of: Residential & Commercial REITs

Specialized REITs (NEC)
type: NamedIndividual
type: Activity
type: BusinessClassification
is contemporary version of: http://data.ga-group.nl/ics/trbc/6010204010
is version of: http://data.ga-group.nl/ics/trbc/6010204010
imported on: 2023-04-07T16:52:39.364811Z
last refreshed on: 2026-06-05T07:16:11.699Z
source accessed on: 2017-12-31T07:04:19Z
source last accessed on: 2021-08-01T01:06:53Z
definition: Companies involved in in at least two activities under the Specialized REITs Industry, none being dominant: Healthcare REITs, Hospitality REITs, Self-Storage REITs, Timber REITs, Mortgage REITs. Includes also entities not elsewhere classified under the Specialized REITs industry.
notation: 6010204010
valid from: 2020
is activity of: Specialized REITs

Healthcare REITs
type: NamedIndividual
type: Activity
type: BusinessClassification
is contemporary version of: http://data.ga-group.nl/ics/trbc/6010204020
is version of: http://data.ga-group.nl/ics/trbc/6010204020
imported on: 2023-04-07T16:52:39.364811Z
last refreshed on: 2026-06-05T07:16:11.699Z
source accessed on: 2017-12-31T07:04:19Z
source last accessed on: 2021-08-01T01:06:53Z
definition: Companies engaged in securitization of interests related to healthcare properties, such as hospitals, clinics, outpatient medical care centers, skilled nursing facilities and medical office buildings.
notation: 6010204020
valid from: 2020
is activity of: Specialized REITs

Hospitality REITs
type: NamedIndividual
type: Activity
type: BusinessClassification
is contemporary version of: http://data.ga-group.nl/ics/trbc/6010204030
is version of: http://data.ga-group.nl/ics/trbc/6010204030
imported on: 2023-04-07T16:52:39.364811Z
last refreshed on: 2026-06-05T07:16:11.699Z
source accessed on: 2017-12-31T07:04:19Z
source last accessed on: 2021-08-01T01:06:53Z
definition: Companies engaged in securitization of interests related to hospitality properties, such as hotels, motels, resorts and lodging (holiday accommodation).
notation: 6010204030
valid from: 2020
is activity of: Specialized REITs

Self-Storage REITs
type: NamedIndividual
type: Activity
type: BusinessClassification
is contemporary version of: http://data.ga-group.nl/ics/trbc/6010204040
is version of: http://data.ga-group.nl/ics/trbc/6010204040
imported on: 2023-04-07T16:52:39.364811Z
last refreshed on: 2026-06-05T07:16:11.699Z
source accessed on: 2017-12-31T07:04:19Z
source last accessed on: 2021-08-01T01:06:53Z
definition: Companies engaged in securitization of interests related to self-storage properties, such as garages, non-industrial and warehouses.
notation: 6010204040
valid from: 2020
is activity of: Specialized REITs

Timber REITs
type: NamedIndividual
type: Activity
type: BusinessClassification
is contemporary version of: http://data.ga-group.nl/ics/trbc/6010204050
is version of: http://data.ga-group.nl/ics/trbc/6010204050
imported on: 2023-04-07T16:52:39.364811Z
last refreshed on: 2026-06-05T07:16:11.699Z
source accessed on: 2017-12-31T07:04:19Z
source last accessed on: 2021-08-01T01:06:53Z
definition: Companies engaged in securitization of interests related to woodlands and forestry.
notation: 6010204050
valid from: 2020
is activity of: Specialized REITs

Mortgage REITs
type: NamedIndividual
type: Activity
type: BusinessClassification
is contemporary version of: http://data.ga-group.nl/ics/trbc/6010204060
is version of: http://data.ga-group.nl/ics/trbc/6010204060
imported on: 2023-04-07T16:52:39.364811Z
last refreshed on: 2026-06-05T07:16:11.699Z
source accessed on: 2017-12-31T07:04:19Z
source last accessed on: 2021-08-01T01:06:53Z
definition: Companies engaged in investment and ownership of property mortgages. REITs loan money for mortgages to owners of real estate, or purchase existing mortgages or mortgage-backed securities.
notation: 6010204060
valid from: 2020
is activity of: Specialized REITs

Islamic REITs
type: NamedIndividual
type: Activity
type: BusinessClassification
is contemporary version of: http://data.ga-group.nl/ics/trbc/6010204070
is version of: http://data.ga-group.nl/ics/trbc/6010204070
imported on: 2023-04-07T16:52:39.364811Z
last refreshed on: 2026-06-05T07:16:11.699Z
source accessed on: 2017-12-31T07:04:19Z
source last accessed on: 2021-08-01T01:06:53Z
definition: Companies engaged in securitization of interests related to all type of properties, in accordance with Sharia law.
notation: 6010204070
valid from: 2020
is activity of: Specialized REITs

Specialized REITs
type: NamedIndividual
type: BusinessClassification
type: Industry
is contemporary version of: http://data.ga-group.nl/ics/trbc/60102040
is version of: http://data.ga-group.nl/ics/trbc/60102040
imported on: 2023-04-07T16:52:39.364811Z
last refreshed on: 2026-06-05T07:16:11.699Z
source accessed on: 2017-12-31T07:04:19Z
source last accessed on: 2021-08-01T01:06:53Z
definition: Operators of investment trusts that secure interests related to non-residential and non-commercial properties, such as Healthcare, Hospitals, Self-Storage, Mortgage , Islamic and Timber.
notation: 60102040
valid from: 2020
is industry of: Residential & Commercial REITs

Residential & Commercial REITs
type: NamedIndividual
type: BusinessClassification
type: IndustryGroup
is contemporary version of: http://data.ga-group.nl/ics/trbc/601020
is version of: http://data.ga-group.nl/ics/trbc/601020
imported on: 2023-04-07T16:52:39.364811Z
last refreshed on: 2026-06-05T07:16:11.699Z
source accessed on: 2017-12-31T07:04:19Z
source last accessed on: 2021-08-01T01:06:53Z
definition: Investment trusts that secure interests related to rights on residential and commercial real estate.
notation: 601020
valid from: 2020
is industry group of: Real Estate

Real Estate
type: NamedIndividual
type: BusinessClassification
type: BusinessSector
is contemporary version of: http://data.ga-group.nl/ics/trbc/6010
is version of: http://data.ga-group.nl/ics/trbc/6010
imported on: 2023-04-07T16:52:39.364811Z
last refreshed on: 2026-06-05T07:16:11.699Z
source accessed on: 2017-12-31T07:04:19Z
source last accessed on: 2021-08-01T01:06:53Z
definition: Developers and managers of real estate operations and related services. Includes residential, commercial and specialized real estate investment trusts.
notation: 6010
valid from: 2020
is business sector of: Real Estate

Real Estate
type: NamedIndividual
type: BusinessClassification
type: EconomicSector
is contemporary version of: http://data.ga-group.nl/ics/trbc/60
is version of: http://data.ga-group.nl/ics/trbc/60
imported on: 2023-04-07T17:17:07.492231Z
last refreshed on: 2026-06-05T07:16:11.699Z
source accessed on: 2021-04-25T05:48:36Z
source last accessed on: 2021-08-01T01:06:53Z
definition: Companies engaged in the development and/or management of real estate operations and related services, commercial, diversified and specialized (healthcare, hospitality, self-storage, timber, mortgage and Islamic) real estate investment trusts.
notation: 60
valid from: 2020

Religious Organizations
type: NamedIndividual
type: Activity
type: BusinessClassification
is contemporary version of: http://data.ga-group.nl/ics/trbc/6110101010
is version of: http://data.ga-group.nl/ics/trbc/6110101010
imported on: 2023-04-07T17:17:07.492231Z
last refreshed on: 2026-06-05T07:16:11.699Z
source accessed on: 2021-04-25T05:48:36Z
source last accessed on: 2021-08-01T01:06:53Z
definition: Organizations engaged in administrating organized religions, promotion of religious activities, running places of worship such as temples, churches etc.
notation: 6110101010
valid from: 2020
is activity of: Religious Organizations

Religious Organizations
type: NamedIndividual
type: BusinessClassification
type: Industry
is contemporary version of: http://data.ga-group.nl/ics/trbc/61101010
is version of: http://data.ga-group.nl/ics/trbc/61101010
imported on: 2023-04-07T17:17:07.492231Z
last refreshed on: 2026-06-05T07:16:11.699Z
source accessed on: 2021-04-25T05:48:36Z
source last accessed on: 2021-08-01T01:06:53Z
definition: Organizations engaged in administrating organized religions, promotion of religious activities, running places of worship such as temples, churches etc.
notation: 61101010
valid from: 2020
is industry of: Institutions, Associations & Organizations

Civic & Social Organizations
type: NamedIndividual
type: Activity
type: BusinessClassification
is contemporary version of: http://data.ga-group.nl/ics/trbc/6110102010
is version of: http://data.ga-group.nl/ics/trbc/6110102010
imported on: 2023-04-07T17:17:07.492231Z
last refreshed on: 2026-06-05T07:16:11.699Z
source accessed on: 2021-04-25T05:48:36Z
source last accessed on: 2021-08-01T01:06:53Z
definition: Organizations promoting the values of their members, examples include Parent Teacher associations, scouts, car clubs, book clubs, student unions, youth clubs etc.
notation: 6110102010
valid from: 2020
is activity of: Civic & Social Organizations

Civic & Social Organizations
type: NamedIndividual
type: BusinessClassification
type: Industry
is contemporary version of: http://data.ga-group.nl/ics/trbc/61101020
is version of: http://data.ga-group.nl/ics/trbc/61101020
imported on: 2023-04-07T17:17:07.492231Z
last refreshed on: 2026-06-05T07:16:11.699Z
source accessed on: 2021-04-25T05:48:36Z
source last accessed on: 2021-08-01T01:06:53Z
definition: Organizations promoting the values of their members, examples include Parent Teacher associations, scouts, car clubs, book clubs, student unions, youth clubs etc.
notation: 61101020
valid from: 2020
is industry of: Institutions, Associations & Organizations

Environmental Organizations
type: NamedIndividual
type: Activity
type: BusinessClassification
is contemporary version of: http://data.ga-group.nl/ics/trbc/6110103010
is version of: http://data.ga-group.nl/ics/trbc/6110103010
imported on: 2023-04-07T17:17:07.492231Z
last refreshed on: 2026-06-05T07:16:11.699Z
source accessed on: 2021-04-25T05:48:36Z
source last accessed on: 2021-08-01T01:06:53Z
definition: Organizations promoting environment protection, conservation and preventative measures.
notation: 6110103010
valid from: 2020
is activity of: Environmental Organizations

Environmental Organizations
type: NamedIndividual
type: BusinessClassification
type: Industry
is contemporary version of: http://data.ga-group.nl/ics/trbc/61101030
is version of: http://data.ga-group.nl/ics/trbc/61101030
imported on: 2023-04-07T17:17:07.492231Z
last refreshed on: 2026-06-05T07:16:11.699Z
source accessed on: 2021-04-25T05:48:36Z
source last accessed on: 2021-08-01T01:06:53Z
definition: Organizations promoting environment protection, conservation and preventative measures.
notation: 61101030
valid from: 2020
is industry of: Institutions, Associations & Organizations

Charity Organizations
type: NamedIndividual
type: Activity
type: BusinessClassification
is contemporary version of: http://data.ga-group.nl/ics/trbc/6110104010
is version of: http://data.ga-group.nl/ics/trbc/6110104010
imported on: 2023-04-07T17:17:07.492231Z
last refreshed on: 2026-06-05T07:16:11.699Z
source accessed on: 2021-04-25T05:48:36Z
source last accessed on: 2021-08-01T01:06:53Z
definition: Organizations engaged in promoting and raising money for charitable causes.
notation: 6110104010
valid from: 2020
is activity of: Charity Organizations

Charity Organizations
type: NamedIndividual
type: BusinessClassification
type: Industry
is contemporary version of: http://data.ga-group.nl/ics/trbc/61101040
is version of: http://data.ga-group.nl/ics/trbc/61101040
imported on: 2023-04-07T17:17:07.492231Z
last refreshed on: 2026-06-05T07:16:11.699Z
source accessed on: 2021-04-25T05:48:36Z
source last accessed on: 2021-08-01T01:06:53Z
definition: Organizations engaged in promoting and raising money for charitable causes.
notation: 61101040
valid from: 2020
is industry of: Institutions, Associations & Organizations

Professional Organizations (NEC)
type: NamedIndividual
type: Activity
type: BusinessClassification
is contemporary version of: http://data.ga-group.nl/ics/trbc/6110105010
is version of: http://data.ga-group.nl/ics/trbc/6110105010
imported on: 2023-04-07T17:17:07.492231Z
last refreshed on: 2026-06-05T07:16:11.699Z
source accessed on: 2021-04-25T05:48:36Z
source last accessed on: 2021-08-01T01:06:53Z
definition: Organizations engaged in at least two Business, Professional & Labor, Political and Non Governmental interests for their members, or not supported in a specific activity.
notation: 6110105010
valid from: 2020
is activity of: Professional Organizations

Business, Professional & Labor Organizations
type: NamedIndividual
type: Activity
type: BusinessClassification
is contemporary version of: http://data.ga-group.nl/ics/trbc/6110105020
is version of: http://data.ga-group.nl/ics/trbc/6110105020
imported on: 2023-04-07T17:17:07.492231Z
last refreshed on: 2026-06-05T07:16:11.699Z
source accessed on: 2021-04-25T05:48:36Z
source last accessed on: 2021-08-01T01:06:53Z
definition: Organizations engaged in the promotion of business, professional and labor interests of their members.
notation: 6110105020
valid from: 2020
is activity of: Professional Organizations

Political Organizations
type: NamedIndividual
type: Activity
type: BusinessClassification
is contemporary version of: http://data.ga-group.nl/ics/trbc/6110105030
is version of: http://data.ga-group.nl/ics/trbc/6110105030
imported on: 2023-04-07T17:17:07.492231Z
last refreshed on: 2026-06-05T07:16:11.699Z
source accessed on: 2021-04-25T05:48:36Z
source last accessed on: 2021-08-01T01:06:53Z
definition: Organizations engaged in promoting or raising funds for political parties or candidates.
notation: 6110105030
valid from: 2020
is activity of: Professional Organizations

Non-Governmental Organizations (NGOs)
type: NamedIndividual
type: Activity
type: BusinessClassification
is contemporary version of: http://data.ga-group.nl/ics/trbc/6110105040
is version of: http://data.ga-group.nl/ics/trbc/6110105040
imported on: 2023-04-07T17:17:07.492231Z
last refreshed on: 2026-06-05T07:16:11.699Z
source accessed on: 2021-04-25T05:48:36Z
source last accessed on: 2021-08-01T01:06:53Z
definition: Non-government professional organizations engaged in promoting the interests of their members.
notation: 6110105040
valid from: 2020
is activity of: Professional Organizations

Professional Organizations
type: NamedIndividual
type: BusinessClassification
type: Industry
is contemporary version of: http://data.ga-group.nl/ics/trbc/61101050
is version of: http://data.ga-group.nl/ics/trbc/61101050
imported on: 2023-04-07T17:17:07.492231Z
last refreshed on: 2026-06-05T07:16:11.699Z
source accessed on: 2021-04-25T05:48:36Z
source last accessed on: 2021-08-01T01:06:53Z
definition: Organizations engaged in Business, Professional & Labor, Political and other Non Governmental interests for their members.
notation: 61101050
valid from: 2020
is industry of: Institutions, Associations & Organizations

Institutions, Associations & Organizations
type: NamedIndividual
type: BusinessClassification
type: IndustryGroup
is contemporary version of: http://data.ga-group.nl/ics/trbc/611010
is version of: http://data.ga-group.nl/ics/trbc/611010
imported on: 2023-04-07T17:17:07.492231Z
last refreshed on: 2026-06-05T07:16:11.699Z
source accessed on: 2021-04-25T05:48:36Z
source last accessed on: 2021-08-01T01:06:53Z
definition: Institutions, Associations & Organizations engaged in administrating and promoting the interests and values of their members.
notation: 611010
valid from: 2020
is industry group of: Institutions, Associations & Organizations

Institutions, Associations & Organizations
type: NamedIndividual
type: BusinessClassification
type: BusinessSector
is contemporary version of: http://data.ga-group.nl/ics/trbc/6110
is version of: http://data.ga-group.nl/ics/trbc/6110
imported on: 2023-04-07T17:17:07.492231Z
last refreshed on: 2026-06-05T07:16:11.699Z
source accessed on: 2021-04-25T05:48:36Z
source last accessed on: 2021-08-01T01:06:53Z
definition: Institutions, Associations & Organizations engaged in administrating and promoting the interests and values of their members.
notation: 6110
valid from: 2020
is business sector of: Institutions, Associations & Organizations

Institutions, Associations & Organizations
type: NamedIndividual
type: BusinessClassification
type: EconomicSector
is contemporary version of: http://data.ga-group.nl/ics/trbc/61
is version of: http://data.ga-group.nl/ics/trbc/61
imported on: 2023-04-07T17:17:07.492231Z
last refreshed on: 2026-06-05T07:16:11.699Z
source accessed on: 2021-04-25T05:48:36Z
source last accessed on: 2021-08-01T01:06:53Z
definition: Institutions, Associations & Organizations engaged in administrating and promoting the interests and values of their members.
notation: 61
valid from: 2020

Government & Government Finance (NEC)
type: NamedIndividual
type: Activity
type: BusinessClassification
is contemporary version of: http://data.ga-group.nl/ics/trbc/6210101010
is version of: http://data.ga-group.nl/ics/trbc/6210101010
imported on: 2023-04-07T17:17:07.492231Z
last refreshed on: 2026-06-05T07:16:11.699Z
source accessed on: 2021-04-25T05:48:36Z
source last accessed on: 2021-08-01T01:06:53Z
definition: Organizations engaged in providing multiple government services with none being dominant or not having their own specific activity under the Government Activity Industry Group.
notation: 6210101010
valid from: 2020
is activity of: Government & Government Finance

Public Finance Activities
type: NamedIndividual
type: Activity
type: BusinessClassification
is contemporary version of: http://data.ga-group.nl/ics/trbc/6210101020
is version of: http://data.ga-group.nl/ics/trbc/6210101020
imported on: 2023-04-07T17:17:07.492231Z
last refreshed on: 2026-06-05T07:16:11.699Z
source accessed on: 2021-04-25T05:48:36Z
source last accessed on: 2021-08-01T01:06:53Z
definition: Organizations involved in public finance, debt issuance, budgeting/setting monetary policies and taxation.
notation: 6210101020
valid from: 2020
is activity of: Government & Government Finance

Government & Government Finance
type: NamedIndividual
type: BusinessClassification
type: Industry
is contemporary version of: http://data.ga-group.nl/ics/trbc/62101010
is version of: http://data.ga-group.nl/ics/trbc/62101010
imported on: 2023-04-07T17:17:07.492231Z
last refreshed on: 2026-06-05T07:16:11.699Z
source accessed on: 2021-04-25T05:48:36Z
source last accessed on: 2021-08-01T01:06:53Z
definition: Organizations engaged in providing government services and public finance activities.
notation: 62101010
valid from: 2020
is industry of: Government Activity

Legal & Safety Public Services (NEC)
type: NamedIndividual
type: Activity
type: BusinessClassification
is contemporary version of: http://data.ga-group.nl/ics/trbc/6210102010
is version of: http://data.ga-group.nl/ics/trbc/6210102010
imported on: 2023-04-07T17:17:07.492231Z
last refreshed on: 2026-06-05T07:16:11.699Z
source accessed on: 2021-04-25T05:48:36Z
source last accessed on: 2021-08-01T01:06:53Z
definition: Organizations engaged in providing legal and safety public services with none being dominant or not having their own specific activity under the Legal & Safety Public Services Industry Group.
notation: 6210102010
valid from: 2020
is activity of: Legal & Safety Public Services

Police, Justice & Legal Counsel
type: NamedIndividual
type: Activity
type: BusinessClassification
is contemporary version of: http://data.ga-group.nl/ics/trbc/6210102020
is version of: http://data.ga-group.nl/ics/trbc/6210102020
imported on: 2023-04-07T17:17:07.492231Z
last refreshed on: 2026-06-05T07:16:11.699Z
source accessed on: 2021-04-25T05:48:36Z
source last accessed on: 2021-08-01T01:06:53Z
definition: Organizations involved in the provision of criminal and civil law enforcement, public safety, courts and legal counsel.
notation: 6210102020
valid from: 2020
is activity of: Legal & Safety Public Services

Fire
type: NamedIndividual
type: Activity
type: BusinessClassification
is contemporary version of: http://data.ga-group.nl/ics/trbc/6210102030
is version of: http://data.ga-group.nl/ics/trbc/6210102030
imported on: 2023-04-07T17:17:07.492231Z
last refreshed on: 2026-06-05T07:16:11.699Z
source accessed on: 2021-04-25T05:48:36Z
source last accessed on: 2021-08-01T01:06:53Z
definition: Organizations involved in the provision of fire safety, preventative fire action and firefighting.
notation: 6210102030
valid from: 2020
is activity of: Legal & Safety Public Services

Legal & Safety Public Services
type: NamedIndividual
type: BusinessClassification
type: Industry
is contemporary version of: http://data.ga-group.nl/ics/trbc/62101020
is version of: http://data.ga-group.nl/ics/trbc/62101020
imported on: 2023-04-07T17:17:07.492231Z
last refreshed on: 2026-06-05T07:16:11.699Z
source accessed on: 2021-04-25T05:48:36Z
source last accessed on: 2021-08-01T01:06:53Z
definition: Organizations involved in the provision of legal and safety public services, including criminal and civil law enforcement, public safety, courts and legal counsel, fire safety, prevention and firefighting.
notation: 62101020
valid from: 2020
is industry of: Government Activity

Government Administration Activities
type: NamedIndividual
type: Activity
type: BusinessClassification
is contemporary version of: http://data.ga-group.nl/ics/trbc/6210103010
is version of: http://data.ga-group.nl/ics/trbc/6210103010
imported on: 2023-04-07T17:17:07.492231Z
last refreshed on: 2026-06-05T07:16:11.699Z
source accessed on: 2021-04-25T05:48:36Z
source last accessed on: 2021-08-01T01:06:53Z
definition: Organizations involved in the administration, supervision, regulation of government programs e.g. social, housing, public health, tourism.
notation: 6210103010
valid from: 2020
is activity of: Government Administration Activities

Government Administration Activities
type: NamedIndividual
type: BusinessClassification
type: Industry
is contemporary version of: http://data.ga-group.nl/ics/trbc/62101030
is version of: http://data.ga-group.nl/ics/trbc/62101030
imported on: 2023-04-07T17:17:07.492231Z
last refreshed on: 2026-06-05T07:16:11.699Z
source accessed on: 2021-04-25T05:48:36Z
source last accessed on: 2021-08-01T01:06:53Z
definition: Organizations involved in the administration, supervision, regulation of government programs e.g. social, housing, public health, tourism.
notation: 62101030
valid from: 2020
is industry of: Government Activity

National Security & International Affairs
type: NamedIndividual
type: Activity
type: BusinessClassification
is contemporary version of: http://data.ga-group.nl/ics/trbc/6210104010
is version of: http://data.ga-group.nl/ics/trbc/6210104010
imported on: 2023-04-07T17:17:07.492231Z
last refreshed on: 2026-06-05T07:16:11.699Z
source accessed on: 2021-04-25T05:48:36Z
source last accessed on: 2021-08-01T01:06:53Z
definition: Organizations engaged in the provision of armed forces and national security. This activity includes government organisations engaged in the setting and managing of international affairs.
notation: 6210104010
valid from: 2020
is activity of: National Security & International Affairs

National Security & International Affairs
type: NamedIndividual
type: BusinessClassification
type: Industry
is contemporary version of: http://data.ga-group.nl/ics/trbc/62101040
is version of: http://data.ga-group.nl/ics/trbc/62101040
imported on: 2023-04-07T17:17:07.492231Z
last refreshed on: 2026-06-05T07:16:11.699Z
source accessed on: 2021-04-25T05:48:36Z
source last accessed on: 2021-08-01T01:06:53Z
definition: Organizations engaged in the provision of armed forces, national security and international affairs.
notation: 62101040
valid from: 2020
is industry of: Government Activity

Government Activity
type: NamedIndividual
type: BusinessClassification
type: IndustryGroup
is contemporary version of: http://data.ga-group.nl/ics/trbc/621010
is version of: http://data.ga-group.nl/ics/trbc/621010
imported on: 2023-04-07T17:17:07.492231Z
last refreshed on: 2026-06-05T07:16:11.699Z
source accessed on: 2021-04-25T05:48:36Z
source last accessed on: 2021-08-01T01:06:53Z
definition: Organizations engaged in government related activities, including public finance, police, fire, legal, administration, national security and international affairs.
notation: 621010
valid from: 2020
is industry group of: Government Activity

Government Activity
type: NamedIndividual
type: BusinessClassification
type: BusinessSector
is contemporary version of: http://data.ga-group.nl/ics/trbc/6210
is version of: http://data.ga-group.nl/ics/trbc/6210
imported on: 2023-04-07T17:17:07.492231Z
last refreshed on: 2026-06-05T07:16:11.699Z
source accessed on: 2021-04-25T05:48:36Z
source last accessed on: 2021-08-01T01:06:53Z
definition: Organizations engaged in government related activities, including public finance, police, fire, legal, administration, national security and international affairs.
notation: 6210
valid from: 2020
is business sector of: Government Activity

Government Activity
type: NamedIndividual
type: BusinessClassification
type: EconomicSector
is contemporary version of: http://data.ga-group.nl/ics/trbc/62
is version of: http://data.ga-group.nl/ics/trbc/62
imported on: 2023-04-07T17:17:07.492231Z
last refreshed on: 2026-06-05T07:16:11.699Z
source accessed on: 2021-04-25T05:48:36Z
source last accessed on: 2021-08-01T01:06:53Z
definition: Organizations engaged in government related activities, including public finance, police, fire, legal, administration, national security and international affairs.
notation: 62
valid from: 2020

Miscellaneous Educational Service Providers
type: NamedIndividual
type: Activity
type: BusinessClassification
is contemporary version of: http://data.ga-group.nl/ics/trbc/6310101010
is version of: http://data.ga-group.nl/ics/trbc/6310101010
imported on: 2023-04-07T16:52:39.364811Z
last refreshed on: 2026-06-05T07:16:11.699Z
source accessed on: 2017-12-31T07:04:19Z
source last accessed on: 2021-08-01T01:06:53Z
definition: Companies engaged in providing any other educational provision or course not covered elsewhere in the Academic & Educational Services Business Group.
notation: 6310101010
valid from: 2020
is activity of: Miscellaneous Educational Service Providers

Miscellaneous Educational Service Providers
type: NamedIndividual
type: BusinessClassification
type: Industry
is contemporary version of: http://data.ga-group.nl/ics/trbc/63101010
is version of: http://data.ga-group.nl/ics/trbc/63101010
imported on: 2023-04-07T17:17:07.492231Z
last refreshed on: 2026-06-05T07:16:11.699Z
source accessed on: 2021-04-25T05:48:36Z
source last accessed on: 2021-08-01T01:06:53Z
definition: Companies engaged in providing any other educational provision or course not covered elsewhere in the Academic & Educational Services Business Group.
notation: 63101010
valid from: 2020
is industry of: Miscellaneous Educational Service Providers

Miscellaneous Educational Service Providers
type: NamedIndividual
type: BusinessClassification
type: IndustryGroup
is contemporary version of: http://data.ga-group.nl/ics/trbc/631010
is version of: http://data.ga-group.nl/ics/trbc/631010
imported on: 2023-04-07T17:17:07.492231Z
last refreshed on: 2026-06-05T07:16:11.699Z
source accessed on: 2021-04-25T05:48:36Z
source last accessed on: 2021-08-01T01:06:53Z
definition: Providers of other educational provision or course not covered elsewhere in the Academic & Educational Services Business Group.
notation: 631010
valid from: 2020
is industry group of: Academic & Educational Services

Schools, Colleges & Universities (NEC)
type: NamedIndividual
type: Activity
type: BusinessClassification
is contemporary version of: http://data.ga-group.nl/ics/trbc/6310201010
is version of: http://data.ga-group.nl/ics/trbc/6310201010
imported on: 2023-04-07T17:17:07.492231Z
last refreshed on: 2026-06-05T07:16:11.699Z
source accessed on: 2021-04-25T05:48:36Z
source last accessed on: 2021-08-01T01:06:53Z
definition: Organizations engaged in providing two or more academic education services with none being dominant or not having their own specific activity under the Schools, Colleges & Universities industry group.
notation: 6310201010
valid from: 2020
is activity of: Schools, Colleges & Universities

Nursery & Pre-Schools
type: NamedIndividual
type: Activity
type: BusinessClassification
is contemporary version of: http://data.ga-group.nl/ics/trbc/6310201020
is version of: http://data.ga-group.nl/ics/trbc/6310201020
imported on: 2023-04-07T17:17:07.492231Z
last refreshed on: 2026-06-05T07:16:11.699Z
source accessed on: 2021-04-25T05:48:36Z
source last accessed on: 2021-08-01T01:06:53Z
definition: Organizations providing nursery, pre-school and kindergarten services. The activity includes governing boards of the Nursery & Pre-Schools.
notation: 6310201020
valid from: 2020
is activity of: Schools, Colleges & Universities

Elementary & Primary Schools
type: NamedIndividual
type: Activity
type: BusinessClassification
is contemporary version of: http://data.ga-group.nl/ics/trbc/6310201030
is version of: http://data.ga-group.nl/ics/trbc/6310201030
imported on: 2023-04-07T17:17:07.492231Z
last refreshed on: 2026-06-05T07:16:11.699Z
source accessed on: 2021-04-25T05:48:36Z
source last accessed on: 2021-08-01T01:06:53Z
definition: Organizations providing academic education at the elementary or primary level as a follow on to the Nursery & Pre-Schools level activity. The activity includes governing boards of the Elementary & Primary schools.
notation: 6310201030
valid from: 2020
is activity of: Schools, Colleges & Universities

Colleges & Secondary Schools
type: NamedIndividual
type: Activity
type: BusinessClassification
is contemporary version of: http://data.ga-group.nl/ics/trbc/6310201040
is version of: http://data.ga-group.nl/ics/trbc/6310201040
imported on: 2023-04-07T17:17:07.492231Z
last refreshed on: 2026-06-05T07:16:11.699Z
source accessed on: 2021-04-25T05:48:36Z
source last accessed on: 2021-08-01T01:06:53Z
definition: Organizations providing academic courses at the secondary or college level as a follow on to the Elementary & Primary Schools level activity. The activity includes governing boards of the Colleges & Secondary schools.
notation: 6310201040
valid from: 2020
is activity of: Schools, Colleges & Universities

Universities
type: NamedIndividual
type: Activity
type: BusinessClassification
is contemporary version of: http://data.ga-group.nl/ics/trbc/6310201050
is version of: http://data.ga-group.nl/ics/trbc/6310201050
imported on: 2023-04-07T17:17:07.492231Z
last refreshed on: 2026-06-05T07:16:11.699Z
source accessed on: 2021-04-25T05:48:36Z
source last accessed on: 2021-08-01T01:06:53Z
definition: Organizations providing academic courses at the university and graduate level as a follow on to the Colleges & Secondary Schools level activity. The activity includes regents and governing boards of the universities.
notation: 6310201050
valid from: 2020
is activity of: Schools, Colleges & Universities

School Districts
type: NamedIndividual
type: Activity
type: BusinessClassification
is contemporary version of: http://data.ga-group.nl/ics/trbc/6310201060
is version of: http://data.ga-group.nl/ics/trbc/6310201060
imported on: 2023-04-07T17:17:07.492231Z
last refreshed on: 2026-06-05T07:16:11.699Z
source accessed on: 2021-04-25T05:48:36Z
source last accessed on: 2021-08-01T01:06:53Z
definition: Organizations involved in the management of school districts and their services; these may contain one or more levels of schools, colleges, universities within the Schools, Colleges & Universities industry.
notation: 6310201060
valid from: 2020
is activity of: Schools, Colleges & Universities

Schools, Colleges & Universities
type: NamedIndividual
type: BusinessClassification
type: Industry
is contemporary version of: http://data.ga-group.nl/ics/trbc/63102010
is version of: http://data.ga-group.nl/ics/trbc/63102010
imported on: 2023-04-07T17:17:07.492231Z
last refreshed on: 2026-06-05T07:16:11.699Z
source accessed on: 2021-04-25T05:48:36Z
source last accessed on: 2021-08-01T01:06:53Z
definition: Organizations involved in the provision, management and governance of schools, colleges and universities including nursery/pre-schools and school districts.
notation: 63102010
valid from: 2020
is industry of: Schools, Colleges & Universities

Schools, Colleges & Universities
type: NamedIndividual
type: BusinessClassification
type: IndustryGroup
is contemporary version of: http://data.ga-group.nl/ics/trbc/631020
is version of: http://data.ga-group.nl/ics/trbc/631020
imported on: 2023-04-07T17:17:07.492231Z
last refreshed on: 2026-06-05T07:16:11.699Z
source accessed on: 2021-04-25T05:48:36Z
source last accessed on: 2021-08-01T01:06:53Z
definition: Organizations involved in the provision, management and governance of schools, colleges and universities including nursery/pre-schools and school districts.
notation: 631020
valid from: 2020
is industry group of: Academic & Educational Services

Professional & Business Education
type: NamedIndividual
type: Activity
type: BusinessClassification
is contemporary version of: http://data.ga-group.nl/ics/trbc/6310301010
is version of: http://data.ga-group.nl/ics/trbc/6310301010
imported on: 2023-04-07T16:52:39.364811Z
last refreshed on: 2026-06-05T07:16:11.699Z
source accessed on: 2017-12-31T07:04:19Z
source last accessed on: 2021-08-01T01:06:53Z
definition: Companies engaged in the provision of non-academic professional and business education e.g. on-job training, vocational training, and other types of employee training. It also includes business, management and technical schools and training.
notation: 6310301010
valid from: 2020
is activity of: Professional & Business Education

Professional & Business Education
type: NamedIndividual
type: BusinessClassification
type: Industry
is contemporary version of: http://data.ga-group.nl/ics/trbc/63103010
is version of: http://data.ga-group.nl/ics/trbc/63103010
imported on: 2023-04-07T17:17:07.492231Z
last refreshed on: 2026-06-05T07:16:11.699Z
source accessed on: 2021-04-25T05:48:36Z
source last accessed on: 2021-08-01T01:06:53Z
definition: Companies engaged in the provision of non-academic professional and business education.
notation: 63103010
valid from: 2020
is industry of: Professional & Business Education

Professional & Business Education
type: NamedIndividual
type: BusinessClassification
type: IndustryGroup
is contemporary version of: http://data.ga-group.nl/ics/trbc/631030
is version of: http://data.ga-group.nl/ics/trbc/631030
imported on: 2023-04-07T17:17:07.492231Z
last refreshed on: 2026-06-05T07:16:11.699Z
source accessed on: 2021-04-25T05:48:36Z
source last accessed on: 2021-08-01T01:06:53Z
definition: Providers of non-academic professional and business education.
notation: 631030
valid from: 2020
is industry group of: Academic & Educational Services

Academic & Educational Services
type: NamedIndividual
type: BusinessClassification
type: BusinessSector
is contemporary version of: http://data.ga-group.nl/ics/trbc/6310
is version of: http://data.ga-group.nl/ics/trbc/6310
imported on: 2023-04-07T17:17:07.492231Z
last refreshed on: 2026-06-05T07:16:11.699Z
source accessed on: 2021-04-25T05:48:36Z
source last accessed on: 2021-08-01T01:06:53Z
definition: Organizations engaged in providing, managing and governing academic courses, non-academic education and training.
notation: 6310
valid from: 2020
is business sector of: Academic & Educational Services

Academic & Educational Services
type: NamedIndividual
type: BusinessClassification
type: EconomicSector
is contemporary version of: http://data.ga-group.nl/ics/trbc/63
is version of: http://data.ga-group.nl/ics/trbc/63
imported on: 2023-04-07T17:17:07.492231Z
last refreshed on: 2026-06-05T07:16:11.699Z
source accessed on: 2021-04-25T05:48:36Z
source last accessed on: 2021-08-01T01:06:53Z
definition: Organizations engaged in providing, managing and governing academic courses, non-academic education and training.
notation: 63
valid from: 2020