icb individuals
type: Ontology
download URL: http://data.ga-group.nl/ics/icb2005.ttl
abstract: This ontology includes individuals representing the set of classification codes based on the principal business activity of the company. This set of classification codes is valid from 2005-01-01 till 2007-03-01.
creator: https://orcid.org/0000-0002-7352-2825
description: The Industry Classification Benchmark (ICB) is an industry classification taxonomy launched by Dow Jones and FTSE in 2005 and now used by FTSE International and STOXX. Codes are four-tiered, numeric, and not prefix-free. The first tier is called industry, the second tier is the supersector, the third tier is the sector, and the fourth tier is the subsector. FTSE/Russell is responsible for assigning an ICB classification to all major public companies. Each company is allocated to the subsector that most closely represents the nature of its business, which is determined by its source of revenue or where it constitutes the majority of revenue.
format: text/turtle
issued: 2026-05-31T02:25:19Z
language: en
license: https://creativecommons.org/licenses/by-sa/4.0/
modified: 2026-05-31T02:25:19Z
publisher: https://orcid.org/0000-0002-7352-2825
has maturity level: Release
imports: SecuritiesClassification
imports: ics
version info: 2005
content language: owl2-quick-reference
label: icb 2005
contributor: PAMIYA Strategic Advisors GmbH
copyright: Copyright (c) 2004 FTSE International Limited
copyright: Copyright (c) 2004 Dow Jones & Co, Inc.
copyright: Copyright (c) 2022-2026 PAMIYA Strategic Advisors GmbH
filename: icb2005.ttl
valid from: 2005-01-01
valid till: 2007-03-01
preferred namespace prefix: icb2005

Oil & Gas
type: IndustryClassificationBenchmarkClassifier
type: IndustryClassifier
type: NamedIndividual
is contemporary version of: http://data.ga-group.nl/ics/icb/0001
is replaced by: http://data.ga-group.nl/ics/icb/2007/0001
is version of: http://data.ga-group.nl/ics/icb/0001
imported on: 2026-06-01T03:03:54.132Z
last refreshed on: 2026-06-01T10:28:56.931Z
source accessed on: 2015-03-30T23:37:37Z
source last accessed on: 2015-03-30T23:37:37Z
notation: 0001
valid from: 2005-01-01
valid till: 2007-03-01

Oil & Gas
type: IndustryClassificationBenchmarkClassifier
type: SupersectorClassifier
type: NamedIndividual
is contemporary version of: http://data.ga-group.nl/ics/icb/0500
is replaced by: http://data.ga-group.nl/ics/icb/2007/0500
is version of: http://data.ga-group.nl/ics/icb/0500
is supersector of: Oil & Gas
imported on: 2026-06-01T03:03:54.132Z
last refreshed on: 2026-06-01T10:28:56.931Z
source accessed on: 2015-03-30T23:37:37Z
source last accessed on: 2015-03-30T23:37:37Z
notation: 0500
valid from: 2005-01-01
valid till: 2007-03-01

Oil & Gas Producers
type: IndustryClassificationBenchmarkClassifier
type: SectorClassifier
type: NamedIndividual
is contemporary version of: http://data.ga-group.nl/ics/icb/0530
is replaced by: http://data.ga-group.nl/ics/icb/2007/0530
is version of: http://data.ga-group.nl/ics/icb/0530
is sector of: Oil & Gas
imported on: 2026-06-01T03:03:54.132Z
last refreshed on: 2026-06-01T10:28:56.931Z
source accessed on: 2015-03-30T23:37:37Z
source last accessed on: 2015-03-30T23:37:37Z
notation: 0530
valid from: 2005-01-01
valid till: 2007-03-01

Exploration & Production
type: IndustryClassificationBenchmarkClassifier
type: SubsectorClassifier
type: NamedIndividual
is contemporary version of: http://data.ga-group.nl/ics/icb/0533
is replaced by: http://data.ga-group.nl/ics/icb/2007/0533
is version of: http://data.ga-group.nl/ics/icb/0533
is subsector of: Oil & Gas Producers
imported on: 2026-06-01T03:03:54.132Z
last refreshed on: 2026-06-01T10:28:56.931Z
source accessed on: 2015-03-30T23:37:37Z
source last accessed on: 2015-03-30T23:37:37Z
definition: Companies engaged in the exploration for and drilling, production, refining and supply of oil and gas products.
notation: 0533
valid from: 2005-01-01
valid till: 2007-03-01

Integrated Oil & Gas
type: IndustryClassificationBenchmarkClassifier
type: SubsectorClassifier
type: NamedIndividual
is contemporary version of: http://data.ga-group.nl/ics/icb/0537
is replaced by: http://data.ga-group.nl/ics/icb/2007/0537
is version of: http://data.ga-group.nl/ics/icb/0537
is subsector of: Oil & Gas Producers
imported on: 2026-06-01T03:03:54.132Z
last refreshed on: 2026-06-01T10:28:56.931Z
source accessed on: 2015-03-30T23:37:37Z
source last accessed on: 2015-03-30T23:37:37Z
definition: Integrated oil and gas companies engaged in the exploration for and drilling, production, refining and distribution of oil and gas products.
notation: 0537
valid from: 2005-01-01
valid till: 2007-03-01

Oil Equipment, Services & Distribution
type: IndustryClassificationBenchmarkClassifier
type: SectorClassifier
type: NamedIndividual
is contemporary version of: http://data.ga-group.nl/ics/icb/0570
is replaced by: http://data.ga-group.nl/ics/icb/2007/0570
is version of: http://data.ga-group.nl/ics/icb/0570
is sector of: Oil & Gas
imported on: 2026-06-01T03:03:54.132Z
last refreshed on: 2026-06-01T10:28:56.931Z
source accessed on: 2015-03-30T23:37:37Z
source last accessed on: 2015-03-30T23:37:37Z
notation: 0570
valid from: 2005-01-01
valid till: 2007-03-01

Oil Equipment & Services
type: IndustryClassificationBenchmarkClassifier
type: SubsectorClassifier
type: NamedIndividual
is contemporary version of: http://data.ga-group.nl/ics/icb/0573
is replaced by: http://data.ga-group.nl/ics/icb/2007/0573
is version of: http://data.ga-group.nl/ics/icb/0573
is subsector of: Oil Equipment, Services & Distribution
imported on: 2026-06-01T03:03:54.132Z
last refreshed on: 2026-06-01T10:28:56.931Z
source accessed on: 2015-03-30T23:37:37Z
source last accessed on: 2015-03-30T23:37:37Z
definition: Suppliers of equipment and services to oil fields and offshore platforms, such as drilling, exploration, seismic-information services and platform construction.
notation: 0573
valid from: 2005-01-01
valid till: 2007-03-01

Pipelines
type: IndustryClassificationBenchmarkClassifier
type: SubsectorClassifier
type: NamedIndividual
is contemporary version of: http://data.ga-group.nl/ics/icb/0577
is replaced by: http://data.ga-group.nl/ics/icb/2007/0577
is version of: http://data.ga-group.nl/ics/icb/0577
is subsector of: Oil Equipment, Services & Distribution
imported on: 2026-06-01T03:03:54.132Z
last refreshed on: 2026-06-01T10:28:56.931Z
source accessed on: 2015-03-30T23:37:37Z
source last accessed on: 2015-03-30T23:37:37Z
definition: Operators of pipelines carrying oil, gas or other forms of fuel. Excludes pipeline operators that derive the majority of their revenues from direct sales to end users, which are classified under Gas Distribution.
notation: 0577
valid from: 2005-01-01
valid till: 2007-03-01

Basic Materials
type: IndustryClassificationBenchmarkClassifier
type: IndustryClassifier
type: NamedIndividual
is contemporary version of: http://data.ga-group.nl/ics/icb/1000
is replaced by: http://data.ga-group.nl/ics/icb/2007/1000
is version of: http://data.ga-group.nl/ics/icb/1000
imported on: 2026-06-01T03:03:54.132Z
last refreshed on: 2026-06-01T10:28:56.931Z
source accessed on: 2015-03-30T23:37:37Z
source last accessed on: 2015-03-30T23:37:37Z
notation: 1000
valid from: 2005-01-01
valid till: 2007-03-01

Chemicals
type: IndustryClassificationBenchmarkClassifier
type: SupersectorClassifier
type: NamedIndividual
is contemporary version of: http://data.ga-group.nl/ics/icb/1300
is replaced by: http://data.ga-group.nl/ics/icb/2007/1300
is version of: http://data.ga-group.nl/ics/icb/1300
is supersector of: Basic Materials
imported on: 2026-06-01T03:03:54.132Z
last refreshed on: 2026-06-01T10:28:56.931Z
source accessed on: 2015-03-30T23:37:37Z
source last accessed on: 2015-03-30T23:37:37Z
notation: 1300
valid from: 2005-01-01
valid till: 2007-03-01

Chemicals
type: IndustryClassificationBenchmarkClassifier
type: SectorClassifier
type: NamedIndividual
is contemporary version of: http://data.ga-group.nl/ics/icb/1350
is replaced by: http://data.ga-group.nl/ics/icb/2007/1350
is version of: http://data.ga-group.nl/ics/icb/1350
is sector of: Chemicals
imported on: 2026-06-01T03:03:54.132Z
last refreshed on: 2026-06-01T10:28:56.931Z
source accessed on: 2015-03-30T23:37:37Z
source last accessed on: 2015-03-30T23:37:37Z
notation: 1350
valid from: 2005-01-01
valid till: 2007-03-01

Commodity Chemicals
type: IndustryClassificationBenchmarkClassifier
type: SubsectorClassifier
type: NamedIndividual
is contemporary version of: http://data.ga-group.nl/ics/icb/1353
is replaced by: http://data.ga-group.nl/ics/icb/2007/1353
is version of: http://data.ga-group.nl/ics/icb/1353
is subsector of: Chemicals
imported on: 2026-06-01T03:03:54.132Z
last refreshed on: 2026-06-01T10:28:56.931Z
source accessed on: 2015-03-30T23:37:37Z
source last accessed on: 2015-03-30T23:37:37Z
definition: Producers and distributors of simple chemical products that are primarily used to formulate more complex chemicals or products, including plastics and rubber in their raw form, fiberglass and synthetic fibers.
notation: 1353
valid from: 2005-01-01
valid till: 2007-03-01

Specialty Chemicals
type: IndustryClassificationBenchmarkClassifier
type: SubsectorClassifier
type: NamedIndividual
is contemporary version of: http://data.ga-group.nl/ics/icb/1357
is replaced by: http://data.ga-group.nl/ics/icb/2007/1357
is version of: http://data.ga-group.nl/ics/icb/1357
is subsector of: Chemicals
imported on: 2026-06-01T03:03:54.132Z
last refreshed on: 2026-06-01T10:28:56.931Z
source accessed on: 2015-03-30T23:37:37Z
source last accessed on: 2015-03-30T23:37:37Z
definition: Producers and distributors of finished chemicals for industries or end users, including dyes, cellular polymers, coatings, special plastics and other chemicals for specialized applications. Includes makers of colorings, flavors and fragrances, fertilizers, pesticides, chemicals used to make drugs, paint in its pigment form and glass in its unfinished form. Excludes producers of paint and glass products used for construction, which are classified under Building Materials & Fixtures.
notation: 1357
valid from: 2005-01-01
valid till: 2007-03-01

Basic Resources
type: IndustryClassificationBenchmarkClassifier
type: SupersectorClassifier
type: NamedIndividual
is contemporary version of: http://data.ga-group.nl/ics/icb/1700
is replaced by: http://data.ga-group.nl/ics/icb/2007/1700
is version of: http://data.ga-group.nl/ics/icb/1700
is supersector of: Basic Materials
imported on: 2026-06-01T03:03:54.132Z
last refreshed on: 2026-06-01T10:28:56.931Z
source accessed on: 2015-03-30T23:37:37Z
source last accessed on: 2015-03-30T23:37:37Z
notation: 1700
valid from: 2005-01-01
valid till: 2007-03-01

Forestry & Paper
type: IndustryClassificationBenchmarkClassifier
type: SectorClassifier
type: NamedIndividual
is contemporary version of: http://data.ga-group.nl/ics/icb/1730
is replaced by: http://data.ga-group.nl/ics/icb/2007/1730
is version of: http://data.ga-group.nl/ics/icb/1730
is sector of: Basic Resources
imported on: 2026-06-01T03:03:54.132Z
last refreshed on: 2026-06-01T10:28:56.931Z
source accessed on: 2015-03-30T23:37:37Z
source last accessed on: 2015-03-30T23:37:37Z
notation: 1730
valid from: 2005-01-01
valid till: 2007-03-01

Forestry
type: IndustryClassificationBenchmarkClassifier
type: SubsectorClassifier
type: NamedIndividual
is contemporary version of: http://data.ga-group.nl/ics/icb/1733
is replaced by: http://data.ga-group.nl/ics/icb/2007/1733
is version of: http://data.ga-group.nl/ics/icb/1733
is subsector of: Forestry & Paper
imported on: 2026-06-01T03:03:54.132Z
last refreshed on: 2026-06-01T10:28:56.931Z
source accessed on: 2015-03-30T23:37:37Z
source last accessed on: 2015-03-30T23:37:37Z
definition: Owners and operators of timber tracts, forest tree nurseries and sawmills. Excludes providers of finished wood products such as wooden beams, which are classified under Building Materials & Fixtures.
notation: 1733
valid from: 2005-01-01
valid till: 2007-03-01

Paper
type: IndustryClassificationBenchmarkClassifier
type: SubsectorClassifier
type: NamedIndividual
is contemporary version of: http://data.ga-group.nl/ics/icb/1737
is replaced by: http://data.ga-group.nl/ics/icb/2007/1737
is version of: http://data.ga-group.nl/ics/icb/1737
is subsector of: Forestry & Paper
imported on: 2026-06-01T03:03:54.132Z
last refreshed on: 2026-06-01T10:28:56.931Z
source accessed on: 2015-03-30T23:37:37Z
source last accessed on: 2015-03-30T23:37:37Z
definition: Producers, converters, merchants and distributors of all grades of paper. Excludes makers of printed forms, which are classified under Business Support Services, and manufacturers of paper items such as cups and napkins, which are classified under Nondurable Household Products.
notation: 1737
valid from: 2005-01-01
valid till: 2007-03-01

Industrial Metals
type: IndustryClassificationBenchmarkClassifier
type: SectorClassifier
type: NamedIndividual
is contemporary version of: http://data.ga-group.nl/ics/icb/1750
is replaced by: http://data.ga-group.nl/ics/icb/2007/1750
is version of: http://data.ga-group.nl/ics/icb/1750
is sector of: Basic Resources
imported on: 2026-06-01T03:03:54.132Z
last refreshed on: 2026-06-01T10:28:56.931Z
source accessed on: 2015-03-30T23:37:37Z
source last accessed on: 2015-03-30T23:37:37Z
notation: 1750
valid from: 2005-01-01
valid till: 2007-03-01

Aluminum
type: IndustryClassificationBenchmarkClassifier
type: SubsectorClassifier
type: NamedIndividual
is contemporary version of: http://data.ga-group.nl/ics/icb/1753
is replaced by: http://data.ga-group.nl/ics/icb/2007/1753
is version of: http://data.ga-group.nl/ics/icb/1753
is subsector of: Industrial Metals
imported on: 2026-06-01T03:03:54.132Z
last refreshed on: 2026-06-01T10:28:56.931Z
source accessed on: 2015-03-30T23:37:37Z
source last accessed on: 2015-03-30T23:37:37Z
definition: Companies that mine or process bauxite or manufacture and distribute aluminum bars, rods and other products for use by other industries. Excludes manufacturers of finished aluminum products, such as siding, which are categorized according to the type of end product.
notation: 1753
valid from: 2005-01-01
valid till: 2007-03-01

Nonferrous Metals
type: IndustryClassificationBenchmarkClassifier
type: SubsectorClassifier
type: NamedIndividual
is contemporary version of: http://data.ga-group.nl/ics/icb/1755
is replaced by: http://data.ga-group.nl/ics/icb/2007/1755
is version of: http://data.ga-group.nl/ics/icb/1755
is subsector of: Industrial Metals
imported on: 2026-06-01T03:03:54.132Z
last refreshed on: 2026-06-01T10:28:56.931Z
source accessed on: 2015-03-30T23:37:37Z
source last accessed on: 2015-03-30T23:37:37Z
definition: Producers and traders of metals and primary metal products other than iron, aluminum and steel. Excludes companies that make finished products, which are categorized according to the type of end product.
notation: 1755
valid from: 2005-01-01
valid till: 2007-03-01

Steel
type: IndustryClassificationBenchmarkClassifier
type: SubsectorClassifier
type: NamedIndividual
is contemporary version of: http://data.ga-group.nl/ics/icb/1757
is replaced by: http://data.ga-group.nl/ics/icb/2007/1757
is version of: http://data.ga-group.nl/ics/icb/1757
is subsector of: Industrial Metals
imported on: 2026-06-01T03:03:54.132Z
last refreshed on: 2026-06-01T10:28:56.931Z
source accessed on: 2015-03-30T23:37:37Z
source last accessed on: 2015-03-30T23:37:37Z
definition: Manufacturers and stockholders of primary iron and steel products such as pipes, wires, sheets and bars, encompassing all processes from smelting in blast furnaces to rolling mills and foundries.
notation: 1757
valid from: 2005-01-01
valid till: 2007-03-01

Mining
type: IndustryClassificationBenchmarkClassifier
type: SectorClassifier
type: NamedIndividual
is contemporary version of: http://data.ga-group.nl/ics/icb/1770
is replaced by: http://data.ga-group.nl/ics/icb/2007/1770
is version of: http://data.ga-group.nl/ics/icb/1770
is sector of: Basic Resources
imported on: 2026-06-01T03:03:54.132Z
last refreshed on: 2026-06-01T10:28:56.931Z
source accessed on: 2015-03-30T23:37:37Z
source last accessed on: 2015-03-30T23:37:37Z
notation: 1770
valid from: 2005-01-01
valid till: 2007-03-01

Coal
type: IndustryClassificationBenchmarkClassifier
type: SubsectorClassifier
type: NamedIndividual
is contemporary version of: http://data.ga-group.nl/ics/icb/1771
is replaced by: http://data.ga-group.nl/ics/icb/2007/1771
is version of: http://data.ga-group.nl/ics/icb/1771
is subsector of: Mining
imported on: 2026-06-01T03:03:54.132Z
last refreshed on: 2026-06-01T10:28:56.931Z
source accessed on: 2015-03-30T23:37:37Z
source last accessed on: 2015-03-30T23:37:37Z
definition: Companies engaged in the exploration for or mining of coal.
notation: 1771
valid from: 2005-01-01
valid till: 2007-03-01

Diamonds & Gemstones
type: IndustryClassificationBenchmarkClassifier
type: SubsectorClassifier
type: NamedIndividual
is contemporary version of: http://data.ga-group.nl/ics/icb/1773
is replaced by: http://data.ga-group.nl/ics/icb/2007/1773
is version of: http://data.ga-group.nl/ics/icb/1773
is subsector of: Mining
imported on: 2026-06-01T03:03:54.132Z
last refreshed on: 2026-06-01T10:28:56.931Z
source accessed on: 2015-03-30T23:37:37Z
source last accessed on: 2015-03-30T23:37:37Z
definition: Companies engaged in the exploration for and production of diamonds and other gemstones.
notation: 1773
valid from: 2005-01-01
valid till: 2007-03-01

General Mining
type: IndustryClassificationBenchmarkClassifier
type: SubsectorClassifier
type: NamedIndividual
is contemporary version of: http://data.ga-group.nl/ics/icb/1775
is replaced by: http://data.ga-group.nl/ics/icb/2007/1775
is version of: http://data.ga-group.nl/ics/icb/1775
is subsector of: Mining
imported on: 2026-06-01T03:03:54.132Z
last refreshed on: 2026-06-01T10:28:56.931Z
source accessed on: 2015-03-30T23:37:37Z
source last accessed on: 2015-03-30T23:37:37Z
definition: Companies engaged in the exploration, extraction or refining of minerals not defined elsewhere within the Mining sector.
notation: 1775
valid from: 2005-01-01
valid till: 2007-03-01

Gold Mining
type: IndustryClassificationBenchmarkClassifier
type: SubsectorClassifier
type: NamedIndividual
is contemporary version of: http://data.ga-group.nl/ics/icb/1777
is replaced by: http://data.ga-group.nl/ics/icb/2007/1777
is version of: http://data.ga-group.nl/ics/icb/1777
is subsector of: Mining
imported on: 2026-06-01T03:03:54.132Z
last refreshed on: 2026-06-01T10:28:56.931Z
source accessed on: 2015-03-30T23:37:37Z
source last accessed on: 2015-03-30T23:37:37Z
definition: Prospectors for and extractors or refiners of gold-bearing ores.
notation: 1777
valid from: 2005-01-01
valid till: 2007-03-01

Platinum & Precious Metals
type: IndustryClassificationBenchmarkClassifier
type: SubsectorClassifier
type: NamedIndividual
is contemporary version of: http://data.ga-group.nl/ics/icb/1779
is replaced by: http://data.ga-group.nl/ics/icb/2007/1779
is version of: http://data.ga-group.nl/ics/icb/1779
is subsector of: Mining
imported on: 2026-06-01T03:03:54.132Z
last refreshed on: 2026-06-01T10:28:56.931Z
source accessed on: 2015-03-30T23:37:37Z
source last accessed on: 2015-03-30T23:37:37Z
definition: Companies engaged in the exploration for and production of platinum, silver and other precious metals not defined elsewhere.
notation: 1779
valid from: 2005-01-01
valid till: 2007-03-01

Industrials
type: IndustryClassificationBenchmarkClassifier
type: IndustryClassifier
type: NamedIndividual
is contemporary version of: http://data.ga-group.nl/ics/icb/2000
is replaced by: http://data.ga-group.nl/ics/icb/2007/2000
is version of: http://data.ga-group.nl/ics/icb/2000
imported on: 2026-06-01T03:03:54.132Z
last refreshed on: 2026-06-01T10:28:56.931Z
source accessed on: 2015-03-30T23:37:37Z
source last accessed on: 2015-03-30T23:37:37Z
notation: 2000
valid from: 2005-01-01
valid till: 2007-03-01

Construction & Materials
type: IndustryClassificationBenchmarkClassifier
type: SupersectorClassifier
type: NamedIndividual
is contemporary version of: http://data.ga-group.nl/ics/icb/2300
is replaced by: http://data.ga-group.nl/ics/icb/2007/2300
is version of: http://data.ga-group.nl/ics/icb/2300
is supersector of: Industrials
imported on: 2026-06-01T03:03:54.132Z
last refreshed on: 2026-06-01T10:28:56.931Z
source accessed on: 2015-03-30T23:37:37Z
source last accessed on: 2015-03-30T23:37:37Z
notation: 2300
valid from: 2005-01-01
valid till: 2007-03-01

Construction & Materials
type: IndustryClassificationBenchmarkClassifier
type: SectorClassifier
type: NamedIndividual
is contemporary version of: http://data.ga-group.nl/ics/icb/2350
is replaced by: http://data.ga-group.nl/ics/icb/2007/2350
is version of: http://data.ga-group.nl/ics/icb/2350
is sector of: Construction & Materials
imported on: 2026-06-01T03:03:54.132Z
last refreshed on: 2026-06-01T10:28:56.931Z
source accessed on: 2015-03-30T23:37:37Z
source last accessed on: 2015-03-30T23:37:37Z
notation: 2350
valid from: 2005-01-01
valid till: 2007-03-01

Building Materials & Fixtures
type: IndustryClassificationBenchmarkClassifier
type: SubsectorClassifier
type: NamedIndividual
is contemporary version of: http://data.ga-group.nl/ics/icb/2353
is replaced by: http://data.ga-group.nl/ics/icb/2007/2353
is version of: http://data.ga-group.nl/ics/icb/2353
is subsector of: Construction & Materials
imported on: 2026-06-01T03:03:54.132Z
last refreshed on: 2026-06-01T10:28:56.931Z
source accessed on: 2015-03-30T23:37:37Z
source last accessed on: 2015-03-30T23:37:37Z
definition: Producers of materials used in the construction and refurbishment of buildings and structures, including cement and other aggregates, wooden beams and frames, paint, glass, roofing and flooring materials other than carpets. Includes producers of bathroom and kitchen fixtures, plumbing supplies and central air-conditioning and heating equipment. Excludes producers of raw lumber, which are classified under Forestry.
notation: 2353
valid from: 2005-01-01
valid till: 2007-03-01

Heavy Construction
type: IndustryClassificationBenchmarkClassifier
type: SubsectorClassifier
type: NamedIndividual
is contemporary version of: http://data.ga-group.nl/ics/icb/2357
is replaced by: http://data.ga-group.nl/ics/icb/2007/2357
is version of: http://data.ga-group.nl/ics/icb/2357
is subsector of: Construction & Materials
imported on: 2026-06-01T03:03:54.132Z
last refreshed on: 2026-06-01T10:28:56.931Z
source accessed on: 2015-03-30T23:37:37Z
source last accessed on: 2015-03-30T23:37:37Z
definition: Companies engaged in the construction of commercial buildings, infrastructure such as roads and bridges, residential apartment buildings, and providers of services to construction companies, such as architects, masons, plumbers and electrical contractors.
notation: 2357
valid from: 2005-01-01
valid till: 2007-03-01

Industrial Goods & Services
type: IndustryClassificationBenchmarkClassifier
type: SupersectorClassifier
type: NamedIndividual
is contemporary version of: http://data.ga-group.nl/ics/icb/2700
is replaced by: http://data.ga-group.nl/ics/icb/2007/2700
is version of: http://data.ga-group.nl/ics/icb/2700
is supersector of: Industrials
imported on: 2026-06-01T03:03:54.132Z
last refreshed on: 2026-06-01T10:28:56.931Z
source accessed on: 2015-03-30T23:37:37Z
source last accessed on: 2015-03-30T23:37:37Z
notation: 2700
valid from: 2005-01-01
valid till: 2007-03-01

Aerospace & Defense
type: IndustryClassificationBenchmarkClassifier
type: SectorClassifier
type: NamedIndividual
is contemporary version of: http://data.ga-group.nl/ics/icb/2710
is replaced by: http://data.ga-group.nl/ics/icb/2007/2710
is version of: http://data.ga-group.nl/ics/icb/2710
is sector of: Industrial Goods & Services
imported on: 2026-06-01T03:03:54.132Z
last refreshed on: 2026-06-01T10:28:56.931Z
source accessed on: 2015-03-30T23:37:37Z
source last accessed on: 2015-03-30T23:37:37Z
notation: 2710
valid from: 2005-01-01
valid till: 2007-03-01

Aerospace
type: IndustryClassificationBenchmarkClassifier
type: SubsectorClassifier
type: NamedIndividual
is contemporary version of: http://data.ga-group.nl/ics/icb/2713
is replaced by: http://data.ga-group.nl/ics/icb/2007/2713
is version of: http://data.ga-group.nl/ics/icb/2713
is subsector of: Aerospace & Defense
imported on: 2026-06-01T03:03:54.132Z
last refreshed on: 2026-06-01T10:28:56.931Z
source accessed on: 2015-03-30T23:37:37Z
source last accessed on: 2015-03-30T23:37:37Z
definition: Manufacturers, assemblers and distributors of aircraft and aircraft parts primarily used in commercial or private air transport. Excludes manufacturers of communications satellites, which are classified under Telecommunications Equipment.
notation: 2713
valid from: 2005-01-01
valid till: 2007-03-01

Defense
type: IndustryClassificationBenchmarkClassifier
type: SubsectorClassifier
type: NamedIndividual
is contemporary version of: http://data.ga-group.nl/ics/icb/2717
is replaced by: http://data.ga-group.nl/ics/icb/2007/2717
is version of: http://data.ga-group.nl/ics/icb/2717
is subsector of: Aerospace & Defense
imported on: 2026-06-01T03:03:54.132Z
last refreshed on: 2026-06-01T10:28:56.931Z
source accessed on: 2015-03-30T23:37:37Z
source last accessed on: 2015-03-30T23:37:37Z
definition: Producers of components and equipment for the defense industry, including military aircraft, radar equipment and weapons.
notation: 2717
valid from: 2005-01-01
valid till: 2007-03-01

General Industrials
type: IndustryClassificationBenchmarkClassifier
type: SectorClassifier
type: NamedIndividual
is contemporary version of: http://data.ga-group.nl/ics/icb/2720
is replaced by: http://data.ga-group.nl/ics/icb/2007/2720
is version of: http://data.ga-group.nl/ics/icb/2720
is sector of: Industrial Goods & Services
imported on: 2026-06-01T03:03:54.132Z
last refreshed on: 2026-06-01T10:28:56.931Z
source accessed on: 2015-03-30T23:37:37Z
source last accessed on: 2015-03-30T23:37:37Z
notation: 2720
valid from: 2005-01-01
valid till: 2007-03-01

Containers & Packaging
type: IndustryClassificationBenchmarkClassifier
type: SubsectorClassifier
type: NamedIndividual
is contemporary version of: http://data.ga-group.nl/ics/icb/2723
is replaced by: http://data.ga-group.nl/ics/icb/2007/2723
is version of: http://data.ga-group.nl/ics/icb/2723
is subsector of: General Industrials
imported on: 2026-06-01T03:03:54.132Z
last refreshed on: 2026-06-01T10:28:56.931Z
source accessed on: 2015-03-30T23:37:37Z
source last accessed on: 2015-03-30T23:37:37Z
definition: Makers and distributors of cardboard, bags, boxes, cans, drums, bottles and jars and glass used for packaging.
notation: 2723
valid from: 2005-01-01
valid till: 2007-03-01

Diversified Industrials
type: IndustryClassificationBenchmarkClassifier
type: SubsectorClassifier
type: NamedIndividual
is contemporary version of: http://data.ga-group.nl/ics/icb/2727
is replaced by: http://data.ga-group.nl/ics/icb/2007/2727
is version of: http://data.ga-group.nl/ics/icb/2727
is subsector of: General Industrials
imported on: 2026-06-01T03:03:54.132Z
last refreshed on: 2026-06-01T10:28:56.931Z
source accessed on: 2015-03-30T23:37:37Z
source last accessed on: 2015-03-30T23:37:37Z
definition: Industrial companies engaged in three or more classes of business within the Industrial industry that differ substantially from each other.
notation: 2727
valid from: 2005-01-01
valid till: 2007-03-01

Electronic & Electrical Equipment
type: IndustryClassificationBenchmarkClassifier
type: SectorClassifier
type: NamedIndividual
is contemporary version of: http://data.ga-group.nl/ics/icb/2730
is replaced by: http://data.ga-group.nl/ics/icb/2007/2730
is version of: http://data.ga-group.nl/ics/icb/2730
is sector of: Industrial Goods & Services
imported on: 2026-06-01T03:03:54.132Z
last refreshed on: 2026-06-01T10:28:56.931Z
source accessed on: 2015-03-30T23:37:37Z
source last accessed on: 2015-03-30T23:37:37Z
notation: 2730
valid from: 2005-01-01
valid till: 2007-03-01

Electrical Components & Equipment
type: IndustryClassificationBenchmarkClassifier
type: SubsectorClassifier
type: NamedIndividual
is contemporary version of: http://data.ga-group.nl/ics/icb/2733
is replaced by: http://data.ga-group.nl/ics/icb/2007/2733
is version of: http://data.ga-group.nl/ics/icb/2733
is subsector of: Electronic & Electrical Equipment
imported on: 2026-06-01T03:03:54.132Z
last refreshed on: 2026-06-01T10:28:56.931Z
source accessed on: 2015-03-30T23:37:37Z
source last accessed on: 2015-03-30T23:37:37Z
definition: Makers and distributors of electrical parts for finished products, such as printed circuit boards for radios, televisions and other consumer electronics. Includes makers of cables, wires, ceramics, transistors, electric adapters, fuel cells and security cameras.
notation: 2733
valid from: 2005-01-01
valid till: 2007-03-01

Electronic Equipment
type: IndustryClassificationBenchmarkClassifier
type: SubsectorClassifier
type: NamedIndividual
is contemporary version of: http://data.ga-group.nl/ics/icb/2737
is replaced by: http://data.ga-group.nl/ics/icb/2007/2737
is version of: http://data.ga-group.nl/ics/icb/2737
is subsector of: Electronic & Electrical Equipment
imported on: 2026-06-01T03:03:54.132Z
last refreshed on: 2026-06-01T10:28:56.931Z
source accessed on: 2015-03-30T23:37:37Z
source last accessed on: 2015-03-30T23:37:37Z
definition: Manufacturers and distributors of electronic products used in different industries. Includes makers of lasers, smart cards, bar scanners, fingerprinting equipment and other electronic factory equipment.
notation: 2737
valid from: 2005-01-01
valid till: 2007-03-01

Industrial Engineering
type: IndustryClassificationBenchmarkClassifier
type: SectorClassifier
type: NamedIndividual
is contemporary version of: http://data.ga-group.nl/ics/icb/2750
is replaced by: http://data.ga-group.nl/ics/icb/2007/2750
is version of: http://data.ga-group.nl/ics/icb/2750
is sector of: Industrial Goods & Services
imported on: 2026-06-01T03:03:54.132Z
last refreshed on: 2026-06-01T10:28:56.931Z
source accessed on: 2015-03-30T23:37:37Z
source last accessed on: 2015-03-30T23:37:37Z
notation: 2750
valid from: 2005-01-01
valid till: 2007-03-01

Commercial Vehicles & Trucks
type: IndustryClassificationBenchmarkClassifier
type: SubsectorClassifier
type: NamedIndividual
is contemporary version of: http://data.ga-group.nl/ics/icb/2753
is replaced by: http://data.ga-group.nl/ics/icb/2007/2753
is version of: http://data.ga-group.nl/ics/icb/2753
is subsector of: Industrial Engineering
imported on: 2026-06-01T03:03:54.132Z
last refreshed on: 2026-06-01T10:28:56.931Z
source accessed on: 2015-03-30T23:37:37Z
source last accessed on: 2015-03-30T23:37:37Z
definition: Manufacturers and distributors of commercial vehicles and heavy agricultural and construction machinery, including rail cars, tractors, bulldozers, buses and industrial lawn mowers. Includes non-military shipbuilders, such as builders of cruise ships and ferries.
notation: 2753
valid from: 2005-01-01
valid till: 2007-03-01

Industrial Machinery
type: IndustryClassificationBenchmarkClassifier
type: SubsectorClassifier
type: NamedIndividual
is contemporary version of: http://data.ga-group.nl/ics/icb/2757
is replaced by: http://data.ga-group.nl/ics/icb/2007/2757
is version of: http://data.ga-group.nl/ics/icb/2757
is subsector of: Industrial Engineering
imported on: 2026-06-01T03:03:54.132Z
last refreshed on: 2026-06-01T10:28:56.931Z
source accessed on: 2015-03-30T23:37:37Z
source last accessed on: 2015-03-30T23:37:37Z
definition: Designers, manufacturers, distributors and installers of industrial machinery and factory equipment, such as machine tools, lathes, presses and assembly line equipment. Includes makers of pollution control equipment, castings, pressings, welded shapes, structural steelwork, compressors, pumps, bearings, elevators and escalators.
notation: 2757
valid from: 2005-01-01
valid till: 2007-03-01

Industrial Transportation
type: IndustryClassificationBenchmarkClassifier
type: SectorClassifier
type: NamedIndividual
is contemporary version of: http://data.ga-group.nl/ics/icb/2770
is replaced by: http://data.ga-group.nl/ics/icb/2007/2770
is version of: http://data.ga-group.nl/ics/icb/2770
is sector of: Industrial Goods & Services
imported on: 2026-06-01T03:03:54.132Z
last refreshed on: 2026-06-01T10:28:56.931Z
source accessed on: 2015-03-30T23:37:37Z
source last accessed on: 2015-03-30T23:37:37Z
notation: 2770
valid from: 2005-01-01
valid till: 2007-03-01

Delivery Services
type: IndustryClassificationBenchmarkClassifier
type: SubsectorClassifier
type: NamedIndividual
is contemporary version of: http://data.ga-group.nl/ics/icb/2771
is replaced by: http://data.ga-group.nl/ics/icb/2007/2771
is version of: http://data.ga-group.nl/ics/icb/2771
is subsector of: Industrial Transportation
imported on: 2026-06-01T03:03:54.132Z
last refreshed on: 2026-06-01T10:28:56.931Z
source accessed on: 2015-03-30T23:37:37Z
source last accessed on: 2015-03-30T23:37:37Z
definition: Operators of mail and package delivery services for commercial and consumer use. Includes courier and logistic services primarily involving air transportation.
notation: 2771
valid from: 2005-01-01
valid till: 2007-03-01

Marine Transportation
type: IndustryClassificationBenchmarkClassifier
type: SubsectorClassifier
type: NamedIndividual
is contemporary version of: http://data.ga-group.nl/ics/icb/2773
is replaced by: http://data.ga-group.nl/ics/icb/2007/2773
is version of: http://data.ga-group.nl/ics/icb/2773
is subsector of: Industrial Transportation
imported on: 2026-06-01T03:03:54.132Z
last refreshed on: 2026-06-01T10:28:56.931Z
source accessed on: 2015-03-30T23:37:37Z
source last accessed on: 2015-03-30T23:37:37Z
definition: Providers of on-water transportation for commercial markets, such as container shipping. Excludes ports, which are classified under Transportation Services, and shipbuilders, which are classified under Commercial Vehicles & Trucks.
notation: 2773
valid from: 2005-01-01
valid till: 2007-03-01

Railroads
type: IndustryClassificationBenchmarkClassifier
type: SubsectorClassifier
type: NamedIndividual
is contemporary version of: http://data.ga-group.nl/ics/icb/2775
is replaced by: http://data.ga-group.nl/ics/icb/2007/2775
is version of: http://data.ga-group.nl/ics/icb/2775
is subsector of: Industrial Transportation
imported on: 2026-06-01T03:03:54.132Z
last refreshed on: 2026-06-01T10:28:56.931Z
source accessed on: 2015-03-30T23:37:37Z
source last accessed on: 2015-03-30T23:37:37Z
definition: Providers of industrial railway transportation and railway lines. Excludes passenger railway companies, which are classified under Travel & Tourism, and manufacturers of rail cars, which are classified under Commercial Vehicles & Trucks.
notation: 2775
valid from: 2005-01-01
valid till: 2007-03-01

Transportation Services
type: IndustryClassificationBenchmarkClassifier
type: SubsectorClassifier
type: NamedIndividual
is contemporary version of: http://data.ga-group.nl/ics/icb/2777
is replaced by: http://data.ga-group.nl/ics/icb/2007/2777
is version of: http://data.ga-group.nl/ics/icb/2777
is subsector of: Industrial Transportation
imported on: 2026-06-01T03:03:54.132Z
last refreshed on: 2026-06-01T10:28:56.931Z
source accessed on: 2015-03-30T23:37:37Z
source last accessed on: 2015-03-30T23:37:37Z
definition: Companies providing services to the Industrial Transportation sector, including companies that manage airports, train depots, roads, bridges, tunnels, ports, and providers of logistic services to shippers of goods. Includes companies that provide aircraft and vehicle maintenance services.
notation: 2777
valid from: 2005-01-01
valid till: 2007-03-01

Trucking
type: IndustryClassificationBenchmarkClassifier
type: SubsectorClassifier
type: NamedIndividual
is contemporary version of: http://data.ga-group.nl/ics/icb/2779
is replaced by: http://data.ga-group.nl/ics/icb/2007/2779
is version of: http://data.ga-group.nl/ics/icb/2779
is subsector of: Industrial Transportation
imported on: 2026-06-01T03:03:54.132Z
last refreshed on: 2026-06-01T10:28:56.931Z
source accessed on: 2015-03-30T23:37:37Z
source last accessed on: 2015-03-30T23:37:37Z
definition: Companies that provide commercial trucking services. Excludes road and tunnel operators, which are classified under Transportation Services, and vehicle rental and taxi companies, which are classified under Travel & Tourism.
notation: 2779
valid from: 2005-01-01
valid till: 2007-03-01

Support Services
type: IndustryClassificationBenchmarkClassifier
type: SectorClassifier
type: NamedIndividual
is contemporary version of: http://data.ga-group.nl/ics/icb/2790
is replaced by: http://data.ga-group.nl/ics/icb/2007/2790
is version of: http://data.ga-group.nl/ics/icb/2790
is sector of: Industrial Goods & Services
imported on: 2026-06-01T03:03:54.132Z
last refreshed on: 2026-06-01T10:28:56.931Z
source accessed on: 2015-03-30T23:37:37Z
source last accessed on: 2015-03-30T23:37:37Z
notation: 2790
valid from: 2005-01-01
valid till: 2007-03-01

Business Support Services
type: IndustryClassificationBenchmarkClassifier
type: SubsectorClassifier
type: NamedIndividual
is contemporary version of: http://data.ga-group.nl/ics/icb/2791
is replaced by: http://data.ga-group.nl/ics/icb/2007/2791
is version of: http://data.ga-group.nl/ics/icb/2791
is subsector of: Support Services
imported on: 2026-06-01T03:03:54.132Z
last refreshed on: 2026-06-01T10:28:56.931Z
source accessed on: 2015-03-30T23:37:37Z
source last accessed on: 2015-03-30T23:37:37Z
definition: Providers of nonfinancial services to a wide range of industrial enterprises and governments. Includes providers of printing services, management consultants, office cleaning services, and companies that install, service and monitor alarm and security systems.
notation: 2791
valid from: 2005-01-01
valid till: 2007-03-01

Business Training & Employment Agencies
type: IndustryClassificationBenchmarkClassifier
type: SubsectorClassifier
type: NamedIndividual
is contemporary version of: http://data.ga-group.nl/ics/icb/2793
is replaced by: http://data.ga-group.nl/ics/icb/2007/2793
is version of: http://data.ga-group.nl/ics/icb/2793
is subsector of: Support Services
imported on: 2026-06-01T03:03:54.132Z
last refreshed on: 2026-06-01T10:28:56.931Z
source accessed on: 2015-03-30T23:37:37Z
source last accessed on: 2015-03-30T23:37:37Z
definition: Providers of business or management training courses and employment services.
notation: 2793
valid from: 2005-01-01
valid till: 2007-03-01

Financial Administration
type: IndustryClassificationBenchmarkClassifier
type: SubsectorClassifier
type: NamedIndividual
is contemporary version of: http://data.ga-group.nl/ics/icb/2795
is replaced by: http://data.ga-group.nl/ics/icb/2007/2795
is version of: http://data.ga-group.nl/ics/icb/2795
is subsector of: Support Services
imported on: 2026-06-01T03:03:54.132Z
last refreshed on: 2026-06-01T10:28:56.931Z
source accessed on: 2015-03-30T23:37:37Z
source last accessed on: 2015-03-30T23:37:37Z
definition: Providers of computerized transaction processing, data communication and information services, including payroll, bill payment and employee benefit services.
notation: 2795
valid from: 2005-01-01
valid till: 2007-03-01

Industrial Suppliers
type: IndustryClassificationBenchmarkClassifier
type: SubsectorClassifier
type: NamedIndividual
is contemporary version of: http://data.ga-group.nl/ics/icb/2797
is replaced by: http://data.ga-group.nl/ics/icb/2007/2797
is version of: http://data.ga-group.nl/ics/icb/2797
is subsector of: Support Services
imported on: 2026-06-01T03:03:54.132Z
last refreshed on: 2026-06-01T10:28:56.931Z
source accessed on: 2015-03-30T23:37:37Z
source last accessed on: 2015-03-30T23:37:37Z
definition: Distributors and wholesalers of diversified products and equipment primarily used in the commercial and industrial sectors. Includes builders merchants.
notation: 2797
valid from: 2005-01-01
valid till: 2007-03-01

Waste & Disposal Services
type: IndustryClassificationBenchmarkClassifier
type: SubsectorClassifier
type: NamedIndividual
is contemporary version of: http://data.ga-group.nl/ics/icb/2799
is replaced by: http://data.ga-group.nl/ics/icb/2007/2799
is version of: http://data.ga-group.nl/ics/icb/2799
is subsector of: Support Services
imported on: 2026-06-01T03:03:54.132Z
last refreshed on: 2026-06-01T10:28:56.931Z
source accessed on: 2015-03-30T23:37:37Z
source last accessed on: 2015-03-30T23:37:37Z
definition: Providers of pollution control and environmental services for the management, recovery and disposal of solid and hazardous waste materials, such as landfills and recycling centers. Excludes manufacturers of industrial air and water filtration equipment, which are classified under Industrial Machinery.
notation: 2799
valid from: 2005-01-01
valid till: 2007-03-01

Consumer Goods
type: IndustryClassificationBenchmarkClassifier
type: IndustryClassifier
type: NamedIndividual
is contemporary version of: http://data.ga-group.nl/ics/icb/3000
is replaced by: http://data.ga-group.nl/ics/icb/2007/3000
is version of: http://data.ga-group.nl/ics/icb/3000
imported on: 2026-06-01T03:03:54.132Z
last refreshed on: 2026-06-01T10:28:56.931Z
source accessed on: 2015-03-30T23:37:37Z
source last accessed on: 2015-03-30T23:37:37Z
notation: 3000
valid from: 2005-01-01
valid till: 2007-03-01

Automobiles & Parts
type: IndustryClassificationBenchmarkClassifier
type: SupersectorClassifier
type: NamedIndividual
is contemporary version of: http://data.ga-group.nl/ics/icb/3300
is replaced by: http://data.ga-group.nl/ics/icb/2007/3300
is version of: http://data.ga-group.nl/ics/icb/3300
is supersector of: Consumer Goods
imported on: 2026-06-01T03:03:54.132Z
last refreshed on: 2026-06-01T10:28:56.931Z
source accessed on: 2015-03-30T23:37:37Z
source last accessed on: 2015-03-30T23:37:37Z
notation: 3300
valid from: 2005-01-01
valid till: 2007-03-01

Automobiles & Parts
type: IndustryClassificationBenchmarkClassifier
type: SectorClassifier
type: NamedIndividual
is contemporary version of: http://data.ga-group.nl/ics/icb/3350
is replaced by: http://data.ga-group.nl/ics/icb/2007/3350
is version of: http://data.ga-group.nl/ics/icb/3350
is sector of: Automobiles & Parts
imported on: 2026-06-01T03:03:54.132Z
last refreshed on: 2026-06-01T10:28:56.931Z
source accessed on: 2015-03-30T23:37:37Z
source last accessed on: 2015-03-30T23:37:37Z
notation: 3350
valid from: 2005-01-01
valid till: 2007-03-01

Automobiles
type: IndustryClassificationBenchmarkClassifier
type: SubsectorClassifier
type: NamedIndividual
is contemporary version of: http://data.ga-group.nl/ics/icb/3353
is replaced by: http://data.ga-group.nl/ics/icb/2007/3353
is version of: http://data.ga-group.nl/ics/icb/3353
is subsector of: Automobiles & Parts
imported on: 2026-06-01T03:03:54.132Z
last refreshed on: 2026-06-01T10:28:56.931Z
source accessed on: 2015-03-30T23:37:37Z
source last accessed on: 2015-03-30T23:37:37Z
definition: Makers of motorcycles and passenger vehicles, including cars, sport utility vehicles (SUVs) and light trucks. Excludes makers of heavy trucks, which are classified under Commercial Vehicles & Trucks, and makers of recreational vehicles (RVs and ATVs), which are classified under Recreational Products.
notation: 3353
valid from: 2005-01-01
valid till: 2007-03-01

Auto Parts
type: IndustryClassificationBenchmarkClassifier
type: SubsectorClassifier
type: NamedIndividual
is contemporary version of: http://data.ga-group.nl/ics/icb/3355
is replaced by: http://data.ga-group.nl/ics/icb/2007/3355
is version of: http://data.ga-group.nl/ics/icb/3355
is subsector of: Automobiles & Parts
imported on: 2026-06-01T03:03:54.132Z
last refreshed on: 2026-06-01T10:28:56.931Z
source accessed on: 2015-03-30T23:37:37Z
source last accessed on: 2015-03-30T23:37:37Z
definition: Manufacturers and distributors of new and replacement parts for motorcycles and automobiles, such as engines, carburetors and batteries. Excludes producers of tires, which are classified under Tires.
notation: 3355
valid from: 2005-01-01
valid till: 2007-03-01

Tires
type: IndustryClassificationBenchmarkClassifier
type: SubsectorClassifier
type: NamedIndividual
is contemporary version of: http://data.ga-group.nl/ics/icb/3357
is replaced by: http://data.ga-group.nl/ics/icb/2007/3357
is version of: http://data.ga-group.nl/ics/icb/3357
is subsector of: Automobiles & Parts
imported on: 2026-06-01T03:03:54.132Z
last refreshed on: 2026-06-01T10:28:56.931Z
source accessed on: 2015-03-30T23:37:37Z
source last accessed on: 2015-03-30T23:37:37Z
definition: Manufacturers, distributors and retreaders of automobile, truck and motorcycle tires.
notation: 3357
valid from: 2005-01-01
valid till: 2007-03-01

Food & Beverage
type: IndustryClassificationBenchmarkClassifier
type: SupersectorClassifier
type: NamedIndividual
is contemporary version of: http://data.ga-group.nl/ics/icb/3500
is replaced by: http://data.ga-group.nl/ics/icb/2007/3500
is version of: http://data.ga-group.nl/ics/icb/3500
is supersector of: Consumer Goods
imported on: 2026-06-01T03:03:54.132Z
last refreshed on: 2026-06-01T10:28:56.931Z
source accessed on: 2015-03-30T23:37:37Z
source last accessed on: 2015-03-30T23:37:37Z
notation: 3500
valid from: 2005-01-01
valid till: 2007-03-01

Beverages
type: IndustryClassificationBenchmarkClassifier
type: SectorClassifier
type: NamedIndividual
is contemporary version of: http://data.ga-group.nl/ics/icb/3530
is replaced by: http://data.ga-group.nl/ics/icb/2007/3530
is version of: http://data.ga-group.nl/ics/icb/3530
is sector of: Food & Beverage
imported on: 2026-06-01T03:03:54.132Z
last refreshed on: 2026-06-01T10:28:56.931Z
source accessed on: 2015-03-30T23:37:37Z
source last accessed on: 2015-03-30T23:37:37Z
notation: 3530
valid from: 2005-01-01
valid till: 2007-03-01

Brewers
type: IndustryClassificationBenchmarkClassifier
type: SubsectorClassifier
type: NamedIndividual
is contemporary version of: http://data.ga-group.nl/ics/icb/3533
is replaced by: http://data.ga-group.nl/ics/icb/2007/3533
is version of: http://data.ga-group.nl/ics/icb/3533
is subsector of: Beverages
imported on: 2026-06-01T03:03:54.132Z
last refreshed on: 2026-06-01T10:28:56.931Z
source accessed on: 2015-03-30T23:37:37Z
source last accessed on: 2015-03-30T23:37:37Z
definition: Manufacturers and shippers of cider or malt products such as beer, ale and stout.
notation: 3533
valid from: 2005-01-01
valid till: 2007-03-01

Distillers & Vintners
type: IndustryClassificationBenchmarkClassifier
type: SubsectorClassifier
type: NamedIndividual
is contemporary version of: http://data.ga-group.nl/ics/icb/3535
is replaced by: http://data.ga-group.nl/ics/icb/2007/3535
is version of: http://data.ga-group.nl/ics/icb/3535
is subsector of: Beverages
imported on: 2026-06-01T03:03:54.132Z
last refreshed on: 2026-06-01T10:28:56.931Z
source accessed on: 2015-03-30T23:37:37Z
source last accessed on: 2015-03-30T23:37:37Z
definition: Producers, distillers, vintners, blenders and shippers of wine and spirits such as whisky, brandy, rum, gin or liqueurs.
notation: 3535
valid from: 2005-01-01
valid till: 2007-03-01

Soft Drinks
type: IndustryClassificationBenchmarkClassifier
type: SubsectorClassifier
type: NamedIndividual
is contemporary version of: http://data.ga-group.nl/ics/icb/3537
is replaced by: http://data.ga-group.nl/ics/icb/2007/3537
is version of: http://data.ga-group.nl/ics/icb/3537
is subsector of: Beverages
imported on: 2026-06-01T03:03:54.132Z
last refreshed on: 2026-06-01T10:28:56.931Z
source accessed on: 2015-03-30T23:37:37Z
source last accessed on: 2015-03-30T23:37:37Z
definition: Manufacturers, bottlers and distributors of non-alcoholic beverages, such as soda, fruit juices, tea, coffee and bottled water.
notation: 3537
valid from: 2005-01-01
valid till: 2007-03-01

Food Producers
type: IndustryClassificationBenchmarkClassifier
type: SectorClassifier
type: NamedIndividual
is contemporary version of: http://data.ga-group.nl/ics/icb/3570
is replaced by: http://data.ga-group.nl/ics/icb/2007/3570
is version of: http://data.ga-group.nl/ics/icb/3570
is sector of: Food & Beverage
imported on: 2026-06-01T03:03:54.132Z
last refreshed on: 2026-06-01T10:28:56.931Z
source accessed on: 2015-03-30T23:37:37Z
source last accessed on: 2015-03-30T23:37:37Z
notation: 3570
valid from: 2005-01-01
valid till: 2007-03-01

Farming & Fishing
type: IndustryClassificationBenchmarkClassifier
type: SubsectorClassifier
type: NamedIndividual
is contemporary version of: http://data.ga-group.nl/ics/icb/3573
is replaced by: http://data.ga-group.nl/ics/icb/2007/3573
is version of: http://data.ga-group.nl/ics/icb/3573
is subsector of: Food Producers
imported on: 2026-06-01T03:03:54.132Z
last refreshed on: 2026-06-01T10:28:56.931Z
source accessed on: 2015-03-30T23:37:37Z
source last accessed on: 2015-03-30T23:37:37Z
definition: Companies that grow crops or raise livestock, operate fisheries or own nontobacco plantations. Includes manufacturers of livestock feeds and seeds and other agricultural products but excludes manufacturers of fertilizers or pesticides, which are classified under Specialty Chemicals.
notation: 3573
valid from: 2005-01-01
valid till: 2007-03-01

Food Products
type: IndustryClassificationBenchmarkClassifier
type: SubsectorClassifier
type: NamedIndividual
is contemporary version of: http://data.ga-group.nl/ics/icb/3577
is replaced by: http://data.ga-group.nl/ics/icb/2007/3577
is version of: http://data.ga-group.nl/ics/icb/3577
is subsector of: Food Producers
imported on: 2026-06-01T03:03:54.132Z
last refreshed on: 2026-06-01T10:28:56.931Z
source accessed on: 2015-03-30T23:37:37Z
source last accessed on: 2015-03-30T23:37:37Z
definition: Food producers, including meatpacking, snacks, fruits, vegetables, dairy products and frozen seafood. Includes producers of pet food and manufacturers of dietary supplements, vitamins and related items. Excludes producers of fruit juices, tea, coffee, bottled water and other non-alcoholic beverages, which are classified under Soft Drinks.
notation: 3577
valid from: 2005-01-01
valid till: 2007-03-01

Personal & Household Goods
type: IndustryClassificationBenchmarkClassifier
type: SupersectorClassifier
type: NamedIndividual
is contemporary version of: http://data.ga-group.nl/ics/icb/3700
is replaced by: http://data.ga-group.nl/ics/icb/2007/3700
is version of: http://data.ga-group.nl/ics/icb/3700
is supersector of: Consumer Goods
imported on: 2026-06-01T03:03:54.132Z
last refreshed on: 2026-06-01T10:28:56.931Z
source accessed on: 2015-03-30T23:37:37Z
source last accessed on: 2015-03-30T23:37:37Z
notation: 3700
valid from: 2005-01-01
valid till: 2007-03-01

Household Goods
type: IndustryClassificationBenchmarkClassifier
type: SectorClassifier
type: NamedIndividual
is contemporary version of: http://data.ga-group.nl/ics/icb/3720
is replaced by: http://data.ga-group.nl/ics/icb/2007/3720
is version of: http://data.ga-group.nl/ics/icb/3720
is sector of: Personal & Household Goods
imported on: 2026-06-01T03:03:54.132Z
last refreshed on: 2026-06-01T10:28:56.931Z
source accessed on: 2015-03-30T23:37:37Z
source last accessed on: 2015-03-30T23:37:37Z
notation: 3720
valid from: 2005-01-01
valid till: 2007-03-01

Durable Household Products
type: IndustryClassificationBenchmarkClassifier
type: SubsectorClassifier
type: NamedIndividual
is contemporary version of: http://data.ga-group.nl/ics/icb/3722
is replaced by: http://data.ga-group.nl/ics/icb/2007/3722
is version of: http://data.ga-group.nl/ics/icb/3722
is subsector of: Household Goods
imported on: 2026-06-01T03:03:54.132Z
last refreshed on: 2026-06-01T10:28:56.931Z
source accessed on: 2015-03-30T23:37:37Z
source last accessed on: 2015-03-30T23:37:37Z
definition: Manufacturers and distributors of domestic appliances, lighting, hand tools and power tools, hardware, cutlery, tableware, garden equipment, luggage, towels and linens.
notation: 3722
valid from: 2005-01-01
valid till: 2007-03-01

Nondurable Household Products
type: IndustryClassificationBenchmarkClassifier
type: SubsectorClassifier
type: NamedIndividual
is contemporary version of: http://data.ga-group.nl/ics/icb/3724
is replaced by: http://data.ga-group.nl/ics/icb/2007/3724
is version of: http://data.ga-group.nl/ics/icb/3724
is subsector of: Household Goods
imported on: 2026-06-01T03:03:54.132Z
last refreshed on: 2026-06-01T10:28:56.931Z
source accessed on: 2015-03-30T23:37:37Z
source last accessed on: 2015-03-30T23:37:37Z
definition: Producers and distributors of pens, paper goods, batteries, light bulbs, tissues, toilet paper and cleaning products such as soaps and polishes.
notation: 3724
valid from: 2005-01-01
valid till: 2007-03-01

Furnishings
type: IndustryClassificationBenchmarkClassifier
type: SubsectorClassifier
type: NamedIndividual
is contemporary version of: http://data.ga-group.nl/ics/icb/3726
is replaced by: http://data.ga-group.nl/ics/icb/2007/3726
is version of: http://data.ga-group.nl/ics/icb/3726
is subsector of: Household Goods
imported on: 2026-06-01T03:03:54.132Z
last refreshed on: 2026-06-01T10:28:56.931Z
source accessed on: 2015-03-30T23:37:37Z
source last accessed on: 2015-03-30T23:37:37Z
definition: Manufacturers and distributors of furniture, including chairs, tables, desks, carpeting, wallpaper and office furniture.
notation: 3726
valid from: 2005-01-01
valid till: 2007-03-01

Home Construction
type: IndustryClassificationBenchmarkClassifier
type: SubsectorClassifier
type: NamedIndividual
is contemporary version of: http://data.ga-group.nl/ics/icb/3728
is replaced by: http://data.ga-group.nl/ics/icb/2007/3728
is version of: http://data.ga-group.nl/ics/icb/3728
is subsector of: Household Goods
imported on: 2026-06-01T03:03:54.132Z
last refreshed on: 2026-06-01T10:28:56.931Z
source accessed on: 2015-03-30T23:37:37Z
source last accessed on: 2015-03-30T23:37:37Z
definition: Constructors of residential homes, including manufacturers of mobile and prefabricated homes intended for use in one place.
notation: 3728
valid from: 2005-01-01
valid till: 2007-03-01

Leisure Goods
type: IndustryClassificationBenchmarkClassifier
type: SectorClassifier
type: NamedIndividual
is contemporary version of: http://data.ga-group.nl/ics/icb/3740
is replaced by: http://data.ga-group.nl/ics/icb/2007/3740
is version of: http://data.ga-group.nl/ics/icb/3740
is sector of: Personal & Household Goods
imported on: 2026-06-01T03:03:54.132Z
last refreshed on: 2026-06-01T10:28:56.931Z
source accessed on: 2015-03-30T23:37:37Z
source last accessed on: 2015-03-30T23:37:37Z
notation: 3740
valid from: 2005-01-01
valid till: 2007-03-01

Consumer Electronics
type: IndustryClassificationBenchmarkClassifier
type: SubsectorClassifier
type: NamedIndividual
is contemporary version of: http://data.ga-group.nl/ics/icb/3743
is replaced by: http://data.ga-group.nl/ics/icb/2007/3743
is version of: http://data.ga-group.nl/ics/icb/3743
is subsector of: Leisure Goods
imported on: 2026-06-01T03:03:54.132Z
last refreshed on: 2026-06-01T10:28:56.931Z
source accessed on: 2015-03-30T23:37:37Z
source last accessed on: 2015-03-30T23:37:37Z
definition: Manufacturers and distributors of consumer electronics, such as TVs, VCRs, DVD players, audio equipment, cable boxes, calculators and camcorders.
notation: 3743
valid from: 2005-01-01
valid till: 2007-03-01

Recreational Products
type: IndustryClassificationBenchmarkClassifier
type: SubsectorClassifier
type: NamedIndividual
is contemporary version of: http://data.ga-group.nl/ics/icb/3745
is replaced by: http://data.ga-group.nl/ics/icb/2007/3745
is version of: http://data.ga-group.nl/ics/icb/3745
is subsector of: Leisure Goods
imported on: 2026-06-01T03:03:54.132Z
last refreshed on: 2026-06-01T10:28:56.931Z
source accessed on: 2015-03-30T23:37:37Z
source last accessed on: 2015-03-30T23:37:37Z
definition: Manufacturers and distributors of recreational equipment. Includes musical instruments, photographic equipment and supplies, RVs, ATVs and marine recreational vehicles such as yachts, dinghies and speedboats.
notation: 3745
valid from: 2005-01-01
valid till: 2007-03-01

Toys
type: IndustryClassificationBenchmarkClassifier
type: SubsectorClassifier
type: NamedIndividual
is contemporary version of: http://data.ga-group.nl/ics/icb/3747
is replaced by: http://data.ga-group.nl/ics/icb/2007/3747
is version of: http://data.ga-group.nl/ics/icb/3747
is subsector of: Leisure Goods
imported on: 2026-06-01T03:03:54.132Z
last refreshed on: 2026-06-01T10:28:56.931Z
source accessed on: 2015-03-30T23:37:37Z
source last accessed on: 2015-03-30T23:37:37Z
definition: Manufacturers and distributors of toys and video/computer games, including such toys and games as playing cards, board games, stuffed animals and dolls.
notation: 3747
valid from: 2005-01-01
valid till: 2007-03-01

Personal Goods
type: IndustryClassificationBenchmarkClassifier
type: SectorClassifier
type: NamedIndividual
is contemporary version of: http://data.ga-group.nl/ics/icb/3760
is replaced by: http://data.ga-group.nl/ics/icb/2007/3760
is version of: http://data.ga-group.nl/ics/icb/3760
is sector of: Personal & Household Goods
imported on: 2026-06-01T03:03:54.132Z
last refreshed on: 2026-06-01T10:28:56.931Z
source accessed on: 2015-03-30T23:37:37Z
source last accessed on: 2015-03-30T23:37:37Z
notation: 3760
valid from: 2005-01-01
valid till: 2007-03-01

Clothing & Accessories
type: IndustryClassificationBenchmarkClassifier
type: SubsectorClassifier
type: NamedIndividual
is contemporary version of: http://data.ga-group.nl/ics/icb/3763
is replaced by: http://data.ga-group.nl/ics/icb/2007/3763
is version of: http://data.ga-group.nl/ics/icb/3763
is subsector of: Personal Goods
imported on: 2026-06-01T03:03:54.132Z
last refreshed on: 2026-06-01T10:28:56.931Z
source accessed on: 2015-03-30T23:37:37Z
source last accessed on: 2015-03-30T23:37:37Z
definition: Manufacturers and distributors of all types of clothing, jewelry, watches or textiles. Includes sportswear, sunglasses, eyeglass frames, leather clothing and goods, and processors of hides and skins.
notation: 3763
valid from: 2005-01-01
valid till: 2007-03-01

Footwear
type: IndustryClassificationBenchmarkClassifier
type: SubsectorClassifier
type: NamedIndividual
is contemporary version of: http://data.ga-group.nl/ics/icb/3765
is replaced by: http://data.ga-group.nl/ics/icb/2007/3765
is version of: http://data.ga-group.nl/ics/icb/3765
is subsector of: Personal Goods
imported on: 2026-06-01T03:03:54.132Z
last refreshed on: 2026-06-01T10:28:56.931Z
source accessed on: 2015-03-30T23:37:37Z
source last accessed on: 2015-03-30T23:37:37Z
definition: Manufacturers and distributors of shoes, boots, sandals, sneakers and other types of footwear.
notation: 3765
valid from: 2005-01-01
valid till: 2007-03-01

Personal Products
type: IndustryClassificationBenchmarkClassifier
type: SubsectorClassifier
type: NamedIndividual
is contemporary version of: http://data.ga-group.nl/ics/icb/3767
is replaced by: http://data.ga-group.nl/ics/icb/2007/3767
is version of: http://data.ga-group.nl/ics/icb/3767
is subsector of: Personal Goods
imported on: 2026-06-01T03:03:54.132Z
last refreshed on: 2026-06-01T10:28:56.931Z
source accessed on: 2015-03-30T23:37:37Z
source last accessed on: 2015-03-30T23:37:37Z
definition: Makers and distributors of cosmetics, toiletries and personal-care and hygiene products, including deodorants, soaps, toothpaste, perfumes, diapers, shampoos, razors and feminine-hygiene products. Includes makers of contraceptives other than oral contraceptives, which are classified under Pharmaceuticals.
notation: 3767
valid from: 2005-01-01
valid till: 2007-03-01

Tobacco
type: IndustryClassificationBenchmarkClassifier
type: SectorClassifier
type: NamedIndividual
is contemporary version of: http://data.ga-group.nl/ics/icb/3780
is replaced by: http://data.ga-group.nl/ics/icb/2007/3780
is version of: http://data.ga-group.nl/ics/icb/3780
is sector of: Personal & Household Goods
imported on: 2026-06-01T03:03:54.132Z
last refreshed on: 2026-06-01T10:28:56.931Z
source accessed on: 2015-03-30T23:37:37Z
source last accessed on: 2015-03-30T23:37:37Z
notation: 3780
valid from: 2005-01-01
valid till: 2007-03-01

Tobacco
type: IndustryClassificationBenchmarkClassifier
type: SubsectorClassifier
type: NamedIndividual
is contemporary version of: http://data.ga-group.nl/ics/icb/3785
is replaced by: http://data.ga-group.nl/ics/icb/2007/3785
is version of: http://data.ga-group.nl/ics/icb/3785
is subsector of: Tobacco
imported on: 2026-06-01T03:03:54.132Z
last refreshed on: 2026-06-01T10:28:56.931Z
source accessed on: 2015-03-30T23:37:37Z
source last accessed on: 2015-03-30T23:37:37Z
definition: Manufacturers and distributors of cigarettes, cigars and other tobacco products. Includes tobacco plantations.
notation: 3785
valid from: 2005-01-01
valid till: 2007-03-01

Health Care
type: IndustryClassificationBenchmarkClassifier
type: IndustryClassifier
type: NamedIndividual
is contemporary version of: http://data.ga-group.nl/ics/icb/4000
is replaced by: http://data.ga-group.nl/ics/icb/2007/4000
is version of: http://data.ga-group.nl/ics/icb/4000
imported on: 2026-06-01T03:03:54.132Z
last refreshed on: 2026-06-01T10:28:56.931Z
source accessed on: 2015-03-30T23:37:37Z
source last accessed on: 2015-03-30T23:37:37Z
notation: 4000
valid from: 2005-01-01
valid till: 2007-03-01

Health Care
type: IndustryClassificationBenchmarkClassifier
type: SupersectorClassifier
type: NamedIndividual
is contemporary version of: http://data.ga-group.nl/ics/icb/4500
is replaced by: http://data.ga-group.nl/ics/icb/2007/4500
is version of: http://data.ga-group.nl/ics/icb/4500
is supersector of: Health Care
imported on: 2026-06-01T03:03:54.132Z
last refreshed on: 2026-06-01T10:28:56.931Z
source accessed on: 2015-03-30T23:37:37Z
source last accessed on: 2015-03-30T23:37:37Z
notation: 4500
valid from: 2005-01-01
valid till: 2007-03-01

Health Care Equipment & Services
type: IndustryClassificationBenchmarkClassifier
type: SectorClassifier
type: NamedIndividual
is contemporary version of: http://data.ga-group.nl/ics/icb/4530
is replaced by: http://data.ga-group.nl/ics/icb/2007/4530
is version of: http://data.ga-group.nl/ics/icb/4530
is sector of: Health Care
imported on: 2026-06-01T03:03:54.132Z
last refreshed on: 2026-06-01T10:28:56.931Z
source accessed on: 2015-03-30T23:37:37Z
source last accessed on: 2015-03-30T23:37:37Z
notation: 4530
valid from: 2005-01-01
valid till: 2007-03-01

Health Care Providers
type: IndustryClassificationBenchmarkClassifier
type: SubsectorClassifier
type: NamedIndividual
is contemporary version of: http://data.ga-group.nl/ics/icb/4533
is replaced by: http://data.ga-group.nl/ics/icb/2007/4533
is version of: http://data.ga-group.nl/ics/icb/4533
is subsector of: Health Care Equipment & Services
imported on: 2026-06-01T03:03:54.132Z
last refreshed on: 2026-06-01T10:28:56.931Z
source accessed on: 2015-03-30T23:37:37Z
source last accessed on: 2015-03-30T23:37:37Z
definition: Owners and operators of health maintenance organizations, hospitals, clinics, dentists, opticians, nursing homes, rehabilitation and retirement centers. Excludes veterinary services, which are classified under Specialized Consumer Services.
notation: 4533
valid from: 2005-01-01
valid till: 2007-03-01

Medical Equipment
type: IndustryClassificationBenchmarkClassifier
type: SubsectorClassifier
type: NamedIndividual
is contemporary version of: http://data.ga-group.nl/ics/icb/4535
is replaced by: http://data.ga-group.nl/ics/icb/2007/4535
is version of: http://data.ga-group.nl/ics/icb/4535
is subsector of: Health Care Equipment & Services
imported on: 2026-06-01T03:03:54.132Z
last refreshed on: 2026-06-01T10:28:56.931Z
source accessed on: 2015-03-30T23:37:37Z
source last accessed on: 2015-03-30T23:37:37Z
definition: Manufacturers and distributors of medical devices such as MRI scanners, prosthetics, pacemakers, X-ray machines and other nondisposable medical devices.
notation: 4535
valid from: 2005-01-01
valid till: 2007-03-01

Medical Supplies
type: IndustryClassificationBenchmarkClassifier
type: SubsectorClassifier
type: NamedIndividual
is contemporary version of: http://data.ga-group.nl/ics/icb/4537
is replaced by: http://data.ga-group.nl/ics/icb/2007/4537
is version of: http://data.ga-group.nl/ics/icb/4537
is subsector of: Health Care Equipment & Services
imported on: 2026-06-01T03:03:54.132Z
last refreshed on: 2026-06-01T10:28:56.931Z
source accessed on: 2015-03-30T23:37:37Z
source last accessed on: 2015-03-30T23:37:37Z
definition: Manufacturers and distributors of medical supplies used by health care providers and the general public. Includes makers of contact lenses, eyeglass lenses, bandages and other disposable medical supplies.
notation: 4537
valid from: 2005-01-01
valid till: 2007-03-01

Pharmaceuticals & Biotechnology
type: IndustryClassificationBenchmarkClassifier
type: SectorClassifier
type: NamedIndividual
is contemporary version of: http://data.ga-group.nl/ics/icb/4570
is replaced by: http://data.ga-group.nl/ics/icb/2007/4570
is version of: http://data.ga-group.nl/ics/icb/4570
is sector of: Health Care
imported on: 2026-06-01T03:03:54.132Z
last refreshed on: 2026-06-01T10:28:56.931Z
source accessed on: 2015-03-30T23:37:37Z
source last accessed on: 2015-03-30T23:37:37Z
notation: 4570
valid from: 2005-01-01
valid till: 2007-03-01

Biotechnology
type: IndustryClassificationBenchmarkClassifier
type: SubsectorClassifier
type: NamedIndividual
is contemporary version of: http://data.ga-group.nl/ics/icb/4573
is replaced by: http://data.ga-group.nl/ics/icb/2007/4573
is version of: http://data.ga-group.nl/ics/icb/4573
is subsector of: Pharmaceuticals & Biotechnology
imported on: 2026-06-01T03:03:54.132Z
last refreshed on: 2026-06-01T10:28:56.931Z
source accessed on: 2015-03-30T23:37:37Z
source last accessed on: 2015-03-30T23:37:37Z
definition: Companies engaged in research into and development of biological substances for the purposes of drug discovery and diagnostic development, and which derive the majority of their revenue from either the sale or licensing of these drugs and diagnostic tools.
notation: 4573
valid from: 2005-01-01
valid till: 2007-03-01

Pharmaceuticals
type: IndustryClassificationBenchmarkClassifier
type: SubsectorClassifier
type: NamedIndividual
is contemporary version of: http://data.ga-group.nl/ics/icb/4577
is replaced by: http://data.ga-group.nl/ics/icb/2007/4577
is version of: http://data.ga-group.nl/ics/icb/4577
is subsector of: Pharmaceuticals & Biotechnology
imported on: 2026-06-01T03:03:54.132Z
last refreshed on: 2026-06-01T10:28:56.931Z
source accessed on: 2015-03-30T23:37:37Z
source last accessed on: 2015-03-30T23:37:37Z
definition: Manufacturers of prescription or over-the-counter drugs, such as aspirin, cold remedies and birth control pills. Includes vaccine producers but excludes vitamin producers, which are classified under Food Products.
notation: 4577
valid from: 2005-01-01
valid till: 2007-03-01

Consumer Services
type: IndustryClassificationBenchmarkClassifier
type: IndustryClassifier
type: NamedIndividual
is contemporary version of: http://data.ga-group.nl/ics/icb/5000
is replaced by: http://data.ga-group.nl/ics/icb/2007/5000
is version of: http://data.ga-group.nl/ics/icb/5000
imported on: 2026-06-01T03:03:54.132Z
last refreshed on: 2026-06-01T10:28:56.931Z
source accessed on: 2015-03-30T23:37:37Z
source last accessed on: 2015-03-30T23:37:37Z
notation: 5000
valid from: 2005-01-01
valid till: 2007-03-01

Retail
type: IndustryClassificationBenchmarkClassifier
type: SupersectorClassifier
type: NamedIndividual
is contemporary version of: http://data.ga-group.nl/ics/icb/5300
is replaced by: http://data.ga-group.nl/ics/icb/2007/5300
is version of: http://data.ga-group.nl/ics/icb/5300
is supersector of: Consumer Services
imported on: 2026-06-01T03:03:54.132Z
last refreshed on: 2026-06-01T10:28:56.931Z
source accessed on: 2015-03-30T23:37:37Z
source last accessed on: 2015-03-30T23:37:37Z
notation: 5300
valid from: 2005-01-01
valid till: 2007-03-01

Food & Drug Retailers
type: IndustryClassificationBenchmarkClassifier
type: SectorClassifier
type: NamedIndividual
is contemporary version of: http://data.ga-group.nl/ics/icb/5330
is replaced by: http://data.ga-group.nl/ics/icb/2007/5330
is version of: http://data.ga-group.nl/ics/icb/5330
is sector of: Retail
imported on: 2026-06-01T03:03:54.132Z
last refreshed on: 2026-06-01T10:28:56.931Z
source accessed on: 2015-03-30T23:37:37Z
source last accessed on: 2015-03-30T23:37:37Z
notation: 5330
valid from: 2005-01-01
valid till: 2007-03-01

Drug Retailers
type: IndustryClassificationBenchmarkClassifier
type: SubsectorClassifier
type: NamedIndividual
is contemporary version of: http://data.ga-group.nl/ics/icb/5333
is replaced by: http://data.ga-group.nl/ics/icb/2007/5333
is version of: http://data.ga-group.nl/ics/icb/5333
is subsector of: Food & Drug Retailers
imported on: 2026-06-01T03:03:54.132Z
last refreshed on: 2026-06-01T10:28:56.931Z
source accessed on: 2015-03-30T23:37:37Z
source last accessed on: 2015-03-30T23:37:37Z
definition: Operators of pharmacies, including wholesalers and distributors catering to these businesses.
notation: 5333
valid from: 2005-01-01
valid till: 2007-03-01

Food Retailers & Wholesalers
type: IndustryClassificationBenchmarkClassifier
type: SubsectorClassifier
type: NamedIndividual
is contemporary version of: http://data.ga-group.nl/ics/icb/5337
is replaced by: http://data.ga-group.nl/ics/icb/2007/5337
is version of: http://data.ga-group.nl/ics/icb/5337
is subsector of: Food & Drug Retailers
imported on: 2026-06-01T03:03:54.132Z
last refreshed on: 2026-06-01T10:28:56.931Z
source accessed on: 2015-03-30T23:37:37Z
source last accessed on: 2015-03-30T23:37:37Z
definition: Supermarkets, food-oriented convenience stores and other food retailers and distributors. Includes retailers of dietary supplements and vitamins.
notation: 5337
valid from: 2005-01-01
valid till: 2007-03-01

General Retailers
type: IndustryClassificationBenchmarkClassifier
type: SectorClassifier
type: NamedIndividual
is contemporary version of: http://data.ga-group.nl/ics/icb/5370
is replaced by: http://data.ga-group.nl/ics/icb/2007/5370
is version of: http://data.ga-group.nl/ics/icb/5370
is sector of: Retail
imported on: 2026-06-01T03:03:54.132Z
last refreshed on: 2026-06-01T10:28:56.931Z
source accessed on: 2015-03-30T23:37:37Z
source last accessed on: 2015-03-30T23:37:37Z
notation: 5370
valid from: 2005-01-01
valid till: 2007-03-01

Apparel Retailers
type: IndustryClassificationBenchmarkClassifier
type: SubsectorClassifier
type: NamedIndividual
is contemporary version of: http://data.ga-group.nl/ics/icb/5371
is replaced by: http://data.ga-group.nl/ics/icb/2007/5371
is version of: http://data.ga-group.nl/ics/icb/5371
is subsector of: General Retailers
imported on: 2026-06-01T03:03:54.132Z
last refreshed on: 2026-06-01T10:28:56.931Z
source accessed on: 2015-03-30T23:37:37Z
source last accessed on: 2015-03-30T23:37:37Z
definition: Retailers and wholesalers specializing mainly in clothing, shoes, jewelry, sunglasses and other accessories.
notation: 5371
valid from: 2005-01-01
valid till: 2007-03-01

Broadline Retailers
type: IndustryClassificationBenchmarkClassifier
type: SubsectorClassifier
type: NamedIndividual
is contemporary version of: http://data.ga-group.nl/ics/icb/5373
is replaced by: http://data.ga-group.nl/ics/icb/2007/5373
is version of: http://data.ga-group.nl/ics/icb/5373
is subsector of: General Retailers
imported on: 2026-06-01T03:03:54.132Z
last refreshed on: 2026-06-01T10:28:56.931Z
source accessed on: 2015-03-30T23:37:37Z
source last accessed on: 2015-03-30T23:37:37Z
definition: Retail outlets and wholesalers offering a wide variety of products including both hard goods and soft goods.
notation: 5373
valid from: 2005-01-01
valid till: 2007-03-01

Home Improvement Retailers
type: IndustryClassificationBenchmarkClassifier
type: SubsectorClassifier
type: NamedIndividual
is contemporary version of: http://data.ga-group.nl/ics/icb/5375
is replaced by: http://data.ga-group.nl/ics/icb/2007/5375
is version of: http://data.ga-group.nl/ics/icb/5375
is subsector of: General Retailers
imported on: 2026-06-01T03:03:54.132Z
last refreshed on: 2026-06-01T10:28:56.931Z
source accessed on: 2015-03-30T23:37:37Z
source last accessed on: 2015-03-30T23:37:37Z
definition: Retailers and wholesalers concentrating on the sale of home improvement products, including garden equipment, carpets, wallpaper, paint, home furniture, blinds and curtains, and building materials.
notation: 5375
valid from: 2005-01-01
valid till: 2007-03-01

Specialized Consumer Services
type: IndustryClassificationBenchmarkClassifier
type: SubsectorClassifier
type: NamedIndividual
is contemporary version of: http://data.ga-group.nl/ics/icb/5377
is replaced by: http://data.ga-group.nl/ics/icb/2007/5377
is version of: http://data.ga-group.nl/ics/icb/5377
is subsector of: General Retailers
imported on: 2026-06-01T03:03:54.132Z
last refreshed on: 2026-06-01T10:28:56.931Z
source accessed on: 2015-03-30T23:37:37Z
source last accessed on: 2015-03-30T23:37:37Z
definition: Providers of consumer services such as auction houses, day-care centers, dry cleaners, schools, consumer rental companies, veterinary clinics, hair salons and providers of funeral, lawn-maintenance, consumer-storage, heating and cooling installation and plumbing services.
notation: 5377
valid from: 2005-01-01
valid till: 2007-03-01

Specialty Retailers
type: IndustryClassificationBenchmarkClassifier
type: SubsectorClassifier
type: NamedIndividual
is contemporary version of: http://data.ga-group.nl/ics/icb/5379
is replaced by: http://data.ga-group.nl/ics/icb/2007/5379
is version of: http://data.ga-group.nl/ics/icb/5379
is subsector of: General Retailers
imported on: 2026-06-01T03:03:54.132Z
last refreshed on: 2026-06-01T10:28:56.931Z
source accessed on: 2015-03-30T23:37:37Z
source last accessed on: 2015-03-30T23:37:37Z
definition: Retailers and wholesalers concentrating on a single class of goods, such as electronics, books, automotive parts or closeouts. Includes automobile dealerships, video rental stores, dollar stores, duty-free shops and automotive fuel stations not owned by oil companies.
notation: 5379
valid from: 2005-01-01
valid till: 2007-03-01

Media
type: IndustryClassificationBenchmarkClassifier
type: SupersectorClassifier
type: NamedIndividual
is contemporary version of: http://data.ga-group.nl/ics/icb/5500
is replaced by: http://data.ga-group.nl/ics/icb/2007/5500
is version of: http://data.ga-group.nl/ics/icb/5500
is supersector of: Consumer Services
imported on: 2026-06-01T03:03:54.132Z
last refreshed on: 2026-06-01T10:28:56.931Z
source accessed on: 2015-03-30T23:37:37Z
source last accessed on: 2015-03-30T23:37:37Z
notation: 5500
valid from: 2005-01-01
valid till: 2007-03-01

Media
type: IndustryClassificationBenchmarkClassifier
type: SectorClassifier
type: NamedIndividual
is contemporary version of: http://data.ga-group.nl/ics/icb/5550
is replaced by: http://data.ga-group.nl/ics/icb/2007/5550
is version of: http://data.ga-group.nl/ics/icb/5550
is sector of: Media
imported on: 2026-06-01T03:03:54.132Z
last refreshed on: 2026-06-01T10:28:56.931Z
source accessed on: 2015-03-30T23:37:37Z
source last accessed on: 2015-03-30T23:37:37Z
notation: 5550
valid from: 2005-01-01
valid till: 2007-03-01

Broadcasting & Entertainment
type: IndustryClassificationBenchmarkClassifier
type: SubsectorClassifier
type: NamedIndividual
is contemporary version of: http://data.ga-group.nl/ics/icb/5553
is replaced by: http://data.ga-group.nl/ics/icb/2007/5553
is version of: http://data.ga-group.nl/ics/icb/5553
is subsector of: Media
imported on: 2026-06-01T03:03:54.132Z
last refreshed on: 2026-06-01T10:28:56.931Z
source accessed on: 2015-03-30T23:37:37Z
source last accessed on: 2015-03-30T23:37:37Z
definition: Producers, operators and broadcasters of radio, television, music and filmed entertainment. Excludes movie theatres, which are classified under Recreational Services.
notation: 5553
valid from: 2005-01-01
valid till: 2007-03-01

Media Agencies
type: IndustryClassificationBenchmarkClassifier
type: SubsectorClassifier
type: NamedIndividual
is contemporary version of: http://data.ga-group.nl/ics/icb/5555
is replaced by: http://data.ga-group.nl/ics/icb/2007/5555
is version of: http://data.ga-group.nl/ics/icb/5555
is subsector of: Media
imported on: 2026-06-01T03:03:54.132Z
last refreshed on: 2026-06-01T10:28:56.931Z
source accessed on: 2015-03-30T23:37:37Z
source last accessed on: 2015-03-30T23:37:37Z
definition: Companies providing advertising, public relations and marketing services. Includes billboard providers and telemarketers.
notation: 5555
valid from: 2005-01-01
valid till: 2007-03-01

Publishing
type: IndustryClassificationBenchmarkClassifier
type: SubsectorClassifier
type: NamedIndividual
is contemporary version of: http://data.ga-group.nl/ics/icb/5557
is replaced by: http://data.ga-group.nl/ics/icb/2007/5557
is version of: http://data.ga-group.nl/ics/icb/5557
is subsector of: Media
imported on: 2026-06-01T03:03:54.132Z
last refreshed on: 2026-06-01T10:28:56.931Z
source accessed on: 2015-03-30T23:37:37Z
source last accessed on: 2015-03-30T23:37:37Z
definition: Publishers of information via printed or electronic media.
notation: 5557
valid from: 2005-01-01
valid till: 2007-03-01

Travel & Leisure
type: IndustryClassificationBenchmarkClassifier
type: SupersectorClassifier
type: NamedIndividual
is contemporary version of: http://data.ga-group.nl/ics/icb/5700
is replaced by: http://data.ga-group.nl/ics/icb/2007/5700
is version of: http://data.ga-group.nl/ics/icb/5700
is supersector of: Consumer Services
imported on: 2026-06-01T03:03:54.132Z
last refreshed on: 2026-06-01T10:28:56.931Z
source accessed on: 2015-03-30T23:37:37Z
source last accessed on: 2015-03-30T23:37:37Z
notation: 5700
valid from: 2005-01-01
valid till: 2007-03-01

Travel & Leisure
type: IndustryClassificationBenchmarkClassifier
type: SectorClassifier
type: NamedIndividual
is contemporary version of: http://data.ga-group.nl/ics/icb/5750
is replaced by: http://data.ga-group.nl/ics/icb/2007/5750
is version of: http://data.ga-group.nl/ics/icb/5750
is sector of: Travel & Leisure
imported on: 2026-06-01T03:03:54.132Z
last refreshed on: 2026-06-01T10:28:56.931Z
source accessed on: 2015-03-30T23:37:37Z
source last accessed on: 2015-03-30T23:37:37Z
notation: 5750
valid from: 2005-01-01
valid till: 2007-03-01

Airlines
type: IndustryClassificationBenchmarkClassifier
type: SubsectorClassifier
type: NamedIndividual
is contemporary version of: http://data.ga-group.nl/ics/icb/5751
is replaced by: http://data.ga-group.nl/ics/icb/2007/5751
is version of: http://data.ga-group.nl/ics/icb/5751
is subsector of: Travel & Leisure
imported on: 2026-06-01T03:03:54.132Z
last refreshed on: 2026-06-01T10:28:56.931Z
source accessed on: 2015-03-30T23:37:37Z
source last accessed on: 2015-03-30T23:37:37Z
definition: Companies providing primarily passenger air transport. Excludes airports, which are classified under Transportation Services.
notation: 5751
valid from: 2005-01-01
valid till: 2007-03-01

Gambling
type: IndustryClassificationBenchmarkClassifier
type: SubsectorClassifier
type: NamedIndividual
is contemporary version of: http://data.ga-group.nl/ics/icb/5752
is replaced by: http://data.ga-group.nl/ics/icb/2007/5752
is version of: http://data.ga-group.nl/ics/icb/5752
is subsector of: Travel & Leisure
imported on: 2026-06-01T03:03:54.132Z
last refreshed on: 2026-06-01T10:28:56.931Z
source accessed on: 2015-03-30T23:37:37Z
source last accessed on: 2015-03-30T23:37:37Z
definition: Providers of gambling and casino facilities. Includes online casinos, racetracks and the manufacturers of pachinko machines and casino and lottery equipment.
notation: 5752
valid from: 2005-01-01
valid till: 2007-03-01

Hotels
type: IndustryClassificationBenchmarkClassifier
type: SubsectorClassifier
type: NamedIndividual
is contemporary version of: http://data.ga-group.nl/ics/icb/5753
is replaced by: http://data.ga-group.nl/ics/icb/2007/5753
is version of: http://data.ga-group.nl/ics/icb/5753
is subsector of: Travel & Leisure
imported on: 2026-06-01T03:03:54.132Z
last refreshed on: 2026-06-01T10:28:56.931Z
source accessed on: 2015-03-30T23:37:37Z
source last accessed on: 2015-03-30T23:37:37Z
definition: Operators and managers of hotels, motels, lodges, resorts, spas and campgrounds.
notation: 5753
valid from: 2005-01-01
valid till: 2007-03-01

Recreational Services
type: IndustryClassificationBenchmarkClassifier
type: SubsectorClassifier
type: NamedIndividual
is contemporary version of: http://data.ga-group.nl/ics/icb/5755
is replaced by: http://data.ga-group.nl/ics/icb/2007/5755
is version of: http://data.ga-group.nl/ics/icb/5755
is subsector of: Travel & Leisure
imported on: 2026-06-01T03:03:54.132Z
last refreshed on: 2026-06-01T10:28:56.931Z
source accessed on: 2015-03-30T23:37:37Z
source last accessed on: 2015-03-30T23:37:37Z
definition: Providers of leisure facilities and services, including fitness centers, cruise lines, movie theatres and sports teams.
notation: 5755
valid from: 2005-01-01
valid till: 2007-03-01

Restaurants & Bars
type: IndustryClassificationBenchmarkClassifier
type: SubsectorClassifier
type: NamedIndividual
is contemporary version of: http://data.ga-group.nl/ics/icb/5757
is replaced by: http://data.ga-group.nl/ics/icb/2007/5757
is version of: http://data.ga-group.nl/ics/icb/5757
is subsector of: Travel & Leisure
imported on: 2026-06-01T03:03:54.132Z
last refreshed on: 2026-06-01T10:28:56.931Z
source accessed on: 2015-03-30T23:37:37Z
source last accessed on: 2015-03-30T23:37:37Z
definition: Operators of restaurants, fast-food facilities, coffee shops and bars. Includes integrated brewery companies and catering companies.
notation: 5757
valid from: 2005-01-01
valid till: 2007-03-01

Travel & Tourism
type: IndustryClassificationBenchmarkClassifier
type: SubsectorClassifier
type: NamedIndividual
is contemporary version of: http://data.ga-group.nl/ics/icb/5759
is replaced by: http://data.ga-group.nl/ics/icb/2007/5759
is version of: http://data.ga-group.nl/ics/icb/5759
is subsector of: Travel & Leisure
imported on: 2026-06-01T03:03:54.132Z
last refreshed on: 2026-06-01T10:28:56.931Z
source accessed on: 2015-03-30T23:37:37Z
source last accessed on: 2015-03-30T23:37:37Z
definition: Companies providing travel and tourism related services, including travel agents, online travel reservation services, automobile rental firms and companies that primarily provide passenger transportation, such as buses, taxis, passenger rail and ferry companies.
notation: 5759
valid from: 2005-01-01
valid till: 2007-03-01

Telecommunications
type: IndustryClassificationBenchmarkClassifier
type: IndustryClassifier
type: NamedIndividual
is contemporary version of: http://data.ga-group.nl/ics/icb/6000
is replaced by: http://data.ga-group.nl/ics/icb/2007/6000
is version of: http://data.ga-group.nl/ics/icb/6000
imported on: 2026-06-01T03:03:54.132Z
last refreshed on: 2026-06-01T10:28:56.931Z
source accessed on: 2015-03-30T23:37:37Z
source last accessed on: 2015-03-30T23:37:37Z
notation: 6000
valid from: 2005-01-01
valid till: 2007-03-01

Telecommunications
type: IndustryClassificationBenchmarkClassifier
type: SupersectorClassifier
type: NamedIndividual
is contemporary version of: http://data.ga-group.nl/ics/icb/6500
is replaced by: http://data.ga-group.nl/ics/icb/2007/6500
is version of: http://data.ga-group.nl/ics/icb/6500
is supersector of: Telecommunications
imported on: 2026-06-01T03:03:54.132Z
last refreshed on: 2026-06-01T10:28:56.931Z
source accessed on: 2015-03-30T23:37:37Z
source last accessed on: 2015-03-30T23:37:37Z
notation: 6500
valid from: 2005-01-01
valid till: 2007-03-01

Fixed Line Telecommunications
type: IndustryClassificationBenchmarkClassifier
type: SectorClassifier
type: NamedIndividual
is contemporary version of: http://data.ga-group.nl/ics/icb/6530
is replaced by: http://data.ga-group.nl/ics/icb/2007/6530
is version of: http://data.ga-group.nl/ics/icb/6530
is sector of: Telecommunications
imported on: 2026-06-01T03:03:54.132Z
last refreshed on: 2026-06-01T10:28:56.931Z
source accessed on: 2015-03-30T23:37:37Z
source last accessed on: 2015-03-30T23:37:37Z
notation: 6530
valid from: 2005-01-01
valid till: 2007-03-01

Fixed Line Telecommunications
type: IndustryClassificationBenchmarkClassifier
type: SubsectorClassifier
type: NamedIndividual
is contemporary version of: http://data.ga-group.nl/ics/icb/6535
is replaced by: http://data.ga-group.nl/ics/icb/2007/6535
is version of: http://data.ga-group.nl/ics/icb/6535
is subsector of: Fixed Line Telecommunications
imported on: 2026-06-01T03:03:54.132Z
last refreshed on: 2026-06-01T10:28:56.931Z
source accessed on: 2015-03-30T23:37:37Z
source last accessed on: 2015-03-30T23:37:37Z
definition: Providers of fixed-line telephone services, including regional and long-distance. Excludes companies whose primary business is Internet access, which are classified under Internet.
notation: 6535
valid from: 2005-01-01
valid till: 2007-03-01

Mobile Telecommunications
type: IndustryClassificationBenchmarkClassifier
type: SectorClassifier
type: NamedIndividual
is contemporary version of: http://data.ga-group.nl/ics/icb/6570
is replaced by: http://data.ga-group.nl/ics/icb/2007/6570
is version of: http://data.ga-group.nl/ics/icb/6570
is sector of: Telecommunications
imported on: 2026-06-01T03:03:54.132Z
last refreshed on: 2026-06-01T10:28:56.931Z
source accessed on: 2015-03-30T23:37:37Z
source last accessed on: 2015-03-30T23:37:37Z
notation: 6570
valid from: 2005-01-01
valid till: 2007-03-01

Mobile Telecommunications
type: IndustryClassificationBenchmarkClassifier
type: SubsectorClassifier
type: NamedIndividual
is contemporary version of: http://data.ga-group.nl/ics/icb/6575
is replaced by: http://data.ga-group.nl/ics/icb/2007/6575
is version of: http://data.ga-group.nl/ics/icb/6575
is subsector of: Mobile Telecommunications
imported on: 2026-06-01T03:03:54.132Z
last refreshed on: 2026-06-01T10:28:56.931Z
source accessed on: 2015-03-30T23:37:37Z
source last accessed on: 2015-03-30T23:37:37Z
definition: Providers of mobile telephone services, including cellular, satellite and paging services.
notation: 6575
valid from: 2005-01-01
valid till: 2007-03-01

Utilities
type: IndustryClassificationBenchmarkClassifier
type: IndustryClassifier
type: NamedIndividual
is contemporary version of: http://data.ga-group.nl/ics/icb/7000
is replaced by: http://data.ga-group.nl/ics/icb/2007/7000
is version of: http://data.ga-group.nl/ics/icb/7000
imported on: 2026-06-01T03:03:54.132Z
last refreshed on: 2026-06-01T10:28:56.931Z
source accessed on: 2015-03-30T23:37:37Z
source last accessed on: 2015-03-30T23:37:37Z
notation: 7000
valid from: 2005-01-01
valid till: 2007-03-01

Utilities
type: IndustryClassificationBenchmarkClassifier
type: SupersectorClassifier
type: NamedIndividual
is contemporary version of: http://data.ga-group.nl/ics/icb/7500
is replaced by: http://data.ga-group.nl/ics/icb/2007/7500
is version of: http://data.ga-group.nl/ics/icb/7500
is supersector of: Utilities
imported on: 2026-06-01T03:03:54.132Z
last refreshed on: 2026-06-01T10:28:56.931Z
source accessed on: 2015-03-30T23:37:37Z
source last accessed on: 2015-03-30T23:37:37Z
notation: 7500
valid from: 2005-01-01
valid till: 2007-03-01

Electricity
type: IndustryClassificationBenchmarkClassifier
type: SectorClassifier
type: NamedIndividual
is contemporary version of: http://data.ga-group.nl/ics/icb/7530
is replaced by: http://data.ga-group.nl/ics/icb/2007/7530
is version of: http://data.ga-group.nl/ics/icb/7530
is sector of: Utilities
imported on: 2026-06-01T03:03:54.132Z
last refreshed on: 2026-06-01T10:28:56.931Z
source accessed on: 2015-03-30T23:37:37Z
source last accessed on: 2015-03-30T23:37:37Z
notation: 7530
valid from: 2005-01-01
valid till: 2007-03-01

Electricity
type: IndustryClassificationBenchmarkClassifier
type: SubsectorClassifier
type: NamedIndividual
is contemporary version of: http://data.ga-group.nl/ics/icb/7535
is replaced by: http://data.ga-group.nl/ics/icb/2007/7535
is version of: http://data.ga-group.nl/ics/icb/7535
is subsector of: Electricity
imported on: 2026-06-01T03:03:54.132Z
last refreshed on: 2026-06-01T10:28:56.931Z
source accessed on: 2015-03-30T23:37:37Z
source last accessed on: 2015-03-30T23:37:37Z
definition: Companies generating and distributing electricity, including generation using geothermal, nuclear and solar energy.
notation: 7535
valid from: 2005-01-01
valid till: 2007-03-01

Gas, Water & Multiutilities
type: IndustryClassificationBenchmarkClassifier
type: SectorClassifier
type: NamedIndividual
is contemporary version of: http://data.ga-group.nl/ics/icb/7570
is replaced by: http://data.ga-group.nl/ics/icb/2007/7570
is version of: http://data.ga-group.nl/ics/icb/7570
is sector of: Utilities
imported on: 2026-06-01T03:03:54.132Z
last refreshed on: 2026-06-01T10:28:56.931Z
source accessed on: 2015-03-30T23:37:37Z
source last accessed on: 2015-03-30T23:37:37Z
notation: 7570
valid from: 2005-01-01
valid till: 2007-03-01

Gas Distribution
type: IndustryClassificationBenchmarkClassifier
type: SubsectorClassifier
type: NamedIndividual
is contemporary version of: http://data.ga-group.nl/ics/icb/7573
is replaced by: http://data.ga-group.nl/ics/icb/2007/7573
is version of: http://data.ga-group.nl/ics/icb/7573
is subsector of: Gas, Water & Multiutilities
imported on: 2026-06-01T03:03:54.132Z
last refreshed on: 2026-06-01T10:28:56.931Z
source accessed on: 2015-03-30T23:37:37Z
source last accessed on: 2015-03-30T23:37:37Z
definition: Distributors of gas to end users. Excludes providers of natural gas as a commodity, which are classified under the Oil & Gas industry.
notation: 7573
valid from: 2005-01-01
valid till: 2007-03-01

Multiutilities
type: IndustryClassificationBenchmarkClassifier
type: SubsectorClassifier
type: NamedIndividual
is contemporary version of: http://data.ga-group.nl/ics/icb/7575
is replaced by: http://data.ga-group.nl/ics/icb/2007/7575
is version of: http://data.ga-group.nl/ics/icb/7575
is subsector of: Gas, Water & Multiutilities
imported on: 2026-06-01T03:03:54.132Z
last refreshed on: 2026-06-01T10:28:56.931Z
source accessed on: 2015-03-30T23:37:37Z
source last accessed on: 2015-03-30T23:37:37Z
definition: Utility companies with significant presence in more than one utility.
notation: 7575
valid from: 2005-01-01
valid till: 2007-03-01

Water
type: IndustryClassificationBenchmarkClassifier
type: SubsectorClassifier
type: NamedIndividual
is contemporary version of: http://data.ga-group.nl/ics/icb/7577
is replaced by: http://data.ga-group.nl/ics/icb/2007/7577
is version of: http://data.ga-group.nl/ics/icb/7577
is subsector of: Gas, Water & Multiutilities
imported on: 2026-06-01T03:03:54.132Z
last refreshed on: 2026-06-01T10:28:56.931Z
source accessed on: 2015-03-30T23:37:37Z
source last accessed on: 2015-03-30T23:37:37Z
definition: Companies providing water to end users, including water treatment plants.
notation: 7577
valid from: 2005-01-01
valid till: 2007-03-01

Financials
type: IndustryClassificationBenchmarkClassifier
type: IndustryClassifier
type: NamedIndividual
is contemporary version of: http://data.ga-group.nl/ics/icb/8000
is replaced by: http://data.ga-group.nl/ics/icb/2007/8000
is version of: http://data.ga-group.nl/ics/icb/8000
imported on: 2026-06-01T03:03:54.132Z
last refreshed on: 2026-06-01T10:28:56.931Z
source accessed on: 2015-03-30T23:37:37Z
source last accessed on: 2015-03-30T23:37:37Z
notation: 8000
valid from: 2005-01-01
valid till: 2007-03-01

Banks
type: IndustryClassificationBenchmarkClassifier
type: SupersectorClassifier
type: NamedIndividual
is contemporary version of: http://data.ga-group.nl/ics/icb/8300
is replaced by: http://data.ga-group.nl/ics/icb/2007/8300
is version of: http://data.ga-group.nl/ics/icb/8300
is supersector of: Financials
imported on: 2026-06-01T03:03:54.132Z
last refreshed on: 2026-06-01T10:28:56.931Z
source accessed on: 2015-03-30T23:37:37Z
source last accessed on: 2015-03-30T23:37:37Z
notation: 8300
valid from: 2005-01-01
valid till: 2007-03-01

Banks
type: IndustryClassificationBenchmarkClassifier
type: SectorClassifier
type: NamedIndividual
is contemporary version of: http://data.ga-group.nl/ics/icb/8350
is replaced by: http://data.ga-group.nl/ics/icb/2007/8350
is version of: http://data.ga-group.nl/ics/icb/8350
is sector of: Banks
imported on: 2026-06-01T03:03:54.132Z
last refreshed on: 2026-06-01T10:28:56.931Z
source accessed on: 2015-03-30T23:37:37Z
source last accessed on: 2015-03-30T23:37:37Z
notation: 8350
valid from: 2005-01-01
valid till: 2007-03-01

Banks
type: IndustryClassificationBenchmarkClassifier
type: SubsectorClassifier
type: NamedIndividual
is contemporary version of: http://data.ga-group.nl/ics/icb/8355
is replaced by: http://data.ga-group.nl/ics/icb/2007/8355
is version of: http://data.ga-group.nl/ics/icb/8355
is subsector of: Banks
imported on: 2026-06-01T03:03:54.132Z
last refreshed on: 2026-06-01T10:28:56.931Z
source accessed on: 2015-03-30T23:37:37Z
source last accessed on: 2015-03-30T23:37:37Z
definition: Banks providing a broad range of financial services, including retail banking, loans and money transmissions.
notation: 8355
valid from: 2005-01-01
valid till: 2007-03-01

Insurance
type: IndustryClassificationBenchmarkClassifier
type: SupersectorClassifier
type: NamedIndividual
is contemporary version of: http://data.ga-group.nl/ics/icb/8500
is replaced by: http://data.ga-group.nl/ics/icb/2007/8500
is version of: http://data.ga-group.nl/ics/icb/8500
is supersector of: Financials
imported on: 2026-06-01T03:03:54.132Z
last refreshed on: 2026-06-01T10:28:56.931Z
source accessed on: 2015-03-30T23:37:37Z
source last accessed on: 2015-03-30T23:37:37Z
notation: 8500
valid from: 2005-01-01
valid till: 2007-03-01

Nonlife Insurance
type: IndustryClassificationBenchmarkClassifier
type: SectorClassifier
type: NamedIndividual
is contemporary version of: http://data.ga-group.nl/ics/icb/8530
is replaced by: http://data.ga-group.nl/ics/icb/2007/8530
is version of: http://data.ga-group.nl/ics/icb/8530
is sector of: Insurance
imported on: 2026-06-01T03:03:54.132Z
last refreshed on: 2026-06-01T10:28:56.931Z
source accessed on: 2015-03-30T23:37:37Z
source last accessed on: 2015-03-30T23:37:37Z
notation: 8530
valid from: 2005-01-01
valid till: 2007-03-01

Full Line Insurance
type: IndustryClassificationBenchmarkClassifier
type: SubsectorClassifier
type: NamedIndividual
is contemporary version of: http://data.ga-group.nl/ics/icb/8532
is replaced by: http://data.ga-group.nl/ics/icb/2007/8532
is version of: http://data.ga-group.nl/ics/icb/8532
is subsector of: Nonlife Insurance
imported on: 2026-06-01T03:03:54.132Z
last refreshed on: 2026-06-01T10:28:56.931Z
source accessed on: 2015-03-30T23:37:37Z
source last accessed on: 2015-03-30T23:37:37Z
definition: Insurance companies with life, health, property & casualty and reinsurance interests, no one of which predominates.
notation: 8532
valid from: 2005-01-01
valid till: 2007-03-01

Insurance Brokers
type: IndustryClassificationBenchmarkClassifier
type: SubsectorClassifier
type: NamedIndividual
is contemporary version of: http://data.ga-group.nl/ics/icb/8534
is replaced by: http://data.ga-group.nl/ics/icb/2007/8534
is version of: http://data.ga-group.nl/ics/icb/8534
is subsector of: Nonlife Insurance
imported on: 2026-06-01T03:03:54.132Z
last refreshed on: 2026-06-01T10:28:56.931Z
source accessed on: 2015-03-30T23:37:37Z
source last accessed on: 2015-03-30T23:37:37Z
definition: Insurance brokers and agencies.
notation: 8534
valid from: 2005-01-01
valid till: 2007-03-01

Property & Casualty Insurance
type: IndustryClassificationBenchmarkClassifier
type: SubsectorClassifier
type: NamedIndividual
is contemporary version of: http://data.ga-group.nl/ics/icb/8536
is replaced by: http://data.ga-group.nl/ics/icb/2007/8536
is version of: http://data.ga-group.nl/ics/icb/8536
is subsector of: Nonlife Insurance
imported on: 2026-06-01T03:03:54.132Z
last refreshed on: 2026-06-01T10:28:56.931Z
source accessed on: 2015-03-30T23:37:37Z
source last accessed on: 2015-03-30T23:37:37Z
definition: Companies engaged principally in accident, fire, automotive, marine, malpractice and other classes of nonlife insurance.
notation: 8536
valid from: 2005-01-01
valid till: 2007-03-01

Reinsurance
type: IndustryClassificationBenchmarkClassifier
type: SubsectorClassifier
type: NamedIndividual
is contemporary version of: http://data.ga-group.nl/ics/icb/8538
is replaced by: http://data.ga-group.nl/ics/icb/2007/8538
is version of: http://data.ga-group.nl/ics/icb/8538
is subsector of: Nonlife Insurance
imported on: 2026-06-01T03:03:54.132Z
last refreshed on: 2026-06-01T10:28:56.931Z
source accessed on: 2015-03-30T23:37:37Z
source last accessed on: 2015-03-30T23:37:37Z
definition: Companies engaged principally in reinsurance.
notation: 8538
valid from: 2005-01-01
valid till: 2007-03-01

Life Insurance
type: IndustryClassificationBenchmarkClassifier
type: SectorClassifier
type: NamedIndividual
is contemporary version of: http://data.ga-group.nl/ics/icb/8570
is replaced by: http://data.ga-group.nl/ics/icb/2007/8570
is version of: http://data.ga-group.nl/ics/icb/8570
is sector of: Insurance
imported on: 2026-06-01T03:03:54.132Z
last refreshed on: 2026-06-01T10:28:56.931Z
source accessed on: 2015-03-30T23:37:37Z
source last accessed on: 2015-03-30T23:37:37Z
notation: 8570
valid from: 2005-01-01
valid till: 2007-03-01

Life Insurance
type: IndustryClassificationBenchmarkClassifier
type: SubsectorClassifier
type: NamedIndividual
is contemporary version of: http://data.ga-group.nl/ics/icb/8575
is replaced by: http://data.ga-group.nl/ics/icb/2007/8575
is version of: http://data.ga-group.nl/ics/icb/8575
is subsector of: Life Insurance
imported on: 2026-06-01T03:03:54.132Z
last refreshed on: 2026-06-01T10:28:56.931Z
source accessed on: 2015-03-30T23:37:37Z
source last accessed on: 2015-03-30T23:37:37Z
definition: Companies engaged principally in life and health insurance.
notation: 8575
valid from: 2005-01-01
valid till: 2007-03-01

Financial Services
type: IndustryClassificationBenchmarkClassifier
type: SupersectorClassifier
type: NamedIndividual
is contemporary version of: http://data.ga-group.nl/ics/icb/8700
is replaced by: http://data.ga-group.nl/ics/icb/2007/8700
is version of: http://data.ga-group.nl/ics/icb/8700
is supersector of: Financials
imported on: 2026-06-01T03:03:54.132Z
last refreshed on: 2026-06-01T10:28:56.931Z
source accessed on: 2015-03-30T23:37:37Z
source last accessed on: 2015-03-30T23:37:37Z
notation: 8700
valid from: 2005-01-01
valid till: 2007-03-01

Real Estate
type: IndustryClassificationBenchmarkClassifier
type: SectorClassifier
type: NamedIndividual
is contemporary version of: http://data.ga-group.nl/ics/icb/8730
is version of: http://data.ga-group.nl/ics/icb/8730
is sector of: Financial Services
imported on: 2026-06-01T03:03:54.132Z
last refreshed on: 2026-06-01T10:28:56.931Z
source accessed on: 2015-03-30T23:37:37Z
source last accessed on: 2015-03-30T23:37:37Z
notation: 8730
valid from: 2005-01-01
valid till: 2007-03-01

Real Estate Holding & Development
type: IndustryClassificationBenchmarkClassifier
type: SubsectorClassifier
type: NamedIndividual
is contemporary version of: http://data.ga-group.nl/ics/icb/8733
is version of: http://data.ga-group.nl/ics/icb/8733
is subsector of: Real Estate
imported on: 2026-06-01T03:03:54.132Z
last refreshed on: 2026-06-01T10:28:56.931Z
source accessed on: 2015-03-30T23:37:37Z
source last accessed on: 2015-03-30T23:37:37Z
definition: Companies that invest directly or indirectly in real estate through development, management or ownership, including property agencies. Excludes real estate investment trusts and similar entities, which are classified as Real Estate Investment Trusts.
notation: 8733
valid from: 2005-01-01
valid till: 2007-03-01

Real Estate Investment Trusts
type: IndustryClassificationBenchmarkClassifier
type: SubsectorClassifier
type: NamedIndividual
is contemporary version of: http://data.ga-group.nl/ics/icb/8737
is version of: http://data.ga-group.nl/ics/icb/8737
is subsector of: Real Estate
imported on: 2026-06-01T03:03:54.132Z
last refreshed on: 2026-06-01T10:28:56.931Z
source accessed on: 2015-03-30T23:37:37Z
source last accessed on: 2015-03-30T23:37:37Z
definition: Real estate investment trusts or corporations (REITs) and listed property trusts (LPTs).
notation: 8737
valid from: 2005-01-01
valid till: 2007-03-01

General Financial
type: IndustryClassificationBenchmarkClassifier
type: SectorClassifier
type: NamedIndividual
is contemporary version of: http://data.ga-group.nl/ics/icb/8770
is replaced by: http://data.ga-group.nl/ics/icb/2007/8770
is version of: http://data.ga-group.nl/ics/icb/8770
is sector of: Financial Services
imported on: 2026-06-01T03:03:54.132Z
last refreshed on: 2026-06-01T10:28:56.931Z
source accessed on: 2015-03-30T23:37:37Z
source last accessed on: 2015-03-30T23:37:37Z
notation: 8770
valid from: 2005-01-01
valid till: 2007-03-01

Asset Managers
type: IndustryClassificationBenchmarkClassifier
type: SubsectorClassifier
type: NamedIndividual
is contemporary version of: http://data.ga-group.nl/ics/icb/8771
is replaced by: http://data.ga-group.nl/ics/icb/2007/8771
is version of: http://data.ga-group.nl/ics/icb/8771
is subsector of: General Financial
imported on: 2026-06-01T03:03:54.132Z
last refreshed on: 2026-06-01T10:28:56.931Z
source accessed on: 2015-03-30T23:37:37Z
source last accessed on: 2015-03-30T23:37:37Z
definition: Companies that provide custodial, trustee and other related fiduciary services. Includes mutual fund management companies.
notation: 8771
valid from: 2005-01-01
valid till: 2007-03-01

Consumer Finance
type: IndustryClassificationBenchmarkClassifier
type: SubsectorClassifier
type: NamedIndividual
is contemporary version of: http://data.ga-group.nl/ics/icb/8773
is replaced by: http://data.ga-group.nl/ics/icb/2007/8773
is version of: http://data.ga-group.nl/ics/icb/8773
is subsector of: General Financial
imported on: 2026-06-01T03:03:54.132Z
last refreshed on: 2026-06-01T10:28:56.931Z
source accessed on: 2015-03-30T23:37:37Z
source last accessed on: 2015-03-30T23:37:37Z
definition: Credit card companies and providers of personal finance services such as personal loans and check cashing companies.
notation: 8773
valid from: 2005-01-01
valid till: 2007-03-01

Specialty Finance
type: IndustryClassificationBenchmarkClassifier
type: SubsectorClassifier
type: NamedIndividual
is contemporary version of: http://data.ga-group.nl/ics/icb/8775
is replaced by: http://data.ga-group.nl/ics/icb/2007/8775
is version of: http://data.ga-group.nl/ics/icb/8775
is subsector of: General Financial
imported on: 2026-06-01T03:03:54.132Z
last refreshed on: 2026-06-01T10:28:56.931Z
source accessed on: 2015-03-30T23:37:37Z
source last accessed on: 2015-03-30T23:37:37Z
definition: Companies engaged in financial activities not specified elsewhere. Includes companies not classified under Equity Investment Instruments or Nonequity Investment Instruments engaged primarily in owning stakes in a diversified range of companies.
notation: 8775
valid from: 2005-01-01
valid till: 2007-03-01

Investment Services
type: IndustryClassificationBenchmarkClassifier
type: SubsectorClassifier
type: NamedIndividual
is contemporary version of: http://data.ga-group.nl/ics/icb/8777
is replaced by: http://data.ga-group.nl/ics/icb/2007/8777
is version of: http://data.ga-group.nl/ics/icb/8777
is subsector of: General Financial
imported on: 2026-06-01T03:03:54.132Z
last refreshed on: 2026-06-01T10:28:56.931Z
source accessed on: 2015-03-30T23:37:37Z
source last accessed on: 2015-03-30T23:37:37Z
definition: Companies providing a range of specialized financial services, including securities brokers and dealers, online brokers and security or commodity exchanges.
notation: 8777
valid from: 2005-01-01
valid till: 2007-03-01

Mortgage Finance
type: IndustryClassificationBenchmarkClassifier
type: SubsectorClassifier
type: NamedIndividual
is contemporary version of: http://data.ga-group.nl/ics/icb/8779
is replaced by: http://data.ga-group.nl/ics/icb/2007/8779
is version of: http://data.ga-group.nl/ics/icb/8779
is subsector of: General Financial
imported on: 2026-06-01T03:03:54.132Z
last refreshed on: 2026-06-01T10:28:56.931Z
source accessed on: 2015-03-30T23:37:37Z
source last accessed on: 2015-03-30T23:37:37Z
definition: Companies that provide mortgages, mortgage insurance and other related services.
notation: 8779
valid from: 2005-01-01
valid till: 2007-03-01

Equity Investment Instruments
type: IndustryClassificationBenchmarkClassifier
type: SectorClassifier
type: NamedIndividual
is contemporary version of: http://data.ga-group.nl/ics/icb/8980
is replaced by: http://data.ga-group.nl/ics/icb/2007/8980
is version of: http://data.ga-group.nl/ics/icb/8980
is sector of: Financial Services
imported on: 2026-06-01T03:03:54.132Z
last refreshed on: 2026-06-01T10:28:56.931Z
source accessed on: 2015-03-30T23:37:37Z
source last accessed on: 2015-03-30T23:37:37Z
notation: 8980
valid from: 2005-01-01
valid till: 2007-03-01

Equity Investment Instruments
type: IndustryClassificationBenchmarkClassifier
type: SubsectorClassifier
type: NamedIndividual
is contemporary version of: http://data.ga-group.nl/ics/icb/8985
is replaced by: http://data.ga-group.nl/ics/icb/2007/8985
is version of: http://data.ga-group.nl/ics/icb/8985
is subsector of: Equity Investment Instruments
imported on: 2026-06-01T03:03:54.132Z
last refreshed on: 2026-06-01T10:28:56.931Z
source accessed on: 2015-03-30T23:37:37Z
source last accessed on: 2015-03-30T23:37:37Z
definition: Corporate closed-ended investment entities identified under distinguishing legislation, such as investment trusts and venture capital trusts.
notation: 8985
valid from: 2005-01-01
valid till: 2007-03-01

Nonequity Investment Instruments
type: IndustryClassificationBenchmarkClassifier
type: SectorClassifier
type: NamedIndividual
is contemporary version of: http://data.ga-group.nl/ics/icb/8990
is replaced by: http://data.ga-group.nl/ics/icb/2007/8990
is version of: http://data.ga-group.nl/ics/icb/8990
is sector of: Financial Services
imported on: 2026-06-01T03:03:54.132Z
last refreshed on: 2026-06-01T10:28:56.931Z
source accessed on: 2015-03-30T23:37:37Z
source last accessed on: 2015-03-30T23:37:37Z
notation: 8990
valid from: 2005-01-01
valid till: 2007-03-01

Nonequity Investment Instruments
type: IndustryClassificationBenchmarkClassifier
type: SubsectorClassifier
type: NamedIndividual
is contemporary version of: http://data.ga-group.nl/ics/icb/8995
is replaced by: http://data.ga-group.nl/ics/icb/2007/8995
is version of: http://data.ga-group.nl/ics/icb/8995
is subsector of: Nonequity Investment Instruments
imported on: 2026-06-01T03:03:54.132Z
last refreshed on: 2026-06-01T10:28:56.931Z
source accessed on: 2015-03-30T23:37:37Z
source last accessed on: 2015-03-30T23:37:37Z
definition: Noncorporate, open-ended investment instruments such as open-ended investment companies and funds, unit trusts, ETFs, currency funds and split capital trusts.
notation: 8995
valid from: 2005-01-01
valid till: 2007-03-01

Technology
type: IndustryClassificationBenchmarkClassifier
type: IndustryClassifier
type: NamedIndividual
is contemporary version of: http://data.ga-group.nl/ics/icb/9000
is replaced by: http://data.ga-group.nl/ics/icb/2007/9000
is version of: http://data.ga-group.nl/ics/icb/9000
imported on: 2026-06-01T03:03:54.132Z
last refreshed on: 2026-06-01T10:28:56.931Z
source accessed on: 2015-03-30T23:37:37Z
source last accessed on: 2015-03-30T23:37:37Z
notation: 9000
valid from: 2005-01-01
valid till: 2007-03-01

Technology
type: IndustryClassificationBenchmarkClassifier
type: SupersectorClassifier
type: NamedIndividual
is contemporary version of: http://data.ga-group.nl/ics/icb/9500
is replaced by: http://data.ga-group.nl/ics/icb/2007/9500
is version of: http://data.ga-group.nl/ics/icb/9500
is supersector of: Technology
imported on: 2026-06-01T03:03:54.132Z
last refreshed on: 2026-06-01T10:28:56.931Z
source accessed on: 2015-03-30T23:37:37Z
source last accessed on: 2015-03-30T23:37:37Z
notation: 9500
valid from: 2005-01-01
valid till: 2007-03-01

Software & Computer Services
type: IndustryClassificationBenchmarkClassifier
type: SectorClassifier
type: NamedIndividual
is contemporary version of: http://data.ga-group.nl/ics/icb/9530
is replaced by: http://data.ga-group.nl/ics/icb/2007/9530
is version of: http://data.ga-group.nl/ics/icb/9530
is sector of: Technology
imported on: 2026-06-01T03:03:54.132Z
last refreshed on: 2026-06-01T10:28:56.931Z
source accessed on: 2015-03-30T23:37:37Z
source last accessed on: 2015-03-30T23:37:37Z
notation: 9530
valid from: 2005-01-01
valid till: 2007-03-01

Computer Services
type: IndustryClassificationBenchmarkClassifier
type: SubsectorClassifier
type: NamedIndividual
is contemporary version of: http://data.ga-group.nl/ics/icb/9533
is replaced by: http://data.ga-group.nl/ics/icb/2007/9533
is version of: http://data.ga-group.nl/ics/icb/9533
is subsector of: Software & Computer Services
imported on: 2026-06-01T03:03:54.132Z
last refreshed on: 2026-06-01T10:28:56.931Z
source accessed on: 2015-03-30T23:37:37Z
source last accessed on: 2015-03-30T23:37:37Z
definition: Companies that provide consulting services to other businesses relating to information technology. Includes providers of computer-system design, systems integration, network and systems operations, data management and storage, repair services and technical support.
notation: 9533
valid from: 2005-01-01
valid till: 2007-03-01

Internet
type: IndustryClassificationBenchmarkClassifier
type: SubsectorClassifier
type: NamedIndividual
is contemporary version of: http://data.ga-group.nl/ics/icb/9535
is replaced by: http://data.ga-group.nl/ics/icb/2007/9535
is version of: http://data.ga-group.nl/ics/icb/9535
is subsector of: Software & Computer Services
imported on: 2026-06-01T03:03:54.132Z
last refreshed on: 2026-06-01T10:28:56.931Z
source accessed on: 2015-03-30T23:37:37Z
source last accessed on: 2015-03-30T23:37:37Z
definition: Companies providing Internet-related services, such as Internet access providers and search engines and providers of Web site design, Web hosting, domain-name registration and e-mail services.
notation: 9535
valid from: 2005-01-01
valid till: 2007-03-01

Software
type: IndustryClassificationBenchmarkClassifier
type: SubsectorClassifier
type: NamedIndividual
is contemporary version of: http://data.ga-group.nl/ics/icb/9537
is replaced by: http://data.ga-group.nl/ics/icb/2007/9537
is version of: http://data.ga-group.nl/ics/icb/9537
is subsector of: Software & Computer Services
imported on: 2026-06-01T03:03:54.132Z
last refreshed on: 2026-06-01T10:28:56.931Z
source accessed on: 2015-03-30T23:37:37Z
source last accessed on: 2015-03-30T23:37:37Z
definition: Publishers and distributors of computer software for home or corporate use. Excludes computer game producers, which are classified under Toys.
notation: 9537
valid from: 2005-01-01
valid till: 2007-03-01

Technology Hardware & Equipment
type: IndustryClassificationBenchmarkClassifier
type: SectorClassifier
type: NamedIndividual
is contemporary version of: http://data.ga-group.nl/ics/icb/9570
is replaced by: http://data.ga-group.nl/ics/icb/2007/9570
is version of: http://data.ga-group.nl/ics/icb/9570
is sector of: Technology
imported on: 2026-06-01T03:03:54.132Z
last refreshed on: 2026-06-01T10:28:56.931Z
source accessed on: 2015-03-30T23:37:37Z
source last accessed on: 2015-03-30T23:37:37Z
notation: 9570
valid from: 2005-01-01
valid till: 2007-03-01

Computer Hardware
type: IndustryClassificationBenchmarkClassifier
type: SubsectorClassifier
type: NamedIndividual
is contemporary version of: http://data.ga-group.nl/ics/icb/9572
is replaced by: http://data.ga-group.nl/ics/icb/2007/9572
is version of: http://data.ga-group.nl/ics/icb/9572
is subsector of: Technology Hardware & Equipment
imported on: 2026-06-01T03:03:54.132Z
last refreshed on: 2026-06-01T10:28:56.931Z
source accessed on: 2015-03-30T23:37:37Z
source last accessed on: 2015-03-30T23:37:37Z
definition: Manufacturers and distributors of computers, servers, mainframes, workstations and other computer hardware and subsystems, such as mass-storage drives, mice, keyboards and printers.
notation: 9572
valid from: 2005-01-01
valid till: 2007-03-01

Electronic Office Equipment
type: IndustryClassificationBenchmarkClassifier
type: SubsectorClassifier
type: NamedIndividual
is contemporary version of: http://data.ga-group.nl/ics/icb/9574
is replaced by: http://data.ga-group.nl/ics/icb/2007/9574
is version of: http://data.ga-group.nl/ics/icb/9574
is subsector of: Technology Hardware & Equipment
imported on: 2026-06-01T03:03:54.132Z
last refreshed on: 2026-06-01T10:28:56.931Z
source accessed on: 2015-03-30T23:37:37Z
source last accessed on: 2015-03-30T23:37:37Z
definition: Manufacturers and distributors of electronic office equipment, including photocopiers and fax machines.
notation: 9574
valid from: 2005-01-01
valid till: 2007-03-01

Semiconductors
type: IndustryClassificationBenchmarkClassifier
type: SubsectorClassifier
type: NamedIndividual
is contemporary version of: http://data.ga-group.nl/ics/icb/9576
is replaced by: http://data.ga-group.nl/ics/icb/2007/9576
is version of: http://data.ga-group.nl/ics/icb/9576
is subsector of: Technology Hardware & Equipment
imported on: 2026-06-01T03:03:54.132Z
last refreshed on: 2026-06-01T10:28:56.931Z
source accessed on: 2015-03-30T23:37:37Z
source last accessed on: 2015-03-30T23:37:37Z
definition: Producers and distributors of semiconductors and other integrated chips, including other products related to the semiconductor industry, such as semiconductor capital equipment and motherboards. Excludes makers of printed circuit boards, which are classified under Electrical Components & Equipment.
notation: 9576
valid from: 2005-01-01
valid till: 2007-03-01

Telecommunications Equipment
type: IndustryClassificationBenchmarkClassifier
type: SubsectorClassifier
type: NamedIndividual
is contemporary version of: http://data.ga-group.nl/ics/icb/9578
is replaced by: http://data.ga-group.nl/ics/icb/2007/9578
is version of: http://data.ga-group.nl/ics/icb/9578
is subsector of: Technology Hardware & Equipment
imported on: 2026-06-01T03:03:54.132Z
last refreshed on: 2026-06-01T10:28:56.931Z
source accessed on: 2015-03-30T23:37:37Z
source last accessed on: 2015-03-30T23:37:37Z
definition: Makers and distributors of high-technology communication products, including satellites, mobile telephones, fiber optics, switching devices, local and wide-area networks, teleconferencing equipment and connectivity devices for computers, including hubs and routers.
notation: 9578
valid from: 2005-01-01
valid till: 2007-03-01