gics 2016 individuals
type: Ontology
download URL: http://data.ga-group.nl/ics/gics2016.ttl
abstract: This ontology includes individuals representing the set of classification codes based on the principal business activity of the company. This set of classification codes is valid from 2016-09-01 till 2018-09-29. @en
creator: https://orcid.org/0000-0002-7352-2825
description: The Global Industry Classification Standard (GICS) is an industry taxonomy developed in 1999 by MSCI and Standard & Poor's (S&P) for use by the global financial community. Codes are four-tiered, numeric, and not prefix-free. The first tier is the sector, the second tier is the industry group, the third tier is the industry, and the fourth tier is the sub-industry. S&P is responsible for assigning a GICS code to all major public companies. The assignment is based on the principal busines activity of the company. @en
format: text/turtle
issued: 2026-05-24T02:25:19Z
language: en
license: https://creativecommons.org/licenses/by-sa/4.0/
modified: 2026-05-24T02:25:19Z
publisher: https://orcid.org/0000-0002-7352-2825
replaces: http://data.ga-group.nl/ics/gics/2014/
has maturity level: Release
imports: SecuritiesClassification
imports: ics
version info: 2016
content language: owl2-quick-reference
label: gics 2016 @en
contributor: PAMIYA Strategic Advisors GmbH
copyright: Copyright (c) 1999 S&P Dow Jones Indices LLC
copyright: Copyright (c) 1999 MSCI Inc.
copyright: Copyright (c) 2019-2026 PAMIYA Strategic Advisors GmbH
filename: gics2016.ttl
valid from: 2016-09-01
valid till: 2018-09-29
preferred namespace prefix: gics2016

石油与天然气钻井
type: GlobalIndustryClassificationStandardsClassifier
type: SubindustryClassifier
type: NamedIndividual
is contemporary version of: http://data.ga-group.nl/ics/gics/10101010
is replaced by: http://data.ga-group.nl/ics/gics/2018/10101010
is version of: http://data.ga-group.nl/ics/gics/10101010
replaces: http://data.ga-group.nl/ics/gics/2014/10101010
is subindustry of: 能源設備與服務
imported on: 2026-05-27T08:45:00.430Z
last refreshed on: 2026-05-31T09:56:29.350Z
source accessed on: 2017-10-19T03:34:33Z
source last accessed on: 2019-06-07T09:41:30Z
label: Erdöl- & Erdgasförderung @de
label: Forage gazier et pétrolier @fr
label: Oil & Gas Drilling @en
label: Perforación de Pozos Petrolíferos y Gasíferos @es
label: Perfuração de Petróleo e Gás @pt
label: Trivellazione di petrolio e gas @it
label: Бурение нефтяных и газовых скважин @ru
label: 石油・ガス掘削 @ja
label: 石油與天然氣鑽井
label: 석유와 가스 시추 @ko
definition: Anbieter von Bohrdiensten oder Eigentümer von Ölförder- und -bohrausrüstungen, die ihre Bohrdienste anbieten. @de
definition: Contratistas de perforación o propietarios de torres de perforación que contratan sus servicios para perforar pozos. @es
definition: Drilling contractors or owners of drilling rigs that contract their services for drilling wells @en
definition: Empresas de perfuração ou proprietários de aparelhos de perfuração que contratam seus serviços para a perfuração de poços. @pt
definition: Entrepreneurs de forage ou propriétaires d'appareils de forage qui offrent leurs services pour les puits de forage @fr
definition: Società appaltatrici di opere di trivellazione o proprietarie di impianti di trivellazione che si occupano di perforazione di pozzi. @it
definition: Буровые подрядные фирмы или владельцы буровых установок, предоставляющие услуги по бурению скважин @ru
definition: 承包鑽井服務的鑽井承包商或擁有鑽機的公司。
definition: 承包钻井服务的钻井承包商或拥有钻机的公司。
definition: 掘削請負会社、または掘削装置を所有しており油田掘削サービスを請け負う業者。 @ja
definition: 유정 시추를 위해 서비스 계약을 체결한 시추 계약업자 또는 시추 장치 소유자 @ko
notation: 10101010
valid from: 2016-09-01
valid till: 2018-09-29

石油天然气设备与服务
type: GlobalIndustryClassificationStandardsClassifier
type: SubindustryClassifier
type: NamedIndividual
is contemporary version of: http://data.ga-group.nl/ics/gics/10101020
is replaced by: http://data.ga-group.nl/ics/gics/2018/10101020
is version of: http://data.ga-group.nl/ics/gics/10101020
replaces: http://data.ga-group.nl/ics/gics/2014/10101020
is subindustry of: 能源設備與服務
imported on: 2026-05-27T08:45:00.430Z
last refreshed on: 2026-05-31T09:56:29.350Z
source accessed on: 2017-10-19T03:34:33Z
source last accessed on: 2019-06-07T09:41:30Z
label: Equipamento e Serviços de Petróleo e Gás @pt
label: Equipos y Servicios Relacionados con el Petróleo y Gas @es
label: Erdöl & Erdgas: Ausrüstung und Dienste @de
label: Impianti e servizi nel settore Petrolio e gas @it
label: Oil & Gas Equipment & Services @en
label: Équipements et Services liés au Pétrole et au Gaz @fr
label: Производство оборудования для нефтегазовой отрасли и услуги по его использованию @ru
label: 石油・ガス装置・サービス @ja
label: 石油天然氣設備與服務
label: 석유와 가스 장비 및 서비스 @ko
definition: Fabricantes de equipamento, incluindo sondas e equipamento de perfuração e fornecedores de suprimentos e serviços para empresas envolvidas na perfuração, avaliação e completação de poços de petróleo e gás. @pt
definition: Fabricantes de equipos, como torres y equipos de perforación, proveedores de suministros y servicios para empresas dedicadas a la perforación, evaluación y explotación de pozos petrolíferos y gasíferos. @es
definition: Fabricants d'équipement, y compris les appareils et l'équipement de forage, et fournisseurs de produits et de services aux entreprises actives dans le forage, l'évaluation et la réalisation de puits gaziers et pétroliers. @fr
definition: Hersteller von Ausrüstungsgegenständen, darunter Ölförder- und Bohrausrüstungen, und Anbieter von Diensten und Ausrüstung für Unternehmen, die mit dem Bohren, Bewerten und Fertigstellen von Erdöl- und Erdgasbohrungen beschäftigt sind. @de
definition: Manufacturers of equipment, including drilling rigs and equipment, and providers of supplies and services to companies involved in the drilling, evaluation and completion of oil and gas wells. @en
definition: Società produttrici di attrezzature, compresi gli impianti e le attrezzature di trivellazione, fornitrici di impianti e servizi per aziende che si occupano di trivellazione, valutazione e completamento di pozzi petroliferi e di gas. @it
definition: Производители оборудования, в том числе буровых установок и оборудования; поставщики материалов и услуг компаниям, занятым в бурении, оценке и окончательном обустройстве нефтяных и газовых скважин. @ru
definition: 包括鑽機及鑽井設備在內的設備製造商，以及向那些涉及石油與天然氣井的鑽探、評估和完井的公司提供用品和服務的公司。
definition: 包括钻机及钻井设备在内的设备制造商，以及向那些涉及石油与天然气井的钻探、评估和完井的公司提供用品和服务的公司。
definition: 掘削装置・設備を含む装置製造会社、および、石油・ガス油田の掘削、油層評価、仕上げを行う会社に用品やサービスを提供する会社。 @ja
definition: 시추 장치 및 장비를 포함한 장비 제조업체, 그리고 석유와 가스 유정의 시추, 평가, 생산준비와 관련된 기업들에게 공급품과 서비스를 제공하는 업체 @ko
notation: 10101020
valid from: 2016-09-01
valid till: 2018-09-29

能源設備與服務
type: GlobalIndustryClassificationStandardsClassifier
type: IndustryClassifier
type: NamedIndividual
is contemporary version of: http://data.ga-group.nl/ics/gics/101010
is replaced by: http://data.ga-group.nl/ics/gics/2018/101010
is version of: http://data.ga-group.nl/ics/gics/101010
replaces: http://data.ga-group.nl/ics/gics/2014/101010
is industry of: 能源
imported on: 2026-05-27T08:45:00.430Z
last refreshed on: 2026-05-31T09:56:29.350Z
source accessed on: 2017-10-19T03:34:33Z
source last accessed on: 2019-06-07T09:41:30Z
label: Energiezubehör und -dienste @de
label: Energy Equipment & Services @en
label: Equipamento e Serviços de Energia @pt
label: Equipos y Servicios de Energía @es
label: Impianti e servizi nel settore energetico @it
label: Équipements et Services dédiés à l’Énergie @fr
label: Производство энергетического оборудования и услуги по его исп��льзованию @ru
label: エネルギー設備・サービス @ja
label: 能源设备与服务
label: 에너지 장비 및 서비스 @ko
notation: 101010
valid from: 2016-09-01
valid till: 2018-09-29

綜合性石油與天然氣企業
type: GlobalIndustryClassificationStandardsClassifier
type: SubindustryClassifier
type: NamedIndividual
is contemporary version of: http://data.ga-group.nl/ics/gics/10102010
is replaced by: http://data.ga-group.nl/ics/gics/2018/10102010
is version of: http://data.ga-group.nl/ics/gics/10102010
replaces: http://data.ga-group.nl/ics/gics/2014/10102010
is subindustry of: 石油、天然气与消费用燃料
imported on: 2026-05-27T08:45:00.430Z
last refreshed on: 2026-05-31T09:56:29.350Z
source accessed on: 2017-10-19T03:34:33Z
source last accessed on: 2019-06-07T09:41:30Z
label: Gaz et Pétrole intégrés @fr
label: Integrated Oil & Gas @en
label: Integrierte Erdöl- und Erdgasbetriebe @de
label: Petróleo e Gás Integrados @pt
label: Petróleo y Gas Integrados @es
label: Società integrate nel settore Petrolio e gas @it
label: Интегрированные нефтяные и газовые компании @ru
label: 総合石油・ガス @ja
label: 综合性石油与天然气企业
label: 종합 석유 및 가스 @ko
definition: Compagnies pétrolières intégrées spécialisées dans l'exploration et la production de pétrole et de gaz, ainsi que dans au moins une autre activité importante suivante : raffinage, commercialisation et transport, ou produits chimiques. @fr
definition: Empresas petrolíferas integradas que se dedicam à exploração e produção de petróleo e gás, assim como pelo menos uma outra atividade significativa nas áreas de refino, comercialização e transporte, ou produtos químicos. @pt
definition: Empresas petroleras integradas dedicadas a la exploración y producción de petróleo y gas, asi como alguna otra actividad importante relacionada con el refinado, comercialización y transporte, o productos químicos. @es
definition: Integrated oil companies engaged in the exploration & production of oil and gas, as well as at least one other significant activity in either refining, marketing and transportation, or chemicals. @en
definition: Integrierte Erdöl- und Erdgasunternehmen, die in der Exploration und Produktion von Erdöl- und Erdgasprodukten sowie in mindestens einer der bedeutenden Branchen Raffinierung, Vermarktung und Transport oder Chemikalien tätig sind. @de
definition: Società petrolifere integrate che si occupano di esplorazione e produzione di petrolio e gas, con un'attività significativa o nella raffineria, marketing e nel trasporto, oppure in prodotti chimici. @it
definition: Интегрированные нефтяные компании, занятые разведкой и добычей нефти и газа, а также не менее чем одним из других основных видов деятельности по переработке, сбыту и транспортировке нефти, газа или химической продукции. @ru
definition: 从事石油及天然气勘探与生产，并且至少在以下某一领域有大量业务：炼制、营销、运输或者石油化工的综合性石油公司。
definition: 從事石油及天然氣勘探與生產，並且至少在以下某一領域有大量業務：煉製、行銷、運輸或者石油化工的綜合性石油公司。
definition: 石油・ガスの探査・開発を行い、精製・販売・輸送・化学品製造のいずれか少なくとも一分野において顕著な活動が見られる総合石油会社。 @ja
definition: 석유와 가스의 탐사 및 생산과 관련된 종합 석유 회사로서, 정유, 마케팅, 수송, 화학 중 최소한 한 가지의 다른 주요 활동을 하는 기업. @ko
notation: 10102010
valid from: 2016-09-01
valid till: 2018-09-29

石油与天然气的勘探与生产
type: GlobalIndustryClassificationStandardsClassifier
type: SubindustryClassifier
type: NamedIndividual
is contemporary version of: http://data.ga-group.nl/ics/gics/10102020
is replaced by: http://data.ga-group.nl/ics/gics/2018/10102020
is version of: http://data.ga-group.nl/ics/gics/10102020
replaces: http://data.ga-group.nl/ics/gics/2014/10102020
is subindustry of: 石油、天然气与消费用燃料
imported on: 2026-05-27T08:45:00.430Z
last refreshed on: 2026-05-31T09:56:29.350Z
source accessed on: 2017-10-19T03:34:33Z
source last accessed on: 2019-06-07T09:41:30Z
label: Erdöl & Erdgas: Exploration & Produktion @de
label: Esplorazione e produzione di petrolio e gas @it
label: Exploração e Produção de Petróleo e Gás @pt
label: Exploration et Production de Pétrole et de Gaz @fr
label: Oil & Gas Exploration & Production @en
label: Producción y Exploración de Petróleo y Gas @es
label: Разведка и добыча нефти и газа @ru
label: 石油・ガス探査・開発 @ja
label: 石油與天然氣的勘探及生産
label: 석유와 가스 탐사 및 생산 @ko
definition: Companies engaged in the exploration and production of oil and gas not classified elsewhere. @en
definition: Empresas dedicadas a la exploración y producción de petróleo y gas no incluidas en otra clasificación. @es
definition: Empresas envolvidas na exploração e produção de petróleo e gás não classificadas em nenhum outro lugar. @pt
definition: Sociétés spécialisées dans l'exploration et la production de pétrole et de gaz n'appartenant à aucune autre classification. @fr
definition: Società che operano nella esplorazione e produzione di petrolio e gas non classificate altrove. @it
definition: Unternehmen, die in der Exploration und Produktion von Erdöl und Erdgas tätig sind und nicht einer der übrigen Branchen angehören. @de
definition: Компании, занятые разведкой и добычей нефти и газа и не включенные в другие группы. @ru
definition: 从事石油及天然气勘探与生产（未归类于别处）的公司。
definition: 他のグループに分類されていない石油・ガスの探査・開発を行う会社。 @ja
definition: 從事石油及天然氣勘探與生產（未歸類於別處）的公司。
definition: 다른 부문으로 분류되지 않은 석유와 가스의 탐사 및 생산 관련 기업 @ko
notation: 10102020
valid from: 2016-09-01
valid till: 2018-09-29

石油与天然气的炼制和营销
type: GlobalIndustryClassificationStandardsClassifier
type: SubindustryClassifier
type: NamedIndividual
is contemporary version of: http://data.ga-group.nl/ics/gics/10102030
is replaced by: http://data.ga-group.nl/ics/gics/2018/10102030
is version of: http://data.ga-group.nl/ics/gics/10102030
replaces: http://data.ga-group.nl/ics/gics/2014/10102030
is subindustry of: 石油、天然气与消费用燃料
imported on: 2026-05-27T08:45:00.430Z
last refreshed on: 2026-05-31T09:56:29.350Z
source accessed on: 2017-10-19T03:34:33Z
source last accessed on: 2019-06-07T09:41:30Z
label: Erdöl & Erdgas: Raffinierung & Vermarktung @de
label: Oil & Gas Refining & Marketing @en
label: Raffinage et Commercialisation de Pétrole et de Gaz @fr
label: Raffinazione e commercializzazione petrolio e gas @it
label: Refinado y Marketing de Petróleo y Gas @es
label: Refinamento e Comercialização de Petróleo e Gás @pt
label: Переработка и сбыт нефти и газа @ru
label: 石油・ガス精製・販売 @ja
label: 石油與天然氣的煉製及營銷
label: 석유와 가스 정제 및 마케팅 @ko
definition: Companies engaged in the refining and marketing of oil, gas and/or refined products not classified in the Integrated Oil & Gas or Independent Power Producers & Energy Traders Sub-Industries. @en
definition: Empresas dedicadas al refinado y mercadeo de petróleo y gas, asi como de productos refinados no clasificados en las subindustrias de petróleo y gas integrados o de los Productores de electricidad y operadores de energía independientes. @es
definition: Empresas envolvidas no refino e comercialização de petróleo, gás e/ou produtos refinados não classificados nas Sub-Indústrias de Petróleo e Gás Integrados ou de Produtores Independentes de Energia e de Comerciantes de Energia. @pt
definition: Sociétés spécialisées dans le raffinage et la commercialisation de produits pétroliers, de gaz et/ou de produits raffinés et non-classées dans les sous-industries des Compagnies Gazières et Pétrolières Intégrées, ou des Producteurs Indépendants d’Électricité et du Commerce d'Énergie. @fr
definition: Società che si occupano della raffinazione e della commercializzazione di petrolio, gas e/o prodotti derivati dalla raffinazione del petrolio non classificate come Società integrate nel settore petrolio e gas o Produttori indipendenti di energia e commercializzazione energia. @it
definition: Unternehmen, die sich mit Raffinieren, Marketing von Öl, Gas und/oder Raffinadeprodukten beschäftigen und die nicht der integrierten Branche Öl- und Gas oder Unabhängige Energiehersteller und Energieverteiler angehören. @de
definition: Компании, занятые переработкой и сбытом нефти, газа и (или) нефтегазопродуктов, не включенные в подотрасли «Интегрированные нефтяные и газовые компании» или «Независимые компании по производству и сбыту энергии». @ru
definition: 从事石油、天然气和/或炼制产品的炼制和营销（未归类于“综合性石油与天然气企业”或者“独立电力生产商与能源贸易商”子行业）的公司。
definition: 從事石油、天然氣和/或煉製產品的煉製和行銷（未歸類於“綜合性石油與天然氣企業”或者“獨立電力生產商與能源貿易商”子行業）的公司。
definition: 石油・ガスおよび精製品の精製、販売を行う会社で、産業サブグループの「総合石油・ガス」または「独立系発電事業者・エネルギー販売業者」に分類されていない会社。 @ja
definition: 종합 석유 및 가스' 또는 '독립 전력 생산업체 & 에너지 거래업체'로 분류되지 않은 석유, 가스 및/또는 정유 제품의 정유 및 마케팅과 관련된 회사. @ko
notation: 10102030
valid from: 2016-09-01
valid till: 2018-09-29

石油与天然气的储存和运输
type: GlobalIndustryClassificationStandardsClassifier
type: SubindustryClassifier
type: NamedIndividual
is contemporary version of: http://data.ga-group.nl/ics/gics/10102040
is replaced by: http://data.ga-group.nl/ics/gics/2018/10102040
is version of: http://data.ga-group.nl/ics/gics/10102040
replaces: http://data.ga-group.nl/ics/gics/2014/10102040
is subindustry of: 石油、天然气与消费用燃料
imported on: 2026-05-27T08:45:00.430Z
last refreshed on: 2026-05-31T09:56:29.350Z
source accessed on: 2017-10-19T03:34:33Z
source last accessed on: 2019-06-07T09:41:30Z
label: Almacenado y Transporte de Petróleo y Gas @es
label: Armazenagem e Transporte de Petróleo e Gás @pt
label: Erdöl & Erdgas: Lagerung & Transport @de
label: Oil & Gas Storage & Transportation @en
label: Stoccaggio e trasporto petrolio e gas @it
label: Stockage et Transport de Pétrole et de Gaz @fr
label: Хранение и транспортировка нефти и газа @ru
label: 石油與天然氣的儲存及運輸
label: 石油���ガス貯蔵・輸送 @ja
label: 석유와 가스 저장 및 수송 @ko
definition: Companies engaged in the storage and/or transportation of oil, gas and/or refined products. Includes diversified midstream natural gas companies facing competitive markets, oil and refined product pipelines, coal slurry pipelines and oil & gas shipping companies. @en
definition: Empresas dedicadas al almacenamiento y/o transporte de petróleo, gas o productos refinados. Se incluyen empresas distribuidoras de gas natural diversificadas que deben hacer frente a mercados competitivos, a oleoductos y conductos para productos refinados, conductos para transporte de carbón y empresas de distribución de gas y petróleo. @es
definition: Empresas envolvidas na armazenagem e/ou transporte de petróleo, gás e/ou produtos refinados. Inclui empresas de gás natural de médio porte e diversificadas, que enfrentam mercados competitivos, oleodutos de petróleo e de produtos refinados, oleodutos de carvão liquefeito e companhias de embarque de petróleo e gás. @pt
definition: Sociétés spécialisées dans le stockage et/ou le transport des produits pétroliers, de gaz et/ou de produits raffinés. Sont incluses les compagnies de gaz naturel diversifiées du secteur médian qui font face aux marchés concurrentiels, les conduites d’acheminement des produits pétroliers et des produits raffinés, les conduites d’acheminement des boues de charbon, et les entreprises de transport de pétrole et de gaz. @fr
definition: Società che si occupano dello stoccaggio e del trasporto di petrolio, gas e/o prodotti derivati dalla raffinazione del petrolio. Sono comprese società medie diversificate che si occupano di gas naturali e che sono presenti in mercati competitivi, oleodotti o condotti di prodotti raffinati e di carbone bitumoso e società di trasporto di petrolio e gas. @it
definition: Unternehmen, die sich mit der Lagerung und/oder dem Transport von Erdöl, Erdgas und/oder Raffinadeprodukten beschäftigen. Eingeschlossen sind auch diversifizierte mittelständische Erdgasunternehmen, die mit Konkurrenzmärkten, Pipelines für Erdöl und Raffinadeprodukte, Pipelines für Kohlenschlamm und Spediteuren für Erdöl & Erdgas konfrontiert sind. @de
definition: Компании, занятые хранением и (или) транспортировкой нефти, газа и (или) продуктов их переработки. В данную группу включены диверсифицированные компании, эксплуатирую��ие трубопроводы и работающие на рынках с высоким уровнем конкуренции, нефтепроводы и нефтепродуктопроводы, пульпопроводы, а также нефте- и газотранспортные компании. @ru
definition: 从事石油、天然气和/或炼制产品储存和运输的公司。包括那些面对竞争市场经营中游业务的多元化天然气公司、石油和炼制产品管道公司、煤泥管道公司以及石油与天然气运输公司。
definition: 從事石油、天然氣和/或煉製產品儲存和運輸的公司。包括那些面對競爭市場經營中游業務的多元化天然氣公司、石油和煉製產品管道公司、煤泥管道公司以及石油與天然氣運輸公司。
definition: 石油・ガスおよび精製品の貯蔵および輸送を行う会社。競争市場に直面している各種中流（ミッドストリーム）天然ガス供給会社、石油および精製品のパイプライン、石炭スラリーパイプライン、石油・ガス輸送会社を含む。 @ja
definition: 석유, 가스 및/또는 정유 제품의 저장 및/또는 수송과 관련된 회사. 시장 경쟁이 치열한 다각화된 중간단계 천연 가스 회사, 석유 및 정유 제품 수송관 회사, 석탄 슬러리 수송��� 회사, 석유 및 가스 선적 회사를 포함. @ko
notation: 10102040
valid from: 2016-09-01
valid till: 2018-09-29

煤與消費用燃料
type: GlobalIndustryClassificationStandardsClassifier
type: SubindustryClassifier
type: NamedIndividual
is contemporary version of: http://data.ga-group.nl/ics/gics/10102050
is replaced by: http://data.ga-group.nl/ics/gics/2018/10102050
is version of: http://data.ga-group.nl/ics/gics/10102050
replaces: http://data.ga-group.nl/ics/gics/2014/10102050
is subindustry of: 石油、天然气与消费用燃料
imported on: 2026-05-27T08:45:00.430Z
last refreshed on: 2026-05-31T09:56:29.350Z
source accessed on: 2017-10-19T03:34:33Z
source last accessed on: 2019-06-07T09:41:30Z
label: Carbón y Carburantes Combustibles @es
label: Carbone e carburanti di consumo @it
label: Carvão e Combustíveis de Consumo @pt
label: Charbon et Combustibles @fr
label: Coal & Consumable Fuels @en
label: Kohle & Nicht erneuerbare Brennstoffe @de
label: Добыча угля и потребляемого топлива @ru
label: 石炭・消耗燃料 @ja
label: 석탄 및 소모 연료 @ko
label: ��与消费用燃料
definition: Companies primarily involved in the production and mining of coal, related products and other consumable fuels related to the generation of energy. Excludes companies primarily producing gases classified in the Industrial Gases sub-industry and companies primarily mining for metallurgical (coking) coal used for steel production. @en
definition: Empresas dedicadas principalmente a la producción y extracción de carbón, de productos relacionados y de otros combustibles de consumo relacionados con la generación de energía. Quedan excluidas las empresas que producen principalmente gases clasificados en la Sub-Industria de Gases Industriales y empresas mineras dedicadas principalmente a la producción metalurgica de carbón utilizado para la producción de acero. @es
definition: Empresas envolvidas principalmente na produção e mineração de carvão, produtos relacionados e outros combustíveis de consumo relacionados à geração de energia. Exclui empresas que produzam principalmente gases classificados na sub-indústria de Gases Industriais e empresas de mineração principalmente de carvão metalúrgico (coque), utilizado na produção de aço. @pt
definition: Sociétés qui font partie principalement de la production et l'exploitation de charbon, de produits connexes, et d'autres combustibles liés à la génération d'énergie. Ne sont pas incluses les sociétés qui produisent principalement des gaz et qui sont classées dans la sous-industrie des Gaz Industriels et les sociétés qui exploitent principalement le charbon métallurgique (cokéfaction) utilisé dans la production d’acier. @fr
definition: Società che si occupano principalmente della produzione e dell'estrazione di carbone, prodotti collegati e altri carburanti di consumo collegati alla produzione di energia. Sono escluse le società che si occupano principalmente di gas classificati come Gas industriali e quelle che si occupano dell' estrazione di carbone metallurgico (coking) utilizzato per la produzione di acciaio. @it
definition: Unternehmen, die sich hauptsächlich mit der Herstellung und dem Abbau von Kohle, verwandten Produkten und anderen nicht erneuerbaren Brennstoffen zur Energieerzeugung beschäftigen. Ausgeschlossen sind Unternehmen, die hauptsächlich Gase herstellen, die der Branche Industriegase angehören und die Unternehmen, die hauptsächlich Hochofenkoks für Stahlproduction abbauen. @de
definition: Компании, занятые в основном производством и добычей угля, сопутствующих продуктов и других видов потребляемого топлива, связанного с генерированием электроэнергии. Данная группа не включает компании, занятые в основном производством газов, включенные в подотрасль «Промышленные газы» и компании, занимающиеся добычей металл��ргического (коксующегося) угля, используемого для производства стали. @ru
definition: 主要从事生产与开采煤、相关产品以及其它与能源生产相关的供消费用燃料的公司。不包括那些归类于“工业气体”子行业中主要从事生产工业气体的公司以及主要从事开采使用在钢铁生产的冶金焦煤。
definition: 主要從事生產與開採煤、相關產品以及其他與能源生產相關的供消費用燃料的公司。不包括那些歸類於“工業氣體”子行業中主要從事生產工業氣體的公司以及主要從事開採使用在鋼鐵生產的冶金焦煤。
definition: 石炭、関連製品、およびエネルギー生成に関連するその他消耗燃料の開発や採掘を主に行う会社。産業サブグループの「工業用ガス」に分類される、主にガスを製造する会社及び鉄鋼生産用の冶金石炭の採掘会社は除く。 @ja
definition: 석탄 채굴 및 생산, 관련 상품, 에너지 생성과 관련된 기타 소비재연료를 주로 취급하는 기업. '산업용 가스'로 분류되는 가스를 주로 생산하는 기업 및 철강 생산에 사용되는 코크스용 석탄을 주로 채굴하는 기업을 제외. @ko
notation: 10102050
valid from: 2016-09-01
valid till: 2018-09-29

石油、天然气与消费用燃料
type: GlobalIndustryClassificationStandardsClassifier
type: IndustryClassifier
type: NamedIndividual
is contemporary version of: http://data.ga-group.nl/ics/gics/101020
is replaced by: http://data.ga-group.nl/ics/gics/2018/101020
is version of: http://data.ga-group.nl/ics/gics/101020
replaces: http://data.ga-group.nl/ics/gics/2014/101020
is industry of: 能源
imported on: 2026-05-27T08:45:00.430Z
last refreshed on: 2026-05-31T09:56:29.350Z
source accessed on: 2017-10-19T03:34:33Z
source last accessed on: 2019-06-07T09:41:30Z
label: Erdöl, Erdgas und nicht erneuerbare Brennstoffe @de
label: Oil, Gas & Consumable Fuels @en
label: Pétrole, Gaz et Combustibles @fr
label: Petróleo, Gás e Combustíveis de Consumo @pt
label: Petroleo, Gas y Combustibles @es
label: Petrolio, gas e carburanti di consumo @it
label: Добыча нефти, газа и потребляемого топлива @ru
label: 石油、天然氣與消費用燃料
label: 石油・ガス・消耗燃料 @ja
label: 석유, 가스, 소모 연료 @ko
notation: 101020
valid from: 2016-09-01
valid till: 2018-09-29

能源
type: GlobalIndustryClassificationStandardsClassifier
type: IndustryGroupClassifier
type: NamedIndividual
is contemporary version of: http://data.ga-group.nl/ics/gics/1010
is replaced by: http://data.ga-group.nl/ics/gics/2018/1010
is version of: http://data.ga-group.nl/ics/gics/1010
replaces: http://data.ga-group.nl/ics/gics/2014/1010
is industry group of: 能源
imported on: 2026-05-27T08:45:00.430Z
last refreshed on: 2026-05-31T09:56:29.350Z
source accessed on: 2017-10-19T03:34:33Z
source last accessed on: 2019-06-07T09:41:30Z
label: Energía @es
label: Energia @it
label: Energie @de
label: Energy @en
label: Énergie @fr
label: Энергетика @ru
label: エネルギー @ja
label: 에너지 @ko
notation: 1010
valid from: 2016-09-01
valid till: 2018-09-29

能源
type: GlobalIndustryClassificationStandardsClassifier
type: SectorClassifier
type: NamedIndividual
is contemporary version of: http://data.ga-group.nl/ics/gics/10
is replaced by: http://data.ga-group.nl/ics/gics/2018/10
is version of: http://data.ga-group.nl/ics/gics/10
replaces: http://data.ga-group.nl/ics/gics/2014/10
imported on: 2026-05-27T08:45:00.430Z
last refreshed on: 2026-05-31T09:56:29.350Z
source accessed on: 2017-10-19T03:34:33Z
source last accessed on: 2019-06-07T09:41:30Z
label: Energía @es
label: Energia @it
label: Energie @de
label: Energy @en
label: Énergie @fr
label: Энергетика @ru
label: エネルギー @ja
label: 에너지 @ko
notation: 10
valid from: 2016-09-01
valid till: 2018-09-29

商品化工
type: GlobalIndustryClassificationStandardsClassifier
type: SubindustryClassifier
type: NamedIndividual
is contemporary version of: http://data.ga-group.nl/ics/gics/15101010
is replaced by: http://data.ga-group.nl/ics/gics/2018/15101010
is version of: http://data.ga-group.nl/ics/gics/15101010
replaces: http://data.ga-group.nl/ics/gics/2014/15101010
is subindustry of: 化学制品
imported on: 2026-05-27T08:45:00.430Z
last refreshed on: 2026-05-31T09:56:29.350Z
source accessed on: 2017-10-19T03:34:33Z
source last accessed on: 2019-06-07T09:41:30Z
label: Commodity Chemicals @en
label: Grundchemikalien @de
label: Mercadorias Químicas @pt
label: Prodotti Chimici di Base @it
label: Productos Químicos Generales @es
label: Produits Chimiques de Base @fr
label: Производство основных химических веществ @ru
label: 基礎化学品 @ja
label: 범용 화학제품(Commodity Chemicals) @ko
definition: Companies that primarily produce industrial chemicals and basic chemicals. Including but not limited to plastics, synthetic fibers, films, commodity-based paints & pigments, explosives and petrochemicals. Excludes chemical companies classified in the Diversified Chemicals, Fertilizers & Agricultural Chemicals, Industrial Gases, or Specialty Chemicals Sub-Industries. @en
definition: Empresas dedicadas principalmente a la elaboración de productos químicos industriales y básicos. Se incluyen, entre otros, plásticos, fibras sintéticas, películas, pinturas y pigmentos, explosivos y productos petroquímicos. Se excluyen las empresas químicas incluidas en las ramas Productos Químicos Diversos, Fertilizantes y Agroquímicos, Gases Industriales o Productos Químicos Especializados. @es
definition: Empresas que produzem principalmente produtos químicos industriais e produtos químicos básicos. Incluindo mas não limitado a plásticos, fibras sintéticas, filmes, tintas e pigmentos baseados em produtos de base, explosivos e produtos petroquímicos. Exclui empresas químicas classificadas nas Sub-Indústrias de Químicos Diversificados, Fertilizantes e Produtos Químicos Agrícolas, Gases Industriais, ou Produtos Químicos Especializados. @pt
definition: Sociétés qui produisent principalement des produits chimiques industriels et des produits chimiques de base. Sont inclus, mais sans s’y limiter, les fabricants de plastiques, de fibres synthétiques, de films, de peintures et pigments à partir de produits de base, d'explosifs et de produits pétrochimiques. Ne sont pas incluses les sociétés classées dans les sous-industries des Gaz Industriels, des Produits Chimiques Spécialisés, des Engrais et Produits Chimiques Agricoles ou des Produits Chimiques Diversifiés. @fr
definition: Società che si occupano principalmente di prodotti chimici industriali e di base. Sono compresi, tra gli altri, materie plastiche, fibre sintetiche, pellicole, pitture e pigmenti d'uso comune, esplosivi e prodotti petrolchimici. Sono escluse le società produttrici di sostanze chimiche classificate come Prodotti chimici diversificati, Fertilizzanti e prodotti chimici per il mercato agricolo, Gas Industriali o Prodotti chimici speciali. @it
definition: Unternehmen, die hauptsächlich Industrie- und Basischemikalien herstellen. Dazu gehören Kunststoffe, synthetische Fasern, Filme, Farben und Pigmente, Sprengstoffe und Chemikalien auf Erdölbasis. Ausgeschlossen sind Chemieunternehmen, die den Branchen „Diverse Chemikalien“, „Düngemittel & landwirtschaftliche Chemikalien“ , „Industriegase“ oder „Spezialchemikalien“ angehören. @de
definition: Компании, занимающиеся в основном производством химических веществ промышленного назначения и основных химических веществ, в том числе пластических масс, синтетических волокон, пленок, красителей и пигментов из основных химических веществ, взрывчатых веществ и нефтехимической продукции. В данную группу не входят химические компании, включенные в подотрасли «Диверсифицированные химические компании», «Производст��о удобрений и химической продукции сельскохозяйственного назначения», «Производство промышленных газов» или «Производство химических веществ специального назначения». @ru
definition: 主に工業用化学薬品や基礎化学薬品を製造する会社。プラスチック、化学繊維、フィルム、商品別塗料・顔料、火薬類、石油化学製品等を含む。産業サブグループの「総合化学」、「肥料・農薬」、「��業用ガス」、「特殊化学品」に分類されている化学薬品会社は除く。 @ja
definition: 主要从事生产化工原料以及基本化工产品的公司。这些产品包括但不仅限于塑料、合成纤维、胶片、 日用涂料与颜料、爆炸物以及石油化工产品。不包括那些归类于“多种化学制品”、“化肥与农用药剂”、“工业气体”或者“特种化学制品”子行业中的化工品公司。
definition: 主要從事生產化工原料以及基本化工產品的公司。這些產品包括但不限於塑膠、合成纖維、膠片、 日用塗料與顏料、爆炸物以及石油化工產品。不包括那些歸類於“多種化學製品”、“化肥與農用藥劑”、“工��氣體”或者“特種化學製品”子行業中的化工品公司。
definition: 산업용 화학제품과 기초 화학제품을 주로 생산하는 기업. 플라스틱 제품, 합성섬유, 필름, 범용 도료와 안료, 폭발물, 석유화학 제품을 포함하되 이에 제한되지 않음. ‘다양한 화학제품’, ‘화학비료와 농약’, ‘산업용 가스’, ‘특수 화학제품’으로 분류되는 화학 기업은 제외. @ko
notation: 15101010
valid from: 2016-09-01
valid till: 2018-09-29

多种化学制品
type: GlobalIndustryClassificationStandardsClassifier
type: SubindustryClassifier
type: NamedIndividual
is contemporary version of: http://data.ga-group.nl/ics/gics/15101020
is replaced by: http://data.ga-group.nl/ics/gics/2018/15101020
is version of: http://data.ga-group.nl/ics/gics/15101020
replaces: http://data.ga-group.nl/ics/gics/2014/15101020
is subindustry of: 化学制品
imported on: 2026-05-27T08:45:00.430Z
last refreshed on: 2026-05-31T09:56:29.350Z
source accessed on: 2017-10-19T03:34:33Z
source last accessed on: 2019-06-07T09:41:30Z
label: Diverse Chemikalien @de
label: Diversified Chemicals @en
label: Prodotti chimici diversificati @it
label: Productos Químicos Diversos @es
label: Produits Chimiques Diversifiés @fr
label: Produtos Químicos Diversificados @pt
label: Диверсифицированные химические компании @ru
label: 多種化學製品
label: 総合化学 @ja
label: 다양한 화학제품 @ko
definition: Empresas dedicadas a la elaboración de una amplia gama de productos químicos, no incluidos en las ramas de Gases Industriales, Productos Químicos Generales, Productos Químicos Especializados o Fertilizantes y Agroquímicos. @es
definition: Fabricantes de uma gama diversificada de produtos químicos não classificados nas Sub-Indústrias de Gases Industriais, Mercadorias Químicas, Químicos Especializados ou Fertilizantes e Produtos Químicos Agrícolas. @pt
definition: Fabricants d’une gamme diversifiée de produits chimiques non-classés dans les sous-industries des Gaz Industriels, des Produits Chimiques de Base, des Produits Chimiques Spécialisés ou des Engrais et Produits Chimiques Agricoles. @fr
definition: Hersteller von diversen Chemieprodukten, die nicht einer der Branchen „Industriegase“, „Grundchemikalien“, „Spezialchemikalien“ oder „Düngemittel & landwirtschaftliche Chemikalien“ angehören. @de
definition: Manufacturers of a diversified range of chemical products not classified in the Industrial Gases, Commodity Chemicals, Specialty Chemicals or Fertilizers & Agricultural Chemicals Sub-Industries. @en
definition: Società produttrici di sostanze chimiche non classificate nei rami Gas industriali, Prodotti chimici, Prodotti chimici speciali o Fertilizzanti e prodotti chimici per il mercato agricolo. @it
definition: Производители диверсифицированной номенклатуры химических веществ, не включенные в подотрасли «Производство промышленных газов» , «Производство основных химических веществ», «Производство химических веществ специального назначения» или «Производство удобрений и химической продукции сельскохозяйственного наз��ачения». @ru
definition: ‘산업용 가스’, ‘범용 화학제품’, ‘특수 화학제품’, ‘��학비료와 농약’으로 분류되지 않은 다각화된 화학 제품군 제조업체. @ko
definition: 各样化学制品（未归类于“工业气体”、“商品化工”、“特种化学制品”或者“化肥与农用药剂”子行业中）制造商。
definition: 各樣化學製品（未歸類於“工業氣體”、“商品化工”、“特種化學製品”或者“化肥與農用藥劑”子行業中）製造商。
definition: 産業サブグループの「工業用ガス」、「基礎化学品」、「特殊化学品」、「肥料・農薬」に分類されていない各種化学品製造会社。 @ja
notation: 15101020
valid from: 2016-09-01
valid till: 2018-09-29

化肥与农用药剂
type: GlobalIndustryClassificationStandardsClassifier
type: SubindustryClassifier
type: NamedIndividual
is contemporary version of: http://data.ga-group.nl/ics/gics/15101030
is replaced by: http://data.ga-group.nl/ics/gics/2018/15101030
is version of: http://data.ga-group.nl/ics/gics/15101030
replaces: http://data.ga-group.nl/ics/gics/2014/15101030
is subindustry of: 化学制品
imported on: 2026-05-27T08:45:00.430Z
last refreshed on: 2026-05-31T09:56:29.350Z
source accessed on: 2017-10-19T03:34:33Z
source last accessed on: 2019-06-07T09:41:30Z
label: Düngemittel & landwirtschaftliche Chemikalien @de
label: Engrais et Produits Chimiques Agricoles @fr
label: Fertilizantes e Produtos Químicos Agrícolas @pt
label: Fertilizantes y Agroquímicos @es
label: Fertilizers & Agricultural Chemicals @en
label: Fertilizzanti e prodotti chimici per il mercato agricolo @it
label: Производство удобрений и химической продукции сельскохозяйственного назначения @ru
label: 化肥與農用藥劑
label: 肥料・農薬 @ja
label: 화학비료와 농약 @ko
definition: Empresas dedicadas a la elaboración de fertilizantes, pesticidas, potasa u otros productos químicos relacionados con la agricultura no incluidas en otras clasificaciones. @es
definition: Hersteller von Düngemitteln, Pestiziden, Pottasche und anderen landwirtschaftlichen Chemikalien, die nicht einer der übrigen Branchen angehören. @de
definition: Producers of fertilizers, pesticides, potash or other agriculture-related chemicals not classified elsewhere. @en
definition: Producteurs d'engrais, de pesticides, de potasse ou d'autre produits chimiques liés à l'agriculture et n'appartenant à aucune autre classification. @fr
definition: Produtores de fertilizantes, pesticidas, potassa ou outros produtos químicos relacionados à agricultura não classificados em nenhum outro lugar. @pt
definition: Società produttrici di fertilizzanti, pesticidi, potassa o altre sostanze chimiche per l'agricoltura non classificate altrove. @it
definition: Производители удобрений, пестицидов, калийных веществ или других химических веществ сельскохозяйственного назначения, не включенные в другие группы. @ru
definition: 生产化肥、杀虫剂、碳酸���、或者与农业有关的化学药品（未归类于别处）的公司。
definition: 生產化肥、殺蟲劑、碳酸鉀、或者與農業有關的化學藥品（未歸類於別處）的公司。
definition: 肥料、殺虫剤、カリ、および他のグループに分類されていない農業関連化学薬品の製造を行う会社。 @ja
definition: 다른 부문으로 분류되지 않은 화학비료, 살충제, 가성칼리 또는 기타 농업 관련 화학제품의 생산업체. @ko
notation: 15101030
valid from: 2016-09-01
valid till: 2018-09-29

工业气体
type: GlobalIndustryClassificationStandardsClassifier
type: SubindustryClassifier
type: NamedIndividual
is contemporary version of: http://data.ga-group.nl/ics/gics/15101040
is replaced by: http://data.ga-group.nl/ics/gics/2018/15101040
is version of: http://data.ga-group.nl/ics/gics/15101040
replaces: http://data.ga-group.nl/ics/gics/2014/15101040
is subindustry of: 化学制品
imported on: 2026-05-27T08:45:00.430Z
last refreshed on: 2026-05-31T09:56:29.350Z
source accessed on: 2017-10-19T03:34:33Z
source last accessed on: 2019-06-07T09:41:30Z
label: Gas industriali @it
label: Gases Industriais @pt
label: Gases Industriales @es
label: Gaz Industriels @fr
label: Industrial Gases @en
label: Industriegase @de
label: Производство промышленных газов @ru
label: 工業氣體
label: 工業用ガス @ja
label: 산업용 가스 @ko
definition: Empresas dedicadas a la producción de gases industriales. @es
definition: Fabricantes de gases industriais. @pt
definition: Hersteller von Industriegasen. @de
definition: Manufacturers of industrial gases. @en
definition: Producteurs de gaz industriels. @fr
definition: Società produttrici di gas industriali. @it
definition: Производители промышленных газов. @ru
definition: 工业气体制造商。
definition: 工業氣體製造商
definition: 工業用ガスの製造会社。 @ja
definition: 산업용 가스 제조업체. @ko
notation: 15101040
valid from: 2016-09-01
valid till: 2018-09-29

特种化学制品
type: GlobalIndustryClassificationStandardsClassifier
type: SubindustryClassifier
type: NamedIndividual
is contemporary version of: http://data.ga-group.nl/ics/gics/15101050
is replaced by: http://data.ga-group.nl/ics/gics/2018/15101050
is version of: http://data.ga-group.nl/ics/gics/15101050
replaces: http://data.ga-group.nl/ics/gics/2014/15101050
is subindustry of: 化学制品
imported on: 2026-05-27T08:45:00.430Z
last refreshed on: 2026-05-31T09:56:29.350Z
source accessed on: 2017-10-19T03:34:33Z
source last accessed on: 2019-06-07T09:41:30Z
label: Prodotti chimici speciali @it
label: Productos Químicos Especializados @es
label: Produits Chimiques Spécialisés @fr
label: Produtos Químicos Especializados @pt
label: Specialty Chemicals @en
label: Spezialchemikalien @de
label: Производство химических веществ специального назначения @ru
label: 特殊化学品 @ja
label: 特種化學製品
label: 특수 화학제품 @ko
definition: Companies that primarily produce high value-added chemicals used in the manufacture of a wide variety of products, including but not limited to fine chemicals, additives, advanced polymers, adhesives, sealants and specialty paints, pigments and coatings. @en
definition: Empresas dedicadas principalmente a la elaboración de productos químicos de alto valor añadido, utilizados en la fabricación de una gran variedad de productos como, entre otros, químicos refinados, aditivos, polímeros avanzados, adhesivos, selladores, pinturas especiales, pigmentos y revestimientos especializados. @es
definition: Empresas que produzem principalmente químicos de alto valor agregado, utilizados no fabrico de uma ampla variedade de produtos, incluindo, mas não se limitando a produtos químicos finos, aditivos, polímeros avançados, adesivos, selantes e tintas especializados, pigmentos e revestimentos. @pt
definition: Sociétés qui produisent principalement des produits chimiques à haute valeur ajoutée et utilisés dans la fabrication de nombreux produits, y compris, sans s’y limiter, les produits de chimie fine, additifs, polymères avancés, adhésifs, mastics, peintures spécialisées, pigments et enduits. @fr
definition: Società produttrici di prodotti chimici ad alto valore aggiunto usati nella fabbricazione di diversi prodotti, inclusi i prodotti della chimica fine, i pigmenti, gli additivi, i polimeri avanzati, adesivi e sigillanti, le vernici e i rivestimenti speciali. @it
definition: Unternehmen, die hauptsächlich Mehrwert-Chemikalien herstellen, die in einem weit gefächerten Produktbereich eingesetzt werden. Dazu gehören Feinchemikalien, Additive, hoch entwickelte Polymere, Klebstoffe, Dichtungsmittel, Spezialfarben, Pigmente und Spezialbeschichtungen. @de
definition: Компании, занятые в основном производством химических веществ с высокой долей добавленной стоимости, используемых �� промышленном производстве широкого спектра продукции, в том числе химических продуктов тонкого органического синтеза, добавок, сложных полимеров, клеев, изоляционных материалов и специальных красок, пигментов и покрытий. @ru
definition: 主要生产用于制造各种产品的高附加值化学制品的公司，这些制品包括但不仅限于精细化学品、添加剂、高级聚合物、粘合剂、密封剂以及特种涂料、颜料和涂层。
definition: 主要生產用於製造各種產品的高附加值化學製品的公司，這些製品包括但不限於精細化學品、添加劑、高級聚合物、粘合劑、密封劑以及特種塗料、顏料和塗層。
definition: 精製化学製品、添加剤、高分子、接着剤、密閉剤、特殊塗料・顔料、コーティング剤等の各種製品の製造に使用される高付加価値化学品を主に製造する会社。 @ja
definition: 정밀 화학제품, 첨가제, 고급 폴리머, 접착제, 실란트와 특수 도료, 안료, 코팅제를 포함하되 이에 제한되지 않는 광범위한 제품의 제조에 사용되는 고부가가치 화학제품을 주로 생산하는 기업. @ko
notation: 15101050
valid from: 2016-09-01
valid till: 2018-09-29

化学制品
type: GlobalIndustryClassificationStandardsClassifier
type: IndustryClassifier
type: NamedIndividual
is contemporary version of: http://data.ga-group.nl/ics/gics/151010
is replaced by: http://data.ga-group.nl/ics/gics/2018/151010
is version of: http://data.ga-group.nl/ics/gics/151010
replaces: http://data.ga-group.nl/ics/gics/2014/151010
is industry of: 原材料
imported on: 2026-05-27T08:45:00.430Z
last refreshed on: 2026-05-31T09:56:29.350Z
source accessed on: 2017-10-19T03:34:33Z
source last accessed on: 2019-06-07T09:41:30Z
label: Chemicals @en
label: Chemikalien @de
label: Prodotti chimici @it
label: Productos Químicos @es
label: Produits chimiques @fr
label: Produtos Químicos @pt
label: Химическое производство @ru
label: 化学 @ja
label: 化學製品
label: 화학 @ko
notation: 151010
valid from: 2016-09-01
valid till: 2018-09-29

建筑材料
type: GlobalIndustryClassificationStandardsClassifier
type: SubindustryClassifier
type: NamedIndividual
is contemporary version of: http://data.ga-group.nl/ics/gics/15102010
is replaced by: http://data.ga-group.nl/ics/gics/2018/15102010
is version of: http://data.ga-group.nl/ics/gics/15102010
replaces: http://data.ga-group.nl/ics/gics/2014/15102010
is subindustry of: 建筑材料
imported on: 2026-05-27T08:45:00.430Z
last refreshed on: 2026-05-31T09:56:29.350Z
source accessed on: 2017-10-19T03:34:33Z
source last accessed on: 2019-06-07T09:41:30Z
label: Baustoffe @de
label: Construction Materials @en
label: Matériaux de Construction @fr
label: Materiais de Construção @pt
label: Materiales de Construcción @es
label: Materiali edili @it
label: Производство строительных материалов @ru
label: 建築材料
label: 建設資材 @ja
label: 건축 자재 @ko
definition: Empresas dedicadas a la producción de materiales de construcción como arena, arcilla, yeso, cal, conglomerado, cemento, hormigón y ladrillos, entre otros. Otros materiales de construcción acabados o semiacabados están clasificados en la rama Productos de Construcción. @es
definition: Fabricantes de materiais de construção, incluindo areia, argila, gesso, cal, agregados, cimento, concreto e tijolos. Outros materiais de construção acabados ou semi-acabados são classificados na Sub-Indústria de Produtos de Construção. @pt
definition: Fabricants de matériaux de construction : sable, argile, gypse, chaux, agrégats, ciment, béton et briques. Les autres matériaux de construction finis ou semi-finis sont classés dans la sous-industrie des Produits pour l'Industrie du Bâtiment. @fr
definition: Hersteller von Baustoffen, einschließlich Sand, Ton, Gips, Kalk, Aggregate, Zement, Beton und Ziegeln. Andere fertige oder halbfertige Baumaterialien fallen in die Branche „Baumaterialien“. @de
definition: Manufacturers of construction materials including sand, clay, gypsum, lime, aggregates, cement, concrete and bricks. Other finished or semi-finished building materials are classified in the Building Products Sub-Industry. @en
definition: Società produttrici di materiali edili, inclusi la sabbia, l'argilla, la pietra da gesso, la calce, il materiale inerte, il cemento, il calcestruzzo e i mattoni. Altri materiali edili finiti o semilavorati sono classificati nel ramo Prodotti edili. @it
definition: Производители строительных материалов, в том числе песка, глины, гипса, извести, наполнителей, цемента, бетона и кирпича. Другие готовые материалы или полуфабрикаты включены в подотрасль «Строительная промышленность». @ru
definition: 包括沙子、泥土、石膏、石灰、集料、水泥、混凝土和砖块在内的建筑材料制造商。其它成品或半成品建筑材料归类于“建筑产品”子行业。
definition: 包括沙子、泥土、石膏、石灰、集料、水泥、混凝土和磚塊在內的建築材料製造商。其他成品或半成品建築材料歸類於“建築產品”子行業。
definition: 砂、粘土、石膏、石灰、骨材、セメント、コンクリー���、レンガを含む建設資材の製造会社。他の仕上げおよび半仕上げ建設資材は産業サブグループの「建設関連製品」に分類される。 @ja
definition: 모래, 점토, 석고, 석회, 골재, 시멘트, 콘크리트, 벽돌을 포함한 건축 자재 제조업체. 기타 완제품 또는 반제품 건축 자재는 ‘건축 제품’으로 분류됨. @ko
notation: 15102010
valid from: 2016-09-01
valid till: 2018-09-29

建筑材料
type: GlobalIndustryClassificationStandardsClassifier
type: IndustryClassifier
type: NamedIndividual
is contemporary version of: http://data.ga-group.nl/ics/gics/151020
is replaced by: http://data.ga-group.nl/ics/gics/2018/151020
is version of: http://data.ga-group.nl/ics/gics/151020
replaces: http://data.ga-group.nl/ics/gics/2014/151020
is industry of: 原材料
imported on: 2026-05-27T08:45:00.430Z
last refreshed on: 2026-05-31T09:56:29.350Z
source accessed on: 2017-10-19T03:34:33Z
source last accessed on: 2019-06-07T09:41:30Z
label: Baustoffe @de
label: Construction Materials @en
label: Matériaux de Construction @fr
label: Materiais de Construção @pt
label: Materiales de Construcción @es
label: Materiali edili @it
label: Производство строительных материалов @ru
label: 建築材料
label: 建設資材 @ja
label: 건축 자재 @ko
notation: 151020
valid from: 2016-09-01
valid till: 2018-09-29

金属与玻璃容器
type: GlobalIndustryClassificationStandardsClassifier
type: SubindustryClassifier
type: NamedIndividual
is contemporary version of: http://data.ga-group.nl/ics/gics/15103010
is replaced by: http://data.ga-group.nl/ics/gics/2018/15103010
is version of: http://data.ga-group.nl/ics/gics/15103010
replaces: http://data.ga-group.nl/ics/gics/2014/15103010
is subindustry of: 容器与包装
imported on: 2026-05-27T08:45:00.430Z
last refreshed on: 2026-05-31T09:56:29.350Z
source accessed on: 2017-10-19T03:34:33Z
source last accessed on: 2019-06-07T09:41:30Z
label: Contêineres de Metal e Vidro @pt
label: Contenedores de Metal y Cristal @es
label: Conteneurs en Verre ou en Métal @fr
label: Contenitori di metallo e vetro @it
label: Metal & Glass Containers @en
label: Metall- und Glasbehälter @de
label: Производство металлической и стеклянной тары @ru
label: 金属・ガラス容器 @ja
label: 金屬與玻璃容器
label: 금속 및 ���리 용기 @ko
definition: Empresas dedicadas a la producción de contenedores de metal, cristal o plástico. Se incluyen tapas y tapones. @es
definition: Fabricantes de contêineres de metal, vidro ou plástico. Inclui rolhas e tampas. @pt
definition: Fabricants de conteneurs en métal, verre ou plastique. Sont inclus les fabricants de bouchons et de capsules. @fr
definition: Hersteller von Metall-, Glas- oder Kunststoffbehältern. Hierzu gehören auch Korken und Verschlüsse. @de
definition: Manufacturers of metal, glass or plastic containers. Includes corks and caps. @en
definition: Società produttrici di contenitori di metallo, vetro o plastica. Sono inclusi i tappi e i coperchi. @it
definition: Производители металлической, стеклянной или пластмассовой тары, в том числе пробок и крышек. @ru
definition: 金属、ガラス、プラスチック容器の製造会社。コルク栓、口金を含む。 @ja
definition: 金属、玻璃或者塑料容器（包括塞子和盖子）制造商。
definition: 金屬、玻璃或者塑膠容器（包括塞子和蓋子）製造商。
definition: 금속, 유리 또는 플라스틱 용기 제조업체. 코르크 마개와 병마개 포함. @ko
notation: 15103010
valid from: 2016-09-01
valid till: 2018-09-29

紙材料包裝
type: GlobalIndustryClassificationStandardsClassifier
type: SubindustryClassifier
type: NamedIndividual
is contemporary version of: http://data.ga-group.nl/ics/gics/15103020
is replaced by: http://data.ga-group.nl/ics/gics/2018/15103020
is version of: http://data.ga-group.nl/ics/gics/15103020
replaces: http://data.ga-group.nl/ics/gics/2014/15103020
is subindustry of: 容器与包装
imported on: 2026-05-27T08:45:00.430Z
last refreshed on: 2026-05-31T09:56:29.350Z
source accessed on: 2017-10-19T03:34:33Z
source last accessed on: 2019-06-07T09:41:30Z
label: Embalaje de Papel @es
label: Emballages en Papier @fr
label: Imballi cartacei @it
label: Papel para Embalagens @pt
label: Paper Packaging @en
label: Papierverpackungen @de
label: Производство бумажной упаковки @ru
label: 包装紙 @ja
label: 纸材料包装
label: 종이 포장지 @ko
definition: Empresas dedicadas a la producción de contenedores y embalajes de papel y cartón. @es
definition: Fabricantes de contêineres e embalagens de papel e papelão. @pt
definition: Fabricants de conteneurs et d'emballages en papier et carton. @fr
definition: Hersteller von Verpackungsmaterialien und Behältern aus Papier und Pappe. @de
definition: Manufacturers of paper and cardboard containers and packaging. @en
definition: Società produttrici di contenitori e materiale di imballaggio di carta e cartone. @it
definition: Производители бумажной и картонной тары и упаковочных материалов. @ru
definition: 紙・ボール紙容器や包装紙の製造会社。 @ja
definition: 紙和紙板容器及包装製造商。
definition: 纸和纸板容器及包装制造商。
definition: 종이와 보드지 용기 및 포장지 제조업체. @ko
notation: 15103020
valid from: 2016-09-01
valid till: 2018-09-29

容器与包装
type: GlobalIndustryClassificationStandardsClassifier
type: IndustryClassifier
type: NamedIndividual
is contemporary version of: http://data.ga-group.nl/ics/gics/151030
is replaced by: http://data.ga-group.nl/ics/gics/2018/151030
is version of: http://data.ga-group.nl/ics/gics/151030
replaces: http://data.ga-group.nl/ics/gics/2014/151030
is industry of: 原材料
imported on: 2026-05-27T08:45:00.430Z
last refreshed on: 2026-05-31T09:56:29.350Z
source accessed on: 2017-10-19T03:34:33Z
source last accessed on: 2019-06-07T09:41:30Z
label: Behälter & Verpackung @de
label: Contêineres e Embalagens @pt
label: Containers & Packaging @en
label: Contenedores y Embalaje @es
label: Contenitori e imballi @it
label: Emballages et Conteneurs @fr
label: Производство тары и упаковки @ru
label: 容器・包装 @ja
label: 容器與包裝
label: 용기와 포장지 @ko
notation: 151030
valid from: 2016-09-01
valid till: 2018-09-29

鋁
type: GlobalIndustryClassificationStandardsClassifier
type: SubindustryClassifier
type: NamedIndividual
is contemporary version of: http://data.ga-group.nl/ics/gics/15104010
is replaced by: http://data.ga-group.nl/ics/gics/2018/15104010
is version of: http://data.ga-group.nl/ics/gics/15104010
replaces: http://data.ga-group.nl/ics/gics/2014/15104010
is subindustry of: 金属与采矿
imported on: 2026-05-27T08:45:00.430Z
last refreshed on: 2026-05-31T09:56:29.350Z
source accessed on: 2017-10-19T03:34:33Z
source last accessed on: 2019-06-07T09:41:30Z
label: Alluminio @it
label: Alumínio @pt
label: Aluminio @es
label: Aluminium @de
label: Aluminum @en
label: Производство алюминия @ru
label: アルミ @ja
label: 铝
label: 알루미늄 @ko
definition: Empresas dedicadas a la producción de aluminio y productos relacionados. Se incluyen las empresas dedicadas a la extracción o procesamiento de bauxita y aquellas dedicadas al reciclaje de aluminio para producir productos acabados o semiacabados. Se excluyen las empresas dedicadas principalmente a la producción de materiales de construcción de aluminio que están clasificadas en la rama Productos de Construcción. @es
definition: Hersteller von Aluminium oder verwandten Produkten, einschließlich Unternehmen, die Bauxit abbauen oder verarbeiten, sowie Unternehmen, die Aluminium recyceln, um fertige oder halbfertige Produkte herzustellen. Ausgeschlossen sind Unternehmen, die hauptsächlich Baumaterialien aus Aluminium herstellen und der Branche „Baumaterialien“ angehören. @de
definition: Producers of aluminum and related products, including companies that mine or process bauxite and companies that recycle aluminum to produce finished or semi-finished products. Excludes companies that primarily produce aluminum building materials classified in the Building Products Sub-Industry. @en
definition: Producteurs d'aluminium et de produits connexes. Sont incluses les sociétés qui exploitent ou traitent la bauxite et qui recyclent l'aluminium pour fabriquer des produits finis ou semi-finis. Cette sous-industrie n'inclut pas les sociétés qui produisent principalement des matériaux de construction en aluminium, classées dans la sous-industrie des Produits pour l'Industrie du Bâtiment. @fr
definition: Produtores de alumínio e produtos relacionados, incluindo as empresas de mineração ou processamento de bauxita e empresas que reciclam o alumínio para produzir produtos acabados ou semi-acabados. Exclui empresas que produzem principalmente materiais de construção em alumínio classificados na Sub-Indústria de Produtos para Construção. @pt
definition: Società produttrici di alluminio e prodotti affini, incluse le società che operano nell'estrazione e la lavorazione di bauxite e nel riciclaggio di alluminio per la produzione di prodotti finiti o semifiniti. Sono escluse le società produttrici di materiali edili di alluminio classificate nel ramo Prodotti edili. @it
definition: Производители алюминия и сопутствующей продукции, в том числе компании, занимающиеся добычей или переработкой бокситов, и компании, занимающиеся вторичной переработкой алюминия для производства готовой продукции или полуфабрикатов. В данную группу не входят компании, зани��ающиеся в основном производством строительных материалов из алюминия, которые включены в подотрасль «Производство строительных изделий». @ru
definition: アルミおよび関連製品の製造会社。ボーキサイトの採掘や加工処理を行う会社、アルミを再利用し、仕上げおよび半仕上げ製品を製造する会社を含む。産業サブグループの「建設関連製品」に分類される、アルミ建設資材を主に製造する会社は除く。 @ja
definition: 鋁及相關產品生產商，包括那些開採或加工鋁土礦的公司以及回收鋁材料用於生產成品或半成品的公司，但不包括歸類於“建築產品”子行業中那些主要從事生產鋁建築材料的公司。
definition: 铝及相关产品生产商，包括那些开采或��工铝土矿的公司以及回收铝材料用于生产成品或半成品的公司，但不包括归类于“建筑产品”子行业中那些主要从事生产铝建筑材料的公司。
definition: 보크사이트를 채굴 또는 처리하는 기업과 알루미늄을 재활용해서 완제품 또는 반제품을 생산하는 기업을 포함한 알루미늄 및 관련 제품 생산업체. ‘건축 자재’로 분류되는 알루미늄 건축 자재를 주로 생산하는 회사는 제외. @ko
notation: 15104010
valid from: 2016-09-01
valid till: 2018-09-29

多种金属与采矿
type: GlobalIndustryClassificationStandardsClassifier
type: SubindustryClassifier
type: NamedIndividual
is contemporary version of: http://data.ga-group.nl/ics/gics/15104020
is replaced by: http://data.ga-group.nl/ics/gics/2018/15104020
is version of: http://data.ga-group.nl/ics/gics/15104020
replaces: http://data.ga-group.nl/ics/gics/2014/15104020
is subindustry of: 金属与采矿
imported on: 2026-05-27T08:45:00.430Z
last refreshed on: 2026-05-31T09:56:29.350Z
source accessed on: 2017-10-19T03:34:33Z
source last accessed on: 2019-06-07T09:41:30Z
label: Diversified Metals & Mining @en
label: Métaux diversifiés et exploitation minière @fr
label: Metais Diversificados y Mineração @pt
label: Metalle & Bergbau: Diverse @de
label: Metalli ed estrazione diversificati @it
label: Minería y Metales Diversos @es
label: Диверсифицированные металлы и их добыча @ru
label: 各種金属・鉱業 @ja
label: 多種金屬與採礦
label: 다양한 금속과 채광 @ko
definition: Companies engaged in the diversified production or extraction of metals and minerals not classified elsewhere. Including, but not limited to, nonferrous metal mining (except bauxite), salt and borate mining, phosphate rock mining, and diversified mining operations. Excludes iron ore mining, classified in the Steel Sub-Industry, bauxite mining, classified in the Aluminum Sub-Industry, and coal mining, classified in either the Steel or Coal & Consumable Fuels Sub-Industries. @en
definition: Empresas dedicadas a la produccion o extraccion de una amplia variedad de metales y minerales no incluidos en otras clasificaciones anteriormente. Incluye, entre otros, la mineria de metales no ferrosos (excepto Bauxita), la mineria de sal y borato, la mineria de roca fosforica, y operaciones de mineria diversas. Excluye la mineria de hierro, clasificado en la rama de Acero, la mineria de bauxita, clasificada en la rama de Aluminio, y la mineria del carbon, clasificada en la rama del Acero o la rama de Carbon y Carburantes Combustibles. @es
definition: Empresas envolvidas na produção diversificada ou extração de metais e minerais não classificadas em nenhum outro lugar, incluindo, mas não limitado a, mineração de metais não-ferrosos (exceto bauxita), mineração de sal e borato, mineração de rocha fosfática e operações de mineração diversificadas. Exclui mineração de minério de ferro, classificada na Sub-Indústria de Aço. Também exclui a mineração de bauxita, classificada na Sub-Indústria de Alumínio e a mineração de carvão, classificada nas Sub-Indústrias de Aço ou Carvão e Combustíveis de Consumo. @pt
definition: Entreprises engagées dans la production diversifiée ou l'extraction de métaux et de minéraux n’appartenant à aucune autre classification. Sont inclus, mais sans s'y limiter, l'exploitation minière de métaux non ferreux (sauf la bauxite), l'exploitation minière de sel et de borate, l’exploitation minière de roches phosphatées, et les opérations minières diversifiées. Ne sont pas inclus l'extraction du minerai de fer, classé dans la sous-industrie de l’Acier, de l'extraction de bauxite, classé dans la sous-industrie de l’Aluminium, et de l’extraction du charbon, classé soit dans les sous-industries de l’Acier soit du Charbon et Combustibles. @fr
definition: Società che operano nella produzione diversificata o nell'estrazione di metalli e minerali non classificati altrove. Tra cui, ma senza limitazione: estrazione di metallo non ferroso (eccetto bauxite), estrazione di sale e borato, estrazione di fosforite, e diversificate attività di estrazione. Sono escluse le attività' di estrazione di minerale di ferro, classificate nel ramo Acciaio; le attività di estrazione di bauxite classificate nel ramo Alluminio; e quelle di estrazione di carbone, classificate nel ramo Acciaio o in quello del Carbone e Carburanti di Consumo. @it
definition: "Unternehmen, die sich mit der Produktion oder Extraktion von diversen Metallen und Mineralien befassen und nicht einer der übrigen Branchen angehören. Eingeschlossen sind auch Bergbau von Nichteisenmetall (ausgenommen Aluminium), Salz und Borate, Phosphorit, Hochofenkoks für Stahlproduktion und andere diversifizierte Abbauunternehmungen. Ausgeschlossen sind Eisenerzgruben, die der „Stahl"" Sub-Industrie angehören, auch Bergbau von Aluminium, welcher der „Aluminium"" Sub-Industrie angehört. Ausgeschlossen sind Unternehmen, die sich mit dem Abbbau von bituminöser (thermischer) Kohle befassen und die der „Kohle & Nicht erneuerbare Brennstoffe"" Sub-Industrie angehören." @de
definition: Компании, занимающиеся диверсифицированным производством или добычей металлов и полезных ископаемых, не включенные в другие группы. Включая, но не ограничиваясь, компании, которые занимаются добычей цветных металлов (кроме бокситов), добычей соли, боратов, добычей фосфоритов и компании диверсифицированной горнодобывающей промышленности. Данная гр��ппа не включает компании, занятые добычей железной руды, включенные в подотрасль «Производство стали» и компании, добывающие бокситы, включенные в подотрасль «Производство алюминия», компании добывающие уголь, включенные в подотрасль «Производство стали» или «Добыча угля и потребляемого топлива». @ru
definition: 从事生产或开采多种金属和矿石（未归类于别处）的公司。包括但不仅限于开采有色金属（不含铝矿），盐及硼酸盐，磷灰矿石，使用在钢铁生产的冶金焦煤，以及多种采矿经营。不包括那些归类于“钢铁”子行业中开采铁的公司和归类于“铝”子行业中开采铝的公司。不包括那些归类于“煤与消费用燃料”子行业中开采热力煤的公司。
definition: 他のグループに分類されていない金属や鉱物の各種製造や採掘を行う会社。\n多様な��物、金属の採掘及び生産を行なう会社（他のグループに分類されないもの）。以下を含むが、（ボーキサイトを除く）非鉄金属、塩、ホウ酸塩、リン鉱石及び多種鉱物の採掘を事業とする会社を限らない。産業サブグループ「鉄鋼」に分類される鉄鉱石の採掘会社及び産業サブグループ「アルミ」に分類されるアルミの採掘会社は除く。産業サブグループ「石炭・消耗燃料」に分類される瀝青（熱）石炭の採掘会社は除く。 @ja
definition: 從事生產或開採多種金屬和礦石（未歸類於別處）的公司。包括但不僅限於開採有色金屬（不含鋁礦）、鹽及硼痠鹽、燐灰礦石、使用在鋼鐵生產的冶金焦煤、以及多種採礦經營。不包括那些歸類於“鋼鐵”子行業中開採鐵的公司和歸類於“鋁”子行業���開採鋁的公司，不包括那些歸類於“煤與消費用燃料”子行業中開採熱力煤的公司。
definition: 다른 곳에서 분류하지 않는 금속 및 광물의 다양한 생산이나 채굴에 참여하는 기업. 비철금속 채굴(보크사이트 제외), 소금과 붕산염 채굴, 인광암 채굴, 다양한 채굴 작업 등을 포함하나 이에 한정하지 않음. '철강'으로 분류되는 철광석 채굴, '알루미늄'으로 분류되는 보크사이트 ��굴, '철강' 또는 '석탄 및 소모 연료'로 분류되는 석탄 채굴은 제외 @ko
notation: 15104020
valid from: 2016-09-01
valid till: 2018-09-29

銅礦業
type: GlobalIndustryClassificationStandardsClassifier
type: SubindustryClassifier
type: NamedIndividual
is contemporary version of: http://data.ga-group.nl/ics/gics/15104025
is replaced by: http://data.ga-group.nl/ics/gics/2018/15104025
is version of: http://data.ga-group.nl/ics/gics/15104025
is subindustry of: 金属与采矿
imported on: 2026-05-27T08:45:00.430Z
last refreshed on: 2026-05-31T09:56:29.350Z
source accessed on: 2017-10-19T03:34:33Z
source last accessed on: 2019-06-07T09:41:30Z
label: Cobre @es
label: Copper @en
label: Cuivre @fr
label: Kupfer @de
label: Rame @it
label: Меднодобывающая промышленность @ru
label: 銅 @ja
label: 铜
label: 구리 @ko
definition: Aziende operanti principalmente nell'estrazione del minerale di rame. @it
definition: Companies involved primarily in copper ore mining. @en
definition: Empresas dedicadas principalmente a la extracción de cobre. @es
definition: Empresas envolvidas principalmente na mineração de cobre. @pt
definition: Les sociétés principalement actives dans l'exploitation minière du minerai de cuivre. @fr
definition: Unternehmen, die primär im Kupfererzabbau tätig sind. @de
definition: Компании, занятые добычей медной руды. @ru
definition: 主に銅鉱石の採掘を行う会社 @ja
definition: 主要从事铜矿开采的公司。
definition: 主要營業項目為銅礦開採的公司。
definition: 주로 구리광석 채굴에 관련된 회사. @ko
notation: 15104025
valid from: 2016-09-01
valid till: 2018-09-29

黃金
type: GlobalIndustryClassificationStandardsClassifier
type: SubindustryClassifier
type: NamedIndividual
is contemporary version of: http://data.ga-group.nl/ics/gics/15104030
is replaced by: http://data.ga-group.nl/ics/gics/2018/15104030
is version of: http://data.ga-group.nl/ics/gics/15104030
replaces: http://data.ga-group.nl/ics/gics/2014/15104030
is subindustry of: 金属与采矿
imported on: 2026-05-27T08:45:00.430Z
last refreshed on: 2026-05-31T09:56:29.350Z
source accessed on: 2017-10-19T03:34:33Z
source last accessed on: 2019-06-07T09:41:30Z
label: Gold @de
label: Or @fr
label: Oro @es
label: Ouro @pt
label: Добыча золота @ru
label: 金 @ja
label: 黄金
label: 금 @ko
definition: Empresas dedicadas a la producción de oro y productos relacionados. Se incluyen las empresas que extraen o procesan oro y las casas de finanzas de Sudáfrica que invierten principalmente en minas de oro pero no las operan. @es
definition: Hersteller von Gold und verwandten Produkten, einschließlich Unternehmen, die Gold abbauen oder verarbeiten, sowie die südafrikanischen Finanzhäuser, die hauptsächlich in Goldminen investieren, diese aber nicht betreiben. @de
definition: Producers of gold and related products, including companies that mine or process gold and the South African finance houses which primarily invest in, but do not operate, gold mines. @en
definition: Producteurs d'or ou de produits connexes. Sont incluses les sociétés qui extraient ou traitent l'or, et les organisations financières sud-africaines qui investissent principalement dans l'or sans l'extraire des mines. @fr
definition: Produtores de ouro e produtos relacionados, incluindo empresas de mineração ou processamento de ouro e as casas financeiras sul-africanas que principalmente investem em minas de outro, mas sem operá-las. @pt
definition: Società produttrici di oro e prodotti affini incluse le società che operano nell'estrazione o la lavorazione di oro e le imprese finanziarie della Repubblica Sudafricana che investono, ma non operano nell'estrazione dell'oro. @it
definition: Производители золота и сопутствующих продуктов, включая компании, занимающиеся добычей или обработкой золота, и южноафри��анские финансовые компании, которые в основном занимаются финансированием золотых приисков, но не их эксплуатацией. @ru
definition: 金や関連製品の製造会社。金の採掘・加工を行う会社、主に金の採掘に投資している（採掘に従事していない）南アフリカの金融会社を含む。 @ja
definition: 黃金及相關產品生產商，包括那些開採或者加工黃金的公司以及那些主要投資但並不經營金礦的南非金融公司。
definition: 黄金及相关产品生产商，包括那些开采或者加工黄金的公司以及那些主要投资但并不经营金矿的南非金融公司。
definition: 금을 채굴 또는 처리하는 기업, 그리고 금광에 주로 투자하되 운영은 하지 않는 남아프리카 금융회사를 포함해서 금 및 관련 제품 생산업체. @ko
notation: 15104030
valid from: 2016-09-01
valid till: 2018-09-29

貴重金屬與礦石
type: GlobalIndustryClassificationStandardsClassifier
type: SubindustryClassifier
type: NamedIndividual
is contemporary version of: http://data.ga-group.nl/ics/gics/15104040
is replaced by: http://data.ga-group.nl/ics/gics/2018/15104040
is version of: http://data.ga-group.nl/ics/gics/15104040
replaces: http://data.ga-group.nl/ics/gics/2014/15104040
is subindustry of: 金属与采矿
imported on: 2026-05-27T08:45:00.430Z
last refreshed on: 2026-05-31T09:56:29.350Z
source accessed on: 2017-10-19T03:34:33Z
source last accessed on: 2019-06-07T09:41:30Z
label: Edelmetalle & Mineralien @de
label: Métaux et Minéraux Précieux @fr
label: Metais Preciosos e Minerais @pt
label: Minerales y Metales Preciosos @es
label: Minerali e metalli preziosi @it
label: Precious Metals & Minerals @en
label: Добыча драгоценных металлов и минералов @ru
label: 貴金属・鉱物 @ja
label: 贵重金属与矿石
label: 귀금속 & 광물 @ko
definition: Companies mining precious metals and minerals not classified in the Gold Sub-Industry. Includes companies primarily mining platinum. @en
definition: Empresas de mineração de metais preciosos e minerais não classificadas na Sub-Indústria de Ouro. Inclui empresas de mineração, principalmente, de platina. @pt
definition: Empresas dedicadas a la extracción de minerales y metales preciosos no clasificadas en la rama Oro. Se incluyen las empresas dedicadas principalmente a la extracción de platino. @es
definition: Sociétés qui extraient les minerais et métaux précieux qui ne sont pas classés dans la sous-industrie de l’Or. Sont incluses les sociétés qui extraient principalement le platine. @fr
definition: Società che operano nell'estrazione di minerali e metalli preziosi non classificate nel ramo Oro. Sono incluse le società che operano principalmente nell'estrazione del platino. @it
definition: Unternehmen, die Edelmetalle und Mineralien abbauen und nicht der Branche „Gold“ angehören. Hierzu gehören Unternehmen, die hauptsächlich Platin abbauen. @de
definition: Компании, занимающиеся добычей драгоценных металлов и минералов, не включенные в подотрасль «Добыча золота». Даная группа включает компании, занимающиеся в основном добычей платины. @ru
definition: ‘금’으로 분류되지 않은 귀금속과 고급 광물을 채굴하는 기업. 주로 백금을 채굴하는 기업 포함. @ko
definition: 从事开采贵重金属和矿石（未归类于“黄金”子行业）的公司。包括那些主要从事开采铂的公司。
definition: 從事開採貴重金屬和礦石（未歸類于“黃金”子行業）的公司。包括那些主要從事開採鉑的公司。
definition: 貴金属・鉱物の採掘を行い、産業サブグループの「金」に分類されていない会社。プラチナの採掘を主に行う会社を含む。 @ja
notation: 15104040
valid from: 2016-09-01
valid till: 2018-09-29

白銀
type: GlobalIndustryClassificationStandardsClassifier
type: SubindustryClassifier
type: NamedIndividual
is contemporary version of: http://data.ga-group.nl/ics/gics/15104045
is replaced by: http://data.ga-group.nl/ics/gics/2018/15104045
is version of: http://data.ga-group.nl/ics/gics/15104045
replaces: http://data.ga-group.nl/ics/gics/2014/15104045
is subindustry of: 金属与采矿
imported on: 2026-05-27T08:45:00.430Z
last refreshed on: 2026-05-31T09:56:29.350Z
source accessed on: 2017-10-19T03:34:33Z
source last accessed on: 2019-06-07T09:41:30Z
label: Argent @fr
label: Argento @it
label: Plata @es
label: Prata @pt
label: Silber @de
label: Silver @en
label: Добыча серебра @ru
label: 白银
label: 銀 @ja
label: 은 @ko
definition: Companies primarily mining silver. Excludes companies classified in the Gold or Precious Metals & Minerals Sub-Industries. @en
definition: Empresas dedicadas principalmente a la extracción de plata. Se excluyen empresas clasificadas en las ramas Oro o Minerales y Metales Preciosos. @es
definition: Empresas principalmente de mineração de prata. Exclui empresas classificadas nas Sub-Indústrias de Ouro ou Metais Preciosos e Minerais. @pt
definition: Sociétés qui extraient principalement l’argent. Ne sont pas incluses les sociétés classées dans les sous-industries de l’Or ou des Métaux et Minéraux Précieux. @fr
definition: Società che operano principalmente nell'estrazione di argento. Sono escluse le società classificate nei rami dell’Oro o dei Metalli Preziosi e Minerali. @it
definition: Unternehmen, die hauptsächlich Silber abbauen und nicht den Branchen „Gold“ oder „Edelmetalle & Mineralien“ angehören. @de
definition: Компании, занимающиеся, преимущественно, добычей серебра. Исключены компании, входящие в подотрасли «Добыча золота» или «Добыча драгоценных металлов и минералов». @ru
definition: 白銀及相關產品生產商。不含歸類於子行業“貴重金屬與礦石”的所屬公司。
definition: 白银及相关产品生产商，不含归类于子行业“贵重金属与矿石”的所属公司。
definition: 銀の採掘を主に行う会社。産業サブグループ「金」と「貴金属・鉱物」に分類される会社は除く。 @ja
definition: 주로 은을 채굴하는 기업. '금' 또는 '귀금속 & 광물'로 분류된 기업은 제외 @ko
notation: 15104045
valid from: 2016-09-01
valid till: 2018-09-29

鋼鐵
type: GlobalIndustryClassificationStandardsClassifier
type: SubindustryClassifier
type: NamedIndividual
is contemporary version of: http://data.ga-group.nl/ics/gics/15104050
is replaced by: http://data.ga-group.nl/ics/gics/2018/15104050
is version of: http://data.ga-group.nl/ics/gics/15104050
replaces: http://data.ga-group.nl/ics/gics/2014/15104050
is subindustry of: 金属与采矿
imported on: 2026-05-27T08:45:00.430Z
last refreshed on: 2026-05-31T09:56:29.350Z
source accessed on: 2017-10-19T03:34:33Z
source last accessed on: 2019-06-07T09:41:30Z
label: Aço @pt
label: Acciaio @it
label: Acero @es
label: Acier @fr
label: Stahl @de
label: Steel @en
label: Производство стали @ru
label: 鉄鋼 @ja
label: 钢铁
label: 철강 @ko
definition: Hersteller von Eisen, Stahl und verwandten Produkten. Eingeschlossen sind Unternehmen, die hauptsächlich Hochofenkoks für Stahlproduktion abbauen. @de
definition: Producers of iron and steel and related products, including metallurgical (coking) coal mining used for steel production. @en
definition: Producteurs de fer et d'acier et de produits connexes. Sont incluses les mines de charbon métallurgique (cokéfaction) utilisé dans la production d'acier. @fr
definition: Productores de hierro, acero y productos ralacionados, incluyendo mineria de carbon metalurgico (coque) para la produccion de acero. @es
definition: Produtores de ferro e aço e produtos relacionados, incluindo a mineração de carvão metalúrgico (coque) utilizado na produção de aço. @pt
definition: Società produttrici di ferro, acciaio e prodotti affini, tra cui carbone metallurgico (coking) utilizzato per la produzione di acciaio. @it
definition: Производители железа, стали и сопутствующей продукции, включая добычу металлургического (коксующегося) угля, используемого для производства стали. @ru
definition: 鉄・鉄鋼や関連製品の製造会社。石炭鉱業における製鋼用コーキング冶金会社を含む。 @ja
definition: 鋼鐵及相關產品生產商。包含煤礦行業內與製鋼相關的鍍金等冶金公司。
definition: 钢铁及相关产品生产商。包含煤矿行业内与制钢相关的镀金等冶金公司。
definition: 철강 생산을 위해 사용하는 금속(코크스) 석탄 채굴 등을 포함해 철, 강철, 관련 제품 생산업체 @ko
notation: 15104050
valid from: 2016-09-01
valid till: 2018-09-29

金属与采矿
type: GlobalIndustryClassificationStandardsClassifier
type: IndustryClassifier
type: NamedIndividual
is contemporary version of: http://data.ga-group.nl/ics/gics/151040
is replaced by: http://data.ga-group.nl/ics/gics/2018/151040
is version of: http://data.ga-group.nl/ics/gics/151040
replaces: http://data.ga-group.nl/ics/gics/2014/151040
is industry of: 原材料
imported on: 2026-05-27T08:45:00.430Z
last refreshed on: 2026-05-31T09:56:29.350Z
source accessed on: 2017-10-19T03:34:33Z
source last accessed on: 2019-06-07T09:41:30Z
label: Industrie minero-metallurgiche @it
label: Métaux et Exploitation Minière @fr
label: Metais e Mineração @pt
label: Metales y Minería @es
label: Metalle & Bergbau @de
label: Metals & Mining @en
label: Металлургия и добывающая промышленность @ru
label: 金属・鉱業 @ja
label: 金屬與採礦
label: 금속과 채광 @ko
notation: 151040
valid from: 2016-09-01
valid till: 2018-09-29

林业产品
type: GlobalIndustryClassificationStandardsClassifier
type: SubindustryClassifier
type: NamedIndividual
is contemporary version of: http://data.ga-group.nl/ics/gics/15105010
is replaced by: http://data.ga-group.nl/ics/gics/2018/15105010
is version of: http://data.ga-group.nl/ics/gics/15105010
replaces: http://data.ga-group.nl/ics/gics/2014/15105010
is subindustry of: 紙類與林業產品
imported on: 2026-05-27T08:45:00.430Z
last refreshed on: 2026-05-31T09:56:29.350Z
source accessed on: 2017-10-19T03:34:33Z
source last accessed on: 2019-06-07T09:41:30Z
label: Forest Products @en
label: Forstprodukte @de
label: Prodotti forestali @it
label: Productos Madereros @es
label: Produits de la Forêt @fr
label: Produtos Florestais @pt
label: Производство продукций лесного хозяйства @ru
label: 林業產品
label: 林産品 @ja
label: 임산물 @ko
definition: Empresas dedicadas a la producción de madera y productos relacionados. Se incluye la madera producida para la construcción. @es
definition: Fabricantes de madeira e produtos madeireiros relacionados. Inclui madeira serrada para a indústria de construção. @pt
definition: Fabricants de bois et de produits à base de bois. Est inclus le bois de construction pour l'Industrie du Bâtiment. @fr
definition: Hersteller von Industrieholz und verwandten Holzprodukten. Hierzu gehört auch Holz für die Bauindustrie. @de
definition: Manufacturers of timber and related wood products. Includes lumber for the building industry. @en
definition: Società produttrici di legname e prodotti affini, compreso il legname da costruzione. @it
definition: Производители древесины и сопутствующих изделий из древесины. Данная группа включает производство древесины для строительной промышленности. @ru
definition: 木材及相关木材制品（包括建筑木材）制造商。
definition: 木材及相關木材製��（包括建築木材）製造商。
definition: 材木や木材関連製品の製造会社。建設産業用の建材を含む。 @ja
definition: 목재 및 관련된 목재 제품 제조업체. 건축용 판재 포함. @ko
notation: 15105010
valid from: 2016-09-01
valid till: 2018-09-29

纸制品
type: GlobalIndustryClassificationStandardsClassifier
type: SubindustryClassifier
type: NamedIndividual
is contemporary version of: http://data.ga-group.nl/ics/gics/15105020
is replaced by: http://data.ga-group.nl/ics/gics/2018/15105020
is version of: http://data.ga-group.nl/ics/gics/15105020
replaces: http://data.ga-group.nl/ics/gics/2014/15105020
is subindustry of: 紙類與林業產品
imported on: 2026-05-27T08:45:00.430Z
last refreshed on: 2026-05-31T09:56:29.350Z
source accessed on: 2017-10-19T03:34:33Z
source last accessed on: 2019-06-07T09:41:30Z
label: Paper Products @en
label: Papierprodukte @de
label: Prodotti cartacei @it
label: Productos de Papel @es
label: Produits à Base de Papier @fr
label: Produtos de papel @pt
label: Целлюлозно-бумажное производство @ru
label: 紙製品
label: 종이 제품 @ko
definition: Empresas dedicadas a la producción de papel de todo tipo. Se excluyen las empresas especializadas en embalajes de papel clasificadas en la rama Embalaje de Papel. @es
definition: Fabricantes de todas as categorias de papel. Exclui empresas especializadas em papéis de embalagem, classificadas na Sub-Indústria de Papel para Embalagens. @pt
definition: Fabricants de toutes les qualités de papiers. Ne sont pas incluses les sociétés qui sont spécialisées dans la production d’emballage en papier et qui sont classées dans la sous-industrie des Emballages en Papier. @fr
definition: Hersteller von Papier verschiedener Qualitäten. Ausgeschlossen sind Unternehmen, die auf Papierverpackungen spezialisiert sind und der Branche „Papierverpackungen“ angehören. @de
definition: Manufacturers of all grades of paper. Excludes companies specializing in paper packaging classified in the Paper Packaging Sub-Industry. @en
definition: Società produttrici di tutti i tipi di carta. Sono escluse le società specializzate nella produzione di materiali per imballaggio di carta, classificate nel ramo Imballi cartacei @it
definition: Производители бумаги всех сортов. В данную группу не входят компании, специализирую��иеся на производстве бумажной упаковки; они включены в подотрасль «Производство бумажной упаковки». @ru
definition: あらゆる種類の紙を製造する会社。産業サブグループの「包装紙」に分類される包装紙会社は除く。 @ja
definition: 各类等级纸张的制造商。不包括那些归类于“纸材料包装”子行业中专门从事纸制包装的公司。
definition: 各類等級紙張的製造商。不包括那些歸類於“紙材料包裝”子行業中專門從事紙制包裝的公司。
definition: 모든 등급의 종이 제조업체. ‘종이 포장지’로 분류되는 종이 포장지 전문 기업은 제외. @ko
notation: 15105020
valid from: 2016-09-01
valid till: 2018-09-29

紙類與林業產品
type: GlobalIndustryClassificationStandardsClassifier
type: IndustryClassifier
type: NamedIndividual
is contemporary version of: http://data.ga-group.nl/ics/gics/151050
is replaced by: http://data.ga-group.nl/ics/gics/2018/151050
is version of: http://data.ga-group.nl/ics/gics/151050
replaces: http://data.ga-group.nl/ics/gics/2014/151050
is industry of: 原材料
imported on: 2026-05-27T08:45:00.430Z
last refreshed on: 2026-05-31T09:56:29.350Z
source accessed on: 2017-10-19T03:34:33Z
source last accessed on: 2019-06-07T09:41:30Z
label: Carta e prodotti forestali @it
label: Paper & Forest Products @en
label: Papier- & Forstprodukte @de
label: Productos Madereros y Papeleros @es
label: Produits issus du Papier et de la Forêt @fr
label: Produtos Florestais e de Papel @pt
label: Целлюлозно-бумажная и лесная промышленность @ru
label: 紙製品・林産品 @ja
label: 纸类与林业产品
label: 종이와 임산물 @ko
notation: 151050
valid from: 2016-09-01
valid till: 2018-09-29

原材料
type: GlobalIndustryClassificationStandardsClassifier
type: IndustryGroupClassifier
type: NamedIndividual
is contemporary version of: http://data.ga-group.nl/ics/gics/1510
is replaced by: http://data.ga-group.nl/ics/gics/2018/1510
is version of: http://data.ga-group.nl/ics/gics/1510
replaces: http://data.ga-group.nl/ics/gics/2014/1510
is industry group of: 原材料
imported on: 2026-05-27T08:45:00.430Z
last refreshed on: 2026-05-31T09:56:29.350Z
source accessed on: 2017-10-19T03:34:33Z
source last accessed on: 2019-06-07T09:41:30Z
label: Matériaux @fr
label: Materiais @pt
label: Materiales @es
label: Materiali @it
label: Materials @en
label: Roh-, Hilfs- & Betriebsstoffe @de
label: Материалы @ru
label: 素材 @ja
label: 물질 @ko
notation: 1510
valid from: 2016-09-01
valid till: 2018-09-29

原材料
type: GlobalIndustryClassificationStandardsClassifier
type: SectorClassifier
type: NamedIndividual
is contemporary version of: http://data.ga-group.nl/ics/gics/15
is replaced by: http://data.ga-group.nl/ics/gics/2018/15
is version of: http://data.ga-group.nl/ics/gics/15
replaces: http://data.ga-group.nl/ics/gics/2014/15
imported on: 2026-05-27T08:45:00.430Z
last refreshed on: 2026-05-31T09:56:29.350Z
source accessed on: 2017-10-19T03:34:33Z
source last accessed on: 2019-06-07T09:41:30Z
label: Matériaux @fr
label: Materiais @pt
label: Materiales @es
label: Materiali @it
label: Materials @en
label: Roh-, Hilfs- & Betriebsstoffe @de
label: Материалы @ru
label: 素材 @ja
label: 물질 @ko
notation: 15
valid from: 2016-09-01
valid till: 2018-09-29

航天航空与国防
type: GlobalIndustryClassificationStandardsClassifier
type: SubindustryClassifier
type: NamedIndividual
is contemporary version of: http://data.ga-group.nl/ics/gics/20101010
is replaced by: http://data.ga-group.nl/ics/gics/2018/20101010
is version of: http://data.ga-group.nl/ics/gics/20101010
replaces: http://data.ga-group.nl/ics/gics/2014/20101010
is subindustry of: 航空航天与国防
imported on: 2026-05-27T08:45:00.430Z
last refreshed on: 2026-05-31T09:56:29.350Z
source accessed on: 2017-10-19T03:34:33Z
source last accessed on: 2019-06-07T09:41:30Z
label: Aérospatiale et Défense @fr
label: Aeroespaço e Defesa @pt
label: Aeronautica e difesa @it
label: Aerospace & Defense @en
label: Industria Aeronáutica y de Defensa @es
label: Luftfahrt & Verteidigung @de
label: Аэрокосмическая и оборонная промышленность @ru
label: 航天航空與國防
label: 航空宇宙・防衛 @ja
label: 우주항공과 국방 @ko
definition: Empresas dedicadas a la fabricación de componentes, equipos o productos civiles o militares para la industria aeronáutica y de defensa. Incluye aparatos electrónicos de defensa y equipos espaciales. @es
definition: Fabricantes de equipamento, partes ou produtos aeroespaciais e de defesa de uso civil ou militar. Inclui equipamento de defesa eletrônica e espacial. @pt
definition: Fabricants de produits, de pièces et de matériels civils ou militaires pour l'industrie aérospatiale et de défense. Sont inclus les fabricants d'électronique de défense et d'équipement de l'industrie spatiale. @fr
definition: Hersteller von Ausrüstung, Teilen und Produkten für die zivile und militärische Luftfahrt und Verteidigung. Hierzu gehören auch elektronische Geräte für die Verteidigung und die Raumfahrt. @de
definition: Manufacturers of civil or military aerospace and defense equipment, parts or products. Includes defense electronics and space equipment. @en
definition: Società produttrici di apparecchiature, impianti, parti e prodotti per l'aeronautica e la difesa civile e militare. Sono incluse le società produttrici di apparecchiature elettroniche e spaziali per la difesa. @it
definition: Производители оборудования, комплектующих или изделий гражданского или военного назначения для космических исследований и обеспечения военной безопасности. В данную группу входят производители электронной аппаратуры военного назначения и оборудования для космических исследований. @ru
definition: 民用或军用航空航天及国防设备、零部件或产品（包括国防电子设备和航天设备）制造商。
definition: 民用或軍用航空航太及國防設備、零部件或產品（包括國防電子設備和航太設備）製造商。
definition: 民間用、軍事用の航空宇宙・防衛に関する設備、部品、製品の製造会社。防衛電子装置や宇宙機器を含む。 @ja
definition: 민간 또는 군용 우주항공 및 국방 장비, 부품 또는 제품 제조업체. 국방용 전자 및 우주 장비 포함. @ko
notation: 20101010
valid from: 2016-09-01
valid till: 2018-09-29

航空航天与国防
type: GlobalIndustryClassificationStandardsClassifier
type: IndustryClassifier
type: NamedIndividual
is contemporary version of: http://data.ga-group.nl/ics/gics/201010
is replaced by: http://data.ga-group.nl/ics/gics/2018/201010
is version of: http://data.ga-group.nl/ics/gics/201010
replaces: http://data.ga-group.nl/ics/gics/2014/201010
is industry of: 資本物品
imported on: 2026-05-27T08:45:00.430Z
last refreshed on: 2026-05-31T09:56:29.350Z
source accessed on: 2017-10-19T03:34:33Z
source last accessed on: 2019-06-07T09:41:30Z
label: Aérospatiale et Défense @fr
label: Aeroespaço e Defesa @pt
label: Aeronautica e difesa @it
label: Aerospace & Defense @en
label: Industria Aeronáutica y de Defensa @es
label: Luftfahrt & Verteidigung @de
label: Аэрокосмическая и оборонная промышленность @ru
label: 航空宇宙・防衛 @ja
label: 航空航天與國防
label: 우주항공과 국방 @ko
notation: 201010
valid from: 2016-09-01
valid till: 2018-09-29

建筑产品
type: GlobalIndustryClassificationStandardsClassifier
type: SubindustryClassifier
type: NamedIndividual
is contemporary version of: http://data.ga-group.nl/ics/gics/20102010
is replaced by: http://data.ga-group.nl/ics/gics/2018/20102010
is version of: http://data.ga-group.nl/ics/gics/20102010
replaces: http://data.ga-group.nl/ics/gics/2014/20102010
is subindustry of: 建筑产品
imported on: 2026-05-27T08:45:00.430Z
last refreshed on: 2026-05-31T09:56:29.350Z
source accessed on: 2017-10-19T03:34:33Z
source last accessed on: 2019-06-07T09:41:30Z
label: Baumaterialien @de
label: Building Products @en
label: Prodotti edili @it
label: Productos de Construcción @es
label: Produits pour l'Industrie du Bâtiment @fr
label: Produtos para Construção @pt
label: Производство строительных изделий @ru
label: 建築產品
label: 建設関連製品 @ja
label: 건축 제품 @ko
definition: Empresas de componentes de construção e de produtos e equipamento de renovação de casas. Exclui madeira serrada e compensados de madeira classificados na Sub-Indústria de Produtos Florestais, e cimento e outros materiais classificados na Sub-Indústria de Materiais de Construção. @pt
definition: Empresas dedicadas a la fabricación de componentes de construcción, productos y equipos para la restauración de edificios y casas. Se excluyen la madera y el contrachapado, clasificados en la rama Productos Madereros, y al cemento y otros materiales clasificados en la rama Materiales de Construcción. @es
definition: Fabricants d'éléments de construction, et d'équipements et de produits pour l’aménagement d’intérieur. Cette sous-industrie n'inclut pas les fabricants de bois de construction et de contreplaqué, classés dans la sous-industrie des Produits de la Forêt, et les fabricants de ciment et d'autres matériaux, classés dans la sous-industrie des Matériaux de Construction. @fr
definition: Hersteller von Baukomponenten und Heimwerkerprodukten und -ausrüstung. Ausgeschlossen sind Bau- und Sperrholz, die in die Branche „Forstprodukte“ fallen, sowie Zement und andere Materialien, die in die Branche „Baustoffe“ fallen. @de
definition: Manufacturers of building components and home improvement products and equipment. Excludes lumber and plywood classified under Forest Products and cement and other materials classified in the Construction Materials Sub-Industry. @en
definition: Società produttrici dei componenti per la costruzione e di prodotti e apparecchiature per l'edilizia. Sono esclusi il legname da costruzione e il legno compensato, classificati nel ramo Prodotti forestali, nonché il cemento e gli altri materiali classificati nel ramo Materiali edili. @it
definition: Производители строительных изделий и б��товых изделий и оборудования. В данную группу не входят производители изделий из древесины и фанеры, включенные в группу «Продукция лесного хозяйства», а также цемента и других материалов, включенные в подотрасль «Производство строительных материалов». @ru
definition: 制造建筑组件、家庭装潢用品及设备的公司。不包括归类于“林产品”子行业中的木材和胶合板以及归类于“建筑材料”子行业中的材料。
definition: 建設部品や増改築用製品・設備の製造会社。産業サブグループの「林産品」に分類される建材・合板、および「建設資材」に分類される他の資材は除く。 @ja
definition: 製造建築元件、家庭裝潢用品及設備的公司。不包括歸類於“林產品”子行業中的木材和膠合板以及歸類於“建築材料”子行業中的材料。
definition: 건축 부품과 주택 개량 제품 및 장비 제조업체. ‘임산물’로 분류되는 판재와 합판, 그리고 ‘건축 자재’로 분류되는 시멘트와 기타 자재는 제외. @ko
notation: 20102010
valid from: 2016-09-01
valid till: 2018-09-29

建筑产品
type: GlobalIndustryClassificationStandardsClassifier
type: IndustryClassifier
type: NamedIndividual
is contemporary version of: http://data.ga-group.nl/ics/gics/201020
is replaced by: http://data.ga-group.nl/ics/gics/2018/201020
is version of: http://data.ga-group.nl/ics/gics/201020
replaces: http://data.ga-group.nl/ics/gics/2014/201020
is industry of: 資本物品
imported on: 2026-05-27T08:45:00.430Z
last refreshed on: 2026-05-31T09:56:29.350Z
source accessed on: 2017-10-19T03:34:33Z
source last accessed on: 2019-06-07T09:41:30Z
label: Baumaterialien @de
label: Building Products @en
label: Prodotti edili @it
label: Productos de Construcción @es
label: Produits pour l'Industrie du Bâtiment @fr
label: Produtos para Construção @pt
label: Производство строительных изделий @ru
label: 建築產品
label: 建設関連製品 @ja
label: 건축 제품 @ko
notation: 201020
valid from: 2016-09-01
valid till: 2018-09-29

建筑与工程
type: GlobalIndustryClassificationStandardsClassifier
type: SubindustryClassifier
type: NamedIndividual
is contemporary version of: http://data.ga-group.nl/ics/gics/20103010
is replaced by: http://data.ga-group.nl/ics/gics/2018/20103010
is version of: http://data.ga-group.nl/ics/gics/20103010
replaces: http://data.ga-group.nl/ics/gics/2014/20103010
is subindustry of: 建筑与工程
imported on: 2026-05-27T08:45:00.430Z
last refreshed on: 2026-05-31T09:56:29.350Z
source accessed on: 2017-10-19T03:34:33Z
source last accessed on: 2019-06-07T09:41:30Z
label: Bau- & Ingenieurswesen @de
label: Construção e Engenharia @pt
label: Construcción e Ingeniería @es
label: Construction & Engineering @en
label: Construction et Ingénierie @fr
label: Costruzione e ingegneria @it
label: Строительство и монтаж инженерного оборудования @ru
label: 建築與工程
label: 建設・土木 @ja
label: 건설과 엔지니어링 @ko
definition: Companies engaged in primarily non-residential construction. Includes civil engineering companies and large-scale contractors. Excludes companies classified in the Homebuilding Sub-Industry. @en
definition: Empresas envolvidas principalmente em construção não residencial. Inclui empresas de engenharia civil e contratantes em grande escala. Exclui empresas classificadas na Sub-Indústria de Construção Residencial. @pt
definition: Empresas que operan fundamentalmente en el sector de la construcción no residencial. Se incluyen las empresas de ingeniería civil y grandes contratistas. Se excluyen las empresas clasificadas en la rama Construcción Residencial. @es
definition: Sociétés spécialisées principalement dans la construction non-résidentielle. Sont incluses les sociétés de génie civil et les entrepreneurs à grande échelle. Ne sont pas incluses les sociétés classées dans la sous-industrie de la Construction d’Habitations Résidentielles. @fr
definition: Società che operano principalmente nella costruzione non abitativa. Sono incluse le società di ingegneria civile e le imprese di costruzione su larga scala, mentre sono escluse le società classificate nel ramo Costruzione abitativa. @it
definition: Unternehmen, die hauptsächlich im gewerblichen Bauwesen tätig sind. Hierzu gehören u. a. Bauingenieursfirmen und Baugroßunternehmen. Ausgeschlossen sind Unternehmen, die der Branche „Wohnungsbau“ angehören. @de
definition: Компании, занимающиеся в основном строительством нежилых зданий и сооружений. В данную группу входят компании, занимающиеся проектированием и строительством гражданских объектов, а также крупные подрядчики. Не входят компании, включенные в подотрасль «Жилое строительство». @ru
definition: 主要从事非住宅建筑建造的公司。包括土木工程公司和大型承包商，但不包括那些归类于“住宅建筑”子行业中的公司。
definition: 主要從事非住宅建築建造的公司。包括土木工程公司和大型承包商，但不包括那些歸類於“住宅建築”子行業中的公司。
definition: 非居住用建物建設を主に行う会社。土木工事会社や大規模な建築工事請負業者を含む。産業サブグループの「住宅建設」に分類される会社は除く。 @ja
definition: 주로 비주택 건설과 관련된 기업. 토목공학 기업과 대규모 계약업체 포함. ‘주택 건설’로 분류되는 기업은 제외. @ko
notation: 20103010
valid from: 2016-09-01
valid till: 2018-09-29

建筑与工程
type: GlobalIndustryClassificationStandardsClassifier
type: IndustryClassifier
type: NamedIndividual
is contemporary version of: http://data.ga-group.nl/ics/gics/201030
is replaced by: http://data.ga-group.nl/ics/gics/2018/201030
is version of: http://data.ga-group.nl/ics/gics/201030
replaces: http://data.ga-group.nl/ics/gics/2014/201030
is industry of: 資本物品
imported on: 2026-05-27T08:45:00.430Z
last refreshed on: 2026-05-31T09:56:29.350Z
source accessed on: 2017-10-19T03:34:33Z
source last accessed on: 2019-06-07T09:41:30Z
label: Bau- & Ingenieurswesen @de
label: Construção e Engenharia @pt
label: Construcción e Ingeniería @es
label: Construction & Engineering @en
label: Construction et Ingénierie @fr
label: Costruzione e ingegneria @it
label: Строительство и монтаж инженерного оборудования @ru
label: 建築與工程
label: 建設・土木 @ja
label: 건설과 엔지니어링 @ko
notation: 201030
valid from: 2016-09-01
valid till: 2018-09-29

电气部件与设备
type: GlobalIndustryClassificationStandardsClassifier
type: SubindustryClassifier
type: NamedIndividual
is contemporary version of: http://data.ga-group.nl/ics/gics/20104010
is replaced by: http://data.ga-group.nl/ics/gics/2018/20104010
is version of: http://data.ga-group.nl/ics/gics/20104010
replaces: http://data.ga-group.nl/ics/gics/2014/20104010
is subindustry of: 电气设备
imported on: 2026-05-27T08:45:00.430Z
last refreshed on: 2026-05-31T09:56:29.350Z
source accessed on: 2017-10-19T03:34:33Z
source last accessed on: 2019-06-07T09:41:30Z
label: Componenti e apparecchiature elettriche @it
label: Composants et Équipement Électriques @fr
label: Electrical Components & Equipment @en
label: Elektrokomponenten & -geräte @de
label: Equipamento e Componentes Elétricos @pt
label: Equipos y Componentes Eléctricos @es
label: Производство электрооборудования и его частей @ru
label: 電器部件與設備
label: 電気部品・設備 @ja
label: 전기 부품과 장비 @ko
definition: Companies that produce electric cables and wires, electrical components or equipment not classified in the Heavy Electrical Equipment Sub-Industry. @en
definition: Empresas dedicadas a la fabricación de cables, equipos o componentes eléctricos no clasificados en la rama Equipos Eléctricos Pesados. @es
definition: Empresas que produzem cabos e fios elétricos, componentes elétricos ou equipamentos não classificados na Sub-Indústria de Equipamentos Elétricos Pesados. @pt
definition: Sociétés qui fabriquent des câbles et fils électriques, des composants et des équipement électriques, et qui ne sont pas classées dans la sous-industrie des Équipement Électriques Lourds. @fr
definition: Società produttrici di cavi, componenti o apparecchiature elettriche, non classificate nel ramo Apparecchiature elettriche pesanti. @it
definition: Unternehmen, die elektrische Kabel und Drähte, Elektrokomponenten oder -geräte herstellen und nicht der Branche „Elektrische Anlagen“ angehören. @de
definition: Производители электрических проводов и кабелей, частей или оборудования, не включенные в подотрасль «Производство тяжелого электрооборудования». @ru
definition: ‘중전기 장비’로 분류되지 않은 전기 케���블, 전선, 전기 부품, 장비를 생산하는 기업. @ko
definition: 生产电缆、电线、电气部件或设备（未归类于“重型电气设备”子行业）的公司。
definition: 生產電纜、電線、電氣部件或設備（未歸類於“重型電氣設備”子行業）的公司。
definition: 電気ケーブル・ワイヤ、電気部品・設備を製造する会社で、産業サブグループの「重電機設備」に分類されていない会社。 @ja
notation: 20104010
valid from: 2016-09-01
valid till: 2018-09-29

重型电气设备
type: GlobalIndustryClassificationStandardsClassifier
type: SubindustryClassifier
type: NamedIndividual
is contemporary version of: http://data.ga-group.nl/ics/gics/20104020
is replaced by: http://data.ga-group.nl/ics/gics/2018/20104020
is version of: http://data.ga-group.nl/ics/gics/20104020
replaces: http://data.ga-group.nl/ics/gics/2014/20104020
is subindustry of: 电气设备
imported on: 2026-05-27T08:45:00.430Z
last refreshed on: 2026-05-31T09:56:29.350Z
source accessed on: 2017-10-19T03:34:33Z
source last accessed on: 2019-06-07T09:41:30Z
label: Apparecchiature elettriche pesanti @it
label: Elektrische Anlagen @de
label: Equipamentos Elétricos Pesados @pt
label: Equipos Eléctricos Pesados @es
label: Heavy Electrical Equipment @en
label: Équipement Électriques Lourds @fr
label: Производство крупного электрооборудования @ru
label: 重型電氣設備
label: 重電機設備 @ja
label: 중전기 장비 @ko
definition: Empresas dedicadas a la fabricación de equipos generadores de energía y otros equipos eléctricos pesados, como turbinas de generación, maquinaria eléctrica pesada diseñada para uso fijo y sistemas eléctricos de gran tamaño. Se excluyen los cables, clasificados en la rama Equipo y componentes eléctricos. @es
definition: Fabricantes de equipamentos de geração de energia e outros equipamentos elétricos pesados, incluindo turbinas de geração de energia, maquinário elétrico pesado destinado a uso fixo e sistemas elétricos de grande porte. Exclui cabos e fios, classificados na Sub-Indústria de Equipamentos e Instrumentos Elétricos. @pt
definition: Fabricants de groupes électrogènes et d'autres équipements électriques lourds, y compris les fabricants de turbines électriques et de machines électriques lourdes destinées aux systèmes électriques fixes et de grande taille. Ne sont pas inclus les fabricants de câbles et de fils, classés dans la sous-industrie des Composants et Équipements Électriques. @fr
definition: Hersteller von Anlagen zur Stromerzeugung und anderen großen elektrischen Geräten, einschließlich Turbinen, elektrischen Großanlagen für stationären Einsatz und großen elektrischen Systemen. Ausgeschlossen sind Kabel und Drähte, die in die Branche „Elektrokomponenten & -geräte“ fallen. @de
definition: Manufacturers of power-generating equipment and other heavy electrical equipment, including power turbines, heavy electrical machinery intended for fixed-use and large electrical systems. Excludes cables and wires, classified in the Electrical Components & Equipment Sub-Industry. @en
definition: Società produttrici di apparecchi alimentatori e altre apparecchiature elettriche pesanti, comprese le turbomacchine, i macchinari elettrici pesanti fissi e i sistemi elettrici di grandi dimensioni. Sono esclusi i cavi elettrici, classificati nel ramo Componenti e apparecchiature elettriche. @it
definition: Производители электроэнергетического оборудования и другого тяжелого электрооборудования, в том числе силовых турбин, тяжелого электротехнического оборудования, предназначенного для стационарного использования и крупных электроэнергетических систем. В данную группу не входят производители проводов и кабелей, включенные в подотрасль «Производство электрооборудования и его частей». @ru
definition: 发电设备等重型电气设备制造商，这些设备包括动力涡轮机、 与固定使用和大型电气系统配套的重型电力机械。不包括归类于“电气部件与设备”子行业中的电缆和电线。
definition: 発電設備や他の重電機設備の製造会社。出力タービンや固定式重電機機器、大型電機システムを含む。産業サブグループの「電気部品・設備」に分類される電機ケーブル・��イヤは除く。 @ja
definition: 發電設備等重型電氣設備製造商，這些設備包括動力渦輪機、 與固定使用和大型電氣系統配套的重型電力機械。不包括歸類於“電氣部件與設備”子行業中的電纜和電線。
definition: 발전 터빈, 고정식 중전기 기계, 대형 전기 시스템을 포함한 발전 장비 및 기타 중전기 장비 제조업체. ‘전기 부품과 장비’로 분류되는 케이블과 전선은 제외. @ko
notation: 20104020
valid from: 2016-09-01
valid till: 2018-09-29

电气设备
type: GlobalIndustryClassificationStandardsClassifier
type: IndustryClassifier
type: NamedIndividual
is contemporary version of: http://data.ga-group.nl/ics/gics/201040
is replaced by: http://data.ga-group.nl/ics/gics/2018/201040
is version of: http://data.ga-group.nl/ics/gics/201040
replaces: http://data.ga-group.nl/ics/gics/2014/201040
is industry of: 資本物品
imported on: 2026-05-27T08:45:00.430Z
last refreshed on: 2026-05-31T09:56:29.350Z
source accessed on: 2017-10-19T03:34:33Z
source last accessed on: 2019-06-07T09:41:30Z
label: Apparecchiature elettriche @it
label: Electrical Equipment @en
label: Elektrische Geräte @de
label: Equipamento Elétrico @pt
label: Equipos Eléctricos @es
label: Équipement Électriques @fr
label: Производство электрооборудования @ru
label: 電気設備 @ja
label: 電氣設備
label: 전기 장비 @ko
notation: 201040
valid from: 2016-09-01
valid till: 2018-09-29

工业集团企业
type: GlobalIndustryClassificationStandardsClassifier
type: SubindustryClassifier
type: NamedIndividual
is contemporary version of: http://data.ga-group.nl/ics/gics/20105010
is replaced by: http://data.ga-group.nl/ics/gics/2018/20105010
is version of: http://data.ga-group.nl/ics/gics/20105010
replaces: http://data.ga-group.nl/ics/gics/2014/20105010
is subindustry of: 工业集团企业
imported on: 2026-05-27T08:45:00.430Z
last refreshed on: 2026-05-31T09:56:29.350Z
source accessed on: 2017-10-19T03:34:33Z
source last accessed on: 2019-06-07T09:41:30Z
label: Conglomérats Industriels @fr
label: Conglomerados Industriais @pt
label: Conglomerados Industriales @es
label: Conglomerati industriali @it
label: Industrial Conglomerates @en
label: Industriekonglomerate @de
label: Деятельность по управлению финансово - промышленными группами и холдинг - компаниями @ru
label: コングロマリット @ja
label: 工業集團企業
label: 복합 기업 @ko
definition: 3つ以上のセクターにまたがって事業展開している多角化企業で、利益が全体の半分以上を占める事業部門がないもの。経営決定権を持つ利害関係者によって大株主が構成され、利害関係者は持分に応じて子会社の経営に参画する権利を有する。 @ja
definition: Diversified industrial companies with business activities in three or more sectors, none of which contributes a majority of revenues. Stakes held are predominantly of a controlling nature and stake holders maintain an operational interest in the running of the subsidiaries. @en
definition: Diversifizierte Industrieunternehmen mit Geschäftsaktivitäten in drei oder mehr Sektoren, von denen keiner die Hauptanteile der Einnahmen erwirtschaftet. Die Art der vorhandenen Beteiligungen ist im wesentlichen die einer Kontrollfunktion, und die Anspruchsberechtigte betreiben die Niederlassungen aus betrieblichem Interesse. @de
definition: Empresas industriais diversificadas com atividades comerciais em três ou mais setores, nenhum dos quais contribui com a maior parte das rendas. Participações detidas são predominantemente de uma natureza de controle e os participantes mantêm um interesse operacional na administração das subsidiárias. @pt
definition: Empresas industriales diversificadas con actividades comerciales en tres o más sectores y cuya fuente principal de ingresos no puede atribuirse específicamente a un sector concreto. Las participaciones que tienen los accionistas de estas compañias son predominantemente de carácter estratégico y mantienen un interés operacional en la dirección de las subsidiarias. @es
definition: Sociétés industrielles diversifiées, ayant des activités commerciales dans au moins trois secteurs, sans qu'aucun de ces secteurs ne contribue à la majorité des revenus. Les participations sont pour la plupart de type majoritaire, tandis que les parties prenantes conservent un intérêt opérationnel dans la conduite des filiales. @fr
definition: Società industriali diversificate con attività commerciali in tre o più settori, nessuno dei quali contribuisce alla maggioranza dei ricavi. Le quote sono principalmente di controllo e gli azionisti mantengono un interesse operativo nella gestione delle affiliate. @it
definition: Диверсифицированные промышленные компании, осуществляющие хозяйственную деятельность в трех или более секторах, ни один из которых не обеспечивает основную долю выручки. Владельцам принадлежат в основном контрольные пакеты акций, акционеры заинтересованы в работе дочерн��х предприятий. @ru
definition: 同时在三个或更多经济领域内经营，但没有单个业务贡献一半以上收入的各种工业��业。企业所持有的股权主要是控股性质，并且股东乐于参与子公司的经营。
definition: 同時在三個或更多經濟領域內經營，但沒有單個業務貢獻一半以上收入的各種工業企業。企業所持有的股權主要是控股性質，並且股東樂於參與子公司的經營。
definition: 세 가지 또는 그 이상의 부문에서 사업 활동을 하며 어떤 단일 부문도 수익의 대부분을 차지하지 않는 다각화된 산업 기업. 소유한 주식은 주로 지배 성향을 지니며 주주는 자회사들의 운영에서 운영 관련 이해관계를 유지함. @ko
notation: 20105010
valid from: 2016-09-01
valid till: 2018-09-29

工业集团企业
type: GlobalIndustryClassificationStandardsClassifier
type: IndustryClassifier
type: NamedIndividual
is contemporary version of: http://data.ga-group.nl/ics/gics/201050
is replaced by: http://data.ga-group.nl/ics/gics/2018/201050
is version of: http://data.ga-group.nl/ics/gics/201050
replaces: http://data.ga-group.nl/ics/gics/2014/201050
is industry of: 資本物品
imported on: 2026-05-27T08:45:00.430Z
last refreshed on: 2026-05-31T09:56:29.350Z
source accessed on: 2017-10-19T03:34:33Z
source last accessed on: 2019-06-07T09:41:30Z
label: Conglomérats Industriels @fr
label: Conglomerados Industriais @pt
label: Conglomerados Industriales @es
label: Conglomerati industriali @it
label: Industrial Conglomerates @en
label: Industriekonglomerate @de
label: Деятельность по управлению финансово - промышленными группами и холдинг - компаниями @ru
label: コングロマリット @ja
label: 工業集團企業
label: 복합 기업 @ko
notation: 201050
valid from: 2016-09-01
valid till: 2018-09-29

建筑机械与重型卡车
type: GlobalIndustryClassificationStandardsClassifier
type: SubindustryClassifier
type: NamedIndividual
is contemporary version of: http://data.ga-group.nl/ics/gics/20106010
is replaced by: http://data.ga-group.nl/ics/gics/2018/20106010
is version of: http://data.ga-group.nl/ics/gics/20106010
replaces: http://data.ga-group.nl/ics/gics/2014/20106010
is subindustry of: 机械制造
imported on: 2026-05-27T08:45:00.430Z
last refreshed on: 2026-05-31T09:56:29.350Z
source accessed on: 2017-10-19T03:34:33Z
source last accessed on: 2019-06-07T09:41:30Z
label: Bau- und Schwerlastfahrzeuge @de
label: Construction Machinery & Heavy Trucks @en
label: Macchinari edili e Autocarri Pesanti @it
label: Machines de Construction et Camions Poids Lourd @fr
label: Maquinário de Construção e Caminhões Pesados @pt
label: Maquinaria de Construccion y Camiones Pesados @es
label: Производство машин для строительства, а также грузовых автомобилей большой грузоподъемности @ru
label: 建築機械與重型卡車
label: 建設機械・大型トラック @ja
label: 건설장비 & 대형 트럭 @ko
definition: Fabricantes de caminhões pesados, rolos compressores, equipamentos de construção e terraplanagem e fabricantes de partes relacionadas. Inclui construção naval não militar. @pt
definition: Fabricantes de camiones pesados, maquinaria de ruedas, equipos de construccion y excavacion y fabricantes de repuestos. Incluye los fabricantes de barcos no militares. @es
definition: Fabricants de camions de chantier, de machines de laminage, de matériels de terrassement et de construction, et fabricants de produits connexes. Est incluse la construction navale civile. @fr
definition: Hersteller von Schwerlastfahrzeugen, Walzen, Baggern, Baugeräten, schweren Landwirtschaftsmaschinen sowie Hersteller verwandter Teile. Hierzu gehört auch der Schiffbau für zivile Zwecke. @de
definition: Manufacturers of heavy duty trucks, rolling machinery, earth-moving and construction equipment, and manufacturers of related parts. Includes non-military shipbuilding. @en
definition: Società produttrici di autocarri per servizi pesanti, rullatrici, macchine di movimento terra e apparecchiature edili, e società produttrici di componenti per macchinari correlati. Comprende la costruzione non militare di navi. @it
definition: Производители грузовых автомобилей большой грузоподъемности, валковых машин, оборудования для земляных работ и строительства, производители соответствующих комплектующих. В данную группу входят производители судов гражданского назначения. @ru
definition: 大型トラック、圧延機、土木・建築設備および関連部品の製造会社。非軍事用造船を含む。 @ja
definition: 重型載重卡車、混凝土攪拌機、土方與建築用機械以及相關零部件製造商。包括非軍用造船企業。
definition: 重型载重卡车、混凝土搅拌机、土方与建筑用机械以及相关零部件制造商。包括非军用造船企业。
definition: 대형 트럭, 롤링 기계, 토공 장비, 건설 장비의 제조업체와 관련 부품 제조업체. 민간 조선업 포함. @ko
notation: 20106010
valid from: 2016-09-01
valid till: 2018-09-29

农用农业机械
type: GlobalIndustryClassificationStandardsClassifier
type: SubindustryClassifier
type: NamedIndividual
is contemporary version of: http://data.ga-group.nl/ics/gics/20106015
is replaced by: http://data.ga-group.nl/ics/gics/2018/20106015
is version of: http://data.ga-group.nl/ics/gics/20106015
replaces: http://data.ga-group.nl/ics/gics/2014/20106015
is subindustry of: 机械制造
imported on: 2026-05-27T08:45:00.430Z
last refreshed on: 2026-05-31T09:56:29.350Z
source accessed on: 2017-10-19T03:34:33Z
source last accessed on: 2019-06-07T09:41:30Z
label: Agricultural & Farm Machinery @en
label: Landwirtschafts- und Landmaschinen @de
label: Macchinari agricoli @it
label: Machines Agricoles @fr
label: Maquinário Agrícola e para Fazendas @pt
label: Maquinaria de Agricultura y Cultivo @es
label: Производство машинного оборудования для сельского хозяйства @ru
label: 農業機械 @ja
label: 農用農業機械
label: 농업 & 농장 기계 @ko
definition: Companies manufacturing agricultural machinery, farm machinery, and their related parts. Includes machinery used for the production of crops and agricultural livestock, agricultural tractors, planting and fertilizing machinery, fertilizer and chemical application equipment, and grain dryers and blowers. @en
definition: Empresas de fabricação de maquinário agrícola, máquinas para uso em fazendas, e suas partes relacionadas. Inclui maquinário utilizado na produção agropecuária y de colheitas, tratores agrícolas, maquinário de plantio e fertilização, e equipamento de aplicação de fertilizantes e produtos químicos, e secadores e aeradores de grãos. @pt
definition: Entreprises de production de machines agricoles et les pièces qui s’y rapportent. Sont inclus les machines utilisées pour la production des cultures et de bétail, les tracteurs agricoles, les planteuses et les fertiliseurs, les matériels d’épandage des engrais et des produits chimiques, les séchoirs et les ventilateurs à grain. @fr
definition: Fabricantes de maquinaria de agricultura, maquinaria de cultivo y repuestos. Incluye maquinaria utilizada para la produccion de sembrios y ganado, tractores, maquinaria de sembrado y fertilizacion, equipos de aplicacion de fertilizantes y químicos y ventiladores y secadoras de granos. @es
definition: Hersteller von Landwirtschafts- und Landmaschinen und verwandter Teile. Hierzu gehören Maschinen, die in der Herstellung von Ernten und in der Tierzucht eingesetzt werden sowie Landwirtschaftstraktoren, Sämaschinen und Düngerstreuer, Geräte für Dünger- und Pflanzenschutzanwendung, Getreidetrocknungs- und Gebläseanlagen. @de
definition: Società produttrici di macchinari agricoli e di componenti per macchinari agricoli. Tra cui macchinari utilizzati per la coltivazione e per il bestiame agricolo, trattori agricoli, macchinari per la fertilizzazione e la piantagione, apparecchiature per l'applicazione di fertilizzanti e agenti chimici, essiccatoi e soffiatori per cereali. @it
definition: Производители машинного оборудования для сельского хозяйства и его комплектующих. В данную группу входят производители оборудования, используемого в производстве сельскохозяйственных культур и скота, производители сельскохозяйственных тракторов, посевной и почвообрабатывающей сельскохозяйственной техники, оборудования для применения удобрений и химических веществ, зерносушилок и воздуходувок. @ru
definition: 农业畜牧业用大型机械及部件生产企业。包含农用谷物脱壳机，农用拖拉机，播种施肥及收割机和谷物干燥及扬风机制造企业。
definition: 大型農業機械及び関連部品の製造会社。作物や農業畜産、農業用トラクター、田植えや施肥機械、化学肥料機器、穀物乾燥機、送風機の製造会社を含む。 @ja
definition: 農業畜牧业用大型機械及部件生產企業。包含農用穀物脫殼機、農用拖拉機、播種施肥及收割機和穀物乾燥及揚風機製造商。
definition: 농업 기계, 농장 기계, 관련 부품을 생산하는 ��업. 곡물과 농축산물 생산에 사용되는 장비, 농경용 트랙터, 식목과 비료 살포 장비, 비료와 화학적 응용 장비, 곡물 건조기, 송풍기 등 포함 @ko
notation: 20106015
valid from: 2016-09-01
valid till: 2018-09-29

工业机械
type: GlobalIndustryClassificationStandardsClassifier
type: SubindustryClassifier
type: NamedIndividual
is contemporary version of: http://data.ga-group.nl/ics/gics/20106020
is replaced by: http://data.ga-group.nl/ics/gics/2018/20106020
is version of: http://data.ga-group.nl/ics/gics/20106020
replaces: http://data.ga-group.nl/ics/gics/2014/20106020
is subindustry of: 机械制造
imported on: 2026-05-27T08:45:00.430Z
last refreshed on: 2026-05-31T09:56:29.350Z
source accessed on: 2017-10-19T03:34:33Z
source last accessed on: 2019-06-07T09:41:30Z
label: Industrial Machinery @en
label: Industriemaschinen @de
label: Macchinari industriali @it
label: Machines Industrielles @fr
label: Maquinário Industrial @pt
label: Maquinaria Industrial @es
label: Производство промышленных машин и оборудования @ru
label: 工業機械
label: 産業機械 @ja
label: 산업용 기계 @ko
definition: Empresas dedicadas a la fabricación de maquinaria y componentes industriales. Se incluyen las prensas, herramientas para maquinaria, compresores, equipo para el control de la contaminación, ascensores, escaleras mecánicas, aislantes, bombas, rodamientos y otra maquinaria metálica. @es
definition: Fabricantes de maquinário industrial e componentes industriais. Inclui empresas que fabricam prensas, ferramentas para máquinas, compressores, equipamentos de controle de poluição, elevadores, escadas rolantes, isoladores, bombas, rolamentos e outras fabricações de metal. @pt
definition: Fabricants de machines et de composants industriels. Sont incluses les sociétés qui fabriquent des presses, des machines-outils, des compresseurs, du matériel de contrôle de la pollution, des ascenseurs, des escaliers mécaniques, des isolateurs, des pompes, des roulements à rouleaux et autres constructions métalliques. @fr
definition: Hersteller von Industriemaschinen und Industriekomponenten. Hierzu gehören auch Hersteller von Pressen, Werkzeugmaschinen, Kompressoren, Geräten für den Umweltschutz, Aufzügen, Rolltreppen, Isolatoren, Pumpen, Rollenlagern und anderen Metallprodukten. @de
definition: Manufacturers of industrial machinery and industrial components. Includes companies that manufacture presses, machine tools, compressors, pollution control equipment, elevators, escalators, insulators, pumps, roller bearings and other metal fabrications. @en
definition: Società produttrici di macchinari e componenti industriali. Sono incluse le società che producono presse, macchine utensili, compressori, apparecchiature per il controllo dell'inquinamento, elevatori, scale mobili, materiali isolanti, pompe, cuscinetti a rulli e altri prodotti metallici. @it
definition: Производители промышленных машин и оборудования, а также их частей. В данную группу входят компании, занимающиеся производством прессов, станков, компрессоров, оборудовани�� для контроля загрязнения окружающей среды, подъемников, эскалаторов, изоляторов, насосов, подшипников и других металлических изделий. @ru
definition: 工业机械与部件制造商。包括那些制造冲床、机床、压缩机、污染控制设备、电梯、电动扶梯、绝缘器、泵、滚柱轴承以及其它金属预制件的公司。
definition: 工業機械與部件製造商。包括那些製造衝床、機床、壓縮機、污染控制設備、電梯、電動扶梯、絕緣器、泵、滾柱軸承以及其他金屬預製件的公司。
definition: 産業機械および産業部品の製造会社。プレス、工作機械、圧���機、公害防止設備、エレベータ、エスカレータ、絶縁器、吸水器、軸受けおよびその他の金属加工物を製造する会社を含む。 @ja
definition: 산업용 기계와 산업용 부품 제조업체. 프레스, 머신툴, 압축기, 오염 통제 장비, 엘리베이터, 에스컬레이터, 절연체, 펌프, 롤러 베어링, 기타 금속 제작물을 제조하는 기업 포함. @ko
notation: 20106020
valid from: 2016-09-01
valid till: 2018-09-29

机械制造
type: GlobalIndustryClassificationStandardsClassifier
type: IndustryClassifier
type: NamedIndividual
is contemporary version of: http://data.ga-group.nl/ics/gics/201060
is replaced by: http://data.ga-group.nl/ics/gics/2018/201060
is version of: http://data.ga-group.nl/ics/gics/201060
replaces: http://data.ga-group.nl/ics/gics/2014/201060
is industry of: 資本物品
imported on: 2026-05-27T08:45:00.430Z
last refreshed on: 2026-05-31T09:56:29.350Z
source accessed on: 2017-10-19T03:34:33Z
source last accessed on: 2019-06-07T09:41:30Z
label: Macchinari @it
label: Machinery @en
label: Machines @fr
label: Maquinário @pt
label: Maquinarias @es
label: Maschinen @de
label: Машиностроение @ru
label: 機械 @ja
label: 機械製造
label: 기계 @ko
notation: 201060
valid from: 2016-09-01
valid till: 2018-09-29

貿易公司與經銷商
type: GlobalIndustryClassificationStandardsClassifier
type: SubindustryClassifier
type: NamedIndividual
is contemporary version of: http://data.ga-group.nl/ics/gics/20107010
is replaced by: http://data.ga-group.nl/ics/gics/2018/20107010
is version of: http://data.ga-group.nl/ics/gics/20107010
replaces: http://data.ga-group.nl/ics/gics/2014/20107010
is subindustry of: 貿易公司與經銷商
imported on: 2026-05-27T08:45:00.430Z
last refreshed on: 2026-05-31T09:56:29.350Z
source accessed on: 2017-10-19T03:34:33Z
source last accessed on: 2019-06-07T09:41:30Z
label: Comercio y Distribución @es
label: Empresas de Comércio e Distribuidores @pt
label: Handels- & Vertriebsunternehmen @de
label: Sociétés Commerciales et Distributeurs Commerciaux @fr
label: Società di trading e distributori @it
label: Trading Companies & Distributors @en
label: Торговые компании и дистрибьюторы @ru
label: 商社・流通業 @ja
label: 贸易公司与经销商
label: 무역 회사와 판매업체 @ko
definition: Empresas de comércio e outros distribuidores de equipamentos e produtos industriais. @pt
definition: Empresas dedicadas al comercio y distribución de productos y equipos industriales. @es
definition: Handels- und andere Vertriebsunternehmen von Industrieausrüstung und -produkten. @de
definition: Sociétés commerciales et autres distributeurs d'équipements et de produits industriels. @fr
definition: Società di trading e altri distributori di apparecchiature e prodotti industriali. @it
definition: Trading companies and other distributors of industrial equipment and products. @en
definition: Торговые компании и другие дистрибьюторы промышленного оборудования и изделий. @ru
definition: 商社および産業設備や製品を取り扱うその他流通業社。 @ja
definition: 貿易公司以及其他工業設備和產品的經銷商。
definition: 贸易公司以及其它工业设备和产品的经销商。
definition: 산업용 장비와 제품의 무역 회사 및 기타 판매업체. @ko
notation: 20107010
valid from: 2016-09-01
valid till: 2018-09-29

貿易公司與經銷商
type: GlobalIndustryClassificationStandardsClassifier
type: IndustryClassifier
type: NamedIndividual
is contemporary version of: http://data.ga-group.nl/ics/gics/201070
is replaced by: http://data.ga-group.nl/ics/gics/2018/201070
is version of: http://data.ga-group.nl/ics/gics/201070
replaces: http://data.ga-group.nl/ics/gics/2014/201070
is industry of: 資本物品
imported on: 2026-05-27T08:45:00.430Z
last refreshed on: 2026-05-31T09:56:29.350Z
source accessed on: 2017-10-19T03:34:33Z
source last accessed on: 2019-06-07T09:41:30Z
label: Comercio y Distribución @es
label: Empresas de Comércio e Distribuidores @pt
label: Handels- & Vertriebsunternehmen @de
label: Sociétés Commerciales et Distributeurs Commerciaux @fr
label: Società di trading e distributori @it
label: Trading Companies & Distributors @en
label: Торговые компании и дистрибьюторы @ru
label: 商社・流通業 @ja
label: 贸易公司与经销商
label: 무역 회사와 판매업체 @ko
notation: 201070
valid from: 2016-09-01
valid till: 2018-09-29

資本物品
type: GlobalIndustryClassificationStandardsClassifier
type: IndustryGroupClassifier
type: NamedIndividual
is contemporary version of: http://data.ga-group.nl/ics/gics/2010
is replaced by: http://data.ga-group.nl/ics/gics/2018/2010
is version of: http://data.ga-group.nl/ics/gics/2010
replaces: http://data.ga-group.nl/ics/gics/2014/2010
is industry group of: 工业
imported on: 2026-05-27T08:45:00.430Z
last refreshed on: 2026-05-31T09:56:29.350Z
source accessed on: 2017-10-19T03:34:33Z
source last accessed on: 2019-06-07T09:41:30Z
label: Beni strumentali @it
label: Bens de capital @pt
label: Bienes de Equipo @es
label: Biens d'Équipement @fr
label: Capital Goods @en
label: Investitionsgüter @de
label: Товары производственного назначения @ru
label: 資本財 @ja
label: 资本品
label: 자본재 @ko
notation: 2010
valid from: 2016-09-01
valid till: 2018-09-29

商业印刷
type: GlobalIndustryClassificationStandardsClassifier
type: SubindustryClassifier
type: NamedIndividual
is contemporary version of: http://data.ga-group.nl/ics/gics/20201010
is replaced by: http://data.ga-group.nl/ics/gics/2018/20201010
is version of: http://data.ga-group.nl/ics/gics/20201010
replaces: http://data.ga-group.nl/ics/gics/2014/20201010
is subindustry of: 商业服务与商业用品
imported on: 2026-05-27T08:45:00.430Z
last refreshed on: 2026-05-31T09:56:29.350Z
source accessed on: 2017-10-19T03:34:33Z
source last accessed on: 2019-06-07T09:41:30Z
label: Commercial Printing @en
label: Impresión Comercial @es
label: Impressão Comercial @pt
label: Imprimerie Commerciale @fr
label: Kommerzielle Druckereien @de
label: Stampa commerciale @it
label: Изготовление коммерческой печатной продукции @ru
label: 商業印刷
label: 상업용 인쇄 @ko
definition: Companies providing commercial printing services. Includes printers primarily serving the media industry. @en
definition: Empresas dedicadas a servicios de impresión comercial. Se incluyen las empresas que ofrecen servicios de impresión a medios de comunicación. @es
definition: Provedores de serviços de impressão comercial. Inclui impressoras que servem principalmente à indústria da mídia. @pt
definition: Sociétés qui fournissent des services d'impression commerciale. Sont incluses les imprimeries qui travaillent principalement pour l'industrie des médias. @fr
definition: Società di servizi di stampa commerciale. Sono inclusi i servizi di stampa che servono principalmente l'industria dei mezzi di comunicazione. @it
definition: Unternehmen, die kommerzielle Druckdienstleistungen anbieten. Eingeschlossen sind Druckereien, die hauptsächlich für die Medienindustrie arbeiten und der Branche „Verlags- und Druckwesen“ angehören. @de
definition: Компании, оказывающие услуги по изготовлению коммерческой печатной продукции, в том числе типографии, занимающиеся в основном обслуживанием средств массовой информации. @ru
definition: 商業印刷サービスを提供する会社。主にマスコミ業界の下請けを行う印刷業者を含む。 @ja
definition: 提供商业印刷服务的公司。包括那些���要服务于媒体业的印刷公司。(printers here refers to printing companies)
definition: 提供商業印刷服務的公司。包括那些主要服務於媒體業的印刷公司。
definition: 상업용 인쇄 서비스를 제공하는 회사. 주로 미디어 산업을 대상으로 하는 인쇄업체. @ko
notation: 20201010
valid from: 2016-09-01
valid till: 2018-09-29

环境与设施服务
type: GlobalIndustryClassificationStandardsClassifier
type: SubindustryClassifier
type: NamedIndividual
is contemporary version of: http://data.ga-group.nl/ics/gics/20201050
is replaced by: http://data.ga-group.nl/ics/gics/2018/20201050
is version of: http://data.ga-group.nl/ics/gics/20201050
replaces: http://data.ga-group.nl/ics/gics/2014/20201050
is subindustry of: 商业服务与商业用品
imported on: 2026-05-27T08:45:00.430Z
last refreshed on: 2026-05-31T09:56:29.350Z
source accessed on: 2017-10-19T03:34:33Z
source last accessed on: 2019-06-07T09:41:30Z
label: Environmental & Facilities Services @en
label: Serviços Ambientais e Instalações @pt
label: Services liés à l’Environnement et aux Locaux @fr
label: Servicios e Instalaciones Medioambientales @es
label: Servizi ambientali e manutenzione impianti @it
label: Umwelt- und Anlagendienste @de
label: Предоставление услуг по охране окружающей среды и обслуживанию объектов @ru
label: 環境與設施服務
label: 環境関連・ファシリティサービス @ja
label: 환경 및 시설 서비스 @ko
definition: Anbieter von Umweltdiensten und Anlagenwartungsdiensten. Hierzu gehören auch Abfallwirtschaft, Gebäudeverwaltung und Unternehmen, die im Umweltschutz tätig sind. Ausgeschlossen sind Großkläranlagen, die der Branche „Wasserversorgungsbetriebe“ angehören. @de
definition: Companies providing environmental and facilities maintenance services. Includes waste management, facilities management and pollution control services. Excludes large-scale water treatment systems classified in the Water Utilities Sub-Industry. @en
definition: Empresas provedoras de serviços ambientais e manutenção de instalações. Inclui serviços de gestão de resíduos, gestão de instalações e controle de poluição. Exclui sistemas de tratamento de água em larga escala, classificados na Sub-Indústria de Serviços de Água. @pt
definition: Empresas que proporcionan servicios medioambientales. Se incluyen los servicios de tratamiento de residuos y de control de la contaminación. Se excluyen los sistemas de tratamiento de agua a gran escala clasificados en la rama Suministro de Agua. @es
definition: Sociétés qui fournissent des services liés à l'environnement et à l'entretien des locaux. Sont incluses les services de gestion des déchets, de gestion des installations et de contrôle de la pollution. Ne sont pas incluses les entreprises spécialisées dans les systèmes de traitement de l'eau à grande échelle, classés dans la sous-industrie des Compagnies des Eaux. @fr
definition: Società che forniscono servizi di manutenzione ambientale e degli impianti. Comprende la gestione dei rifiuti, la gestione degli impianti e i servizi di controllo dell'inquinamento. Sono esclusi i sistemi su larga scala per la purificazione idrica classificati nel ramo Servizi idrici. @it
definition: Компании, предоставляющие услуги по охране окружающей среды и техническому обслуживанию объектов, в том числе по организации сбора и вывоза отходов, управлению объектами и контролю уровня загрязнения окружающей среды. В данную группу не входят крупные водоочистные системы, которые включены в подотрасль «Коммунальное водоснабжение». @ru
definition: 提供环境服务与环境设施维护服务的公司。这些服务包括废物处理、设施管理和污染控制服务。不包括归类于“水公用事业”子行业中的大型水处理系统。
definition: 提供環境服務與環境設施維護服務的公司。這些服務包括廢物處理、設施管理和污染控制服務。不包括歸類于“水公用事業”子行業中的大型水處理系統。
definition: 環境関連およびファシリティ管理サービスを提供する会社。廃棄物管理、ファシリティ管理、公害防止サービスを含む。産業サブグループの「水道」に分類される大規模な水処理システムは除く。 @ja
definition: 환경 및 시설 유지관리 서비스를 제공하는 회사. 폐기물 관리, 시설 관리, 오염 통제 서비스를 포함. '수도 공익 사��체'로 분류되는 대규모 수처리 시스템은 제외. @ko
notation: 20201050
valid from: 2016-09-01
valid till: 2018-09-29

办公服务与用品
type: GlobalIndustryClassificationStandardsClassifier
type: SubindustryClassifier
type: NamedIndividual
is contemporary version of: http://data.ga-group.nl/ics/gics/20201060
is replaced by: http://data.ga-group.nl/ics/gics/2018/20201060
is version of: http://data.ga-group.nl/ics/gics/20201060
replaces: http://data.ga-group.nl/ics/gics/2014/20201060
is subindustry of: 商业服务与商业用品
imported on: 2026-05-27T08:45:00.430Z
last refreshed on: 2026-05-31T09:56:29.350Z
source accessed on: 2017-10-19T03:34:33Z
source last accessed on: 2019-06-07T09:41:30Z
label: Bürodienste & -bedarf @de
label: Office Services & Supplies @en
label: Serviços e Suprimentos de Escritório @pt
label: Services et fournitures de Bureau @fr
label: Servizi e forniture per ufficio @it
label: Suministros y Servicios de Oficina @es
label: Предоставление услуг и производство товаров для офиса @ru
label: 事務サービス・用品 @ja
label: 辦公服務與用品
label: 사무 서비스와 사무용품 @ko
definition: Anbieter von Bürodiensten und Hersteller von Bürobedarf und -geräten, die keiner der übrigen Branchen angehören. @de
definition: Empresas que proporcionan servicios o fabrican equipo de oficina, no incluidas en otra clasificación. @es
definition: Provedores de serviços de escritório e fabricantes de suprimentos de escritório e equipamento não classificados em nenhum outro lugar. @pt
definition: Providers of office services and manufacturers of office supplies and equipment not classified elsewhere. @en
definition: Servizi per ufficio e produttori di forniture e attrezzature per ufficio non classificati altrove. @it
definition: Sociétés qui fournissent des services pour le bureau et fabricants de fournitures et d'équipements de bureau, n'appartenant à aucune autre classification. @fr
definition: Компании, предоставляющие услуги для офиса, и производители материалов и оборудов��ния для офиса, не включенные в другие группы. @ru
definition: 事務サービスの提供業者、および他のグループに分類されていないオフィス用品・���備を製造する会社。 @ja
definition: 提供办公服务的公司以及制造办公用品和设备（未归类于别处）的公司。
definition: 提供辦公服務的公司以及製造辦公用品和設備（未歸類於別處）的公司。
definition: 사무 서비스 제공업체, 다른 부문으로 분류되지 않은 사무용품 및 장비 제조업체. @ko
notation: 20201060
valid from: 2016-09-01
valid till: 2018-09-29

綜合支持服務
type: GlobalIndustryClassificationStandardsClassifier
type: SubindustryClassifier
type: NamedIndividual
is contemporary version of: http://data.ga-group.nl/ics/gics/20201070
is replaced by: http://data.ga-group.nl/ics/gics/2018/20201070
is version of: http://data.ga-group.nl/ics/gics/20201070
replaces: http://data.ga-group.nl/ics/gics/2014/20201070
is subindustry of: 商业服务与商业用品
imported on: 2026-05-27T08:45:00.430Z
last refreshed on: 2026-05-31T09:56:29.350Z
source accessed on: 2017-10-19T03:34:33Z
source last accessed on: 2019-06-07T09:41:30Z
label: Diverse unterstützende Dienste @de
label: Diversified Support Services @en
label: Serviços de Suporte Diversificados @pt
label: Services d'Aide Divers @fr
label: Servicios de Apoyo Diversificados @es
label: Servizi di assistenza diversificati @it
label: Предоставление диверсифицированных вспомогательных услуг @ru
label: 各種支援サービス @ja
label: 综合支持服务
label: 다양한 지원 서비스 @ko
definition: Companies primarily providing labor oriented support services to businesses and governments. Includes commercial cleaning services, dining & catering services, equipment repair services, industrial maintenance services, industrial auctioneers, storage & warehousing, transaction services, uniform rental services, and other business support services. @en
definition: Empresas provedoras principalmente de serviços de suporte a trabalho orientado a empresas e governos. Inclui serviços de limpeza comercial, serviços de refeições e de catering, serviços de reparo de equipamentos, serviços de manutenção industrial, leiloeiros industriais, armazenagem e depósitos, serviços de transações, serviços de aluguel de uniformes, e outros serviços de suporte a empresas. @pt
definition: Empresas que proporcionan principalmente servicios de apoyo orientados a la mano de obra, para empresas y gobiernos. Incluye servicios de limpieza comercial, servicios de comidas y catering, servicios de reparación de equipos, servicios de mantenimiento industrial, subastadores industriales, almacenamiento y depósito, servicios de transacción, servicios de alquiler de uniformes y otros servicios de apoyo a las empresas. @es
definition: Sociétés qui fournissent principalement des services d'aide orientés sur la main-d'œuvre aux entreprises et aux gouvernements. Sont inclus les services de nettoyage commercial, les services de restauration et de traiteur, les services de réparation de matériel, les services de maintenance industrielle, les services de commissaire-priseur industriel, de stockage et d'entrepôt, de transaction, les services de location de vêtements de travail et autres services d'aide aux entreprises. @fr
definition: Società che si occupano principalmente della fornitura di servizi di assistenza labor oriented ad altre società e strutture governative. Sono inclusi servizi di pulizia, di catering, riparazione di apparecchiature, manutenzione industriale, banditori d'asta industriale, stoccaggio e immagazzinamento, servizi di transazione, servizi di affitto uniformi e altri servizi di assistenza alle imprese. @it
definition: Unternehmen, die hauptsächlich Labororientierte Dienste für Unternehmen und die Regierung anbieten. Eingeschlossen sind auch kommerzielle Reinigungsunternehmen, Restaurant- und Cateringdienste, Gerätereparatur-Anbieter, gewerbliche Wartungsdienste, gewerbliche Auktionshäuser, Aufbewahrung und Lagerung, Abwicklungsdienste, einheitliche Verleihdienste und andere Unternehmensdienste. @de
definition: Компании, занимающиеся в основном предоставлением услуг по поддержке бизнеса в сфере трудовых ресурсов коммерческим предприятиям и государственным организациям. В данную группу входят компании, оказывающие услуги по уборке коммерческой недвижимости, организации питания, ремонту и техническому обслуживанию оборудования, проведению промышленных аукционов, складские услуги, транзакционные услуги, услуги по прокату форме��ной одежды и другие вспомогательные услуги для бизнеса. @ru
definition: 主要向企业和政府提供劳动力支持的公司。包括商业清洁服务、餐饮服务、修理设备、工业维护、工业拍卖、存储和仓储、运输服务、制服租赁和其他商业支持服务。
definition: 主要向企業和政府提供勞動力支援的公司。包括商業清潔服務、餐飲服務、修理設備、工業維護、工業拍賣、存儲和倉儲、運輸服務、制服租賃和其他商業支援服務。
definition: 民間企業や政府に対して労働力を中心とする支援サービスを主に提供する会社。商業クリーニングサービス、飲食業・宅配サービス、機器修理サービス、産業保守サービス、産業オークション、保管・倉庫業、取引サービス、制服貸与サービス、その他支援サービスを含む。 @ja
definition: 기업 및 정부에 노동 위주의 지원 서비스를 주로 제공하는 회사. 상업적인 청소 서비스, 식사 및 케이터링 서비스, 장비 수리 서비스, 산업 유지보수 서비스, 산업 경매인, 보관 및 창고, 거래 서비스, 유니폼 대여 서비스, 기타 사업 지원 서비스를 포함. @ko
notation: 20201070
valid from: 2016-09-01
valid till: 2018-09-29

安全和报警服务
type: GlobalIndustryClassificationStandardsClassifier
type: SubindustryClassifier
type: NamedIndividual
is contemporary version of: http://data.ga-group.nl/ics/gics/20201080
is replaced by: http://data.ga-group.nl/ics/gics/2018/20201080
is version of: http://data.ga-group.nl/ics/gics/20201080
replaces: http://data.ga-group.nl/ics/gics/2014/20201080
is subindustry of: 商业服务与商业用品
imported on: 2026-05-27T08:45:00.430Z
last refreshed on: 2026-05-31T09:56:29.350Z
source accessed on: 2017-10-19T03:34:33Z
source last accessed on: 2019-06-07T09:41:30Z
label: Security & Alarm Services @en
label: Serviços de segurança e alarmes @pt
label: Services de Sécurité et d'Alarme @fr
label: Servicios de Seguridad y Alarmas @es
label: Servizi di sicurezza @it
label: Sicherheits- und Alarmdienste @de
label: Предоставление услуг по охране @ru
label: セキュリティ・警報装置サービス @ja
label: 安全與報警服務
label: 보안 및 경보 서비스 @ko
definition: Companies providing security and protection services to business and governments. Includes companies providing services such as correctional facilities, security & alarm services, armored transportation & guarding. Excludes companies providing security software classified under the Systems Software Sub-Industry and home security services classified under the Specialized Consumer Services Sub-Industry. Also excludes companies manufacturing security system equipment classified under the Electronic Equipment & Instruments Sub-Industry. @en
definition: Empresas provedoras de serviços de segurança e de proteção a empresas e governos. Inclui empresas provedoras de serviços, tais como estabelecimentos prisionais, serviços de segurança e de alarme, transporte blindado e vigilância. Exclui empresas provedoras de software de segurança classificadas na Sub-Indústria de Software de Sistemas e serviços de segurança residenciais classificados na Sub-Indústria de Serviços Especializados ao Consumidor. Também exclui empresas que fabricam equipamentos de sistema de segurança classificadas na Sub-Indústria de Equipamentos e Instrumentos Eletrônicos. @pt
definition: Empresas que proporcionan servicios de seguridad y protección a empresas y gobiernos. Incluye empresas que proporcionan servicios como instalaciones correccionales, servicios de seguridad y alarmas, transporte blindado y guardias. Se excluyen empresas que proporcionan programas informáticos de seguridad, clasificadas en la rama de Software de Sistemas y los servicios de seguridad doméstica, clasificados en la rama de Servicios de Consumo Especializados. También se excluyen empresas fabricantes de equipo para sistemas de seguridad, clasificadas en la rama de Equipo e Instrumentos Electrónicos. @es
definition: Sociétés qui fournissent des services de sécurité et de protection aux entreprises et aux gouvernements. Sont incluses les sociétés qui fournissent des services tels que les établissements correctionnels, les services de sécurité et d'alarme, le transport de fonds par fourgon blindé et le gardiennage. Ne sont pas incluses les sociétés qui fournissent des logiciels de sécurité classés dans la sous-industrie des Logiciels Système et les services de sécurité à domicile classés dans la sous-industrie des Services consommateurs spécialisés. Ne sont également pas incluses les sociétés qui fabriquent du matériel dédié aux systèmes de sécurité classés dans la sous-industrie de l’Equipement et Instruments Electroniques. @fr
definition: Società che forniscono servizi di sicurezza e protezione ad altre società e strutture governative. Sono incluse le società che forniscono servizi quali carceri, servizi di sicurezza, sorveglianza e trasporto armati. Sono escluse le società che forniscono software di sicurezza classificate nel ramo Software di sistema e sicurezza domestica classificate nel ramo Servizi specializzati al consumatore. Sono inoltre escluse le società che producono apparecchiature per sistemi di sicurezza classificate nel ramo Strumenti e apparecchiature elettronici. \n @it
definition: Unternehmen, die Sicherheitsdienste für Unternehmen und die Regierung anbieten. Eingeschlossen sind Unternehmen wie Justizvollzugsanstalten, Sicherheits- und Alarmdienste und gesicherter Transport und Bewachung. Ausgeschlossen sind Unternehmen, die Sicherheits-Software, die unter die System Software Branche fallen, und Heimsicherheitsdienste, die unter die spezielle Verbraucherdienst Branche fallen, anbieten. Auch ausgeschlossen sind Unternehmen, die Sicherheitssystemgeräte herstellen, die unter die Branche elektronische Geräte und Apparate fallen. @de
definition: Компании, занимающиеся предоставлением услуг по защите и охране коммерческим предприятиям и государственным организациям. В данную группу входят компании, оказывающие услуги, связанные с работой исправительных учреждений, охраной, услуги транспортировки на бронированном транспорте и вооруженного сопровождения. В данную группу не входят компании, оказывающие услуги программного обеспечения систем безопасности, включенные в подотрасль «Производство системного программного обеспечения», и бытовые охранные услуги, включенные в подотрасль «Специализированные потребительские услуги», а также компании, занимающиеся производством оборудования для систем безопасности, включенные в подотрасль «Электронное оборудование и приборы». @ru
definition: 向企业和政府提供安全和保护服务的公司。包括提供设备修正、安全和报警服务、武装押运服务的公司。但不包括提��安全软件（归类于系统软件子行业）和家庭安全服务（归类于特殊消费服务子行业）的公司。也不包括制造安全系统设备的公司（归类于电子设备和仪器子行业）。
definition: 向企業和政府提供安全和保護服務的公司。包括提供設備修正、安全和報警服務、武裝押運服務的公司。但不包括提供安全軟體（歸類於系統軟體子行業）和家庭安全服務（歸類于特殊客戶服務子行業）的公司。也不包括製造安全系統設備的公司（歸類於電子設備和儀器子行業）。
definition: 民間企業や政府に対してセキュリティおよび警備サービスを提供する会社。更正施設、セキュリティ・警報装置サービス、護送・警護などのサービスを提供する会社を含む。産業サブグループの「システム・ソフトウェア」に分類されるセキュリティソフトウェアを提供する会社、産業サブグループの「専門消費者サービス」に分類されるホームセキュリティサービスを提供する会社は除く。また、産業サブグループの「電子装置・機器」に分類されるセキュリティシステム機器を製造する会社も除く。 @ja
definition: 기업 및 정부에 보안 및 보호 서비스를 제공하는 회사. 교정 시설, 보안 및 경보 서비스, 무장 수송 및 경호와 같은 서비스를 제공하는 회사 포함. '시스템 소프트웨어'로 분류되는 보안 소프트웨어를 제공하는 회사와 '특화된 ��비자 서비스'로 분류되는 가정 보안 서비스는 제외. '전자 장비와 기기'로 분류되는 보안 시스템 장비를 제조하는 회사 또한 제외. @ko
notation: 20201080
valid from: 2016-09-01
valid till: 2018-09-29

商业服务与商业用品
type: GlobalIndustryClassificationStandardsClassifier
type: IndustryClassifier
type: NamedIndividual
is contemporary version of: http://data.ga-group.nl/ics/gics/202010
is replaced by: http://data.ga-group.nl/ics/gics/2018/202010
is version of: http://data.ga-group.nl/ics/gics/202010
replaces: http://data.ga-group.nl/ics/gics/2014/202010
is industry of: 商业和专业服务
imported on: 2026-05-27T08:45:00.430Z
last refreshed on: 2026-05-31T09:56:29.350Z
source accessed on: 2017-10-19T03:34:33Z
source last accessed on: 2019-06-07T09:41:30Z
label: Commercial Services & Supplies @en
label: Gewerbliche Dienste & Betriebsstoffe @de
label: Serviços Comerciais e Suprimentos @pt
label: Services et Fournitures Commerciales @fr
label: Servizi e forniture commerciali @it
label: Suministros y Servicios Comerciales @es
label: Коммерческие услуги и поставки @ru
label: 商業サービス・用品 @ja
label: 商業服務與商業用品
label: 상업 서비스와 공급품 @ko
notation: 202010
valid from: 2016-09-01
valid till: 2018-09-29

人力資源與就業服務
type: GlobalIndustryClassificationStandardsClassifier
type: SubindustryClassifier
type: NamedIndividual
is contemporary version of: http://data.ga-group.nl/ics/gics/20202010
is replaced by: http://data.ga-group.nl/ics/gics/2018/20202010
is version of: http://data.ga-group.nl/ics/gics/20202010
replaces: http://data.ga-group.nl/ics/gics/2014/20202010
is subindustry of: 专业服务
imported on: 2026-05-27T08:45:00.430Z
last refreshed on: 2026-05-31T09:56:29.350Z
source accessed on: 2017-10-19T03:34:33Z
source last accessed on: 2019-06-07T09:41:30Z
label: Human Resource & Employment Services @en
label: Human Resource und Arbeitsvermittlung @de
label: Recursos Humanos e Serviços de Emprego @pt
label: Risorse umane e servizi di collocamento @it
label: Services Liés aux Ressources Humaines et aux Emplois @fr
label: Servicios de Recursos Humanos y Empleo @es
label: Предоставление услуг по управлению человеческими ресурсами и трудоустройству @ru
label: 人事・雇用サービス @ja
label: 人力资源与就业服务
label: 인적 자원 및 고용 서비스 @ko
definition: Companies providing business support services relating to human capital management. Includes employment agencies, employee training, payroll & benefit support services, retirement support services and temporary agencies. @en
definition: Empresas provedoras de serviços de suporte a empresas relacionados à gestão do capital humano. Inclui agências de emprego, treinamento de funcionários, serviços de folha de pagamento e de suporte de benefícios, serviços de suporte à aposentadoria e agências de empregos temporários. @pt
definition: Empresas que proporcionan servicios de apoyo de mercado relacionados con la administración de capital humano. Se Incluyen agencias de empleo, de formación de empleados, de servicios de apoyo de nómina y prestaciones, servicios de apoyo en la jubilación y agencias de trabajadores temporales. @es
definition: Sociétés qui fournissent des services d'aide aux entreprises liés à la gestion du capital humain. Sont inclus les agences pour l’emploi, la formation d'employés, les services d'aide à l'élaboration de bulletins de paie et de bénéfices, les services d'aide à la retraite, et les agences d'intérim. @fr
definition: Società che forniscono servizi di assistenza ad altre società collegati alla gestione del capitale umano. Sono incluse agenzie per l'impiego, servizi di formazione dei dipendenti, servizi di assistenza per paghe e contributi, di assistenza per pensionamenti e agenzie di lavoro temporaneo. @it
definition: Unternehmen, die Unternehmensbetreuung in den Bereichen Mitarbeiter-Management anbieten. Eingeschlossen sind auch Arbeitsvermittlungsstellen, Stellen für Mitarbeitertraining, Lohnbuchhaltungsdienste und Leistungsberatungen, Rentenberatungsstellen und vorübergehende Agenturen. @de
definition: Компании, предоставляющие услуги по поддержке бизнеса в области управления человеческими ресурсами. В данную группу входят агентства, оказывающие услуги ��о трудоустройству, профессиональной подготовке, консультированию в сфере оплаты труда и премиального вознаграждения, пенсионного обеспечения и временного трудоустройства. @ru
definition: 人材管理に関連した事業支援サービスを提供する会社。職業紹介所、社員教育、給与計算・福利厚生支援サービス、退職支援サービス、人材派遣会社を含む。 @ja
definition: 提供与人力资本管理相关的业务支持服务的公司。包括职业介绍所、员工培训、工资和福利保障服务、退休保障服务以及临时机构。
definition: 提供與人力資本管理相關的業務支援服務的公司。包括職業介紹所、員工培訓、工資和福利保障服務、退休保障服務以及臨時機構。
definition: 인적 자원 관리에 관계된 사업 지원 서비스를 제공하는 회사. 직업 소개소, 직원 훈련, 봉급 및 연금 지원 서비스, 퇴직 지원 서비스, 인력 파견 회사를 포함. @ko
notation: 20202010
valid from: 2016-09-01
valid till: 2018-09-29

調查與諮詢服務
type: GlobalIndustryClassificationStandardsClassifier
type: SubindustryClassifier
type: NamedIndividual
is contemporary version of: http://data.ga-group.nl/ics/gics/20202020
is replaced by: http://data.ga-group.nl/ics/gics/2018/20202020
is version of: http://data.ga-group.nl/ics/gics/20202020
replaces: http://data.ga-group.nl/ics/gics/2014/20202020
is subindustry of: 专业服务
imported on: 2026-05-27T08:45:00.430Z
last refreshed on: 2026-05-31T09:56:29.350Z
source accessed on: 2017-10-19T03:34:33Z
source last accessed on: 2019-06-07T09:41:30Z
label: Forschungs- und Beratungsdienste @de
label: Research & Consulting Services @en
label: Serviços de pesquisa e consultoria @pt
label: Services de Recherche et Conseil @fr
label: Servicios de Investigación y Consultoría @es
label: Servizi di consulenza e ricerca @it
label: Предоставление исследовательских и консультационных услуг @ru
label: 調査・コンサルティングサービス @ja
label: 调查和咨询服务
label: 리서치 및 컨설팅 서비스 @ko
definition: Companies primarily providing research and consulting services to businesses and governments not classified elsewhere. Includes companies involved in management consulting services, architectural design, business information or scientific research, marketing, and testing & certification services. Excludes companies providing information technology consulting services classified in the IT Consulting & Other Services Sub-Industry. @en
definition: Empresas provedoras principalmente de serviços de pesquisa e consultoria a empresas e governos, não classificadas em nenhum outro lugar. Inclui empresas envolvidas em serviços de consultoria de gestão, projetos arquitetônicos, pesquisa científica ou de informações comerciais, propaganda, e serviços de teste e certificação. Exclui empresas provedoras de serviços de consultoria de tecnologia de informação, classificadas na Sub-Indústria de Consultoria de TI e Outros Servi��os. @pt
definition: Empresas que proporcionan principalmente servicios de investigación y consultoría a empresas y gobiernos, no incluidas en ninguna otra clasificaci��n. Se incluyen las empresas que prestan servicios de consultoría en administración, diseño arquitectónico, información comercial o investigación científica, marketing y servicios de prueba y certificación. Se excluyen empresas que proporcionen servicios de consultoría en tecnología de la infomación, clasificadas en la rama de Consultoría de Tecnología de la Información y Otros Servicios. @es
definition: Sociétés qui fournissent principalement des services de recherche et conseil aux entreprises et aux gouvernements n’appartenant à aucune autre classification. Sont incluses les sociétés impliquées dans des services de conseil-gestion, de design architectural, d’informations professionnelles ou de recherche scientifique, de marketing, de test et de certification. Ne sont pas incluses les sociétés qui fournissent des services de conseil informatique classés dans la sous-industrie des Conseils Liés aux Technologies de l’Information et Autres Services. @fr
definition: Società che si occupano principalmente della fornitura di servizi di ricerca e consulenza ad altre società e a strutture governative non classificate altrove. Sono incluse le società che si occupano della fornitura di servizi di consulenza gestionale, progettazione architettonica, informazioni aziendali o ricerca scientifica, marketing e servizi di collaudo e certificazione. Sono scluse le società che forniscono servizi di consulenza sulle tecnologie informatiche classificate nel ramo Consulenza e altri servizi informatici. @it
definition: Unternehmen, die Forschungs- und Beratungsdienste für Unternehmen und die Regierung anbieten und in keine andere Branche fallen. Eingeschlossen sind Unternehmen, die in Unternehmensberatungsdiensten, architektonische Gestaltungen, Unternehmensinformationen oder wissenschaftliche Forschungen, Marketing und Prüf- und Beurkundungsdienste involviert sind. Ausgeschlossen sind Unternehmen, die Informationstechnologie, die in die Branche IT Beratung & andere Dienste fällt, anbieten. @de
definition: Компании, занимающиеся в основном предоставлением услуг в области исследований и консультаций коммерческим предприятиям и государственным организациям, не включенные в другие группы. В данную группу входят компании, оказывающие консультационные услуги по вопросам управления, архитектурного проектирования, коммерческой информации или научных исследований, маркетинга, тестирования и сертификации. В данную группу не входят компании, оказывающие консультационные услуги в области информационных технологий, включенные в подотрасль «Консультирование в сфере информационных технологий и другие услуги». @ru
definition: 主要为企业和政府提供调查和咨询服务（未归类于别处）的公司。包括提供管理咨询服务、建筑设计、商业信息和科学研究、市场、测试和认证服务的公司。不包括提供信息技术咨询的公司（归类于IT咨询及其他子行业）。
definition: 主要為企業和政府提供調查和諮詢服務（未歸類於別處）的公司。包括提供管理諮詢服務、建築設計、商業資訊和科學研究、市場、測試和認證服務的公司。不包括提供資訊技術諮詢的公司（歸類於IT諮詢及其他子行業）。
definition: 民間企業や政府に対して調査およびコンサルティングサービスを主に提供する、他のグループに分類されていない会社。管理コンサルティングサービス、建築設計、企業情報および科学調査、マーケティング、試験・資格認定サービスを主に行う会社を含む。産業サブグループの「情報技術コンサルティング・他のサービ��」に分類される情報技術コンサルティングサービスを提供する会社は除く。 @ja
definition: 다른 부문으로 분류되지 않은, 기업 및 정부에 리서치 및 컨설팅 서비스를 주로 제공하는 회사. 경영 컨설팅 서비스, 건축 설계, 사업 정보 또는 과학 리서치, 마케팅, 시험 및 인증 서비스에 관계된 회사를 포함. 'IT 컨설팅과 기타 서비스'로 분류되는 정보 기술 컨설팅 서비스를 제공하는 회사는 제외. @ko
notation: 20202020
valid from: 2016-09-01
valid till: 2018-09-29

专业服务
type: GlobalIndustryClassificationStandardsClassifier
type: IndustryClassifier
type: NamedIndividual
is contemporary version of: http://data.ga-group.nl/ics/gics/202020
is replaced by: http://data.ga-group.nl/ics/gics/2018/202020
is version of: http://data.ga-group.nl/ics/gics/202020
replaces: http://data.ga-group.nl/ics/gics/2014/202020
is industry of: 商业和专业服务
imported on: 2026-05-27T08:45:00.430Z
last refreshed on: 2026-05-31T09:56:29.350Z
source accessed on: 2017-10-19T03:34:33Z
source last accessed on: 2019-06-07T09:41:30Z
label: Professional Services @en
label: Professionelle Dienste @de
label: Serviços Profissionais @pt
label: Services Professionnels @fr
label: Servicios Profesionales @es
label: Servizi professionali @it
label: Профессиональные услуги @ru
label: 専門サービス @ja
label: 專業服務
label: 전문 서비스 @ko
notation: 202020
valid from: 2016-09-01
valid till: 2018-09-29

商业和专业服务
type: GlobalIndustryClassificationStandardsClassifier
type: IndustryGroupClassifier
type: NamedIndividual
is contemporary version of: http://data.ga-group.nl/ics/gics/2020
is replaced by: http://data.ga-group.nl/ics/gics/2018/2020
is version of: http://data.ga-group.nl/ics/gics/2020
replaces: http://data.ga-group.nl/ics/gics/2014/2020
is industry group of: 工业
imported on: 2026-05-27T08:45:00.430Z
last refreshed on: 2026-05-31T09:56:29.350Z
source accessed on: 2017-10-19T03:34:33Z
source last accessed on: 2019-06-07T09:41:30Z
label: Commercial & Professional Services @en
label: Gewerbliche Dienste & Betriebsstoffe @de
label: Serviços Comerciais e Profissionais @pt
label: Services Commerciaux et Professionnels @fr
label: Servicios Comerciales y Profesionales @es
label: Servizi commerciali e professionali @it
label: Коммерческие и профессиональные услуги @ru
label: 商業・専門サービス @ja
label: 商業與專業服務
label: 상업 및 전문 서비스 @ko
notation: 2020
valid from: 2016-09-01
valid till: 2018-09-29

航空貨運與物流
type: GlobalIndustryClassificationStandardsClassifier
type: SubindustryClassifier
type: NamedIndividual
is contemporary version of: http://data.ga-group.nl/ics/gics/20301010
is replaced by: http://data.ga-group.nl/ics/gics/2018/20301010
is version of: http://data.ga-group.nl/ics/gics/20301010
replaces: http://data.ga-group.nl/ics/gics/2014/20301010
is subindustry of: 航空貨運與物流
imported on: 2026-05-27T08:45:00.430Z
last refreshed on: 2026-05-31T09:56:29.350Z
source accessed on: 2017-10-19T03:34:33Z
source last accessed on: 2019-06-07T09:41:30Z
label: Air Freight & Logistics @en
label: Fret Aérien et Logistique @fr
label: Frete Aéreo e Logística @pt
label: Luftfracht & Logistikdienste @de
label: Servicios Logísticos y de Transporte Aéreo de Mercancías @es
label: Trasporto aereo e servizi logistici @it
label: Грузовые перевозки воздушным транспортом и логистика @ru
label: 航空貨物・物流サービス @ja
label: 航空货运与物流
label: 항공 화물 운송과 물류 @ko
definition: Companies providing air freight transportation, courier and logistics services, including package and mail delivery and customs agents. Excludes those companies classified in the Airlines, Marine or Trucking Sub-Industries. @en
definition: Empresas provedoras de transporte de frete aéreo, serviços de entrega e de logística, incluindo a entrega de pacotes e de correspondência e agentes aduaneiros. Exclui aquelas empresas classificadas nas Sub-Indústrias de Linhas Aéreas, Marítimo ou Transporte por Caminhões. @pt
definition: Empresas que proporcionan servicios logísticos y de transporte aéreo de mercancías. Se incluyen servicios de envío de paquetes y correo, así como agentes de aduanas. Se excluyen las empresas clasificadas en las ramas Líneas Aéreas, Transporte Marítimo o Transporte por Carretera. @es
definition: Sociétés qui fournissent des services de transport maritime de biens ou de personnes. Ne sont pas inclus les bateaux de croisière classés dans la sous-industrie des Hôtels, des Lieux de Villégiature et des Croisiéristes. @fr
definition: Società di servizi per il trasporto aereo, corrieri e servizi logistici, incluso il trasporto postale, di pacchi e gli agenti doganali. Sono escluse le società classificate nei Rami Compagnie aeree, Trasporto marittimo e Trasporto Stradale. @it
definition: "Unternehmen, die Luftfrachttransport , Kurierdienste und Logistikdienste anbieten, einschließlich Verpackung, Lieferung per Post und Zollabfertigung. Ausgeschlossen sind die Unternehmen, die den Branchen „Fluggesellschaften“, „Schifffahrt“ oder „Straßenverkehr"" angehören." @de
definition: "Компании, предоставляющие услуги по перевозке грузов воздушным транспортом, а также услуги курьерской службы и логистики, в том числе по упаковке и доставке почтов��х отправлений, и услуги таможенных агентов. В данную группу не входят компании, включенные в подотрасли «Деятельность воздушного транспорта», «Деятельность морского транспорта» или «Деятельность автомобильного транспорта""." @ru
definition: 提供航空貨運、快遞及物流服務的公司，包括包裹和郵件投遞報關行。不包括歸類於“航空公司”、“海運”和“陸運”子行業中的那些公司。
definition: 提供航空货运、快递及物流服务的公司，包括包裹和邮件投递报关行。不包括归类于“航空公司”、���海运”和“陆运”子行业中的那些公司。
definition: 航空貨物輸送、国際宅配便、物流サービスを提供する会社。梱包、郵便配達や通関業者を含む。産業サブグループの「旅客航空輸送業」、「海運業」、「陸運」に分類される会社は除く。 @ja
definition: 소포와 ��편 배달 및 세관 대행업체를 포함한 항공 화물 운송, 택배, 물류 서비스 제공회사. ‘항공사’, ‘해운회사’ 또는 ‘육상 운송회사’로 분류되는 회사는 제외. @ko
notation: 20301010
valid from: 2016-09-01
valid till: 2018-09-29

航空貨運與物流
type: GlobalIndustryClassificationStandardsClassifier
type: IndustryClassifier
type: NamedIndividual
is contemporary version of: http://data.ga-group.nl/ics/gics/203010
is replaced by: http://data.ga-group.nl/ics/gics/2018/203010
is version of: http://data.ga-group.nl/ics/gics/203010
replaces: http://data.ga-group.nl/ics/gics/2014/203010
is industry of: 运输
imported on: 2026-05-27T08:45:00.430Z
last refreshed on: 2026-05-31T09:56:29.350Z
source accessed on: 2017-10-19T03:34:33Z
source last accessed on: 2019-06-07T09:41:30Z
label: Air Freight & Logistics @en
label: Fret Aérien et Logistique @fr
label: Frete Aéreo e Logística @pt
label: Luftfracht & Kuriere @de
label: Servicios Logísticos y de Transporte Aéreo de Mercancías @es
label: Trasporto aereo e servizi logistici @it
label: Грузовые перевозки воздушным транспортом и логистика @ru
label: 航空貨物・物流サー��ス @ja
label: 航空货运与物流
label: 항공 화물 운송과 물류 @ko
notation: 203010
valid from: 2016-09-01
valid till: 2018-09-29

航空公司
type: GlobalIndustryClassificationStandardsClassifier
type: SubindustryClassifier
type: NamedIndividual
is contemporary version of: http://data.ga-group.nl/ics/gics/20302010
is replaced by: http://data.ga-group.nl/ics/gics/2018/20302010
is version of: http://data.ga-group.nl/ics/gics/20302010
replaces: http://data.ga-group.nl/ics/gics/2014/20302010
is subindustry of: 航空公司
imported on: 2026-05-27T08:45:00.430Z
last refreshed on: 2026-05-31T09:56:29.350Z
source accessed on: 2017-10-19T03:34:33Z
source last accessed on: 2019-06-07T09:41:30Z
label: Airlines @en
label: Compagnie aeree @it
label: Compagnies Aériennes @fr
label: Fluggesellschaften @de
label: Líneas Aéreas @es
label: Linhas Aéreas @pt
label: Деятельность воздушного транспорта @ru
label: 旅客航空輸送業 @ja
label: 항공사 @ko
definition: Companies providing primarily passenger air transportation. @en
definition: Empresas dedicadas principalmente al transporte aéreo de pasajeros. @es
definition: Empresas provedoras principalmente de transporte aéreo de passageiros. @pt
definition: Sociétés qui fournissent principalement des services de transport aérien de passagers. @fr
definition: Società che operano principalmente nel settore del trasporto aereo di passeggeri. @it
definition: Unternehmen, die hauptsächlich im Passagierflugverkehr tätig sind. @de
definition: Компании, занимающиеся в основном пассажирскими перевозками воздушным транспортом. @ru
definition: 主に旅客航空輸送サービスを提供する会社。 @ja
definition: 主要提供航空客运服务的公司。
definition: 主要提供航空客運服務的公司。
definition: 주로 승객 항공 수송을 제공하는 회사. @ko
notation: 20302010
valid from: 2016-09-01
valid till: 2018-09-29

航空公司
type: GlobalIndustryClassificationStandardsClassifier
type: IndustryClassifier
type: NamedIndividual
is contemporary version of: http://data.ga-group.nl/ics/gics/203020
is replaced by: http://data.ga-group.nl/ics/gics/2018/203020
is version of: http://data.ga-group.nl/ics/gics/203020
replaces: http://data.ga-group.nl/ics/gics/2014/203020
is industry of: 运输
imported on: 2026-05-27T08:45:00.430Z
last refreshed on: 2026-05-31T09:56:29.350Z
source accessed on: 2017-10-19T03:34:33Z
source last accessed on: 2019-06-07T09:41:30Z
label: Airlines @en
label: Compagnie aeree @it
label: Compagnies Aériennes @fr
label: Fluggesellschaften @de
label: Líneas Aéreas @es
label: Linhas Aéreas @pt
label: Деятельность воздушного транспорта @ru
label: 旅客航空輸送業 @ja
label: 항공사 @ko
notation: 203020
valid from: 2016-09-01
valid till: 2018-09-29

海运
type: GlobalIndustryClassificationStandardsClassifier
type: SubindustryClassifier
type: NamedIndividual
is contemporary version of: http://data.ga-group.nl/ics/gics/20303010
is replaced by: http://data.ga-group.nl/ics/gics/2018/20303010
is version of: http://data.ga-group.nl/ics/gics/20303010
replaces: http://data.ga-group.nl/ics/gics/2014/20303010
is subindustry of: 海运
imported on: 2026-05-27T08:45:00.430Z
last refreshed on: 2026-05-31T09:56:29.350Z
source accessed on: 2017-10-19T03:34:33Z
source last accessed on: 2019-06-07T09:41:30Z
label: Marine @en
label: Schifffahrt @de
label: Transport Maritime @fr
label: Transporte Marítimo @es
label: Trasporto marittimo @it
label: Деятельность морского транспорта @ru
label: 海運
label: 海運業 @ja
label: 해운회사 @ko
definition: Companies providing goods or passenger maritime transportation. Excludes cruise-ships classified in the Hotels, Resorts & Cruise Lines Sub-Industry. @en
definition: Empresas dedicadas al transporte marítimo de mercancías o pasajeros. Se excluyen los cruceros clasificados en la rama de Hoteles, Centros de Vacaciones y Cruceros. @es
definition: Empresas provedoras de transporte marítimo de mercadorias ou passageiros. Exclui navios de cruzeiro classificados na Sub-Indústria de Hotéis, Resorts e Linhas de Cruzeiro. @pt
definition: Sociétés qui fournissent principalement des services de transport ferroviaire de biens et de personnes. @fr
definition: Società che operano nel trasporto marittimo di merci e passeggeri, escluse navi da crociera, classificate nel ramo Hotel, Villaggi vacanze e navi da crociera. @it
definition: Unternehmen, die Güter oder Personen per Schiff transportieren. Ausgeschlossen sind Kreuzfahrtschiffe, die der Branche „Hotels, Urlaubsanlagen & Kreuzfahrtlinien“ angehören. @de
definition: Компании, занимающиеся перевозкой грузов или пассажиров морским транспортом. В данную группу не входят компании по организац��и круизов, включенные в подотрасль «Деятельность гостиниц, курортов, организация круизов». @ru
definition: 提供海上客运或者货运服务的公司。不包括归类于“酒店、度假村与豪华游轮”子行业中的豪华游轮。
definition: 提供海上客運或者貨運服務的公司。不包括歸類於“酒店、度假村與豪華遊輪”子行業中的豪華遊輪。
definition: 貨物・旅客の海上交通サービスを行う会社。産業サブグループの「ホテル・リゾート・クルーズ船」に分類されるクルーズ船は除く。 @ja
definition: 화물이나 승객의 해운을 제공하는 회사. ‘호텔, 리조트, 크루즈’로 분류되는 크루즈 선박은 제외. @ko
notation: 20303010
valid from: 2016-09-01
valid till: 2018-09-29

海运
type: GlobalIndustryClassificationStandardsClassifier
type: IndustryClassifier
type: NamedIndividual
is contemporary version of: http://data.ga-group.nl/ics/gics/203030
is replaced by: http://data.ga-group.nl/ics/gics/2018/203030
is version of: http://data.ga-group.nl/ics/gics/203030
replaces: http://data.ga-group.nl/ics/gics/2014/203030
is industry of: 运输
imported on: 2026-05-27T08:45:00.430Z
last refreshed on: 2026-05-31T09:56:29.350Z
source accessed on: 2017-10-19T03:34:33Z
source last accessed on: 2019-06-07T09:41:30Z
label: Marine @en
label: Schifffahrt @de
label: Transport Maritime @fr
label: Transporte Marítimo @es
label: Trasporto marittimo @it
label: Деятельность морского транспорта @ru
label: 海運
label: 海運業 @ja
label: 해운회사 @ko
notation: 203030
valid from: 2016-09-01
valid till: 2018-09-29

鐵路
type: GlobalIndustryClassificationStandardsClassifier
type: SubindustryClassifier
type: NamedIndividual
is contemporary version of: http://data.ga-group.nl/ics/gics/20304010
is replaced by: http://data.ga-group.nl/ics/gics/2018/20304010
is version of: http://data.ga-group.nl/ics/gics/20304010
replaces: http://data.ga-group.nl/ics/gics/2014/20304010
is subindustry of: 公路与铁路
imported on: 2026-05-27T08:45:00.430Z
last refreshed on: 2026-05-31T09:56:29.350Z
source accessed on: 2017-10-19T03:34:33Z
source last accessed on: 2019-06-07T09:41:30Z
label: Ferrovias @pt
label: Railroads @en
label: Schienenverkehr @de
label: Transport Ferroviaire @fr
label: Trasporto ferroviario @it
label: Vías Férreas @es
label: Железнодорожные компании @ru
label: 鉄道 @ja
label: 铁路
label: 철도회사 @ko
definition: Companies providing primarily goods and passenger rail transportation. @en
definition: Empresas provedoras principalmente de transporte ferroviário de mercadorias e passageiros. @pt
definition: Empresas que proporcionan servicios de transporte ferroviario de mercancías y pasajeros. @es
definition: Società che operano principalmente nel settore del trasporto ferroviario di beni e di passeggeri. @it
definition: Transport Routier @fr
definition: Unternehmen, die hauptsächlich Güter und Personen auf dem Schienenweg transportieren. @de
definition: Компании, занимающиеся в основном грузовыми и пассажирскими перевозками железнодорожным транспортом. @ru
definition: 主要提供鐵路客運和貨運服務的公司。
definition: 主要提供铁路客运和货运服务的公司。
definition: 貨物・旅客の鉄道輸送サービスを主に行う会社。 @ja
definition: 주로 화물과 승객의 철도 수송을 제공하는 회사. @ko
notation: 20304010
valid from: 2016-09-01
valid till: 2018-09-29

陆运
type: GlobalIndustryClassificationStandardsClassifier
type: SubindustryClassifier
type: NamedIndividual
is contemporary version of: http://data.ga-group.nl/ics/gics/20304020
is replaced by: http://data.ga-group.nl/ics/gics/2018/20304020
is version of: http://data.ga-group.nl/ics/gics/20304020
replaces: http://data.ga-group.nl/ics/gics/2014/20304020
is subindustry of: 公路与铁路
imported on: 2026-05-27T08:45:00.430Z
last refreshed on: 2026-05-31T09:56:29.350Z
source accessed on: 2017-10-19T03:34:33Z
source last accessed on: 2019-06-07T09:41:30Z
label: Straßenverkehr @de
label: Transporte por Caminhões @pt
label: Transporte por Carretera @es
label: Trasporto stradale @it
label: Trucking @en
label: Перевозки автомобильным транспортом @ru
label: 陸運
label: 육상 운송회사 @ko
definition: Companies providing primarily goods and passenger land transportation. Includes vehicle rental and taxi companies. @en
definition: Empresas provedoras principalmente de transporte terrestre de mercadorias e passageiros. Inclui empresas de aluguel de veículos e de táxi. @pt
definition: Empresas que proporcionan servicios de transporte terrestre de mercancías y pasajeros. Se incluyen los servicios de taxi y alquiler de vehículos. @es
definition: Società che operano principalmente nel settore del trasporto stradale di beni e di passeggeri. Sono incluse le società di noleggio automezzi e di taxi. @it
definition: Unternehmen, die hauptsächlich Güter und Personen auf dem Landweg transportieren. Hierzu gehören auch Autoverleiher und Taxiunternehmen. @de
definition: Компании, занимающиеся в основном грузовыми и пассажирскими перевозками наземным транспортом, в том числе компании по аренде автомобилей и таксомоторные компании. @ru
definition: 主要提供公路客运和货运服务的公司。包括租车公司和出租车公司。
definition: 主要提供公路客運和貨運服務的公司。包括租車公司和計程車公司。
definition: 貨物・旅客の陸上輸送サービスを主に行う���社。車両レンタル・タクシー会社を含む。 @ja
definition: 주로 화물과 승객의 육상 운송을 제공하는 회사. 차량 렌탈과 택시 회사 포함. @ko
notation: 20304020
valid from: 2016-09-01
valid till: 2018-09-29

公路与铁路
type: GlobalIndustryClassificationStandardsClassifier
type: IndustryClassifier
type: NamedIndividual
is contemporary version of: http://data.ga-group.nl/ics/gics/203040
is replaced by: http://data.ga-group.nl/ics/gics/2018/203040
is version of: http://data.ga-group.nl/ics/gics/203040
replaces: http://data.ga-group.nl/ics/gics/2014/203040
is industry of: 运输
imported on: 2026-05-27T08:45:00.430Z
last refreshed on: 2026-05-31T09:56:29.350Z
source accessed on: 2017-10-19T03:34:33Z
source last accessed on: 2019-06-07T09:41:30Z
label: Carreteras y Ferrocarriles @es
label: Road & Rail @en
label: Rodovias e Ferrovias @pt
label: Straßen- & Schienenverkehr @de
label: Transport Routier et Ferroviaire @fr
label: Trasporto stradale e ferroviario @it
label: Деятельность автомобильного и железнодорожного транспора @ru
label: 公路與鐵路
label: 陸運・鉄道 @ja
label: 도로와 선로 @ko
notation: 203040
valid from: 2016-09-01
valid till: 2018-09-29

机场服务
type: GlobalIndustryClassificationStandardsClassifier
type: SubindustryClassifier
type: NamedIndividual
is contemporary version of: http://data.ga-group.nl/ics/gics/20305010
is replaced by: http://data.ga-group.nl/ics/gics/2018/20305010
is version of: http://data.ga-group.nl/ics/gics/20305010
replaces: http://data.ga-group.nl/ics/gics/2014/20305010
is subindustry of: 交通基本設施
imported on: 2026-05-27T08:45:00.430Z
last refreshed on: 2026-05-31T09:56:29.350Z
source accessed on: 2017-10-19T03:34:33Z
source last accessed on: 2019-06-07T09:41:30Z
label: Airport Services @en
label: Flughafendienste @de
label: Serviços Aeroportuários @pt
label: Servicios de Aeropuertos @es
label: Servizi aeroportuali @it
label: Предоставление услуг аэропорта @ru
label: 機場服務
label: 空港サービス @ja
label: 공항 서비스 @ko
definition: Betreiber von Flughäfen und Unternehmen, die damit verwandte Dienste anbieten. @de
definition: Operadores de aeroportos e empresas provedoras de serviços relacionados. @pt
definition: Operadores de aeropuertos y empresas que proporcionan servicios relacionados. @es
definition: Operatori aeroportuali e società di servizi affini. @it
definition: Operators of airports and companies providing related services. @en
definition: Операторы аэропортов и компа��ии, оказывающие сопутствующие услуги. @ru
definition: 机场经营商以及提供相关服务的公司。
definition: 機場經營商以及提供相關服務的公司。
definition: 空港運営業者および関連サービスの提供会社。 @ja
definition: 공항 운영회사 및 관련 서비스 제공회사. @ko
notation: 20305010
valid from: 2016-09-01
valid till: 2018-09-29

公路与铁路
type: GlobalIndustryClassificationStandardsClassifier
type: SubindustryClassifier
type: NamedIndividual
is contemporary version of: http://data.ga-group.nl/ics/gics/20305020
is replaced by: http://data.ga-group.nl/ics/gics/2018/20305020
is version of: http://data.ga-group.nl/ics/gics/20305020
replaces: http://data.ga-group.nl/ics/gics/2014/20305020
is subindustry of: 交通基本設施
imported on: 2026-05-27T08:45:00.430Z
last refreshed on: 2026-05-31T09:56:29.350Z
source accessed on: 2017-10-19T03:34:33Z
source last accessed on: 2019-06-07T09:41:30Z
label: Carreteras y Vías Férreas @es
label: Highways & Railtracks @en
label: Rodovias e Trilhos de Trem @pt
label: Straßen- und Schienennetze @de
label: Strade e ferrovie @it
label: Дорожное и железнодорожное путевое хозяйство @ru
label: 公路與鐵路
label: 高速道路・鉄道路線 @ja
label: 고속도로와 선로 @ko
definition: Besitzer und Betreiber von Straßen, Tunneln und Schienennetzen. @de
definition: Owners and operators of roads, tunnels and railtracks. @en
definition: Propietarios y operadores de carreteras, túneles y vías férreas. @es
definition: Proprietários e operadores de estradas, túneis e trilhos de trem. @pt
definition: Proprietari e gestori di strade, tunnel e ferrovie. @it
definition: Компании, владеющие автомобильными дорогами, тоннелями и железнодорожным путевым хозяйством, и занимающиеся их эксплуатацией. @ru
definition: 公路、隧道和鐵路的業主和經營商。
definition: 公路、隧道和铁路的业主和经营商。
definition: 道路、トンネル、鉄道路線の所有者や運営業者。 @ja
definition: 도로, 터널, 선로의 소유자와 운영자. @ko
notation: 20305020
valid from: 2016-09-01
valid till: 2018-09-29

海港与服务
type: GlobalIndustryClassificationStandardsClassifier
type: SubindustryClassifier
type: NamedIndividual
is contemporary version of: http://data.ga-group.nl/ics/gics/20305030
is replaced by: http://data.ga-group.nl/ics/gics/2018/20305030
is version of: http://data.ga-group.nl/ics/gics/20305030
replaces: http://data.ga-group.nl/ics/gics/2014/20305030
is subindustry of: 交通基本設施
imported on: 2026-05-27T08:45:00.430Z
last refreshed on: 2026-05-31T09:56:29.350Z
source accessed on: 2017-10-19T03:34:33Z
source last accessed on: 2019-06-07T09:41:30Z
label: Häfen & Dienste @de
label: Marine Ports & Services @en
label: Porti e servizi marittimi @it
label: Portos e Serviços Marítimos @pt
label: Servicios y Puertos Marítimos @es
label: Деятельность и услуги морских портов @ru
label: 海港與服務
label: 港湾サービス @ja
label: 항구 및 서비스 @ko
definition: Besitzer und Betreiber von Seehäfen und verwandten Diensten. @de
definition: Owners and operators of marine ports and related services. @en
definition: Propietarios y operadores de puertos marítimos y servicios relacionados. @es
definition: Proprietários e operadores de portos marítimos e serviços relacionados. @pt
definition: Proprietari e gestori di porti marittimi e servizi affini. @it
definition: Компании, владеющие морскими портами, занимающиеся их эксплуатацией и предоставляющие сопутствующие услуги. @ru
definition: 海港及相关服务的业主和经营商。
definition: 海港及相關服務的業主和經營商。
definition: 港湾の所有者や運営業者、および関連サービスの提供業者。 @ja
definition: 항구 소유자와 운영자, 관련 서비스 업체. @ko
notation: 20305030
valid from: 2016-09-01
valid till: 2018-09-29

交通基本設施
type: GlobalIndustryClassificationStandardsClassifier
type: IndustryClassifier
type: NamedIndividual
is contemporary version of: http://data.ga-group.nl/ics/gics/203050
is replaced by: http://data.ga-group.nl/ics/gics/2018/203050
is version of: http://data.ga-group.nl/ics/gics/203050
replaces: http://data.ga-group.nl/ics/gics/2014/203050
is industry of: 运输
imported on: 2026-05-27T08:45:00.430Z
last refreshed on: 2026-05-31T09:56:29.350Z
source accessed on: 2017-10-19T03:34:33Z
source last accessed on: 2019-06-07T09:41:30Z
label: Infraestructura de Transportes @es
label: Infraestrutura de Transportes @pt
label: Infrastructure de Transports @fr
label: Infrastrutture di trasporto @it
label: Transportation Infrastructure @en
label: Transportinfrastruktur @de
label: Транспортная инфраструктура @ru
label: 交通基本设施
label: 運送インフラ @ja
label: 운송 인프라 @ko
notation: 203050
valid from: 2016-09-01
valid till: 2018-09-29

运输
type: GlobalIndustryClassificationStandardsClassifier
type: IndustryGroupClassifier
type: NamedIndividual
is contemporary version of: http://data.ga-group.nl/ics/gics/2030
is replaced by: http://data.ga-group.nl/ics/gics/2018/2030
is version of: http://data.ga-group.nl/ics/gics/2030
replaces: http://data.ga-group.nl/ics/gics/2014/2030
is industry group of: 工业
imported on: 2026-05-27T08:45:00.430Z
last refreshed on: 2026-05-31T09:56:29.350Z
source accessed on: 2017-10-19T03:34:33Z
source last accessed on: 2019-06-07T09:41:30Z
label: Transportation @en
label: Transporte @pt
label: Transportes @es
label: Transports @fr
label: Transportwesen @de
label: Trasporto @it
label: Транспорт @ru
label: 運輸
label: 운송 @ko
notation: 2030
valid from: 2016-09-01
valid till: 2018-09-29

工业
type: GlobalIndustryClassificationStandardsClassifier
type: SectorClassifier
type: NamedIndividual
is contemporary version of: http://data.ga-group.nl/ics/gics/20
is replaced by: http://data.ga-group.nl/ics/gics/2018/20
is version of: http://data.ga-group.nl/ics/gics/20
replaces: http://data.ga-group.nl/ics/gics/2014/20
imported on: 2026-05-27T08:45:00.430Z
last refreshed on: 2026-05-31T09:56:29.350Z
source accessed on: 2017-10-19T03:34:33Z
source last accessed on: 2019-06-07T09:41:30Z
label: Industria @it
label: Industriais @pt
label: Industrial @es
label: Industrials @en
label: Industrie @de
label: Промышленность @ru
label: 工業
label: 資本財・サービス @ja
label: 산업 @ko
notation: 20
valid from: 2016-09-01
valid till: 2018-09-29

机动车零配件与设备
type: GlobalIndustryClassificationStandardsClassifier
type: SubindustryClassifier
type: NamedIndividual
is contemporary version of: http://data.ga-group.nl/ics/gics/25101010
is replaced by: http://data.ga-group.nl/ics/gics/2018/25101010
is version of: http://data.ga-group.nl/ics/gics/25101010
replaces: http://data.ga-group.nl/ics/gics/2014/25101010
is subindustry of: 汽車零配��
imported on: 2026-05-27T08:45:00.430Z
last refreshed on: 2026-05-31T09:56:29.350Z
source accessed on: 2017-10-19T03:34:33Z
source last accessed on: 2019-06-07T09:41:30Z
label: Auto Parts & Equipment @en
label: Automobilteile & -geräte @de
label: Autopeças e equipamento automotivo @pt
label: Equipo y Componentes de Automóviles @es
label: Parti di ricambio e attrezzature per automezzi @it
label: Производство комплектующих и оборудования для автомобилей @ru
label: 機動車零配件與設備
label: 自動車部品・装置 @ja
label: 자동차 부품과 장비 @ko
definition: Empresas dedicadas a la fabricación de piezas y accesorios de automóviles y motocicletas. Se excluyen las empresas clasificadas en la rama Neumáticos y Caucho. @es
definition: Fabricantes de peças e acessórios para automóveis e motocicletas. Exclui empresas classificadas na Sub-Indústria de Pneus e Borrachas. @pt
definition: Hersteller von Teilen und Zubehör für Automobile und Motorräder. Ausgeschlossen sind Unternehmen, die der Branche „Reifen & Gummi“ angehören. @de
definition: Manufacturers of parts and accessories for automobiles and motorcycles. Excludes companies classified in the Tires & Rubber Sub-Industry. @en
definition: Società produttrici di parti di ricambio e accessori per automezzi e motocicli. Sono escluse le società classificate nel ramo Gomme e pneumatici. @it
definition: Производители комплектующих и аксессуаров для автомобилей и мот��циклов. В данную группу не входят компании, включенные в подотрасль «Производство шин и резиновых изделий». @ru
definition: 汽車和摩托車零配件製造商。不包括歸類於“輪胎與橡膠”子行業中的那些公司。
definition: 汽车和摩托车零配件制造商。不包括归类于“轮胎与橡胶”子行业中的那些公司。
definition: 自動車や自動二輪車の部品や付属品の製造会社。産業サブグループの「タイヤ・ゴム」に分類される会社は除く。 @ja
definition: 자동차와 오토바이의 부품과 액세서리 제조업체. ‘타이어와 고무’로 분류되는 회사는 제외. @ko
notation: 25101010
valid from: 2016-09-01
valid till: 2018-09-29

輪胎與橡膠
type: GlobalIndustryClassificationStandardsClassifier
type: SubindustryClassifier
type: NamedIndividual
is contemporary version of: http://data.ga-group.nl/ics/gics/25101020
is replaced by: http://data.ga-group.nl/ics/gics/2018/25101020
is version of: http://data.ga-group.nl/ics/gics/25101020
replaces: http://data.ga-group.nl/ics/gics/2014/25101020
is subindustry of: 汽車零配��
imported on: 2026-05-27T08:45:00.430Z
last refreshed on: 2026-05-31T09:56:29.350Z
source accessed on: 2017-10-19T03:34:33Z
source last accessed on: 2019-06-07T09:41:30Z
label: Gomme e pneumatici @it
label: Neumáticos y Caucho @es
label: Pneus e Borrachas @pt
label: Reifen & Gummi @de
label: Tires & Rubber @en
label: Производство шин и резиновых изделий @ru
label: タイヤ・ゴム @ja
label: 轮胎与橡胶
label: 타이어와 고무 @ko
definition: Empresas dedicadas a la fabricación de neumáticos y caucho. @es
definition: Fabricantes de pneus e borrachas. @pt
definition: Hersteller von Reifen und Gummi. @de
definition: Manufacturers of tires and rubber. @en
definition: Società produttrici di gomme e pneumatici. @it
definition: Производители шин и резиновых изделий. @ru
definition: タイヤおよびゴムの製造会社。 @ja
definition: 輪胎與橡膠製造商。
definition: 轮胎与橡胶制造商。
definition: 타이어와 고무 제조업체. @ko
notation: 25101020
valid from: 2016-09-01
valid till: 2018-09-29

汽車零配��
type: GlobalIndustryClassificationStandardsClassifier
type: IndustryClassifier
type: NamedIndividual
is contemporary version of: http://data.ga-group.nl/ics/gics/251010
is replaced by: http://data.ga-group.nl/ics/gics/2018/251010
is version of: http://data.ga-group.nl/ics/gics/251010
replaces: http://data.ga-group.nl/ics/gics/2014/251010
is industry of: 汽車與汽車零部件
imported on: 2026-05-27T08:45:00.430Z
last refreshed on: 2026-05-31T09:56:29.350Z
source accessed on: 2017-10-19T03:34:33Z
source last accessed on: 2019-06-07T09:41:30Z
label: Auto Components @en
label: Automobilteile @de
label: Componentes Automotivos @pt
label: Componentes de Automóviles @es
label: Componenti per automezzi @it
label: Composants Automobiles @fr
label: Производство комплектующих для автомобилей @ru
label: 汽车零配件
label: 自動車部品 @ja
label: 자동차 부품 @ko
notation: 251010
valid from: 2016-09-01
valid till: 2018-09-29

汽車製造商
type: GlobalIndustryClassificationStandardsClassifier
type: SubindustryClassifier
type: NamedIndividual
is contemporary version of: http://data.ga-group.nl/ics/gics/25102010
is replaced by: http://data.ga-group.nl/ics/gics/2018/25102010
is version of: http://data.ga-group.nl/ics/gics/25102010
replaces: http://data.ga-group.nl/ics/gics/2014/25102010
is subindustry of: 汽車
imported on: 2026-05-27T08:45:00.430Z
last refreshed on: 2026-05-31T09:56:29.350Z
source accessed on: 2017-10-19T03:34:33Z
source last accessed on: 2019-06-07T09:41:30Z
label: Automobile Manufacturers @en
label: Automobilhersteller @de
label: Fabricantes de Automóveis @pt
label: Fabricantes de Automóviles @es
label: Società produttrici di automobili @it
label: Производство автомобилей @ru
label: 汽车制造商
label: 自動車製造 @ja
label: 자동차 제조업체 @ko
definition: Companies that produce mainly passenger automobiles and light trucks. Excludes companies producing mainly motorcycles and three-wheelers classified in the Motorcycle Manufacturers Sub-Industry and heavy duty trucks classified in the Construction Machinery & Heavy Trucks Sub-Industry. @en
definition: Empresas dedicadas principalmente a la fabricación de automóviles de pasajeros y camiones ligeros. Se excluyen los fabricantes de motocicletas y vehículos de tres ruedas, clasificados en la rama Fabricantes de Motocicletas y los fabricantes de camiones pesados, clasificados en la rama de Maquinaria de Construcción y Vehículos Pesados. @es
definition: Empresas que produzem principalmente automóveis de passageiros e caminhões leves. Exclui empresas que produzem principalmente motocicletas e triciclos, classificadas na Sub-Indústria de Fabricantes de Motocicleta, e também aquelas que produzem caminhões pesados, ​​classificadas na Sub-Indústria de Maquinário de Construção e Caminhões Pesados. @pt
definition: Società che producono principalmente automobili per trasporto privato e autocarri leggeri. Sono escluse le società che producono principalmente motocicli e mezzi di trasporto a tre ruote classificate nel ramo Società produttrici di motocicli, e autocarri pesanti classificate nel ramo Macchinari edili e agricoli, Autocarri. @it
definition: Unternehmen, die hauptsächlich Personenfahrzeuge und Kleinlastwagen herstellen. Ausgeschlossen sind Unternehmen, die hauptsächlich Motorräder und Dreiräder herstellen und der Branche „Motorradhersteller“ angehören, oder solche, die hauptsächlich Schwerlastfahrzeuge herstellen und der Branche „Bau- & Landwirtschaftsmaschinen und Schwerlastfahrzeuge“ angehören. @de
definition: Компании, занимающиеся в основном производством пассажирских автомобилей и грузовых автомобилей малой грузоподъемности. В данную группу не входят компании, занимающиеся в основном производством мотоциклов и мотоциклов с коляской, которые включены в подотрасль «Производство мотоциклов», а такж�� грузовых автомобилей большой грузоподъемности, которые включены в подотрасль «Производство машин для строительства, а также грузовых автомобилей большой грузоподъемности». @ru
definition: 主要生产载客汽车及轻型卡车的公司。不包括归类于“摩托车制造商”子行业中那些主要生产摩托车及三轮摩托车的公司，也不包括那些归类于“建筑机械与重型卡车”子行业中那些制造重型卡车的公司。
definition: 主要生產載客汽車及輕型卡車的公司。不包括歸類於“摩託車製造商”子行業中那些主要生產摩託車及三輪摩託車的公司，也不包括那些歸類於“建築機械與重型卡車”子��業中那些製造重型卡車的公司。
definition: 乗用車や軽トラックを主に製造する会社。産業サブグループの「自動二輪車製造」に分類される自動二輪車や三輪車を主��製造する会社、および「建設機械・大型トラック」に分類される大型トラックの製造会社は除く。 @ja
definition: 주로 승용차와 경트럭을 생산하는 회사. ‘오토바이 제조업체’로 분류되는 오토바이와 삼륜차, 그리고 ‘건설장비 & 대형 트럭’으로 분류되는 대형 트럭을 주로 생산하는 회사는 제외. @ko
notation: 25102010
valid from: 2016-09-01
valid till: 2018-09-29

摩托車製造商
type: GlobalIndustryClassificationStandardsClassifier
type: SubindustryClassifier
type: NamedIndividual
is contemporary version of: http://data.ga-group.nl/ics/gics/25102020
is replaced by: http://data.ga-group.nl/ics/gics/2018/25102020
is version of: http://data.ga-group.nl/ics/gics/25102020
replaces: http://data.ga-group.nl/ics/gics/2014/25102020
is subindustry of: 汽車
imported on: 2026-05-27T08:45:00.430Z
last refreshed on: 2026-05-31T09:56:29.350Z
source accessed on: 2017-10-19T03:34:33Z
source last accessed on: 2019-06-07T09:41:30Z
label: Fabricantes de Motocicletas @es
label: Motorcycle Manufacturers @en
label: Motorradhersteller @de
label: Società produttrici di motocicli @it
label: Производство мотоциклов @ru
label: 摩托车制造商
label: 自動二輪車製造 @ja
label: 오토바이 제조업체 @ko
definition: Companies that produce motorcycles, scooters or three-wheelers. Excludes bicycles classified in the Leisure Products Sub-Industry. @en
definition: Empresas dedicadas a la fabricación de motocicletas, patinetas o vehículos de tres ruedas. Se excluyen los fabricantes de bicicletas, clasificados en la rama Productos Recreativos. @es
definition: Empresas que produzem motocicletas, motonetas ou triciclos. Exclui bicicletas, classificadas na Sub-Indústria de Produtos para Lazer. @pt
definition: Società che producono motocicli, scooter o veicoli di trasporto a tre ruote, escluse le biciclette classificate nel ramo Articoli per il tempo libero. @it
definition: Unternehmen, die Motorräder, Motorroller oder Dreiräder herstellen. Ausgeschlossen sind Fahrräder, die in die Branche „Freizeitartikel“ fallen. @de
definition: Компании, занимающиеся производством мотоциклов, скутеров или мотоциклов с коляской. В данную группу не входят производители велосипедов, включенные в подотрасль «Производство товаров для отдыха». @ru
definition: 生产摩托车、小型摩托车或者三轮摩托拖车的公司。不包括归类于“娱乐用品”子行业中的自行车制造商。
definition: 生產摩托車、小型摩托車或者三輪摩托拖車的公司。不包括歸類於“娛樂用品”子行業中的自行車製造商。
definition: 自動二輪車、スクーターおよび自動三輪車を製造する会社。産業サブグループの「レジャー用品」に分類される自転車は除く。 @ja
definition: 오토바이, 스쿠터, 또는 삼륜차를 생산하는 회사. ‘레저용 제품’으로 분류되는 자전거는 제외. @ko
notation: 25102020
valid from: 2016-09-01
valid till: 2018-09-29

汽車
type: GlobalIndustryClassificationStandardsClassifier
type: IndustryClassifier
type: NamedIndividual
is contemporary version of: http://data.ga-group.nl/ics/gics/251020
is replaced by: http://data.ga-group.nl/ics/gics/2018/251020
is version of: http://data.ga-group.nl/ics/gics/251020
replaces: http://data.ga-group.nl/ics/gics/2014/251020
is industry of: 汽車與汽車零部件
imported on: 2026-05-27T08:45:00.430Z
last refreshed on: 2026-05-31T09:56:29.350Z
source accessed on: 2017-10-19T03:34:33Z
source last accessed on: 2019-06-07T09:41:30Z
label: Automóveis @pt
label: Automóviles @es
label: Automobilbranche @de
label: Automobiles @en
label: Automobili @it
label: Производство автомобилей @ru
label: 汽车
label: 自動車 @ja
label: 자동차 @ko
notation: 251020
valid from: 2016-09-01
valid till: 2018-09-29

汽車與汽車零部件
type: GlobalIndustryClassificationStandardsClassifier
type: IndustryGroupClassifier
type: NamedIndividual
is contemporary version of: http://data.ga-group.nl/ics/gics/2510
is replaced by: http://data.ga-group.nl/ics/gics/2018/2510
is version of: http://data.ga-group.nl/ics/gics/2510
replaces: http://data.ga-group.nl/ics/gics/2014/2510
is industry group of: 非日常生活消費品
imported on: 2026-05-27T08:45:00.430Z
last refreshed on: 2026-05-31T09:56:29.350Z
source accessed on: 2017-10-19T03:34:33Z
source last accessed on: 2019-06-07T09:41:30Z
label: Automóveis e Componentes @pt
label: Automóviles y Componentes @es
label: Automezzi e componenti @it
label: Automobile & Komponenten @de
label: Automobiles & Components @en
label: Automobiles et Composants Automobiles @fr
label: Автотранспортные средства и комплектующие @ru
label: 汽车与汽车零部件
label: 自動車・自動車部品 @ja
label: 자동차와 부품 @ko
notation: 2510
valid from: 2016-09-01
valid till: 2018-09-29

消費電子產品
type: GlobalIndustryClassificationStandardsClassifier
type: SubindustryClassifier
type: NamedIndividual
is contemporary version of: http://data.ga-group.nl/ics/gics/25201010
is replaced by: http://data.ga-group.nl/ics/gics/2018/25201010
is version of: http://data.ga-group.nl/ics/gics/25201010
replaces: http://data.ga-group.nl/ics/gics/2014/25201010
is subindustry of: 家庭耐用消費品
imported on: 2026-05-27T08:45:00.430Z
last refreshed on: 2026-05-31T09:56:29.350Z
source accessed on: 2017-10-19T03:34:33Z
source last accessed on: 2019-06-07T09:41:30Z
label: Aparatos Eléctricos @es
label: Consumer Electronics @en
label: Elettronica di consumo @it
label: Produtos Eletrônicos de Consumo @pt
label: Verbraucherelektronik @de
label: Производство бытовой электроники @ru
label: 民生用電子機器 @ja
label: 消费电子产品
label: 가전제품 @ko
definition: Fabricantes de aparatos electrónicos de consumo doméstico, incluyendo televisores, equipos de alta fidelidad, consolas de juego, camaras digitales y productos relacionados. Se excluyen los fabricantes de computadoras personales, clasificados en la rama de Hardware, Almacenamiento y Periféricos, así como los de electrodomésticos, clasificados en la rama de Electrodomésticos. @es
definition: Fabricantes de produtos eletrônicos de consumo, incluindo televisores, equipamentos de áudio domésticos, consoles de jogos, câmeras digitais e produtos relacionados. Exclui os fabricantes de computadores pessoais, classificados na Sub-Indústria de Tecnologia de Hardware, Armazenamento e Periféricos, e aparelhos eletrodomésticos, classificados na Sub-Indústria de Aparelhos Domésticos. @pt
definition: Hersteller von Elektronikprodukten, einschließlich Fernsehern, Audiogeräten für den Privatgebrauch, Computerspielkonsolen, digitalen Kameras und verwandten Produkten. Ausgeschlossen sind Hersteller von PCs für den Privatgebrauch, die der Branche „Hardware Technologie, Speicherung & Peripherie“ angehören, sowie Hersteller von elektrischen Haushaltsgeräten, die der Branche „Haushaltsgeräte“ angehören. @de
definition: Manufacturers of consumer electronics products including TVs, home audio equipment, game consoles, digital cameras, and related products. Excludes personal home computer manufacturers classified in the Technology Hardware, Storage & Peripherals Sub-Industry, and electric household appliances classified in the Household Appliances Sub-Industry. @en
definition: Società produttrici di prodotti elettronici di consumo, quali televisori, apparecchiatura acustica per la casa, console di gioco, macchine fotografiche digitali e prodotti relativi. In questo ramo non rientrano i produttori di personal computer classificati nel ramo Tecnologia Hardware, Archiviazione e Periferiche e i produttori di elettrodomestici classificati nel ramo Apparecchi Domestici. @it
definition: TV, 가정용 오디오 장��, 게임 콘솔, 디지털 카메라, 관련 제품을 포함한 소비자 전자제품 제조업체. ‘기술 하드웨어, 스토리지 & 주변기기’로 분류된 개인용 홈 컴퓨터 제조업체와 ‘가정용 기기’로 분류된 가정용 전자 기기는 제외 @ko
definition: Производители бытовой электроники, в том числе телевизоров, бытового аудиооборудования, игровых приставок, цифровых видеокамер и сопутствующих товаров. В данную группу не входят производители домашних персональных компьютеров, включенные в подотрасль «Аппаратное обеспечение, устройства хранения данных, периферийные устройства», а также бытовой техники, включенные в подотрасль «Производство бытовой техники». @ru
definition: テレビ、家庭用ビデオ機器、ゲームコンソール、デジタルカメラーおよび関連製品を含む民生用電子機器の製造会社。産業サブグループの「テクノロッジー ハードウェア・コンピュータ記憶装置・周辺機器」に分類される家庭用パーソナルコンピュータの製造会社、および「家庭用電気機器」に分類される家庭用電子機器の製造会社は除く。 @ja
definition: 消費電子產品製造商。這些產品包括電視機、錄像機、音響設備、遊戲機以及相關產品。不包括歸類於“電腦硬體、儲存設備及電腦週邊”子行業中的個人電腦製造商，也不包括歸類於“家用電器”子行業中的家用電器製造商。
definition: 消费电子产品制造商，这些产品包括电视机、录像机、音响设备、游戏机以及相关产品。不包括归类于“电脑硬件、储存设备及电脑周边”子行业中的个人电脑制造商，也不包括归类于“家用电器”子行业中的家用电器制造商。
notation: 25201010
valid from: 2016-09-01
valid till: 2018-09-29

家庭装饰品
type: GlobalIndustryClassificationStandardsClassifier
type: SubindustryClassifier
type: NamedIndividual
is contemporary version of: http://data.ga-group.nl/ics/gics/25201020
is replaced by: http://data.ga-group.nl/ics/gics/2018/25201020
is version of: http://data.ga-group.nl/ics/gics/25201020
replaces: http://data.ga-group.nl/ics/gics/2014/25201020
is subindustry of: 家庭耐用消費品
imported on: 2026-05-27T08:45:00.430Z
last refreshed on: 2026-05-31T09:56:29.350Z
source accessed on: 2017-10-19T03:34:33Z
source last accessed on: 2019-06-07T09:41:30Z
label: Arredi per la casa @it
label: Decoração @pt
label: Home Furnishings @en
label: Möbel & Innenausstattung @de
label: Mobiliario para el Hogar @es
label: Производство товаров для дома @ru
label: 家具・装飾 @ja
label: 家庭裝飾品
label: 가정용 가구 @ko
definition: Empresas dedicadas a la fabricación de mobiliario para el hogar. Se incluyen los fabricantes de tapicería, alfombras o revestimiento de paredes. @es
definition: Fabricantes de artigos de decoração em tecido ou de móveis, incluindo tapeçaria, tapetes e revestimentos de parede. @pt
definition: Hersteller von Heimtextilien oder Möbeln, einschließlich Polstermöbeln, Teppichen und Tapeten. @de
definition: Manufacturers of soft home furnishings or furniture, including upholstery, carpets and wall-coverings. @en
definition: Produttori di tappezzeria o materiali per imbottiture, tappeti e rivestimenti di pareti. @it
definition: Производители мягкой мебели или обстановки для дома, в том числе обивочных материалов, ковровых изделий и материалов для облицовки стен. @ru
definition: 室内装飾材料、カーペット、壁装材料を含む室��装飾品（ソフト ファニシング）や家具の製造会社。 @ja
definition: 軟性家庭裝飾品及傢俱製造商，包括傢俱覆蓋飾物、地毯和牆面裝飾材料。
definition: 软性家庭装饰品及家具制造商，包括家具覆盖饰物、地毯和墙面装饰材料。
definition: 실내 장식용품, 카펫, 벽지를 포함한 소프트 가정용 세간 또는 가구 제조업체. @ko
notation: 25201020
valid from: 2016-09-01
valid till: 2018-09-29

住宅建筑
type: GlobalIndustryClassificationStandardsClassifier
type: SubindustryClassifier
type: NamedIndividual
is contemporary version of: http://data.ga-group.nl/ics/gics/25201030
is replaced by: http://data.ga-group.nl/ics/gics/2018/25201030
is version of: http://data.ga-group.nl/ics/gics/25201030
replaces: http://data.ga-group.nl/ics/gics/2014/25201030
is subindustry of: 家庭耐用消費品
imported on: 2026-05-27T08:45:00.430Z
last refreshed on: 2026-05-31T09:56:29.350Z
source accessed on: 2017-10-19T03:34:33Z
source last accessed on: 2019-06-07T09:41:30Z
label: Construção Residencial @pt
label: Construcción de Viviendas @es
label: Edilizia @it
label: Haus- & Wohnungsbau @de
label: Homebuilding @en
label: Жилищное строительство @ru
label: 住宅建築
label: 住宅建設 @ja
label: 주택 건설 @ko
definition: Costruttori di edifici residenziali, inclusi i costruttori di case prefabbricate e semifisse. @it
definition: Empresas de construção residencial. Inclui fabricantes de casas pré-fabricadas e casas fabricadas semi-prontas. @pt
definition: Empresas dedicadas a la construcción residencial. Se incluyen los constructores de casas prefabricadas y semifijas. @es
definition: Residential construction companies. Includes manufacturers of prefabricated houses and semi-fixed manufactured homes. @en
definition: Unternehmen, die im Haus- und Wohnungsbau tätig sind. Hierzu gehören auch Hersteller von vorgefertigten Häusern und beweglichen Häusern. @de
definition: Компании по строительству жилья, в том числе производители сборных домов и домов без окончательной отделки. @ru
definition: 住宅建筑公司。包括预制房屋和半固定活动房屋制造商。
definition: 住宅建築公司。包括預製房屋和半固定活動房屋製造商。
definition: 居住用建築の請負会社。プレハブ建築物や半固定式家屋の製造会社を含む。 @ja
definition: 주택 건설 기업. 조립식 주택과 반고정 제작 주택 제조업체 포함. @ko
notation: 25201030
valid from: 2016-09-01
valid till: 2018-09-29

家用电器
type: GlobalIndustryClassificationStandardsClassifier
type: SubindustryClassifier
type: NamedIndividual
is contemporary version of: http://data.ga-group.nl/ics/gics/25201040
is replaced by: http://data.ga-group.nl/ics/gics/2018/25201040
is version of: http://data.ga-group.nl/ics/gics/25201040
replaces: http://data.ga-group.nl/ics/gics/2014/25201040
is subindustry of: 家庭耐用消費品
imported on: 2026-05-27T08:45:00.430Z
last refreshed on: 2026-05-31T09:56:29.350Z
source accessed on: 2017-10-19T03:34:33Z
source last accessed on: 2019-06-07T09:41:30Z
label: Aparelhos Domésticos @pt
label: Apparecchi domestici @it
label: Electrodomésticos @es
label: Haushaltsgeräte @de
label: Household Appliances @en
label: Производство бытовой техники @ru
label: 家庭用電気機器 @ja
label: 家用電器
label: 가정용 기기 @ko
definition: Empresas dedicadas a la fabricación de electrodomésticos y productos relacionados. Se incluyen los fabricantes de aparatos eléctricos, herramientas y utensilios de jardinería. Se excluyen los fabricantes de televisores y otros productos de audio y vídeo clasificados en la rama de Equipos Tecnológicos, Almacenamiento Electrónico y Periféricos.\n @es
definition: Fabricantes de aparelhos eletrodomésticos e produtos relacionados. Inclui os fabricantes de ferramentas elétricas e manuais, incluindo ferramentas de jardinagem. Exclui televisores e outros produtos de áudio e vídeo, classificados na Sub-Indústria de Produtos Eletrônicos de Consumo, e computadores pessoais, classificados na Sub-Indústria de Tecnologia de Hardware, Armazenamento e Periféricos. @pt
definition: Hersteller von elektrischen Haushaltsgeräten und verwandten Produkten. Hierzu gehören auch Hersteller von Elektrowerkzeugen, einschließlich Gartenwerkzeugen. Ausgeschlossen sind Fernseher sowie andere Audio- und Videoprodukte, die in die Branche „Verbraucherelektronik“ fallen, sowie PCs, die in die Branche „Computer-Hardware“ fallen. @de
definition: Manufacturers of electric household appliances and related products. Includes manufacturers of power and hand tools, including garden improvement tools. Excludes TVs and other audio and video products classified in the Consumer Electronics Sub-Industry and personal computers classified in the Technology Hardware, Storage & Peripherals Sub-Industry. @en
definition: Società produttrici di elettrodomestici e prodotti affini. Sono inclusi i produttori di apparecchi elettrici e manuali, fra i quali gli attrezzi per il giardinaggio. Sono esclusi i televisori e gli altri prodotti audio e video classificati nel ramo Elettronica di consumo, nonché i personal computer classificati nel ramo Hardware. @it
definition: Производители электрической бытовой техники и сопутствующих товаров, в том числе производители электрических и механических инструментов и садового инвентаря. В данную группу не входят производители телевизионного и другого аудио- и видеооборудования, включенные в подотрасль «Производство бытовой электроники», и производители персональных компьютеров, включенные в подотрасль «Аппаратное обеспечение, устройства хранения памяти данных, периферийные устройства». @ru
definition: 家庭用電子機器や関連製品の製造会社。造園用道具を含む電動工具やハンドツールの製造会社を含む。産業サブグループの「民生用電子機器」に分類されるテレビや他のオーディオ・ビデオ製品、および「テクノロッジー ハードウェア・コンピュータ記憶装置・周辺機器」に分類されるパーソナルコンピュータは除く。 @ja
definition: 家用电器及相关产品制造商。包括电动和手工具（包括园艺工具）制造商。不包括归类于“消费电子产品”子行业中的电视机和其它音视频产品，也不包括归类于“电脑硬件、储存设备及电脑周边”子行业中的个人电脑。
definition: 家用電器及相關產品製造商。包括電動和手工具（包括園藝工具）製造商。不包括歸類於“消費電子產品”子行業中的電視機和其他音視頻產品，也不包括歸類於“電腦硬體、儲存設備及電腦週邊”子行業中的個人電腦。
definition: 가정용 전기 기기 및 관련 제품 제조업체. 정원용 기기를 포함한 전동 및 수동 기구 제조업체 포함. ‘소비자 전자제품’으로 분류되는 TV 및 기타 오디오/비디오 제품, 그리고 ‘기술 하드웨어, 스토리지 & 주변기기’로 분류되는 개인용 컴퓨터는 제외. @ko
notation: 25201040
valid from: 2016-09-01
valid till: 2018-09-29

品家用器具與特殊消費品
type: GlobalIndustryClassificationStandardsClassifier
type: SubindustryClassifier
type: NamedIndividual
is contemporary version of: http://data.ga-group.nl/ics/gics/25201050
is replaced by: http://data.ga-group.nl/ics/gics/2018/25201050
is version of: http://data.ga-group.nl/ics/gics/25201050
replaces: http://data.ga-group.nl/ics/gics/2014/25201050
is subindustry of: 家庭耐用消費品
imported on: 2026-05-27T08:45:00.430Z
last refreshed on: 2026-05-31T09:56:29.350Z
source accessed on: 2017-10-19T03:34:33Z
source last accessed on: 2019-06-07T09:41:30Z
label: Articulos Domésticos de Cocina y Cristalería @es
label: Artigos de Utilidade Doméstica e Especialidades @pt
label: Casalinghi @it
label: Haushaltswaren & Sonderartikel @de
label: Housewares & Specialties @en
label: Производство предметов домашнего обихода и обустройства @ru
label: 家庭用品・雑貨 @ja
label: 家用器具与特殊消费品
label: 가정용품과 소비자 용품 @ko
definition: Empresas dedicadas a la fabricación de artículos domésticos duraderos como cuberterías, utensilios de cocina, cristalerías u otros artículos de cristal o plata, y otros productos domésticos especializados, no incluidas en otra clasificación. @es
definition: Fabbricanti di prodotti per la casa durevoli, fra i quali posateria, vasellame, bicchieri, cristalleria, argenteria, utensili da cucina e articoli speciali di consumo non classificati altrove. @it
definition: Fabricantes de produtos domésticos duráveis​​, incluindo talheres, panelas, copos, cristais, prataria, utensílios de cozinha e especialidades de consumo não classificadas em nenhum outro lugar. @pt
definition: Hersteller von Haushaltswaren, einschließlich Besteck, Geschirr, Töpfen und Pfannen, Glas-, Kristall- und Silberwaren, Küchengeräten, Küchengeschirr und speziellen Gebrauchsgütern, die in keine der übrigen Branchen fallen. @de
definition: Manufacturers of durable household products, including cutlery, cookware, glassware, crystal, silverware, utensils, kitchenware and consumer specialties not classified elsewhere. @en
definition: Производители предметов домашнего обихода длительного пользования, в том числе столовых приборов, домашней утвари, стеклянной посуды, хрусталя, изделий из серебра, столовой и кухонной посуды и потребительских товаров, не включенных в другие группы. @ru
definition: 家庭用耐久材の製造会社。刃物類、調理器具、ガラス製品、クリスタル製品、食卓用銀製品、調理用具、台所用品および他のグループに分類されていない消費者雑貨を含���。 @ja
definition: 家庭耐用品制造商。这些用品包括餐具、炊具、玻璃器具、水晶、银器、刀叉、厨房用具以及未归类于别处的特殊消费品。
definition: 家庭耐用品製造商。這些用品包括餐具、炊具、玻璃器具、水晶、銀器、刀叉、廚房用具以及未歸類於別處的特殊消費品。
definition: 다른 부문으로 분류되지 않은 날붙이, 요리도구, 유리 그릇, 크리스탈 식기류, 은식기류, 가정용품, 부엌용품, 소비자 용품을 포함한 내구적인 가정용품 제조업체. @ko
notation: 25201050
valid from: 2016-09-01
valid till: 2018-09-29

家庭耐用消費品
type: GlobalIndustryClassificationStandardsClassifier
type: IndustryClassifier
type: NamedIndividual
is contemporary version of: http://data.ga-group.nl/ics/gics/252010
is replaced by: http://data.ga-group.nl/ics/gics/2018/252010
is version of: http://data.ga-group.nl/ics/gics/252010
replaces: http://data.ga-group.nl/ics/gics/2014/252010
is industry of: 耐用消費品與服裝
imported on: 2026-05-27T08:45:00.430Z
last refreshed on: 2026-05-31T09:56:29.350Z
source accessed on: 2017-10-19T03:34:33Z
source last accessed on: 2019-06-07T09:41:30Z
label: Bienes de Uso Doméstico Duradero @es
label: Biens de Consommation Durables de Logement @fr
label: Gebrauchsgüter @de
label: Household Durables @en
label: Prodotti durevoli per la casa @it
label: Produtos Domésticos Duráveis @pt
label: Производство бытовой техники длительного пользования @ru
label: 家庭用耐久財 @ja
label: 家庭耐用消费品
label: 가정용 내구재 @ko
notation: 252010
valid from: 2016-09-01
valid till: 2018-09-29

消閒用品
type: GlobalIndustryClassificationStandardsClassifier
type: SubindustryClassifier
type: NamedIndividual
is contemporary version of: http://data.ga-group.nl/ics/gics/25202010
is replaced by: http://data.ga-group.nl/ics/gics/2018/25202010
is version of: http://data.ga-group.nl/ics/gics/25202010
replaces: http://data.ga-group.nl/ics/gics/2014/25202010
is subindustry of: 休閒設備與用品
imported on: 2026-05-27T08:45:00.430Z
last refreshed on: 2026-05-31T09:56:29.350Z
source accessed on: 2017-10-19T03:34:33Z
source last accessed on: 2019-06-07T09:41:30Z
label: Articoli per il tempo libero @it
label: Freizeitartikel @de
label: Leisure Products @en
label: Productos Recreativos @es
label: Produtos para Lazer @pt
label: Производство оборудования и товаров для отдыха @ru
label: レジャー用品 @ja
label: 消闲用品
label: 레저용 제품 @ko
definition: Empresas dedicadas a la fabricación de equipos y productos de recreación. Se incluyen los fabricantes de equipos deportivos, bicicletas y juguetes. @es
definition: Fabricantes de produtos e equipamento para lazer, incluindo equipamentos esportivos, bicicletas e brinquedos. @pt
definition: Hersteller von Freizeitartikeln und -ausstattung, einschließlich Sportausstattung, Fahrrädern und Spielzeug. @de
definition: Manufacturers of leisure products and equipment including sports equipment, bicycles and toys. @en
definition: Società produttrici di articoli per il tempo libero e di attrezzatura per lo sport, biciclette e giocattoli. @it
definition: Производители товаров и оборудования для отдыха, в ��ом числе производители спортивного инвентаря, велосипедов и игрушек. @ru
definition: スポーツ用品、自転車、玩具を含むレジャー用品・設備の製造会社。 @ja
definition: 消閒用品及設備（包括體育用品、自行車和玩具）製造商。
definition: 消闲用品及设备（包括体育用品、自行��和玩具）制造商。
definition: 스포츠 장비, 자전거, 장난감을 포함한 레저용 제품 및 장비 제조업체. @ko
notation: 25202010
valid from: 2016-09-01
valid till: 2018-09-29

休閒設備與用品
type: GlobalIndustryClassificationStandardsClassifier
type: IndustryClassifier
type: NamedIndividual
is contemporary version of: http://data.ga-group.nl/ics/gics/252020
is replaced by: http://data.ga-group.nl/ics/gics/2018/252020
is version of: http://data.ga-group.nl/ics/gics/252020
replaces: http://data.ga-group.nl/ics/gics/2014/252020
is industry of: 耐用消費品與服裝
imported on: 2026-05-27T08:45:00.430Z
last refreshed on: 2026-05-31T09:56:29.350Z
source accessed on: 2017-10-19T03:34:33Z
source last accessed on: 2019-06-07T09:41:30Z
label: Articoli per il tempo libero @it
label: Freizeitartikel @de
label: Leisure Products @en
label: Oборудованиe и товары для отдыха @ru
label: Productos Recreativos @es
label: Produits de Loisirs @fr
label: Produtos para Lazer @pt
label: レジャー用品 @ja
label: 休闲设备与用品
label: 레저용 제품 @ko
notation: 252020
valid from: 2016-09-01
valid till: 2018-09-29

服装、服饰与奢侈品
type: GlobalIndustryClassificationStandardsClassifier
type: SubindustryClassifier
type: NamedIndividual
is contemporary version of: http://data.ga-group.nl/ics/gics/25203010
is replaced by: http://data.ga-group.nl/ics/gics/2018/25203010
is version of: http://data.ga-group.nl/ics/gics/25203010
replaces: http://data.ga-group.nl/ics/gics/2014/25203010
is subindustry of: 紡織品、服裝與奢侈品
imported on: 2026-05-27T08:45:00.430Z
last refreshed on: 2026-05-31T09:56:29.350Z
source accessed on: 2017-10-19T03:34:33Z
source last accessed on: 2019-06-07T09:41:30Z
label: Abbigliamento, accessori e articoli di lusso @it
label: Apparel, Accessories & Luxury Goods @en
label: Articulos de Confección, Accesorios y Bienes de Lujo @es
label: Bekleidung & Zubehör & Luxusgüter @de
label: Vestuário, Acessórios e Artigos de Luxo @pt
label: Производство одежды, аксессуаров и предметов роскоши @ru
label: アパレル・アクセサリー・贅沢品 @ja
label: 服裝、服飾與奢侈品
label: 의류, 액세서리, 사치품 @ko
definition: Empresas dedicadas a la confección y elaboración de accesorios y bienes de lujo. Se incluyen los fabricantes de bolsos, carteras, equipaje, joyería y relojería de diseño. Se excluyen los fabricantes de calzado clasificados en la rama Calzado. @es
definition: Fabricantes de vestuário, acessórios e artigos de luxo. Inclui empresas que produzem principalmente bolsas de grife, carteiras, malas, joias e relógios. Exclui sapatos, classificados na Sub-Indústria de Calçados. @pt
definition: Hersteller von Bekleidung, Zubehör und Luxusgütern. Hierzu gehören auch Unternehmen, die hauptsächlich Designer-Artikel wie Handtaschen, Brieftaschen, Reisegepäck, Schmuck und Uhren herstellen. Ausgeschlossen sind Schuhe, die in die Branche „Fußbekleidung“ fallen. @de
definition: Manufacturers of apparel, accessories & luxury goods. Includes companies primarily producing designer handbags, wallets, luggage, jewelry and watches. Excludes shoes classified in the Footwear Sub-Industry. @en
definition: Produttori di articoli di abbigliamento, accessori e articoli di lusso. Sono comprese le società che producono principalmente borse, portafogli, valigie, gioielli e orologi. Sono escluse le calzature, classificate nel ramo Calzature. @it
definition: Производители одежды, аксессуаров и предметов роскоши, в том числе компании, занимающиеся в основном производством авторских дамских сумок, кошельков, чемоданов, ювелирных изделий и часов. В данную группу не входят производители обуви, включенные в подотрасль «Производство обуви». @ru
definition: アパレル、アクセサリー、贅沢品の製造会社。ブランド品ハンドバッグ、財布、旅行用カバン、宝石類、時計を主に製造する会社を含む。産業サブグループの「履物」に分類される履物は除く。 @ja
definition: 服装、服饰与奢侈品制造商。包括那些主要生产名设计师手提包、皮夹、行李箱、珠宝和手表的公司。不包括归类于“鞋类”子行业中的鞋类用品。
definition: 服裝、服飾與奢侈品製造商。包括那些主要生產名設計師手提包、皮夾、行李箱、珠寶和手錶的公司。不包括歸類於“鞋類”子行業中的鞋類用品。
definition: 의류, 액세서리, 사치품 제조업체. 유명 디자이너의 핸드백, 지갑, 가방, 보석, 시계를 주로 생산하는 회사 포함. ‘신발’로 분류되는 신발은 제외. @ko
notation: 25203010
valid from: 2016-09-01
valid till: 2018-09-29

鞋类
type: GlobalIndustryClassificationStandardsClassifier
type: SubindustryClassifier
type: NamedIndividual
is contemporary version of: http://data.ga-group.nl/ics/gics/25203020
is replaced by: http://data.ga-group.nl/ics/gics/2018/25203020
is version of: http://data.ga-group.nl/ics/gics/25203020
replaces: http://data.ga-group.nl/ics/gics/2014/25203020
is subindustry of: 紡織品、服裝與奢侈品
imported on: 2026-05-27T08:45:00.430Z
last refreshed on: 2026-05-31T09:56:29.350Z
source accessed on: 2017-10-19T03:34:33Z
source last accessed on: 2019-06-07T09:41:30Z
label: Calçados @pt
label: Calzado @es
label: Calzature @it
label: Footwear @en
label: Fußbekleidung @de
label: Производство обуви @ru
label: 履物 @ja
label: 鞋類
label: 신발 @ko
definition: Empresas dedicadas a la fabricación de calzado. Se incluyen los fabricantes de calzado deportivo y de cuero. @es
definition: Fabbricanti di calzature. Sono incluse le calzature sportive e in pelle. @it
definition: Fabricantes de calçados. Inclui sapatos esportivos e de couro. @pt
definition: Hersteller von Schuhen. Hierzu gehören auch Sportschuhe und Lederschuhe. @de
definition: Manufacturers of footwear. Includes sport and leather shoes. @en
definition: Производители обуви, в том числе спортивной и кожаной. @ru
definition: 履物の製造会社。スポーツ用および皮製の靴を含む。 @ja
definition: 鞋类用品制造商。包括运动鞋和皮鞋。
definition: 鞋類用品製造商。包括運動鞋和皮鞋。
definition: 신발 제조업체. 운동화와 가죽 신발 포함. @ko
notation: 25203020
valid from: 2016-09-01
valid till: 2018-09-29

紡織品
type: GlobalIndustryClassificationStandardsClassifier
type: SubindustryClassifier
type: NamedIndividual
is contemporary version of: http://data.ga-group.nl/ics/gics/25203030
is replaced by: http://data.ga-group.nl/ics/gics/2018/25203030
is version of: http://data.ga-group.nl/ics/gics/25203030
replaces: http://data.ga-group.nl/ics/gics/2014/25203030
is subindustry of: 紡織品、服裝與奢侈品
imported on: 2026-05-27T08:45:00.430Z
last refreshed on: 2026-05-31T09:56:29.350Z
source accessed on: 2017-10-19T03:34:33Z
source last accessed on: 2019-06-07T09:41:30Z
label: Têxteis @pt
label: Tessili @it
label: Textil @es
label: Textiles @en
label: Textilien @de
label: Производство текстильной продукции @ru
label: 繊維 @ja
label: 纺织品
label: 섬유 @ko
definition: Empresas dedicadas a la fabricación textil y de artículos relacionados, no incluidas en las ramas Confección, Accesorios y Bienes de Lujo, Calzado o Mobiliario para el Hogar. @es
definition: Fabricantes de têxteis e produtos relacionados não classificados nas Sub-Indústrias de Vestuário, Acessórios e Artigos de Luxo, Calçados ou Decoração. @pt
definition: Hersteller von Textilien und verwandten Produkten, die nicht in die Branchen „Bekleidung & Zubehör & Luxusgüter“, „Fußbekleidung“ und „Möbel & Innenausstattung“ fallen. @de
definition: Manufacturers of textile and related products not classified in the Apparel, Accessories & Luxury Goods, Footwear or Home Furnishings Sub-Industries. @en
definition: Società produttrici di prodotti tessili e affini non classificati in Abbigliamento, accessori e articoli di lusso, Calzature o Forniture per la casa. @it
definition: Производители текстильной и сопутствующей продукции, не включенные в подотрасли «Производство одежды, аксессуаров и предметов роскоши», «Производство обуви» или «Производство товаров для дома». @ru
definition: ‘의류, 액세서리, 사치품’, ‘신발’ 또는 ‘가정용 가구’로 분류되지 않은 섬유 및 관련 제품 제조업체. @ko
definition: 紡織品及相關產品製造商。不包括那些歸類於“服裝、服飾與奢侈品”、“鞋類”或者“家庭裝飾品”子行業中的公司。
definition: 繊維、および産業サブグループの「アパレル・アクセサリー・贅沢品」、「履物」、「家具・装飾」に分類されていない関連製品の製造会社。 @ja
definition: 纺织品及相关产品制造商。不包括那些归类于“服装、服饰与奢侈品”、“鞋类”或者“家庭装饰品”子行业中的公司。
notation: 25203030
valid from: 2016-09-01
valid till: 2018-09-29

紡織品、服裝與奢侈品
type: GlobalIndustryClassificationStandardsClassifier
type: IndustryClassifier
type: NamedIndividual
is contemporary version of: http://data.ga-group.nl/ics/gics/252030
is replaced by: http://data.ga-group.nl/ics/gics/2018/252030
is version of: http://data.ga-group.nl/ics/gics/252030
replaces: http://data.ga-group.nl/ics/gics/2014/252030
is industry of: 耐用消費品與服裝
imported on: 2026-05-27T08:45:00.430Z
last refreshed on: 2026-05-31T09:56:29.350Z
source accessed on: 2017-10-19T03:34:33Z
source last accessed on: 2019-06-07T09:41:30Z
label: Articulos Textiles, de Confección y Bienes de Lujo @es
label: Tecidos, Vestuário e Artigos de Luxo @pt
label: Tessili, abbigliamento e articoli di lusso @it
label: Textiles, Apparel & Luxury Goods @en
label: Textiles, Habillement et Produits de Luxe @fr
label: Textilien & Bekleidung & Luxusgüter @de
label: Производство одежды, аксессуаров и предметов роскоши @ru
label: 繊維・アパレル・贅沢品 @ja
label: 纺织品、服装与奢侈品
label: 섬유, 의류, 사치품 @ko
notation: 252030
valid from: 2016-09-01
valid till: 2018-09-29

耐用消費品與服裝
type: GlobalIndustryClassificationStandardsClassifier
type: IndustryGroupClassifier
type: NamedIndividual
is contemporary version of: http://data.ga-group.nl/ics/gics/2520
is replaced by: http://data.ga-group.nl/ics/gics/2018/2520
is version of: http://data.ga-group.nl/ics/gics/2520
replaces: http://data.ga-group.nl/ics/gics/2014/2520
is industry group of: 非日常生活消費品
imported on: 2026-05-27T08:45:00.430Z
last refreshed on: 2026-05-31T09:56:29.350Z
source accessed on: 2017-10-19T03:34:33Z
source last accessed on: 2019-06-07T09:41:30Z
label: Bienes de Consumo Duradero y Confección @es
label: Biens de Consommation Durables et Habillement @fr
label: Consumer Durables & Apparel @en
label: Gebrauchsgüter & Bekleidung @de
label: Prodotti durevoli e tessili @it
label: Produtos de Consumo Duráveis ​​e Vestuário @pt
label: Потребительские товары длительного пользования и одежда @ru
label: 耐久消費財・アパレル @ja
label: 耐用消费品与服装
label: 내구 소비재와 의류 @ko
notation: 2520
valid from: 2016-09-01
valid till: 2018-09-29

賭場與賭博
type: GlobalIndustryClassificationStandardsClassifier
type: SubindustryClassifier
type: NamedIndividual
is contemporary version of: http://data.ga-group.nl/ics/gics/25301010
is replaced by: http://data.ga-group.nl/ics/gics/2018/25301010
is version of: http://data.ga-group.nl/ics/gics/25301010
replaces: http://data.ga-group.nl/ics/gics/2014/25301010
is subindustry of: 酒店、餐館與休閒
imported on: 2026-05-27T08:45:00.430Z
last refreshed on: 2026-05-31T09:56:29.350Z
source accessed on: 2017-10-19T03:34:33Z
source last accessed on: 2019-06-07T09:41:30Z
label: Casinò e case da gioco @it
label: Casinos & Gaming @en
label: Casinos & Glücksspiel @de
label: Casinos y Juegos de Azar @es
label: Cassinos e Jogos @pt
label: Деятельность казино и игорного бизнеса @ru
label: カジノ・ゲーム @ja
label: 赌场与赌博
label: 카지노와 게임 @ko
definition: Besitzer und Betreiber von Casinos und Glücksspieleinrichtungen. Hierzu gehören auch Lotteriebetreiber und Wettbüros. @de
definition: Owners and operators of casinos and gaming facilities. Includes companies providing lottery and betting services. @en
definition: Propietarios y operadores de casinos y salones recreativos y de juego. Se incluyen las empresas de lotería y servicios de apuestas. @es
definition: Proprietários e operadores de cassinos e instalações de jogos. Inclui empresas provedoras de serviços de loteria e apostas. @pt
definition: Proprietari e gestori di casinò e case da gioco. Sono incluse le società che organizzano lotterie e scommesse. @it
definition: Компании, владеющие казино и предприятиями игорного бизнеса, и занимающиеся их эксплуатацией, в том числе компании, занимающиеся организацией лотерей и услуг тотализатора. @ru
definition: カジノ・ゲーム設備の所有者や運営業者。宝くじ、ギャンブルサービスを提供している会社を含む。 @ja
definition: 賭場及賭博設施的業主和運營商。包括那些提供彩票和賭博服務的公司。
definition: 赌场及赌博设施的业主和运营商。包括那些提供博彩和赌博服务的公司。
definition: 카지노와 게임 시설의 소유자와 운영자. 복권과 베팅 서비스 제공 회사 포함. @ko
notation: 25301010
valid from: 2016-09-01
valid till: 2018-09-29

酒店、度假村与豪华游轮
type: GlobalIndustryClassificationStandardsClassifier
type: SubindustryClassifier
type: NamedIndividual
is contemporary version of: http://data.ga-group.nl/ics/gics/25301020
is replaced by: http://data.ga-group.nl/ics/gics/2018/25301020
is version of: http://data.ga-group.nl/ics/gics/25301020
replaces: http://data.ga-group.nl/ics/gics/2014/25301020
is subindustry of: 酒店、餐館與休閒
imported on: 2026-05-27T08:45:00.430Z
last refreshed on: 2026-05-31T09:56:29.350Z
source accessed on: 2017-10-19T03:34:33Z
source last accessed on: 2019-06-07T09:41:30Z
label: Hotéis, Resorts e Linhas de Cruzeiros @pt
label: Hoteles, Centros de Vacaciones y Cruceros @es
label: Hotels, Resorts & Cruise Lines @en
label: Hotels, Urlaubsanlagen & Kreuzfahrtlinien @de
label: Hotels, Villaggi vacanze, Navi da Crociera @it
label: Деятельность гостиниц, курортов и организация круизов @ru
label: ホテル・リゾート・クルーズ船 @ja
label: 酒店、度假村與豪華游輪
label: 호텔, 리조트, 크루즈 @ko
definition: Besitzer und Betreiber von Hotels, Urlaubsanlagen und Kreuzfahrtlinien. Hierzu gehören auch Reisebüros, Touranbieter und verwandte Dienstleister, die keiner der übrigen Branchen angehören. Ausgeschlossen sind Hotels mit Casino-Betrieb, die der Branche „Casinos & Glücksspiel“ angehören. @de
definition: Owners and operators of hotels, resorts and cruise-ships. Includes travel agencies, tour operators and related services not classified elsewhere . Excludes casino-hotels classified in the Casinos & Gaming Sub-Industry. @en
definition: Propietarios y operadores de hoteles, centros de vacaciones y cruceros. Se incluyen las agencias de viajes, operadores turísticos y empresas de servicios relacionados, no incluidas en otra clasificación. Se excluyen los hoteles casino incluidos en la rama Casinos y Juegos de Azar. @es
definition: Proprietários e operadores de hotéis, resorts e navios de cruzeiro. Inclui agências de viagens, operadoras de turismo e serviços relacionados não classificadas em nenhum outro lugar. Exclui hotéis casino, classificados na Sub-Indústria de Cassinos e Jogos. @pt
definition: Proprietari e gestori di alberghi, villaggi di vacanze e navi da crociera. Sono inclusi gli operatori turistici, le agenzie di viaggio e i servizi affini non classificati altrove. Sono esclusi i casinò, classificati nel ramo Casinò e case da gioco @it
definition: Компании, вл��деющие гостиницами, курортами и круизными теплоходами и занимающиеся их эксплуатацией, в том числе туристические агентства, туристические операторы и компании, оказывающие сопутствующие услуги и не включенные в другие группы. В данную группу не входят казино, совмещенные с гостиницей, включенные в подотрасль «Деятельность казино и игорного бизнеса». @ru
definition: ホテル、リゾート、クルーズ船の所有者や運営業者。旅行代理店、旅行業者、および他のグループに分類されていない関連サービスの提供業者を含む。産業サブグループの「カジノ・ゲーム」に分類されるカジノ付きホテルは除く。 @ja
definition: 酒店、度假村及豪华游轮的业主和运营商。包括旅行社、旅行团运营商以及相关的服务。不包括归类于“赌场与赌博”子行业中的 赌场酒店。
definition: 酒店、度假村及豪華游輪的業主和運營商。包括旅行社、旅行團運營商以及相關的服務。不包括歸類於“賭場與賭博”子行業中的 賭場酒店。
definition: 호텔, 리조트, 크루즈 선박의 소유자와 운영자. 여행사, 투어 운영, 그리고 다른 부문으로 분류되지 않은 관련 서비스 업체 포함. ‘카지노와 게임’으로 분류되는 카지노-호텔은 제외. @ko
notation: 25301020
valid from: 2016-09-01
valid till: 2018-09-29

消閒設施
type: GlobalIndustryClassificationStandardsClassifier
type: SubindustryClassifier
type: NamedIndividual
is contemporary version of: http://data.ga-group.nl/ics/gics/25301030
is replaced by: http://data.ga-group.nl/ics/gics/2018/25301030
is version of: http://data.ga-group.nl/ics/gics/25301030
replaces: http://data.ga-group.nl/ics/gics/2014/25301030
is subindustry of: 酒店、餐館與休閒
imported on: 2026-05-27T08:45:00.430Z
last refreshed on: 2026-05-31T09:56:29.350Z
source accessed on: 2017-10-19T03:34:33Z
source last accessed on: 2019-06-07T09:41:30Z
label: Centros Recreativos @es
label: Freizeiteinrichtungen @de
label: Instalações para o Lazer @pt
label: Leisure Facilities @en
label: Strutture per il tempo libero @it
label: Деятельность предприятий досуга и отдыха @ru
label: レジャー設備 @ja
label: 消闲设施
label: 레저 시설 @ko
definition: Besitzer und Betreiber von Freizeiteinrichtungen, einschließlich Sport- und Fitnesszentren, Stadien, Golfplätzen und Freizeitparks, die nicht der Branche „Film & Unterhaltung“ angehören. @de
definition: Owners and operators of leisure facilities, including sport and fitness centers, stadiums, golf courses and amusement parks not classified in the Movies & Entertainment Sub-Industry. @en
definition: Propietarios y operadores de centros de recreación. Se incluyen los centros deportivos y gimnasios, estadios, campos de golf y parques de atracciones, no incluidos en la rama Películas y Entretenimiento. @es
definition: Proprietários e operadores de instalações para o lazer, incluindo centros de esporte e fitness, estádios, campos de golfe e parques de diversões não classificados na Sub-Indústria de Filmes e Entretenimento. @pt
definition: Proprietari e gestori di strutture per il tempo libero, compresi centri sportivi e di fitness, stadi, campi da golf e luna park non classificati nel ramo Film e intrattenimento. @it
definition: Компании, владеющие предприятиями досуга и отдыха, в том числе спортивными и оздоровительными центрами, стадионами, полями для гольфа и ��арками аттракционов, не включенными в подотрасль «Деятельность кинотеатров и досугово-развлекательных учреждений», и занимающиеся их эксплуатацией. @ru
definition: ‘영화와 엔터테인먼트’로 분류되지 않은 스포츠 센터, 피트니스 센터, 경기장, 골프장, 놀이공원을 포함한 레저 시설의 소유자와 운영자. @ko
definition: レジャー施設の所有者や運営業者。スポーツ・フィットネスセンター、スタジアム、ゴルフコース、産業サブグループの「映画・娯楽」に分類されていないアミューズメントパークを含む。 @ja
definition: 消閒設施的業主和運營商，這些設施包括體育運動中心、健身中心、體育場、高爾夫球場以及遊樂園（未歸類於“電影與娛樂”子行業）。
definition: 消闲设施的业主和运营商，这些设施包括体育运动中心、健身中心、体育场、高尔夫球场以及游乐园（未归类于“电影与娱乐”子行业）。
notation: 25301030
valid from: 2016-09-01
valid till: 2018-09-29

餐館
type: GlobalIndustryClassificationStandardsClassifier
type: SubindustryClassifier
type: NamedIndividual
is contemporary version of: http://data.ga-group.nl/ics/gics/25301040
is replaced by: http://data.ga-group.nl/ics/gics/2018/25301040
is version of: http://data.ga-group.nl/ics/gics/25301040
replaces: http://data.ga-group.nl/ics/gics/2014/25301040
is subindustry of: 酒店、餐館與休閒
imported on: 2026-05-27T08:45:00.430Z
last refreshed on: 2026-05-31T09:56:29.350Z
source accessed on: 2017-10-19T03:34:33Z
source last accessed on: 2019-06-07T09:41:30Z
label: Restaurantes @es
label: Restaurants @de
label: Ristoranti @it
label: Деятельность ресторанов @ru
label: レストラン @ja
label: 餐馆
label: 레스토랑 @ko
definition: Besitzer und Betreiber von Restaurants, Kneipen, Gaststätten, Fast Food-Restaurants oder Imbissen. Hierzu gehören auch Unternehmen, die Catering-Dienste anbieten. @de
definition: Owners and operators of restaurants, bars, pubs, fast-food or take-out facilities. Includes companies that provide food catering services. @en
definition: Propietarios y operadores de restaurantes, bares, pubs y locales de comida rápida o para llevar. Se incluyen las empresas de catering. @es
definition: Proprietários e operadores de restaurantes, bares, pubs, instalações que servem fast-food ou refeições para viagem. Inclui empresas que fornecem serviços de catering. @pt
definition: Proprietari e gestori di ristoranti, bar, pub, fast-food o locali da asporto. Sono comprese le società che forniscono servizi di catering. @it
definition: Компании, владеющие ресторанами, барами, пабами, предприятиями быстрого питания или предприятиями, продающими еду на вынос, и занимающиеся их эксплуатацией, в том числе компании, занимающиеся организацией питания. @ru
definition: レストラン、バー、パブ、ファーストフード、持ち帰り食料品販売店の所有者や運営業者。配膳サービスを提供する会社を含む。 @ja
definition: 餐館、酒吧、客棧、速食或者外賣服務設施的業主和���營商。包括那些提供外勤飲食供應服務的公司。
definition: 餐馆、酒吧、客栈、快餐或者外卖服务设施的业主和运营商。包括那些提供外勤饮食供应服务的公司。
definition: 레스토랑, 바, 술집, 패스트푸드 또는 테이크아웃 시설의 소유자와 운영자. 음식 케이터링 서비스 제공 회사 포함. @ko
notation: 25301040
valid from: 2016-09-01
valid till: 2018-09-29

酒店、餐館與休閒
type: GlobalIndustryClassificationStandardsClassifier
type: IndustryClassifier
type: NamedIndividual
is contemporary version of: http://data.ga-group.nl/ics/gics/253010
is replaced by: http://data.ga-group.nl/ics/gics/2018/253010
is version of: http://data.ga-group.nl/ics/gics/253010
replaces: http://data.ga-group.nl/ics/gics/2014/253010
is industry of: 消費者服務
imported on: 2026-05-27T08:45:00.430Z
last refreshed on: 2026-05-31T09:56:29.350Z
source accessed on: 2017-10-19T03:34:33Z
source last accessed on: 2019-06-07T09:41:30Z
label: Hôtels, Restaurants et Loisirs @fr
label: Hotéis, Restaurantes e Lazer @pt
label: Hotel, ristoranti e intrattenimento @it
label: Hoteles, Restaurantes y Recreacion @es
label: Hotels, Restaurants & Freizeit @de
label: Hotels, Restaurants & Leisure @en
label: Деятельность гостиниц, ресторанов и мест отдыха @ru
label: ホテル・レストラン・レジャー @ja
label: 酒店、餐馆与休闲
label: 호텔, 레스토랑, 레저 @ko
notation: 253010
valid from: 2016-09-01
valid till: 2018-09-29

教育服务
type: GlobalIndustryClassificationStandardsClassifier
type: SubindustryClassifier
type: NamedIndividual
is contemporary version of: http://data.ga-group.nl/ics/gics/25302010
is replaced by: http://data.ga-group.nl/ics/gics/2018/25302010
is version of: http://data.ga-group.nl/ics/gics/25302010
replaces: http://data.ga-group.nl/ics/gics/2014/25302010
is subindustry of: 綜合消費服務
imported on: 2026-05-27T08:45:00.430Z
last refreshed on: 2026-05-31T09:56:29.350Z
source accessed on: 2017-10-19T03:34:33Z
source last accessed on: 2019-06-07T09:41:30Z
label: Bildungsdienste @de
label: Education Services @en
label: Serviços de Educação @pt
label: Servicios de Educación @es
label: Servizi educativi @it
label: Предоставление услуг в области образования @ru
label: 教育サービス @ja
label: 教育服務
label: 교육 서비스 @ko
definition: Companies providing educational services, either on-line or through conventional teaching methods. Includes, private universities, correspondence teaching, providers of educational seminars, educational materials and technical education. Excludes companies providing employee education programs classified in the Human Resources & Employment Services Sub-Industry @en
definition: Empresas provedoras de serviços de educação, seja on-line ou através de métodos convencionais de ensino. Inclui as universidades privadas, o ensino por correspondência, provedores de seminários educativos, materiais educativos e ensino técnico. Exclui empresas provedoras de programas de educação de funcionários, classificadas na Sub-Indústria de Recursos Humanos e Serviços de Emprego. @pt
definition: Empresas que proporcionan servicios de educación, de forma electrónica o mediante métodos tradicionales de enseñanza. Se Incluyen las universidades privadas, enseñanza a distancia, gestores de seminarios educacionales, material y educación técnica. Quedan excluidas las empresas que proporcionan programas de educación a empleados clasificados en la subindustria de Recursos Humanos y Servicios de Empleo. @es
definition: Società che forniscono servizi educativi, sia on-line che attraverso metodi di insegnamento tradizionali. Sono compresi università private, insegnamento per corrispondenza, fornitori di seminari educativi, materiali educativi e formazione tecnica. Sono escluse le società che forniscono formazione per il personale classificate come Risorse umane e servizi di collocamento @it
definition: Unternehmen, die Bildungsdienste anbieten, entweder online oder mit Hilfe traditioneller Lehrmethoden. Hierzu gehören private Universitäten, Korrespondenzlehre, Anbieter von Bildungsseminaren, Bildungsmaterial und technischer Bildung. Ausgeschlossen sind Unternehmen, die Mitarbeiter-Programme anbieten, die der Branche Humanressourcen & Beschäftigungsdienste angehören. @de
definition: Компании, предоставляющие услуги в области образования с использованием как сети Интернет, так и традиционных методов обучения, в том числе частные университеты, учреждения заочного образования, организаторы учебных семинаров, учреждения, предоставляющие учебные материалы и услуги по техническому образованию. В данную группу не входят компании, организующие программы повышения квалификации работников, включенные в подотрасль «Предоставление услуг по управлению человеческими ресурсами и трудоустройству» @ru
definition: オンラインまたは従来の指導方法で教育サービスを提供する会社。私立大学、通信教育、および教育セミナー、教材、技術教育の提供業者を含む。産業サブグループの「人事・雇用サービス」に分類される社員教育プログラムを提供する会社は除く。 @ja
definition: 通过在线或者传统的教学方法提供教育服务的公司。包括私立大学、函授教学以及提供教育讲座、教育资料和技术培训的公司。不包括归类于“人力资源与就业服务”子行业中提供员工培训项目的公司。
definition: 通過線上或者傳統的教學方法提供教育服務的公司。包括私立大學、函授教學以及提供教育講座、教育資料和技術培訓的公司。不包括歸類于“人力資源與就業服務”子行業中提供員工培訓專案的公司。
definition: 온라인이나 종래의 교수법으로 교육 서비스를 제���하는 회사. 사립 대학, 통신 교육, 교육 세미나/교재/기술 교육 제공업체를 포함. '인적 자원 및 고용 서비스'로 분류되는 직원 교육 프로그램을 제공하는 회사는 제외 @ko
notation: 25302010
valid from: 2016-09-01
valid till: 2018-09-29

特殊消費服務
type: GlobalIndustryClassificationStandardsClassifier
type: SubindustryClassifier
type: NamedIndividual
is contemporary version of: http://data.ga-group.nl/ics/gics/25302020
is replaced by: http://data.ga-group.nl/ics/gics/2018/25302020
is version of: http://data.ga-group.nl/ics/gics/25302020
replaces: http://data.ga-group.nl/ics/gics/2014/25302020
is subindustry of: 綜合消費服務
imported on: 2026-05-27T08:45:00.430Z
last refreshed on: 2026-05-31T09:56:29.350Z
source accessed on: 2017-10-19T03:34:33Z
source last accessed on: 2019-06-07T09:41:30Z
label: Serviços Especializados aos Consumidores @pt
label: Servicios de Consumo Especializados @es
label: Servizi specializzati al consumatore @it
label: Specialized Consumer Services @en
label: Spezialisierte Verbraucherdienste @de
label: Предоставление специализированных потребительских услуг @ru
label: 専門消費者サービス @ja
label: 特殊消费者服务
label: 특화된 소비자 서비스 @ko
definition: Companies providing consumer services not classified elsewhere. Includes residential services, home security, legal services, personal services, renovation & interior design services, consumer auctions and wedding & funeral services. @en
definition: Empresas provedoras de serviços aos consumidores não classificadas em nenhum outro lugar. Inclui serviços residenciais, segurança residencial, serviços jurídicos, serviços pessoais, serviços de renovação e de decoração de interiores, leilões para consumidor e serviços de casamento e funeral. @pt
definition: Empresas que proporcionan servicios no incluidos en ningún otro apartado. Se incluyen los servicios residenciales, seguridad del hogar, servicios legales, servicios personales, renovación y de diseño interior, subastas de consumidores y servicios de matrimonios y de entierro. @es
definition: Società che forniscono servizi al consumatore non classificati altrove. Sono compresi i servizi residenziali, la sicurezza domestica, i servizi legali, i servizi alla persona, i servizi di ristrutturazione e interior design, le aste, i servizi per matrimoni e funerali. @it
definition: Unternehmen, die Verbraucherdienste anbieten und keiner anderen Branche angehören. Hierzu gehören Wohnbaudienste, Heimsicherheit, Rechtsdienste, persönliche Dienstleistungen, Renovierungsdienste und Dienste für Innendesign, Verbraucherauktionen und Hochzeits- und Beerdigungsdienste. @de
definition: Компании, предоставляющие потребительские услуги и не включенные в другие группы. В данную группу входят компании, предоставляющие бытовые, охранные, юридические, персональные услуги, услуги по ремонту и дизайну интерьера, проведению потребительских аукционов, ритуальные услуги и услуги по организации свадебных торжеств. @ru
definition: 他のグループに分類されていない消費者サービスを提供する会社。住宅関連サービス、ホームセキュリティ、法律サービス、パーソナルサービス、改築・インテリアデザインサービス、消費者向けオークション、冠婚葬祭サービスを含む。 @ja
definition: 提供未归类于别处的消费者服务的公司。 包括家居服务、家庭安全、法律服务、个人服务、室内改造与装修服务、消费者拍卖以及婚葬服务。
definition: 提供未歸類于別處的消費服務的公司。 包括家居服務、家庭安全、法律服務、個人服務、室內改造與裝修服務、消費拍賣以及婚葬服務。
definition: 다른 부문으로 분류되지 않은 소비자 서비스를 제공하는 회사. 주거 서비스, 가정 보안, 법률 서비스, 개인 서비스, 리노베이션 및 인테리어 디자인 서비스, 소비자 경매, 예식 및 장례 서비스를 포함. @ko
notation: 25302020
valid from: 2016-09-01
valid till: 2018-09-29

綜合消費服務
type: GlobalIndustryClassificationStandardsClassifier
type: IndustryClassifier
type: NamedIndividual
is contemporary version of: http://data.ga-group.nl/ics/gics/253020
is replaced by: http://data.ga-group.nl/ics/gics/2018/253020
is version of: http://data.ga-group.nl/ics/gics/253020
replaces: http://data.ga-group.nl/ics/gics/2014/253020
is industry of: 消費者服務
imported on: 2026-05-27T08:45:00.430Z
last refreshed on: 2026-05-31T09:56:29.350Z
source accessed on: 2017-10-19T03:34:33Z
source last accessed on: 2019-06-07T09:41:30Z
label: Diversified Consumer Services @en
label: Serviços Diversificados aos Consumidores @pt
label: Services Consommateurs Diversifiés @fr
label: Servicios de Consumo Diversificados @es
label: Servizi al consumatore diversificati @it
label: Verschiedene Verbraucherdienste @de
label: Различные потребительские усл��ги @ru
label: 各種消費者サービス @ja
label: 综合消费者服务
label: 다양한 소비자 서��스 @ko
notation: 253020
valid from: 2016-09-01
valid till: 2018-09-29

消費者服務
type: GlobalIndustryClassificationStandardsClassifier
type: IndustryGroupClassifier
type: NamedIndividual
is contemporary version of: http://data.ga-group.nl/ics/gics/2530
is replaced by: http://data.ga-group.nl/ics/gics/2018/2530
is version of: http://data.ga-group.nl/ics/gics/2530
replaces: http://data.ga-group.nl/ics/gics/2014/2530
is industry group of: 非日常生活消費品
imported on: 2026-05-27T08:45:00.430Z
last refreshed on: 2026-05-31T09:56:29.350Z
source accessed on: 2017-10-19T03:34:33Z
source last accessed on: 2019-06-07T09:41:30Z
label: Consumer Services @en
label: Serviços aos Consumidores @pt
label: Services Consommateurs @fr
label: Servicios al Consumidor @es
label: Servizi al consumatore @it
label: Verbraucherdienste @de
label: Потребительские услуги @ru
label: 消費者サービス @ja
label: 消费者服务
label: 소비자 서비스 @ko
notation: 2530
valid from: 2016-09-01
valid till: 2018-09-29

广告
type: GlobalIndustryClassificationStandardsClassifier
type: SubindustryClassifier
type: NamedIndividual
is anachronous version of: http://data.ga-group.nl/ics/gics/50201010
is contemporary version of: http://data.ga-group.nl/ics/gics/25401010
is replaced by: http://data.ga-group.nl/ics/gics/2018/50201010
is version of: http://data.ga-group.nl/ics/gics/25401010
is version of: http://data.ga-group.nl/ics/gics/50201010
replaces: http://data.ga-group.nl/ics/gics/2014/25401010
is subindustry of: 媒体
imported on: 2026-05-27T08:45:00.430Z
last refreshed on: 2026-05-31T09:56:29.350Z
source accessed on: 2017-10-19T03:34:33Z
source last accessed on: 2019-06-07T09:41:30Z
label: Advertising @en
label: Pubblicità @it
label: Publicidad @es
label: Publicidade @pt
label: Werbung @de
label: Рекламная деятельность @ru
label: 広告 @ja
label: 廣告
label: 광고 @ko
definition: Companies providing advertising, marketing or public relations services. @en
definition: Empresas dedicadas a servicios de publicidad, marketing o relaciones públicas. @es
definition: Empresas provedoras de serviços de publicidade, marketing ou relações públicas. @pt
definition: Società fornitrici di servizi di pubblicità, marketing o di pubbliche relazioni. @it
definition: Unternehmen, die Werbe-, Marketing- oder PR-Dienste anbieten. @de
definition: Компании, предоставляющие услуги по рекламе, маркетингу или связям с общественностью. @ru
definition: 広告、マーケティング、広報活動サービスを提供する会社。 @ja
definition: 提供广告、营销或者公共关系服务的公司。
definition: 提供廣告、行銷或者公共關係服務的公司。
definition: 광고, 마케팅 또는 홍보 서비스 제공 회사. @ko
notation: 25401010
valid from: 2016-09-01
valid till: 2018-09-29

广播
type: GlobalIndustryClassificationStandardsClassifier
type: SubindustryClassifier
type: NamedIndividual
is anachronous version of: http://data.ga-group.nl/ics/gics/50201020
is contemporary version of: http://data.ga-group.nl/ics/gics/25401020
is replaced by: http://data.ga-group.nl/ics/gics/2018/50201020
is version of: http://data.ga-group.nl/ics/gics/25401020
is version of: http://data.ga-group.nl/ics/gics/50201020
replaces: http://data.ga-group.nl/ics/gics/2014/25401020
is subindustry of: 媒体
imported on: 2026-05-27T08:45:00.430Z
last refreshed on: 2026-05-31T09:56:29.350Z
source accessed on: 2017-10-19T03:34:33Z
source last accessed on: 2019-06-07T09:41:30Z
label: Broadcasting @en
label: Difusión por Radio y Televisión @es
label: Fernseh- und Rundfunkübertragung @de
label: Radiodifusão @pt
label: Trasmissioni @it
label: Деятельность в сфере теле- и радиовещания @ru
label: 廣播
label: 放送 @ja
label: 방송 @ko
definition: Besitzer und Betreiber von Fernseh- oder Rundfunkübertragungssystemen, einschließlich der Programmgestaltung. Eingeschlossen sind Fernseh- und Rundfunkübertragungen, Radiosendergruppen und Radiostationen. @de
definition: Owners and operators of television or radio broadcasting systems, including programming. Includes, radio and television broadcasting, radio networks, and radio stations. @en
definition: Propietarios y operadores de sistemas de difusión por radio y televisión, incluida la programación. Incluye emisoras de radio y televisión, cadenas radiofónicas y estaciones de radio. @es
definition: Proprietários e operadores de sistemas de difusão por televisão ou rádio, incluindo programação. Inclui a difusão por rádio e televisão, redes de rádio e estações de rádio. @pt
definition: Proprietari e gestori di sistemi di trasmissione e programmazione televisivi e radiofonici. Sono inclusi sistemi di trasmissione televisivi e radiofonici, reti e stazioni radiofoniche. @it
definition: Компании, владеющие системами телевидения или радиовещания и ос��ществляющие их эксплуатацию, в том числе, оказывающие услуги по созданию программ. В данную группу входят компании, оказывающие услуги радио- и телевизионного вещания, радиосетей и радиостанций. @ru
definition: プログラミングを含むテレビ・ラジオ放���システムの所有者や運営業者。ラジオ、テレビ放送、ラジオネットワーク、ラジオ局を含む。 @ja
definition: 电视或电台广播系统的业主和运营商，包括制作公司。包括电台和电视广播、广播网络和广播站。
definition: 電視或電臺廣播系統的業主和運營商，包括製作公司。包括電臺和電視廣播、廣播網路和廣播站。
definition: 프로그램 편성을 포함한 TV 또는 라디오 방송 시스템의 소유자와 운영자. 라디오 및 TV 방송, 라디오 네트워크, 라디오 방송국을 포함. @ko
notation: 25401020
valid from: 2016-09-01
valid till: 2018-09-29

有綫和衛星電視
type: GlobalIndustryClassificationStandardsClassifier
type: SubindustryClassifier
type: NamedIndividual
is anachronous version of: http://data.ga-group.nl/ics/gics/50201030
is contemporary version of: http://data.ga-group.nl/ics/gics/25401025
is replaced by: http://data.ga-group.nl/ics/gics/2018/50201030
is version of: http://data.ga-group.nl/ics/gics/25401025
is version of: http://data.ga-group.nl/ics/gics/50201030
replaces: http://data.ga-group.nl/ics/gics/2014/25401025
is subindustry of: 媒体
imported on: 2026-05-27T08:45:00.430Z
last refreshed on: 2026-05-31T09:56:29.350Z
source accessed on: 2017-10-19T03:34:33Z
source last accessed on: 2019-06-07T09:41:30Z
label: Cable & Satellite @en
label: Cabo e Satélite @pt
label: Cavo e satellite @it
label: Kabel- und Satellietenübertragung @de
label: Televisión por Cable y Vía Satélite @es
label: Деятельность в сфере кабельного и спутникового телевидения @ru
label: ケーブル・衛星テレビ @ja
label: 有线和卫星电视
label: 케이블과 위성 @ko
definition: Anbieter von Kabel- oder Satellitenübertragungen. Eingeschlossen ist das Kabelnetz und die Programmverteilung. @de
definition: Fornitori di servizi televisivi via cavo e satellite. Sono incluse le reti di cavi e la distribuzione di programmi. @it
definition: Provedores de serviços de televisão a cabo ou satélite. Inclui as redes de cabo e distribuição de programas. @pt
definition: Proveedores de servicios de televisión por cable o vía satélite. Incluye cadenas de cable y distribución de programación. @es
definition: Providers of cable or satellite television services. Includes cable networks and program distribution. @en
definition: Компании, оказывающие услуги кабельного и спутникового телевидения, в том числе через сети кабельного вещания и распространения программ. @ru
definition: ケーブルテレビ、衛星放送サービスの提供会社。ケーブルネットワークおよびプログラム配信を含む。 @ja
definition: 提供有线或卫星电视服务。包括有线网络和节目发行。
definition: 提供���線或衛星電視服務。包括有線網路和節目發行。
definition: 케이블 또는 위성 TV 서비스 제공업체. 케이블 네트워크와 프로그램 배급을 포함. @ko
notation: 25401025
valid from: 2016-09-01
valid till: 2018-09-29

电影与娱乐
type: GlobalIndustryClassificationStandardsClassifier
type: SubindustryClassifier
type: NamedIndividual
is anachronous version of: http://data.ga-group.nl/ics/gics/50202010
is contemporary version of: http://data.ga-group.nl/ics/gics/25401030
is replaced by: http://data.ga-group.nl/ics/gics/2018/50202010
is version of: http://data.ga-group.nl/ics/gics/25401030
is version of: http://data.ga-group.nl/ics/gics/50202010
replaces: http://data.ga-group.nl/ics/gics/2014/25401030
is subindustry of: 媒体
imported on: 2026-05-27T08:45:00.430Z
last refreshed on: 2026-05-31T09:56:29.350Z
source accessed on: 2017-10-19T03:34:33Z
source last accessed on: 2019-06-07T09:41:30Z
label: Film & Unterhaltung @de
label: Film e intrattenimento @it
label: Filmes e Entretenimento @pt
label: Movies & Entertainment @en
label: Películas y Entretenimiento @es
label: Деятельность кинотеатров и досугово-развлекательных учреждений @ru
label: 映画・娯楽 @ja
label: 電影與娛樂
label: 영화와 엔터테인먼트 @ko
definition: Companies that engage in producing and selling entertainment products and services, including companies engaged in the production, distribution and screening of movies and television shows, producers and distributors of music, entertainment theaters and sports teams. @en
definition: Empresas dedicadas a la producción y venta de productos y servicios de entretenimiento. Se incluyen las empresas dedicadas a la producción, distribución y proyección de películas y programas televisivos, productores y distribuidores de música, teatros y equipos (clubes) deportivos. @es
definition: Empresas envolvidas na produção e venda de produtos e serviços de entretenimento, incluindo empresas envolvidas na produção, distribuição e exibição de filmes e programas de televisão, produtores e distribuidores de música, salas de entretenimento e equipes esportivas. @pt
definition: Società operanti nella produzione e vendita di prodotti e servizi per l'intrattenimento, comprese le società operanti nella produzione, distribuzione e proiezione di film e spettacoli per la televisione, produttori e distributori di musica, spettacoli teatrali e sportivi. @it
definition: Unternehmen, die in der Herstellung und dem Verkauf von Unterhaltungsprodukten und -diensten tätig sind, einschließlich Unternehmen, die Spielfilme und Fernsehshows produzieren, vertreiben und ausstrahlen, Musik-Produzenten und -vertreiber, Theater und Sportmannschaften. @de
definition: Компании, занятые производством и реализацией продуктов и услуг развлекательного характера, в том числе занятые производством, распространением и прокатом кинофильмов и телевизионных развлекательных программ, производством и распространением музыкальных произведений, развлекательных театральных постановок и спортивных команд. @ru
definition: 从事制作和销售娱乐产品与服务的公司，包括那些从事制作、发行和审核电影及电视节目的公司、音乐发行商和制作方、娱乐剧场以及体育俱乐部。
definition: 娯楽商品やサービスを製作、販売する会社。映画・テレビ番組の製作、配給、放映を行う会社、音楽の製作・配信会社、娯楽劇場やスポーツチームを含む。 @ja
definition: 從事製作和銷售娛樂產品與服務的公司，包括那些從事製作、發行和投放電影及電視節目的公司、音樂發行商和製作方、娛樂劇場以及體育俱樂部。
definition: 영화와 TV 쇼의 제작, 배급, 상영과 관련된 회사, 그리고 음악, 엔터테인먼트 극장, 스포츠팀의 제작자와 배급자를 포함해서 엔터테인먼트 상품과 서비스의 제작 및 판매와 관련된 회사. @ko
notation: 25401030
valid from: 2016-09-01
valid till: 2018-09-29

Editoria
type: GlobalIndustryClassificationStandardsClassifier
type: SubindustryClassifier
type: NamedIndividual
is anachronous version of: http://data.ga-group.nl/ics/gics/50201040
is contemporary version of: http://data.ga-group.nl/ics/gics/25401040
is replaced by: http://data.ga-group.nl/ics/gics/2018/50201040
is version of: http://data.ga-group.nl/ics/gics/25401040
is version of: http://data.ga-group.nl/ics/gics/50201040
replaces: http://data.ga-group.nl/ics/gics/2014/25401040
is subindustry of: 媒体
imported on: 2026-05-27T08:45:00.430Z
last refreshed on: 2026-05-31T09:56:29.350Z
source accessed on: 2017-10-19T03:34:33Z
source last accessed on: 2019-06-07T09:41:30Z
label: Publicações @pt
label: Publicación @es
label: Publishing @en
label: Verlagswesen @de
label: Издательская деятельность @ru
label: 出版
label: 출판 @ko
definition: Editores de jornais, revistas e livros, e provedores de informações em forma impressa ou em formato eletrônico. @pt
definition: Editori di giornali, riviste e libri; fornitori di informazioni su carta o in formato elettronico. @it
definition: Empresas dedicadas a la publicación de periódicos, revistas y libros y proveedores de información en formato impreso o electrónico. @es
definition: Herausgeber von Zeitungen, Zeitschriften und Büchern, und Anbieter von Informationen in gedruckter oder elektronischer Form. @de
definition: Publishers of newspapers, magazines and books, and providers of information in print or electronic formats. @en
definition: Компании, занимающиеся изданием газет, журналов, книг, а также производством информации в печатной или электронной форме. @ru
definition: 報紙、雜誌和書籍出版商，以印刷或電子格式提供資訊的提供商。
definition: 报纸、杂志和书籍出版商，以印刷或电子格式提供信息的提供商。
definition: 新聞、雑誌、書籍の出版会社、および印刷・電子形式での情報提供業者。 @ja
definition: 신문, 잡지, 책의 출판사, 그리고 인쇄물 또는 전자 형태로 정보를 제공하는 업체. @ko
notation: 25401040
valid from: 2016-09-01
valid till: 2018-09-29

媒体
type: GlobalIndustryClassificationStandardsClassifier
type: IndustryClassifier
type: NamedIndividual
is anachronous version of: http://data.ga-group.nl/ics/gics/502010
is contemporary version of: http://data.ga-group.nl/ics/gics/254010
is replaced by: http://data.ga-group.nl/ics/gics/2018/502010
is version of: http://data.ga-group.nl/ics/gics/254010
is version of: http://data.ga-group.nl/ics/gics/502010
replaces: http://data.ga-group.nl/ics/gics/2014/254010
is industry of: 媒体
imported on: 2026-05-27T08:45:00.430Z
last refreshed on: 2026-05-31T09:56:29.350Z
source accessed on: 2017-10-19T03:34:33Z
source last accessed on: 2019-06-07T09:41:30Z
label: Médias @fr
label: Mídia @pt
label: Media @en
label: Medien @de
label: Medios de Comunicación @es
label: Mezzi di comunicazione @it
label: Деятельность средств массовой информации @ru
label: メディア @ja
label: 媒體
label: 미디어 @ko
notation: 254010
valid from: 2016-09-01
valid till: 2018-09-29

媒体
type: GlobalIndustryClassificationStandardsClassifier
type: IndustryGroupClassifier
type: NamedIndividual
is anachronous version of: http://data.ga-group.nl/ics/gics/5020
is contemporary version of: http://data.ga-group.nl/ics/gics/2540
is replaced by: http://data.ga-group.nl/ics/gics/2018/5020
is version of: http://data.ga-group.nl/ics/gics/2540
is version of: http://data.ga-group.nl/ics/gics/5020
replaces: http://data.ga-group.nl/ics/gics/2014/2540
is industry group of: 非日常生活消費品
imported on: 2026-05-27T08:45:00.430Z
last refreshed on: 2026-05-31T09:56:29.350Z
source accessed on: 2017-10-19T03:34:33Z
source last accessed on: 2019-06-07T09:41:30Z
label: Médias @fr
label: Mídia @pt
label: Media @en
label: Medien @de
label: Medios de Comunicación @es
label: Mezzi di comunicazione @it
label: Средства массовой информации @ru
label: メディア @ja
label: 媒體
label: 미디어 @ko
notation: 2540
valid from: 2016-09-01
valid till: 2018-09-29

經銷商
type: GlobalIndustryClassificationStandardsClassifier
type: SubindustryClassifier
type: NamedIndividual
is contemporary version of: http://data.ga-group.nl/ics/gics/25501010
is replaced by: http://data.ga-group.nl/ics/gics/2018/25501010
is version of: http://data.ga-group.nl/ics/gics/25501010
replaces: http://data.ga-group.nl/ics/gics/2014/25501010
is subindustry of: 經銷商
imported on: 2026-05-27T08:45:00.430Z
last refreshed on: 2026-05-31T09:56:29.350Z
source accessed on: 2017-10-19T03:34:33Z
source last accessed on: 2019-06-07T09:41:30Z
label: Distribuidores @es
label: Distributors @en
label: Vertriebsunternehmen @de
label: Дистрибьюторская деятельность @ru
label: 经销商
label: 販売 @ja
label: 판매업체 @ko
definition: Distribuidores e atacadistas de mercadorias em geral não classificadas em nenhum outro lugar. Inclui distribuidores de veículos. @pt
definition: Distribuidores y mayoristas de productos generales no clasificados en otra sección. Se incluyen los distribuidores de vehículos. @es
definition: Distributors and wholesalers of general merchandise not classified elsewhere. Includes vehicle distributors. @en
definition: Vertriebsunternehmen und Großhändler allgemeiner Güter, die keiner der übrigen Branchen angehören. Hierzu gehören auch Fahrzeughändler. @de
definition: Компании, занимающиеся распространением товаров общего назначения, не включенных в другие группы, и их оптовой торговлей, в том числе дистрибьюторы транспортных средств. @ru
definition: 他のグループに分類されていない一般商品の販売や卸売りを行う業者。車両販売業者を含む。 @ja
definition: 日用商品經銷商和批發商。包括機車經銷商。
definition: 日用商品经销商和批发商。包括机车经销商。
definition: 다른 부문으로 분류되지 않은 일반 상품의 판매업체 및 도매업체. 차량 판매업체 포함. @ko
notation: 25501010
valid from: 2016-09-01
valid till: 2018-09-29

經銷商
type: GlobalIndustryClassificationStandardsClassifier
type: IndustryClassifier
type: NamedIndividual
is contemporary version of: http://data.ga-group.nl/ics/gics/255010
is replaced by: http://data.ga-group.nl/ics/gics/2018/255010
is version of: http://data.ga-group.nl/ics/gics/255010
replaces: http://data.ga-group.nl/ics/gics/2014/255010
is industry of: 零售业
imported on: 2026-05-27T08:45:00.430Z
last refreshed on: 2026-05-31T09:56:29.350Z
source accessed on: 2017-10-19T03:34:33Z
source last accessed on: 2019-06-07T09:41:30Z
label: Distribuidores @es
label: Distributeurs @fr
label: Distributori @it
label: Distributors @en
label: Vertriebsunternehmen @de
label: Дистрибьюторская деятельность @ru
label: 经销商
label: 販売 @ja
label: 판매업체 @ko
notation: 255010
valid from: 2016-09-01
valid till: 2018-09-29

互联网与直销零售
type: GlobalIndustryClassificationStandardsClassifier
type: SubindustryClassifier
type: NamedIndividual
is contemporary version of: http://data.ga-group.nl/ics/gics/25502020
is replaced by: http://data.ga-group.nl/ics/gics/2018/25502020
is version of: http://data.ga-group.nl/ics/gics/25502020
replaces: http://data.ga-group.nl/ics/gics/2014/25502020
is subindustry of: 互联网与直销零售
imported on: 2026-05-27T08:45:00.430Z
last refreshed on: 2026-05-31T09:56:29.350Z
source accessed on: 2017-10-19T03:38:28Z
source last accessed on: 2019-06-07T09:41:30Z
label: Internet & Direct Marketing Retail @en
label: Vendas pela Internet ou por Catáçogo @pt
label: Ventas por Internet y Marketing Directo @es
label: Интернет и прямая розничная торговля @ru
label: インターネット販売・通信販売 @ja
label: 網路與直接行銷零售業
label: 인터넷 및 직접 마케팅 소매 @ko
definition: Companies providing retail services primarily on the Internet, through mail order, and TV home shopping retailers. @en
definition: Empresas dedicadas principalmente a servicios de ventas por Internet, por correo o por televisión. @es
definition: Empresas provedoras de serviços de vendas principalmente via internet, correio ou televisão. @pt
definition: Компании, осуществляющие розничную торговлю по Интернету и почтовым заказам, а также тел��магазины. @ru
definition: インターネットや通販、テレビホームショッピングでの小売り販売サービスを提供している会社。 @ja
definition: 主要透過網路、郵購以及電視購物頻道提供零售服務的公司。
definition: 主要通过互联网、邮购和家庭电视购物零售商提供零售服务的公司。
definition: 주로 인터넷과 우편 주문을 통해 소매 서비스를 제공하는 회사와 TV 홈쇼핑 소매업체. @ko
notation: 25502020
valid from: 2016-09-01
valid till: 2018-09-29

互联网与直销零售
type: GlobalIndustryClassificationStandardsClassifier
type: IndustryClassifier
type: NamedIndividual
is contemporary version of: http://data.ga-group.nl/ics/gics/255020
is replaced by: http://data.ga-group.nl/ics/gics/2018/255020
is version of: http://data.ga-group.nl/ics/gics/255020
replaces: http://data.ga-group.nl/ics/gics/2014/255020
is industry of: 零售业
imported on: 2026-05-27T08:45:00.430Z
last refreshed on: 2026-05-31T09:56:29.350Z
source accessed on: 2017-10-19T03:34:33Z
source last accessed on: 2019-06-07T09:41:30Z
label: Einzelhandel (Internet & Direktmarketing) @de
label: Internet & Direct Marketing Retail @en
label: Vendas pela Internet ou por Catálogo @pt
label: Vendita al dettaglio tramite Internet e direct marketing @it
label: Ventas por Internet y Marketing Directo @es
label: Vente par Internet et marketing direct @fr
label: Интернет и прямая розничная торговля @ru
label: インターネット販売・通信販売 @ja
label: 網路與直接行銷零售業
label: 인터넷 및 직접 마케팅 소매 @ko
notation: 255020
valid from: 2016-09-01
valid till: 2018-09-29

百貨商店
type: GlobalIndustryClassificationStandardsClassifier
type: SubindustryClassifier
type: NamedIndividual
is contemporary version of: http://data.ga-group.nl/ics/gics/25503010
is replaced by: http://data.ga-group.nl/ics/gics/2018/25503010
is version of: http://data.ga-group.nl/ics/gics/25503010
replaces: http://data.ga-group.nl/ics/gics/2014/25503010
is subindustry of: 多元化零售
imported on: 2026-05-27T08:45:00.430Z
last refreshed on: 2026-05-31T09:56:29.350Z
source accessed on: 2017-10-19T03:38:28Z
source last accessed on: 2019-06-07T09:41:30Z
label: Department Stores @en
label: Grandes Almacenes @es
label: Lojas de Departamentos @pt
label: Деятельность универсальных магазинов @ru
label: 百貨店 @ja
label: 百货商店
label: 백화점 @ko
definition: Owners and operators of department stores. @en
definition: Propietarios y operadores de grandes almacenes. @es
definition: Proprietários e operadores de lojas de departamentos. @pt
definition: Компании, владеющие универсальными магазинами и занимающиеся их эксплуатацией. @ru
definition: 百貨商店的業主和運營商
definition: 百貨店の所有者や運営業者。 @ja
definition: 百货商店的业主和运营商。
definition: 백화점의 소유자와 운영자 @ko
notation: 25503010
valid from: 2016-09-01
valid till: 2018-09-29

綜合貨品商店
type: GlobalIndustryClassificationStandardsClassifier
type: SubindustryClassifier
type: NamedIndividual
is contemporary version of: http://data.ga-group.nl/ics/gics/25503020
is replaced by: http://data.ga-group.nl/ics/gics/2018/25503020
is version of: http://data.ga-group.nl/ics/gics/25503020
replaces: http://data.ga-group.nl/ics/gics/2014/25503020
is subindustry of: 多元化零售
imported on: 2026-05-27T08:45:00.430Z
last refreshed on: 2026-05-31T09:56:29.350Z
source accessed on: 2017-10-19T03:38:28Z
source last accessed on: 2019-06-07T09:41:30Z
label: Establecimientos de Venta de Productos Generales @es
label: General Merchandise Stores @en
label: Lojas de Mercadorias Gerais @pt
label: Деятельность магазинов со смешанным ассортиментом товаров @ru
label: 総合小売り @ja
label: 综合货品商店
label: 일반 상점 @ko
definition: Owners and operators of stores offering diversified general merchandise. Excludes hypermarkets and large-scale super centers classified in the Hypermarkets & Super Centers Sub-Industry. @en
definition: Propietarios y operadores de establecimientos de venta de productos generales variados. Se excluyen los hipermercados y grandes superficies pertenecientes a la rama Hipermercados y Grandes Superficies. @es
definition: Proprietários e operadores de lojas que oferecem mercadorias gerais diversificadas. Exclui hipermercados e supercentros de grande escala classificados na Sub-Indústria de Hipermercados e Supercentros. @pt
definition: Компании, владеющие магазинами со смешанным ассортиментом товаров и занимающиеся их эксплуатацией. В данную группу не входят гипермаркеты и крупные торговые центры, включенные в подотрасль «Деятельность гипермаркетов и крупных торговых центров». @ru
definition: 出售各色日用商品的綜合貨品商店的業主和運營商。不包括歸類於“大賣場與大型超市”子行業中的超級市場和特大購物中心。
definition: 出售各色日用商品的综合货品商店的业主和运营商。不包括归类于“大卖场与大型超市”子行业中的超级市场和特大购物中心。
definition: 各種一般商品を提供している店舗の所有者や運営業者。産業サブグループの「大型スーパーマーケット・スーパーマーケット」に分類される超大型マーケット、大型スーパーマーケットは除く。 @ja
definition: 다각화된 일반 상품을 제공하는 상점의 소유자와 운영자. ‘하이퍼마켓과 대형 쇼핑센터’로 분류되는 하이퍼마켓과 대형 쇼핑센터는 제외. @ko
notation: 25503020
valid from: 2016-09-01
valid till: 2018-09-29

多元化零售
type: GlobalIndustryClassificationStandardsClassifier
type: IndustryClassifier
type: NamedIndividual
is contemporary version of: http://data.ga-group.nl/ics/gics/255030
is replaced by: http://data.ga-group.nl/ics/gics/2018/255030
is version of: http://data.ga-group.nl/ics/gics/255030
replaces: http://data.ga-group.nl/ics/gics/2014/255030
is industry of: 零售业
imported on: 2026-05-27T08:45:00.430Z
last refreshed on: 2026-05-31T09:56:29.350Z
source accessed on: 2017-10-19T03:34:33Z
source last accessed on: 2019-06-07T09:41:30Z
label: Comércio Varejista de Múltiplas Linhas @pt
label: Einzelhandel: Gemischt @de
label: Multiline Retail @en
label: Vendita al dettaglio di articoli vari @it
label: Ventas Multilínea @es
label: Vente au Détail d’Articles Diversifiés @fr
label: Розничная торговля универсальным ассортиментом товаров @ru
label: 複合小売り @ja
label: 복합 소매 @ko
notation: 255030
valid from: 2016-09-01
valid till: 2018-09-29

服装零售
type: GlobalIndustryClassificationStandardsClassifier
type: SubindustryClassifier
type: NamedIndividual
is contemporary version of: http://data.ga-group.nl/ics/gics/25504010
is replaced by: http://data.ga-group.nl/ics/gics/2018/25504010
is version of: http://data.ga-group.nl/ics/gics/25504010
replaces: http://data.ga-group.nl/ics/gics/2014/25504010
is subindustry of: 专营零售
imported on: 2026-05-27T08:45:00.430Z
last refreshed on: 2026-05-31T09:56:29.350Z
source accessed on: 2017-10-19T03:38:28Z
source last accessed on: 2019-06-07T09:41:30Z
label: Apparel Retail @en
label: Comércio Varejista de Vestuário @pt
label: Venta de Ropa @es
label: Розничная торговля одеждой @ru
label: 服裝零售
label: 衣料小売り @ja
label: 의류 소매 @ko
definition: Comerciantes especializados principalmente en la venta de ropa y accesorios. @es
definition: Retailers specialized mainly in apparel and accessories. @en
definition: Varejistas especializados, principalmente, em vestuário e acessórios. @pt
definition: Компании розничной торговли, специализирующиеся в основном на продаже одежды и аксессуаров. @ru
definition: アパレルやアクセサリーを専門に取り扱う小売り業者。 @ja
definition: 主要专营服装和服饰的零售商。
definition: 主要專營服裝和服飾的零售商。
definition: 주로 의류와 액세서리를 전문으로 하는 소매상 @ko
notation: 25504010
valid from: 2016-09-01
valid till: 2018-09-29

电脑与电子产品零售
type: GlobalIndustryClassificationStandardsClassifier
type: SubindustryClassifier
type: NamedIndividual
is contemporary version of: http://data.ga-group.nl/ics/gics/25504020
is replaced by: http://data.ga-group.nl/ics/gics/2018/25504020
is version of: http://data.ga-group.nl/ics/gics/25504020
replaces: http://data.ga-group.nl/ics/gics/2014/25504020
is subindustry of: 专营零售
imported on: 2026-05-27T08:45:00.430Z
last refreshed on: 2026-05-31T09:56:29.350Z
source accessed on: 2017-10-19T03:38:28Z
source last accessed on: 2019-06-07T09:41:30Z
label: Comércio Varejista de Computadores e Eletrônicos @pt
label: Computer & Electronics Retail @en
label: Venta de Ordenadores y Productos Electrónicos @es
label: Розничная торговля компьютерным и электронным оборудованием @ru
label: コンピュータ・電子機器小売�� @ja
label: 電腦與電子產品零售
label: 컴퓨터와 전자제품 소매 @ko
definition: Owners and operators of consumer electronics, computers, video and related products retail stores. @en
definition: Propietarios y operadores de establecimientos de venta de productos electrónicos, ordenadores y artículos relacionados destinados a consumidores particulares. @es
definition: Proprietários e operadores de lojas varejistas de eletrônicos, computadores, vídeo e de produtos relacionados. @pt
definition: Компании, владеющие магазинами розничной торговли бытовой электроникой, компьютерами, видеоаппаратурой и сопутствующими товарами и занимающиеся их эксплуатацией. @ru
definition: 民生用電子機器、コンピュータ、ビデオや関連製品を販売する小売店舗の所有者や運営業者。 @ja
definition: 消費類電子產品、電腦、視頻及相關產品零售店的業主和運營商。
definition: 消费类电子产品、电脑、视频及相关产品零售店的业主和运营商。
definition: 소비자 전자제품, 컴퓨터, 비디오, 관련 제품 소매점의 소유자와 운영자. @ko
notation: 25504020
valid from: 2016-09-01
valid till: 2018-09-29

家庭装潢零售
type: GlobalIndustryClassificationStandardsClassifier
type: SubindustryClassifier
type: NamedIndividual
is contemporary version of: http://data.ga-group.nl/ics/gics/25504030
is replaced by: http://data.ga-group.nl/ics/gics/2018/25504030
is version of: http://data.ga-group.nl/ics/gics/25504030
replaces: http://data.ga-group.nl/ics/gics/2014/25504030
is subindustry of: 专营零售
imported on: 2026-05-27T08:45:00.430Z
last refreshed on: 2026-05-31T09:56:29.350Z
source accessed on: 2017-10-19T03:38:28Z
source last accessed on: 2019-06-07T09:41:30Z
label: Comércio Varejista de Material de Construção e Decoração @pt
label: Home Improvement Retail @en
label: Venta de Mejoras para el Hogar @es
label: Розничная торговля предметами домашнего обихода и обустройства @ru
label: 住宅関連用品小売り @ja
label: 家庭裝潢零售
label: 가정 개량용품 소매 @ko
definition: Owners and operators of home and garden improvement retail stores. Includes stores offering building materials and supplies. @en
definition: Propietarios y operadores de establecimientos de venta de utensilios de bricolaje y jardinería. Se incluyen los establecimientos de venta y suministro de materiales de construcción. @es
definition: Proprietários e operadores de lojas de varejo de material de construção e decoração para casas e jardins. Inclui lojas que oferecem materiais de construção e suprimentos. @pt
definition: Компании, владеющие магазинами розничной торговли предметами для благоустройства дома и сада и занимающиеся их эксплуатацией. В данную группу входят магазины строительных материалов и товаров. @ru
definition: 住宅・造園関連用品を販売する小売り店舗の所有者や運営業者。建設資材や用品を取り扱う店舗を含む。 @ja
definition: 家庭装潢及园艺用品零售店的业主和运营商。包括建筑材料及用品零售店。
definition: 家庭裝潢及園藝用品零售店的業主和運營商。包括建築材料及用品零售店。
definition: 가정과 정원 개량용품 소매점 소유자와 운영자. 건축 자재와 공급품 상점 포함. @ko
notation: 25504030
valid from: 2016-09-01
valid till: 2018-09-29

专卖店
type: GlobalIndustryClassificationStandardsClassifier
type: SubindustryClassifier
type: NamedIndividual
is contemporary version of: http://data.ga-group.nl/ics/gics/25504040
is replaced by: http://data.ga-group.nl/ics/gics/2018/25504040
is version of: http://data.ga-group.nl/ics/gics/25504040
replaces: http://data.ga-group.nl/ics/gics/2014/25504040
is subindustry of: 专营零售
imported on: 2026-05-27T08:45:00.430Z
last refreshed on: 2026-05-31T09:56:29.350Z
source accessed on: 2017-10-19T03:38:28Z
source last accessed on: 2019-06-07T09:41:30Z
label: Lojas Especializadas @pt
label: Specialty Stores @en
label: Tiendas Especializadas @es
label: Специализированная торговля @ru
label: 専門店 @ja
label: 專賣店
label: 전문품 상점 @ko
definition: Owners and operators of specialty retail stores not classified elsewhere. Includes jewelry stores, toy stores, office supply stores, health & vision care stores, and book & entertainment stores. @en
definition: Propietarios y operadores de tiendas especializadas no clasificadas en otra sección. Se incluyen las joyerías, jugueterías, tiendas de artículos para oficina, tiendas de artículos para la salud y ópticas, además de librerías y tiendas de material de recreación. @es
definition: Proprietários e operadores de lojas de varejo especializadas não classificadas em nenhum outro lugar. Inclui joalherias, lojas de brinquedos, lojas de materiais de escritório, de saúde e óticas, e livrarias e produtos para entretenimento. @pt
definition: Компании, владеющие специализированными магазинами розничной торговли и занимающиеся их эксплуатацией, не включенные в другие группы. В данную группу входят магазины, специализирующиеся на продаже ювелирных изделий, игрушек, товаров для офиса, косметических товаров и средств по уходу, книг и товаров для отдыха и развлечения. @ru
definition: 他のグループに分類されていない専門小売り店舗の所有者や運営業者。宝石店、玩具店、事務用品店、ヘルスケア・ビジョンケア専門店、書籍・娯楽用品を取り扱う店舗を含む。 @ja
definition: 零售专卖店（未归类于别处）的业主和运营商。包括珠宝店、玩具店、办公用品店、卫生保健与视力保健用品店以及书籍与娱乐用品店。
definition: 零售專賣店（未歸類於別處）的業主和運營商。包括珠寶店、玩具店、辦公用品店、衛生保健與視力保健用品店以及書籍與娛樂用品店。
definition: 다른 부분으로 분류되지 않은 전문품 소매 상점 소유자와 운영자. 보석 상점, 장난감 상���, 사무용품 상점, 건강 및 시력 관리 상점, 도서 및 엔터테인먼트 상점을 포함. @ko
notation: 25504040
valid from: 2016-09-01
valid till: 2018-09-29

汽車零售
type: GlobalIndustryClassificationStandardsClassifier
type: SubindustryClassifier
type: NamedIndividual
is contemporary version of: http://data.ga-group.nl/ics/gics/25504050
is replaced by: http://data.ga-group.nl/ics/gics/2018/25504050
is version of: http://data.ga-group.nl/ics/gics/25504050
replaces: http://data.ga-group.nl/ics/gics/2014/25504050
is subindustry of: 专营零售
imported on: 2026-05-27T08:45:00.430Z
last refreshed on: 2026-05-31T09:56:29.350Z
source accessed on: 2017-10-19T03:38:28Z
source last accessed on: 2019-06-07T09:41:30Z
label: Automotive Retail @en
label: Comércio Varejista de Automóveis @pt
label: Розничная торговля автотранспортными средствами @ru
label: 汽车零售
label: 自動車小売り @ja
label: 자동차 소매 @ko
definition: Owners and operators of stores specializing in automotive retail. Includes auto dealers, gas stations, and retailers of auto accessories, motorcycles & parts, automotive glass, and automotive equipment & parts. @en
definition: Proprietários e operadores de lojas especializadas em comércio varejista automotivo. Inclui concessionárias de automóveis, postos de gasolina e varejistas de acessórios de automóveis, motocicletas e peças, vidro automotivo e equipamentos automotivos e autopeças. @pt
definition: Компании, владеющие специализированными магазин��ми розничной торговли автотранспортными средствами и занимающиеся их эксплуатацией. В данную группу входят дилеры, автозаправочные станции, компании розничной торговли аксессуарами для автотранспортных средств, мотоциклами и запасными частями, а также оборудованием и запасными частями для автотранспортных средств. @ru
definition: 专业汽车零售店的业主和运营商。包括汽车销售商、加油站以及汽车配件、摩托车与零件、汽车玻璃、汽车设备与零件零售商。
definition: 專業汽車零售���的業主和運營商。包括汽車銷售商、加油站以及汽車配件、摩托車與零件、汽車玻璃、汽車設備與零件零售商。
definition: 自動車販売を専門に取り扱う店舗の所有者や運営業者。自動車販売店、ガソリンスタンド、および自動車付属品、自動二輪車・部品、自動車ガラス、自動車機器・部品の小売り業者を含む。 @ja
definition: 자동차 소매를 전문으로 하는 상점 소유자와 운영자. 자동차 딜러, 주유소, 자동차 액세서리/오토바이 및 부품/자동차 유리/자동차 장비 및 부품 소매상을 포함. @ko
notation: 25504050
valid from: 2016-09-01
valid till: 2018-09-29

家庭装饰零售
type: GlobalIndustryClassificationStandardsClassifier
type: SubindustryClassifier
type: NamedIndividual
is contemporary version of: http://data.ga-group.nl/ics/gics/25504060
is replaced by: http://data.ga-group.nl/ics/gics/2018/25504060
is version of: http://data.ga-group.nl/ics/gics/25504060
replaces: http://data.ga-group.nl/ics/gics/2014/25504060
is subindustry of: 专营零售
imported on: 2026-05-27T08:45:00.430Z
last refreshed on: 2026-05-31T09:56:29.350Z
source accessed on: 2017-10-19T03:38:28Z
source last accessed on: 2019-06-07T09:41:30Z
label: Comércio Varejista de Decoração @pt
label: Homefurnishing Retail @en
label: Venta de Equipamiento para el Hogar @es
label: Розничная торговля товарами для дома @ru
label: 家具・装飾小売�� @ja
label: 家庭裝飾零售
label: 가정용 가구 소매 @ko
definition: Owners and operators of furniture and home furnishings retail stores. Includes residential furniture, homefurnishings, housewares, and interior design. Excludes home and garden improvement stores, classified in the Home Improvement Retail Sub-Industry. @en
definition: Propietarios y operadores de mobiliario y tiendas de equipamiento para el hogar. Se incluye el mobiliario de residencias, apartamentos, almacenes y diseño interior. Se excluyen las tiendas de mejoras de jardines y casas, clasificadas en la rama industrial de Venta de Mejoras para el Hogar. @es
definition: Proprietários e operadores de lojas de varejo de moveis e de decoração. Inclui móveis residenciais, decorações, artigos de utilidades domésticas e projetos de interior. Exclui lojas de varejo de material de construção e decoração de casas e jardins, classificadas na Sub-Indústria de Comércio Varejista de Material de Construção e Decoração. @pt
definition: Компании, владеющие магазинами розничной торговли мягкой мебелью и обстановкой для дома, в том числе жилой мебелью, товарами для дома, хозяйственными принадлежностями и предметами обстановки. В данную группу не входят магазины розничной торговли предметами для благоустройства дома и сада, включенные в подотрасль «Розничная торговля предметами домашнего обихода и обустройства». @ru
definition: 傢俱和家庭裝飾零售店的業主和運營商。包括傢俱、家庭裝飾、家用器皿和室內裝飾。 不包括歸類於“家庭裝潢零售”子行業中的家庭裝潢和園藝用品零售店。
definition: 家具および装飾品を販売する小売り店舗の所有者や運営業者。住居用家具、室内装飾品、家庭用品、インテリアデザインを含む。産業サブグループの「住宅関連用品小売り」に分類される住宅・造園関連用品を販売する店舗は除く。 @ja
definition: 家具和家庭装饰零售店的业主和运营商。包括家具、家庭装饰、家用器皿和室内装饰。 不包括归类于“家庭装潢零售”子行业中的家庭装潢和园艺用品零售店。
definition: 가구 및 가정용 세간 소매 상점 소유자와 운영자. 주거용 가구, 가정용 세간, 가정용품, 인테리어 디자인을 포함. '가정 개량용품 소매'로 분류되는 가정 및 정원 개량용품 상점은 제외. @ko
notation: 25504060
valid from: 2016-09-01
valid till: 2018-09-29

专营零售
type: GlobalIndustryClassificationStandardsClassifier
type: IndustryClassifier
type: NamedIndividual
is contemporary version of: http://data.ga-group.nl/ics/gics/255040
is replaced by: http://data.ga-group.nl/ics/gics/2018/255040
is version of: http://data.ga-group.nl/ics/gics/255040
replaces: http://data.ga-group.nl/ics/gics/2014/255040
is industry of: 零售业
imported on: 2026-05-27T08:45:00.430Z
last refreshed on: 2026-05-31T09:56:29.350Z
source accessed on: 2017-10-19T03:34:33Z
source last accessed on: 2019-06-07T09:41:30Z
label: Comércio Varejista Especializado @pt
label: Einzelhandel: Spezial @de
label: Specialty Retail @en
label: Vendita al dettaglio di articoli speciali @it
label: Ventas especializadas @es
label: Vente au Détail Spécialisée @fr
label: Специализированная розничная торговля @ru
label: 専門小売り @ja
label: 專營零售
label: 전문 소매 @ko
notation: 255040
valid from: 2016-09-01
valid till: 2018-09-29

零售业
type: GlobalIndustryClassificationStandardsClassifier
type: IndustryGroupClassifier
type: NamedIndividual
is contemporary version of: http://data.ga-group.nl/ics/gics/2550
is replaced by: http://data.ga-group.nl/ics/gics/2018/2550
is version of: http://data.ga-group.nl/ics/gics/2550
replaces: http://data.ga-group.nl/ics/gics/2014/2550
is industry group of: 非日常生活消費品
imported on: 2026-05-27T08:45:00.430Z
last refreshed on: 2026-05-31T09:56:29.350Z
source accessed on: 2017-10-19T03:34:33Z
source last accessed on: 2019-06-07T09:41:30Z
label: Comércio Varejista @pt
label: Groß- und Einzelhandel @de
label: Retailing @en
label: Vendita al dettaglio @it
label: Venta al por Menor @es
label: Vente au Détail @fr
label: Розничная торговля @ru
label: 小売 @ja
label: 零售業
label: 소매 @ko
notation: 2550
valid from: 2016-09-01
valid till: 2018-09-29

非日常生活消費品
type: GlobalIndustryClassificationStandardsClassifier
type: SectorClassifier
type: NamedIndividual
is contemporary version of: http://data.ga-group.nl/ics/gics/25
is replaced by: http://data.ga-group.nl/ics/gics/2018/25
is version of: http://data.ga-group.nl/ics/gics/25
replaces: http://data.ga-group.nl/ics/gics/2014/25
imported on: 2026-05-27T08:45:00.430Z
last refreshed on: 2026-05-31T09:56:29.350Z
source accessed on: 2017-10-19T03:34:33Z
source last accessed on: 2019-06-07T09:41:30Z
label: Beni voluttuari @it
label: Bens de Consumo Discricionário @pt
label: Consommation Discrétionnaire @fr
label: Consumer Discretionary @en
label: Consumo Discrecional @es
label: Nicht-Basiskonsumgüter @de
label: Неосновные потребительские товары @ru
label: 一般消費財・サービス @ja
label: 非日常生活消费品
label: 자유 소비재 @ko
notation: 25
valid from: 2016-09-01
valid till: 2018-09-29

药品零售
type: GlobalIndustryClassificationStandardsClassifier
type: SubindustryClassifier
type: NamedIndividual
is contemporary version of: http://data.ga-group.nl/ics/gics/30101010
is replaced by: http://data.ga-group.nl/ics/gics/2018/30101010
is version of: http://data.ga-group.nl/ics/gics/30101010
replaces: http://data.ga-group.nl/ics/gics/2014/30101010
is subindustry of: 食品与主要用品零售
imported on: 2026-05-27T08:45:00.430Z
last refreshed on: 2026-05-31T09:56:29.350Z
source accessed on: 2017-10-19T03:38:28Z
source last accessed on: 2019-06-07T09:41:30Z
label: Comércio Varejista de Medicamentos @pt
label: Drug Retail @en
label: Venta de Medicamentos @es
label: Розничная торговля лекарственными препаратами @ru
label: 薬品小売り @ja
label: 藥品零售
label: 약품 소매 @ko
definition: Owners and operators of primarily drug retail stores and pharmacies. @en
definition: Propietarios y operadores de farmacias y establecimientos dedicados principalmente a la venta de medicamentos. @es
definition: Proprietários e operadores de farmácias e lojas varejistas que vendem principalmente medicamentos. @pt
definition: Компании, владеющие розничными магазинами и аптеками по продаже лекарств, и занимающиеся их эксплуатацией. @ru
definition: 药品零售店和药剂店的业主和运营商。
definition: 薬品小売り店および薬局の所有者や運営業者。 @ja
definition: 藥品零售店和藥劑店的業主和運營商。
definition: 주로 약품 소매 상점 및 약국의 소유자와 운영자. @ko
notation: 30101010
valid from: 2016-09-01
valid till: 2018-09-29

食品分銷商
type: GlobalIndustryClassificationStandardsClassifier
type: SubindustryClassifier
type: NamedIndividual
is contemporary version of: http://data.ga-group.nl/ics/gics/30101020
is replaced by: http://data.ga-group.nl/ics/gics/2018/30101020
is version of: http://data.ga-group.nl/ics/gics/30101020
replaces: http://data.ga-group.nl/ics/gics/2014/30101020
is subindustry of: 食品与主要用品零售
imported on: 2026-05-27T08:45:00.430Z
last refreshed on: 2026-05-31T09:56:29.350Z
source accessed on: 2017-10-19T03:38:28Z
source last accessed on: 2019-06-07T09:41:30Z
label: Distribución de Alimentos @es
label: Distribuidores de Produtos Alimentícios @pt
label: Food Distributors @en
label: Деятельность дистрибьюторов продуктов питания @ru
label: 食品分销商
label: 食品流通 @ja
label: 식품 도매 @ko
definition: Distribuidores de alimentos a otras empresas (no a consumidores particulares). @es
definition: Distribuidores de produtos alimentícios para outras empresas e não diretamente para o consumidor. @pt
definition: Distributors of food products to other companies and not directly to the consumer. @en
definition: Дистрибьюторы продуктов питания другим компаниям, а не непосредственно потребителям. @ru
definition: 向其他公司而並不直接向消費者分銷食品的公司。
definition: 向其它公司而并不直接向消费者分销食品的公司。
definition: 消費者への直接販売ではなく、他の会社へ食品を販売している業者。 @ja
definition: 타 회사에 식품을 공급하며 소비자에게 직접 판매하지는 않는 업체. @ko
notation: 30101020
valid from: 2016-09-01
valid till: 2018-09-29

食品零售
type: GlobalIndustryClassificationStandardsClassifier
type: SubindustryClassifier
type: NamedIndividual
is contemporary version of: http://data.ga-group.nl/ics/gics/30101030
is replaced by: http://data.ga-group.nl/ics/gics/2018/30101030
is version of: http://data.ga-group.nl/ics/gics/30101030
replaces: http://data.ga-group.nl/ics/gics/2014/30101030
is subindustry of: 食品与主要用品零售
imported on: 2026-05-27T08:45:00.430Z
last refreshed on: 2026-05-31T09:56:29.350Z
source accessed on: 2017-10-19T03:38:28Z
source last accessed on: 2019-06-07T09:41:30Z
label: Comércio Varejista de Produtos Alimentícios @pt
label: Food Retail @en
label: Venta de Alimentos @es
label: Розничная торговля продуктами питания @ru
label: 食品小売り @ja
label: 식품 소매 @ko
definition: Owners and operators of primarily food retail stores. @en
definition: Propietarios y operadores de establecimientos dedicados principalmente a la venta de alimentos. @es
definition: Proprietários e operadores de lojas de varejo, principalmente de produtos alimentícios. @pt
definition: Компании, владеющие розничными магазинами торговли преимущественно продуктами питания, и занимающиеся их эксплуатацией. @ru
definition: 食品零售店的業主和運營商。
definition: 食品零售店的��主和运营商。
definition: 食料品小売り店の所有者や運営業者。 @ja
definition: ���로 식품 소매 상점의 소유자와 운영자. @ko
notation: 30101030
valid from: 2016-09-01
valid till: 2018-09-29

大卖场与超市
type: GlobalIndustryClassificationStandardsClassifier
type: SubindustryClassifier
type: NamedIndividual
is contemporary version of: http://data.ga-group.nl/ics/gics/30101040
is replaced by: http://data.ga-group.nl/ics/gics/2018/30101040
is version of: http://data.ga-group.nl/ics/gics/30101040
replaces: http://data.ga-group.nl/ics/gics/2014/30101040
is subindustry of: 食品与主要用品零售
imported on: 2026-05-27T08:45:00.430Z
last refreshed on: 2026-05-31T09:56:29.350Z
source accessed on: 2017-10-19T03:38:28Z
source last accessed on: 2019-06-07T09:41:30Z
label: Hipermercados e Supercentros @pt
label: Hipermercados y Grandes Superficies @es
label: Hypermarkets & Super Centers @en
label: Деятельность гипермаркетов и крупных торговых центров @ru
label: 大型スーパーマーケット・スーパーマーケット @ja
label: 大賣場與超市
label: 하이퍼마켓과 대형 쇼핑센터 @ko
definition: Owners and operators of hypermarkets and super centers selling food and a wide-range of consumer staple products. Excludes Food and Drug Retailers classified in the Food Retail and Drug Retail Sub-Industries, respectively. @en
definition: Propietarios y operadores de hipermercados y grandes superficiesm, dedicados a la venta de alimentos y una amplia gama de productos de primera necesidad. Se excluyen los comerciantes dedicados a alimentos y medicamentos clasificados en las ramas Venta de Alimentos y Venta de Medicamentos, respectivamente. @es
definition: Proprietários e operadores de hipermercados e supercentros que vendem produtos alimentícios e uma ampla gama de produtos básicos de consumo. Exclui os varejistas de produtos alimentícios e medicamentos, classificados nas Sub-Indústrias de Comércio Varejista de Produtos Alimentícios e Comércio Varejista de Medicamentos, respectivamente. @pt
definition: Компании, владеющие гипермаркетами и крупными торговыми центрами по продаже продуктов питания и широкого ассортимента товаров массового спроса, и занимающиеся их эксплуатацией. В данную группу не входят компании розничной торговли продуктами питания и лекарственными препаратами, включенные, соотв��тственно, в подотрасли «Розничная торговля продуктами питания» и «Розничная торговля лекарственными препаратами». @ru
definition: 大卖场以及出售食品和各类日常消费品的超市。不包括分别归类于“食品零售”和“药品零售”子行业中的食品与药品零售店。
definition: 大賣場以及出售食品和各類日常消費品的超市。不包括分別歸類於“食品零售”和“藥品零售”子行業中的食品與藥品零售店。
definition: 食品や広範囲にわたる生活必需品を販売する大型スーパーマーケットやスーパーマーケットの所有者および運営業者。産業サブグループの「食品小売り」およ���「薬品小売り」に分類される食品・薬品の小売り業者は除く。 @ja
definition: 식품과 다양한 기본 소비자 식료품을 판매하는 하이퍼마켓과 대형 쇼핑센터의 소유자와 운영자. 각각 ‘식품 소매’와 ‘약품 소매’로 분류되는 식품 및 약품 소매업체는 제외. @ko
notation: 30101040
valid from: 2016-09-01
valid till: 2018-09-29

食品与主要用品零售
type: GlobalIndustryClassificationStandardsClassifier
type: IndustryClassifier
type: NamedIndividual
is contemporary version of: http://data.ga-group.nl/ics/gics/301010
is replaced by: http://data.ga-group.nl/ics/gics/2018/301010
is version of: http://data.ga-group.nl/ics/gics/301010
replaces: http://data.ga-group.nl/ics/gics/2014/301010
is industry of: 食品与主要用品零售
imported on: 2026-05-27T08:45:00.430Z
last refreshed on: 2026-05-31T09:56:29.350Z
source accessed on: 2017-10-19T03:34:33Z
source last accessed on: 2019-06-07T09:41:30Z
label: Comércio Varejista de Produtos Alimentícios e Produtos Básicos @pt
label: Food & Staples Retailing @en
label: Lebensmittel- und Basisartikeleinzelhandel @de
label: Vendita al dettaglio di alimenti e beni di prima necessità @it
label: Venta de Alimentos y Productos de Primera Necesidad @es
label: Vente au Détail de Produits Alimentaires et de Produits de Première Nécessité @fr
label: Розничная торговля продуктами питания и товарами массового спроса @ru
label: 食品・生活必需品小売り @ja
label: 食品與主要用品零售
label: 식품과 기본 식료품 소매 @ko
notation: 301010
valid from: 2016-09-01
valid till: 2018-09-29

食品与主要用品零售
type: GlobalIndustryClassificationStandardsClassifier
type: IndustryGroupClassifier
type: NamedIndividual
is contemporary version of: http://data.ga-group.nl/ics/gics/3010
is replaced by: http://data.ga-group.nl/ics/gics/2018/3010
is version of: http://data.ga-group.nl/ics/gics/3010
replaces: http://data.ga-group.nl/ics/gics/2014/3010
is industry group of: 日常消費品
imported on: 2026-05-27T08:45:00.430Z
last refreshed on: 2026-05-31T09:56:29.350Z
source accessed on: 2017-10-19T03:34:33Z
source last accessed on: 2019-06-07T09:41:30Z
label: Comércio Varejista de Produtos Alimentícios e Produtos Básicos @pt
label: Food & Staples Retailing @en
label: Lebensmittel- und Basisartikeleinzelhandel @de
label: Vendita al dettaglio di alimenti e beni di prima necessità @it
label: Venta de Alimentos y Productos de Primera Necesidad @es
label: Vente au Détail de Produits Alimentaires et de Produits de Première Nécessité @fr
label: Розничная торговля продуктами питания и потребительскими товарами массового спроса @ru
label: 食品・生活必需品小売り @ja
label: 食品與主要用品零售
label: 식품과 기본 식료품 소매 @ko
notation: 3010
valid from: 2016-09-01
valid till: 2018-09-29

啤酒酿造商
type: GlobalIndustryClassificationStandardsClassifier
type: SubindustryClassifier
type: NamedIndividual
is contemporary version of: http://data.ga-group.nl/ics/gics/30201010
is replaced by: http://data.ga-group.nl/ics/gics/2018/30201010
is version of: http://data.ga-group.nl/ics/gics/30201010
replaces: http://data.ga-group.nl/ics/gics/2014/30201010
is subindustry of: 饮料
imported on: 2026-05-27T08:45:00.430Z
last refreshed on: 2026-05-31T09:56:29.350Z
source accessed on: 2017-10-19T03:38:28Z
source last accessed on: 2019-06-07T09:41:30Z
label: Brewers @en
label: Cervejarias @pt
label: Producción de Cerveza @es
label: Производство алкогольной и безалкогольной продукции @ru
label: 啤酒釀造商
label: 醸造 @ja
label: 맥주 양조업자 @ko
definition: Empresas dedicadas a la producción de cerveza y licores de malta. Se incluyen las fábricas de cerveza no clasificadas en la rama industrial Restaurantes. @es
definition: Producers of beer and malt liquors. Includes breweries not classified in the Restaurants Sub-Industry. @en
definition: Produtores de cerveja e bebidas alcoólicas à base de malte. Inclui cervejarias não classificadas na Sub-Indústria de Restaurantes. @pt
definition: Производители пивоваренной продукции, в том числе пивоварни, не включенные в подотрасль «Деятельность ресторанов». @ru
definition: ビール、麦芽醸造酒の製造会社。産業サブグループの「レストラン」に分類されていない醸造業者を含む。 @ja
definition: 生产啤酒和麦芽酒 的公司。包括未归类于“餐馆”子行业中的啤酒厂。
definition: 生產啤酒和麥芽酒 的公司。包括未歸類於“餐館”子行業中的啤酒廠。
definition: 맥주와 맥아 발효 술 생산업체. ‘레스토랑’으로 분류되지 않은 양조장 포함. @ko
notation: 30201010
valid from: 2016-09-01
valid till: 2018-09-29

酿酒商与葡萄酒商
type: GlobalIndustryClassificationStandardsClassifier
type: SubindustryClassifier
type: NamedIndividual
is contemporary version of: http://data.ga-group.nl/ics/gics/30201020
is replaced by: http://data.ga-group.nl/ics/gics/2018/30201020
is version of: http://data.ga-group.nl/ics/gics/30201020
replaces: http://data.ga-group.nl/ics/gics/2014/30201020
is subindustry of: 饮料
imported on: 2026-05-27T08:45:00.430Z
last refreshed on: 2026-05-31T09:56:29.350Z
source accessed on: 2017-10-19T03:38:28Z
source last accessed on: 2019-06-07T09:41:30Z
label: Destiladores y Vinateros @es
label: Destilarias e Viticultores @pt
label: Distillers & Vintners @en
label: Производство спирта и вин @ru
label: 蒸留酒・ワイン @ja
label: 釀酒商與葡萄酒商
label: 증류업체와 양조업체 @ko
definition: Destiladores, vinateros y productores de bebidas alcohólicas no clasificados en la rama industrial Producción de Cerveza. @es
definition: Destiladores, viticultores e produtores de bebidas alcoólicas não classificadas na Sub-Indústria de Cervejarias. @pt
definition: Distillers, vintners and producers of alcoholic beverages not classified in the Brewers Sub-Industry. @en
definition: Производители спирта, вин и других алкогольных напитков, не включенные в подотрасль «Производство пивоваренной продукции». @ru
definition: ‘맥주 양조업자’로 분류되지 않은 술의 증류, 양조, 제조업체. @ko
definition: 蒸留酒、ワイン醸造業者および産業サブグループの「醸造」に分類されていないアルコール飲料の製造会社。 @ja
definition: 酿酒商、葡萄酒商和酒精饮料生厂商（未归类于“啤酒酿造商”子行业）。
definition: 釀酒商、葡萄酒商和酒精飲料生廠商（未歸類於“啤酒釀造商”子行業）。
notation: 30201020
valid from: 2016-09-01
valid till: 2018-09-29

軟飲料
type: GlobalIndustryClassificationStandardsClassifier
type: SubindustryClassifier
type: NamedIndividual
is contemporary version of: http://data.ga-group.nl/ics/gics/30201030
is replaced by: http://data.ga-group.nl/ics/gics/2018/30201030
is version of: http://data.ga-group.nl/ics/gics/30201030
replaces: http://data.ga-group.nl/ics/gics/2014/30201030
is subindustry of: 饮料
imported on: 2026-05-27T08:45:00.430Z
last refreshed on: 2026-05-31T09:56:29.350Z
source accessed on: 2017-10-19T03:38:28Z
source last accessed on: 2019-06-07T09:41:30Z
label: Producción de Bebidas no Alcohólicas @es
label: Refrigerantes @pt
label: Soft Drinks @en
label: Производство безалкогольных напитков @ru
label: 清涼飲料 @ja
label: 软饮料
label: 청량 음료 @ko
definition: Empresas dedicadas a la producción de bebidas no alcohólicas, incluyendo el agua mineral. Se excluyen los productores de leche, clasificados en la rama industrial Alimentos Envasados. @es
definition: Producers of non-alcoholic beverages including mineral waters. Excludes producers of milk classified in the Packaged Foods Sub-Industry. @en
definition: Produtores de bebidas não alcoólicas, incluindo água mineral. Exclui produtores de leite classificados na Sub-Indústria de Alimentos Embalados. @pt
definition: Производители безалкогольных напитков, в том числе минеральной воды, за исключением производителей молока, включенных в подотрасль «Производство фасованной продукции». @ru
definition: ミネラルウォーターを含む非アルコール飲料の製造会社。産業サブグループの「包装食品」に分類される牛乳製造会社は除く。 @ja
definition: 生产包括矿泉水在内的不含酒精饮料的公司。不包括归类于“包装食品”子行业中的奶制品生产商。
definition: 生產包括礦泉水在內的不含酒精飲料的公司。不包括歸類於“包裝食品”子行業中的乳製品生產商。
definition: 광천수를 포함한 무알콜 음료 생산업체. ‘포장 식품’으로 분류되는 우유 생산업체는 제외. @ko
notation: 30201030
valid from: 2016-09-01
valid till: 2018-09-29

饮料
type: GlobalIndustryClassificationStandardsClassifier
type: IndustryClassifier
type: NamedIndividual
is contemporary version of: http://data.ga-group.nl/ics/gics/302010
is replaced by: http://data.ga-group.nl/ics/gics/2018/302010
is version of: http://data.ga-group.nl/ics/gics/302010
replaces: http://data.ga-group.nl/ics/gics/2014/302010
is industry of: 食品、飲料與煙草
imported on: 2026-05-27T08:45:00.430Z
last refreshed on: 2026-05-31T09:56:29.350Z
source accessed on: 2017-10-19T03:34:33Z
source last accessed on: 2019-06-07T09:41:30Z
label: Bebidas @es
label: Bevande @it
label: Beverages @en
label: Boissons @fr
label: Getränke @de
label: Производство напитков @ru
label: 飲料
label: 음료 @ko
notation: 302010
valid from: 2016-09-01
valid till: 2018-09-29

农产品
type: GlobalIndustryClassificationStandardsClassifier
type: SubindustryClassifier
type: NamedIndividual
is contemporary version of: http://data.ga-group.nl/ics/gics/30202010
is replaced by: http://data.ga-group.nl/ics/gics/2018/30202010
is version of: http://data.ga-group.nl/ics/gics/30202010
replaces: http://data.ga-group.nl/ics/gics/2014/30202010
is subindustry of: Alimentos
imported on: 2026-05-27T08:45:00.430Z
last refreshed on: 2026-05-31T09:56:29.350Z
source accessed on: 2017-10-19T03:38:28Z
source last accessed on: 2019-06-07T09:41:30Z
label: Agricultural Products @en
label: Productos Agrícolas @es
label: Produtos Agrícolas @pt
label: Производство сельскохозяйственной продукции @ru
label: 農產品
label: 農産物 @ja
label: 농산물 @ko
definition: Empresas dedicadas a la producción agrícola. Se incluyen propietarios de tierras de cultivo y plantaciones, y empresas que producen y procesan alimentos, pero no los envasan ni comercializan. Se excluyen las empresas clasificadas en la rama Productos Madereros y aquellas dedicadas a envasar y comercializar alimentos, clasificadas en la rama Alimentos y Carnes Envasados. @es
definition: Producers of agricultural products. Includes crop growers, owners of plantations and companies that produce and process foods but do not package and market them. Excludes companies classified in the Forest Products Sub-Industry and those that package and market the food products classified in the Packaged Foods Sub-Industry. @en
definition: Produtores de produtos agrícolas. Inclui cultivadores, donos de plantações e empresas que produzem e processam alimentos, mas não os embalam e comercializam. Exclui empresas classificadas na Sub-Indústria de Produtos Florestais e aqueles que embalam e comercializam os produtos alimentícios e estão classificados na Sub-Indústria de Alimentos Embalados. @pt
definition: "Производители сельскохозяйственной продукции, в том числе зерноводческие компании, владельцы плантаций и компании по производству и переработке продуктов питания, которые не занимаются их упаковкой и сбытом. В данную группу не входят компании, включенные в подотрасль ""Производство продукции лесного хозяйства"" и компании, занятые упаковкой и сбытом продуктов питания и включенные в подотрасль «Производство фасованной продукции»." @ru
definition: 农产品生产商。包括农作物种植、生产与加工食品但不包装和销售它们的种植园业主及公司。不包括那些归类于“林业产品”子行业中的公司以及归类于“包装食品”子行业目录中那些包装和销售食品的公司。
definition: 農產品生產商。包括農作物種植、生產與加工食品但不包裝和銷售它們的種植園業主及公司。不包括那些歸類于“林業產品”子行業中的公司以及歸類於“包裝食品”子行業目錄中那些包裝和銷售食品的公司。
definition: 農産物の製造会社。農作物栽培者、プランテーションの所有者、食品の製造・加工を行う会社（包装、販売は行わない）を含む。産業サブグループの「林産品」に分類される会社、���よび「包装食品」に分類される食品の包装・販売を行う会社は除く。 @ja
definition: 농산물 생산업체. 농작물 재배자, 농장 소유자, 그리고 식품을 생산 및 처리는 하지만 포장 및 판매는 하지 않는 회사 포함. ‘임산물’로 분류되는 회사는 제외하며, ‘포장 식품’으로 분류되는 식품을 포장 및 판매하는 회사도 제외. @ko
notation: 30202010
valid from: 2016-09-01
valid till: 2018-09-29

包装食品与肉类
type: GlobalIndustryClassificationStandardsClassifier
type: SubindustryClassifier
type: NamedIndividual
is contemporary version of: http://data.ga-group.nl/ics/gics/30202030
is replaced by: http://data.ga-group.nl/ics/gics/2018/30202030
is version of: http://data.ga-group.nl/ics/gics/30202030
replaces: http://data.ga-group.nl/ics/gics/2014/30202030
is subindustry of: Alimentos
imported on: 2026-05-27T08:45:00.430Z
last refreshed on: 2026-05-31T09:56:29.350Z
source accessed on: 2017-10-19T03:38:28Z
source last accessed on: 2019-06-07T09:41:30Z
label: Alimentos e Carnes Embaladas @pt
label: Alimentos y Carnes Envasados @es
label: Packaged Foods & Meats @en
label: Производство фасованных продуктов питания и мясных продуктов @ru
label: 包装食品・肉 @ja
label: 包裝食品與肉類
label: 포장 식품과 고기 @ko
definition: Empresas dedicadas a la producción de alimentos envasados como productos lácteos, zumos de frutas, carnes y productos avícolas, pescado y comida para animales. @es
definition: Producers of packaged foods including dairy products, fruit juices, meats, poultry, fish and pet foods. @en
definition: Produtores de alimentos embalados incluindo produtos derivados de leite, sucos de frutas, carnes, aves, peixe e alimentos para animais de estimação. @pt
definition: Производители фасованных продуктов питания, в том числе молочных продуктов, фруктовых соков, мясных продуктов, продуктов из птицы, рыбы, а также кормов для животных. @ru
definition: 乳製品、フルーツジュース、肉、鶏肉、魚、ペットフードを含む包装食品の製造会社。 @ja
definition: 生产包括乳制品、果汁、肉类、禽类和鱼类产品以及宠物食品在内的包装食品的公司。
definition: 生產包括乳製品、果汁、肉類、禽類和魚類產品以及寵物食品在內的包裝食���的公司。
definition: 유제품, 과일 주스, 고기, 가금류, 생선, 애완동물 음식을 포함한 포장 식품 생산업체. @ko
notation: 30202030
valid from: 2016-09-01
valid till: 2018-09-29

Alimentos
type: GlobalIndustryClassificationStandardsClassifier
type: IndustryClassifier
type: NamedIndividual
is contemporary version of: http://data.ga-group.nl/ics/gics/302020
is replaced by: http://data.ga-group.nl/ics/gics/2018/302020
is version of: http://data.ga-group.nl/ics/gics/302020
replaces: http://data.ga-group.nl/ics/gics/2014/302020
is industry of: 食品、飲料與煙草
imported on: 2026-05-27T08:45:00.430Z
last refreshed on: 2026-05-31T09:56:29.350Z
source accessed on: 2017-10-19T03:34:33Z
source last accessed on: 2019-06-07T09:41:30Z
label: Food Products @en
label: Nahrungsmittel @de
label: Prodotti alimentari @it
label: Produits Alimentaires @fr
label: Produtos Alimentícios @pt
label: Производство продуктов питания @ru
label: 食品
label: 식품 @ko
notation: 302020
valid from: 2016-09-01
valid till: 2018-09-29

烟草
type: GlobalIndustryClassificationStandardsClassifier
type: SubindustryClassifier
type: NamedIndividual
is contemporary version of: http://data.ga-group.nl/ics/gics/30203010
is replaced by: http://data.ga-group.nl/ics/gics/2018/30203010
is version of: http://data.ga-group.nl/ics/gics/30203010
replaces: http://data.ga-group.nl/ics/gics/2014/30203010
is subindustry of: 烟草
imported on: 2026-05-27T08:45:00.430Z
last refreshed on: 2026-05-31T09:56:29.350Z
source accessed on: 2017-10-19T03:38:28Z
source last accessed on: 2019-06-07T09:41:30Z
label: Tabaco @es
label: Tobacco @en
label: Производство табачной продукции @ru
label: タバコ @ja
label: 煙草
label: 담배 @ko
definition: Empresas dedicadas a la producción de cigarrillos y otros productos relacionados. @es
definition: Fabricantes de cigarros e outros produtos de tabaco. @pt
definition: Manufacturers of cigarettes and other tobacco products. @en
definition: Производители сигарет и другой табачной продукции. @ru
definition: 紙巻タバコおよび他のタバコ製品の製造会社。 @ja
definition: 香烟及其它烟草产品制造商。
definition: 香煙及其他煙草產品製造商。
definition: 담배 및 기타 담배 제품 제조업체. @ko
notation: 30203010
valid from: 2016-09-01
valid till: 2018-09-29

烟草
type: GlobalIndustryClassificationStandardsClassifier
type: IndustryClassifier
type: NamedIndividual
is contemporary version of: http://data.ga-group.nl/ics/gics/302030
is replaced by: http://data.ga-group.nl/ics/gics/2018/302030
is version of: http://data.ga-group.nl/ics/gics/302030
replaces: http://data.ga-group.nl/ics/gics/2014/302030
is industry of: 食品、飲料與煙草
imported on: 2026-05-27T08:45:00.430Z
last refreshed on: 2026-05-31T09:56:29.350Z
source accessed on: 2017-10-19T03:34:33Z
source last accessed on: 2019-06-07T09:41:30Z
label: Tabac @fr
label: Tabacco @it
label: Tabaco @es
label: Tabak @de
label: Tobacco @en
label: Производство табачной продукции @ru
label: タバコ @ja
label: 煙草
label: 담배 @ko
notation: 302030
valid from: 2016-09-01
valid till: 2018-09-29

食品、飲料與煙草
type: GlobalIndustryClassificationStandardsClassifier
type: IndustryGroupClassifier
type: NamedIndividual
is contemporary version of: http://data.ga-group.nl/ics/gics/3020
is replaced by: http://data.ga-group.nl/ics/gics/2018/3020
is version of: http://data.ga-group.nl/ics/gics/3020
replaces: http://data.ga-group.nl/ics/gics/2014/3020
is industry group of: 日常消費品
imported on: 2026-05-27T08:45:00.430Z
last refreshed on: 2026-05-31T09:56:29.350Z
source accessed on: 2017-10-19T03:34:33Z
source last accessed on: 2019-06-07T09:41:30Z
label: Alimenti, bevande e tabacco @it
label: Alimentos, Bebidas y Tabaco @es
label: Food, Beverage & Tobacco @en
label: Lebensmittel, Getränke & Tabak @de
label: Produits Alimentaires, Boissons et Tabac @fr
label: Produtos Alimentícios, Bebidas e Tabaco @pt
label: Пищевая промышленность @ru
label: 食品、饮料与烟草
label: 食品・飲料・タバコ @ja
label: 식품, 음료, 담배 @ko
notation: 3020
valid from: 2016-09-01
valid till: 2018-09-29

居家用品
type: GlobalIndustryClassificationStandardsClassifier
type: SubindustryClassifier
type: NamedIndividual
is contemporary version of: http://data.ga-group.nl/ics/gics/30301010
is replaced by: http://data.ga-group.nl/ics/gics/2018/30301010
is version of: http://data.ga-group.nl/ics/gics/30301010
replaces: http://data.ga-group.nl/ics/gics/2014/30301010
is subindustry of: 居家用品
imported on: 2026-05-27T08:45:00.430Z
last refreshed on: 2026-05-31T09:56:29.350Z
source accessed on: 2017-10-19T03:38:28Z
source last accessed on: 2019-06-07T09:41:30Z
label: Household Products @en
label: Productos Domésticos @es
label: Produtos de Uso Doméstico @pt
label: Производство бытовых товаров @ru
label: 家庭用品
label: 가정용품 @ko
definition: Empresas dedicadas a la producción de artículos domésticos no duraderos, como detergentes, jabones, pañales y otros productos domésticos de papel, como pañuelos, no clasificados en la rama Productos Papeleros. @es
definition: Fabricantes de produtos para uso doméstico não duráveis, incluindo detergentes, sabões, fraldas e outros produtos de lenços de papel e papéis de uso doméstico não classificados na Sub-Indústria de Produtos de Papel. @pt
definition: Producers of non-durable household products, including detergents, soaps, diapers and other tissue and household paper products not classified in the Paper Products Sub-Industry. @en
definition: Производители бытовых товаров кратковременного пользования, в том числе моющих средств, мыла, подгузников и других косметических и бытовых товаров из бумаги, не включенные в подотрасль «Целлюлозно-бумажное производство». @ru
definition: 洗剤、石鹸、おむつ、および産業サブグループの「紙製品」に分類されていないティッシュ製品や家庭用紙製品を含む非耐久性家庭用品の製造会社。 @ja
definition: 生产包括洗涤剂、肥皂、尿布和其它家用卫生纸及纸用品（未归类于“纸制品”子行业）在内的家庭非耐用消费品的公司。
definition: 生產包括洗滌劑、肥皂、尿布和其他家用衛生紙及紙用品（未歸類於“紙製品”子行業）在內的家庭非耐用消費品的公司。
definition: 세제, 비누, 기저귀, 그리고 ‘종이 제품’으로 분류되지 않은 기타 티슈 및 가정용 종이 제품을 포함한 비내구적 가정용품 생산업체. @ko
notation: 30301010
valid from: 2016-09-01
valid till: 2018-09-29

居家用品
type: GlobalIndustryClassificationStandardsClassifier
type: IndustryClassifier
type: NamedIndividual
is contemporary version of: http://data.ga-group.nl/ics/gics/303010
is replaced by: http://data.ga-group.nl/ics/gics/2018/303010
is version of: http://data.ga-group.nl/ics/gics/303010
replaces: http://data.ga-group.nl/ics/gics/2014/303010
is industry of: 家庭与个人用品
imported on: 2026-05-27T08:45:00.430Z
last refreshed on: 2026-05-31T09:56:29.350Z
source accessed on: 2017-10-19T03:34:33Z
source last accessed on: 2019-06-07T09:41:30Z
label: Haushaltsartikel @de
label: Household Products @en
label: Prodotti per la casa @it
label: Productos Domésticos @es
label: Produits Domestiques @fr
label: Produtos de Uso Doméstico @pt
label: Производство бытовых товаров @ru
label: 家庭用品
label: 가정용품 @ko
notation: 303010
valid from: 2016-09-01
valid till: 2018-09-29

个人用品
type: GlobalIndustryClassificationStandardsClassifier
type: SubindustryClassifier
type: NamedIndividual
is contemporary version of: http://data.ga-group.nl/ics/gics/30302010
is replaced by: http://data.ga-group.nl/ics/gics/2018/30302010
is version of: http://data.ga-group.nl/ics/gics/30302010
replaces: http://data.ga-group.nl/ics/gics/2014/30302010
is subindustry of: 个人用品
imported on: 2026-05-27T08:45:00.430Z
last refreshed on: 2026-05-31T09:56:29.350Z
source accessed on: 2017-10-19T03:38:28Z
source last accessed on: 2019-06-07T09:41:30Z
label: Personal Products @en
label: Productos Personales @es
label: Produtos Pessoais @pt
label: Производство предметов личной гигиены @ru
label: パーソナル用品 @ja
label: 個人用品
label: 개인용품 @ko
definition: Empresas dedicadas a la producción de artículos personales y de belleza, como cosméticos y perfumes. @es
definition: Fabricantes de produtos pessoais e cuidados de beleza, incluindo cosméticos e perfumes. @pt
definition: Manufacturers of personal and beauty care products, including cosmetics and perfumes. @en
definition: Производители товаров личной гигиены и средств по уходу, в том числе косметических и парфюмерных товаров. @ru
definition: 化粧品や香水を含むパーソナル用品やビューティー・ケア製品の製造会社。 @ja
definition: 生产包括化妆品和香水在内的个人及美容护理用品的公司。
definition: 生產包括化妝品和香水在內的個人及美容護理用品的公司。
definition: 화장품과 향수를 포함한 개인용품 및 미용제품 제조업체. @ko
notation: 30302010
valid from: 2016-09-01
valid till: 2018-09-29

个人用品
type: GlobalIndustryClassificationStandardsClassifier
type: IndustryClassifier
type: NamedIndividual
is contemporary version of: http://data.ga-group.nl/ics/gics/303020
is replaced by: http://data.ga-group.nl/ics/gics/2018/303020
is version of: http://data.ga-group.nl/ics/gics/303020
replaces: http://data.ga-group.nl/ics/gics/2014/303020
is industry of: 家庭与个人用品
imported on: 2026-05-27T08:45:00.430Z
last refreshed on: 2026-05-31T09:56:29.350Z
source accessed on: 2017-10-19T03:34:33Z
source last accessed on: 2019-06-07T09:41:30Z
label: Personal Products @en
label: Pflegeprodukte @de
label: Prodotti per l'igiene personale @it
label: Productos Personales @es
label: Produits de Soin Personnel @fr
label: Produtos Pessoais @pt
label: Производство предметов личной гигиены @ru
label: パーソナル用品 @ja
label: 個人用品
label: 개인용품 @ko
notation: 303020
valid from: 2016-09-01
valid till: 2018-09-29

家庭与个人用品
type: GlobalIndustryClassificationStandardsClassifier
type: IndustryGroupClassifier
type: NamedIndividual
is contemporary version of: http://data.ga-group.nl/ics/gics/3030
is replaced by: http://data.ga-group.nl/ics/gics/2018/3030
is version of: http://data.ga-group.nl/ics/gics/3030
replaces: http://data.ga-group.nl/ics/gics/2014/3030
is industry group of: 日常消費品
imported on: 2026-05-27T08:45:00.430Z
last refreshed on: 2026-05-31T09:56:29.350Z
source accessed on: 2017-10-19T03:34:33Z
source last accessed on: 2019-06-07T09:41:30Z
label: Haushaltsartikel & Körperpflegeprodukte @de
label: Household & Personal Products @en
label: Prodotti per la casa e l'igiene personale @it
label: Productos Domésticos y Personales @es
label: Produits Domestiques et de Soin Personnel @fr
label: Produtos de Uso Doméstico e Pessoais @pt
label: Бытовые товары и предметы личной гигиены @ru
label: 家庭用品・パーソナル用品 @ja
label: 家庭與個人用品
label: 가정용품과 개인용품 @ko
notation: 3030
valid from: 2016-09-01
valid till: 2018-09-29

日常消費品
type: GlobalIndustryClassificationStandardsClassifier
type: SectorClassifier
type: NamedIndividual
is contemporary version of: http://data.ga-group.nl/ics/gics/30
is replaced by: http://data.ga-group.nl/ics/gics/2018/30
is version of: http://data.ga-group.nl/ics/gics/30
replaces: http://data.ga-group.nl/ics/gics/2014/30
imported on: 2026-05-27T08:45:00.430Z
last refreshed on: 2026-05-31T09:56:29.350Z
source accessed on: 2017-10-19T03:34:33Z
source last accessed on: 2019-06-07T09:41:30Z
label: Basiskonsumgüter @de
label: Beni di prima necessita' @it
label: Biens de Consommation de Base @fr
label: Consumer Staples @en
label: Productos de Primera Necesidad @es
label: Produtos Básicos de Consumo @pt
label: Потребительские товары массового спроса @ru
label: 日常消费品
label: 生活必需品 @ja
label: 기본 소비자 식료품 @ko
notation: 30
valid from: 2016-09-01
valid till: 2018-09-29

医疗保健设备
type: GlobalIndustryClassificationStandardsClassifier
type: SubindustryClassifier
type: NamedIndividual
is contemporary version of: http://data.ga-group.nl/ics/gics/35101010
is replaced by: http://data.ga-group.nl/ics/gics/2018/35101010
is version of: http://data.ga-group.nl/ics/gics/35101010
replaces: http://data.ga-group.nl/ics/gics/2014/35101010
is subindustry of: 医疗保健设备与用品
imported on: 2026-05-27T08:45:00.430Z
last refreshed on: 2026-05-31T09:56:29.350Z
source accessed on: 2017-10-19T03:38:28Z
source last accessed on: 2019-06-07T09:41:30Z
label: Equipamento de Assistência Médica @pt
label: Equipos Médicos @es
label: Health Care Equipment @en
label: Производство медицинского оборудования @ru
label: ヘルスケア機器 @ja
label: 醫療保健設備
label: 건강관리 장비 @ko
definition: Empresas dedicadas a la fabricación de equipo y dispositivos para la atención de la salud. Se incluyen fabricantes de instrumentos médicos, sistemas de administración de medicamentos, dispositivos cardiovasculares, ortopédicos y equipos de diagnóstico. @es
definition: Fabricantes de equipamento e dispositivos de assistência à saúde. Inclui instrumentos médicos, sistemas de entrega de medicamentos, dispositivos cardiovasculares e ortopédicos, e equipamento diagnóstico. @pt
definition: Manufacturers of health care equipment and devices. Includes medical instruments, drug delivery systems, cardiovascular & orthopedic devices, and diagnostic equipment. @en
definition: Производители медицинского оборудования и приборов, в том числе медицинских инструментов, систем доставки лекарственных препара��ов, оборудования для кардиологических и ортопедических служб, диагностического оборудования. @ru
definition: ヘルスケア機器および装置の製造会社。医療用器具、薬物送達システム、心血管装置、矯正装置、診断装置を含む。 @ja
definition: 医疗保健设备及装置制造商。包括医疗仪器和药物运送系统、心血管和矫形设备、 以及诊断设备。
definition: 醫療保健設備及裝置製造商。包括醫療儀器和藥物運送系統、心血管和矯形設備、 以及診斷設備。
definition: 건강관리 장비와 장치 제조업체. 의료기기, 약물전달 장치, 심장��관계 및 정형외과용 장치, 진단장비 포함. @ko
notation: 35101010
valid from: 2016-09-01
valid till: 2018-09-29

医疗保健用品
type: GlobalIndustryClassificationStandardsClassifier
type: SubindustryClassifier
type: NamedIndividual
is contemporary version of: http://data.ga-group.nl/ics/gics/35101020
is replaced by: http://data.ga-group.nl/ics/gics/2018/35101020
is version of: http://data.ga-group.nl/ics/gics/35101020
replaces: http://data.ga-group.nl/ics/gics/2014/35101020
is subindustry of: 医疗保健设备与用品
imported on: 2026-05-27T08:45:00.430Z
last refreshed on: 2026-05-31T09:56:29.350Z
source accessed on: 2017-10-19T03:38:28Z
source last accessed on: 2019-06-07T09:41:30Z
label: Health Care Supplies @en
label: Suministros Medicos @es
label: Suprimentos de Assistência Médica @pt
label: Производство товаров медицинского назначения @ru
label: ヘルスケア用品 @ja
label: 醫療保健用品
label: 건강관리 용품 @ko
definition: Empresas dedicadas a la fabricación de suministros médicos y productos médicos no incluidos en otra clasificación. Se incluyen fabricantes de productos oftalmológicos, suministros para hospitales y dispositivos de seguridad de aguja y jeringa. @es
definition: Fabricantes de suprimentos de assistência à saúde e produtos médicos não classificados em nenhum outro lugar. Inclui produtos de cuidado dos olhos, suprimentos hospitalares, e dispositivos de segurança de agulhas e seringas. @pt
definition: Manufacturers of health care supplies and medical products not classified elsewhere. Includes eye care products, hospital supplies, and safety needle & syringe devices. @en
definition: Производители товаров медицинского назначения и лекарственных препаратов, не включенные в другие группы. В данную группу входят производители продукции для ухода за глазами, стационарных медицинских учреждений, безопасных игл и шприцев. @ru
definition: 他のグループに分類されていないヘルスケア用品や医療品の製造会社。アイ・ケア製品、病院用品、安全針、注射器装置を含む。 @ja
definition: 医疗保健用品及医药产品（未归类于别处）的制造商。包括眼护理用品、医疗用品、 和安全针及注射器设备。
definition: 醫療保健用品及醫藥產品（未歸類於別處）的製造商。包括眼護理用品、醫院供應品、 和安全針及注射器設備。
definition: 다른 부문으로 분류되지 않은 건강관리 용품과 의료용 제품 제조업체. 눈 관리 제품, 병원용품, 안전 주사바늘 및 주사기 장치 포함. @ko
notation: 35101020
valid from: 2016-09-01
valid till: 2018-09-29

医疗保健设备与用品
type: GlobalIndustryClassificationStandardsClassifier
type: IndustryClassifier
type: NamedIndividual
is contemporary version of: http://data.ga-group.nl/ics/gics/351010
is replaced by: http://data.ga-group.nl/ics/gics/2018/351010
is version of: http://data.ga-group.nl/ics/gics/351010
replaces: http://data.ga-group.nl/ics/gics/2014/351010
is industry of: 医疗保健设备与服���
imported on: 2026-05-27T08:45:00.430Z
last refreshed on: 2026-05-31T09:56:29.350Z
source accessed on: 2017-10-19T03:34:33Z
source last accessed on: 2019-06-07T09:41:30Z
label: Attrezzatura e forniture sanitarie @it
label: Equipamento e Suprimentos de Assistência Médica @pt
label: Equipos y Suministros Médicos @es
label: Gesundheitswesen: Ausstattung & Produkte @de
label: Health Care Equipment & Supplies @en
label: Équipement et Fournitures Médicaux @fr
label: Производство медицинского оборудования и товаров медицинского назначения @ru
label: ヘルスケア機器・用品 @ja
label: 醫療保健設備與用品
label: 건강관리 장비와 용품 @ko
notation: 351010
valid from: 2016-09-01
valid till: 2018-09-29

保健护理产品经销商
type: GlobalIndustryClassificationStandardsClassifier
type: SubindustryClassifier
type: NamedIndividual
is contemporary version of: http://data.ga-group.nl/ics/gics/35102010
is replaced by: http://data.ga-group.nl/ics/gics/2018/35102010
is version of: http://data.ga-group.nl/ics/gics/35102010
replaces: http://data.ga-group.nl/ics/gics/2014/35102010
is subindustry of: 医疗保健提供商与服务
imported on: 2026-05-27T08:45:00.430Z
last refreshed on: 2026-05-31T09:56:29.350Z
source accessed on: 2017-10-19T03:38:28Z
source last accessed on: 2019-06-07T09:41:30Z
label: Distribuidores de Productos Médicos @es
label: Distribuidores de Produtos de Assistência Médica @pt
label: Health Care Distributors @en
label: Деятельность дистрибьюторов товаров медицинского назначения @ru
label: ヘルスケア・ディストリビュータ @ja
label: 醫療護理產品經銷商
label: 건강관리 판매업체 @ko
definition: Distribuidores e atacadistas de produtos de assistência à saúde não classificados em nenhum outro lugar. @pt
definition: Distribuidores y mayoristas de productos médicos no clasificados en ninguna otra rama. @es
definition: Distributors and wholesalers of health care products not classified elsewhere. @en
definition: Компании, занимающиеся распространением и оптовой торговлей мед��цинскими товарами, не включенные в другие группы. @ru
definition: 他のグループに分類されていないヘルスケア製品の販売・卸売り業者。 @ja
definition: 保健护理产品（未归类于别处）的经销商和批发商。
definition: 保健護理產品（未歸類於別處）的經銷商和批發商。
definition: 다른 부문으로 분류되지 않은 건강관리 제품 판매업체 및 도매업체. @ko
notation: 35102010
valid from: 2016-09-01
valid till: 2018-09-29

保健护理服务
type: GlobalIndustryClassificationStandardsClassifier
type: SubindustryClassifier
type: NamedIndividual
is contemporary version of: http://data.ga-group.nl/ics/gics/35102015
is replaced by: http://data.ga-group.nl/ics/gics/2018/35102015
is version of: http://data.ga-group.nl/ics/gics/35102015
replaces: http://data.ga-group.nl/ics/gics/2014/35102015
is subindustry of: 医疗保健提供商与服务
imported on: 2026-05-27T08:45:00.430Z
last refreshed on: 2026-05-31T09:56:29.350Z
source accessed on: 2017-10-19T03:38:28Z
source last accessed on: 2019-06-07T09:41:30Z
label: Health Care Services @en
label: Serviços de Assistência Médica @pt
label: Servicios Médicos @es
label: Предоставление услуг здравоохранения @ru
label: ヘルスケアサービス @ja
label: 保健護理服務
label: 건강관리 서비스 @ko
definition: Empresas proveedoras de servicios para la atención de pacientes, no clasificadas en ninguna otra rama. Se incluyen centros de diálisis, servicios de pruebas de laboratorio y servicios de administración de farmacias. También se incluyen las empresas que prestan servicios comerciales de apoyo a los proveedores de atención médica, como los servicios administrativos de apoyo, los servicios de agencias de cobranzas, los servicios de personal y los servicios de ventas y mercadeo contratados externamente. @es
definition: Provedores de serviços de assistência de saúde não classificados em nenhum outro lugar. Inclui centros de diálise, serviços de testes laboratoriais e serviços de gestão farmacêutica. Também inclui empresas provedoras de serviços comerciais de suporte a provedores de assistência médica, tais como serviços de suporte administrativo, serviços de agências de cobrança, serviços de quadros de funcionários e serviços terceirizados de comercialização e vendas. @pt
definition: Providers of patient health care services not classified elsewhere. Includes dialysis centers, lab testing services, and pharmacy management services. Also includes companies providing business support services to health care providers, such as clerical support services, collection agency services, staffing services and outsourced sales & marketing services @en
definition: Компании, предоставляющие услуги здравоохранения, не включенные в другие группы. В данную группу входят пункты диализа, лаборатории, компании по управлению аптеками, а также компании, предоставляющие услуги по организации деятельности медицинских учреждений, в частности, услуги по делопроизводству, сбору платежей, комплектованию штата, услуги по реализации и маркетингу, переданные другим организациям. @ru
definition: 他のグループに分類されていないヘルスケアサービスの提供業者。透析センター、医療検査サービス、薬局管理サービスを含む。ヘルスケア・プロバイダー向けに事務処理サービス、回収代行サービス、人材派遣サービス、外部委託販売/マーケティング・サービスなどの事業支援サービスを提供する会社も含む。 @ja
definition: 提供病人保健护理服务（未归类于别处）的公司。包括透析中心、实验室试验服务、和药房管理服务。也包括向医疗保健供应商提供支持性业务服务, 譬如职员支助性业务、代收机构服务、雇员服务和外包销售及营销服务的公司
definition: 提供病人保健護理服務（未歸類於別處）的公司。包括透析中心、實驗室試驗服務、和藥房管理服務。也包括向醫療保健供應商提供支援性業務服務, 譬如職員支助性業務、代收機構服務、雇員服務和外包銷售及行銷服務的公司
definition: 다른 부문으로 분류되지 않은 환자 건강관리 서비스 제공업체. 투석 센터, 실험실 검사 서비스, 약국 관리 서비스 포함. 또한 건강관리 업체에 사무 지원 서비스, 채권 회수 대행 서비스, 구인 서비스, 외주 판매 및 마케팅 서비스 등 사업 지원 서비스를 제공하는 회사도 포함 @ko
notation: 35102015
valid from: 2016-09-01
valid till: 2018-09-29

保健护理机构
type: GlobalIndustryClassificationStandardsClassifier
type: SubindustryClassifier
type: NamedIndividual
is contemporary version of: http://data.ga-group.nl/ics/gics/35102020
is replaced by: http://data.ga-group.nl/ics/gics/2018/35102020
is version of: http://data.ga-group.nl/ics/gics/35102020
replaces: http://data.ga-group.nl/ics/gics/2014/35102020
is subindustry of: 医疗保健提供商与服务
imported on: 2026-05-27T08:45:00.430Z
last refreshed on: 2026-05-31T09:56:29.350Z
source accessed on: 2017-10-19T03:38:28Z
source last accessed on: 2019-06-07T09:41:30Z
label: Establecimientos Médicos @es
label: Health Care Facilities @en
label: Instalações de Assistência Médica @pt
label: Деятельность учреждений здравоохранения @ru
label: ヘルスケア施設 @ja
label: 保健護理機構
label: 건강관리 시설 @ko
definition: Owners and operators of health care facilities, including hospitals, nursing homes, rehabilitation centers and animal hospitals. @en
definition: Propietarios y operadores de centros médicos. Se incluyen hospitales, hogares de ancianos, centros de rehabilitación y clínicas veterinarias. @es
definition: Proprietários e operadores de instalações de assistência à saúde, incluindo hospitais, casas de repouso, centros de reabilitação e hospitais veterinários. @pt
definition: Компании, владеющие учреждениями здравоохранения, в том числе больницами, частными лечебницами, центрами реабилитации и ветеринарными лечебницами, и занимающиеся их эксплуатацией. @ru
definition: 保健护理设施的业主和运营商，包括医院、疗养院、康复中心、以及宠物医院。
definition: 保健護理設施的業主和運營商，包括醫院、療養院、康復中心、以及動物醫院。
definition: 病院、養��/介護福祉施設、リハビリセンター、動物病院を含むヘルスケア施設の所有者や運営業者。 @ja
definition: 병원, 요양원, 재활 센터, 동물 병원을 포함한 건강관�� 시설의 소유자와 운영자. @ko
notation: 35102020
valid from: 2016-09-01
valid till: 2018-09-29

管理型保健护理
type: GlobalIndustryClassificationStandardsClassifier
type: SubindustryClassifier
type: NamedIndividual
is contemporary version of: http://data.ga-group.nl/ics/gics/35102030
is replaced by: http://data.ga-group.nl/ics/gics/2018/35102030
is version of: http://data.ga-group.nl/ics/gics/35102030
replaces: http://data.ga-group.nl/ics/gics/2014/35102030
is subindustry of: 医疗保健提供商与服务
imported on: 2026-05-27T08:45:00.430Z
last refreshed on: 2026-05-31T09:56:29.350Z
source accessed on: 2017-10-19T03:38:28Z
source last accessed on: 2019-06-07T09:41:30Z
label: Administración de Salud @es
label: Assistência Médica Administrada @pt
label: Managed Health Care @en
label: Учреждения здравоохранения @ru
label: 管理健康医療 @ja
label: 管理型保健護理
label: 헬스케어 관리 @ko
definition: Owners and operators of Health Maintenance Organizations (HMOs) and other managed plans. @en
definition: Propietarios y operadores de empresas de seguros médicos y otros servicios de salud. @es
definition: Proprietários e operadores de Organizações de Manutenção de Saúde (HMO) e outros planos administrados. @pt
definition: Компании, владеющие оздоровительными учреждениями и другими специализированными учреждениями, и занимающиеся их эксплуатацией. @ru
definition: 保険維持機構（HMO)や他の管理医療型プランを提供する業者。 @ja
definition: 健康維護組織（HMOs）的業主和運營商，以及其他管理型計畫。
definition: 健康维护组织（HMOs）的业主和运营商，以及其它管理型计划。
definition: 종합 건강관리 기관(HMO) 및 기타 헬스케어 관리 플랜의 소유자와 운영자. @ko
notation: 35102030
valid from: 2016-09-01
valid till: 2018-09-29

医疗保健提供商与服务
type: GlobalIndustryClassificationStandardsClassifier
type: IndustryClassifier
type: NamedIndividual
is contemporary version of: http://data.ga-group.nl/ics/gics/351020
is replaced by: http://data.ga-group.nl/ics/gics/2018/351020
is version of: http://data.ga-group.nl/ics/gics/351020
replaces: http://data.ga-group.nl/ics/gics/2014/351020
is industry of: 医疗保健设备与服���
imported on: 2026-05-27T08:45:00.430Z
last refreshed on: 2026-05-31T09:56:29.350Z
source accessed on: 2017-10-19T03:34:33Z
source last accessed on: 2019-06-07T09:41:30Z
label: Fornitori e servizi sanitari @it
label: Fournisseurs de Produits de Santé et Services de Santé @fr
label: Gesundheitswesen: Einrichtungen & Dienste @de
label: Health Care Providers & Services @en
label: Proveedores de Servicios Médicos @es
label: Serviços e Provedores de Produtos de Assistência Médica @pt
label: Деятельность организаций и служб здравоохранения @ru
label: ヘルスケア・プロバイダー/ヘルスケア・サービス @ja
label: 醫療保健供應商與服務
label: 건강관리 업체 및 서비스 @ko
notation: 351020
valid from: 2016-09-01
valid till: 2018-09-29

医疗保健技术
type: GlobalIndustryClassificationStandardsClassifier
type: SubindustryClassifier
type: NamedIndividual
is contemporary version of: http://data.ga-group.nl/ics/gics/35103010
is replaced by: http://data.ga-group.nl/ics/gics/2018/35103010
is version of: http://data.ga-group.nl/ics/gics/35103010
replaces: http://data.ga-group.nl/ics/gics/2014/35103010
is subindustry of: 医疗保健技术
imported on: 2026-05-27T08:45:00.430Z
last refreshed on: 2026-05-31T09:56:29.350Z
source accessed on: 2017-10-19T03:38:28Z
source last accessed on: 2019-06-07T09:41:30Z
label: Health Care Technology @en
label: Servicios Tecnológicos para el Área de la Salud @es
label: Tecnologia de Assistência Médica @pt
label: Информационные услуги для здравоохранения @ru
label: ヘルスケア・テクノロジー @ja
label: 醫療保健技術
label: 건강관리 기술 @ko
definition: Companies providing information technology services primarily to health care providers. Includes companies providing application, systems and/or data processing software, internet-based tools, and IT consulting services to doctors, hospitals or businesses operating primarily in the Health Care Sector @en
definition: Empresas provedoras de serviços de tecnologia de informação principalmente a provedores de assistência médica. Inclui empresas provedoras de serviços de aplicação, software de sistemas e/ou de processamento de dados, ferramentas com base na internet e consultoria de TI a médicos, hospitais ou empresas que operam principalmente no Setor de Assistência Médica @pt
definition: Empresas que prestan servicios de tecnología de la información, principalmente a proveedores de atención médica. Se incluyen las empresas proveedoras de software de aplicaciones, sistemas o procesamiento de datos, herramientas disponibles por Internet y servicios de consultoría tecnológica para a médicos, hospitales o empresas que operan fundamentalmente en el área de la salud. @es
definition: Компании, предоставляющие информационные услуги преимущественно учреждениям здравоохранения. В данную группу входят компании, предоставляющие программное обеспечение для установки приложений, систем и (или) обработки данных, Интернет-инструменты и консультации по использованию информационных технологий врачам, больницам или коммерческим компаниям, работающим преимущественно в здравоохранении. @ru
definition: 主にヘルスケア・プロバイダーに情報技術サービスを提供する会社。医師、病院、主にヘルスケアセクターで運営する事業体にアプリケーション、システム、データ処理ソフトウェア、インターネットベース・ツール、ITコンサルティング・サービスを提供する会社を含む。 @ja
definition: 主要为医疗保健供应商提供信息技术服务的公���。包括向医生、医院或以医疗保健为主业的公司提供应用、系统或者数据处理软件、基于互联网的工具、以及IT咨询服务的公司
definition: 主要為醫療保健供應商提供資訊技術服務的公司。包括提供應用、系統和/或者資料處理軟體、基於網際網路的工具、和向醫生、醫院或主要在醫療保健產業的業務運行提供IT諮詢服務的���司
definition: 주로 건강관리 업체에 정보기술 서비스를 제공하는 회사. 의사, 병원, 건강관리 부문에서 주로 활동하는 업체에 응용 프로그램, 시스템 및/또는 데이터 처리 소프트웨어, 인터넷 기반 도구, IT 컨설팅 서비스를 제공하는 회사 포함 @ko
notation: 35103010
valid from: 2016-09-01
valid till: 2018-09-29

医疗保健技术
type: GlobalIndustryClassificationStandardsClassifier
type: IndustryClassifier
type: NamedIndividual
is contemporary version of: http://data.ga-group.nl/ics/gics/351030
is replaced by: http://data.ga-group.nl/ics/gics/2018/351030
is version of: http://data.ga-group.nl/ics/gics/351030
replaces: http://data.ga-group.nl/ics/gics/2014/351030
is industry of: 医疗保健设备与服���
imported on: 2026-05-27T08:45:00.430Z
last refreshed on: 2026-05-31T09:56:29.350Z
source accessed on: 2017-10-19T03:34:33Z
source last accessed on: 2019-06-07T09:41:30Z
label: Gesundheitswesen: Technologie @de
label: Health Care Technology @en
label: Servicios Tecnológicos para el Área de la Salud @es
label: Technologies des Soins de Santé @fr
label: Tecnologia de Assistência à Saúde @pt
label: Tecnologia sanitaria @it
label: Информационные услуги для здравоохранения @ru
label: ヘルスケア・テクノロジー @ja
label: 醫療保健技術
label: 건강관리 기술 @ko
notation: 351030
valid from: 2016-09-01
valid till: 2018-09-29

医疗保健设备与服���
type: GlobalIndustryClassificationStandardsClassifier
type: IndustryGroupClassifier
type: NamedIndividual
is contemporary version of: http://data.ga-group.nl/ics/gics/3510
is replaced by: http://data.ga-group.nl/ics/gics/2018/3510
is version of: http://data.ga-group.nl/ics/gics/3510
replaces: http://data.ga-group.nl/ics/gics/2014/3510
is industry group of: 医疗保健
imported on: 2026-05-27T08:45:00.430Z
last refreshed on: 2026-05-31T09:56:29.350Z
source accessed on: 2017-10-19T03:34:33Z
source last accessed on: 2019-06-07T09:41:30Z
label: Attrezzature e servizi sanitari @it
label: Equipamento e Serviços de Assistência Médica @pt
label: Equipos y Servicios Medicos @es
label: Gesundheitswesen: Ausstattung & Dienste @de
label: Health Care Equipment & Services @en
label: Équipement et Services de Santé @fr
label: Оборудование и услуги здравоохранения @ru
label: ヘルスケア機器・サービス @ja
label: 醫療保健設備與服務
label: 건강관리 장비와 서비스 @ko
notation: 3510
valid from: 2016-09-01
valid till: 2018-09-29

生物技術
type: GlobalIndustryClassificationStandardsClassifier
type: SubindustryClassifier
type: NamedIndividual
is contemporary version of: http://data.ga-group.nl/ics/gics/35201010
is replaced by: http://data.ga-group.nl/ics/gics/2018/35201010
is version of: http://data.ga-group.nl/ics/gics/35201010
replaces: http://data.ga-group.nl/ics/gics/2014/35201010
is subindustry of: 生物技術
imported on: 2026-05-27T08:45:00.430Z
last refreshed on: 2026-05-31T09:56:29.350Z
source accessed on: 2017-10-19T03:38:28Z
source last accessed on: 2019-06-07T09:41:30Z
label: Biotechnology @en
label: Biotecnología @es
label: Biotecnologia @pt
label: Биотехнологии @ru
label: バイオテクノロジー @ja
label: 生物科技
label: 생명공학 @ko
definition: Companies primarily engaged in the research, development, manufacturing and/or marketing of products based on genetic analysis and genetic engineering. Includes companies specializing in protein-based therapeutics to treat human diseases. Excludes companies manufacturing products using biotechnology but without a health care application. @en
definition: Empresas dedicadas principalmente a la investigación, desarrollo y producción y/o comercialización de productos de ingeniería genética o análisis genético. Incluye compañías especializadas en terapia con base en proteínas para el tratamiento de enfermedades humanas. Se excluyen las empresas fabricantes de productos biotecnológicos sin uso en la salud. @es
definition: Empresas envolvidas principalmente na pesquisa, desenvolvimento, fabricação e/ou comercialização de produtos baseados na análise e engenharia genética. Inclui empresas especializadas em terapias à base de proteínas para tratar doenças humanas. Exclui empresas que fabriquem produtos que usam biotecnologia mas sem uma aplicação na assistência médica. @pt
definition: Компании, занимающиеся, в основном, исследованием, разработкой, производством и/или маркетингом продуктов, основанных на генном анализе и генной инженерии, в том числе компании, специализирующиеся на терапевтическом использовании протеина для лечения болезней человека. Данная группа не включает компании, производящие продукцию с использованием биотехнологий, предназначенную не для медицинской помощи. @ru
definition: 主要从事研究、开发、制造和/或者销售基于基因分析和遗传工程产品的公司。包括在基于蛋白质治疗学治疗人类疾病方面进行专门研究的公司，不包含无医疗保健相关机械，只使用生物科技生产产品的企业。
definition: 主要從事研究、開發、製造和/或者銷售基於基因分析和遺傳工程產品的公司。包括在基於蛋白質治療學治療人類疾病方麵進行專門研究的公司，不包含無醫療保健相關機械、隻使用生物科技生產產品的企業。
definition: 遺伝子分析および遺伝子工学に基づいた製品の研究、開発、製造、販売を主に行う会社。人間の病気を治療するプロテインに基づく治療法に特化する会社を含む。遺伝子技��を使い、ヘルスケアとは無関係な製品を製造する会社は除く。 @ja
definition: 유전자 분석과 유전자 엔지니어링을 기반으로 제품 연구, 개발, 제조, 마케팅에 주로 참여하는 기업. 인간의 질병을 치료하는 단백질 기반 치료에 전문성을 갖고 있는 기업 포함. 생명공학을 활용해 제품을 생산하지만 의료에 적용하지 않는 기업은 제외 @ko
notation: 35201010
valid from: 2016-09-01
valid till: 2018-09-29

生物技術
type: GlobalIndustryClassificationStandardsClassifier
type: IndustryClassifier
type: NamedIndividual
is contemporary version of: http://data.ga-group.nl/ics/gics/352010
is replaced by: http://data.ga-group.nl/ics/gics/2018/352010
is version of: http://data.ga-group.nl/ics/gics/352010
replaces: http://data.ga-group.nl/ics/gics/2014/352010
is industry of: 制药、生物科技和生命科学
imported on: 2026-05-27T08:45:00.430Z
last refreshed on: 2026-05-31T09:56:29.350Z
source accessed on: 2017-10-19T03:34:33Z
source last accessed on: 2019-06-07T09:41:30Z
label: Biotechnologie @de
label: Biotechnology @en
label: Biotecnología @es
label: Biotecnologia @it
label: Применение биотехнологий @ru
label: バイオテクノロジー @ja
label: 生物科技
label: 생명공학 @ko
notation: 352010
valid from: 2016-09-01
valid till: 2018-09-29

制药
type: GlobalIndustryClassificationStandardsClassifier
type: SubindustryClassifier
type: NamedIndividual
is contemporary version of: http://data.ga-group.nl/ics/gics/35202010
is replaced by: http://data.ga-group.nl/ics/gics/2018/35202010
is version of: http://data.ga-group.nl/ics/gics/35202010
replaces: http://data.ga-group.nl/ics/gics/2014/35202010
is subindustry of: 制药
imported on: 2026-05-27T08:45:00.430Z
last refreshed on: 2026-05-31T09:56:29.350Z
source accessed on: 2017-10-19T03:38:28Z
source last accessed on: 2019-06-07T09:41:30Z
label: Pharmaceuticals @en
label: Productos Farmacéuticos @es
label: Produtos Farmacêuticos @pt
label: Производство фармацевтической продукции @ru
label: 医薬品 @ja
label: 製薬
label: 제약 @ko
definition: Companies engaged in the research, development or production of pharmaceuticals. Includes veterinary drugs. @en
definition: Empresas dedicadas a la investigación, desarrollo o producción de productos farmacéuticos. Se incluyen los fármacos veterinarios. @es
definition: Empresas envolvidas na pesquisa, desenvolvimento ou produção de produtos farmacêuticos. Inclui medicamentos veterinários. @pt
definition: Компании, занимающиеся исследованием, разработкой или производством фармацевтической продукции, в том числе лекарственных препаратов для животных. @ru
definition: 从事药品的研究、开发与生产的公司。包括兽药。
definition: 医薬品の研究・開発・製造を行う会社。獣医用医薬品を含む。 @ja
definition: 從事藥品的研究、開發與生產的公司。包括獸藥。
definition: 약품의 연구, 개발 또는 생산과 관련된 회사. 동물용 약 포함. @ko
notation: 35202010
valid from: 2016-09-01
valid till: 2018-09-29

制药
type: GlobalIndustryClassificationStandardsClassifier
type: IndustryClassifier
type: NamedIndividual
is contemporary version of: http://data.ga-group.nl/ics/gics/352020
is replaced by: http://data.ga-group.nl/ics/gics/2018/352020
is version of: http://data.ga-group.nl/ics/gics/352020
replaces: http://data.ga-group.nl/ics/gics/2014/352020
is industry of: 制药、生物科技和生命科学
imported on: 2026-05-27T08:45:00.430Z
last refreshed on: 2026-05-31T09:56:29.350Z
source accessed on: 2017-10-19T03:34:33Z
source last accessed on: 2019-06-07T09:41:30Z
label: Pharmaceuticals @en
label: Pharmazeutika @de
label: Prodotti farmaceutici @it
label: Productos Farmacéuticos @es
label: Produits Pharmaceutiques @fr
label: Produtos Farmacêuticos @pt
label: Производство фармацевтической продукции @ru
label: 医薬品 @ja
label: 製薬
label: 제약 @ko
notation: 352020
valid from: 2016-09-01
valid till: 2018-09-29

生命科学工具和服务
type: GlobalIndustryClassificationStandardsClassifier
type: SubindustryClassifier
type: NamedIndividual
is contemporary version of: http://data.ga-group.nl/ics/gics/35203010
is replaced by: http://data.ga-group.nl/ics/gics/2018/35203010
is version of: http://data.ga-group.nl/ics/gics/35203010
replaces: http://data.ga-group.nl/ics/gics/2014/35203010
is subindustry of: 生命科学工具和服务
imported on: 2026-05-27T08:45:00.430Z
last refreshed on: 2026-05-31T09:56:29.350Z
source accessed on: 2017-10-19T03:38:28Z
source last accessed on: 2019-06-07T09:41:30Z
label: Ferramentas e Serviços de Ciências Biológicas @pt
label: Herramientas y Servicios para las Ciencias de la Salud @es
label: Life Sciences Tools & Services @en
label: Исследования и разработка фармацевтической продукции @ru
label: ライフサイエンス・ツール/サービス @ja
label: 生命科學工具與服務
label: 생명과학 도구 및 서비스 @ko
definition: Companies enabling the drug discovery, development and production continuum by providing analytical tools, instruments, consumables & supplies, clinical trial services and contract research services. Includes firms primarily servicing the pharmaceutical and biotechnology industries. @en
definition: Empresas que facilitan el continuo descubrimiento, desarrollo y producción de fármacos, mediante el suministro de herramientas de análisis, instrumentos, productos consumibles y suministros, servicios de ensayos clínicos y servicios contractuales de investigación. Se incluyen las empresas que atienden principalmente a las industrias farmacéutica y de biotecnología. @es
definition: Empresas que permitem a descoberta, o desenvolvimento e continuidade de produção de medicamentos, fornecendo ferramentas analíticas, instrumentos, materiais de consumo e suprimentos, serviços de testes clínicos e serviços de pesquisa de contrato. Inclui empresas atendendo principalmente às indústrias farmacêuticas e de biotecnologia. @pt
definition: Компании, обеспечивающие открытие, разработку и производство лек��рственных препаратов посредством предоставления аналитических инструментов и расходных материалов, а также услуг по проведению клинических испытаний и исследований на договорной основе. В данную группу входят компании, занимающиеся преимущественно обслуживанием фармацевтической промышленности и промышленности биотехнологий. @ru
definition: 分析装置、設備、消耗品およびその他物品、臨床実験サービス、請負調査サービスを提供することによって、新薬の発見から開発、製造までの一連の工程に貢献する会社。製薬業界およびバイオテクノロジー業界に主にサービスを提供する会社を含む。 @ja
definition: 通过提供分析工具、仪器、医疗消耗品及用品、临床试验服务和承包研究服务而促进药物发明、开发和生产的公司。包括主要为制药和生物技术行业服务的公司。
definition: 通過提供分析工具、儀器、醫療消耗品及用品、臨床試驗服務和承包研究服務而促進藥物發明、開發和生產的公司。包括主要為製藥和生物技術行業服務的公司。
definition: 분석 도구, 기기, 소모품 및 용품, 임상시험 서비스, 계약 연구 서비스를 제공하여 약물의 발견, 개발, 생산이 연속적으로 이루어질 수 있게 하는 회사. 제약 및 생물공학 서비스를 주로 제공하는 회사 포함. @ko
notation: 35203010
valid from: 2016-09-01
valid till: 2018-09-29

生命科学工具和服务
type: GlobalIndustryClassificationStandardsClassifier
type: IndustryClassifier
type: NamedIndividual
is contemporary version of: http://data.ga-group.nl/ics/gics/352030
is replaced by: http://data.ga-group.nl/ics/gics/2018/352030
is version of: http://data.ga-group.nl/ics/gics/352030
replaces: http://data.ga-group.nl/ics/gics/2014/352030
is industry of: 制药、生物科技和生命科学
imported on: 2026-05-27T08:45:00.430Z
last refreshed on: 2026-05-31T09:56:29.350Z
source accessed on: 2017-10-19T03:34:33Z
source last accessed on: 2019-06-07T09:41:30Z
label: Biowissenschaften Hilfsmittel & Dienstleistungen @de
label: Ferramentas e Serviços de Ci��ncias Biológicas @pt
label: Herramientas y Servicios para las Ciencias de la Salud @es
label: Life Sciences Tools & Services @en
label: Outils et Services Appliqués aux Sciences Biologiques @fr
label: Servizi e strumenti per scienze biologiche @it
label: Исследования и разработка фармацевтической продукции @ru
label: ライフサイエンス・ツール/サービス @ja
label: 生命科學工具與服務
label: 생명과학 도구 및 서비스 @ko
notation: 352030
valid from: 2016-09-01
valid till: 2018-09-29

制药、生物科技和生命科学
type: GlobalIndustryClassificationStandardsClassifier
type: IndustryGroupClassifier
type: NamedIndividual
is contemporary version of: http://data.ga-group.nl/ics/gics/3520
is replaced by: http://data.ga-group.nl/ics/gics/2018/3520
is version of: http://data.ga-group.nl/ics/gics/3520
replaces: http://data.ga-group.nl/ics/gics/2014/3520
is industry group of: 医疗保健
imported on: 2026-05-27T08:45:00.430Z
last refreshed on: 2026-05-31T09:56:29.350Z
source accessed on: 2017-10-19T03:34:33Z
source last accessed on: 2019-06-07T09:41:30Z
label: Farmaceutica, Biotecnologie e Scienze biogiche @it
label: Pharmaceuticals, Biotechnology & Life Sciences @en
label: Pharmazeutika, Biotechnologie & Biowissenschaften @de
label: Productos Farmacéuticos, Biotecnología y Ciencias de la Salud @es
label: Produtos Farmacêuticos, Biotecnologia e Ciências Biológicas @pt
label: Sciences Pharmaceutiques, Biotechnologiques et Biologiques @fr
label: Производство фармацевтической продукции, биотехнологии, биологические науки @ru
label: 医薬品・バイオテクノロジー・ライフサイエンス @ja
label: 製薬、生物技術與生命科學
label: 제약, 생명공학, 생명과학 @ko
notation: 3520
valid from: 2016-09-01
valid till: 2018-09-29

医疗保健
type: GlobalIndustryClassificationStandardsClassifier
type: SectorClassifier
type: NamedIndividual
is contemporary version of: http://data.ga-group.nl/ics/gics/35
is replaced by: http://data.ga-group.nl/ics/gics/2018/35
is version of: http://data.ga-group.nl/ics/gics/35
replaces: http://data.ga-group.nl/ics/gics/2014/35
imported on: 2026-05-27T08:45:00.430Z
last refreshed on: 2026-05-31T09:56:29.350Z
source accessed on: 2017-10-19T03:34:33Z
source last accessed on: 2019-06-07T09:41:30Z
label: Assistência Médica @pt
label: Gesundheitswesen @de
label: Health Care @en
label: Salud @es
label: Salute @it
label: Santé @fr
label: Здравоохранение @ru
label: ヘルスケア @ja
label: 醫療保健
label: 건강관리 @ko
notation: 35
valid from: 2016-09-01
valid till: 2018-09-29

綜合性銀行
type: GlobalIndustryClassificationStandardsClassifier
type: SubindustryClassifier
type: NamedIndividual
is contemporary version of: http://data.ga-group.nl/ics/gics/40101010
is replaced by: http://data.ga-group.nl/ics/gics/2018/40101010
is version of: http://data.ga-group.nl/ics/gics/40101010
replaces: http://data.ga-group.nl/ics/gics/2014/40101010
is subindustry of: 商业银行
imported on: 2026-05-27T08:45:00.430Z
last refreshed on: 2026-05-31T09:56:29.350Z
source accessed on: 2017-10-19T03:38:28Z
source last accessed on: 2019-06-07T09:41:30Z
label: Bancos Diversificados @es
label: Diversified Banks @en
label: Диверсифицированные банки @ru
label: 综合性银行
label: 都市銀行 @ja
label: 다양한 은행 @ko
definition: Bancos de gran tamaño, con presencia nacional y servicios diversos, cuyos ingresos provienen principalmente de operaciones bancarias tradicionales y que tienen actividades de negocios significativas en banca de servicios y préstamos a empresas medianas y pequeñas, además de proveer una gama amplia de servicios financieros. Se excluyen los bancos clasificados en la rama de Bancos Regionales y la de Ahorro y Financiamento de Hipotecas. Se excluyen también los bancos clasificados en la rama industrial de Inversión y Correduría. @es
definition: Bancos grandes e geograficamente diversos com presença nacional, cujas receitas são derivadas principalmente de operações bancárias convencionais, têm atividades comerciais significativas em bancos de varejo e empréstimos a pequenas e médias empresas, e fornecem uma gama diversa de serviços financeiros. Exclui empresas classificadas nas Sub-Indústrias de Bancos Regionais ou de Poupança e Financiamento de Hipotecas. Também exclui bancos de investimentos classificados na Sub-Indústria de Bancos de Investimento e Corretagem. @pt
definition: Large, geographically diverse banks with a national footprint whose revenues are derived primarily from conventional banking operations, have significant business activity in retail banking and small and medium corporate lending, and provide a diverse range of financial services. Excludes banks classified in the Regional Banks and Thrifts & Mortgage Finance Sub-Industries. Also excludes investment banks classified in the Investment Banking & Brokerage Sub-Industry. @en
definition: Большие, банки с национальными представительствами и представительствами в разнообразных географических точках, извлекающие основную прибыль из стандартных банковских операций, ведущие значительную деятельность в сфере розничных банковских услуг, а также занимающиеся кредитованием малых и средних предприятий и предоставляющие широкий ряд финансовых услуг. В данную группу не входят банки, включенные в подотрасли «Региональные банки» и «Сберегательные и ипотечные финансовые организации», а также инвестиционные банки, включенные в подотрасль «Инвестиционные банки и брокерские организации». @ru
definition: 主要业务为商业信贷并有大量零售银行业务���中小企业信贷业务并提供各种综合性金融业务的全国性大规模商业银行。不包括那些归类于“区域性银行”和“互助储蓄银行与抵押贷款”子行业中的银行，也不包括那些归类于“投资银行业与经纪业”子行业中的投资银行。
definition: 主要业務為商業信貸並有大量零售銀行業務和中小企業信貸业務並提供各種綜合性金融业務的全國性大規糢商業銀行。不包括那些歸類於“區域性銀行”���“互助儲蓄銀行與牴押貸款”子行業中的銀行、也不包括那些歸類於“投資銀行業與經紀业”子行業中的投資銀行。
definition: 商業貸し付けを主に行い、リテールバンキングや中小企業への貸し付け及び各種金融サービスを提供する全国範囲に大規模の総合商業銀行。産業サブグループの「地方銀行」、「貯蓄・抵当・不動産金融」に分類される銀行、お��び「投資銀行・証券会社」に分類される投資銀行は除く。 @ja
definition: 지리적으로 다양하고 전통적인 은행 업무를 통해 주로 수익을 얻는 국내 활동 대형 은행으로서 소매 금융과 중소기업 대출에서 상당한 업무 활동을 하고 다양한 금융 서비스를 제공. ‘지역 은행’과 ‘저축 & 모기지 금융’으로 분류된 은행은 제외. 또한 ‘투자 은행 & 중개업’으로 분류된 투자 은행은 제외 @ko
notation: 40101010
valid from: 2016-09-01
valid till: 2018-09-29

区域性银行
type: GlobalIndustryClassificationStandardsClassifier
type: SubindustryClassifier
type: NamedIndividual
is contemporary version of: http://data.ga-group.nl/ics/gics/40101015
is replaced by: http://data.ga-group.nl/ics/gics/2018/40101015
is version of: http://data.ga-group.nl/ics/gics/40101015
replaces: http://data.ga-group.nl/ics/gics/2014/40101015
is subindustry of: 商业银行
imported on: 2026-05-27T08:45:00.430Z
last refreshed on: 2026-05-31T09:56:29.350Z
source accessed on: 2017-10-19T03:38:28Z
source last accessed on: 2019-06-07T09:41:30Z
label: Bancos Regionais @pt
label: Bancos Regionales @es
label: Regional Banks @en
label: Региональные банки @ru
label: 區域性銀行
label: 地方銀行 @ja
label: 지방 은행 @ko
definition: Bancos comerciais cujos negócios são derivados principalmente de operações bancárias convencionais e têm atividades comerciais significativas em bancos varejistas e empréstimos corporativos a pequenas e médias empresas. Os bancos regionais tendem a operar em regiões geográficas limitadas. Exclui empresas classificadas nas Sub-Indústrias de Bancos Diversificados ou de Poupança e Financiamento de Hipotecas. Também exclui bancos de investimentos classificados na Sub-Indústria de Bancos de Investimentos e Corretagem. @pt
definition: Bancos comerciales cuyo negocio proviene principalmente de operaciones bancarias tradicionales y tienen actividades de negocios significativas en banca de servicios y prestamos a pequeñas y medianas empresas. Los bancos regionales operan usualmente en una región geografica determinada. Se excluyen las empresas clasificadas en la ramas de Bancos Diversificados y de Ahorro y Financiamiento de Hipotecas. Se excluyen también los bancos de inversión, clasificados en la rama de Bancos de Inversión y Correduría. @es
definition: Commercial banks whose businesses are derived primarily from conventional banking operations and have significant business activity in retail banking and small and medium corporate lending. Regional banks tend to operate in limited geographic regions. Excludes companies classified in the Diversified Banks and Thrifts & Mortgage Banks sub-industries. Also excludes investment banks classified in the Investment Banking & Brokerage Sub-Industry. @en
definition: Коммерческие банки, чья деятельность, в основном, связана со стандартными банков��кими операциями и масштабными операциями с частными вкладчиками, а также кредитованием малых и средних предприятий. Региональные банки действуют, как правило, на ограниченной территории. В данную группу не входят компании, включенные в подотрасли «Деятельность диверсифицированных банков» и «Деятельность сберегательных и ипотечных финансовых организаций», а также инвестиционные банки, включенные в подотрасль «Инвестиционные банки и брокерские организации». @ru
definition: 提供通常意义上的银行业务的商业银行。区域银行倾向于在有限的地理区域内经营业务。不包括那些归类于“综合性银行”、“互助储蓄银行与抵押贷款”子行业中的公司，也不包括那些归类于“投资银行业与经纪业”子行业中的投资银行。
definition: 提供通常意義上的銀行業務的商業銀行。區域銀行傾嚮於在有限的地理區域內經營业務。不包括那些歸類於“綜合性銀行”、“互助儲蓄銀行與牴押貸款”子行業中的公司，也不包括那些歸類於“投資銀行業與經紀业”子行業中的投資銀行。
definition: 通常の銀行業務を提供する商業銀行。地方銀行の営業活動は地理的に限定される場合が多い。産業サブグループの「都市銀行」、「貯蓄・抵当・不動産金融」に分類される会社、および「投資銀行・証券会社」に分類される投資銀行は除く。 @ja
definition: 주로 전통적인 은행 업무를 수행하고 소매 금융과 중소기업 대출에서 상당한 업무 활동을 하는 상업 은행. 지리적으로 제한적인 지역에서 활동하는 경향이 있음. ‘다양한 은행’과 ‘저축 & 모기지 금융’으로 분류된 기업은 제외. 또한 ‘투자 은행 & 중개업’에 분류된 투자 은행은 제외 @ko
notation: 40101015
valid from: 2016-09-01
valid till: 2018-09-29

商业银行
type: GlobalIndustryClassificationStandardsClassifier
type: IndustryClassifier
type: NamedIndividual
is contemporary version of: http://data.ga-group.nl/ics/gics/401010
is replaced by: http://data.ga-group.nl/ics/gics/2018/401010
is version of: http://data.ga-group.nl/ics/gics/401010
replaces: http://data.ga-group.nl/ics/gics/2014/401010
is industry of: 银行
imported on: 2026-05-27T08:45:00.430Z
last refreshed on: 2026-05-31T09:56:29.350Z
source accessed on: 2017-10-19T03:34:33Z
source last accessed on: 2019-06-07T09:41:30Z
label: Banche commerciali @it
label: Bancos Comerciales @es
label: Bancos @pt
label: Banken @de
label: Banks @en
label: Banques @fr
label: Банковская деятельность @ru
label: 商業銀行
label: 銀行 @ja
label: 은행 @ko
notation: 401010
valid from: 2016-09-01
valid till: 2018-09-29

互助储蓄与抵押信贷金融服务
type: GlobalIndustryClassificationStandardsClassifier
type: SubindustryClassifier
type: NamedIndividual
is contemporary version of: http://data.ga-group.nl/ics/gics/40102010
is replaced by: http://data.ga-group.nl/ics/gics/2018/40102010
is version of: http://data.ga-group.nl/ics/gics/40102010
replaces: http://data.ga-group.nl/ics/gics/2014/40102010
is subindustry of: 互助储蓄银行与抵押信贷
imported on: 2026-05-27T08:45:00.430Z
last refreshed on: 2026-05-31T09:56:29.350Z
source accessed on: 2017-10-19T03:38:28Z
source last accessed on: 2019-06-07T09:41:30Z
label: Ahorro y Financiamiento de Hipotecas @es
label: Poupança e Financiamento de Hipotecas @pt
label: Thrifts & Mortgage Finance @en
label: Сберегательные и ипотечные финансовые организации @ru
label: 互助儲蓄與牴押信貸金融服務
label: 貯蓄・抵当・不動産金融 @ja
label: 저축 & 모기지 금융 @ko
definition: Financial institutions providing mortgage and mortgage related services. These include financial institutions whose assets are primarily mortgage related, savings & loans, mortgage lending institutions, building societies and companies providing insurance to mortgage banks. @en
definition: Instituciones financieras que proporcionan hipotecas y servicios relacionados. Se incluyen las instituciones financieras cuyos activos están relacionados principalmente con hipotecas, ahorros y préstamos, instituciones de préstamos hipotecarios, cooperativas de crédito y empresas de seguros para bancos hipotecarios. @es
definition: Instituições financeiras que proveem serviços de hipoteca e relacionados à hipoteca. Estes incluem instituições financeiras cujos ativos são principalmente relacionados a hipotecas, poupança e empréstimos, instituições de crédito hipotecário, sociedades construtoras e empresas provedoras de seguro a bancos de crédito hipotecário. @pt
definition: Финансовые организации, предоставляющие услуги по ипотеке и сопутствующие услуги. В данную группу входят финансовые организации, активы которых связаны преимущественно с ипотекой, сбережениями и займами, организации (учреждения) ипотечного кредитования, строительные общества и компании, предоставляющие услуги страхования ипотечным банкам. @ru
definition: 抵当・不動産および関連サービスを提供する金融機関。資産が主に抵当・不動産関連である金融機関、貯蓄・貸付組合、住宅ローン貸付機関、住宅組合、および住宅ローン貸付銀行に保険を提供する会社を含む。 @ja
definition: 提供抵押貸款以及抵押貸款相關服務的金融機構。包括那些其資產主要與抵押貸款相關的金融機構、儲蓄與貸款、抵押貸款機構、建房互助協會以及向抵押銀行提供保險的公司。
definition: 提供抵押贷款以及抵押贷款相关服务的金融机构。包括那些其资产主要与抵押贷款相关的金融机构、储蓄与贷款、抵押贷款机构、建房互助协会以及向抵押银行提供保险的公司。
definition: 모기지, 모기지 관련 서비스를 제공하는 금융기관. 자산이 주로 모기지, 저축, 대출과 관련이 있는 금융 기관, 모기지 대출 기관, 주택금융조합, 모기지 은행에 대한 보험 제공 회사 포함 @ko
notation: 40102010
valid from: 2016-09-01
valid till: 2018-09-29

互助储蓄银行与抵押信贷
type: GlobalIndustryClassificationStandardsClassifier
type: IndustryClassifier
type: NamedIndividual
is contemporary version of: http://data.ga-group.nl/ics/gics/401020
is replaced by: http://data.ga-group.nl/ics/gics/2018/401020
is version of: http://data.ga-group.nl/ics/gics/401020
replaces: http://data.ga-group.nl/ics/gics/2014/401020
is industry of: 银行
imported on: 2026-05-27T08:45:00.430Z
last refreshed on: 2026-05-31T09:56:29.350Z
source accessed on: 2017-10-19T03:34:33Z
source last accessed on: 2019-06-07T09:41:30Z
label: Ahorro y Financiamiento de Hipotecas @es
label: Poupança e Financiamento de Hipotecas @pt
label: Società finanziarie @it
label: Sparkassen- und Hypothekenfinanzierung @de
label: Thrifts & Mortgage Finance @en
label: Épargne et Prêts Hypothécaires @fr
label: Деятельность сберегательных и ипотечных финансовых организаций @ru
label: 互助儲蓄銀行與抵押信貸
label: 貯蓄・抵当・不動産金融 @ja
label: 저축 & 모기지 금융 @ko
notation: 401020
valid from: 2016-09-01
valid till: 2018-09-29

银行
type: GlobalIndustryClassificationStandardsClassifier
type: IndustryGroupClassifier
type: NamedIndividual
is contemporary version of: http://data.ga-group.nl/ics/gics/4010
is replaced by: http://data.ga-group.nl/ics/gics/2018/4010
is version of: http://data.ga-group.nl/ics/gics/4010
replaces: http://data.ga-group.nl/ics/gics/2014/4010
is industry group of: Finance
imported on: 2026-05-27T08:45:00.430Z
last refreshed on: 2026-05-31T09:56:29.350Z
source accessed on: 2017-10-19T03:34:33Z
source last accessed on: 2019-06-07T09:41:30Z
label: Banche @it
label: Bancos @pt
label: Banken @de
label: Banks @en
label: Banques @fr
label: Entidades Bancarias @es
label: Банковская деятельность @ru
label: 銀行
label: 은행 @ko
notation: 4010
valid from: 2016-09-01
valid till: 2018-09-29

其他綜合性金融服務
type: GlobalIndustryClassificationStandardsClassifier
type: SubindustryClassifier
type: NamedIndividual
is contemporary version of: http://data.ga-group.nl/ics/gics/40201020
is replaced by: http://data.ga-group.nl/ics/gics/2018/40201020
is version of: http://data.ga-group.nl/ics/gics/40201020
replaces: http://data.ga-group.nl/ics/gics/2014/40201020
is subindustry of: 綜合金融服務
imported on: 2026-05-27T08:45:00.430Z
last refreshed on: 2026-05-31T09:56:29.350Z
source accessed on: 2017-10-19T03:38:28Z
source last accessed on: 2019-06-07T09:41:30Z
label: Other Diversified Financial Services @en
label: Otros Servicios Financieros Diversificados @es
label: Outros Serviços Financeiros Diversificados @pt
label: Другие диверсифицированные финансовые услуги @ru
label: 他の各種金融サービス @ja
label: 其它综合性金融服务
label: 기타 다양한 금융 서비스 @ko
definition: Provedores de diversos servicios financieros y/o con interés en una variedad de servicios financieros, incluyendo servicios bancarios, seguros y mercados de capitales, mas sin ninguno de estos como negocio predominante. Se excluyen las empresas clasificadas en las ramas de Bancos Regionales y Bancos Diversificados. @es
definition: Provedores de uma gama diversa de serviços financeiros e/ou com algum interesse em uma ampla gama de serviços financeiros, incluindo bancos, seguro e mercados de capital, mas sem nenhuma linha de negócios dominante. Exclui empresas classificadas nas Sub-Indústrias de Bancos Regionais e Bancos Diversificados. @pt
definition: Providers of a diverse range of financial services and/or with some interest in a wide range of financial services including banking, insurance and capital markets, but with no dominant business line. Excludes companies classified in the Regional Banks and Diversified Banks Sub-Industries. @en
definition: Компании, предоставляющие разнообразные финансовые услуги и/или имеющие определенный интерес в предоставлении широкого спектра финансовых услуг, в том числе банковских, страховых, услуг на рынках капитала, однако не имеющие доминирующего направления деятельности. В данную группу не входят компании, включенные в подотрасли «Деятельность региональных банков» и «Деятельность диверсифицированных банков». @ru
definition: 。這些領域包括銀行服務、保險和資本市場。不包含歸類於“��合性銀行”及“區域性銀行”子行業的企業。
definition: 各種金融サービスの提供業者で、銀行業務、保険・資本市場を含む幅広い金融サービスを展開しているが、主要な事業分野がない業者。産業サブグループの「都市銀行」と｢地方銀行」に分類される会社は除く。 @ja
definition: 提供各色金融服务和/或那些在众多金融服务领域获取收益但没有主要业务种类的公司，这些领域包括银行服务、保险和资本市场。不包含归类于“综合性银行”及“区域性银行”子行业的企业。
definition: 다양한 금융 서비스를 제공하고/제공하거나 은행, 보험, 캐피탈 시장 등 포괄적인 금융 서비스에 관심을 갖고 있지만 지배적인 사업 부문이 없는 기업. ‘지방 은행’과 ‘다양한 은행’에 분류된 기업 제외 @ko
notation: 40201020
valid from: 2016-09-01
valid till: 2018-09-29

多領域控股
type: GlobalIndustryClassificationStandardsClassifier
type: SubindustryClassifier
type: NamedIndividual
is contemporary version of: http://data.ga-group.nl/ics/gics/40201030
is replaced by: http://data.ga-group.nl/ics/gics/2018/40201030
is version of: http://data.ga-group.nl/ics/gics/40201030
replaces: http://data.ga-group.nl/ics/gics/2014/40201030
is subindustry of: 綜合金融服務
imported on: 2026-05-27T08:45:00.430Z
last refreshed on: 2026-05-31T09:56:29.350Z
source accessed on: 2017-10-19T03:38:28Z
source last accessed on: 2019-06-07T09:41:30Z
label: Holdings de Múltiplos Setores @pt
label: Multi-Sector Holdings @en
label: Sociedades de Cartera Multisector @es
label: Капиталовложения в компании различных отраслей @ru
label: マルチセクター持株会社 @ja
label: 多领域控股
label: 다부문 지주회사 @ko
definition: 3つ以上のセクターにまたがって著しく多角化した事業を展開しており、売上高または利益のどちらかが全体の半分以上を占める事業部門がないもの。経営決定権のない株主が大部分を占めている。大株主が経営決定権を握る多角化した金融機関を含む。産業サブグループの「コングロマリット」に分類される他の多角化企業は除く。 @ja
definition: A company with significantly diversified holdings across three or more sectors, none of which contributes a majority of profit and/or sales. Stakes held are predominantly of a non-controlling nature. Includes diversified financial companies where stakes held are of a controlling nature. Excludes other diversified companies classified in the Industrials Conglomerates Sub-Industry. @en
definition: Empresas con participaciones accionarias altamente diversificadas en tres o más sectores, de los cuales ninguno corresponde individualmente a la mayor parte de los beneficios y/o ventas. Las participaciones que tienen son predominantemente de carácter no estratégico. Se incluyen empresas financieras diversificadas en las que las participaciones son de carácter estratégico. Se excluyen otras empresas diversificadas, clasificadas en la rama Conglomerados Industriales. @es
definition: Uma empresa com holdings significativamente diversificados ao longo de três ou mais setores, nenhum dos quais contribui com uma maioria de lucros e/ou de vendas. As participações detidas são predominantemente de uma natureza não controladora. Inclui empresas financeiras diversificadas cujas participações detidas são de uma natureza controladora. Exclui outras empresas diversificadas classificados na Sub-Indústria de Conglomerados Industriais. @pt
definition: Компания с высоким уровнем диверсификации капиталовложений в три или несколько секторов, ни один из которых не обеспечивает основного объема ее прибыли и (или) продаж. Пакеты акций в основном не являются контрольными. В данную группу входят диверсифицированные финансовые компании, в которых принадлежит контрольный пакет акций, и не входят другие диверсифицированные компании, включенные в подотрасль «Деятельность промышленных конгломератов». @ru
definition: 在三个或更多行业板块同时持有股份的公司，其在任何一个领域的利润和/或销售额都不超过总额的一半。所持有的股权主要是非控股性质。包括所持有股份为控股性质的综合金融公司。不包括那些归类于“工业联合企业”子行业中的各类公司。
definition: 在三個或更多領域同時持有股份的公司，其在任何一個領域的利潤和/或銷售額都不超過總額的一半。所持有的股權主要是非控股性質。包括所持有股份為控股性質的綜合金融公司。不包括那些歸類於“工業聯合企業”子行業中的各類公司。
definition: 세 가지 또는 그 이상의 부문에 걸쳐 상당히 다양한 소유회사들이 있으며, 어떤 소유회사도 수익 및/또는 매출의 대부분을 차지하지 않는 회사. 소유한 주식은 주로 지배 성향을 지니지 않음. 소유한 주식이 지배 성향을 지니는 다각화된 금융 회사 포함. ‘복합 기업’으로 분류되는 기타 다양한 회사는 제외. @ko
notation: 40201030
valid from: 2016-09-01
valid till: 2018-09-29

特殊金融服务
type: GlobalIndustryClassificationStandardsClassifier
type: SubindustryClassifier
type: NamedIndividual
is contemporary version of: http://data.ga-group.nl/ics/gics/40201040
is replaced by: http://data.ga-group.nl/ics/gics/2018/40201040
is version of: http://data.ga-group.nl/ics/gics/40201040
replaces: http://data.ga-group.nl/ics/gics/2014/40201040
is subindustry of: 綜合金融服務
imported on: 2026-05-27T08:45:00.430Z
last refreshed on: 2026-05-31T09:56:29.350Z
source accessed on: 2017-10-19T03:38:28Z
source last accessed on: 2019-06-07T09:41:30Z
label: Serviços Financeiros Especializados @pt
label: Servicios Financieros Especializados @es
label: Specialized Finance @en
label: Специализированные финансовые услуги @ru
label: 専門金融 @ja
label: 特殊金融服務業
label: 특수 금융 @ko
definition: Empresas que proporcionan servicios financieros especializados, no incluidas en ninguna otra categoría y que obtienen la mayoría de sus ingresos de una línea de negocios especializada. Se incluyen, entre otras, empresas de financiamiento privado, bancos centrales, servicios de factoraje y arrendamiento y empresas especializadas. Se excluyen las empresas clasificadas en la rama de Información y Mercados Financieros. @es
definition: Provedores de serviços financeiros especializados sem classificação em outro lugar. As empresas nesta sub-indústria derivam a maior parte da receita de uma linha especializada de negócios. Inclui, mas não está limitado a empresas de financiamento comercial, bancos centrais, instituções de arrendamento mercantil, serviços de factoring e botiques especializadas. Exclui empresas classificadas na sub-indústria de Bolsa de Valores e Mercados Financeiros. @pt
definition: Providers of specialized financial services not classified elsewhere. Companies in this sub-industry derive a majority of revenue from one specialized line of business. Includes, but not limited to, commercial financing companies, central banks, leasing institutions, factoring services, and specialty boutiques. Excludes companies classified in the Financial Exchanges & Data sub-industry. @en
definition: Поставщики специализированных финансовых услуг, не вошедших в другие категории. Компании, относящиеся к данной подотрасли, получают основной доход от одного узкоспециализированного вида деятельности. \nДанная категория, в частности, включает коммерческие кредитные компании, центральные банки, лизинговые учреждения, факторинговые компании и специализированные бутики. К данной категории не относятся компании, включенные в подотрасль Финансовые биржи и Финансовые данные. @ru
definition: 他處未分類之特殊金融服務供應商。歸類於此一子行業別的公司，其主要收益來源為一特殊業務行業。 \n包括，但不限於商業融資公司、中央銀行、租賃公司、保理服務公司以及專業零售等。其中不包括被歸類於「金融交易與資料」這項子行業別的公司。
definition: 并无归入其他类别的特殊金融服务提供商。本子行业公司的大部分收益来源于某一特殊业务种类。\n包括但不限于商业融资公司、中央银行、租赁机构、保理业务服务和特色服务商。不包括归类于金融交易所和数据子行业的公司。
definition: 特定の分野での金融サービス提供業者で、他の分類に属さない会社。売上の大部分が専門分野における取引により占められている。商業金融、中央銀行、リース会社、ファクタリング会社、ブティック型運���会社を含むがそれ限りではない。取引所およびデータ提供会社は除く。 @ja
definition: 다른 부문으로 분류되지 않은 전문금융 제공회사. 이 분류에 속한 회사들은 전문화된 하나의 사업 부문에서 대부분의 수익을 창출함. 상업용 자금제공업체, 중앙은행, 리스기관, 팩토링 서비스, 전문 부티크(boutique)를 포함하나 제한되지 않음. 금융 거래소 및 데이터 하위 산업으로 분류된 회사는 제외 @ko
notation: 40201040
valid from: 2016-09-01
valid till: 2018-09-29

綜合金融服務
type: GlobalIndustryClassificationStandardsClassifier
type: IndustryClassifier
type: NamedIndividual
is contemporary version of: http://data.ga-group.nl/ics/gics/402010
is replaced by: http://data.ga-group.nl/ics/gics/2018/402010
is version of: http://data.ga-group.nl/ics/gics/402010
replaces: http://data.ga-group.nl/ics/gics/2014/402010
is industry of: 綜合金融
imported on: 2026-05-27T08:45:00.430Z
last refreshed on: 2026-05-31T09:56:29.350Z
source accessed on: 2017-10-19T03:34:33Z
source last accessed on: 2019-06-07T09:41:30Z
label: Diversified Financial Services @en
label: Diversifizierte Finanzdienste @de
label: Serviços Financeiros Diversificados @pt
label: Services Financiers Diversifiés @fr
label: Servicios Financieros Diversificados @es
label: Servizi finanziari diversificati @it
label: Предоставление диверсифицированных финансовых услуг @ru
label: 各種金融サービス @ja
label: 综合金融服务
label: 다양한 금융 서비스 @ko
notation: 402010
valid from: 2016-09-01
valid till: 2018-09-29

消費信貸
type: GlobalIndustryClassificationStandardsClassifier
type: SubindustryClassifier
type: NamedIndividual
is contemporary version of: http://data.ga-group.nl/ics/gics/40202010
is replaced by: http://data.ga-group.nl/ics/gics/2018/40202010
is version of: http://data.ga-group.nl/ics/gics/40202010
replaces: http://data.ga-group.nl/ics/gics/2014/40202010
is subindustry of: 消費信貸
imported on: 2026-05-27T08:45:00.430Z
last refreshed on: 2026-05-31T09:56:29.350Z
source accessed on: 2017-10-19T03:38:28Z
source last accessed on: 2019-06-07T09:41:30Z
label: Consumer Finance @en
label: Financiamento ao Consumidor @pt
label: Servicios Financieros Personales @es
label: Потребительское финансирование @ru
label: 消費者金融 @ja
label: 消费信贷
label: 소비자 금융 @ko
definition: Empresas dedicadas a los servicios financieros personales. Se incluyen las empresas de crédito personal, tarjetas de crédito, financiación de arrendamiento, servicios financieros para viajes y casas de empeño. Se excluyen los prestamistas hipotecarios, clasificados en la rama Ahorro y Financiamiento de Hipotecas. @es
definition: Provedores de serviços de financiamento ao consumidor, incluindo o crédito pessoal, cartões de crédito, financiamento de arrendamento, serviços de dinheiro relacionados com viagens e lojas de penhores. Exclui credores hipotecários classificados na Sub-Indústria de Poupança e Financiamento de Hipotecas. @pt
definition: Providers of consumer finance services, including personal credit, credit cards, lease financing, travel-related money services and pawn shops. Excludes mortgage lenders classified in the Thrifts & Mortgage Finance Sub-Industry. @en
definition: Компании, предоставляющие услуги потребительского финансирования, в том числе индивидуальные кредиты, кредитные карты, лизинговое финансирование, ипотечное кредитование, обслуживание дорожных чеков, а также ломбарды. В данную группу не входят компании ипотечного кредитования, включенные в подот��асль «Деятельность сберегательных и ипотечных финансовых организаций». @ru
definition: 消費信貸服務提供商，包括個人信貸、信用卡、租賃融資、旅行相關的金融服務以��當鋪。不包括那些歸類於“互助儲蓄與牴押信貸金融服務”子行業中的抵押貸款商。
definition: 消費者金融サービスの提供業者。個人信用、クレジットカード、リースによる資金調達、旅行関連金融サービス、質屋を含む。産業サブグループの「貯蓄・抵当・不動産金融」に分類される住宅ローン貸付業者は除く。 @ja
definition: 消费信贷服务提供商，包括个人信贷、信用卡、租赁融资、旅行相关的金融服务以及当铺。不包括那些归类于“互助储蓄与抵押信贷金融服务”子行业中的抵押贷款商。
definition: 개인 신용, 신용 카드, 리스 금융, 여행 관련 현금 서비스, 전당포를 포함한 소비자 금융 서비스 제공업체. ‘저축 & 모기지 금융’으로 분류되는 모기지 대출은 제외. @ko
notation: 40202010
valid from: 2016-09-01
valid till: 2018-09-29

消費信貸
type: GlobalIndustryClassificationStandardsClassifier
type: IndustryClassifier
type: NamedIndividual
is contemporary version of: http://data.ga-group.nl/ics/gics/402020
is replaced by: http://data.ga-group.nl/ics/gics/2018/402020
is version of: http://data.ga-group.nl/ics/gics/402020
replaces: http://data.ga-group.nl/ics/gics/2014/402020
is industry of: 綜合金融
imported on: 2026-05-27T08:45:00.430Z
last refreshed on: 2026-05-31T09:56:29.350Z
source accessed on: 2017-10-19T03:34:33Z
source last accessed on: 2019-06-07T09:41:30Z
label: Consumer Finance @en
label: Crédit à la Consommation @fr
label: Credito al consumo @it
label: Financiamento ao Consumidor @pt
label: Private Finanzdienste @de
label: Servicios Financieros Personales @es
label: Потребительское финансирование @ru
label: 消費者金融 @ja
label: 消费信贷
label: 소비자 금융 @ko
notation: 402020
valid from: 2016-09-01
valid till: 2018-09-29

資產管理與托管銀行
type: GlobalIndustryClassificationStandardsClassifier
type: SubindustryClassifier
type: NamedIndividual
is contemporary version of: http://data.ga-group.nl/ics/gics/40203010
is replaced by: http://data.ga-group.nl/ics/gics/2018/40203010
is version of: http://data.ga-group.nl/ics/gics/40203010
replaces: http://data.ga-group.nl/ics/gics/2014/40203010
is subindustry of: 资本市场
imported on: 2026-05-27T08:45:00.430Z
last refreshed on: 2026-05-31T09:56:29.350Z
source accessed on: 2017-10-19T03:38:28Z
source last accessed on: 2019-06-07T09:41:30Z
label: Asset Management & Custody Banks @en
label: Bancos de Custódia e Gestão de Ativos @pt
label: Gestión de Activos y Bancos de Custodia @es
label: Управление активами и деятельность депозитарных банков @ru
label: 資産運用会社・資産管理銀行 @ja
label: 资产管理与托管银行
label: 자산 관리와 유가증권 보관 @ko
definition: Financial institutions primarily engaged in investment management and/or related custody and securities fee-based services. Includes companies operating mutual funds, closed-end funds and unit investment trusts. Excludes banks and other financial institutions primarily involved in commercial lending, investment banking, brokerage and other specialized financial activities. @en
definition: Instituciones financieras dedicadas principalmente a la gestión de inversiones y/o servicios de custodia de valores. Se incluyen las empresas que operan fondos de inversión, fondos cerrados y fideicomisos de inversión independientes. Se excluyen los bancos y otras instituciones financieras dedicadas principalmente a préstamos comerciales, banca de inversión, correduría y otras actividades financieras especializadas. @es
definition: Instituições financeiras envolvidas principalmente na gestão de investimentos e /ou serviços relacionados baseados em taxas de custódia e títulos. Inclui empresas que operam fundos mútuos, fundos fechados e trustes unitários de investimentos. Exclui bancos e outras instituições financeiras envolvidas principalmente em empréstimos comerciais, bancos de investimentos, corretagem e outras atividades financeiras especializadas. @pt
definition: Финансовые организации, занимающиеся преимущественно управлением инвестициями и (или) предоставлением сопутствующих платных депозитарных услуг и услуг по работе с ценными бумагами. В данную группу входят компании, занимающиеся управлением взаимными фондами, закрытыми фондами и паевыми инвестиционными фондами. Не входят банки и другие финансовые организации, занимающиеся в основном коммерческим ��редитованием, инвестиционной банковской деятельностью, брокерской деятельностью и другими видами специализированной финансовой деятельности. @ru
definition: 主要从事投资管理和/或与其相关的有偿托管和证券业务。包括经营共同基金和封闭式基金的公司以及单位信托公司。不包括那些主要从事商业贷款、投资银行业、经纪业和其它特殊金融业务的银行和金融机构。
definition: 主要從事投資管理和/或與其相關的有償託管和證券業務。包括經營共同基金和封閉式基金的公司以及單位信託公司。不包括那些主要從事商業貸款、投資銀行業、經紀業和其他特殊金融業務的銀行和金融機構。
definition: 資産運用、および関連する管理サービス、証券手数料に基づくサービスを主に行う金融機関。ミューチュアルファンド、クローズドエンド型投資信託、単位型投資信託を運営する会社を含む。貸し付け、投資銀行業務、証券会社や他の専門的な金融活動を主に行う銀行および他の金融機関は除く。 @ja
definition: 투자 관리 및/또는 관련된 유가증권 보관 및 증권 유료 서비스와 주로 관련된 금융기관. 뮤추얼 펀드, 폐쇄형 펀드, 유닛 트러스트를 운영하는 회사 포함. 상업 대출, 투자 금융, 중개, 기타 전문 금융 활동과 주로 관련된 기타 금융기관과 은행은 제외. @ko
notation: 40203010
valid from: 2016-09-01
valid till: 2018-09-29

投資銀行業與經紀業
type: GlobalIndustryClassificationStandardsClassifier
type: SubindustryClassifier
type: NamedIndividual
is contemporary version of: http://data.ga-group.nl/ics/gics/40203020
is replaced by: http://data.ga-group.nl/ics/gics/2018/40203020
is version of: http://data.ga-group.nl/ics/gics/40203020
replaces: http://data.ga-group.nl/ics/gics/2014/40203020
is subindustry of: 资本市场
imported on: 2026-05-27T08:45:00.430Z
last refreshed on: 2026-05-31T09:56:29.350Z
source accessed on: 2017-10-19T03:38:28Z
source last accessed on: 2019-06-07T09:41:30Z
label: Bancos de Inversión y Corredurías @es
label: Bancos de Investimento e Corretagem @pt
label: Investment Banking & Brokerage @en
label: Деятельность инвестиционных банков и брокерских организаций @ru
label: 投資銀行・証券会社 @ja
label: 投资银行业与经纪业
label: 투자 은행 & 중개업 @ko
definition: Financial institutions primarily engaged in investment banking & brokerage services, including equity and debt underwriting, mergers and acquisitions, securities lending and advisory services. Excludes banks and other financial institutions primarily involved in commercial lending, asset management and specialized financial activities. @en
definition: Instituciones financieras dedicadas principalmente a los servicios bancarios de inversión y de correduría, incluyendo la suscripción de capital y deuda, las fusiones y las adquisiciones, el préstamo de valores y los servicios de asesoramiento. Se excluyen los bancos y otras instituciones financieras dedicadas principalmente a los préstamos comerciales, la gestión de activos y otras actividades financieras especializadas. @es
definition: Instituições financeiras envolvidas principalmente nos serviços de bancos de investimento e de corretagem, incluindo capital próprio e subscrição de dívida, fusões e aquisições, empréstimos de títulos e serviços de consultoria. Exclui bancos e outras instituições financeiras envolvidas principalmente em empréstimos comerciais, gestão de ativos e atividades financeiras especializadas. @pt
definition: Финансовые организации, занимающиеся преимущественно инвестиционной банковской деятельностью и предоставлением брокерских услуг, в том числе андеррайтингом долевых ценных бумаг и долговых обязательств, услугами по слиянию и поглощению компаний, ссудой ценных бумаг и предоставлением консультационных услуг. В данную гру��пу не входят банки и другие финансовые организации, занимающиеся в основном коммерческим кредитованием, управлением активами и другими видами специализированной финансовой деятельности. @ru
definition: 主要从事投资银行与经纪业务的金融机构，包括股票和债务承销、合并、收购、证券租借和咨询业务。不包括那些主要从事商业贷款、资产管理以及特殊金融业务的银行和金融机构。
definition: 主要從事投資銀行與經紀業務的金融機構，包括股票和債務承銷、合併、收購、證券租借和諮詢業務。不包括那些主要從事商業貸款、資產管理以及特殊金融業務的銀行和金融機構。
definition: 投資銀行��務、証券業務を主に行う金融機関。株式・債券の公開・発行、合併吸収、証券貸借、投資相談サービスを含む。商業貸し付け、資産運用、専門的な金融活動を主に行う銀行や他の金融機関は除く。 @ja
definition: 자산과 부채 인수(underwriting), 합병, 인수, 담보 대출, 자문 서비스를 포함해서 투자 금융 및 중개 서비스와 주로 관련된 금융기관. 상업 대출, 자산 관리, 전문 금융 사업과 주로 관련된 은행 및 기타 금융기관은 제외. @ko
notation: 40203020
valid from: 2016-09-01
valid till: 2018-09-29

綜合性資本市場
type: GlobalIndustryClassificationStandardsClassifier
type: SubindustryClassifier
type: NamedIndividual
is contemporary version of: http://data.ga-group.nl/ics/gics/40203030
is replaced by: http://data.ga-group.nl/ics/gics/2018/40203030
is version of: http://data.ga-group.nl/ics/gics/40203030
replaces: http://data.ga-group.nl/ics/gics/2014/40203030
is subindustry of: 资本市场
imported on: 2026-05-27T08:45:00.430Z
last refreshed on: 2026-05-31T09:56:29.350Z
source accessed on: 2017-10-19T03:38:28Z
source last accessed on: 2019-06-07T09:41:30Z
label: Diversified Capital Markets @en
label: Mercados de Capital Diversificado @pt
label: Mercados de Capitales Diversificados @es
label: Диверсифицированная деятельность на рынках капитала @ru
label: 総合資本市場 @ja
label: 综合性资本市场
label: 다양한 캐피탈 시장 @ko
definition: Financial institutions primarily engaged in diversified capital markets activities, including a significant presence in at least two of the following area: large/major corporate lending, investment banking, brokerage and asset management. Excludes less diversified companies classified in the Asset Management & Custody Banks or Investment Banking & Brokerage sub-industries. Also excludes companies classified in the Banks or Insurance industry groups or the Consumer Finance Sub-Industry. @en
definition: Instituciones financieras dedicadas principalmente a actividades diversas en mercados de capitales, con una presencia significativa en al menos dos de las siguientes áreas: préstamos a grandes empresas o corporaciones, banca de inversión, correduría y gestión de activos. Se excluyen las empresas menos diversificadas, clasificadas en la rama Gestión de Activos y Servicios de Custodia de Valores o la de Bancos de Inversión y Corredurías. También se excluyen las empresas clasificadas en las ramas industriales de Entidades Bancarias o Seguros, o en la rama Servicios Financieros Personales. @es
definition: Instituições financeiras envolvidas principalmente em atividades diversificadas de mercado de capitais, incluindo uma presença significativa em pelo menos dois das seguintes áreas: empréstimos a grandes/importantes empresas, bancos de investimento, corretagem e gestão de ativos. Exclui empresas menos diversificadas, classificadas nas Sub-Indústrias de Bancos de Custódia e Gestão de Ativos ou Bancos de Investimento e Corretagem. Também exclui empresas classificadas nos grupos das indústrias de Bancos ou Seguros, ou na Sub-Indústria de Financiamento ao Consumidor. @pt
definition: Финансовые организации, занимающиеся в основном диверсифицированной деятельностью на рынках капитала, в том числе имеющие значительное присутствие не менее чем в двух направлениях бизнеса, а именно, в кредитовании крупных корпоративных клиентов, инвестиционной банковской деятельности, брокерской деятельности и управлении активами. В данную группу не входят менее диверсифицированные компании, включенные в подотрасли «Управление активами и деятельность депозитарных банков» или «Деятельность инвестиционных банков и брокерских организаций», а также компании, включенные в группы отраслей «Деятельность банков» или «Страховая деятельность» или в подотрасль «Потребительское финансирование». @ru
definition: 主要从事综合性资本市场业务的金融机构，其至少在以下两个领域中有大量业务的金融机构：大型/主要企业信贷、投资银行业与经纪业和资产管理。不包括那些归类于“资产管理与托管银行”或者“投资银行业与经纪业”子行业中的业务较单一的公司。同时也不包括那些归类于“银行或保险业集团”或“消费信贷”子行业中的公司
definition: 主要從事綜合性資本市場業務的金融機構，其至少在以下兩個領域中有大量業務的金融機構：大型/主要企業信貸、投資銀行業���經紀業和資產管理。不包括那些歸類於“資產管理與託管銀行”或者“投資銀行業與經紀業”子行業中的業務較單一的公司。同時也不包括那些歸類於“銀行或保險業集團”或“消費信貸”子行業中的公司
definition: 複数の資本市場活動を主に行う金融機関。大手企業への貸し付け、投資銀行業務、証券業、資産運用のうち、最低2分野に従事している会社を含む。産業サブグループの「資産運用会社・資産管理銀行」、「投資銀行・証券会社」に分類される業務分野の限られた会社は除く。また、産業グループの「銀行」、「保険」、産業サブグループの「消費者金融」に分類される会社も除く。 @ja
definition: 대기업/주요기업 대출, 투자 금융, 중개, 자산 관리 중 최소한 두 분야에서 주요 활동을 하고 있으며, 다각화된 캐피탈 시장 활동을 주로 하고 있는 금융기관. ‘자산 관리와 유가증권 보관’ 또는 ‘투자 은행 & 중개업’으로 분류되는 비교적 덜 다각화된 회사는 제외. 또한 은행 또는 보험 산업 그룹이나 ‘소비자 금융’으로 분류되는 회사도 제외. @ko
notation: 40203030
valid from: 2016-09-01
valid till: 2018-09-29

金融交易所和数据
type: GlobalIndustryClassificationStandardsClassifier
type: SubindustryClassifier
type: NamedIndividual
is contemporary version of: http://data.ga-group.nl/ics/gics/40203040
is replaced by: http://data.ga-group.nl/ics/gics/2018/40203040
is version of: http://data.ga-group.nl/ics/gics/40203040
is subindustry of: 资本市场
imported on: 2026-05-27T08:45:00.430Z
last refreshed on: 2026-05-31T09:56:29.350Z
source accessed on: 2017-10-19T03:38:28Z
source last accessed on: 2019-06-07T09:41:30Z
label: Bolsas e Mercados Financeiros @pt
label: Financial Exchanges & Data @en
label: Información y Mercados Financieros @es
label: Финансовые биржи и Финансовые данные @ru
label: 取引所およびデータ提供会社 @ja
label: 金融交易與資料業
label: 금융 거래소 및 데이터 @ko
definition: Empresas dedicadas al intercambio financiero de títulos, productos, instrumentos financieros derivados y otros, así como proveedores de herramientas y productos de apoyo en decisiones financieras, incluyendo las agencias de calificación. @es
definition: Empresas dedicadas aos negócios financeiros de títulos, produtos, instrumentos financeiros, derivativos e outros, assim como provedores de ferramentas e produtos de apoio às decisões financeiras, incluindo agências de classificação. @pt
definition: Financial exchanges for securities, commodities, derivatives and other financial instruments, and providers of financial decision support tools and products including ratings agencies @en
definition: Финансовые биржи ценных бумаг, товаров, деривативов и других финансовых услуг, а ��акже поставщики финансовых продуктов и инструментов для принятия решений, включая рейтинговые агентства. @ru
definition: 有価証券、商品先物、派生商品や他の金融商品の取引所、および投資判断を支援する商品の提供会社。格付会社も含む。 @ja
definition: 證券、大宗商品、衍生性金融商品及其他金融工具之金融交易服務，及包含評等機構在內之金融決策支援工具與產品的供應商
definition: 证券、商品、衍生工具和其他金融工具的金融交易所，以及金融决策支持工具和产品供应商（包括评级机构）
definition: 증권, 원자재 상품, 파생상품, 기타 금융수단에 대한 거래소. 금융거래 결정을 지원하는 도구 및 상품 제공사. 신용평가사 포함. @ko
notation: 40203040
valid from: 2016-09-01
valid till: 2018-09-29

资本市场
type: GlobalIndustryClassificationStandardsClassifier
type: IndustryClassifier
type: NamedIndividual
is contemporary version of: http://data.ga-group.nl/ics/gics/402030
is replaced by: http://data.ga-group.nl/ics/gics/2018/402030
is version of: http://data.ga-group.nl/ics/gics/402030
replaces: http://data.ga-group.nl/ics/gics/2014/402030
is industry of: 綜合金融
imported on: 2026-05-27T08:45:00.430Z
last refreshed on: 2026-05-31T09:56:29.350Z
source accessed on: 2017-10-19T03:34:33Z
source last accessed on: 2019-06-07T09:41:30Z
label: Attività di capitale @it
label: Capital Markets @en
label: Kapitalmärkte @de
label: Marchés de Capitaux @fr
label: Mercados de Capital @pt
label: Mercados de Capitales @es
label: Деятельность на рынках капитала @ru
label: 資本市場
label: 캐피탈 시장 @ko
notation: 402030
valid from: 2016-09-01
valid till: 2018-09-29

抵押房地产投资信托
type: GlobalIndustryClassificationStandardsClassifier
type: SubindustryClassifier
type: NamedIndividual
is contemporary version of: http://data.ga-group.nl/ics/gics/40204010
is replaced by: http://data.ga-group.nl/ics/gics/2018/40204010
is version of: http://data.ga-group.nl/ics/gics/40204010
replaces: http://data.ga-group.nl/ics/gics/2014/40402030
is subindustry of: 抵押型不動產投資 信託基金（REITs）
imported on: 2026-05-27T08:45:00.430Z
last refreshed on: 2026-05-31T09:56:29.350Z
source accessed on: 2017-10-19T03:38:28Z
source last accessed on: 2019-06-07T09:41:30Z
label: Mortgage REITs @en
label: REIT Hipotecários @pt
label: REIT Hipotecarias @es
label: Ипотечныe инвестиционные фонды недвижимости (REIT) @ru
label: モーゲージ不動産投資信託（REIT） @ja
label: 抵押房地產投資信托
label: 모기지 리츠 @ko
definition: Companies or Trusts that service, originate, purchase and/or securitize residential and/or commercial mortgage loans. Includes trusts that invest in mortgage-backed securities and other mortgage related assets. @en
definition: Empresas o fideicomisos que dan servicio, originan, compran o aseguran préstamos hipotecarios residenciales o comerciales. Se incluyen los fideicomisos que invierten en valores con garantía hipotecaria y otros activos relacionados con las hipotecas. @es
definition: Empresas ou Trustes que atendem, originam, compram e/ou garantem empréstimos hipotecários comerciais e/ou residenciais. Inclui trustes que investem em títulos garantidos por hipotecas e outros bens relativos à hipoteca. @pt
definition: Компании или трасты, занимающиеся обслуживанием, предоставлением, приобретением и (или) секьюритизацией коммерческих ипотечных кредитов, в том числе трасты, занимающиеся инвестициями в ипотечные ценные бумаги и другие активы, обеспеченные ипотекой. @ru
definition: 从事提供、发起、购买住宅和／或商业抵押贷款，及／或相关资产证券化业务的公司或信托公司。包括投资抵押担保证券和其他相关抵押相关资产的信托公司。
definition: 住宅もしくは商業用不動産担保ローンを取得して証券化する会社もしくは信託機関。モーゲージREIT担保証券（MBS）へ投資する投資信託も含む。 @ja
definition: 從事發起、購買住宅和/或者商業抵押貸款服務，和/或者相關資產證券化業務的公司或信託公司。包括在抵押擔保證券和其他相關資產抵押方面進行投資的信託公司。
definition: 주거용 및/또는 상업용 모기지 대출을 서비스, 출시, 구매 및/또는 증권화하는 기업 또는 신탁회사. 모기지담보부 증권과 기타 모기지 관련 자산에 투자하는 신탁회사 포함. @ko
notation: 40204010
valid from: 2016-09-01
valid till: 2018-09-29

抵押型不動產投資 信託基金（REITs）
type: GlobalIndustryClassificationStandardsClassifier
type: IndustryClassifier
type: NamedIndividual
is contemporary version of: http://data.ga-group.nl/ics/gics/402040
is replaced by: http://data.ga-group.nl/ics/gics/2018/402040
is version of: http://data.ga-group.nl/ics/gics/402040
is industry of: 綜合金融
imported on: 2026-05-27T08:45:00.430Z
last refreshed on: 2026-05-31T09:56:29.350Z
source accessed on: 2017-10-19T03:34:33Z
source last accessed on: 2019-06-07T09:41:30Z
label: Fideicomiso Hipotecario de Inversión en Bienes Inmobiliarios (REIT) @es
label: Fondi comuni di investimento immobiliare e ipotecari (REIT) @it
label: Hypotheken-Immobilienfonds (Real Estate Investment Trusts – REITs) @de
label: Mortgage Real Estate Investment Trusts (REITs) @en
label: Sociétés d'Investissement Immobilier Cotées (SIIC) spécialisées dans le Crédit Hypothécaire @fr
label: Trustes de Investimento Imobiliário (REIT) @pt
label: Ипотечныe инвестиционные фонды недвижимости (REIT) @ru
label: モーゲージ不動産投資信託（REIT） @ja
label: 抵押房地产投资信托（REITs）
label: 모기지 리츠 @ko
notation: 402040
valid from: 2016-09-01
valid till: 2018-09-29

綜合金融
type: GlobalIndustryClassificationStandardsClassifier
type: IndustryGroupClassifier
type: NamedIndividual
is contemporary version of: http://data.ga-group.nl/ics/gics/4020
is replaced by: http://data.ga-group.nl/ics/gics/2018/4020
is version of: http://data.ga-group.nl/ics/gics/4020
replaces: http://data.ga-group.nl/ics/gics/2014/4020
is industry group of: Finance
imported on: 2026-05-27T08:45:00.430Z
last refreshed on: 2026-05-31T09:56:29.350Z
source accessed on: 2017-10-19T03:34:33Z
source last accessed on: 2019-06-07T09:41:30Z
label: Diversified Financials @en
label: Diversifizierte Finanzdienste @de
label: Entidades Financieras Diversas @es
label: Prodotti e servizi finanziari diversificati @it
label: Serviços Financeiros Diversificados @pt
label: Services Financiers Diversifiés @fr
label: Диверсифицированные финансовые услуги @ru
label: Диверсифицированные ��инансовые услуги @ru
label: 各種金融 @ja
label: 综合金融
label: 다양한 금융 @ko
notation: 4020
valid from: 2016-09-01
valid till: 2018-09-29

保险经纪商
type: GlobalIndustryClassificationStandardsClassifier
type: SubindustryClassifier
type: NamedIndividual
is contemporary version of: http://data.ga-group.nl/ics/gics/40301010
is replaced by: http://data.ga-group.nl/ics/gics/2018/40301010
is version of: http://data.ga-group.nl/ics/gics/40301010
replaces: http://data.ga-group.nl/ics/gics/2014/40301010
is subindustry of: 保险
imported on: 2026-05-27T08:45:00.430Z
last refreshed on: 2026-05-31T09:56:29.350Z
source accessed on: 2017-10-19T03:38:28Z
source last accessed on: 2019-06-07T09:41:30Z
label: Agentes de Seguros @es
label: Corretores de Seguro @pt
label: Insurance Brokers @en
label: Деятельность страховых агентов @ru
label: 保険ブローカー @ja
label: 保險經紀商
label: 보험 중개 @ko
definition: Agencia de corredores de seguros o reaseguros. @es
definition: Empresas de Corretagem de Seguros e Resseguros. @pt
definition: Insurance and reinsurance brokerage firms. @en
definition: Брокерские компании, предоставляющие услуги страхования и перестрахования. @ru
definition: 保险和再��险经纪商。
definition: 保険および再保険ブローカー会社。 @ja
definition: 保險與再保險經紀商。
definition: 보험 및 재보험 중개 회사. @ko
notation: 40301010
valid from: 2016-09-01
valid till: 2018-09-29

人壽與健康保險
type: GlobalIndustryClassificationStandardsClassifier
type: SubindustryClassifier
type: NamedIndividual
is contemporary version of: http://data.ga-group.nl/ics/gics/40301020
is replaced by: http://data.ga-group.nl/ics/gics/2018/40301020
is version of: http://data.ga-group.nl/ics/gics/40301020
replaces: http://data.ga-group.nl/ics/gics/2014/40301020
is subindustry of: 保险
imported on: 2026-05-27T08:45:00.430Z
last refreshed on: 2026-05-31T09:56:29.350Z
source accessed on: 2017-10-19T03:38:28Z
source last accessed on: 2019-06-07T09:41:30Z
label: Life & Health Insurance @en
label: Seguros de Vida e de Saúde @pt
label: Seguros de Vida y Salud @es
label: Предоставление услуг страхования жизни и медицинского страхования @ru
label: 人寿与健康保险
label: 生命保険・健康保険 @ja
label: 생명과 건강 보험 @ko
definition: Companies providing primarily life, disability, indemnity or supplemental health insurance. Excludes managed care companies classified in the Managed Health Care Sub-Industry. @en
definition: Empresas dedicadas a servicios de seguros de vida, invalidez, indemnización o suplementarios. Se excluyen las empresas de administración de salud, clasificadas en la rama Administración de Salud. @es
definition: Empresas provedoras principalmente de seguros de vida, de deficiência, de indenização e complementares de saúde. Exclui empresas de assistência administrada classificadas na Sub-Indústria de Assistência Médica Administrada. @pt
definition: Компании, предоставляющие преимущественно услуги страхования жизни, страхования на случай нетрудоспособности, страхования от возмещения ущерба или дополнительного медицинского страхования. В данную группу не входят компании, включенные в подотрасль «Управляемое здравоохранение». @ru
definition: 主要提供人壽、殘疾、損失補償或者補充健康保險的公司。不包括那些歸類於“管理型保健護理“子行業中的管理型保健護理公司。
definition: 主要提供人寿、残疾、损失补偿或者补充健康保险的公司。不包括那些归类于“管理型保健护理“子行业中的管理型保健护理公司。
definition: 生命保険、身体障害保険、傷害保険、補助健康保険を主に提供する会社。産業サブグループの「管理健康医療」に分類される管理医療保険会社は除く。 @ja
definition: 생명, 장애, 손해 보험, 또는 보조적인 건강보험을 주로 제공하는 회사. ‘헬스케어 관리’으로 분류되는 헬스케어 관리 회사는 제외. @ko
notation: 40301020
valid from: 2016-09-01
valid till: 2018-09-29

多元化保险
type: GlobalIndustryClassificationStandardsClassifier
type: SubindustryClassifier
type: NamedIndividual
is contemporary version of: http://data.ga-group.nl/ics/gics/40301030
is replaced by: http://data.ga-group.nl/ics/gics/2018/40301030
is version of: http://data.ga-group.nl/ics/gics/40301030
replaces: http://data.ga-group.nl/ics/gics/2014/40301030
is subindustry of: 保险
imported on: 2026-05-27T08:45:00.430Z
last refreshed on: 2026-05-31T09:56:29.350Z
source accessed on: 2017-10-19T03:38:28Z
source last accessed on: 2019-06-07T09:41:30Z
label: Multi-line Insurance @en
label: Seguros Diversos @es
label: Seguros de Múltiplas Linhas @pt
label: Страховая деятельность в различных направлениях @ru
label: 多元化保險
label: 総合保険 @ja
label: 종합 보험 @ko
definition: Companhias de seguro com interesses diversificados em seguros de vida, saúde e propriedade e de acidentes. @pt
definition: Empresas aseguradoras que ofrecen servicios diversos de seguros de vida, enfermedad, propiedad y contra accidentes. @es
definition: Insurance companies with diversified interests in life, health and property and casualty insurance. @en
definition: Страховые компании, осуществляющие деятельность в разных направлениях страхования жизни, имущества, медицинского страхования и страхования от несчастных случаев. @ru
definition: 有人壽、健康、財產及意外傷害保險業務的保險公司。
definition: 有人寿、健康、财产及意外伤害保险业务的保险公司。
definition: 生命保険、健康保険、動産保険、損害保険などを各種取り扱う保険会社。 @ja
definition: 생명, 건강, 자산, 사고 보험에 다각적인 이해관계를 지니고 있는 보험 회사. @ko
notation: 40301030
valid from: 2016-09-01
valid till: 2018-09-29

財產與意外傷害保險
type: GlobalIndustryClassificationStandardsClassifier
type: SubindustryClassifier
type: NamedIndividual
is contemporary version of: http://data.ga-group.nl/ics/gics/40301040
is replaced by: http://data.ga-group.nl/ics/gics/2018/40301040
is version of: http://data.ga-group.nl/ics/gics/40301040
replaces: http://data.ga-group.nl/ics/gics/2014/40301040
is subindustry of: 保险
imported on: 2026-05-27T08:45:00.430Z
last refreshed on: 2026-05-31T09:56:29.350Z
source accessed on: 2017-10-19T03:38:28Z
source last accessed on: 2019-06-07T09:41:30Z
label: Property & Casualty Insurance @en
label: Seguro de Propiedad y contra Accidentes @es
label: Seguros de Propriedade e de Acidentes @pt
label: Страхование имущества и страхование от несчастных случаев @ru
label: 動産保険・損害保険 @ja
label: 财产与意外伤害保险
label: 자산과 사고 보험 @ko
definition: Companies providing primarily property and casualty insurance. @en
definition: Empresas aseguradoras que ofrecen principalmente seguros de propiedad y contra accidentes. @es
definition: Empresas provendo principalmente seguro de propriedade e de acidentes. @pt
definition: Компании, предоставляющие в основном услуги по страхованию имущества и страхованию от несчастных случаев. @ru
definition: 主要提供財產和意外傷害保險業務的公司。
definition: 主要提供财产和意外伤害保险业务的公司。
definition: 動産・損害保険を主に提供する会社。 @ja
definition: 자산과 사고 보험을 주로 제공하는 회사. @ko
notation: 40301040
valid from: 2016-09-01
valid till: 2018-09-29

再保险
type: GlobalIndustryClassificationStandardsClassifier
type: SubindustryClassifier
type: NamedIndividual
is contemporary version of: http://data.ga-group.nl/ics/gics/40301050
is replaced by: http://data.ga-group.nl/ics/gics/2018/40301050
is version of: http://data.ga-group.nl/ics/gics/40301050
replaces: http://data.ga-group.nl/ics/gics/2014/40301050
is subindustry of: 保险
imported on: 2026-05-27T08:45:00.430Z
last refreshed on: 2026-05-31T09:56:29.350Z
source accessed on: 2017-10-19T03:38:28Z
source last accessed on: 2019-06-07T09:41:30Z
label: Reaseguros @es
label: Reinsurance @en
label: Resseguros @pt
label: Деятельность по перестрахованию @ru
label: 再保険 @ja
label: 再保險
label: 재보험 @ko
definition: Companies providing primarily reinsurance. @en
definition: Empresas dedicadas principalmente al reaseguro. @es
definition: Empresas provendo principalmente resseguro. @pt
definition: Компании, предоставляющие в основном услуги перестрахования. @ru
definition: 主に再保険を提供する会社。 @ja
definition: 主要提供再保险业务的公司。
definition: 主要提供再保險業務的公司。
definition: 재보험을 주로 제공하는 회사. @ko
notation: 40301050
valid from: 2016-09-01
valid till: 2018-09-29

保险
type: GlobalIndustryClassificationStandardsClassifier
type: IndustryClassifier
type: NamedIndividual
is contemporary version of: http://data.ga-group.nl/ics/gics/403010
is replaced by: http://data.ga-group.nl/ics/gics/2018/403010
is version of: http://data.ga-group.nl/ics/gics/403010
replaces: http://data.ga-group.nl/ics/gics/2014/403010
is industry of: 保险
imported on: 2026-05-27T08:45:00.430Z
last refreshed on: 2026-05-31T09:56:29.350Z
source accessed on: 2017-10-19T03:34:33Z
source last accessed on: 2019-06-07T09:41:30Z
label: Assicurazioni @it
label: Assurance @fr
label: Insurance @en
label: Seguros @es
label: Versicherungen @de
label: Страховая деятельность @ru
label: 保険 @ja
label: 保險
label: 보험 @ko
notation: 403010
valid from: 2016-09-01
valid till: 2018-09-29

保险
type: GlobalIndustryClassificationStandardsClassifier
type: IndustryGroupClassifier
type: NamedIndividual
is contemporary version of: http://data.ga-group.nl/ics/gics/4030
is replaced by: http://data.ga-group.nl/ics/gics/2018/4030
is version of: http://data.ga-group.nl/ics/gics/4030
replaces: http://data.ga-group.nl/ics/gics/2014/4030
is industry group of: Finance
imported on: 2026-05-27T08:45:00.430Z
last refreshed on: 2026-05-31T09:56:29.350Z
source accessed on: 2017-10-19T03:34:33Z
source last accessed on: 2019-06-07T09:41:30Z
label: Assicurazioni @it
label: Assurance @fr
label: Insurance @en
label: Seguros @es
label: Versicherungen @de
label: Страхование @ru
label: 保険 @ja
label: 保險
label: 보험 @ko
notation: 4030
valid from: 2016-09-01
valid till: 2018-09-29

Finance
type: GlobalIndustryClassificationStandardsClassifier
type: SectorClassifier
type: NamedIndividual
is contemporary version of: http://data.ga-group.nl/ics/gics/40
is replaced by: http://data.ga-group.nl/ics/gics/2018/40
is version of: http://data.ga-group.nl/ics/gics/40
replaces: http://data.ga-group.nl/ics/gics/2014/40
imported on: 2026-05-27T08:45:00.430Z
last refreshed on: 2026-05-31T09:56:29.350Z
source accessed on: 2017-10-19T03:34:33Z
source last accessed on: 2019-06-07T09:41:30Z
label: Financials @en
label: Finanza @it
label: Finanzas @es
label: Finanzwesen @de
label: Serviços Financeiros @pt
label: Финансы @ru
label: 金融
label: 금융 @ko
notation: 40
valid from: 2016-09-01
valid till: 2018-09-29

互联网软件与服务
type: GlobalIndustryClassificationStandardsClassifier
type: SubindustryClassifier
type: NamedIndividual
is contemporary version of: http://data.ga-group.nl/ics/gics/45101010
is version of: http://data.ga-group.nl/ics/gics/45101010
replaces: http://data.ga-group.nl/ics/gics/2014/45101010
is subindustry of: 互联网软件与服务
imported on: 2026-05-27T08:45:00.430Z
last refreshed on: 2026-05-31T09:56:08.967Z
source accessed on: 2017-10-19T03:38:21Z
source last accessed on: 2019-06-07T09:41:30Z
label: Internet Software & Services @en
label: Logiciels et Services Internet @fr
label: Software e Serviços de Internet @pt
label: Software e servizi Internet @it
label: Предоставление программного обеспечения и услуг Интернета @ru
label: インターネット ソフトウェア・サービス @ja
label: 인터넷 소프트웨어 & 서비스 @ko
definition: Companies developing and marketing internet software and/or providing internet services including online databases and interactive services, as well as companies deriving a majority of their revenues from online advertising. Excludes companies classified in the Internet Retail Sub-Industry. @en
definition: Empresas de desenvolvimento e comercialização de software de internet e/ou prestadoras de serviços de internet, incluindo bases de dados on-line e serviços interativos, assim como empresas que derivam a maioria das suas receitas de publicidade on-line. Exclui empresas classificadas na Sub-Indústria Vendas pela Internet ou por Catálogo. @pt
definition: Sociétés qui développent et commercialisent des logiciels internet et / ou fournissent des services Internet, y compris les bases de données en ligne et des services interactifs, ainsi que des entreprises qui tirent la majorité de leurs revenus de la publicité en ligne. Ne sont pas incluses les entreprises classées dans la sous-industrie de la Vente au Détail sur Internet. @fr
definition: Società che sviluppano e commercializzano software per Internet e/o che forniscono servizi per Internet, tra i quali servizi di database online e servizi interattivi, e società che traggono la maggior parte del loro fatturato da servizi di pubblicità online. Sono escluse le società classificate nel ramo Vendita via Internet. @it
definition: Компании, занимающиеся разработкой и маркетинго�� программного обеспечения Интернета и/или Интернет-услуг, в том числе он-лайн баз данных и интерактивных услуг, а также компании, извлекающие основную прибыль из размещения рекламы в Интернете. В данную группу не входят компании, включенные в подотрасль «Розничная торговля через Интернет». @ru
definition: インターネットソフトウェアの開発・販売を行う会社、およびオンラインデータベース、双方向サービス、オンライン広告等、インターネットサービスを提供する会社。産���サブグループの「インターネット販売」に分類される会社は除く。 @ja
definition: 开发与销售互联网软件和/或提供互联网服务的公司，这些服务包括在线数据库、交互服务、网络地址注册服务、数���库建设、互联网设计服务及在线广告。不包括那些归类于“互联网零售”子行业中的公司。
definition: 인터넷 소프트웨어의 개발과 판매, 온라인 데이터베이스와 인터액티브 서비스 등 인터넷 서비스 제공 회사, 온라인 광고를 통해 매출의 대부분이 발생하는 회사. ‘인터넷 소매’에 분류된 기업 제외. @ko
notation: 45101010
valid from: 2016-09-01
valid till: 2018-09-29

互联网软件与服务
type: GlobalIndustryClassificationStandardsClassifier
type: IndustryClassifier
type: NamedIndividual
is contemporary version of: http://data.ga-group.nl/ics/gics/451010
is version of: http://data.ga-group.nl/ics/gics/451010
replaces: http://data.ga-group.nl/ics/gics/2014/451010
is industry of: 軟體與服務
imported on: 2026-05-27T08:45:00.430Z
last refreshed on: 2026-05-31T09:56:29.350Z
source accessed on: 2017-10-19T03:34:33Z
source last accessed on: 2019-06-07T09:41:30Z
label: Internet Software & Services @en
label: Internet-Software & -dienste @de
label: Logiciels et Services d'Internet @fr
label: Software e Serviços de Internet @pt
label: Software e servizi Internet @it
label: Software y Servicios de Internet @es
label: Предоставление программного обеспечения и услуг Интернета @ru
label: インターネットソフトウェア・サービス @ja
label: 網際網路軟體與服務
label: 인터넷 소프트웨어와 서비스 @ko
notation: 451010
valid from: 2016-09-01
valid till: 2018-09-29

信息科技咨询与其它服务
type: GlobalIndustryClassificationStandardsClassifier
type: SubindustryClassifier
type: NamedIndividual
is contemporary version of: http://data.ga-group.nl/ics/gics/45102010
is replaced by: http://data.ga-group.nl/ics/gics/2018/45102010
is version of: http://data.ga-group.nl/ics/gics/45102010
replaces: http://data.ga-group.nl/ics/gics/2014/45102010
is subindustry of: 信息技术服务
imported on: 2026-05-27T08:45:00.430Z
last refreshed on: 2026-05-31T09:56:08.967Z
source accessed on: 2017-10-19T03:38:21Z
source last accessed on: 2019-06-07T09:41:30Z
label: Conseils Liés Aux Technologies de l’Information et Autres Services @fr
label: Consulenza e altri servizi informatici @it
label: Consultoria de TI e Outros Serviços @pt
label: IT Consulting & Other Services @en
label: IT 컨설팅과 기타 서비스 @ko
label: Консультирование в сфере информационных технологий и другие услуги @ru
label: 情報技術コンサルティング・他のサービス @ja
definition: Fornitori di servizi informatici e di integrazione di sistemi non classificati nei rami Servizi di elaborazione dati e outsourcing e Software e servizi Internet. Sono inclusi i servizi di consulenza informatica e di gestione delle informazioni. @it
definition: Fournisseurs de technologies de l’information et de services d'intégration de systèmes, non-classés dans les sous-industries du Traitement de Données et Services Externalisés, ou des Logiciels et Services Internet. Sont inclus les services de conseil liés aux technologies de l’information et de gestion de l'information. @fr
definition: Provedores de serviços de tecnologia da informação e integração de sistemas não classificados nas Sub-Indústrias de Serviços Terceirizados e de Processamento de Dados ou Software e Serviços de Internet. Inclui serviços de consultoria de tecnologia de informação e gerenciamento de informações. @pt
definition: Providers of information technology and systems integration services not classified in the Data Processing & Outsourced Services or Internet Software & Services Sub-Industries. Includes information technology consulting and information management services. @en
definition: Компании, предоставляющие услуги в сфере информационных технологий и системной интеграции, не включенные в подотрасли «Предоставление услуг по обработке данных и услуги, п��едоставление которых передано другим компаниям» или Производство программного обеспечения и предоставление услуг Интернета». В данную группу входят компании, оказывающие консультационные услуги в области информационных технологий и управления информацией. @ru
definition: ‘데이터 처리와 아웃소싱 서비스’ 또는 ‘인터넷 소프트웨어와 서비스’로 분류되지 않은 정보 기술 및 시스템 통합 서비스 제공업체. 정보 기술 컨설팅과 정보 관리 서비스 포함. @ko
definition: 情報技術テクノロジー、およびシステム統合サービスを提供する会社で、産業サブグループの「情報処理・外注サービス」、「インターネットソフトウェア・サービス」に分類されないもの。情報技術コンサルティングや情報管理サービスを含む。 @ja
definition: 提供信息科技和系统集成服务的公司（未归类于“数据处理与外包服务”或者“互联网软件与服务”子行业）。包括信息科技咨询和信息管理服务。
notation: 45102010
valid from: 2016-09-01
valid till: 2018-09-29

数据处理与外包服务
type: GlobalIndustryClassificationStandardsClassifier
type: SubindustryClassifier
type: NamedIndividual
is anachronous version of: http://data.ga-group.nl/ics/gics/20202030
is contemporary version of: http://data.ga-group.nl/ics/gics/45102020
is replaced by: http://data.ga-group.nl/ics/gics/2018/45102020
is version of: http://data.ga-group.nl/ics/gics/20202030
is version of: http://data.ga-group.nl/ics/gics/45102020
replaces: http://data.ga-group.nl/ics/gics/2014/45102020
is subindustry of: 信息技术服务
imported on: 2026-05-27T08:45:00.430Z
last refreshed on: 2026-05-31T09:56:08.967Z
source accessed on: 2017-10-19T03:38:21Z
source last accessed on: 2019-06-07T09:41:30Z
label: Data Processing & Outsourced Services @en
label: Serviços Terceirizados e de Processamento de Dados @pt
label: Servizi di elaborazione dati e outsourcing @it
label: Traitement des Données et Services Externalisés @fr
label: Предоставление услуг по обработке данных и услуги, предоставление которых передано другим компаниям» @ru
label: 情報処理・外注サービス @ja
label: 데이터 처리와 아웃소싱 서비스 @ko
definition: Fornitori di servizi di elaborazione elettronica di dati commerciali e/o outsourcing, incluse società fornitrici di servizi di back-office automation. @it
definition: Fournisseurs de services de traitement des données électroniques commerciales et/ou de services externalisés des processus d’entreprises. Sont incluses les entreprises qui offrent des services pour automatiser des services administratifs. @fr
definition: Provedores de serviços de processamento de dados eletrônicos comerciais e/ou terceirização de processos comerciais. Inclui empresas que prestam serviços para automação de retaguarda. @pt
definition: Providers of commercial electronic data processing and/or business process outsourcing services. Includes companies that provide services for back-office automation. @en
definition: Провайдеры услуг по обработке коммерческих данных и (или) аутсорсингу бизнес-процессов. В данную группу входят компании, предоставляющие услуги по автоматизации бэк-офиса. @ru
definition: 商業電子情報処理、会社業務外注サービスの提供業者。バックオフィス自動化サービスを提供する会社を含む。 @ja
definition: 提供商业电子数据处理和/或经营流程外包服务的公司。包括那些提供事务部门办公自动化服务的公司。
definition: 상업용 전자 데이터 처리 및/또는 비즈니스 프로세스 아웃소싱 서비스 제공업체. 백오피스 자동화를 위한 서비스 제공 회사 포함. @ko
notation: 45102020
valid from: 2016-09-01
valid till: 2018-09-29

信息技术服务
type: GlobalIndustryClassificationStandardsClassifier
type: IndustryClassifier
type: NamedIndividual
is contemporary version of: http://data.ga-group.nl/ics/gics/451020
is replaced by: http://data.ga-group.nl/ics/gics/2018/451020
is version of: http://data.ga-group.nl/ics/gics/451020
replaces: http://data.ga-group.nl/ics/gics/2014/451020
is industry of: 軟體與服務
imported on: 2026-05-27T08:45:00.430Z
last refreshed on: 2026-05-31T09:56:29.350Z
source accessed on: 2017-10-19T03:34:33Z
source last accessed on: 2019-06-07T09:41:30Z
label: IT Services @en
label: IT 서비스 @ko
label: IT-Dienste @de
label: Services Liés Aux Technologies de l’Information @fr
label: Servicios de Tecnología de la Información @es
label: Servizi informatici @it
label: Предоставление услуг в сфере информационных технологий @ru
label: 情報技術サービス @ja
label: 資訊技術服務
notation: 451020
valid from: 2016-09-01
valid till: 2018-09-29

应用软件
type: GlobalIndustryClassificationStandardsClassifier
type: SubindustryClassifier
type: NamedIndividual
is contemporary version of: http://data.ga-group.nl/ics/gics/45103010
is replaced by: http://data.ga-group.nl/ics/gics/2018/45103010
is version of: http://data.ga-group.nl/ics/gics/45103010
replaces: http://data.ga-group.nl/ics/gics/2014/45103010
is subindustry of: 軟體
imported on: 2026-05-27T08:45:00.430Z
last refreshed on: 2026-05-31T09:56:08.967Z
source accessed on: 2017-10-19T03:38:21Z
source last accessed on: 2019-06-07T09:41:30Z
label: Application Software @en
label: Logiciels d'Application @fr
label: Software applicativi @it
label: Software para Aplicativos @pt
label: Производство прикладного программного обеспечения @ru
label: アプリケーション・ソフトウェア @ja
label: 애플리케이션 소프트웨어 @ko
definition: Companies engaged in developing and producing software designed for specialized applications for the business or consumer market. Includes enterprise and technical software. Excludes companies classified in the Home Entertainment Software Sub-Industry. Also excludes companies producing systems or database management software classified in the Systems Software Sub-Industry. @en
definition: Empresas envolvidas no desenvolvimento e na produção de software projetado para aplicativos especializados para empresas ou pessoas. Inclui software empresarial e técnico. Exclui empresas classificadas na Sub-Indústria de Software de Entretenimento em Casa. Também exclui empresas produtoras de software de gerenciamento de sistemas ou de base de dados classificadas na Sub-Indústria de Software de Sistemas. @pt
definition: Sociétés spécialisées dans le développement et la production de logiciels destinés à des applications spécialisées pour les professionnels et le grand public, y compris les logiciels d'entreprise ou techniques. Ne sont pas incluses les entreprises classées dans la sous-industrie des Logiciels de Divertissement à Domicile. Ne sont pas incluses non plus les entreprises qui produisent des systèmes ou des logiciels de gestion de base de données classées dans la sous-industrie des Logiciels Système. @fr
definition: Società che si occupano dello sviluppo e della produzione di software destinato ad applicazioni specifiche per il mercato delle aziende o degli utenti finali, inclusi software per le imprese e software tecnici. Sono escluse le società classificate nel ramo Software per Home Entertainment e le società produttrici di software di sistema o di gestione dei database classificate nel ramo Software di sistema. @it
definition: Компании, занимающиеся разработкой и производством программного обеспечения для специализированного применения в коммерческой деятельности или на потребительском рынке. В данную группу не входят компании, включенные в подотрасль «Производство программного обеспечения для домашнего пользования в развлекательных целях», а также компании, занимающиеся производством систем или программного обеспечения для управления данными, включенные в подотрасль «Производство сис��емного программного обеспечения». @ru
definition: 从事为企业和消费者开发与生产专业应用软件（包括企业与技术软件）的公司。不包括那些归类于“家庭娱乐软件”子行业中的公司，也不包括那些归类于“系统软件”子行业中生产系统和数据库管理软件的公司。
definition: 企業・個人を対象とした特定アプリケーション用ソフトウェアの開発・製造を行う会社。エンタープライズ、テクニカルソフトウ��アを含む。産業サブグループの「ホームエンターテイメント・ソフトウェア」に分類される会社、および「システム・ソフトウェア」に分類されるシステム、データベース管理ソフトウェアを製造する会社は除く。 @ja
definition: 기업 또는 소비자 시장의 전문 애플리케이션을 위한 소프트웨어의 개발 및 제작과 관련된 회사. 엔터프라이즈 및 기술 소프트웨어 포함. ‘홈 엔터테인먼트 소프트웨어’로 분류되는 회사는 제외. 또한 ‘시스템 소프트웨어’으로 분류되는 시스템 또는 데이터베이스 관리 소프트웨어 제작 회사는 제외. @ko
notation: 45103010
valid from: 2016-09-01
valid till: 2018-09-29

系统软件
type: GlobalIndustryClassificationStandardsClassifier
type: SubindustryClassifier
type: NamedIndividual
is contemporary version of: http://data.ga-group.nl/ics/gics/45103020
is replaced by: http://data.ga-group.nl/ics/gics/2018/45103020
is version of: http://data.ga-group.nl/ics/gics/45103020
replaces: http://data.ga-group.nl/ics/gics/2014/45103020
is subindustry of: 軟體
imported on: 2026-05-27T08:45:00.430Z
last refreshed on: 2026-05-31T09:56:08.967Z
source accessed on: 2017-10-19T03:38:21Z
source last accessed on: 2019-06-07T09:41:30Z
label: Logiciels Système @fr
label: Software de Sistemas @pt
label: Software di sistema @it
label: Systems Software @en
label: Производство системного программного обеспечения @ru
label: システム・ソフトウェア @ja
label: 시스템 소프트웨어 @ko
definition: Companies engaged in developing and producing systems and database management software. @en
definition: Empresas envolvidas no desenvolvimento e produção de software de gerenciamento de sistemas e base de dados. @pt
definition: Sociétés spécialisées dans le développement et la production de logiciels de gestion de bases de données et de logiciels système. @fr
definition: Società che si occupano dello sviluppo e della produzione di software di sistema e di gestione dei database. @it
definition: Компании, занимающиеся разработкой и производством систем и программного обеспечения для управления базами данных. @ru
definition: システム・データベース管理ソフトウェアの製造・開発を行う会社。 @ja
definition: 从事开发与生产系统和数据库管理软件的公司。
definition: 시스템과 데이터베이스 관리 소프트웨어 개발 및 제작과 관련된 회사. @ko
notation: 45103020
valid from: 2016-09-01
valid till: 2018-09-29

家庭娱乐软件
type: GlobalIndustryClassificationStandardsClassifier
type: SubindustryClassifier
type: NamedIndividual
is contemporary version of: http://data.ga-group.nl/ics/gics/45103030
is version of: http://data.ga-group.nl/ics/gics/45103030
replaces: http://data.ga-group.nl/ics/gics/2014/45103030
is subindustry of: 軟體
imported on: 2026-05-27T08:45:00.430Z
last refreshed on: 2026-05-31T09:56:08.967Z
source accessed on: 2017-10-19T03:38:21Z
source last accessed on: 2019-06-07T09:41:30Z
label: Home Entertainment Software @en
label: Logiciel de Divertissement à Domicile @fr
label: Software de Entretenimento em Casa @pt
label: Software per Home Entertainment @it
label: Производство программного обеспечения для домашнего пользования в развлекательных целях @ru
label: ホームエンターテイメント・ソフトウェア @ja
label: 홈 엔터테인먼트 소프트웨어 @ko
definition: Fabricantes de software para sistema de entretenimento em casa e software educativo usado principalmente em casa. @pt
definition: Fabricants de logiciels de divertissement à domicile et de logiciels éducatifs, principalement utilisés à la maison. @fr
definition: Manufacturers of home entertainment software and educational software used primarily in the home. @en
definition: Società produttrici di software per Home Entertainment e Educational di utilizzo prevalentemente domestico. @it
definition: Производители программного обеспечения для домашнего пользования в развлекательных целях и программного обеспечения для образовательных целей, используемого преимущественно в домашних условиях. @ru
definition: 主に家庭用のホームエンターテイメント ソフトウェアや教育ソフトウェアの製造会社。 @ja
definition: 开发主要在家中使用的家庭娱乐软件和教育软件的公司。
definition: 주로 가정에서 사용하는 홈 엔터테인먼트 소프트웨어와 교육용 소프트웨어 제작업체. @ko
notation: 45103030
valid from: 2016-09-01
valid till: 2018-09-29

軟體
type: GlobalIndustryClassificationStandardsClassifier
type: IndustryClassifier
type: NamedIndividual
is contemporary version of: http://data.ga-group.nl/ics/gics/451030
is replaced by: http://data.ga-group.nl/ics/gics/2018/451030
is version of: http://data.ga-group.nl/ics/gics/451030
replaces: http://data.ga-group.nl/ics/gics/2014/451030
is industry of: 軟體與服務
imported on: 2026-05-27T08:45:00.430Z
last refreshed on: 2026-05-31T09:56:29.350Z
source accessed on: 2017-10-19T03:34:33Z
source last accessed on: 2019-06-07T09:41:30Z
label: Logiciels @fr
label: Software @de
label: Производство программного обеспечения @ru
label: ソフトウェア @ja
label: 软件
label: 소프트웨어 @ko
notation: 451030
valid from: 2016-09-01
valid till: 2018-09-29

軟體與服務
type: GlobalIndustryClassificationStandardsClassifier
type: IndustryGroupClassifier
type: NamedIndividual
is contemporary version of: http://data.ga-group.nl/ics/gics/4510
is replaced by: http://data.ga-group.nl/ics/gics/2018/4510
is version of: http://data.ga-group.nl/ics/gics/4510
replaces: http://data.ga-group.nl/ics/gics/2014/4510
is industry group of: 信息技术
imported on: 2026-05-27T08:45:00.430Z
last refreshed on: 2026-05-31T09:56:29.350Z
source accessed on: 2017-10-19T03:34:33Z
source last accessed on: 2019-06-07T09:41:30Z
label: Logiciels et Services @fr
label: Software & Dienste @de
label: Software & Services @en
label: Software e Serviços @pt
label: Software e servizi @it
label: Software y Servicios @es
label: Программное обеспечение и услуги @ru
label: ソフトウェア・サービス @ja
label: 软件与服务
label: 소프트웨어와 서비스 @ko
notation: 4510
valid from: 2016-09-01
valid till: 2018-09-29

通信设备
type: GlobalIndustryClassificationStandardsClassifier
type: SubindustryClassifier
type: NamedIndividual
is contemporary version of: http://data.ga-group.nl/ics/gics/45201020
is replaced by: http://data.ga-group.nl/ics/gics/2018/45201020
is version of: http://data.ga-group.nl/ics/gics/45201020
replaces: http://data.ga-group.nl/ics/gics/2014/45201020
is subindustry of: 通信設備
imported on: 2026-05-27T08:45:00.430Z
last refreshed on: 2026-05-31T09:56:08.967Z
source accessed on: 2017-10-19T03:38:21Z
source last accessed on: 2019-06-07T09:41:30Z
label: Apparecchiature di comunicazione @it
label: Communications Equipment @en
label: Equipamento de Comunicações @pt
label: Équipement de Communication @fr
label: Производство оборудования для связи @ru
label: 通信機器 @ja
label: 통신 장비 @ko
definition: Fabricantes de equipamento e produtos de comunicação, incluindo LANs, WANs, roteadores, telefones, mesas telefônicas e fornecedores de serviços de telecomunicações. Exclui fabricantes de telefones celulares classificados na Sub-Indústria de Tecnologia de Hardware, Armazenamento de Dados e Periféricos. @pt
definition: Fabricants d'équipement et de produits de communication (Y compris le réseau local, le réseau étendu, les routeurs, les téléphones, les standards et les centrales téléphoniques). Ne sont pas inclus les fabricants de téléphones mobiles classés dans la sous-industrie de la Technologie du Matériel Informatique, du Stockage et des Périphériques. @fr
definition: LAN, WAN, 라우터, 전화기, 스위치보드, 교환기 등 통신 장비와 제품의 제조업체. ‘기술 하드웨어, 스토리지, & 주변기기’로 분류된 휴대폰 제조업체는 제외 @ko
definition: LAN、WAN、ルータ、電話機、交換台、交換機を含む通信機器や製品の製造会社。産業サブグループの「テクノロッジー ハードウェア・コンピュータ記憶装置・周辺機器」に分類される携帯電話の製造会社は除く。 @ja
definition: Manufacturers of communication equipment and products, including LANs, WANs, routers, telephones, switchboards and exchanges. Excludes cellular phone manufacturers classified in the Technology Hardware, Storage & Peripherals Sub-Industry. @en
definition: Società produttrici di apparecchiature e prodotti di comunicazione, inclusi LAN, WAN, router, apparecchi telefonici, centralini e centrali telefoniche. Sono esclusi i produttori di telefoni cellulari classificati nel gruppo Tecnologia Hardware, Archiviazione dati e Periferiche. @it
definition: Производители оборудования и товаров для связи, в том числе локальных информационных сетей, глобальных информационных сетей, маршрутизаторов, телефонов, коммутационных узлов и автоматических телефонных станций. В данную группу не входят компании, производящие сотовые телефоны, включенные в подотрасль «Аппаратное обеспечение, устройства хранения данных, периферийные устройства». @ru
definition: 通信设备和产品制造商，包括局域网、广域网、路由器、电话机、总机和交换机。不包含归类于“电脑硬件、储存设备及电脑周边”子行业中的手机制造商。
notation: 45201020
valid from: 2016-09-01
valid till: 2018-09-29

通信設備
type: GlobalIndustryClassificationStandardsClassifier
type: IndustryClassifier
type: NamedIndividual
is contemporary version of: http://data.ga-group.nl/ics/gics/452010
is replaced by: http://data.ga-group.nl/ics/gics/2018/452010
is version of: http://data.ga-group.nl/ics/gics/452010
replaces: http://data.ga-group.nl/ics/gics/2014/452010
is industry of: 技术硬件与设备
imported on: 2026-05-27T08:45:00.430Z
last refreshed on: 2026-05-31T09:56:29.350Z
source accessed on: 2017-10-19T03:34:33Z
source last accessed on: 2019-06-07T09:41:30Z
label: Apparecchiature di comunicazione @it
label: Communications Equipment @en
label: Equipamento de Comunicações @pt
label: Equipos de Comunicaciones @es
label: Kommunikationsausrüstung @de
label: Équipement de Communication @fr
label: Производство оборудования для связи @ru
label: 通信機器 @ja
label: 通信设备
label: 통신 장비 @ko
notation: 452010
valid from: 2016-09-01
valid till: 2018-09-29

电脑硬件、储存设备及电脑周边
type: GlobalIndustryClassificationStandardsClassifier
type: SubindustryClassifier
type: NamedIndividual
is contemporary version of: http://data.ga-group.nl/ics/gics/45202030
is replaced by: http://data.ga-group.nl/ics/gics/2018/45202030
is version of: http://data.ga-group.nl/ics/gics/45202030
replaces: http://data.ga-group.nl/ics/gics/2014/45202030
is subindustry of: 电脑与外围设备
imported on: 2026-05-27T08:45:00.430Z
last refreshed on: 2026-05-31T09:56:08.967Z
source accessed on: 2017-10-19T03:38:21Z
source last accessed on: 2019-06-07T09:41:30Z
label: Technologie du Matériel Informatique, du Stockage et des Périphériques @fr
label: Technology Hardware, Storage & Peripherals @en
label: Tecnologia Hardware, di Archiviazione dati e Periferiche @it
label: Tecnologia de Hardware, Armazenamento e Periféricos @pt
label: Аппаратное обеспечение, устройства хранения памяти данных, периферийные устройства @ru
label: テクノロッジー ハードウェア・コンピュータ記憶装置・周辺機器 @ja
label: 기술 하드웨어, 스토리지 & 주변기기 @ko
definition: Fabricantes de telefones celulares, computadores pessoais, servidores, componentes e periféricos para computadores eletrônicos. Inclui componentes de armazenamento de dados, placas-mãe, placas de áudio e de vídeo, monitores, teclados, impressoras e outros periféricos. Exclui os semicondutores, classificados na Sub-Indústria de Semicondutores. @pt
definition: Fabricants de téléphones cellulaires, d’ordinateurs personnels, de serveurs, de composants électroniques pour ordinateurs et périphériques. Sont inclus des composants de stockage de données, des cartes mères, des cartes son et vidéo, des moniteurs, des claviers, des imprimantes et d’autres périphériques. Ne sont pas inclus les semi-conducteurs classés dans la sous-industrie des Semi-conducteurs. @fr
definition: Manufacturers of cellular phones, personal computers, servers, electronic computer components and peripherals. Includes data storage components, motherboards, audio and video cards, monitors, keyboards, printers, and other peripherals. Excludes semiconductors classified in the Semiconductors Sub-Industry. @en
definition: Società produttrici di telefoni cellulari, personal computer, server, componenti e periferiche per computer tra i quali archiviazione dati, schede madre, schede audio e video, schermi, tastiere, stampanti e altre periferiche. Sono esclusi i semiconduttori classificati nel ramo Semiconduttori. @it
definition: Производители сотовых телефонов, персональных компьютеров, серверов, электронных компьютерных компонентов и периферийных устройств. В данную группу входят компании, производящие компоненты хранения данных, материнские платы, аудио- и видеокарты, мониторы, клавиатуры, принтеры и другие периферийные устройства. В данную группу не входят компании, производящие полупроводники, включенные в подотрасль «Производство полупроводников». @ru
definition: 手机，个人电脑，服务器，电子计算机零件及周边产品，如数据存储部件、母板、声卡和显卡、监视器、键盘、打印机和其它外围设备制造商。不包括归类于“半导体产品”子行业中的半导体产品制造商。
definition: 携帯電話、個人コンピュータ、サーバ、電子コンピュータ部品と周辺機器の製造会社。データ保存部品、マザーボード、オーディオ・ビデオカード、モニター、キーボード、プリンタ、他の周辺機器を含む。産業サブグループの「半導体」に分類される半導体製造会社は除く。 @ja
definition: 휴대폰, PC, 서버, 전자 컴퓨터 부품, 주변기기 제조업체. 데이터 스토리지 부품, 마더보드, 오디오와 비디오 카드, 모니터, 키보드, 프린터, 기타 주���기기 포함. ‘반도체’로 분류되는 반도체는 제외. @ko
notation: 45202030
valid from: 2016-09-01
valid till: 2018-09-29

电脑与外围设备
type: GlobalIndustryClassificationStandardsClassifier
type: IndustryClassifier
type: NamedIndividual
is contemporary version of: http://data.ga-group.nl/ics/gics/452020
is replaced by: http://data.ga-group.nl/ics/gics/2018/452020
is version of: http://data.ga-group.nl/ics/gics/452020
replaces: http://data.ga-group.nl/ics/gics/2014/452020
is industry of: 技术硬件与设备
imported on: 2026-05-27T08:45:00.430Z
last refreshed on: 2026-05-31T09:56:29.350Z
source accessed on: 2017-10-19T03:34:33Z
source last accessed on: 2019-06-07T09:41:30Z
label: Equipos Tecnológicos, Almacenamiento Electrónico y Periféricos @es
label: Hardware Technologie, Speicherung & Peripherie @de
label: Technologie du Matériel Informatique, du Stockage et des Périphériques @fr
label: Technology Hardware, Storage & Peripherals @en
label: Tecnologia Hardware, di Archiviazione dati e Periferiche @it
label: Tecnologia de Hardware, Armazenamento e Periféricos @pt
label: Аппаратное обеспечение, устройства хранения памяти данных, периферийные устройства @ru
label: コンピュータ・周辺機器 @ja
label: 電腦與周邊設備
label: 기술 하드웨어, 스토리지 & 주변기기 @ko
notation: 452020
valid from: 2016-09-01
valid till: 2018-09-29

电子设备和仪器
type: GlobalIndustryClassificationStandardsClassifier
type: SubindustryClassifier
type: NamedIndividual
is contemporary version of: http://data.ga-group.nl/ics/gics/45203010
is replaced by: http://data.ga-group.nl/ics/gics/2018/45203010
is version of: http://data.ga-group.nl/ics/gics/45203010
replaces: http://data.ga-group.nl/ics/gics/2014/45203010
is subindustry of: 电子设备、仪器和元件
imported on: 2026-05-27T08:45:00.430Z
last refreshed on: 2026-05-31T09:56:08.967Z
source accessed on: 2017-10-19T03:38:21Z
source last accessed on: 2019-06-07T09:41:30Z
label: Electronic Equipment & Instruments @en
label: Equipamento e Instrumentos Eletrônicos @pt
label: Strumenti e apparecchiature elettronici @it
label: Équipement et Instruments Électroniques @fr
label: Производство электронного оборудования и приборов @ru
label: 電子装置・機器 @ja
label: 전자 장비와 기기 @ko
definition: Fabricantes de equipamento e instrumentos eletrônicos, incluindo instrumentos eletrônicos de testes, instrumentos analíticos e de medições, produtos de scanner/código de barras, lasers, telas, máquinas de ponto-de-venda e equipamento de sistema de segurança. @pt
definition: Fabricants d'équipement et d’instruments électroniques, y compris les instruments analytiques, de test électronique et de mesure, les scanners/lecteurs de code-barres, les lasers, les écrans d'affichage, les équipements du point de vente et les systèmes de sécurité. @fr
definition: Manufacturers of electronic equipment and instruments including analytical, electronic test and measurement instruments, scanner/barcode products, lasers, display screens, point-of-sales machines, and security system equipment. @en
definition: Produttori di strumenti e apparecchiature elettroniche compresi strumenti di misurazione, test elettronici e analitici, prodotti per scansione e codici a barre, laser, schermi video, macchine per punti vendita e apparecchiature per sistemi di sicurezza. @it
definition: Производители электронного оборудования и приборов, в том числе анализаторов, электронных контрольно-измерительных приборов, устройств считывания/устройств работы со штрих-кодами, лазеров, устройств отображения, кассовых терминалов и оборудования систем безопасности. @ru
definition: 分析用電子試験・計測装置、スキャナー/バーコード製品、レーザー、表示装置、POS機器、および警報システム機器を含む電子機器・装置の製造業者。 @ja
definition: 电子设备和仪器制造商，包括生产应用于太阳能行业原材料和设备的公司。
definition: 분석, 전자 시험, 측정 기기, 스캐너/바코드 제품, 레이저, 디스플레이 화면, POS 기계, 보안 시스템 장비를 포함한 전자 장비와 기기 제조업체. @ko
notation: 45203010
valid from: 2016-09-01
valid till: 2018-09-29

电子元件
type: GlobalIndustryClassificationStandardsClassifier
type: SubindustryClassifier
type: NamedIndividual
is contemporary version of: http://data.ga-group.nl/ics/gics/45203015
is replaced by: http://data.ga-group.nl/ics/gics/2018/45203015
is version of: http://data.ga-group.nl/ics/gics/45203015
replaces: http://data.ga-group.nl/ics/gics/2014/45203015
is subindustry of: 电子设备、仪器和元件
imported on: 2026-05-27T08:45:00.430Z
last refreshed on: 2026-05-31T09:56:08.967Z
source accessed on: 2017-10-19T03:38:21Z
source last accessed on: 2019-06-07T09:41:30Z
label: Componente Eletrônicos @pt
label: Componenti elettronici @it
label: Composants Électroniques @fr
label: Electronic Components @en
label: Производство электронных компонентов @ru
label: 電子部品 @ja
label: 전자 부품 @ko
definition: Fabricantes de componentes eletrônicos. Inclui componentes eletrônicos, dispositivos de conexão, tubos catódicos, resistores e capacitores eletrônicos, bobinas eletrônicas, placas de circuito impresso, transformadores e outros indutores, componentes/tecnologia de processamento de sinais. @pt
definition: Fabricants de composants électroniques. Sont inclus les composants électroniques, les dispositifs de connexion, les tubes électroniques, les condensateurs et résistances électroniques, les bobines électroniques, les cartes de circuit imprimé, les transformateurs et autres bobines d'induction, la technologie/les composants de traitement des signaux. @fr
definition: Manufacturers of electronic components. Includes electronic components, connection devices, electron tubes, electronic capacitors and resistors, electronic coil, printed circuit board, transformer and other inductors, signal processing technology/components. @en
definition: Produttori di componenti elettronici. Sono inclusi componenti elettronici, dispositivi di connessione, provette per elettroni, resistenze e capacitatori elettronici, bobine elettroniche, schede a circuiti stampati, trasformatori e altri induttori, tecnologie e componenti di elaborazione dei segnali. @it
definition: Производители электронных компонентов, в том числе соединительных устройств, ЭЛТ, электронных конденсаторов, резисторов, электронных катушек, печатных плат, трансформаторов и других индукторов, а также технологий/компонентов обработки сигнала и другого электронного оборудования, не включенного в другие группы. @ru
definition: 电子元件制造商。包括太阳能组件和电池。
definition: 電子コンポーネントの製造業者。電子部品、配線装置、電子管、電子コンデンサおよび抵抗器、電子コイル、 プリント配線板、変圧器・その��インダクタ、信号処理技術/部品、および他のグループに分類されていないその他電子機器を含む。 @ja
definition: 전자 부품 제조업체. 전자 부품, 연결 장치, 전자관, 전자 콘덴서와 저항기, 전자 코일, 인쇄 회로 기판, 변압기와 기타 인덕터, 신호 처리 기술/부품, 다른 부문으로 분류되지 않은 기타 전자 장비를 포함. @ko
notation: 45203015
valid from: 2016-09-01
valid till: 2018-09-29

电子制造服务
type: GlobalIndustryClassificationStandardsClassifier
type: SubindustryClassifier
type: NamedIndividual
is contemporary version of: http://data.ga-group.nl/ics/gics/45203020
is replaced by: http://data.ga-group.nl/ics/gics/2018/45203020
is version of: http://data.ga-group.nl/ics/gics/45203020
replaces: http://data.ga-group.nl/ics/gics/2014/45203020
is subindustry of: 电子设备、仪器和元件
imported on: 2026-05-27T08:45:00.430Z
last refreshed on: 2026-05-31T09:56:08.967Z
source accessed on: 2017-10-19T03:38:21Z
source last accessed on: 2019-06-07T09:41:30Z
label: Electronic Manufacturing Services @en
label: Serviços de Fabricação de Eletrônicos @pt
label: Services de Fabrication Électronique @fr
label: Servizi di produzione elettronica @it
label: Предоставление услуг по производству электронного оборудования @ru
label: 電子製品製造サービス @ja
label: 전자 제조 서비스 @ko
definition: Fabricants d'équipements électroniques destinés principalement aux marchés des Fabricants d’Équipement d’Origine. @fr
definition: Producers of electronic equipment mainly for the OEM (Original Equipment Manufacturers) markets. @en
definition: Produtores de equipamento eletrônico principalmente para mercados de OEM (fabricante de equipamento de origem). @pt
definition: Società produttrici di apparecchiature elettroniche principalmente per i mercati OEM (Original Equipment Manufacturers). @it
definition: Производители электронного оборудования преимущественно для компаний, продающих изделия других фирм под собственной маркой. @ru
definition: 主にOEM（他社ブランドで販売される製品を製造する会社）として供給を行う電子機器製造会社。 @ja
definition: 主要为OEM（原始设备制造商）市场生产电子设备的公司。
definition: 주로 OEM(주문자상표부착생산) 시장을 위한 전자 장비를 생산하는 업체. @ko
notation: 45203020
valid from: 2016-09-01
valid till: 2018-09-29

技术产品经销商
type: GlobalIndustryClassificationStandardsClassifier
type: SubindustryClassifier
type: NamedIndividual
is contemporary version of: http://data.ga-group.nl/ics/gics/45203030
is replaced by: http://data.ga-group.nl/ics/gics/2018/45203030
is version of: http://data.ga-group.nl/ics/gics/45203030
replaces: http://data.ga-group.nl/ics/gics/2014/45203030
is subindustry of: 电子设备、仪器和元件
imported on: 2026-05-27T08:45:00.430Z
last refreshed on: 2026-05-31T09:56:08.967Z
source accessed on: 2017-10-19T03:38:21Z
source last accessed on: 2019-06-07T09:41:30Z
label: Distribuidores de Tecnologia @pt
label: Distributeurs de Technologie @fr
label: Distributori di tecnologia @it
label: Technology Distributors @en
label: Дистрибьюторы высокотехнологичной продукции @ru
label: テクノロジー ディストリビュータ @ja
label: 기술 판매업체 @ko
definition: Distribuidores de equipamento e hardware de tecnologia. Inclui distribuidores de equipamento de comunicações, computadores e periféricos, semicondutores, e componentes e equipamento eletrônico. @pt
definition: Distributeurs de matériel et d'équipement technologique. Sont inclus les distributeurs d'équipement de communication, d'ordinateurs et de périphériques, de semi-conducteurs, de composants et d'équipement électroniques. @fr
definition: Distributors of technology hardware and equipment. Includes distributors of communications equipment, computers & peripherals, semiconductors, and electronic equipment and components. @en
definition: Società distributrici di hardware e apparecchiature tecnologiche. Sono inclusi i distributori di apparecchiature per telecomunicazioni, computer e periferiche, semiconduttori ed apparecchiature e componenti elettronici. @it
definition: Дистрибьюторы высокотехнологичных аппаратных средств и оборудования, в том числе оборудования для связи, компьютеров и периферийных устройств, полупроводников и электронной аппаратуры и комплектующих. @ru
definition: テクノロジー・ハードウェアおよび機器のディストリビュータ。電子通信機器、コンピュータおよび周辺機器、半導体、電子機器や部品のディストリビュータを含む。 @ja
definition: 技术硬件和设备经销商。包括经销通信设备、电脑及外围设备、半导体产品和电子设备及元器件的公司。
definition: 기술 하드웨어와 장비 판매업체. 통신 장비, 컴퓨터와 주변기기, 반도체, 전자 장비와 부품 판매업체 포함. @ko
notation: 45203030
valid from: 2016-09-01
valid till: 2018-09-29

电子设备、仪器和元件
type: GlobalIndustryClassificationStandardsClassifier
type: IndustryClassifier
type: NamedIndividual
is contemporary version of: http://data.ga-group.nl/ics/gics/452030
is replaced by: http://data.ga-group.nl/ics/gics/2018/452030
is version of: http://data.ga-group.nl/ics/gics/452030
replaces: http://data.ga-group.nl/ics/gics/2014/452030
is industry of: 技术硬件与设备
imported on: 2026-05-27T08:45:00.430Z
last refreshed on: 2026-05-31T09:56:29.350Z
source accessed on: 2017-10-19T03:34:33Z
source last accessed on: 2019-06-07T09:41:30Z
label: Componenti, strumenti e apparecchiature elettronici @it
label: Electronic Equipment, Instruments & Components @en
label: Elektronische Geräte, Instrumente & Komponenten @de
label: Equipamento, Instrumentos e Componentes Eletrônicos @pt
label: Equipos, Instrumentos y Componentes Electrónicos @es
label: Équipement, Instruments et Composants Électroniques @fr
label: Производство электронного оборудования, приборов и деталей @ru
label: 電子装置・機器・部品 @ja
label: 電子設備、儀器與元件
label: 전자 장비와 기기, 부품 @ko
notation: 452030
valid from: 2016-09-01
valid till: 2018-09-29

技术硬件与设备
type: GlobalIndustryClassificationStandardsClassifier
type: IndustryGroupClassifier
type: NamedIndividual
is contemporary version of: http://data.ga-group.nl/ics/gics/4520
is replaced by: http://data.ga-group.nl/ics/gics/2018/4520
is version of: http://data.ga-group.nl/ics/gics/4520
replaces: http://data.ga-group.nl/ics/gics/2014/4520
is industry group of: 信息技术
imported on: 2026-05-27T08:45:00.430Z
last refreshed on: 2026-05-31T09:56:29.350Z
source accessed on: 2017-10-19T03:34:33Z
source last accessed on: 2019-06-07T09:41:30Z
label: Equipos Tecnológico y Maquinarias @es
label: Hardware & Ausrüstung @de
label: Matériel et Équipement Liés Aux Technologies de l’Information @fr
label: Technology Hardware & Equipment @en
label: Tecnologia de Hardware e Equipamentos @pt
label: Tecnologia hardware e apparecchiature @it
label: Производство высокотехнологичных аппаратных средств и оборудования @ru
label: テクノロジー・ハードウェアおよび機器 @ja
label: 技術硬體與設備
label: 기술 하드웨어와 장비 @ko
notation: 4520
valid from: 2016-09-01
valid till: 2018-09-29

半导体设备
type: GlobalIndustryClassificationStandardsClassifier
type: SubindustryClassifier
type: NamedIndividual
is contemporary version of: http://data.ga-group.nl/ics/gics/45301010
is replaced by: http://data.ga-group.nl/ics/gics/2018/45301010
is version of: http://data.ga-group.nl/ics/gics/45301010
replaces: http://data.ga-group.nl/ics/gics/2014/45301010
is subindustry of: 半导体产品与设备
imported on: 2026-05-27T08:45:00.430Z
last refreshed on: 2026-05-31T09:56:08.967Z
source accessed on: 2017-10-19T03:38:21Z
source last accessed on: 2019-06-07T09:41:30Z
label: Apparecchiature con semiconduttori @it
label: Equipamento de Semicondutores @pt
label: Semiconductor Equipment @en
label: Équipement de Semi-conducteurs @fr
label: Производство полупроводникового оборудования @ru
label: 半導体装置 @ja
label: 반도체 장비 @ko
definition: Fabricantes de equipamento de semicondutores, incluindo fabricantes de matéria prima e equipamento usado na indústria de energia solar. @pt
definition: Fabricants d'équipement de semi-conducteurs. Sont inclus les fabricants de matières premières et de l'équipement utilisé dans l'industrie de l'énergie solaire. @fr
definition: Manufacturers of semiconductor equipment, including manufacturers of the raw material and equipment used in the solar power industry. @en
definition: Societa' produttrici di apparecchiature con semiconduttori, incluse societa' produttrici di materie prime ed attrezzature usate nel settore dell'energia solare. @it
definition: Производители полупроводникового оборудования, включая производителей сырья и оборудования, используемых в солнечной энергетике. @ru
definition: 半导体设备制造商。
definition: 半導体装置の製造会社。太陽エネルギー業界に使われる装置及び原材料の製造会社を含む。 @ja
definition: 태양열 산업에 사용되는 원자재 및 설비 제조사를 포함한 반도체 설비 제조사 @ko
notation: 45301010
valid from: 2016-09-01
valid till: 2018-09-29

半导体产品
type: GlobalIndustryClassificationStandardsClassifier
type: SubindustryClassifier
type: NamedIndividual
is contemporary version of: http://data.ga-group.nl/ics/gics/45301020
is replaced by: http://data.ga-group.nl/ics/gics/2018/45301020
is version of: http://data.ga-group.nl/ics/gics/45301020
replaces: http://data.ga-group.nl/ics/gics/2014/45301020
is subindustry of: 半导体产品与设备
imported on: 2026-05-27T08:45:00.430Z
last refreshed on: 2026-05-31T09:56:08.967Z
source accessed on: 2017-10-19T03:38:21Z
source last accessed on: 2019-06-07T09:41:30Z
label: Semi-conducteurs @fr
label: Semiconductors @en
label: Semicondutores @pt
label: Semiconduttori @it
label: Производство полупроводников @ru
label: 半導体 @ja
label: 반도체 @ko
definition: Fabricantes de semicondutores e produtos relacionados, incluindo fabricantes de células e módulos solares. @pt
definition: Fabricants de semi-conducteurs et de produits connexes, y compris les fabricants de modules solaires et de photopiles. @fr
definition: Manufacturers of semiconductors and related products, including manufacturers of solar modules and cells. @en
definition: Società produttrici di semiconduttori e prodotti affini, incluse societa' produttrici di moduli e celle solari. @it
definition: Производители полупроводников и сопутствующих товаров, включая производит��лей солнечных модулей и батарей. @ru
definition: 半导体产品及相关产品制造商。
definition: 半導体および関連製品の製造会社。太陽電池モジュール及び太陽電池の製造会社を含む。 @ja
definition: 태양 모듈 및 셀 제조사 포함한 반도체 및 관련 상품 제조사 @ko
notation: 45301020
valid from: 2016-09-01
valid till: 2018-09-29

半导体产品与设备
type: GlobalIndustryClassificationStandardsClassifier
type: IndustryClassifier
type: NamedIndividual
is contemporary version of: http://data.ga-group.nl/ics/gics/453010
is replaced by: http://data.ga-group.nl/ics/gics/2018/453010
is version of: http://data.ga-group.nl/ics/gics/453010
replaces: http://data.ga-group.nl/ics/gics/2014/453010
is industry of: 半导体产品与设备
imported on: 2026-05-27T08:45:00.430Z
last refreshed on: 2026-05-31T09:56:29.350Z
source accessed on: 2017-10-19T03:34:33Z
source last accessed on: 2019-06-07T09:41:30Z
label: Halbleiter & Geräte zur Halbleiterproduktion @de
label: Semi-conducteurs et Équipement de Semi-conducteurs @fr
label: Semiconductores y Equipos Relacionados @es
label: Semiconductors & Semiconductor Equipment @en
label: Semicondutores e Equipamento de Semicondutores @pt
label: Semiconduttori e apparecchiature con semiconduttori @it
label: Производство полупроводников и полупроводникового оборудования @ru
label: 半導体・半導体製造装置 @ja
label: 半導體產品與設備
label: 반도체와 반도체 장비 @ko
notation: 453010
valid from: 2016-09-01
valid till: 2018-09-29

半导体产品与设备
type: GlobalIndustryClassificationStandardsClassifier
type: IndustryGroupClassifier
type: NamedIndividual
is contemporary version of: http://data.ga-group.nl/ics/gics/4530
is replaced by: http://data.ga-group.nl/ics/gics/2018/4530
is version of: http://data.ga-group.nl/ics/gics/4530
replaces: http://data.ga-group.nl/ics/gics/2014/4530
is industry group of: 信息技术
imported on: 2026-05-27T08:45:00.430Z
last refreshed on: 2026-05-31T09:56:29.350Z
source accessed on: 2017-10-19T03:34:33Z
source last accessed on: 2019-06-07T09:41:30Z
label: Halbleiter & Geräte zur Halbleiterproduktion @de
label: Semi-conducteurs et Équipement de Semi-conducteurs @fr
label: Semiconductores y Equipos Relacionados @es
label: Semiconductors & Semiconductor Equipment @en
label: Semicondutores e Equipamento de Semicondutores @pt
label: Semiconduttori e apparecchiature con semiconduttori @it
label: Производство полупроводников и полупроводникового оборудования @ru
label: 半導体・半導体製造装置 @ja
label: 半導體產品與設備
label: 반도체와 반도체 장비 @ko
notation: 4530
valid from: 2016-09-01
valid till: 2018-09-29

信息技术
type: GlobalIndustryClassificationStandardsClassifier
type: SectorClassifier
type: NamedIndividual
is contemporary version of: http://data.ga-group.nl/ics/gics/45
is replaced by: http://data.ga-group.nl/ics/gics/2018/45
is version of: http://data.ga-group.nl/ics/gics/45
replaces: http://data.ga-group.nl/ics/gics/2014/45
imported on: 2026-05-27T08:45:00.430Z
last refreshed on: 2026-05-31T09:56:29.350Z
source accessed on: 2017-10-19T03:34:33Z
source last accessed on: 2019-06-07T09:41:30Z
label: IT @de
label: Informatica @it
label: Information Technology @en
label: Technologies de l'Information @fr
label: Tecnologías de la Información @es
label: Tecnologia da Informação @pt
label: Информационные технологии @ru
label: 情報技術 @ja
label: 資訊技術
label: 정보 기술 @ko
notation: 45
valid from: 2016-09-01
valid till: 2018-09-29

非传统电信运营商
type: GlobalIndustryClassificationStandardsClassifier
type: SubindustryClassifier
type: NamedIndividual
is contemporary version of: http://data.ga-group.nl/ics/gics/50101010
is replaced by: http://data.ga-group.nl/ics/gics/2018/50101010
is version of: http://data.ga-group.nl/ics/gics/50101010
replaces: http://data.ga-group.nl/ics/gics/2014/50101010
is subindustry of: 綜合電信業務
imported on: 2026-05-27T08:45:00.430Z
last refreshed on: 2026-05-31T09:56:08.967Z
source accessed on: 2017-10-19T03:38:21Z
source last accessed on: 2019-06-07T09:41:30Z
label: Alternative Carriers @en
label: Carrier alternativi @it
label: Operadoras Alternativas @pt
label: Prestataires de services alternatifs @fr
label: Предоставление услуг альтернативной связи @ru
label: 代替通信事業会社 @ja
label: 대안 통신업체 @ko
definition: Prestataires de services de communication et de transmission de données à haut débit grâce principalement à un réseau de câbles en fibres optiques/à bande passante élevée. @fr
definition: Provedores principalmente de serviços de comunicações e transmissão de dados de alta densidade através de uma alta largura de banda/rede de cabo de fibra ótica. @pt
definition: Providers of communications and high-density data transmission services primarily through a high bandwidth/fiber-optic cable network. @en
definition: Società che gestiscono servizi di comunicazione e trasmissione dati a elevata densità, principalmente tramite una rete di cavi a banda larga e a fibre ottiche. @it
definition: Компании, занимающиеся предоставлением услуг связи и передачей данных с высокой плотностью, преимущественно при помощи широкополосных сетей и оптоволоконных кабелей. @ru
definition: 主に広帯域、および光ファイバ・ケーブルネットワークを利用して通信・高密度データ送信サービスを提供する業者。 @ja
definition: 通过高带宽/光缆网络提供通信和海量数据传输业务的公司。
definition: 주로 고 대역폭/광섬유 케이블 네트워크를 통해 통신과 고밀도 데이터 전송 서비스를 제공하는 업체. @ko
notation: 50101010
valid from: 2016-09-01
valid till: 2018-09-29

综合电信业务
type: GlobalIndustryClassificationStandardsClassifier
type: SubindustryClassifier
type: NamedIndividual
is contemporary version of: http://data.ga-group.nl/ics/gics/50101020
is replaced by: http://data.ga-group.nl/ics/gics/2018/50101020
is version of: http://data.ga-group.nl/ics/gics/50101020
replaces: http://data.ga-group.nl/ics/gics/2014/50101020
is subindustry of: 綜合電信業務
imported on: 2026-05-27T08:45:00.430Z
last refreshed on: 2026-05-31T09:56:08.967Z
source accessed on: 2017-10-19T03:38:21Z
source last accessed on: 2019-06-07T09:41:30Z
label: Integrated Telecommunication Services @en
label: Serviços Integrados de Telecomunicações @pt
label: Services de Télécommunication Intégrés @fr
label: Servizi integrati di telecomunicazione @it
label: Предоставление комплексных телекоммуникационных услуг @ru
label: 総合電気通信サービス @ja
label: 통합 전기통신 서비스 @ko
definition: Gérants de réseaux de télécommunication principalement fixes et entreprises fournissant des services de télécommunication fixe et mobile n'appartenant à aucune autre classification. @fr
definition: Operadores principalmente de redes de telecomunicações de linha fixa e empresas prestadoras de serviços de telecomunicações sem fio e de linha fixa não classificadas em outros lugares. @pt
definition: Operatori di reti di telecomunicazione fisse, nonché società che forniscono servizi di telecomunicazione sia wireless sia a rete fissa non classificate altrove. @it
definition: Operators of primarily fixed-line telecommunications networks and companies providing both wireless and fixed-line telecommunications services not classified elsewhere. @en
definition: Операторы, занимающиеся в основном эксплуатацией сетей проводной связи, а также компании, предоставляющие услуги проводной и беспроводной связи, не включенные в другие группы. @ru
definition: 主に固定回線電気通信ネットワークサービスを提供する業者、および他のグループに分類されていないワイヤレス、固定回線電気通信サービスの双方を提供する会社。 @ja
definition: 主要指固定电信网络运营商以及提供无线和固话电信业务（未归类于别处）的公司。
definition: 주로 유선 전기통신 네트워크를 운영하는 업체, 그리고 다른 부문으로 분류되지 않은 무선 및 유선 전기통신 서비스를 함께 제공하는 업체. @ko
notation: 50101020
valid from: 2016-09-01
valid till: 2018-09-29

綜合電信業務
type: GlobalIndustryClassificationStandardsClassifier
type: IndustryClassifier
type: NamedIndividual
is contemporary version of: http://data.ga-group.nl/ics/gics/501010
is replaced by: http://data.ga-group.nl/ics/gics/2018/501010
is version of: http://data.ga-group.nl/ics/gics/501010
replaces: http://data.ga-group.nl/ics/gics/2014/501010
is industry of: 电信业务
imported on: 2026-05-27T08:45:00.430Z
last refreshed on: 2026-05-31T09:56:29.350Z
source accessed on: 2017-10-19T03:34:33Z
source last accessed on: 2019-06-07T09:41:30Z
label: Diverse Telekommunikationsdienste @de
label: Diversified Telecommunication Services @en
label: Serviços Diversificados de Telecomunicações @pt
label: Services de Télécommunication Diversifiés @fr
label: Servicios de Telecomunicaciones Diversos @es
label: Servizi di telecomunicazione diversificati @it
label: Предоставление разнообразных услуг в области телекоммуникации @ru
label: 各種電気通信サービス @ja
label: 综合电信业务
label: 다양한 전기통신 서비스 @ko
notation: 501010
valid from: 2016-09-01
valid till: 2018-09-29

无线电信业务
type: GlobalIndustryClassificationStandardsClassifier
type: SubindustryClassifier
type: NamedIndividual
is contemporary version of: http://data.ga-group.nl/ics/gics/50102010
is replaced by: http://data.ga-group.nl/ics/gics/2018/50102010
is version of: http://data.ga-group.nl/ics/gics/50102010
replaces: http://data.ga-group.nl/ics/gics/2014/50102010
is subindustry of: 无线电信业务
imported on: 2026-05-27T08:45:00.430Z
last refreshed on: 2026-05-31T09:56:08.967Z
source accessed on: 2017-10-19T03:38:21Z
source last accessed on: 2019-06-07T09:41:30Z
label: Serviços de Telecomunicações sem Fio @pt
label: Services de Télécommunication Sans Fil @fr
label: Servizi di telecomunicazione senza fili (wireless) @it
label: Wireless Telecommunication Services @en
label: Предоставление услуг беспроводной связи @ru
label: 無線通信サービス @ja
label: 무선 전기통신 서비스 @ko
definition: Provedores principalmente de serviços de celulares ou de telecomunicações sem fio, incluindo serviços de paging. @pt
definition: Providers of primarily cellular or wireless telecommunication services, including paging services. @en
definition: Sociétés qui fournissent principalement des services de télécommunication sans fil ou de téléphonie mobile, y compris les services de radiomessagerie. @fr
definition: Società che forniscono principalmente servizi di telecomunicazione cellulare o wireless, inclusi i servizi cercapersone. @it
definition: Компании, занимающиеся в основном предоставлением услуг беспроводной, в том числе пейджинговой, связи. @ru
definition: 主に携帯無線・ワイヤレス電気通信サービスを提供する業者。ページング（呼び出し）サービスを含む。 @ja
definition: 主要指提供蜂窝或无线电信业���（包括寻呼业务）的公司。
definition: 호출기 서비스를 포함해서 주로 휴대폰이나 무선 전기통신 서비스를 제공하는 업체. @ko
notation: 50102010
valid from: 2016-09-01
valid till: 2018-09-29

无线电信业务
type: GlobalIndustryClassificationStandardsClassifier
type: IndustryClassifier
type: NamedIndividual
is contemporary version of: http://data.ga-group.nl/ics/gics/501020
is replaced by: http://data.ga-group.nl/ics/gics/2018/501020
is version of: http://data.ga-group.nl/ics/gics/501020
replaces: http://data.ga-group.nl/ics/gics/2014/501020
is industry of: 电信业务
imported on: 2026-05-27T08:45:00.430Z
last refreshed on: 2026-05-31T09:56:29.350Z
source accessed on: 2017-10-19T03:34:33Z
source last accessed on: 2019-06-07T09:41:30Z
label: Drahtlose Telekommunikationsdienste @de
label: Serviços de Telecomunicações sem Fio @pt
label: Services de Télécommunication Sans Fil @fr
label: Servicios de Telecomunicación Inalámbrica @es
label: Servizi di telecomunicazione senza fili (wireless) @it
label: Wireless Telecommunication Services @en
label: Предоставление услуг беспроводной связи @ru
label: 無綫電信業務
label: 無線通信サービス @ja
label: 무선 전기통신 서비스 @ko
notation: 501020
valid from: 2016-09-01
valid till: 2018-09-29

电信业务
type: GlobalIndustryClassificationStandardsClassifier
type: IndustryGroupClassifier
type: NamedIndividual
is contemporary version of: http://data.ga-group.nl/ics/gics/5010
is replaced by: http://data.ga-group.nl/ics/gics/2018/5010
is version of: http://data.ga-group.nl/ics/gics/5010
replaces: http://data.ga-group.nl/ics/gics/2014/5010
is industry group of: 电信业务
imported on: 2026-05-27T08:45:00.430Z
last refreshed on: 2026-05-31T09:56:29.350Z
source accessed on: 2017-10-19T03:34:33Z
source last accessed on: 2019-06-07T09:41:30Z
label: Serviços de Telecomunicações @pt
label: Services de Télécommunication @fr
label: Servicios de Telecomunicaciones @es
label: Servizi di telecomunicazione @it
label: Telecommunication Services @en
label: Telekommunikationsdienste @de
label: Предоставление телекоммуникационных услуг @ru
label: 電信業務
label: 電気通信サービス @ja
label: 전기통신 서비스 @ko
notation: 5010
valid from: 2016-09-01
valid till: 2018-09-29

电信业务
type: GlobalIndustryClassificationStandardsClassifier
type: SectorClassifier
type: NamedIndividual
is contemporary version of: http://data.ga-group.nl/ics/gics/50
is replaced by: http://data.ga-group.nl/ics/gics/2018/50
is version of: http://data.ga-group.nl/ics/gics/50
replaces: http://data.ga-group.nl/ics/gics/2014/50
imported on: 2026-05-27T08:45:00.430Z
last refreshed on: 2026-05-31T09:56:29.350Z
source accessed on: 2017-10-19T03:34:33Z
source last accessed on: 2019-06-07T09:41:30Z
label: Serviços de Telecomunicações @pt
label: Services de Télécommunication @fr
label: Servicios de Telecomunicaciones @es
label: Servizi di telecomunicazione @it
label: Telecommunication Services @en
label: Telekommunikationsdienste @de
label: Предоставление телекоммуникационных услуг @ru
label: 電信業務
label: 電気通信サービス @ja
label: 전기통신 서비스 @ko
notation: 50
valid from: 2016-09-01
valid till: 2018-09-29

电力公用事业
type: GlobalIndustryClassificationStandardsClassifier
type: SubindustryClassifier
type: NamedIndividual
is contemporary version of: http://data.ga-group.nl/ics/gics/55101010
is replaced by: http://data.ga-group.nl/ics/gics/2018/55101010
is version of: http://data.ga-group.nl/ics/gics/55101010
replaces: http://data.ga-group.nl/ics/gics/2014/55101010
is subindustry of: 电力公用事业
imported on: 2026-05-27T08:45:00.430Z
last refreshed on: 2026-05-31T09:56:08.967Z
source accessed on: 2017-10-19T03:38:21Z
source last accessed on: 2019-06-07T09:41:30Z
label: Aziende di gestione dell'energia elettrica @it
label: Electric Utilities @en
label: Serviços de Eletricidade @pt
label: Électricité @fr
label: Электроснабжение @ru
label: 電力 @ja
label: 전기 공익 사업체 @ko
definition: Companies that produce or distribute electricity. Includes both nuclear and non-nuclear facilities. @en
definition: Empresas que produzem ou distribuem eletricidade. Inclui instalações nucleares e não nucleares. @pt
definition: Sociétés qui produisent ou distribuent l'électricité. Sont incluses à la fois les centrales nucléaires et non nucléaires. @fr
definition: Società che producono o distribuiscono l'energia elettrica. Sono inclusi impianti di produzione sia nucleare sia convenzionale. @it
definition: Компании, занимающиеся производством или распределением электроэнергии. В данную группу входят объекты атомной и неатомной энергетики. @ru
definition: 发电和配电公司。包括核子及非核子设施。
definition: 電気を製造または供給する会社。原子力施設、非原子力施設の両方を含む。 @ja
definition: 전기를 생산 또는 배급하는 회사. 핵 및 비핵 시설 모두 포함. @ko
notation: 55101010
valid from: 2016-09-01
valid till: 2018-09-29

电力公用事业
type: GlobalIndustryClassificationStandardsClassifier
type: IndustryClassifier
type: NamedIndividual
is contemporary version of: http://data.ga-group.nl/ics/gics/551010
is replaced by: http://data.ga-group.nl/ics/gics/2018/551010
is version of: http://data.ga-group.nl/ics/gics/551010
replaces: http://data.ga-group.nl/ics/gics/2014/551010
is industry of: 公用事业
imported on: 2026-05-27T08:45:00.430Z
last refreshed on: 2026-05-31T09:56:29.350Z
source accessed on: 2017-10-19T03:34:33Z
source last accessed on: 2019-06-07T09:41:30Z
label: Electric Utilities @en
label: Elettricità @it
label: Serviços de Eletricidade @pt
label: Stromversorgungsbetriebe @de
label: Suministro Eléctrico @es
label: Électricité @fr
label: Электроснабжение @ru
label: 電力 @ja
label: 電力公用事業
label: 전기 공익 사업체 @ko
notation: 551010
valid from: 2016-09-01
valid till: 2018-09-29

燃气公用事业
type: GlobalIndustryClassificationStandardsClassifier
type: SubindustryClassifier
type: NamedIndividual
is contemporary version of: http://data.ga-group.nl/ics/gics/55102010
is replaced by: http://data.ga-group.nl/ics/gics/2018/55102010
is version of: http://data.ga-group.nl/ics/gics/55102010
replaces: http://data.ga-group.nl/ics/gics/2014/55102010
is subindustry of: 燃气公用事业
imported on: 2026-05-27T08:45:00.430Z
last refreshed on: 2026-05-31T09:56:08.967Z
source accessed on: 2017-10-19T03:38:21Z
source last accessed on: 2019-06-07T09:41:30Z
label: Aziende di gestione della distribuzione del gas @it
label: Gas Utilities @en
label: Gaz @fr
label: Serviços de Gás @pt
label: Газоснабжение @ru
label: ガス @ja
label: 가스 공익 사업체 @ko
definition: Companies whose main charter is to distribute and transmit natural and manufactured gas. Excludes companies primarily involved in gas exploration or production classified in the Oil & Gas Exploration & Production Sub-Industry. Also excludes diversified midstream natural gas companies classified in the Oil & Gas Storage & Transportation Sub-Industry. @en
definition: Empresas cujo estatuto principal é distribuir e transmitir gás natural e manufaturado. Exclui empresas envolvidas principalmente na exploração ou produção de gás classificadas na Sub-Indústria de Exploração e Produção de Petróleo e Gás. Também exclui empresas de porte médio e diversificadas de gás natural classificadas na Sub-Indústria de Armazenagem e Transporte de Petróleo e Gás. @pt
definition: Sociétés spécialisées dans la distribution et la transmission de gaz naturel et de gaz fabriqué. Ne sont pas incluses les sociétés principalement spécialisées dans l'exploration et la production de gaz, classées dans la sous-industrie de l’Exploration et Production de Pétrole et de Gaz. Ne sont pas également incluses les sociétés de gaz naturel diversifiées du secteur médian, classées dans la sous-industrie du Stockage et Transport de Pétrole et de Gaz. @fr
definition: Società la cui attività principale è quella di distribuire e trasferire gas naturale e lavorato. Sono escluse le società operanti prevalentemente nel settore della ricerca e della produzione di gas classificate nel ramo Ricerca e produzione di petrolio e gas. Inoltre, sono escluse le società produttrici di gas naturale di livello diversificato, classificate nel ramo Raffinazione, commercializzazione, stoccaggio e trasporto di prodotti petroliferi e gas. @it
definition: Компании, занимающиеся в основном распределением и передачей природного и искусственного газа. В данную группу не входят компании, занимающиеся добычей или производством газа, включенные в подотрасл�� «Разведка и добыча нефти и газа», а также диверсифицированные компании по эксплуатации газопроводов, включенные в подотрасль «Переработка, сбыт и транспортировка нефти и газа». @ru
definition: 包括主要任务为配送天然气和人工煤气的公司。不包括那些归类于“石油与天然气的勘探与生产”子行业中主要从事天然气勘探和生产的公司，也不包括那些归类于“石油与天然气的炼制、销售和运输”子行业中的各类处于市场中游的天然气公司。
definition: 天然ガス・精製ガスの供給・輸送を主に行う会社。産業サブグ��ープの「石油・ガス探査・開発」に分類されるガス探査や開発を主に行う会社は除く。また、「石油・ガス精製・販売・輸送」に分類されるその他中流（ミッドストリーム）天然ガス供給会社も除く。 @ja
definition: 천연 및 제조 가스를 배급하고 전달하는 것이 주 업무인 회사. ‘석유와 가스 탐사 및 생산’으로 분류되는 가스 탐사 또는 생산과 주로 관련된 회사는 제외. 또한 '석유와 가스 저장 및 수송’으로 분류되는 다각화된 중간단계 천연가스 회사도 제외. @ko
notation: 55102010
valid from: 2016-09-01
valid till: 2018-09-29

燃气公用事业
type: GlobalIndustryClassificationStandardsClassifier
type: IndustryClassifier
type: NamedIndividual
is contemporary version of: http://data.ga-group.nl/ics/gics/551020
is replaced by: http://data.ga-group.nl/ics/gics/2018/551020
is version of: http://data.ga-group.nl/ics/gics/551020
replaces: http://data.ga-group.nl/ics/gics/2014/551020
is industry of: 公用事业
imported on: 2026-05-27T08:45:00.430Z
last refreshed on: 2026-05-31T09:56:29.350Z
source accessed on: 2017-10-19T03:34:33Z
source last accessed on: 2019-06-07T09:41:30Z
label: Gas Utilities @en
label: Gas @it
label: Gasversorgungsbetriebe @de
label: Gaz @fr
label: Serviços de Gás @pt
label: Suministro de Gas @es
label: Газоснабжение @ru
label: ガス @ja
label: 燃氣公用事業
label: 가스 공익 사업체 @ko
notation: 551020
valid from: 2016-09-01
valid till: 2018-09-29

复合型公用事业
type: GlobalIndustryClassificationStandardsClassifier
type: SubindustryClassifier
type: NamedIndividual
is contemporary version of: http://data.ga-group.nl/ics/gics/55103010
is replaced by: http://data.ga-group.nl/ics/gics/2018/55103010
is version of: http://data.ga-group.nl/ics/gics/55103010
replaces: http://data.ga-group.nl/ics/gics/2014/55103010
is subindustry of: 复合型公用事业
imported on: 2026-05-27T08:45:00.430Z
last refreshed on: 2026-05-31T09:56:08.967Z
source accessed on: 2017-10-19T03:38:21Z
source last accessed on: 2019-06-07T09:41:30Z
label: Compagnies aux activités diversifiées @fr
label: Múltiplos Serviços @pt
label: Multi-Utilities @en
label: Servizi plurisettoriali @it
label: Коммунальные услуги @ru
label: 総合公益事業 @ja
label: 복합 공익 사업체 @ko
definition: Compagnies aux activités très diversifiées outre les activités fondamentales des Compagnies d’Électricité, de Gaz et/ou des Eaux. @fr
definition: Empresas de serviços de utilidade pública com atividades significativamente diversificadas, além de operações fundamentais de serviços de eletricidade, gás e/ou água. @pt
definition: Società che gestiscono attività in campi molto diversificati non classificate altrove nei rami Aziende di gestione dell'energia elettrica, Aziende di gestione della distribuzione del gas e/o Aziende di distribuzione idrica. @it
definition: Utility companies with significantly diversified activities in addition to core Electric Utility, Gas Utility and/or Water Utility operations. @en
definition: Коммунальные компании, занимающиеся предоставлением услуг в нескольких направлениях помимо профильной деятельности в области электроэнергетики, газоснабжения и (или) водоснабжения. @ru
definition: 「電力」、「ガス」、「水道」の主力事業の他に各種分野で経営を展開する公益会社。 @ja
definition: 除主业为电力公用事业、燃气公用事业和/或水公用事业之外，还有其它多元化业务的公用事业公司。
definition: 핵심적인 전기 공익 사업체, 가스 공익 사업체 및/또는 수도 공익 사업체 운영 이외에 상당히 다각화된 활동을 하고 있는 공익 사업체. @ko
notation: 55103010
valid from: 2016-09-01
valid till: 2018-09-29

复合型公用事业
type: GlobalIndustryClassificationStandardsClassifier
type: IndustryClassifier
type: NamedIndividual
is contemporary version of: http://data.ga-group.nl/ics/gics/551030
is replaced by: http://data.ga-group.nl/ics/gics/2018/551030
is version of: http://data.ga-group.nl/ics/gics/551030
replaces: http://data.ga-group.nl/ics/gics/2014/551030
is industry of: 公用事业
imported on: 2026-05-27T08:45:00.430Z
last refreshed on: 2026-05-31T09:56:29.350Z
source accessed on: 2017-10-19T03:34:33Z
source last accessed on: 2019-06-07T09:41:30Z
label: Compagnies aux activités diversifiées @fr
label: Múltiplos Serviços @pt
label: Multi-Utilities @en
label: Multi-Versorger @de
label: Multiservicios @es
label: Servizi plurisettoriali @it
label: Коммунальные услуги @ru
label: 復合公用事業
label: 総合公益事業 @ja
label: 복합 공익 사업체 @ko
notation: 551030
valid from: 2016-09-01
valid till: 2018-09-29

水公用事业
type: GlobalIndustryClassificationStandardsClassifier
type: SubindustryClassifier
type: NamedIndividual
is contemporary version of: http://data.ga-group.nl/ics/gics/55104010
is replaced by: http://data.ga-group.nl/ics/gics/2018/55104010
is version of: http://data.ga-group.nl/ics/gics/55104010
replaces: http://data.ga-group.nl/ics/gics/2014/55104010
is subindustry of: 水公用事业
imported on: 2026-05-27T08:45:00.430Z
last refreshed on: 2026-05-31T09:56:08.967Z
source accessed on: 2017-10-19T03:38:21Z
source last accessed on: 2019-06-07T09:41:30Z
label: Aziende di distribuzione idrica @it
label: Compagnies des Eaux @fr
label: Serviços de Água @pt
label: Water Utilities @en
label: Водоснабжение @ru
label: 水道 @ja
label: 수도 공익 사업체 @ko
definition: Companies that purchase and redistribute water to the end-consumer. Includes large-scale water treatment systems. @en
definition: Empresas que compram e redistribuem água para o consumidor final. Inclui sistemas de tratamento de água em larga escala. @pt
definition: Sociétés qui achètent et redistribuent l'eau au consommateur final. Sont incluses les compagnies de traitement des eaux à grande échelle. @fr
definition: Società che acquistano e ridistribuiscono acqua al consumatore finale. Sono inclusi gli impianti di trattamento dell'acqua su larga scala. @it
definition: Компании, занимающиеся приобретением и перераспределением водных ресурсов конечным потребителям. В данную группу входят крупные водоочистные системы. @ru
definition: 末端消費者を対象とした水の購入・再分配を行う会社。大規模な水処理システムを含む。 @ja
definition: 购买水后再把水配送给最终消费者的公司。包括大型水处理系统。
definition: 물을 구입해서 최종 소비자에게 재공급하는 회사. 대규모 수처리 시스템 포함. @ko
notation: 55104010
valid from: 2016-09-01
valid till: 2018-09-29

水公用事业
type: GlobalIndustryClassificationStandardsClassifier
type: IndustryClassifier
type: NamedIndividual
is contemporary version of: http://data.ga-group.nl/ics/gics/551040
is replaced by: http://data.ga-group.nl/ics/gics/2018/551040
is version of: http://data.ga-group.nl/ics/gics/551040
replaces: http://data.ga-group.nl/ics/gics/2014/551040
is industry of: 公用事业
imported on: 2026-05-27T08:45:00.430Z
last refreshed on: 2026-05-31T09:56:29.350Z
source accessed on: 2017-10-19T03:34:33Z
source last accessed on: 2019-06-07T09:41:30Z
label: Acqua @it
label: Compagnies des Eaux @fr
label: Serviços de Água @pt
label: Suministro de Agua @es
label: Wasserversorgungsbetriebe @de
label: Water Utilities @en
label: Водоснабжение @ru
label: 水公用事業
label: 水道 @ja
label: 수도 공익 사업체 @ko
notation: 551040
valid from: 2016-09-01
valid till: 2018-09-29

独立电力生产商与能源贸易商
type: GlobalIndustryClassificationStandardsClassifier
type: SubindustryClassifier
type: NamedIndividual
is contemporary version of: http://data.ga-group.nl/ics/gics/55105010
is replaced by: http://data.ga-group.nl/ics/gics/2018/55105010
is version of: http://data.ga-group.nl/ics/gics/55105010
replaces: http://data.ga-group.nl/ics/gics/2014/55105010
is subindustry of: 独立电力生产商与能源贸易商
imported on: 2026-05-27T08:45:00.430Z
last refreshed on: 2026-05-31T09:56:08.967Z
source accessed on: 2017-10-19T03:38:21Z
source last accessed on: 2019-06-07T09:41:30Z
label: Independent Power Producers & Energy Traders @en
label: Producteurs d’Énergie Indépendants et Fournisseurs d'Énergie @fr
label: Produtores Independentes de Energia e Comerciantes de Energia @pt
label: Produttori indipendenti di energia e società di commercializzazione di energia @it
label: Независимые производители и поставщики электроэнергии @ru
label: 独立系発電事業者・エネルギー販売業者 @ja
label: 독립 전력 생산업체 & 에너지 거래업체 @ko
definition: Companies that operate as Independent Power Producers (IPPs), Gas & Power Marketing & Trading Specialists and/or Integrated Energy Merchants. Excludes producers of electricity using renewable sources, such as solar power, hydropower, and wind power. Also excludes electric transmission companies and utility distribution companies classified in the Electric Utilities Sub-Industry. @en
definition: Empresas que operam como produtores independentes de energia, especialistas de comercialização e comércio de energia e gás e/ou comerciantes de energia integrada. Exclui produtores de eletricidade que usem fontes renováveis, tais como energia solar, hidráulica e eólica. Também exclui empresas de transmissão elétrica e empresas de distribuição de serviços de utilidade pública, classificadas na Sub-Indústria de Serviços de Eletricidade. @pt
definition: Entreprises qui fonctionnent comme des producteurs indépendants d’électricité (PIE), des spécialistes de la fourniture et de la commercialisation du gaz et de l’électricité et /ou des fournisseurs spécialisés dans la performance énergétique intégrée. Ne sont pas inclus les producteurs d'électricité utilisant des sources d'énergie renouvelables, telles que l'énergie solaire, l'hydroélectricité et l'énergie éolienne. Ne sont également pas incluses les entreprises de transport d'électricité et les entreprises de distribution de services publics class��es dans la sous-industrie de l’Électricité. @fr
definition: Società che operano come Produttori indipendenti di energia (IPP), Società specializzate nella commercializzazione e nella compravendita di gas ed energia e/o Commercianti di energia integrata. Sono escluse le società produttrici di elettricità che utilizzano fonti rinnovabili, come energia idrica, eolica e solare. Sono inoltre escluse le società di trasmissione dell'energia elettrica e le società di distribuzione di utenze classificate come Aziende di gestione dell'energia elettrica. @it
definition: Компании, действующие в качестве независимых производителей электроэнергии, специалистов по сбыту газа и электроэнергии и/или интегрированные сбытовые энергетические компании. В данную группу не входят производители электроэнергии из возобновляемых источников, таких как солнечная, энергия ветра и гидроэнергия. В данную группу не входят компании по передаче электроэнергии и коммунальные распределительные компании, включенные в подотрасль «Электроэнергетика общего пользования». @ru
definition: 独立电力生产商（IPPs）、燃气���电力专业销售贸易公司和/或综合性能源商。不包括使用太阳能、水能和风能发电的公司，也不包括归类于“电力公用事业”子行业中的输电公司和配电公司。
definition: 独立系発電事業者（IPP）、ガス・電力販売・取引専門業者、総合エネルギー商社として事業を行う会社。太陽エネルギー、水力及び風力発電の供給会社は除く。産業サブグループの「電力」に分類される送電会社、電力・ガス・水道供給会社も除く。 @ja
definition: 독립전력생산자(IPP), 가스와 ��력 에너지 마케팅/거래 전문회사, 통합 에너지 회사로서 활동하는 기업, 태양열, 수력, 풍력과 같은 재생 가능한 자원을 이용해 전기를 생산하는 기업은 제외. 또한 ‘전기 공익 사업체’에 분류한 전기 전송 회사와 배급하는 회사도 제외. @ko
notation: 55105010
valid from: 2016-09-01
valid till: 2018-09-29

新能源发电业者
type: GlobalIndustryClassificationStandardsClassifier
type: SubindustryClassifier
type: NamedIndividual
is contemporary version of: http://data.ga-group.nl/ics/gics/55105020
is replaced by: http://data.ga-group.nl/ics/gics/2018/55105020
is version of: http://data.ga-group.nl/ics/gics/55105020
replaces: http://data.ga-group.nl/ics/gics/2014/55105020
is subindustry of: 独立电力生产商与能源贸易商
imported on: 2026-05-27T08:45:00.430Z
last refreshed on: 2026-05-31T09:56:08.967Z
source accessed on: 2017-10-19T03:38:21Z
source last accessed on: 2019-06-07T09:41:30Z
label: Electricité Renouvelable @fr
label: Eletricidade Renovável @pt
label: Produttori di elettricità da fonti rinnovabili @it
label: Renewable Electricity @en
label: Возобновляемые источники электроэнергии @ru
label: 再生エネルギー系発電事業者 @ja
label: 재생 가능한 전기 @ko
definition: Companies that engage in the generation and distribution of electricity using renewable sources, including, but not limited to, companies that produce electricity using biomass, geothermal energy, solar energy, hydropower, and wind power. Excludes companies manufacturing capital equipment used to generate electricity using renewable sources, such as manufacturers of solar power systems, installers of photovoltaic cells, and companies involved in the provision of technology, components, and services mainly to this market. @en
definition: Empresas envolvidas na geração e distribuição de eletricidade usando fontes renováveis, incluindo, mas não limitado a empresas que produzem eletricidade utilizando biomassa, energia geotérmica, energia solar, força hidráulica e eólica. Exclui empresas manufaturadoras de equipamento de capital usado para gerar eletricidade de fontes renováveis, tais como fabricantes de sistemas de energia solar, instaladores de células fotovoltaicas e empresas envolvidas no fornecimento de tecnologia, componentes e serviços principalmente a este mercado. @pt
definition: Les entreprises qui se livrent à la production et la distribution d'électricité à partir de sources renouvelables, y compris, mais sans s'y limiter, les entreprises qui produisent de l'électricité à partir de la biomasse, de l'énergie géothermique, de l'énergie solaire, de l'hydroélectricité et de l'énergie éolienne. N’est pas incluse la fabrication d'équipements utilisés pour produire de l'électricité à partir des sources renouvelables, tels que les fabricants de systèmes d'énergie solaire, les installateurs de cellules photovoltaïques, et les entreprises impliquées dans la fourniture de la technologie, de composants et services principalement à ce marché. @fr
definition: Società che si impegnano nella produzione e distribuzione di elettricità utilizzando risorse rinnovabili tra le quali, ma non limitatamente a, società che utilizzano biomasse, energia geotermica, energia solare, energia idrica, ed energia eolica. Sono escluse le società che producono attrezzature usate per generare elettricità utilizzando fonti rinnovabili, come i produttori di apparecchiature per energia solare, installatori di cellule fotovoltaiche, e quelle società specializzate nella fornitura di servizi e componenti tecnologici principalmente per questo settore. @it
definition: Компании, действующие в качестве производителей и поставщиков электроэнергии из возобновляемых источников. Включая, но не ограничиваясь, компании, которые производят электричество с использованием биомассы, геотермальной энергии, солнечной, гидроэнергии и энергии ветра. В данную группу не входят компании, производящие капитальное оборудование для выработки электроэнергии с использованием возобновляемых источников, такие как пр��изводители солнечных энергетических систем, компании, занимающиеся установкой фотоэлементов, в также компании, занимающиеся предоставлением технологий, компонентов и услуг в основном для этого рынка. @ru
definition: 使用新能源，包括但不限于生物能源、地热、太阳能、水能及风能发电的电力提供业者。不包括制造使用新能源发电设备的企业、如太阳能设备制造商、太阳能电池装备商、以及提供相关科技、部件及服务的企业。
definition: 再生エネルギー発電事業者。バイオマス、地熱エネルギー、太陽エネルギー、水力及び風力発電の供給会社が含まれるが、これに限らない。再生エネルギー発電用の機器を製造する会社、太陽光発電システム、太陽電池の装備業者及びこれに関わる技術、部品やサービスを提供する会社は除く。 @ja
definition: 바이오매스, 지열 에너지, 태양 에너지, 수력, 풍력 등을 사용하여 전기를 생산하는 회사 등 재생 가능한 자원을 이용해 전기 발전과 배급에 참여하는 기업. 태양열 시스템 제조업체, 광전지 설치업체 등 재생 가능한 자원을 이용해 에너지를 생산하는 자본 설비의 제조업체, 주로 이 시장을 대상으로 기술, 부품, 서비스를 제공하는데 참여하는 기업은 제외 @ko
notation: 55105020
valid from: 2016-09-01
valid till: 2018-09-29

独立电力生产商与能源贸易商
type: GlobalIndustryClassificationStandardsClassifier
type: IndustryClassifier
type: NamedIndividual
is contemporary version of: http://data.ga-group.nl/ics/gics/551050
is replaced by: http://data.ga-group.nl/ics/gics/2018/551050
is version of: http://data.ga-group.nl/ics/gics/551050
replaces: http://data.ga-group.nl/ics/gics/2014/551050
is industry of: 公用事业
imported on: 2026-05-27T08:45:00.430Z
last refreshed on: 2026-05-31T09:56:29.350Z
source accessed on: 2017-10-19T03:34:33Z
source last accessed on: 2019-06-07T09:41:30Z
label: Independent Power and Renewable Electricity Producers @en
label: Producteurs Indépendants d'Énergie et d’Electricité Renouvelable @fr
label: Productores de Energía Independientes y de Energía Eléctrica Renovable @es
label: Produtores Independentes de Energia e Eletricidade Renovável @pt
label: Produttori indipendenti di energia e Produttori di elettricità da fonti rinnovabili @it
label: Unabhängige Energie- und Erneuerbare Elektrizitätshersteller @de
label: Деятельность производителей и поставщиков электроэнергии из независимых и возобновляющихся источников @ru
label: 独立系発電事業者・エネルギー販売業者 @ja
label: 獨立電力生産商與能源貿易商
label: 독립 전력 생산업체와 재생 가능한 전기 생산업체 @ko
notation: 551050
valid from: 2016-09-01
valid till: 2018-09-29

公用事业
type: GlobalIndustryClassificationStandardsClassifier
type: IndustryGroupClassifier
type: NamedIndividual
is contemporary version of: http://data.ga-group.nl/ics/gics/5510
is replaced by: http://data.ga-group.nl/ics/gics/2018/5510
is version of: http://data.ga-group.nl/ics/gics/5510
replaces: http://data.ga-group.nl/ics/gics/2014/5510
is industry group of: 公用事业
imported on: 2026-05-27T08:45:00.430Z
last refreshed on: 2026-05-31T09:56:29.350Z
source accessed on: 2017-10-19T03:34:33Z
source last accessed on: 2019-06-07T09:41:30Z
label: Serviços de Utilidade Pública @pt
label: Services aux Collectivités @fr
label: Servicios de Utilidad Pública @es
label: Servizi di pubblica utilità @it
label: Utilities @en
label: Versorgungsbetriebe @de
label: Предоставление коммунальных услуг @ru
label: 公用事業
label: 公益事業 @ja
label: 공익 사업체 @ko
notation: 5510
valid from: 2016-09-01
valid till: 2018-09-29

公用事业
type: GlobalIndustryClassificationStandardsClassifier
type: SectorClassifier
type: NamedIndividual
is contemporary version of: http://data.ga-group.nl/ics/gics/55
is replaced by: http://data.ga-group.nl/ics/gics/2018/55
is version of: http://data.ga-group.nl/ics/gics/55
replaces: http://data.ga-group.nl/ics/gics/2014/55
imported on: 2026-05-27T08:45:00.430Z
last refreshed on: 2026-05-31T09:56:29.350Z
source accessed on: 2017-10-19T03:34:33Z
source last accessed on: 2019-06-07T09:41:30Z
label: Serviços de Utilidade Pública @pt
label: Services aux Collectivités @fr
label: Servicios de Utilidad Pública @es
label: Servizi di pubblica utilità @it
label: Utilities @en
label: Versorgungsbetriebe @de
label: Предоставление коммунальных услуг @ru
label: 公用事業
label: 公益事業 @ja
label: 공익 사업체 @ko
notation: 55
valid from: 2016-09-01
valid till: 2018-09-29

多样化房地产投资信托
type: GlobalIndustryClassificationStandardsClassifier
type: SubindustryClassifier
type: NamedIndividual
is contemporary version of: http://data.ga-group.nl/ics/gics/60101010
is replaced by: http://data.ga-group.nl/ics/gics/2018/60101010
is version of: http://data.ga-group.nl/ics/gics/60101010
replaces: http://data.ga-group.nl/ics/gics/2014/40402010
is subindustry of: 權益型不動產 投資信託基金 （REITs）
imported on: 2026-05-27T08:45:00.430Z
last refreshed on: 2026-05-31T09:56:08.967Z
source accessed on: 2017-10-19T03:38:21Z
source last accessed on: 2019-06-07T09:41:30Z
label: Diversified REITs @en
label: Fondi di Investimento Immobiliare diversificati @it
label: REIT Diversificados @pt
label: SIIC à Exploitation Diversifiée @fr
label: Диверсифицированные инвестиционные фонды недвижимости @ru
label: 各種不動産投資信託 @ja
label: 다각화된 리츠 @ko
definition: 2種以上の不動産タイプに渡って多角的に経営を展開する会社または信託機関。 @ja
definition: A company or Trust with significantly diversified operations across two or more property types. @en
definition: Fondi di investimento immobiliare industriali @it
definition: SIIC Industrielles @fr
definition: Uma empresa ou Trustes com operações significativamente diversificadas por dois ou mais tipos de propriedades @pt
definition: Промышленные инвестиционные фонды недвижимости @ru
definition: 工业房地产投资信托
definition: 산업 리츠 @ko
notation: 60101010
valid from: 2016-09-01
valid till: 2018-09-29

工業房地產投資信托
type: GlobalIndustryClassificationStandardsClassifier
type: SubindustryClassifier
type: NamedIndividual
is contemporary version of: http://data.ga-group.nl/ics/gics/60101020
is replaced by: http://data.ga-group.nl/ics/gics/2018/60101020
is version of: http://data.ga-group.nl/ics/gics/60101020
replaces: http://data.ga-group.nl/ics/gics/2014/40402020
is subindustry of: 權益型不動產 投資信託基金 （REITs）
imported on: 2026-05-27T08:45:00.430Z
last refreshed on: 2026-05-31T09:56:29.350Z
source accessed on: 2017-10-19T03:38:28Z
source last accessed on: 2019-06-07T09:41:30Z
label: Industrial REITs @en
label: REIT Industriais @pt
label: REIT Industriales @es
label: 工業用不動産投資信託 @ja
definition: Companies or Trusts engaged in the acquisition, development, ownership, leasing, management and operation of industrial properties. Includes companies operating industrial warehouses and distribution properties. @en
definition: REIT de Hotéis e Resorts @pt
definition: REIT de Hoteles y Propiedades de Recreación @es
definition: ホテル・リゾート不動産投資信託 @ja
definition: 酒店及娛樂地產投資信託
notation: 60101020
valid from: 2016-09-01
valid till: 2018-09-29

酒店及度假村房地产投资信托
type: GlobalIndustryClassificationStandardsClassifier
type: SubindustryClassifier
type: NamedIndividual
is contemporary version of: http://data.ga-group.nl/ics/gics/60101030
is replaced by: http://data.ga-group.nl/ics/gics/2018/60101030
is version of: http://data.ga-group.nl/ics/gics/60101030
replaces: http://data.ga-group.nl/ics/gics/2014/40402035
is subindustry of: 權益型不動產 投資信託基金 （REITs）
imported on: 2026-05-27T08:45:00.430Z
last refreshed on: 2026-05-31T09:56:08.967Z
source accessed on: 2017-10-19T03:34:33Z
source last accessed on: 2019-06-07T09:41:30Z
label: Fondi di Investimento Immobiliare relativi ad Albergi e Villaggi Turistici @it
label: Hotel & Resort REITs @en
label: Hotel und Resort REIT's @de
label: SIIC Hôtel et Lieu de Villégiature @fr
label: Инвестиционные фонды недвижимости в гостинично-курортной сфере @ru
label: 호텔 및 리조트 리츠 @ko
definition: Büro-REIT's @de
definition: Companies or Trusts engaged in the acquisition, development, ownership, leasing, management and operation of hotel and resort properties. @en
definition: Fondi di investimento immobiliare relativi a uffici @it
definition: SIIC Bureautiques @fr
definition: Компании или трасты, занимающиеся приобретением, развитием, владением, арендой, управлением и эксплуатацией гостиничного и курортного недвижимого имущества. @ru
definition: 办公房地产投资信托
definition: 사무실 리츠 @ko
notation: 60101030
valid from: 2016-09-01
valid till: 2018-09-29

辦公房地產投資信托
type: GlobalIndustryClassificationStandardsClassifier
type: SubindustryClassifier
type: NamedIndividual
is contemporary version of: http://data.ga-group.nl/ics/gics/60101040
is replaced by: http://data.ga-group.nl/ics/gics/2018/60101040
is version of: http://data.ga-group.nl/ics/gics/60101040
replaces: http://data.ga-group.nl/ics/gics/2014/40402040
is subindustry of: 權益型不動產 投資信託基金 （REITs）
imported on: 2026-05-27T08:45:00.430Z
last refreshed on: 2026-05-31T09:56:29.350Z
source accessed on: 2017-10-19T03:38:28Z
source last accessed on: 2019-06-07T09:41:30Z
label: Office REITs @en
label: REIT de Escritórios @pt
label: REIT de Oficinas @es
label: Инвестиционные фонды недвижимости в сфере коммерческих помещений @ru
label: オフィス不動産投資信託 @ja
definition: Companies or Trusts engaged in the acquisition, development, ownership, leasing, management and operation of office properties. @en
definition: REIT de Assistência Médica @pt
definition: REIT de Propiedades Dedicadas al Cuidado de Salud @es
definition: Инвестиционные фонды недвижимости в области здравоохранения @ru
definition: ヘルスケア不動産投資信託 @ja
definition: 醫療保健地產投資信託
notation: 60101040
valid from: 2016-09-01
valid till: 2018-09-29

Fondi di Investimento Immobiliare relativi ad immobili destinati ad attività di Assistenza Sanitaria
type: GlobalIndustryClassificationStandardsClassifier
type: SubindustryClassifier
type: NamedIndividual
is contemporary version of: http://data.ga-group.nl/ics/gics/60101050
is replaced by: http://data.ga-group.nl/ics/gics/2018/60101050
is version of: http://data.ga-group.nl/ics/gics/60101050
replaces: http://data.ga-group.nl/ics/gics/2014/40402045
is subindustry of: 權益型不動產 投資信託基金 （REITs）
imported on: 2026-05-27T08:45:00.430Z
last refreshed on: 2026-05-31T09:54:52.820Z
source accessed on: 2017-10-19T03:34:33Z
source last accessed on: 2019-06-07T09:41:30Z
label: Gesundheitswesen REIT's @de
label: Health Care REITs @en
label: SIIC Soins de Santé @fr
label: 건강관리 리츠 @ko
definition: Companies or Trusts engaged in the acquisition, development, ownership, leasing, management and operation of properties serving the health care industry, including hospitals, nursing homes, and assisted living properties. @en
definition: Fondi di investimento immobiliare residenziale @it
definition: SIIC Résidentielles @fr
definition: Wohnbau-REIT's @de
definition: 주택용 리츠 @ko
notation: 60101050
valid from: 2016-09-01
valid till: 2018-09-29

住宅房地产投资信托
type: GlobalIndustryClassificationStandardsClassifier
type: SubindustryClassifier
type: NamedIndividual
is contemporary version of: http://data.ga-group.nl/ics/gics/60101060
is replaced by: http://data.ga-group.nl/ics/gics/2018/60101060
is version of: http://data.ga-group.nl/ics/gics/60101060
replaces: http://data.ga-group.nl/ics/gics/2014/40402050
is subindustry of: 權益型不動產 投資信託基金 （REITs）
imported on: 2026-05-27T08:45:00.430Z
last refreshed on: 2026-05-31T09:56:29.350Z
source accessed on: 2017-10-19T03:38:28Z
source last accessed on: 2019-06-07T09:41:30Z
label: REIT Residenciais @pt
label: REIT Residenciales @es
label: Residential REITs @en
label: 住宅房地產投資信托
label: 住宅用不動産投資信託 @ja
definition: Companies or Trusts engaged in the acquisition, development, ownership, leasing, management and operation of residential properties including multifamily homes, apartments, manufactured homes and student housing properties @en
definition: REIT Comerciales @es
definition: REIT Varejistas @pt
definition: 店舗用不動���投資信託 @ja
definition: 零售业房地产投资信托
definition: 零售業房地產投資信托
notation: 60101060
valid from: 2016-09-01
valid till: 2018-09-29

Fondi di investimento immobiliare per il dettaglio
type: GlobalIndustryClassificationStandardsClassifier
type: SubindustryClassifier
type: NamedIndividual
is contemporary version of: http://data.ga-group.nl/ics/gics/60101070
is replaced by: http://data.ga-group.nl/ics/gics/2018/60101070
is version of: http://data.ga-group.nl/ics/gics/60101070
replaces: http://data.ga-group.nl/ics/gics/2014/40402060
is subindustry of: 權益型不動產 投資信託基金 （REITs）
imported on: 2026-05-27T08:45:00.430Z
last refreshed on: 2026-05-31T09:56:08.967Z
source accessed on: 2017-10-19T03:34:33Z
source last accessed on: 2019-06-07T09:41:30Z
label: Handels-REIT's @de
label: Retail REITs @en
label: SIIC au Détail @fr
label: Инвестиционные фонды недвижимости в области розничной торговли @ru
label: 소매점 리츠 @ko
definition: Companies or Trusts engaged in the acquisition, development, ownership, leasing, management and operation of shopping malls, outlet malls, neighborhood and community shopping centers. @en
definition: Fondi di investimento immobiliare specializzati @it
definition: SIIC Spécialisées @fr
definition: Spezialisierte REIT's @de
definition: Специализированные инвестиционные фонды недвижимости @ru
definition: 특수 리츠 @ko
notation: 60101070
valid from: 2016-09-01
valid till: 2018-09-29

特种房地产投资信托
type: GlobalIndustryClassificationStandardsClassifier
type: SubindustryClassifier
type: NamedIndividual
is contemporary version of: http://data.ga-group.nl/ics/gics/60101080
is replaced by: http://data.ga-group.nl/ics/gics/2018/60101080
is version of: http://data.ga-group.nl/ics/gics/60101080
replaces: http://data.ga-group.nl/ics/gics/2014/40402070
is subindustry of: 權益型不動產 投資信託基金 （REITs）
imported on: 2026-05-27T08:45:00.430Z
last refreshed on: 2026-05-31T09:56:29.350Z
source accessed on: 2017-10-19T03:38:28Z
source last accessed on: 2019-06-07T09:41:30Z
label: REIT Especializados @es
label: Specialized REITs @en
label: 専門不動産投資信託 @ja
label: 特種房地產投資信托
definition: Companies or Trusts engaged in the acquisition, development, ownership, leasing, management and operation of properties not classified elsewhere. Includes trusts that operate and invest in storage properties. It also includes REITs that do not generate a majority of their revenues and income from real estate rental and leasing operations. @en
definition: Empresas o fideicomisos dedicados a la adquisición, desarrollo, posesión, alquiler, administración y operación de propiedades no clasificados previamente. Incluye fideicomisos que operan e invierten en inmuebles de almacenamiento. Tambien incluye REIT que no generan la mayoria de sus ingresos del alquiler o arrendamiento de inmuebles. @es
definition: Empresas ou Trustes envolvidos na aquisição, desenvolvimento, propriedade, arrendamento, gestão e operação de propriedades não classificadas em nenhum outro lugar. Inclui trustes que operam e investem em propriedades de armazenagem. Também inclui REIT que não geram uma maioria de suas receitas e rendimento de operações de arrendamento e aluguel imobiliários. @pt
definition: 从事并无归入其他类别的物业的收购、开发、所有权、��赁、管理和经营的公司或信托公司。包括经营和投资仓储物业的信托公司。也包括主要收益和收入并非来自房地产租金和租赁经营的房地产投资信托。
definition: 各種不動産事業 @ja
definition: 多樣化房地產活動
notation: 60101080
valid from: 2016-09-01
valid till: 2018-09-29

權益型不動產 投資信託基金 （REITs）
type: GlobalIndustryClassificationStandardsClassifier
type: IndustryClassifier
type: NamedIndividual
is contemporary version of: http://data.ga-group.nl/ics/gics/601010
is replaced by: http://data.ga-group.nl/ics/gics/2018/601010
is version of: http://data.ga-group.nl/ics/gics/601010
replaces: http://data.ga-group.nl/ics/gics/2014/404020
is industry of: 房地产
imported on: 2026-05-27T08:45:00.430Z
last refreshed on: 2026-05-31T09:56:29.350Z
source accessed on: 2017-10-19T03:34:33Z
source last accessed on: 2019-06-07T09:41:30Z
label: Aktienkapital Immobilien Anlagefonds (REITs) @de
label: Equity Real Estate Investment Trusts (REITs) @en
label: Fideicomisos Hipotecarios de Inversión en Bienes Inmobiliarios (REIT) @es
label: Fondi comuni di investimento immobiliare e in partecipazioni (REIT) @it
label: Sociétés d'Investissement Immobilier Cotées (SIIC) @fr
label: Trustes de Investimento Imobiliário (REIT) @pt
label: Прямое частное инвестирование в недвижимость Инвестиционные фонды недвижимости (REIT) @ru
label: エクイティ不動産投資信託 (REITs) @ja
label: 股权房地产投资信托 （REITs）
label: 주식 리츠 @ko
notation: 601010
valid from: 2016-09-01
valid till: 2018-09-29

多样化房地产活动
type: GlobalIndustryClassificationStandardsClassifier
type: SubindustryClassifier
type: NamedIndividual
is contemporary version of: http://data.ga-group.nl/ics/gics/60102010
is replaced by: http://data.ga-group.nl/ics/gics/2018/60102010
is version of: http://data.ga-group.nl/ics/gics/60102010
replaces: http://data.ga-group.nl/ics/gics/2014/40403010
is subindustry of: 房地产管理和开发
imported on: 2026-05-27T08:45:00.430Z
last refreshed on: 2026-05-31T09:56:17.589Z
source accessed on: 2017-10-19T03:34:33Z
source last accessed on: 2019-06-07T09:41:30Z
label: Actividades Diversificadas Relacionadas con Bienes Inmobiliarios @es
label: Activités Immobilières Diversifiées @fr
label: Atividades Imobiliárias Diversificadas @pt
label: Attività immobiliari diversificate @it
label: Diverse Immobilienaktivitäten @de
label: Diversified Real Estate Activities @en
label: 다각화된 부동산 활동 @ko
definition: Companies engaged in a diverse spectrum of real estate activities including real estate development & sales, real estate management, or real estate services, but with no dominant business line. @en
definition: Empresas Operadoras de Imóveis @pt
definition: Empresas dedicadas a un espectro diverso de actividades relacionadas con los bienes inmobiliarios que incluyen el desarrollo y venta de bienes inmuebles, la administración de bienes inmuebles o servicios para bienes inmuebles, pero sin una línea de negocios dominante. @es
definition: Immobilienbetriebsgesellschaft @de
definition: Sociétés d'Exploitation de Biens Immobiliers @fr
definition: Società che operano nel mercato immobiliare @it
definition: 房地产经营公司
definition: 부동산 운영 회사 @ko
notation: 60102010
valid from: 2016-09-01
valid till: 2018-09-29

房地產經營公司
type: GlobalIndustryClassificationStandardsClassifier
type: SubindustryClassifier
type: NamedIndividual
is contemporary version of: http://data.ga-group.nl/ics/gics/60102020
is replaced by: http://data.ga-group.nl/ics/gics/2018/60102020
is version of: http://data.ga-group.nl/ics/gics/60102020
replaces: http://data.ga-group.nl/ics/gics/2014/40403020
is subindustry of: 房地产管理和开发
imported on: 2026-05-27T08:45:00.430Z
last refreshed on: 2026-05-31T09:56:29.350Z
source accessed on: 2017-10-19T03:38:28Z
source last accessed on: 2019-06-07T09:41:30Z
label: Empresas Operadoras de Bienes Inmobiliarios @es
label: Real Estate Operating Companies @en
label: Операционные компании на рынке недвижимости @ru
label: 不動産運営会社 @ja
definition: Companies engaged in operating real estate properties for the purpose of leasing & management. @en
definition: Desarrollo Inmobiliario @es
definition: Строительство недвижимого имущества @ru
definition: 不動産開発 @ja
definition: 房地產開發
notation: 60102020
valid from: 2016-09-01
valid till: 2018-09-29

房地产开发
type: GlobalIndustryClassificationStandardsClassifier
type: SubindustryClassifier
type: NamedIndividual
is contemporary version of: http://data.ga-group.nl/ics/gics/60102030
is replaced by: http://data.ga-group.nl/ics/gics/2018/60102030
is version of: http://data.ga-group.nl/ics/gics/60102030
replaces: http://data.ga-group.nl/ics/gics/2014/40403030
is subindustry of: 房地产管理和开发
imported on: 2026-05-27T08:45:00.430Z
last refreshed on: 2026-05-31T09:55:52.568Z
source accessed on: 2017-10-19T03:34:33Z
source last accessed on: 2019-06-07T09:41:30Z
label: Desenvolvimento Imobiliário @pt
label: Immobilienentwicklung @de
label: Promotion Immobilière @fr
label: Real Estate Development @en
label: Sviluppo immobiliare @it
label: 부동산 개발 @ko
definition: Companies that develop real estate and sell the properties after development. Excludes companies classified in the Homebuilding Sub-Industry. @en
definition: Immobiliendienste @de
definition: Serviços Imobiliários @pt
definition: Services Immobiliers @fr
definition: Servizi immobiliari @it
definition: 房地产服务
definition: 부동산 서비스 @ko
notation: 60102030
valid from: 2016-09-01
valid till: 2018-09-29

Real Estate Services
type: GlobalIndustryClassificationStandardsClassifier
type: SubindustryClassifier
type: NamedIndividual
is contemporary version of: http://data.ga-group.nl/ics/gics/60102040
is replaced by: http://data.ga-group.nl/ics/gics/2018/60102040
is version of: http://data.ga-group.nl/ics/gics/60102040
replaces: http://data.ga-group.nl/ics/gics/2014/40403040
is subindustry of: 房地产管理和开发
imported on: 2026-05-27T08:45:00.430Z
last refreshed on: 2026-05-31T09:56:29.350Z
source accessed on: 2017-10-19T03:38:28Z
source last accessed on: 2019-06-07T09:41:30Z
definition: Real estate service providers such as real estate agents, brokers & real estate appraisers. @en
notation: 60102040
valid from: 2016-09-01
valid till: 2018-09-29

房地产管理和开发
type: GlobalIndustryClassificationStandardsClassifier
type: IndustryClassifier
type: NamedIndividual
is contemporary version of: http://data.ga-group.nl/ics/gics/601020
is replaced by: http://data.ga-group.nl/ics/gics/2018/601020
is version of: http://data.ga-group.nl/ics/gics/601020
replaces: http://data.ga-group.nl/ics/gics/2014/404030
is industry of: 房地产
imported on: 2026-05-27T08:45:00.430Z
last refreshed on: 2026-05-31T09:56:29.350Z
source accessed on: 2017-10-19T03:34:33Z
source last accessed on: 2019-06-07T09:41:30Z
label: Desarrollo y Administración de Bienes Inmobiliarios @es
label: Gestion et Promotion Immobilière @fr
label: Immobilienverwaltung- und bau @de
label: Real Estate Management & Development @en
label: Sviluppo e gestione proprietà immobiliari @it
label: Управление недвижимостью и его развитие @ru
label: 不動産管理・開発 @ja
label: 房地產管理與開發
label: 부동산 관리 및 개발 @ko
notation: 601020
valid from: 2016-09-01
valid till: 2018-09-29

房地产
type: GlobalIndustryClassificationStandardsClassifier
type: IndustryGroupClassifier
type: NamedIndividual
is contemporary version of: http://data.ga-group.nl/ics/gics/6010
is replaced by: http://data.ga-group.nl/ics/gics/2018/6010
is version of: http://data.ga-group.nl/ics/gics/6010
replaces: http://data.ga-group.nl/ics/gics/2014/4040
is industry group of: 房地产
imported on: 2026-05-27T08:45:00.430Z
last refreshed on: 2026-05-31T09:56:29.350Z
source accessed on: 2017-10-19T03:34:33Z
source last accessed on: 2019-06-07T09:41:30Z
label: Bienes Inmobiliarios @es
label: Imóveis @pt
label: Immobilien @de
label: Immobilier @fr
label: Investimento immobiliare @it
label: Real Estate @en
label: Недвижимость @ru
label: 不動産 @ja
label: 房地產
label: 부동산 @ko
notation: 6010
valid from: 2016-09-01
valid till: 2018-09-29

房地产
type: GlobalIndustryClassificationStandardsClassifier
type: SectorClassifier
type: NamedIndividual
is contemporary version of: http://data.ga-group.nl/ics/gics/60
is replaced by: http://data.ga-group.nl/ics/gics/2018/60
is version of: http://data.ga-group.nl/ics/gics/60
imported on: 2026-05-27T08:45:00.430Z
last refreshed on: 2026-05-31T09:56:29.350Z
source accessed on: 2017-10-19T03:34:33Z
source last accessed on: 2019-06-07T09:41:30Z
label: Bienes Inmobiliarios @es
label: Imóveis @pt
label: Immobilien @de
label: Immobilier @fr
label: Investimento immobiliare @it
label: Real Estate @en
label: Недвижимость @ru
label: 不動産 @ja
label: 房地產
label: 부동산 @ko
notation: 60
valid from: 2016-09-01
valid till: 2018-09-29