BICS individuals
type: Ontology
download URL: http://data.ga-group.nl/ics/bics2014.ttl
abstract: This ontology includes individuals representing the set of classification codes based on the principal business activity of the company. This set of classification codes is valid from 2024.
creator: https://orcid.org/0000-0002-7352-2825
description: The Bloomberg Industry Classification Standard (BICS) is an industry classification taxonomy launched by Bloomberg in 2014. Codes are at least four-tiered, but up to eight tiers are possible. Codes are numeric but not prefix-free. The first tier is called sector, the second tier is the industry group, the third tier is the industry, and the fourth tier is the subindustry. Tiers five to eight are simply called segments. Bloomberg is responsible for assigning a BICS classification to all major public companies. Each company is allocated to the subindustry that most closely represents the nature of its business according to the BICS classification methodology.
format: text/turtle
issued: 2026-06-03T02:25:19Z
language: en
license: https://creativecommons.org/licenses/by-sa/4.0/
modified: 2026-06-03T02:25:19Z
publisher: https://orcid.org/0000-0002-7352-2825
has maturity level: Release
imports: classes
imports: ics
version info: 2024
content language: owl2-quick-reference
label: BICS 2024
contributor: PAMIYA Strategic Advisors GmbH
copyright: Copyright (c) 2014 Bloomberg LLC
copyright: Copyright (c) 2022-2026 PAMIYA Strategic Advisors GmbH
filename: bics2024.ttl
valid from: 2024
preferred namespace prefix: bics2024

Advertising Agencies
type: BicsLevel6Segment
type: Classifier
type: NamedIndividual
is level6 segment of: Advertising Agencies & Svcs
is contemporary version of: http://data.ga-group.nl/ics/bics/101010101010
is version of: http://data.ga-group.nl/ics/bics/101010101010
replaces: http://data.ga-group.nl/ics/bics/2020/101010101010
imported on: 2026-06-08T13:40:52.236Z
last refreshed on: 2026-06-08T13:41:38.450Z
source accessed on: 2024-06-05T14:42:36Z
source last accessed on: 2024-06-05T14:42:36Z
label: Agências de propaganda @pt
label: Agences de pub @fr
label: Agencias publicidad @es
label: Soctà pubblicitarie @it
label: Werbeagenturen @de
label: Рекламные агентства @ru
label: 广告代理 @zh
label: 広告代理店 @ja
label: 廣告代理業 @zh-hant
label: 광고대행사 @ko
definition: This segment includes companies that create advertising campaigns for use in newspapers, magazines, radio, television or other media.
notation: 101010101010
valid from: 2024-06-07

E-Marketing
type: BicsLevel6Segment
type: Classifier
type: NamedIndividual
is level6 segment of: Advertising Agencies & Svcs
is contemporary version of: http://data.ga-group.nl/ics/bics/101010101011
is version of: http://data.ga-group.nl/ics/bics/101010101011
replaces: http://data.ga-group.nl/ics/bics/2020/101010101011
imported on: 2026-06-08T13:40:52.236Z
last refreshed on: 2026-06-08T13:41:38.450Z
source accessed on: 2024-06-05T14:42:36Z
source last accessed on: 2024-06-05T14:42:36Z
label: E-마케팅 @ko
label: Marketing online @pt
label: Эл. маркетинг @ru
label: 网络营销 @zh
label: 電子行銷 @zh-hant
label: eﾏｰｹﾃｨﾝｸﾞ @ja
definition: This segment includes companies that specialize in creating advertising campaigns via Internet media. Includes email marketing, mobile and website advertising, search engine optimization, and social media marketing.
notation: 101010101011
valid from: 2024-06-07

Marketing Consulting Services
type: BicsLevel7Segment
type: Classifier
type: NamedIndividual
is level7 segment of: Market Research & Consulting
is contemporary version of: http://data.ga-group.nl/ics/bics/10101010101210
is version of: http://data.ga-group.nl/ics/bics/10101010101210
replaces: http://data.ga-group.nl/ics/bics/2020/10101010101210
imported on: 2026-06-08T13:40:52.236Z
last refreshed on: 2026-06-08T13:41:38.450Z
source accessed on: 2024-06-05T14:42:36Z
source last accessed on: 2024-06-05T14:42:36Z
label: Marketing-Consulting-Dienste @de
label: Serviços de consultoria de marketing @pt
label: Services de conseils en marketing @fr
label: Servicios de consultoría de mercadotecnia @es
label: Servizi consulenza marketing @it
label: Консультационные услуги по маркетингу @ru
label: 营销咨询服务 @zh
label: 行銷顧問服務 @zh-hant
label: 시장 컨설팅 서비스 @ko
label: ﾏｰｹﾃｨﾝｸﾞｺﾝｻﾙﾃｨﾝｸﾞｻｰﾋﾞｽ @ja
definition: This segment includes companies that provide marketing consulting services.
notation: 10101010101210
valid from: 2024-06-07

Market Research
type: BicsLevel7Segment
type: Classifier
type: NamedIndividual
is level7 segment of: Market Research & Consulting
is contemporary version of: http://data.ga-group.nl/ics/bics/10101010101211
is version of: http://data.ga-group.nl/ics/bics/10101010101211
replaces: http://data.ga-group.nl/ics/bics/2020/10101010101211
imported on: 2026-06-08T13:40:52.236Z
last refreshed on: 2026-06-08T13:41:38.450Z
source accessed on: 2024-06-05T14:42:36Z
source last accessed on: 2024-06-05T14:42:36Z
label: Estudios del mercado @es
label: Etudes de marché @fr
label: Marktforschung @de
label: Pesquisas de mercado @pt
label: Ricerche di mercato @it
label: Исследования рынка @ru
label: 市场研究 @zh
label: 市場研究及意見調查 @zh-hant
label: 市場調査 @ja
label: 시장 리서치 @ko
definition: This segment includes companies that provide market research and opinion polling.
notation: 10101010101211
valid from: 2024-06-07

Market Research & Consulting
type: BicsLevel6Segment
type: Classifier
type: NamedIndividual
is level6 segment of: Advertising Agencies & Svcs
is contemporary version of: http://data.ga-group.nl/ics/bics/101010101012
is version of: http://data.ga-group.nl/ics/bics/101010101012
replaces: http://data.ga-group.nl/ics/bics/2020/101010101012
imported on: 2026-06-08T13:40:52.236Z
last refreshed on: 2026-06-08T13:41:38.450Z
source accessed on: 2024-06-05T14:42:36Z
source last accessed on: 2024-06-05T14:42:36Z
label: Consulenza e ricerca di mercato @it
label: Consultoria e pesquisa de mercado @pt
label: Estudios y consultoría de mercado @es
label: Etude de marché et conseil @fr
label: Marktforschung & Beratung @de
label: Исследования рынка и консалтинг @ru
label: 市场研究和顾问 @zh
label: 市場研究及顧問 @zh-hant
label: 市場調査･ｺﾝｻﾙﾃｨﾝｸﾞ @ja
label: 시장 리서치 & 컨설팅 @ko
definition: This segment includes companies that provide market research, opinion polling or marketing consulting services.
notation: 101010101012
valid from: 2024-06-07

Media Representatives
type: BicsLevel6Segment
type: Classifier
type: NamedIndividual
is level6 segment of: Advertising Agencies & Svcs
is contemporary version of: http://data.ga-group.nl/ics/bics/101010101013
is version of: http://data.ga-group.nl/ics/bics/101010101013
replaces: http://data.ga-group.nl/ics/bics/2020/101010101013
imported on: 2026-06-08T13:40:52.236Z
last refreshed on: 2026-06-08T13:41:38.450Z
source accessed on: 2024-06-05T14:42:36Z
source last accessed on: 2024-06-05T14:42:36Z
label: Agencias de representación de medios @es
label: Medienvertreter @de
label: Rappresentanti dei media @it
label: Représentants de médias @fr
label: Representantes mídia @pt
label: Представитель средств рекламы @ru
label: 媒体代表 @zh
label: 媒體代表 @zh-hant
label: 광고매체판매업 @ko
label: ﾒﾃﾞｨｱﾚｯ��ﾟ @ja
label: ﾒﾃﾞｨ���ﾚｯﾌﾟ @ja
definition: This segment includes companies that sell media time or space on behalf of media owners.
notation: 101010101013
valid from: 2024-06-07

Public Relations Agencies
type: BicsLevel6Segment
type: Classifier
type: NamedIndividual
is level6 segment of: Advertising Agencies & Svcs
is contemporary version of: http://data.ga-group.nl/ics/bics/101010101014
is version of: http://data.ga-group.nl/ics/bics/101010101014
replaces: http://data.ga-group.nl/ics/bics/2020/101010101014
imported on: 2026-06-08T13:40:52.236Z
last refreshed on: 2026-06-08T13:41:38.450Z
source accessed on: 2024-06-05T14:42:36Z
source last accessed on: 2024-06-05T14:42:36Z
label: Agências de relações públicas @pt
label: Agencias de relaciones públicas @es
label: Agenzie di pubbliche relazioni @it
label: Public-Relations-Agenturen @de
label: Services de relations publiques @fr
label: Агентства по связьм с общественностью @ru
label: 公共關係代理 @zh-hant
label: 公关代理 @zh
label: 広報代理店 @ja
label: 홍보기관 @ko
definition: This segment includes companies that provide public relations services. Public relations services manage the communication and spread of information between their clients and the public.
notation: 101010101014
valid from: 2024-06-07

Advertising Agencies & Svcs
type: BicsLevel5Segment
type: Classifier
type: NamedIndividual
is level5 segment of: Advertising & Marketing
is contemporary version of: http://data.ga-group.nl/ics/bics/1010101010
is version of: http://data.ga-group.nl/ics/bics/1010101010
replaces: http://data.ga-group.nl/ics/bics/2020/1010101010
imported on: 2026-06-08T13:40:52.236Z
last refreshed on: 2026-06-08T13:41:38.450Z
source accessed on: 2024-06-05T14:42:36Z
source last accessed on: 2024-06-05T14:42:36Z
label: Agências de publicidade e serv @pt
label: Agences/serv de publicité @fr
label: Agenzie e serv pubblicitari @it
label: Servicios y agencias de publicidad @es
label: Werbeagenturen & -dienste @de
label: Рекламн. агентства и услг @ru
label: 广告代理商及相关服务 @zh
label: 広告代理店･関連ｻｰﾋﾞｽ @ja
label: 廣告代理及服務 @zh-hant
label: 광고 대행사 & 관련 서비스 @ko
definition: This segment includes companies that create advertising campaigns for media use, provide market research or marketing consulting services, or act as public relations or media representatives.
notation: 1010101010
valid from: 2024-06-07

Advertising Material Distr Svcs
type: BicsLevel6Segment
type: Classifier
type: NamedIndividual
is level6 segment of: Direct Marketing
is contemporary version of: http://data.ga-group.nl/ics/bics/101010101110
is version of: http://data.ga-group.nl/ics/bics/101010101110
replaces: http://data.ga-group.nl/ics/bics/2020/101010101110
imported on: 2026-06-08T13:40:52.236Z
last refreshed on: 2026-06-08T13:41:38.450Z
source accessed on: 2024-06-05T14:42:36Z
source last accessed on: 2024-06-05T14:42:36Z
label: Serv de distr material de publicidad @es
label: Serv de distrib de matériel publicitaire @fr
label: Serv distr material de publicidade @pt
label: Serv distrib materiale pubblicitario @it
label: Werbematerialverteildienste @de
label: Услг по распростр. рекламы @ru
label: 广告材料分发服务 @zh
label: 広告素材配給ｻｰﾋﾞｽ @ja
label: 廣告宣傳物發送服務 @zh-hant
label: 광고물 배포 서비스 @ko
definition: This segment includes companies that direct distribute advertising materials or samples.
notation: 101010101110
valid from: 2024-06-07

Direct Mail Advertising
type: BicsLevel6Segment
type: Classifier
type: NamedIndividual
is level6 segment of: Direct Marketing
is contemporary version of: http://data.ga-group.nl/ics/bics/101010101111
is version of: http://data.ga-group.nl/ics/bics/101010101111
replaces: http://data.ga-group.nl/ics/bics/2020/101010101111
imported on: 2026-06-08T13:40:52.236Z
last refreshed on: 2026-06-08T13:41:38.450Z
source accessed on: 2024-06-05T14:42:36Z
source last accessed on: 2024-06-05T14:42:36Z
label: Agencias de publicidad que operan por correo directo @es
label: Postversandwerbung @de
label: Pubblicità Direct Mail @it
label: Publicidade mala direta @pt
label: Publipostage @fr
label: Реклама через прямую почтовую рассылку @ru
label: 直接投遞廣告 @zh-hant
label: 直邮广告 @zh
label: 직접우편 광고 @ko
label: ﾀﾞｲﾚｸﾄﾒｰﾙ広告 @ja
definition: This segment includes companies that create advertisements and campaigns that are distributed through mail services. Includes mail advertisements, fliers, pamphlets, and coupons.
notation: 101010101111
valid from: 2024-06-07

Direct Marketing
type: BicsLevel5Segment
type: Classifier
type: NamedIndividual
is level5 segment of: Advertising & Marketing
is contemporary version of: http://data.ga-group.nl/ics/bics/1010101011
is version of: http://data.ga-group.nl/ics/bics/1010101011
replaces: http://data.ga-group.nl/ics/bics/2020/1010101011
imported on: 2026-06-08T13:40:52.236Z
last refreshed on: 2026-06-08T13:41:38.450Z
source accessed on: 2024-06-05T14:42:36Z
source last accessed on: 2024-06-05T14:42:36Z
label: Direktmarketing @de
label: Márketing directo @es
label: Marketing direct @fr
label: Marketing direto @pt
label: Vendite dirette @it
label: Прямой маркетинг @ru
label: 直接銷售業 @zh-hant
label: 直销 @zh
label: 다이렉트 마케팅 @ko
label: ﾀﾞｲﾚｸﾄﾏｰｹﾃｨﾝｸﾞ @ja
definition: This segment includes companies involved in the creation or distribution of direct marketing advertisements. Includes mail advertisements, telemarketing, coupons, and text (SMS) advertisements.
notation: 1010101011
valid from: 2024-06-07

Advertising & Marketing
type: BicsLevel4SubIndustry
type: Classifier
type: NamedIndividual
is sub industry of: Advertising & Marketing
is contemporary version of: http://data.ga-group.nl/ics/bics/10101010
is version of: http://data.ga-group.nl/ics/bics/10101010
replaces: http://data.ga-group.nl/ics/bics/2020/10101010
imported on: 2026-06-08T13:40:52.236Z
last refreshed on: 2026-06-08T13:41:38.450Z
source accessed on: 2024-06-05T14:42:36Z
source last accessed on: 2024-06-05T14:42:36Z
label: Pubblicità e marketing @it
label: Publicidad y mercadeo @es
label: Publicidade e Marketing @pt
label: Publicité et marketing @fr
label: Werbung & Marketing @de
label: Реклама и маркетинг @ru
label: 广告营销 @zh
label: 広告･ﾏｰｹﾃｨﾝｸﾞ @ja
label: 廣告及行銷 @zh-hant
label: 광고 & 마케팅 @ko
definition: This industry subgroup includes companies that provide advertising and marketing services. Includes the creation of advertising campaigns for use in media, display, or direct mail advertising and other related services.
notation: 10101010
valid from: 2024-06-07

Advertising & Marketing
type: BicsLevel3Industry
type: Classifier
type: NamedIndividual
is industry of: Media
is contemporary version of: http://data.ga-group.nl/ics/bics/101010
is version of: http://data.ga-group.nl/ics/bics/101010
replaces: http://data.ga-group.nl/ics/bics/2020/101010
imported on: 2026-06-08T13:40:52.236Z
last refreshed on: 2026-06-08T13:41:38.450Z
source accessed on: 2024-06-05T14:42:36Z
source last accessed on: 2024-06-05T14:42:36Z
label: Pubblicità e marketing @it
label: Publicidad y mercadeo @es
label: Publicidade e Marketing @pt
label: Publicité et marketing @fr
label: Werbung & Marketing @de
label: Реклама и маркетинг @ru
label: 广告与营销 @zh
label: 広告･ﾏｰｹﾃｨﾝｸﾞ @ja
label: 廣告及行銷 @zh-hant
label: 광고 & 마케팅 @ko
definition: This industry includes companies that provide advertising and marketing services. Includes the creation of advertising campaigns for use in media, display, or direct mail advertising and other related services.
notation: 101010
valid from: 2024-06-07

Cable & Satellite Video Svcs
type: BicsLevel5Segment
type: Classifier
type: NamedIndividual
is level5 segment of: Cable & Satellite
is contemporary version of: http://data.ga-group.nl/ics/bics/1010111010
is version of: http://data.ga-group.nl/ics/bics/1010111010
replaces: http://data.ga-group.nl/ics/bics/2020/1010111010
imported on: 2026-06-08T13:40:52.236Z
last refreshed on: 2026-06-08T13:41:38.450Z
source accessed on: 2024-06-05T14:42:36Z
source last accessed on: 2024-06-05T14:42:36Z
label: Kabel- & Satellitenvideo-Svcs @de
label: Serv a cabo e satélite - Vídeo @pt
label: Serv video cavo e satellite @it
label: Serv video p/cable y satélite @es
label: Srvc vidéo par câble/satellite @fr
label: Кабельное и спутн. видео @ru
label: Кабельное и с��утн. видео @ru
label: 有線影片服務 @zh-hant
label: 有线与卫星视频服务 @zh
label: 케이블 & 위성 비디오 서비스 @ko
label: ｹｰﾌﾞﾙﾃﾚﾋﾞ･衛星放送ｻｰﾋﾞｽ @ja
definition: This segment includes companies that offer cable or satellite television access. Access is usually provided to the customer through a set-top box.
notation: 1010111010
valid from: 2024-06-07

Cable & Satellite Internet Svcs
type: BicsLevel5Segment
type: Classifier
type: NamedIndividual
is level5 segment of: Cable & Satellite
is contemporary version of: http://data.ga-group.nl/ics/bics/1010111011
is version of: http://data.ga-group.nl/ics/bics/1010111011
replaces: http://data.ga-group.nl/ics/bics/2020/1010111011
imported on: 2026-06-08T13:40:52.236Z
last refreshed on: 2026-06-08T13:41:38.450Z
source accessed on: 2024-06-05T14:42:36Z
source last accessed on: 2024-06-05T14:42:36Z
label: Kabel-, Satell.-, Internet-Svcs @de
label: Serv Internet p/cable y satélite @es
label: Serv a cabo e satélite - Internet @pt
label: Serv internet cavo e satellite @it
label: Srvc Internet câble/satellite @fr
label: Кабельный и спутн. интернет @ru
label: 有線網路服務-媒體 @zh-hant
label: 有线与卫星互联网服务 @zh
label: 케이블 & 위성 인터넷 서비스 @ko
label: ｹｰﾌﾞﾙﾃﾚﾋﾞ･衛星ｲﾝﾀｰﾈｯﾄｻｰﾋﾞｽ @ja
definition: This segment includes cable companies that provide Internet and broadband services.
notation: 1010111011
valid from: 2024-06-07

Cable & Satellite Phone Svcs
type: BicsLevel5Segment
type: Classifier
type: NamedIndividual
is level5 segment of: Cable & Satellite
is contemporary version of: http://data.ga-group.nl/ics/bics/1010111012
is version of: http://data.ga-group.nl/ics/bics/1010111012
replaces: http://data.ga-group.nl/ics/bics/2020/1010111012
imported on: 2026-06-08T13:40:52.236Z
last refreshed on: 2026-06-08T13:41:38.450Z
source accessed on: 2024-06-05T14:42:36Z
source last accessed on: 2024-06-05T14:42:36Z
label: Kabel- & Satellitentelefon-Svcs @de
label: Serv a cabo e satélite - Telefone @pt
label: Serv teléfono p/cable y satélite @es
label: Serv telefono cavo e satellite @it
label: Srvc téléphon câble/satellite @fr
label: Кабельный и спутн. телефон @ru
label: 有線電話服務-媒體 @zh-hant
label: 有線��話服務-媒體 @zh-hant
label: 有线与卫星电话服务 @zh
label: 케이블 & 위성 전화 서비스 @ko
label: ｹｰﾌﾞﾙﾃﾚﾋﾞ･衛星電話ｻｰﾋﾞｽ @ja
definition: This segment includes cable companies that provide phone services.
notation: 1010111012
valid from: 2024-06-07

Cable & Satellite
type: BicsLevel4SubIndustry
type: Classifier
type: NamedIndividual
is sub industry of: Cable & Satellite
is contemporary version of: http://data.ga-group.nl/ics/bics/10101110
is version of: http://data.ga-group.nl/ics/bics/10101110
replaces: http://data.ga-group.nl/ics/bics/2020/10101110
imported on: 2026-06-08T13:40:52.236Z
last refreshed on: 2026-06-08T13:41:38.450Z
source accessed on: 2024-06-05T14:42:36Z
source last accessed on: 2024-06-05T14:42:36Z
label: Câble et Satellite @fr
label: Cable y satélite @es
label: Cabo e satélite @pt
label: Cavo e satellite @it
label: Kabel & Satelliten @de
label: Кабельное и спутник. @ru
label: 有線及衛星電視 @zh-hant
label: 有线和卫星 @zh
label: 케이블 & 위성 @ko
label: ｹｰﾌﾞﾙﾃﾚﾋﾞ･衛星放送 @ja
definition: This industry subgroup includes companies that provide subscription television or radio services delivered by coaxial cable or satellite dish. Cable companies may also provide Internet and phone service through a cable.
notation: 10101110
valid from: 2024-06-07

Cable & Satellite
type: BicsLevel3Industry
type: Classifier
type: NamedIndividual
is industry of: Media
is contemporary version of: http://data.ga-group.nl/ics/bics/101011
is version of: http://data.ga-group.nl/ics/bics/101011
replaces: http://data.ga-group.nl/ics/bics/2020/101011
imported on: 2026-06-08T13:40:52.236Z
last refreshed on: 2026-06-08T13:41:38.450Z
source accessed on: 2024-06-05T14:42:36Z
source last accessed on: 2024-06-05T14:42:36Z
label: Câble et satellite @fr
label: Cable y satélite @es
label: Cabo e satélite @pt
label: Cavo e satellite @it
label: Kabel & Satelliten @de
label: Кабельное и спутник. @ru
label: 有線及衛星電視 @zh-hant
label: 有线和卫星 @zh
label: 케이블 & 위성 @ko
label: ｹｰﾌﾞﾙﾃﾚﾋﾞ･衛星放送 @ja
definition: This industry includes companies that provide subscription television or radio services delivered by coaxial cable or satellite dish. Cable companies may also provide Internet and phone service through a cable.
notation: 101011
valid from: 2024-06-07

Film Production
type: BicsLevel7Segment
type: Classifier
type: NamedIndividual
is level7 segment of: Film & TV Production
is contemporary version of: http://data.ga-group.nl/ics/bics/10101210101010
is version of: http://data.ga-group.nl/ics/bics/10101210101010
replaces: http://data.ga-group.nl/ics/bics/2020/10101210101010
imported on: 2026-06-08T13:40:52.236Z
last refreshed on: 2026-06-08T13:41:38.450Z
source accessed on: 2024-06-05T14:42:36Z
source last accessed on: 2024-06-05T14:42:36Z
label: Filmproduktion @de
label: Produção de filmes @pt
label: Producción de películas @es
label: Production de films @fr
label: Produzione pellicole @it
label: Кинопроизводство @ru
label: 影片製作 @zh-hant
label: 映画 制作 @ja
label: 电影制作 @zh
label: 영화 프로덕션 @ko
definition: This segment includes companies that produce films.
notation: 10101210101010
valid from: 2024-06-07

TV & Video Production
type: BicsLevel7Segment
type: Classifier
type: NamedIndividual
is level7 segment of: Film & TV Production
is contemporary version of: http://data.ga-group.nl/ics/bics/10101210101011
is version of: http://data.ga-group.nl/ics/bics/10101210101011
replaces: http://data.ga-group.nl/ics/bics/2020/10101210101011
imported on: 2026-06-08T13:40:52.236Z
last refreshed on: 2026-06-08T13:41:38.450Z
source accessed on: 2024-06-05T14:42:36Z
source last accessed on: 2024-06-05T14:42:36Z
label: Produção de vídeo e tv @pt
label: Producción de televisión y video @es
label: Production TV et vidéo @fr
label: Produzione TV e video @it
label: TV & 비디오 프로덕션 @ko
label: TV & 비���오 프로덕션 @ko
label: TV- & Videoproduktion @de
label: Теле- и видео производство @ru
label: 电视与视频制作 @zh
label: 電視及影音製作 @zh-hant
label: ﾃﾚﾋﾞ･ﾋﾞﾃﾞｵ 制作 @ja
definition: This segment includes companies that produce television programs and other videos.
notation: 10101210101011
valid from: 2024-06-07

Film & TV Production
type: BicsLevel6Segment
type: Classifier
type: NamedIndividual
is level6 segment of: Film & TV Production & Distr
is contemporary version of: http://data.ga-group.nl/ics/bics/101012101010
is version of: http://data.ga-group.nl/ics/bics/101012101010
replaces: http://data.ga-group.nl/ics/bics/2020/101012101010
imported on: 2026-06-08T13:40:52.236Z
last refreshed on: 2026-06-08T13:41:38.450Z
source accessed on: 2024-06-05T14:42:36Z
source last accessed on: 2024-06-05T14:42:36Z
label: Film- & TV-Produktion @de
label: Produção de filmes e TV @pt
label: Producción de películas y televisión @es
label: Production de films et TV @fr
label: Produzione pellicole e TV @it
label: Кино- и ТВ производство @ru
label: 影片及電視製作 @zh-hant
label: 映画･ﾃﾚﾋﾞ 制作 @ja
label: 电影与电视制作 @zh
label: 영화 & TV 프로덕션 @ko
definition: This segment includes companies that produce film, videos, television programs, or television commercials.
notation: 101012101010
valid from: 2024-06-07

Film Distribution
type: BicsLevel7Segment
type: Classifier
type: NamedIndividual
is level7 segment of: Film & Video Distribution
is contemporary version of: http://data.ga-group.nl/ics/bics/10101210101110
is version of: http://data.ga-group.nl/ics/bics/10101210101110
replaces: http://data.ga-group.nl/ics/bics/2020/10101210101110
imported on: 2026-06-08T13:40:52.236Z
last refreshed on: 2026-06-08T13:41:38.450Z
source accessed on: 2024-06-05T14:42:36Z
source last accessed on: 2024-06-05T14:42:36Z
label: Distribución de películas @es
label: Distribuci��n de películas @es
label: Distribuição de filmes @pt
label: Distribui��ão de filmes @pt
label: Distribution de films @fr
label: Distribuzione pellicole @it
label: Filmvertrieb @de
label: Кинопрокат @ru
label: 影片發行 @zh-hant
label: 映画 配給 @ja
label: 电影发行 @zh
label: 영화 배급 @ko
definition: This segment includes companies that acquire film distribution rights and distribute videotapes, DVDs and other formats to movie theaters, television networks and TV stations.
notation: 10101210101110
valid from: 2024-06-07

TV Show Syndication
type: BicsLevel7Segment
type: Classifier
type: NamedIndividual
is level7 segment of: Film & Video Distribution
is contemporary version of: http://data.ga-group.nl/ics/bics/10101210101111
is version of: http://data.ga-group.nl/ics/bics/10101210101111
replaces: http://data.ga-group.nl/ics/bics/2020/10101210101111
imported on: 2026-06-08T13:40:52.236Z
last refreshed on: 2026-06-08T13:41:38.450Z
source accessed on: 2024-06-05T14:42:36Z
source last accessed on: 2024-06-05T14:42:36Z
label: Consórcio de programa de TV @pt
label: Fernsehshowsyndikation @de
label: Sindicación de programas de televisión @es
label: Syndication TV @fr
label: TV 쇼 신디케이션 @ko
label: Vendita serie TV @it
label: Распространение телешоу на постанц. основе @ru
label: 电视节目联合供应 @zh
label: 電視節目聯合供應 @zh-hant
label: ﾃﾚﾋﾞ番組販売 @ja
definition: This segment includes companies that acquire TV show distribution rights and distribute to television networks and stations.
notation: 10101210101111
valid from: 2024-06-07

Film & Video Distribution
type: BicsLevel6Segment
type: Classifier
type: NamedIndividual
is level6 segment of: Film & TV Production & Distr
is contemporary version of: http://data.ga-group.nl/ics/bics/101012101011
is version of: http://data.ga-group.nl/ics/bics/101012101011
replaces: http://data.ga-group.nl/ics/bics/2020/101012101011
imported on: 2026-06-08T13:40:52.236Z
last refreshed on: 2026-06-08T13:41:38.450Z
source accessed on: 2024-06-05T14:42:36Z
source last accessed on: 2024-06-05T14:42:36Z
label: Distribución de película y video @es
label: Distribuição de filme e vídeo @pt
label: Distribution de films et vidéo @fr
label: Distribuzione pellicole e video @it
label: Film- & Videovertrieb @de
label: Кино- и видео прокат @ru
label: 影片及影音發行 @zh-hant
label: 映画･ﾋﾞﾃﾞｵ 制作･配給 @ja
label: 电影与视频发行 @zh
label: 영화 & 비디오 배급 @ko
definition: This segment includes companies that acquire film and video distribution rights and distribute film, videotapes, DVDs and other formats to movie theaters, television networks and TV stations.
notation: 101012101011
valid from: 2024-06-07

Teleprod & Postprod Services
type: BicsLevel6Segment
type: Classifier
type: NamedIndividual
is level6 segment of: Film & TV Production & Distr
is contemporary version of: http://data.ga-group.nl/ics/bics/101012101012
is version of: http://data.ga-group.nl/ics/bics/101012101012
replaces: http://data.ga-group.nl/ics/bics/2020/101012101012
imported on: 2026-06-08T13:40:52.236Z
last refreshed on: 2026-06-08T13:41:38.450Z
source accessed on: 2024-06-05T14:42:36Z
source last accessed on: 2024-06-05T14:42:36Z
label: Fernsehprod. & Nachbearbeitungsdienste @de
label: Serviços de teleprodução pós prod @pt
label: Services de téléprod et postproduction @fr
label: Servicios de tele producción y post producción @es
label: Servizi teleprod e postprod @it
label: Телепроизв. и проч. монтажн. услуги @ru
label: 影像制作及后期制作服务 @zh
label: 影像製作及後製服務 @zh-hant
label: 番組制作･編集ｻｰﾋﾞｽ @ja
label: 영상제작 & 영상물 편집 서비스업 @ko
definition: This segment includes companies that provide postproduction services for film and TV. Includes editing film, titling, subtitling, credits, and closed captioning.
notation: 101012101012
valid from: 2024-06-07

Online Film & TV Streaming
type: BicsLevel6Segment
type: Classifier
type: NamedIndividual
is level6 segment of: Film & TV Production & Distr
is contemporary version of: http://data.ga-group.nl/ics/bics/101012101013
is version of: http://data.ga-group.nl/ics/bics/101012101013
imported on: 2026-06-08T13:40:52.236Z
last refreshed on: 2026-06-08T13:41:38.450Z
source accessed on: 2024-06-05T14:42:36Z
source last accessed on: 2024-06-05T14:42:36Z
label: Film e TV in streaming online @it
label: Películas online y TV por streaming @es
label: Streaming de filmes e TV on-line @pt
label: Streaming de films/TV en ligne @fr
label: Streaming von Filmen & TV online @de
label: Онлайн вещание - фильмы и ТВ @ru
label: 在线影视流媒体 @zh
label: 線上影片及電視串流 @zh-hant
label: 온라인 영화 & TV 스트리밍 @ko
label: ｵﾝﾗｲﾝ映画&TVｽﾄﾘｰﾐﾝｸﾞ @ja
definition: This segment includes companies that create, acquire distribution rights, and distribute film and television shows directly to consumers online via websites or mobile applications. Excludes companies that do not produce content.
notation: 101012101013
valid from: 2024-06-07

Film & TV Production & Distr
type: BicsLevel5Segment
type: Classifier
type: NamedIndividual
is level5 segment of: Film & TV
is contemporary version of: http://data.ga-group.nl/ics/bics/1010121010
is version of: http://data.ga-group.nl/ics/bics/1010121010
replaces: http://data.ga-group.nl/ics/bics/2020/1010121010
imported on: 2026-06-08T13:40:52.236Z
last refreshed on: 2026-06-08T13:41:38.450Z
source accessed on: 2024-06-05T14:42:36Z
source last accessed on: 2024-06-05T14:42:36Z
label: Film- & TV-Produktion & -Vertrieb @de
label: Prod et distrib de films et TV @fr
label: Produção e distr de filmes e TV @pt
label: Producción y distribución de películas y televisión @es
label: Produzione e distrib pellicole e TV @it
label: Кино- и ТВ произв. и прокат @ru
label: 影片及電視製作及發行 @zh-hant
label: 映画･ﾃﾚﾋﾞ 制作･配給 @ja
label: 电影与电视制作及发行 @zh
label: 영화 & TV 프로덕션 & 배급 @ko
definition: This segment includes companies that produce and/or distribute film, videos, television programs, or television commercials.
notation: 1010121010
valid from: 2024-06-07

Adv Rev - Cable Networks
type: BicsLevel7Segment
type: Classifier
type: NamedIndividual
is level7 segment of: Cable Networks
is contemporary version of: http://data.ga-group.nl/ics/bics/10101210111010
is version of: http://data.ga-group.nl/ics/bics/10101210111010
replaces: http://data.ga-group.nl/ics/bics/2020/10101210111010
imported on: 2026-06-08T13:40:52.236Z
last refreshed on: 2026-06-08T13:41:38.450Z
source accessed on: 2024-06-05T14:42:36Z
source last accessed on: 2024-06-05T14:42:36Z
label: Ingreso de publicidad-redes de cable @es
label: Rec prop - Redes a cabo @pt
label: Rev pub-réseaux de câble @fr
label: Ric pubb - Reti via cavo @it
label: Werbeerlös - Kabelnetze @de
label: Рекл. врчк - кабельные сети @ru
label: 广告收入-有线网络 @zh
label: 広告売上高-ｹｰﾌﾞﾙﾈｯﾄﾜｰｸ @ja
label: 廣告收入-有線網路 @zh-hant
label: 광고 수익 - 케이블 네트워크 @ko
definition: This segment includes revenue that cable networks generate from advertising.
notation: 10101210111010
valid from: 2024-06-07

Other Rev - Cable Networks
type: BicsLevel7Segment
type: Classifier
type: NamedIndividual
is level7 segment of: Cable Networks
is contemporary version of: http://data.ga-group.nl/ics/bics/10101210111011
is version of: http://data.ga-group.nl/ics/bics/10101210111011
replaces: http://data.ga-group.nl/ics/bics/2020/10101210111011
imported on: 2026-06-08T13:40:52.236Z
last refreshed on: 2026-06-08T13:41:38.450Z
source accessed on: 2024-06-05T14:42:36Z
source last accessed on: 2024-06-05T14:42:36Z
label: Altri ric - Reti via cavo @it
label: Autres rev- Réseaux de câble @fr
label: Otro ing-redes de cable @es
label: Out rec- Redes a cabo @pt
label: Sonstiger Erlös - Kabelnetze @de
label: Пр. выручка - кабельные сети @ru
label: その他売上高-ｹｰﾌﾞﾙﾈｯﾄﾜｰｸ @ja
label: 其他收入-有線網路 @zh-hant
label: 其他收入-有线网络 @zh
label: 기타 수익 - 케이블 네트워크 @ko
definition: This segment includes revenue that cable networks generate from sources other than advertising.
notation: 10101210111011
valid from: 2024-06-07

Cable Networks
type: BicsLevel6Segment
type: Classifier
type: NamedIndividual
is level6 segment of: TV Media Networks
is contemporary version of: http://data.ga-group.nl/ics/bics/101012101110
is version of: http://data.ga-group.nl/ics/bics/101012101110
replaces: http://data.ga-group.nl/ics/bics/2020/101012101110
imported on: 2026-06-08T13:40:52.236Z
last refreshed on: 2026-06-08T13:41:38.450Z
source accessed on: 2024-06-05T14:42:36Z
source last accessed on: 2024-06-05T14:42:36Z
label: Canali TV via cavo @it
label: Kabelnetze @de
label: Réseaux de câble @fr
label: Réseaux de c��ble @fr
label: Redes a cabo @pt
label: Redes de cable @es
label: Кабельные сети @ru
label: 有線網路 @zh-hant
label: 有线网络 @zh
label: 케이블 네트워크 @ko
label: ｹｰﾌﾞﾙﾈｯﾄﾜｰｸ @ja
definition: This segment includes companies that aggregate, market, and distribute television programs to cable companies, satellite companies, and wireline telecommunications companies. These networks negotiate with local and international distributors to broadcast programming on a subscription or fee basis.
notation: 101012101110
valid from: 2024-06-07

Adv Rev - TV Broadcast Netw
type: BicsLevel7Segment
type: Classifier
type: NamedIndividual
is level7 segment of: TV Broadcast Networks
is contemporary version of: http://data.ga-group.nl/ics/bics/10101210111110
is version of: http://data.ga-group.nl/ics/bics/10101210111110
replaces: http://data.ga-group.nl/ics/bics/2020/10101210111110
imported on: 2026-06-08T13:40:52.236Z
last refreshed on: 2026-06-08T13:41:38.450Z
source accessed on: 2024-06-05T14:42:36Z
source last accessed on: 2024-06-05T14:42:36Z
label: Ing an - estación de tv @es
label: Rec prop - Redes transm televisiva @pt
label: Rev de pub - Réseau de diffusion télé @fr
label: Ric pub-rete TV @it
label: Werbeerlös - TV Rundfunknetzwerke @de
label: Рекл. выручка - Сети телевещания @ru
label: 广告收入-电视广播网络 @zh
label: 広告売上高-ﾃﾚﾋﾞ放送ﾈｯﾄﾜｰｸ @ja
label: 廣告收入-電視播放網路 @zh-hant
label: 광고수익-TV 방송국 네트워크 @ko
definition: This segment includes revenue that TV broadcast networks generates from advertising.
notation: 10101210111110
valid from: 2024-06-07

Other Rev - TV Broadcast Netw
type: BicsLevel7Segment
type: Classifier
type: NamedIndividual
is level7 segment of: TV Broadcast Networks
is contemporary version of: http://data.ga-group.nl/ics/bics/10101210111111
is version of: http://data.ga-group.nl/ics/bics/10101210111111
replaces: http://data.ga-group.nl/ics/bics/2020/10101210111111
imported on: 2026-06-08T13:40:52.236Z
last refreshed on: 2026-06-08T13:41:38.450Z
source accessed on: 2024-06-05T14:42:36Z
source last accessed on: 2024-06-05T14:42:36Z
label: Altri ric - Reti teletrasmissione @it
label: Autres rev - Rés diffusion TV @fr
label: Otro ingreso - retransmisión de televisión @es
label: Outras rec - Redes transmissão TV @pt
label: Sonst. Erlös - Fernsehübertragungsnetze @de
label: Пр. выручка -сети телевещ. @ru
label: その他売上高-ﾃﾚﾋﾞ放送ﾈｯﾄﾜｰｸ @ja
label: 其他收入-电视广播网络 @zh
label: 其他收入-電視播放網路 @zh-hant
label: 기타 수익 - TV 방송국 네트워크 @ko
definition: This segment includes revenue that TV broadcast networks generate from sources other than advertising.
notation: 10101210111111
valid from: 2024-06-07

TV Broadcast Networks
type: BicsLevel6Segment
type: Classifier
type: NamedIndividual
is level6 segment of: TV Media Networks
is contemporary version of: http://data.ga-group.nl/ics/bics/101012101111
is version of: http://data.ga-group.nl/ics/bics/101012101111
replaces: http://data.ga-group.nl/ics/bics/2020/101012101111
imported on: 2026-06-08T13:40:52.236Z
last refreshed on: 2026-06-08T13:41:38.450Z
source accessed on: 2024-06-05T14:42:36Z
source last accessed on: 2024-06-05T14:42:36Z
label: Estaciones de tv @es
label: Réseaux de diffusion TV @fr
label: Redes transmissão televisiva @pt
label: Reti trasmissione TV @it
label: TV Rundfunknetzwerke @de
label: TV 방송국 네트워크 @ko
label: Сети телевещания @ru
label: 电视广播网络 @zh
label: 電視播放網路 @zh-hant
label: ﾃﾚﾋﾞ放送ﾈｯﾄﾜｰｸ @ja
definition: This segment includes companies that aggregate, market, and distribute television programs to affiliate TV broadcasting stations. These stations then transmit the programming to viewers over public airways.
notation: 101012101111
valid from: 2024-06-07

TV Media Networks
type: BicsLevel5Segment
type: Classifier
type: NamedIndividual
is level5 segment of: Film & TV
is contemporary version of: http://data.ga-group.nl/ics/bics/1010121011
is version of: http://data.ga-group.nl/ics/bics/1010121011
replaces: http://data.ga-group.nl/ics/bics/2020/1010121011
imported on: 2026-06-08T13:40:52.236Z
last refreshed on: 2026-06-08T13:41:38.450Z
source accessed on: 2024-06-05T14:42:36Z
source last accessed on: 2024-06-05T14:42:36Z
label: Estaciones de medios p/tv @es
label: Redes mídia televisiva @pt
label: Reti media TV @it
label: TV Mediennetzwerke @de
label: TV 미디어 네트워크 @ko
label: TV, médias, réseaux @fr
label: Сети ТВ-СМИ @ru
label: 电视媒体网络 @zh
label: 電視媒體網路 @zh-hant
label: ﾃﾚﾋﾞﾒﾃﾞｨｱﾈｯﾄﾜｰｸ @ja
definition: This segment includes companies that aggregate, market, and distribute television programs to TV broadcasting stations, cable companies, satellite companies, and wireline telecommunications companies. Programming may be produced in-house or acquired from external sources.
notation: 1010121011
valid from: 2024-06-07

Royalty Income - Film & TV
type: BicsLevel5Segment
type: Classifier
type: NamedIndividual
is level5 segment of: Film & TV
is contemporary version of: http://data.ga-group.nl/ics/bics/1010121012
is version of: http://data.ga-group.nl/ics/bics/1010121012
replaces: http://data.ga-group.nl/ics/bics/2020/1010121012
imported on: 2026-06-08T13:40:52.236Z
last refreshed on: 2026-06-08T13:41:38.450Z
source accessed on: 2024-06-05T14:42:36Z
source last accessed on: 2024-06-05T14:42:36Z
label: Ing de regalías - películas y TV @es
label: Lizenzerlös - Film & TV @de
label: Receita de royalty - Filme e TV @pt
label: Reddito concessioni-Film e TV @it
label: Royalties - film et TV @fr
label: Лиценз. сборы - кино- и ТВ @ru
label: 權利金收入-媒體 @zh-hant
label: 版权收入-电影与电视 @zh
label: 로열티 수익- 영화 & TV @ko
label: ﾛｲﾔﾙﾃｨ収入-映画･ﾃﾚﾋﾞ @ja
definition: This segment includes companies that generate revenue from their film and television assets (such as trademarks, brand names and/or agreements) for which a royalty payment or licensing fee is paid by others.
notation: 1010121012
valid from: 2024-06-07

Film & TV
type: BicsLevel4SubIndustry
type: Classifier
type: NamedIndividual
is sub industry of: Entertainment Content
is contemporary version of: http://data.ga-group.nl/ics/bics/10101210
is version of: http://data.ga-group.nl/ics/bics/10101210
replaces: http://data.ga-group.nl/ics/bics/2020/10101210
imported on: 2026-06-08T13:40:52.236Z
last refreshed on: 2026-06-08T13:41:38.450Z
source accessed on: 2024-06-05T14:42:36Z
source last accessed on: 2024-06-05T14:42:36Z
label: Film e TV @it
label: Filme e TV @pt
label: Films et TV @fr
label: Películas y televisión @es
label: Кино и ТВ @ru
label: 影片及電視 @zh-hant
label: 映画･ﾃﾚﾋﾞ @ja
label: 电影与电视 @zh
label: 영화 & TV @ko
definition: This industry subgroup includes companies that create, acquire, distribute, or broadcast film and television content.
notation: 10101210
valid from: 2024-06-07

Integrated Record Prod & Distr
type: BicsLevel5Segment
type: Classifier
type: NamedIndividual
is level5 segment of: Music
is contemporary version of: http://data.ga-group.nl/ics/bics/1010121110
is version of: http://data.ga-group.nl/ics/bics/1010121110
replaces: http://data.ga-group.nl/ics/bics/2020/1010121110
imported on: 2026-06-08T13:40:52.236Z
last refreshed on: 2026-06-08T13:41:38.450Z
source accessed on: 2024-06-05T14:42:36Z
source last accessed on: 2024-06-05T14:42:36Z
label: Integrierte Musikprod. & -vertrieb @de
label: Prod e dist de gravação integrada @pt
label: Prod e distrib registrazioni integrate @it
label: Prod int d'enregistrements et distrib @fr
label: Produc y distr grabación integr @es
label: Объед. запись и распрост. пластинок @ru
label: 整合唱片製作及發行 @zh-hant
label: 総合ﾚｺｰﾄﾞ制作･配給 @ja
label: 综合录音制品制作与发行 @zh
label: 통합 음반 제작 & 배급 @ko
definition: This segment includes companies that release, promote, and distribute sound recordings. These companies manufacture, or arrange for the manufacture of recordings, such as audio tapes/cassettes and compact discs, and promote and distribute these products to wholesalers, retailers, or directly to the public. Companies in this segment produce master recordings themselves or obtain reproduction and distribution rights to master recordings produced by record production companies or other integrated record companies.
notation: 1010121110
valid from: 2024-06-07

Music Publishers
type: BicsLevel5Segment
type: Classifier
type: NamedIndividual
is level5 segment of: Music
is contemporary version of: http://data.ga-group.nl/ics/bics/1010121111
is version of: http://data.ga-group.nl/ics/bics/1010121111
replaces: http://data.ga-group.nl/ics/bics/2020/1010121111
imported on: 2026-06-08T13:40:52.236Z
last refreshed on: 2026-06-08T13:41:38.450Z
source accessed on: 2024-06-05T14:42:36Z
source last accessed on: 2024-06-05T14:42:36Z
label: Editeurs de musique @fr
label: Editoras de música @es
label: Editori di musica @it
label: Musikverleger @de
label: Издатели муз. произведений @ru
label: 音乐出版商 @zh
label: 音楽出版 @ja
label: 音樂出版 @zh-hant
label: 음반 제작업 @ko
definition: This segment includes companies that acquire and register copyrights for musical compositions, and promote and authorize the use of these compositions in recordings, radio, television, motion pictures, live performances, print or other media. Companies in this segment represent the interests of the songwriter or other owners of musical compositions to produce revenues from the use of such works, generally through licensing agreements. These companies may own the copyright or act as administrator of the music copyrights on behalf of copyright owners. Publishers of music books and sheet music are included in this segment.
notation: 1010121111
valid from: 2024-06-07

Record Production
type: BicsLevel5Segment
type: Classifier
type: NamedIndividual
is level5 segment of: Music
is contemporary version of: http://data.ga-group.nl/ics/bics/1010121112
is version of: http://data.ga-group.nl/ics/bics/1010121112
replaces: http://data.ga-group.nl/ics/bics/2020/1010121112
imported on: 2026-06-08T13:40:52.236Z
last refreshed on: 2026-06-08T13:41:38.450Z
source accessed on: 2024-06-05T14:42:36Z
source last accessed on: 2024-06-05T14:42:36Z
label: Musikproduktion @de
label: Prod. enreg. sonore @fr
label: Produção de disco @pt
label: Producción de discos @es
label: Produzione di dischi @it
label: Запись пластинок @ru
label: 唱片製作 @zh-hant
label: 录制产品制作 @zh
label: 음반 제작업 @ko
label: ﾚｺｰﾄﾞ制作 @ja
definition: This segment includes companies that produce records, tapes, and compact discs. These companies contract with artists and arrange and finance the production of original master recordings. These companies also hold the copyright to the master recording and derive most of their revenues from the sales, leasing, and licensing of master recordings. Such companies do not have their own duplication or distribution capabilities.
notation: 1010121112
valid from: 2024-06-07

Music
type: BicsLevel4SubIndustry
type: Classifier
type: NamedIndividual
is sub industry of: Entertainment Content
is contemporary version of: http://data.ga-group.nl/ics/bics/10101211
is version of: http://data.ga-group.nl/ics/bics/10101211
replaces: http://data.ga-group.nl/ics/bics/2020/10101211
imported on: 2026-06-08T13:40:52.236Z
last refreshed on: 2026-06-08T13:41:38.450Z
source accessed on: 2024-06-05T14:42:36Z
source last accessed on: 2024-06-05T14:42:36Z
label: Música @es
label: Musica @it
label: Musik @de
label: Musique @fr
label: Музыка @ru
label: 音乐 @zh
label: 音楽 @ja
label: 音樂製作及發行 @zh-hant
label: 음악 @ko
definition: This industry subgroup includes companies that acquire, produce, and distribute music content.
notation: 10101211
valid from: 2024-06-07

Mobile & Online Games
type: BicsLevel5Segment
type: Classifier
type: NamedIndividual
is level5 segment of: Video Games
is contemporary version of: http://data.ga-group.nl/ics/bics/1010121210
is version of: http://data.ga-group.nl/ics/bics/1010121210
replaces: http://data.ga-group.nl/ics/bics/2020/1010121210
imported on: 2026-06-08T13:40:52.236Z
last refreshed on: 2026-06-08T13:41:38.450Z
source accessed on: 2024-06-05T14:42:36Z
source last accessed on: 2024-06-05T14:42:36Z
label: Giochi online e mobile @it
label: Jeux sur mobiles et en ligne @fr
label: Jogos online e móveis @pt
label: Juegos en línea y móviles @es
label: Mobiles & Online-Spiele @de
label: Мобильные и онлайн-игры @ru
label: 手机及在线游戏 @zh
label: 數位遊戲 @zh-hant
label: 모바일 & 온라인 게임 @ko
label: ﾓﾊﾞｲﾙ･ｵﾝﾗｲﾝｹﾞｰﾑ @ja
definition: This segment includes companies that primarily publish and distribute video game software for mobile phones or websites.
notation: 1010121210
valid from: 2024-06-07

Console & PC Games
type: BicsLevel5Segment
type: Classifier
type: NamedIndividual
is level5 segment of: Video Games
is contemporary version of: http://data.ga-group.nl/ics/bics/1010121211
is version of: http://data.ga-group.nl/ics/bics/1010121211
replaces: http://data.ga-group.nl/ics/bics/2020/1010121211
imported on: 2026-06-08T13:40:52.236Z
last refreshed on: 2026-06-08T13:41:38.450Z
source accessed on: 2024-06-05T14:42:36Z
source last accessed on: 2024-06-05T14:42:36Z
label: Giochi console e PC @it
label: Jeux sur console et PC @fr
label: Jogos de console e computador @pt
label: Juegos de consola y ordenador @es
label: Konsole & PC-Spiele @de
label: Игровые приставки, ПК @ru
label: 套裝遊戲 @zh-hant
label: 游戏机及电脑游戏 @zh
label: 콘솔 & PC 게임 @ko
label: ｹﾞｰﾑ機･ﾊﾟｿｺﾝｹﾞｰﾑ @ja
definition: This segment includes companies that publish and distribute video game software for personal computers or video game consoles.
notation: 1010121211
valid from: 2024-06-07

Video Games
type: BicsLevel4SubIndustry
type: Classifier
type: NamedIndividual
is sub industry of: Entertainment Content
is contemporary version of: http://data.ga-group.nl/ics/bics/10101212
is version of: http://data.ga-group.nl/ics/bics/10101212
replaces: http://data.ga-group.nl/ics/bics/2020/10101212
imported on: 2026-06-08T13:40:52.236Z
last refreshed on: 2026-06-08T13:41:38.450Z
source accessed on: 2024-06-05T14:42:36Z
source last accessed on: 2024-06-05T14:42:36Z
label: Jeux vidéo @fr
label: Juegos de video @es
label: Vídeo games @pt
label: Videogiochi @it
label: Videospiele @de
label: Видеоигры @ru
label: 电子游戏 @zh
label: 電玩遊戲軟體 @zh-hant
label: 비디오 게임 @ko
label: ﾋﾞﾃﾞｵｹﾞｰﾑ @ja
definition: This industry subgroup includes companies that publish and/or distribute video game software.
notation: 10101212
valid from: 2024-06-07

Entertainment Content
type: BicsLevel3Industry
type: Classifier
type: NamedIndividual
is industry of: Media
is contemporary version of: http://data.ga-group.nl/ics/bics/101012
is version of: http://data.ga-group.nl/ics/bics/101012
replaces: http://data.ga-group.nl/ics/bics/2020/101012
imported on: 2026-06-08T13:40:52.236Z
last refreshed on: 2026-06-08T13:41:38.450Z
source accessed on: 2024-06-05T14:42:36Z
source last accessed on: 2024-06-05T14:42:36Z
label: Conteúdo entretenimento @pt
label: Contenido entretenimiento @es
label: Contenus de divertissement @fr
label: Contenuto intrattenimento @it
label: Unterhaltungsinhalt @de
label: Развлекательное содерж. @ru
label: 娛樂內容 @zh-hant
label: 娯楽ｺﾝﾃﾝﾂ @ja
label: 娱乐内容 @zh
label: 엔터테인먼트 콘텐츠 @ko
definition: This industry includes companies that create entertainment content or acquire the right to distribute content and sell advertising over cable or broadcast media, such as television or radio. Includes entertainment programs, news, sports, and educational and children's television programming, as well as the creation of music and video games. Excludes content distributed via the Internet (see Internet Media).
notation: 101012
valid from: 2024-06-07

Professional Book Publishers
type: BicsLevel6Segment
type: Classifier
type: NamedIndividual
is level6 segment of: Book Publishers
is contemporary version of: http://data.ga-group.nl/ics/bics/101013101010
is version of: http://data.ga-group.nl/ics/bics/101013101010
replaces: http://data.ga-group.nl/ics/bics/2020/101013101010
imported on: 2026-06-08T13:40:52.236Z
last refreshed on: 2026-06-08T13:41:38.450Z
source accessed on: 2024-06-05T14:42:36Z
source last accessed on: 2024-06-05T14:42:36Z
label: Editeurs de livres professionnels @fr
label: Editoras de libros profesionales @es
label: Editoras de livros profissionais @pt
label: Editoria - libri professionali @it
label: Verlag für Fachbücher @de
label: Издатели профессиональных книг @ru
label: 专业书籍出版社 @zh
label: 専門書出版 @ja
label: 專業書籍出版社 @zh-hant
label: 전문서적 출판사 @ko
definition: This segment includes companies that publish books used by specific professions.
notation: 101013101010
valid from: 2024-06-07

School Textbook Publishers
type: BicsLevel6Segment
type: Classifier
type: NamedIndividual
is level6 segment of: Book Publishers
is contemporary version of: http://data.ga-group.nl/ics/bics/101013101011
is version of: http://data.ga-group.nl/ics/bics/101013101011
replaces: http://data.ga-group.nl/ics/bics/2020/101013101011
imported on: 2026-06-08T13:40:52.236Z
last refreshed on: 2026-06-08T13:41:38.450Z
source accessed on: 2024-06-05T14:42:36Z
source last accessed on: 2024-06-05T14:42:36Z
label: Editeurs de livres scolaires @fr
label: Editoras de libros escolares @es
label: Editoras de livros acadêmicos @pt
label: Editoria - libri scolastici @it
label: Verlag für Schulbücher @de
label: Издатели школьных учебников @ru
label: 教科书出版社 @zh
label: 教科書出版 @ja
label: 教科書出版社 @zh-hant
label: 학교 교과서 출판사 @ko
definition: This segment includes companies that publish school textbooks.
notation: 101013101011
valid from: 2024-06-07

Book Publishers
type: BicsLevel5Segment
type: Classifier
type: NamedIndividual
is level5 segment of: Publishing
is contemporary version of: http://data.ga-group.nl/ics/bics/1010131010
is version of: http://data.ga-group.nl/ics/bics/1010131010
replaces: http://data.ga-group.nl/ics/bics/2020/1010131010
imported on: 2026-06-08T13:40:52.236Z
last refreshed on: 2026-06-08T13:41:38.450Z
source accessed on: 2024-06-05T14:42:36Z
source last accessed on: 2024-06-05T14:42:36Z
label: Buchverlage @de
label: Editeurs de livres @fr
label: Editoras de livros @pt
label: Editoras @es
label: Editori di libri @it
label: Книгоиздательства @ru
label: 图书出版商 @zh
label: 書籍出版 @ja
label: 서적 출판업 @ko
definition: This segment includes companies that publish and distribute books. These companies provide book design, editing and marketing activities.
notation: 1010131010
valid from: 2024-06-07

Advertising Rev - Newspaper
type: BicsLevel6Segment
type: Classifier
type: NamedIndividual
is level6 segment of: Newspaper Publishers
is contemporary version of: http://data.ga-group.nl/ics/bics/101013101110
is version of: http://data.ga-group.nl/ics/bics/101013101110
replaces: http://data.ga-group.nl/ics/bics/2020/101013101110
imported on: 2026-06-08T13:40:52.236Z
last refreshed on: 2026-06-08T13:41:38.450Z
source accessed on: 2024-06-05T14:42:36Z
source last accessed on: 2024-06-05T14:42:36Z
label: Ingreso de publicidad - periódico @es
label: Rec propaganda - Jornais @pt
label: Rev de publicité - Journaux @fr
label: Ric pubblicitari - Quotidiano @it
label: Werbeerlös - Zeitung @de
label: Рекламная выручка - газета @ru
label: 广告收入-报纸 @zh
label: 広告売上高-新聞 @ja
label: 廣告收入-報紙 @zh-hant
label: 광고 수익 - 신문 @ko
definition: This segment includes revenue that newspaper publishers generate from advertising.
notation: 101013101110
valid from: 2024-06-07

Circulation Rev - Newspaper
type: BicsLevel6Segment
type: Classifier
type: NamedIndividual
is level6 segment of: Newspaper Publishers
is contemporary version of: http://data.ga-group.nl/ics/bics/101013101111
is version of: http://data.ga-group.nl/ics/bics/101013101111
replaces: http://data.ga-group.nl/ics/bics/2020/101013101111
imported on: 2026-06-08T13:40:52.236Z
last refreshed on: 2026-06-08T13:41:38.450Z
source accessed on: 2024-06-05T14:42:36Z
source last accessed on: 2024-06-05T14:42:36Z
label: Auflagenerlös - Zeitung @de
label: Ingreso circulación - periódicos @es
label: Rec circulação - Jornais @pt
label: Rev de circulation - Journaux @fr
label: Ric circolazione - Quotidiano @it
label: Врчк от продажи тиража - газета @ru
label: 发行收入-报纸 @zh
label: 新聞売上高-新聞 @ja
label: 發行收入-報紙 @zh-hant
label: 발행 수익 - 신문 @ko
definition: This segment includes revenue that newspaper publishers generate from circulation.
notation: 101013101111
valid from: 2024-06-07

Other Revenue - Newspaper
type: BicsLevel6Segment
type: Classifier
type: NamedIndividual
is level6 segment of: Newspaper Publishers
is contemporary version of: http://data.ga-group.nl/ics/bics/101013101112
is version of: http://data.ga-group.nl/ics/bics/101013101112
replaces: http://data.ga-group.nl/ics/bics/2020/101013101112
imported on: 2026-06-08T13:40:52.236Z
last refreshed on: 2026-06-08T13:41:38.450Z
source accessed on: 2024-06-05T14:42:36Z
source last accessed on: 2024-06-05T14:42:36Z
label: Altri ricavi - Quotidiano @it
label: Autres revenus - Journaux @fr
label: Otro ingreso - periódicos @es
label: Outras receitas - Jornais @pt
label: Sonstiger Erlös - Zeitung @de
label: Прочая выручка - газета @ru
label: その他売上高-新聞 @ja
label: 其他收入-報紙 @zh-hant
label: 其他收入-报纸 @zh
label: 기타 수익 - 신문 @ko
definition: This segment includes revenue that newspaper publishers generate from sources other than advertising and circulation.
notation: 101013101112
valid from: 2024-06-07

Newspaper Publishers
type: BicsLevel5Segment
type: Classifier
type: NamedIndividual
is level5 segment of: Publishing
is contemporary version of: http://data.ga-group.nl/ics/bics/1010131011
is version of: http://data.ga-group.nl/ics/bics/1010131011
replaces: http://data.ga-group.nl/ics/bics/2020/1010131011
imported on: 2026-06-08T13:40:52.236Z
last refreshed on: 2026-06-08T13:41:38.450Z
source accessed on: 2024-06-05T14:42:36Z
source last accessed on: 2024-06-05T14:42:36Z
label: Edit periódicos @es
label: Editeurs de journaux @fr
label: Editoras de jornais @pt
label: Editori quotidiani @it
label: Zeitungsverlage @de
label: Издатели газет @ru
label: 報紙出版 @zh-hant
label: 报业出版商 @zh
label: 报业出��商 @zh
label: 新聞発行 @ja
label: 신문 발행업 @ko
definition: This segment includes companies that produce and distribute newspapers.
notation: 1010131011
valid from: 2024-06-07

Advertising Rev - Periodical
type: BicsLevel6Segment
type: Classifier
type: NamedIndividual
is level6 segment of: Periodical Publishers
is contemporary version of: http://data.ga-group.nl/ics/bics/101013101210
is version of: http://data.ga-group.nl/ics/bics/101013101210
replaces: http://data.ga-group.nl/ics/bics/2020/101013101210
imported on: 2026-06-08T13:40:52.236Z
last refreshed on: 2026-06-08T13:41:38.450Z
source accessed on: 2024-06-05T14:42:36Z
source last accessed on: 2024-06-05T14:42:36Z
label: Ingreso de publicidad - periódico @es
label: Rec publicação - Periódicos @pt
label: Revenus de publicité - Périodiques @fr
label: Ric pubblicitari - Periodico @it
label: Werbeerlös - Zeitschrift @de
label: Рекламн. врчк - периодика @ru
label: 广告收入-期刊 @zh
label: 広告売上高-定期刊行物 @ja
label: 廣告收入-期刊 @zh-hant
label: 광고 수익 - 정기간행물 @ko
definition: This segment includes revenue that periodical publishers generate from advertising.
notation: 101013101210
valid from: 2024-06-07

Circulation Rev - Periodical
type: BicsLevel6Segment
type: Classifier
type: NamedIndividual
is level6 segment of: Periodical Publishers
is contemporary version of: http://data.ga-group.nl/ics/bics/101013101211
is version of: http://data.ga-group.nl/ics/bics/101013101211
replaces: http://data.ga-group.nl/ics/bics/2020/101013101211
imported on: 2026-06-08T13:40:52.236Z
last refreshed on: 2026-06-08T13:41:38.450Z
source accessed on: 2024-06-05T14:42:36Z
source last accessed on: 2024-06-05T14:42:36Z
label: Auflagenerlös - Zeitschrift @de
label: Ingreso circulación - periodicidad @es
label: Rec circulação - Periódicos @pt
label: Rev tirage - Périodiques @fr
label: Ric circolazione - Periodico @it
label: Врчк от прдж тиража - периодика @ru
label: 发行收入-期刊 @zh
label: 新聞売上高-定期刊行物出版 @ja
label: 發行收入-期刊 @zh-hant
label: 발행 수익 - 정기간행물 @ko
definition: This segment includes revenue that periodical publishers generate from circulation.
notation: 101013101211
valid from: 2024-06-07

Other Revenue - Periodical
type: BicsLevel6Segment
type: Classifier
type: NamedIndividual
is level6 segment of: Periodical Publishers
is contemporary version of: http://data.ga-group.nl/ics/bics/101013101212
is version of: http://data.ga-group.nl/ics/bics/101013101212
replaces: http://data.ga-group.nl/ics/bics/2020/101013101212
imported on: 2026-06-08T13:40:52.236Z
last refreshed on: 2026-06-08T13:41:38.450Z
source accessed on: 2024-06-05T14:42:36Z
source last accessed on: 2024-06-05T14:42:36Z
label: Altri ricavi - Periodico @it
label: Autres revenus - Périodiques @fr
label: Otro ingreso - periódico @es
label: Outras receitas - Periódicos @pt
label: Sonstiger Erlös - Zeitschrift @de
label: Прочая выручка - периодика @ru
label: その他売上高-定期刊行物 @ja
label: 其他收入-期刊 @zh
label: 기타 수익 - 정기간행물 @ko
definition: This segment includes revenue that periodical publishers generate from sources other than advertising and circulation.
notation: 101013101212
valid from: 2024-06-07

Periodical Publishers
type: BicsLevel5Segment
type: Classifier
type: NamedIndividual
is level5 segment of: Publishing
is contemporary version of: http://data.ga-group.nl/ics/bics/1010131012
is version of: http://data.ga-group.nl/ics/bics/1010131012
replaces: http://data.ga-group.nl/ics/bics/2020/1010131012
imported on: 2026-06-08T13:40:52.236Z
last refreshed on: 2026-06-08T13:41:38.450Z
source accessed on: 2024-06-05T14:42:36Z
source last accessed on: 2024-06-05T14:42:36Z
label: Editeurs de périodiques @fr
label: Editoras de periódicos @es
label: Editores de periódicos @pt
label: Editori di periodici @it
label: Herausgeber von Journalen @de
label: Издатели периодики @ru
label: 定期刊行物出版 @ja
label: 期刊出版 @zh-hant
label: 期刊出版商 @zh
label: 정기간행물 발행업 @ko
definition: This segment includes companies that produce and distribute magazines and other periodicals.
notation: 1010131012
valid from: 2024-06-07

Publishing
type: BicsLevel4SubIndustry
type: Classifier
type: NamedIndividual
is sub industry of: Publishing & Broadcasting
is contemporary version of: http://data.ga-group.nl/ics/bics/10101310
is version of: http://data.ga-group.nl/ics/bics/10101310
replaces: http://data.ga-group.nl/ics/bics/2020/10101310
imported on: 2026-06-08T13:40:52.236Z
last refreshed on: 2026-06-08T13:41:38.450Z
source accessed on: 2024-06-05T14:42:36Z
source last accessed on: 2024-06-05T14:42:36Z
label: Edition @fr
label: Editoria @it
label: Editorial @es
label: Publicação @pt
label: Verlagswesen @de
label: Полиграфия @ru
label: 出版 @ja
label: 出版業 @zh-hant
label: 출판 @ko
definition: This industry subgroup includes companies that produce and distribute printed media content such as newspapers, periodicals, and books.
notation: 10101310
valid from: 2024-06-07

Adv Rev - Local TV Broadcast
type: BicsLevel6Segment
type: Classifier
type: NamedIndividual
is level6 segment of: Local TV Broadcasting
is contemporary version of: http://data.ga-group.nl/ics/bics/101013111010
is version of: http://data.ga-group.nl/ics/bics/101013111010
replaces: http://data.ga-group.nl/ics/bics/2020/101013111010
imported on: 2026-06-08T13:40:52.236Z
last refreshed on: 2026-06-08T13:41:38.450Z
source accessed on: 2024-06-05T14:42:36Z
source last accessed on: 2024-06-05T14:42:36Z
label: Ingreso de publicidad-transmisión de televisión local @es
label: Rec prop - Transmissão de TV local @pt
label: Rev pub - Télédiffusion locale @fr
label: Ric pubb - Trasmissione TV locale @it
label: Werbeerl. - Lokale Fernsehübertragung @de
label: Рекламн. врчк - местное телевещание @ru
label: 广告收入-地方电视广播 @zh
label: 広告売上高-地方ﾃﾚﾋﾞ放送 @ja
label: 廣告收入-地方電視播放 @zh-hant
label: 광고 수익 - 지역 TV 방송 @ko
definition: This segment includes revenue that television broadcasters generate from advertising.
notation: 101013111010
valid from: 2024-06-07

Other Rev - Local TV Broadcast
type: BicsLevel6Segment
type: Classifier
type: NamedIndividual
is level6 segment of: Local TV Broadcasting
is contemporary version of: http://data.ga-group.nl/ics/bics/101013111011
is version of: http://data.ga-group.nl/ics/bics/101013111011
replaces: http://data.ga-group.nl/ics/bics/2020/101013111011
imported on: 2026-06-08T13:40:52.236Z
last refreshed on: 2026-06-08T13:41:38.450Z
source accessed on: 2024-06-05T14:42:36Z
source last accessed on: 2024-06-05T14:42:36Z
label: Altri ric - Trasmissione TV locale @it
label: Autres rev - Télédiffusion locale @fr
label: Otro ingreso-retransmisión de televisión local @es
label: Out rec - Transmissão de TV local @pt
label: Sonst. Erl. - Lokale Fernsehübertragung @de
label: Пр. врчк - местное телевещание @ru
label: その他売上高-地方ﾃﾚﾋﾞ放送 @ja
label: 其他收入-地方电视广播 @zh
label: 其他收入-地方電視播放 @zh-hant
label: 기타 수익 - 지역 TV 방송 @ko
definition: This segment includes revenue that television broadcasters generate from sources other than advertising.
notation: 101013111011
valid from: 2024-06-07

Local TV Broadcasting
type: BicsLevel5Segment
type: Classifier
type: NamedIndividual
is level5 segment of: Local TV & Radio Broadcast
is contemporary version of: http://data.ga-group.nl/ics/bics/1010131110
is version of: http://data.ga-group.nl/ics/bics/1010131110
replaces: http://data.ga-group.nl/ics/bics/2020/1010131110
imported on: 2026-06-08T13:40:52.236Z
last refreshed on: 2026-06-08T13:41:38.450Z
source accessed on: 2024-06-05T14:42:36Z
source last accessed on: 2024-06-05T14:42:36Z
label: Cadenas de televisión local @es
label: Lokale Fernsehübertragung @de
label: Télédiffusion locale @fr
label: Transmissão de TV local @pt
label: Trasmissione TV locale @it
label: Местное телевещание @ru
label: 地方电视广播 @zh
label: 地方電視播放 @zh-hant
label: 地方ﾃﾚﾋﾞ放送 @ja
label: 지역 TV 방송 @ko
definition: This segment includes companies that operate broadcasting studios, stations, and facilities for the transmission of local television programming over public airwaves. Such programming may originate in their own studio, from an affiliated network, or from external sources.
notation: 1010131110
valid from: 2024-06-07

Radio Networks
type: BicsLevel6Segment
type: Classifier
type: NamedIndividual
is level6 segment of: Radio Broadcasting
is contemporary version of: http://data.ga-group.nl/ics/bics/101013111110
is version of: http://data.ga-group.nl/ics/bics/101013111110
replaces: http://data.ga-group.nl/ics/bics/2020/101013111110
imported on: 2026-06-08T13:40:52.236Z
last refreshed on: 2026-06-08T13:41:38.450Z
source accessed on: 2024-06-05T14:42:36Z
source last accessed on: 2024-06-05T14:42:36Z
label: Canali radio @it
label: Radiodiffusion @fr
label: Radionetworks @de
label: Redes de rádio @pt
label: Redes de radio @es
label: Радиосети @ru
label: 廣播網 @zh-hant
label: 电台网络 @zh
label: 라디오 네트워크 @ko
label: ﾗｼﾞｵﾈｯﾄﾜｰｸ @ja
definition: This segment includes companies that distribute programming to multiple stations simultaneously or slightly delayed, to extend total coverage beyond the limits of a single broadcast signal.
notation: 101013111110
valid from: 2024-06-07

Radio Stations
type: BicsLevel6Segment
type: Classifier
type: NamedIndividual
is level6 segment of: Radio Broadcasting
is contemporary version of: http://data.ga-group.nl/ics/bics/101013111111
is version of: http://data.ga-group.nl/ics/bics/101013111111
replaces: http://data.ga-group.nl/ics/bics/2020/101013111111
imported on: 2026-06-08T13:40:52.236Z
last refreshed on: 2026-06-08T13:41:38.450Z
source accessed on: 2024-06-05T14:42:36Z
source last accessed on: 2024-06-05T14:42:36Z
label: Emisoras de radio @es
label: Estações de rádio @pt
label: Radiosender @de
label: Stations de radio @fr
label: Stazioni radio @it
label: Станции радиовещания @ru
label: 廣播電台 @zh-hant
label: 电台 @zh
label: 라디오 @ko
label: ﾗｼﾞｵ局 @ja
definition: This segment includes companies that operate broadcasting studios, stations, and facilities for the transmission of radio programming over public airwaves. Such programming may originate in their own studio, from an affiliated network or from external sources.
notation: 101013111111
valid from: 2024-06-07

Radio Broadcasting
type: BicsLevel5Segment
type: Classifier
type: NamedIndividual
is level5 segment of: Local TV & Radio Broadcast
is contemporary version of: http://data.ga-group.nl/ics/bics/1010131111
is version of: http://data.ga-group.nl/ics/bics/1010131111
replaces: http://data.ga-group.nl/ics/bics/2020/1010131111
imported on: 2026-06-08T13:40:52.236Z
last refreshed on: 2026-06-08T13:41:38.450Z
source accessed on: 2024-06-05T14:42:36Z
source last accessed on: 2024-06-05T14:42:36Z
label: Radioübertragung @de
label: Radiodiffusion @fr
label: Radiodiffusione @it
label: Transmisión radio @es
label: Transmissão de rádio @pt
label: Станции радиовещания @ru
label: 廣播 @zh-hant
label: 电台广播 @zh
label: 라디오 방송 @ko
label: ﾗｼﾞｵ放送 @ja
definition: This segment includes companies that produce, acquire, distribute, or broadcast radio programming. Excludes satellite radio (see "Cable & Satellite").
notation: 1010131111
valid from: 2024-06-07

Local TV & Radio Broadcast
type: BicsLevel4SubIndustry
type: Classifier
type: NamedIndividual
is sub industry of: Publishing & Broadcasting
is contemporary version of: http://data.ga-group.nl/ics/bics/10101311
is version of: http://data.ga-group.nl/ics/bics/10101311
replaces: http://data.ga-group.nl/ics/bics/2020/10101311
imported on: 2026-06-08T13:40:52.236Z
last refreshed on: 2026-06-08T13:41:38.450Z
source accessed on: 2024-06-05T14:42:36Z
source last accessed on: 2024-06-05T14:42:36Z
label: Lokale Fernseh- & Radioübertragung @de
label: Retransmisión local de televisión y radio @es
label: Télé/radiodiffusion locale @fr
label: Tele e radiotrasmissione locale @it
label: Transmissão de TV e rádio local @pt
label: Местное теле- и радиовещание @ru
label: Местное теле- и ради��вещание @ru
label: 地方电视与电台广播 @zh
label: 地方電視及廣播播放 @zh-hant
label: 地方ﾃﾚﾋﾞ･ﾗｼﾞｵ放送 @ja
label: 지역 TV & 라디오 방송 @ko
definition: This industry subgroup includes companies that provide television and radio broadcasting typically via public airwaves
notation: 10101311
valid from: 2024-06-07

Out-of-Home Display Advertising
type: BicsLevel4SubIndustry
type: Classifier
type: NamedIndividual
is sub industry of: Publishing & Broadcasting
is contemporary version of: http://data.ga-group.nl/ics/bics/10101312
is version of: http://data.ga-group.nl/ics/bics/10101312
replaces: http://data.ga-group.nl/ics/bics/2020/10101312
imported on: 2026-06-08T13:40:52.236Z
last refreshed on: 2026-06-08T13:41:38.450Z
source accessed on: 2024-06-05T14:42:36Z
source last accessed on: 2024-06-05T14:42:36Z
label: Out-of-Home Display-Werbung @de
label: Placards publicitaires à l'extérieur de la maison @fr
label: Pubblicità esterna @it
label: Publicidad externa @es
label: Publicidade - Exibição fora de casa @pt
label: Внешние рекламные услуги @ru
label: 屋外広告 @ja
label: 戶外展示廣告 @zh-hant
label: 户外展示广告 @zh
label: 옥외 디스플레이 광고 @ko
definition: This industry subgroup includes companies that own and operate public display advertising, such as billboards, shopping mall and retail displays, bus advertisements, and other public displays.
notation: 10101312
valid from: 2024-06-07

Publishing & Broadcasting
type: BicsLevel3Industry
type: Classifier
type: NamedIndividual
is industry of: Media
is contemporary version of: http://data.ga-group.nl/ics/bics/101013
is version of: http://data.ga-group.nl/ics/bics/101013
replaces: http://data.ga-group.nl/ics/bics/2020/101013
imported on: 2026-06-08T13:40:52.236Z
last refreshed on: 2026-06-08T13:41:38.450Z
source accessed on: 2024-06-05T14:42:36Z
source last accessed on: 2024-06-05T14:42:36Z
label: Edition et diffusion @fr
label: Editoria e trasmissione @it
label: Publicação e transmissão @pt
label: Publicación y difusión @es
label: Verlagswesen & Rundfunk @de
label: Издательское дело и СМИ @ru
label: 出版与广播 @zh
label: 出版及播放 @zh-hant
label: 出版･放送 @ja
label: 출판 & 방송 @ko
definition: This industry includes companies that publish books, newspapers, and periodicals, television and radio stations, and networks broadcast via antennas.
notation: 101013
valid from: 2024-06-07

Adv Rev - Automotive Web
type: BicsLevel6Segment
type: Classifier
type: NamedIndividual
is level6 segment of: Automotive Web
is contemporary version of: http://data.ga-group.nl/ics/bics/101014101010
is version of: http://data.ga-group.nl/ics/bics/101014101010
replaces: http://data.ga-group.nl/ics/bics/2020/101014101010
imported on: 2026-06-08T13:40:52.236Z
last refreshed on: 2026-06-08T13:41:38.450Z
source accessed on: 2024-06-05T14:42:36Z
source last accessed on: 2024-06-05T14:42:36Z
label: Ingreso de publicidad-web automotriz @es
label: Rec prop - Automotivo web @pt
label: Rev pub - Sites Web automobiles @fr
label: Ric pubb - Siti automobilistici @it
label: Werbeerlös - Auto-Webseiten @de
label: Рекламн. врчк - веб-сайты автомобилей @ru
label: 广告收入-汽车网站 @zh
label: 広告売上高-自動車Webｻｲﾄ @ja
label: 廣告收入-汽車網站 @zh-hant
label: 광고 수익 - 자동차 웹 @ko
definition: This segment includes revenue that automotive websites generate from advertising.
notation: 101014101010
valid from: 2024-06-07

Other Rev - Automotive Web
type: BicsLevel6Segment
type: Classifier
type: NamedIndividual
is level6 segment of: Automotive Web
is contemporary version of: http://data.ga-group.nl/ics/bics/101014101011
is version of: http://data.ga-group.nl/ics/bics/101014101011
replaces: http://data.ga-group.nl/ics/bics/2020/101014101011
imported on: 2026-06-08T13:40:52.236Z
last refreshed on: 2026-06-08T13:41:38.450Z
source accessed on: 2024-06-05T14:42:36Z
source last accessed on: 2024-06-05T14:42:36Z
label: Altri ricavi-auto web @it
label: Autres rev - Sites Web automobiles @fr
label: Otro ing-web automotriz @es
label: Outras rec - Web automóveis @pt
label: Sonst. Erlös - Auto, Web @de
label: Проч. выручка - Автомоб. вебсайты @ru
label: その他売上高-自動車関連Webｻｲﾄ @ja
label: 其他收入-汽車網站 @zh-hant
label: 其他收入-汽车网页 @zh
label: 기타 수익 - 자동차 웹 @ko
definition: This segment includes revenue that automotive websites generate from sources other than advertising.
notation: 101014101011
valid from: 2024-06-07

Automotive Web
type: BicsLevel5Segment
type: Classifier
type: NamedIndividual
is level5 segment of: Internet Media & Services
is contemporary version of: http://data.ga-group.nl/ics/bics/1010141010
is version of: http://data.ga-group.nl/ics/bics/1010141010
replaces: http://data.ga-group.nl/ics/bics/2020/1010141010
imported on: 2026-06-08T13:40:52.236Z
last refreshed on: 2026-06-08T13:41:38.450Z
source accessed on: 2024-06-05T14:42:36Z
source last accessed on: 2024-06-05T14:42:36Z
label: Auto-Webseiten @de
label: Automotivo web @pt
label: Sites Web automobiles @fr
label: Siti automobilistici @it
label: Web automotriz @es
label: Веб-сайты автомоб. @ru
label: 汽車網站 @zh-hant
label: 汽车网站 @zh
label: 自動車Webｻｲﾄ @ja
label: 자동차 웹 @ko
definition: This segment includes companies that provide automotive information and classified listings online.
notation: 1010141010
valid from: 2024-06-07

Adv Rev - Dating Services Web
type: BicsLevel6Segment
type: Classifier
type: NamedIndividual
is level6 segment of: Dating Services Web
is contemporary version of: http://data.ga-group.nl/ics/bics/101014101110
is version of: http://data.ga-group.nl/ics/bics/101014101110
replaces: http://data.ga-group.nl/ics/bics/2020/101014101110
imported on: 2026-06-08T13:40:52.236Z
last refreshed on: 2026-06-08T13:41:38.450Z
source accessed on: 2024-06-05T14:42:36Z
source last accessed on: 2024-06-05T14:42:36Z
label: Ingreso de publicidad-sitios web de agencias de contactos @es
label: Rec pub - Sites serv relac @pt
label: Rev pub - Services de rencontres Web @fr
label: Ric pubb - Siti servizi incontri @it
label: Werbeerlös - Webseiten für Partnervermittl. @de
label: Рекламн. врчк - веб-службы знакомств @ru
label: 广告收入-交友服务网站 @zh
label: 広告売上高-交際ｻｰﾋﾞｽWebｻｲﾄ @ja
label: 広告売上高-交際ｻｰﾋﾞｽWeb���ｲﾄ @ja
label: 廣告收入-交友服務網站 @zh-hant
label: 광고 수익 - 만남 주선 서비스 웹 @ko
definition: This segment includes revenue that online dating services generate from advertising.
notation: 101014101110
valid from: 2024-06-07

Other Rev - Dating Svcs Web
type: BicsLevel6Segment
type: Classifier
type: NamedIndividual
is level6 segment of: Dating Services Web
is contemporary version of: http://data.ga-group.nl/ics/bics/101014101111
is version of: http://data.ga-group.nl/ics/bics/101014101111
replaces: http://data.ga-group.nl/ics/bics/2020/101014101111
imported on: 2026-06-08T13:40:52.236Z
last refreshed on: 2026-06-08T13:41:38.450Z
source accessed on: 2024-06-05T14:42:36Z
source last accessed on: 2024-06-05T14:42:36Z
label: Altri ric - Siti serv incontri @it
label: Autres rev - Services de rencontres Web @fr
label: Otro ingreso-Sitios Web de agencias de contactos @es
label: Out rec - Web serv relac @pt
label: Sonst. Erlös - Webseiten für Partnervermittl. @de
label: Пр. врчк - веб-службы знакомств @ru
label: その他売上高-交際ｻｰﾋﾞｽWebｻｲﾄ @ja
label: 其他收入-交友服務網站 @zh-hant
label: 其他收入-汽车网站 @zh
label: 기타 수익 - 만남 주선 서비스 웹 @ko
definition: This segment includes revenue that online dating services generate from sources other than advertising.
notation: 101014101111
valid from: 2024-06-07

Dating Services Web
type: BicsLevel5Segment
type: Classifier
type: NamedIndividual
is level5 segment of: Internet Media & Services
is contemporary version of: http://data.ga-group.nl/ics/bics/1010141011
is version of: http://data.ga-group.nl/ics/bics/1010141011
replaces: http://data.ga-group.nl/ics/bics/2020/1010141011
imported on: 2026-06-08T13:40:52.236Z
last refreshed on: 2026-06-08T13:41:38.450Z
source accessed on: 2024-06-05T14:42:36Z
source last accessed on: 2024-06-05T14:42:36Z
label: Services de rencontres Web @fr
label: Siti web per incontri @it
label: Web de serviços de relac @pt
label: Web de sitios de citas @es
label: Webseiten für Partnervermittl. @de
label: Веб-службы знакомств @ru
label: 交友服务网站 @zh
label: 交友服務網站 @zh-hant
label: 만남 주선 서비스 웹 @ko
label: ﾃﾞｰﾄｻｰﾋﾞｽWebｻｲﾄ @ja
definition: This segment includes companies that offer dating services and other matchmaking services online.
notation: 1010141011
valid from: 2024-06-07

Adv Rev - Domain Registrar
type: BicsLevel6Segment
type: Classifier
type: NamedIndividual
is level6 segment of: Domain Registrar
is contemporary version of: http://data.ga-group.nl/ics/bics/101014101210
is version of: http://data.ga-group.nl/ics/bics/101014101210
replaces: http://data.ga-group.nl/ics/bics/2020/101014101210
imported on: 2026-06-08T13:40:52.236Z
last refreshed on: 2026-06-08T13:41:38.450Z
source accessed on: 2024-06-05T14:42:36Z
source last accessed on: 2024-06-05T14:42:36Z
label: Ingreso de publicidad-registrador de dominio @es
label: Rec prop - Domínio Registrar @pt
label: Rev pub - Enregistrement nom de domaine @fr
label: Ric pubb - Registrazione dominio @it
label: Werbeerlös - Domain-Registrar @de
label: Рекламн. врчк - регистратор доменов @ru
label: 广告收入-域名注册 @zh
label: 広告売上高-ﾄﾞﾒｲﾝ登録Webｻｲﾄ @ja
label: 廣告收入-網域註冊商 @zh-hant
label: 광고 수익 - 도메인 등록 @ko
definition: This segment includes revenue that domain registrars generate from advertising.
notation: 101014101210
valid from: 2024-06-07

Other Rev - Domain Registrar
type: BicsLevel6Segment
type: Classifier
type: NamedIndividual
is level6 segment of: Domain Registrar
is contemporary version of: http://data.ga-group.nl/ics/bics/101014101211
is version of: http://data.ga-group.nl/ics/bics/101014101211
replaces: http://data.ga-group.nl/ics/bics/2020/101014101211
imported on: 2026-06-08T13:40:52.236Z
last refreshed on: 2026-06-08T13:41:38.450Z
source accessed on: 2024-06-05T14:42:36Z
source last accessed on: 2024-06-05T14:42:36Z
label: Altre entrate-Registrazione dominio internet @it
label: Autres revenus - Enregistrement de nom de domaine Internet @fr
label: Otro ingreso-Registrador de dominio @es
label: Outra receita - registro domínio @pt
label: Sonstiger Erlös - Domain-Registrar @de
label: Прочий доход-Регистрация домейнов @ru
label: その他売上高-ﾄﾞﾒｲﾝ登録Webｻｲﾄ @ja
label: 其他收入 - 域名注册 @zh
label: 其他收入-網域註冊商 @zh-hant
label: 기타수익 - 도메인 등록기관 @ko
definition: This segment includes revenue that domain registrars generate from sources other than advertising.
notation: 101014101211
valid from: 2024-06-07

Domain Registrar
type: BicsLevel5Segment
type: Classifier
type: NamedIndividual
is level5 segment of: Internet Media & Services
is contemporary version of: http://data.ga-group.nl/ics/bics/1010141012
is version of: http://data.ga-group.nl/ics/bics/1010141012
replaces: http://data.ga-group.nl/ics/bics/2020/1010141012
imported on: 2026-06-08T13:40:52.236Z
last refreshed on: 2026-06-08T13:41:38.450Z
source accessed on: 2024-06-05T14:42:36Z
source last accessed on: 2024-06-05T14:42:36Z
label: Domain-Registrar @de
label: Enregistrement de nom de domaine Internet @fr
label: Registrador de dominio @es
label: Registrazione dominio internet @it
label: Registros de domínio @pt
label: Регистрация домейнов @ru
label: 域名注册 @zh
label: 網域註冊商 @zh-hant
label: 도메인 등록기관 @ko
label: ﾄﾞﾒｲﾝ登録Webｻｲﾄ @ja
definition: This segment includes companies that primarily register Internet domain names.
notation: 1010141012
valid from: 2024-06-07

Adv Rev-Entmt Evt Ticket Online
type: BicsLevel6Segment
type: Classifier
type: NamedIndividual
is level6 segment of: Entmt Event Ticket Online
is contemporary version of: http://data.ga-group.nl/ics/bics/101014101310
is version of: http://data.ga-group.nl/ics/bics/101014101310
replaces: http://data.ga-group.nl/ics/bics/2020/101014101310
imported on: 2026-06-08T13:40:52.236Z
last refreshed on: 2026-06-08T13:41:38.450Z
source accessed on: 2024-06-05T14:42:36Z
source last accessed on: 2024-06-05T14:42:36Z
label: Ingreso de publicidad-boleta en línea de evento @es
label: Rec prop - Ingressos evento e entret online @pt
label: Rev pub - Vente de tickets de spectacles Web @fr
label: Ric pubb-Biglietti intratt online @it
label: Werbeerl. - Karten für Entertainm.-Events online @de
label: Рекламн. врчк - интернет-прдж билетов на рзвлк мероприят. @ru
label: Рекламн. врчк - интернет-прдж билетов на рзвл�� мероприят. @ru
label: 广告收入-娱乐活动在线售票 @zh
label: 広告売上高-ｲﾍﾞﾝﾄﾁｹｯﾄ販売Webｻｲﾄ @ja
label: 廣告收入-娛樂活動線上售票 @zh-hant
label: 광고 수익 - 엔터테인먼트 행사 티켓 온라인 @ko
definition: This segment includes revenue that entertainment event ticket sales websites generate from advertising.
notation: 101014101310
valid from: 2024-06-07

Other-Entmt Evt Ticket Online
type: BicsLevel6Segment
type: Classifier
type: NamedIndividual
is level6 segment of: Entmt Event Ticket Online
is contemporary version of: http://data.ga-group.nl/ics/bics/101014101311
is version of: http://data.ga-group.nl/ics/bics/101014101311
replaces: http://data.ga-group.nl/ics/bics/2020/101014101311
imported on: 2026-06-08T13:40:52.236Z
last refreshed on: 2026-06-08T13:41:38.450Z
source accessed on: 2024-06-05T14:42:36Z
source last accessed on: 2024-06-05T14:42:36Z
label: Altro-Biglietti intratt online @it
label: Autres rev - Vente de tickets de spectacles Web @fr
label: Otro-boleta en línea de evento @es
label: Outr - Ingressos en entret online @pt
label: Sonst. - Online-Karten Entertainm.-Event @de
label: Пр.- интернет-прдж билетов на рзвлк мероприят. @ru
label: その他-ｲﾍﾞﾝﾄﾁｹｯﾄ販売Webｻｲﾄ @ja
label: 其他收入-娛樂活動線上售票 @zh-hant
label: 其他收入-娱乐活动在线售票 @zh
label: 기타 - 엔터테인먼트 행사 티켓 온라인 @ko
definition: This segment includes revenue that entertainment event ticket sales websites generate from sources other than advertising.
notation: 101014101311
valid from: 2024-06-07

Entmt Event Ticket Online
type: BicsLevel5Segment
type: Classifier
type: NamedIndividual
is level5 segment of: Internet Media & Services
is contemporary version of: http://data.ga-group.nl/ics/bics/1010141013
is version of: http://data.ga-group.nl/ics/bics/1010141013
replaces: http://data.ga-group.nl/ics/bics/2020/1010141013
imported on: 2026-06-08T13:40:52.236Z
last refreshed on: 2026-06-08T13:41:38.450Z
source accessed on: 2024-06-05T14:42:36Z
source last accessed on: 2024-06-05T14:42:36Z
label: Biglietti intrattenimento online @it
label: Evento de entretenimiento boleto en línea @es
label: Ingressos evento e entret online @pt
label: Karten für Entertainm.-Events online @de
label: Vente tickets de spectacle Web @fr
label: Интернет-прдж билетов на развлек. мероприят. @ru
label: 娛樂活動線上售票 @zh-hant
label: 娱乐活动在线售票 @zh
label: 엔터테인먼트 행사 티켓 온라인 @ko
label: ｲﾍﾞﾝﾄﾁｹｯﾄ販売Webｻｲﾄ @ja
definition: This segment includes companies that retail tickets online for entertainment events, such as musical events, sporting events, and theatrical shows.
notation: 1010141013
valid from: 2024-06-07

Adv Rev - Photography Web
type: BicsLevel6Segment
type: Classifier
type: NamedIndividual
is level6 segment of: Photography Web
is contemporary version of: http://data.ga-group.nl/ics/bics/101014101410
is version of: http://data.ga-group.nl/ics/bics/101014101410
replaces: http://data.ga-group.nl/ics/bics/2020/101014101410
imported on: 2026-06-08T13:40:52.236Z
last refreshed on: 2026-06-08T13:41:38.450Z
source accessed on: 2024-06-05T14:42:36Z
source last accessed on: 2024-06-05T14:42:36Z
label: Ingreso de publicidad-sitios web de fotografía @es
label: Rec prop - Web fotografia @pt
label: Rev pub - Photographie Web @fr
label: Ric pubb - Siti fotografici @it
label: Werbeerlös - Fotografie-Webseiten @de
label: Рекламн. врчк - сайты с фотогр. @ru
label: 广告收入-摄影网站 @zh
label: 広告売上高-写真Webｻｲﾄ @ja
label: 廣告收入-攝影網站 @zh-hant
label: 광고 수익 - 사진 웹 @ko
definition: This segment includes revenue that photo sharing and finishing websites generate from advertising.
notation: 101014101410
valid from: 2024-06-07

Other Rev - Photography Web
type: BicsLevel6Segment
type: Classifier
type: NamedIndividual
is level6 segment of: Photography Web
is contemporary version of: http://data.ga-group.nl/ics/bics/101014101411
is version of: http://data.ga-group.nl/ics/bics/101014101411
replaces: http://data.ga-group.nl/ics/bics/2020/101014101411
imported on: 2026-06-08T13:40:52.236Z
last refreshed on: 2026-06-08T13:41:38.450Z
source accessed on: 2024-06-05T14:42:36Z
source last accessed on: 2024-06-05T14:42:36Z
label: Altri ric - Siti fotografici @it
label: Autres rev - Photographie Web @fr
label: Otro ing-web fotografía @es
label: Out rec - Web fotografia @pt
label: Sonst. Erlös - Fotografie-Webseiten @de
label: Пр. выручка - сайты с фотогр. @ru
label: その他売上-写真Webｻｲﾄ @ja
label: 其他收入-摄影网站 @zh
label: 其他收入-攝影網站 @zh-hant
label: 기타 수익 - 사진 웹 @ko
label: 기타 수익 - ��진 웹 @ko
definition: This segment includes revenue that photo sharing and finishing websites generate from sources other than advertising.
notation: 101014101411
valid from: 2024-06-07

Photography Web
type: BicsLevel5Segment
type: Classifier
type: NamedIndividual
is level5 segment of: Internet Media & Services
is contemporary version of: http://data.ga-group.nl/ics/bics/1010141014
is version of: http://data.ga-group.nl/ics/bics/1010141014
replaces: http://data.ga-group.nl/ics/bics/2020/1010141014
imported on: 2026-06-08T13:40:52.236Z
last refreshed on: 2026-06-08T13:41:38.450Z
source accessed on: 2024-06-05T14:42:36Z
source last accessed on: 2024-06-05T14:42:36Z
label: Fotografie-Webseiten @de
label: Photographie Web @fr
label: Siti fotografici @it
label: Web de fotografía @es
label: Web fotografia @pt
label: Сайты с фотогр. @ru
label: Сайты с фотог��. @ru
label: 写真Webｻｲﾄ @ja
label: 摄影网站 @zh
label: 攝影網站 @zh-hant
label: 사진 웹 @ko
definition: This segment includes companies that provide photo posting, printing, and collating services online.
notation: 1010141014
valid from: 2024-06-07

Adv Rev-Price & Svc Comp Web
type: BicsLevel6Segment
type: Classifier
type: NamedIndividual
is level6 segment of: Price & Svc Comparison Web
is contemporary version of: http://data.ga-group.nl/ics/bics/101014101510
is version of: http://data.ga-group.nl/ics/bics/101014101510
replaces: http://data.ga-group.nl/ics/bics/2020/101014101510
imported on: 2026-06-08T13:40:52.236Z
last refreshed on: 2026-06-08T13:41:38.450Z
source accessed on: 2024-06-05T14:42:36Z
source last accessed on: 2024-06-05T14:42:36Z
label: Ingreso de publicidad- web de precios y comp de servicios @es
label: Rec prop - Web comp preço e serv @pt
label: Rev pub - Sites Web de comparaison de prix/services @fr
label: Ric pubb-Siti confronto prz e serv @it
label: Werbeerlös - Preis-/Servicevergl. Webseiten @de
label: Рекламн. врчк - сайты сравнения цен и услг @ru
label: 广告收入-价格与服务比较网站 @zh
label: 広告売上高-価格･ｻｰﾋﾞｽ比較Webｻｲﾄ @ja
label: 広告売上��-価格･ｻｰﾋﾞｽ比較Webｻｲﾄ @ja
label: 廣告收入-價格及服務比較網站 @zh-hant
label: 광고 수익 - 가격 & 서비스 비교 웹 @ko
definition: This segment includes revenue that price and service comparison websites generate from advertising.
notation: 101014101510
valid from: 2024-06-07

Other-Price & Svc Comp Web
type: BicsLevel6Segment
type: Classifier
type: NamedIndividual
is level6 segment of: Price & Svc Comparison Web
is contemporary version of: http://data.ga-group.nl/ics/bics/101014101511
is version of: http://data.ga-group.nl/ics/bics/101014101511
replaces: http://data.ga-group.nl/ics/bics/2020/101014101511
imported on: 2026-06-08T13:40:52.236Z
last refreshed on: 2026-06-08T13:41:38.450Z
source accessed on: 2024-06-05T14:42:36Z
source last accessed on: 2024-06-05T14:42:36Z
label: Altro-Siti confronto prz e serv @it
label: Autrs rev - Sites Web de comparaison de prix/services @fr
label: Otro- web de precios y comp de servicios @es
label: Out-Web comp preço e serv @pt
label: Sonst. - Preis-/Servicevergl. Webseiten @de
label: Пр. - сайты сравнения цен и услг @ru
label: その他売上高-価格･ｻｰﾋﾞｽ比較Webｻｲﾄ @ja
label: 其他收入-价格与服务比较网站 @zh
label: 其他收入-價格及服務比較網站 @zh-hant
label: 기타 - 가격 & 서비스 비교 웹 @ko
definition: This segment includes revenue that price and service comparison websites generate from sources other than advertising.
notation: 101014101511
valid from: 2024-06-07

Price & Svc Comparison Web
type: BicsLevel5Segment
type: Classifier
type: NamedIndividual
is level5 segment of: Internet Media & Services
is contemporary version of: http://data.ga-group.nl/ics/bics/1010141015
is version of: http://data.ga-group.nl/ics/bics/1010141015
replaces: http://data.ga-group.nl/ics/bics/2020/1010141015
imported on: 2026-06-08T13:40:52.236Z
last refreshed on: 2026-06-08T13:41:38.450Z
source accessed on: 2024-06-05T14:42:36Z
source last accessed on: 2024-06-05T14:42:36Z
label: Comparaison prix et serv Web @fr
label: Siti confronto prezzi e serv @it
label: Sitios de comparaciones de precios y servicios @es
label: Web comparação de pç e serv @pt
label: Webseiten zum Vergleich von Preisen & Service @de
label: Сайты сравнения цен и услг @ru
label: 价格与服务比较网站 @zh
label: 価格･ｻｰﾋﾞｽ比較Webｻｲﾄ @ja
label: 價格及服務比較網站 @zh-hant
label: 가격 & 서비스 비교 웹 @ko
definition: This segment includes companies that provide product price comparison services online. Such products include credit card rates, mobile phone rates, holiday prices, flights, digital cameras, and printers.
notation: 1010141015
valid from: 2024-06-07

Adv Rev - Real Estate Web
type: BicsLevel6Segment
type: Classifier
type: NamedIndividual
is level6 segment of: Real Estate & Property Web
is contemporary version of: http://data.ga-group.nl/ics/bics/101014101610
is version of: http://data.ga-group.nl/ics/bics/101014101610
replaces: http://data.ga-group.nl/ics/bics/2020/101014101610
imported on: 2026-06-08T13:40:52.236Z
last refreshed on: 2026-06-08T13:41:38.450Z
source accessed on: 2024-06-05T14:42:36Z
source last accessed on: 2024-06-05T14:42:36Z
label: Ingreso de publicidad-web inmobiliario @es
label: Rec prop-Web imóveis @pt
label: Rev pub-Sites Web d'agences immobilières @fr
label: Ric pubb - Siti immobiliari @it
label: Werbeerlös - Immobilien-Webseiten @de
label: Рекламн. врчк - сайты недвижим. @ru
label: 广告收入-房地产网站 @zh
label: 広告売上高-不動産Webｻｲﾄ @ja
label: 広告売上高-不動産Web���ｲﾄ @ja
label: 廣告收入-不動產及房地產站 @zh-hant
label: 광고 수익 - 부동산 웹 @ko
definition: This segment includes revenue that real estate and property websites generate from advertising.
notation: 101014101610
valid from: 2024-06-07

Other Rev - Real Estate Web
type: BicsLevel6Segment
type: Classifier
type: NamedIndividual
is level6 segment of: Real Estate & Property Web
is contemporary version of: http://data.ga-group.nl/ics/bics/101014101611
is version of: http://data.ga-group.nl/ics/bics/101014101611
replaces: http://data.ga-group.nl/ics/bics/2020/101014101611
imported on: 2026-06-08T13:40:52.236Z
last refreshed on: 2026-06-08T13:41:38.450Z
source accessed on: 2024-06-05T14:42:36Z
source last accessed on: 2024-06-05T14:42:36Z
label: Altri ric - Siti immobiliari @it
label: Autres rev - Sites Web d'agences immobilières @fr
label: Otro ingreso-web inmobiliario @es
label: Out rec-Web imóveis @pt
label: Sonst. Erlös - Immobilien-Webseiten @de
label: Пр. врчк - сайты недвиж. @ru
label: その他売上高-不動産Webｻｲﾄ @ja
label: 其他收入-不動產網站 @zh-hant
label: 其他收入-房地产网站 @zh
label: 기타 수익 - 부동산 웹 @ko
definition: This segment includes revenue that real estate and property websites generate from sources other than advertising.
notation: 101014101611
valid from: 2024-06-07

Real Estate & Property Web
type: BicsLevel5Segment
type: Classifier
type: NamedIndividual
is level5 segment of: Internet Media & Services
is contemporary version of: http://data.ga-group.nl/ics/bics/1010141016
is version of: http://data.ga-group.nl/ics/bics/1010141016
replaces: http://data.ga-group.nl/ics/bics/2020/1010141016
imported on: 2026-06-08T13:40:52.236Z
last refreshed on: 2026-06-08T13:41:38.450Z
source accessed on: 2024-06-05T14:42:36Z
source last accessed on: 2024-06-05T14:42:36Z
label: Agences immobilières en ligne @fr
label: Siti web per immobili e proprietà @it
label: Sitios de inmobiliario @es
label: Webseiten für Immbobilien @de
label: Website de propriedades e imóveis @pt
label: Вебсайты недвижимости и имущества @ru
label: 不動產及房地產網站 @zh-hant
label: 不動産Webｻｲﾄ @ja
label: 房地产和物业网站 @zh
label: 부동산 & 자산 웹사이트 @ko
definition: This segment includes companies that provide real estate and property information and listings online.
notation: 1010141016
valid from: 2024-06-07

Adv Rev - Recruit Svcs Web
type: BicsLevel6Segment
type: Classifier
type: NamedIndividual
is level6 segment of: Recruitment Services Web
is contemporary version of: http://data.ga-group.nl/ics/bics/101014101710
is version of: http://data.ga-group.nl/ics/bics/101014101710
replaces: http://data.ga-group.nl/ics/bics/2020/101014101710
imported on: 2026-06-08T13:40:52.236Z
last refreshed on: 2026-06-08T13:41:38.450Z
source accessed on: 2024-06-05T14:42:36Z
source last accessed on: 2024-06-05T14:42:36Z
label: Ingreso de publicidad-sitios Web de servicios de reclutamiento @es
label: Rec pub-Web serv recrutamento @pt
label: Rev pub - Serv de recrutement Web @fr
label: Ric pubb - Siti reclutamento @it
label: Werbeerlös - Personalvermittlungs-Webseiten @de
label: Рекламн. врчк - сайты служб по подбору кадров @ru
label: Рекла��н. врчк - сайты служб по подбору кадров @ru
label: 广告收入-招聘服务网站 @zh
label: 広告売上高-求人ｻｰﾋﾞｽWebｻｲﾄ @ja
label: 廣告收入-求職求才網站 @zh-hant
label: 광고 수익 - 채용 서비스 웹 @ko
definition: This segment includes revenue that recruitment services websites generate from advertising.
notation: 101014101710
valid from: 2024-06-07

Other Rev - Recruit Svc Web
type: BicsLevel6Segment
type: Classifier
type: NamedIndividual
is level6 segment of: Recruitment Services Web
is contemporary version of: http://data.ga-group.nl/ics/bics/101014101711
is version of: http://data.ga-group.nl/ics/bics/101014101711
replaces: http://data.ga-group.nl/ics/bics/2020/101014101711
imported on: 2026-06-08T13:40:52.236Z
last refreshed on: 2026-06-08T13:41:38.450Z
source accessed on: 2024-06-05T14:42:36Z
source last accessed on: 2024-06-05T14:42:36Z
label: Altri ric - Siti reclutamento @it
label: Autrs rev - Serv de recrutement Web @fr
label: Otro ingreso-Sitios reclutam @es
label: Out rec -Web serv recrutamento @pt
label: Sonst. Erlös - Personalvermittl.-Webseiten @de
label: Пр. врчк - сайты служб по подбору кадров @ru
label: その他売上-求人ｻｰﾋﾞｽWebｻｲﾄ @ja
label: 其他收入-招聘服务网站 @zh
label: 其他收入-求職求才網站 @zh-hant
label: 기타 수익 - 채용 서비스 웹 @ko
definition: This segment includes revenue that recruitment services websites generate from sources other than advertising.
notation: 101014101711
valid from: 2024-06-07

Recruitment Services Web
type: BicsLevel5Segment
type: Classifier
type: NamedIndividual
is level5 segment of: Internet Media & Services
is contemporary version of: http://data.ga-group.nl/ics/bics/1010141017
is version of: http://data.ga-group.nl/ics/bics/1010141017
replaces: http://data.ga-group.nl/ics/bics/2020/1010141017
imported on: 2026-06-08T13:40:52.236Z
last refreshed on: 2026-06-08T13:41:38.450Z
source accessed on: 2024-06-05T14:42:36Z
source last accessed on: 2024-06-05T14:42:36Z
label: Personalvermittlungs-Webseiten @de
label: Serv de recrutement Web @fr
label: Servicios web de reclutamiento @es
label: Siti web servizi reclutamento @it
label: Web serviços recrutamento @pt
label: Сайты служб по подбору кадров @ru
label: 招聘服务网站 @zh
label: 求職求才服務網站 @zh-hant
label: 채용 서비스 웹 @ko
label: ﾘｸﾙｰﾄｻｰﾋﾞｽWebｻｲﾄ @ja
definition: This segment includes companies that provide recruitment services and online listings for both employers and potential employees.
notation: 1010141017
valid from: 2024-06-07

Adv Rev - Travel & Booking Web
type: BicsLevel6Segment
type: Classifier
type: NamedIndividual
is level6 segment of: Travel Info & Booking Web
is contemporary version of: http://data.ga-group.nl/ics/bics/101014101810
is version of: http://data.ga-group.nl/ics/bics/101014101810
replaces: http://data.ga-group.nl/ics/bics/2020/101014101810
imported on: 2026-06-08T13:40:52.236Z
last refreshed on: 2026-06-08T13:41:38.450Z
source accessed on: 2024-06-05T14:42:36Z
source last accessed on: 2024-06-05T14:42:36Z
label: Ingreso de publicidad-sitios Web de información y registración de viajes @es
label: Rec prop -Web viagem e reservas @pt
label: Rev pub- Tourisme et réservations Web @fr
label: Ric pubb - Siti viaggio e prenotazione @it
label: Werbeerlös - Reise- & Buchungs-Webseiten @de
label: Рекламн. врчк - информ. туристич. сайты и бронирование онлайн @ru
label: 广告收入-旅游与预订网站 @zh
label: 広告売上高-旅行情報･予約Webｻｲﾄ @ja
label: 廣告收入-旅遊資訊及預約網站 @zh-hant
label: 광고 수익 - 여행 & 예약 웹 @ko
definition: This segment includes revenue that travel information and booking websites generate from advertising.
notation: 101014101810
valid from: 2024-06-07

Other - Travel & Booking Web
type: BicsLevel6Segment
type: Classifier
type: NamedIndividual
is level6 segment of: Travel Info & Booking Web
is contemporary version of: http://data.ga-group.nl/ics/bics/101014101811
is version of: http://data.ga-group.nl/ics/bics/101014101811
replaces: http://data.ga-group.nl/ics/bics/2020/101014101811
imported on: 2026-06-08T13:40:52.236Z
last refreshed on: 2026-06-08T13:41:38.450Z
source accessed on: 2024-06-05T14:42:36Z
source last accessed on: 2024-06-05T14:42:36Z
label: Altro - Siti viaggio e prenotazione @it
label: Autres - Tourisme et réservations Web @fr
label: Otros - viajes y reservaciones de web @es
label: Out-Web viagem e reservas @pt
label: Sonst. - Reise- & Buchungs-Webseiten @de
label: Пр. - информ. туристич. сайты и бронирование онлайн @ru
label: その他-旅行情報･予約Webｻｲﾄ @ja
label: 其他-旅遊資訊及預約網站 @zh-hant
label: 其他收入-旅游与预订网站 @zh
label: 기타 - 여행 & 예약 웹 @ko
definition: This segment includes revenue that travel information and booking websites generate from sources other than advertising.
notation: 101014101811
valid from: 2024-06-07

Travel Info & Booking Web
type: BicsLevel5Segment
type: Classifier
type: NamedIndividual
is level5 segment of: Internet Media & Services
is contemporary version of: http://data.ga-group.nl/ics/bics/1010141018
is version of: http://data.ga-group.nl/ics/bics/1010141018
replaces: http://data.ga-group.nl/ics/bics/2020/1010141018
imported on: 2026-06-08T13:40:52.236Z
last refreshed on: 2026-06-08T13:41:38.450Z
source accessed on: 2024-06-05T14:42:36Z
source last accessed on: 2024-06-05T14:42:36Z
label: Information touristique et réservations en ligne @fr
label: Siti web di prenotazione e viaggi @it
label: Sitios de viajes y reservaciones @es
label: Webseiten für Reiseinformationen & Buchungen @de
label: Websites de reservas e informações de viagem @pt
label: Вебсайты информации о путешествиях и бронирования @ru
label: 旅游信息及预订网站 @zh
label: 旅行情報･予約Webｻｲﾄ @ja
label: 旅遊資訊及預約網站 @zh-hant
label: 여행정보 & 예약 웹사이트 @ko
definition: This segment includes companies that offer travel information and booking services online.
notation: 1010141018
valid from: 2024-06-07

Adv Rev - Education Info Web
type: BicsLevel6Segment
type: Classifier
type: NamedIndividual
is level6 segment of: Education Information Web
is contemporary version of: http://data.ga-group.nl/ics/bics/101014101910
is version of: http://data.ga-group.nl/ics/bics/101014101910
replaces: http://data.ga-group.nl/ics/bics/2020/101014101910
imported on: 2026-06-08T13:40:52.236Z
last refreshed on: 2026-06-08T13:41:38.450Z
source accessed on: 2024-06-05T14:42:36Z
source last accessed on: 2024-06-05T14:42:36Z
label: Ingreso de publicidad-sitios Web de información educativa @es
label: Rec prop -Web info educação @pt
label: Rev pub- Web Info éduc @fr
label: Ric pubb - Siti info istruzione @it
label: Werbeerlös - Bildungsinfo-Webseiten @de
label: Рекламн. врчк - образов. веб-сайты @ru
label: 广告收入-教育信息网站 @zh
label: 広告売上高-教育情報Webｻｲﾄ @ja
label: 廣告收入-教育資訊網站 @zh-hant
label: 광고 수익 - 교육정보 웹 @ko
definition: This segment includes revenue that educational information websites generate from advertising.
notation: 101014101910
valid from: 2024-06-07

Other - Education Info Web
type: BicsLevel6Segment
type: Classifier
type: NamedIndividual
is level6 segment of: Education Information Web
is contemporary version of: http://data.ga-group.nl/ics/bics/101014101911
is version of: http://data.ga-group.nl/ics/bics/101014101911
replaces: http://data.ga-group.nl/ics/bics/2020/101014101911
imported on: 2026-06-08T13:40:52.236Z
last refreshed on: 2026-06-08T13:41:38.450Z
source accessed on: 2024-06-05T14:42:36Z
source last accessed on: 2024-06-05T14:42:36Z
label: Altro - Siti info istruzione @it
label: Autres - Web Info éduc @fr
label: Otro- web de información educativa @es
label: Out-Web info educação @pt
label: Sonst. - Bildungsinfo-Webseiten @de
label: Пр. - образов. веб-сайты @ru
label: その他売上高-教育情報Webｻｲﾄ @ja
label: 其他-教育資訊網站 @zh-hant
label: 其他收入-教育信息网站 @zh
label: 기타 - 교육정보 웹 @ko
definition: This segment includes revenue that educational information websites generate from sources other than advertising.
notation: 101014101911
valid from: 2024-06-07

Education Information Web
type: BicsLevel5Segment
type: Classifier
type: NamedIndividual
is level5 segment of: Internet Media & Services
is contemporary version of: http://data.ga-group.nl/ics/bics/1010141019
is version of: http://data.ga-group.nl/ics/bics/1010141019
replaces: http://data.ga-group.nl/ics/bics/2020/1010141019
imported on: 2026-06-08T13:40:52.236Z
last refreshed on: 2026-06-08T13:41:38.450Z
source accessed on: 2024-06-05T14:42:36Z
source last accessed on: 2024-06-05T14:42:36Z
label: Sites Internet d'information sur l'éducation @fr
label: Siti web per informazioni sull'istruzione @it
label: Sitios de información educativa @es
label: Webseiten für Bildungsinformationen @de
label: Websites informação de educação @pt
label: Образовательные вебсайты @ru
label: 教育信息网站 @zh
label: 教育情報Webｻｲﾄ @ja
label: 教育資訊網站 @zh-hant
label: 교육정보 웹사이트 @ko
definition: This segment includes companies that provide educational information online.
notation: 1010141019
valid from: 2024-06-07

Display Advertising
type: BicsLevel7Segment
type: Classifier
type: NamedIndividual
is level7 segment of: Adv Rev - Internet Portals
is contemporary version of: http://data.ga-group.nl/ics/bics/10101410201010
is version of: http://data.ga-group.nl/ics/bics/10101410201010
replaces: http://data.ga-group.nl/ics/bics/2020/10101410201010
imported on: 2026-06-08T13:40:52.236Z
last refreshed on: 2026-06-08T13:41:38.450Z
source accessed on: 2024-06-05T14:42:36Z
source last accessed on: 2024-06-05T14:42:36Z
label: Afficher publicité @fr
label: Anuncio de mostrador @es
label: Display-Werbung @de
label: Exibir propaganda @pt
label: Pubblicità esterna @it
label: Витринно-выставочная реклама @ru
label: 展示廣告 @zh-hant
label: 显示广告 @zh
label: 表示広告 @ja
label: 디스플레이 광고 @ko
definition: This segment includes revenue generated by the display of graphical advertisements on a webpage.
notation: 10101410201010
valid from: 2024-06-07

Search Advertising
type: BicsLevel7Segment
type: Classifier
type: NamedIndividual
is level7 segment of: Adv Rev - Internet Portals
is contemporary version of: http://data.ga-group.nl/ics/bics/10101410201011
is version of: http://data.ga-group.nl/ics/bics/10101410201011
replaces: http://data.ga-group.nl/ics/bics/2020/10101410201011
imported on: 2026-06-08T13:40:52.236Z
last refreshed on: 2026-06-08T13:41:38.450Z
source accessed on: 2024-06-05T14:42:36Z
source last accessed on: 2024-06-05T14:42:36Z
label: Anuncio de búsqueda @es
label: Buscar propaganda @pt
label: Recherche publicité @fr
label: Ricerca pubblicità @it
label: Werbungssuche @de
label: Поисковая реклама @ru
label: 搜尋廣告 @zh-hant
label: 搜索广告 @zh
label: 検索広告 @ja
label: 검색 광고 @ko
definition: This segment includes revenue generated from text-based links to an advertiser's website from Web searches conducted on an Internet search engine.
notation: 10101410201011
valid from: 2024-06-07

Adv Rev - Internet Portals
type: BicsLevel6Segment
type: Classifier
type: NamedIndividual
is level6 segment of: Internet Advertising Portals
is contemporary version of: http://data.ga-group.nl/ics/bics/101014102010
is version of: http://data.ga-group.nl/ics/bics/101014102010
replaces: http://data.ga-group.nl/ics/bics/2020/101014102010
imported on: 2026-06-08T13:40:52.236Z
last refreshed on: 2026-06-08T13:41:38.450Z
source accessed on: 2024-06-05T14:42:36Z
source last accessed on: 2024-06-05T14:42:36Z
label: Ing de pub-portales de internet @es
label: Rec public - Portais da internet @pt
label: Rev pub - Portails Internet @fr
label: Ric pubb - Portali Internet @it
label: Werbeerl. - Internetportale @de
label: Рекламн. врчк - Интернет-порталы @ru
label: 广告收入-互联网门户网站 @zh
label: 広告売上高-ｲﾝﾀｰﾈｯﾄ･ﾎﾟｰﾀﾙ @ja
label: 廣告收入-網路 @zh-hant
label: 광고수익 - 인터넷 포털 @ko
definition: This segment includes revenue that Internet search engines generate from advertising.
notation: 101014102010
valid from: 2024-06-07

Other Rev - Internet Portals
type: BicsLevel6Segment
type: Classifier
type: NamedIndividual
is level6 segment of: Internet Advertising Portals
is contemporary version of: http://data.ga-group.nl/ics/bics/101014102011
is version of: http://data.ga-group.nl/ics/bics/101014102011
replaces: http://data.ga-group.nl/ics/bics/2020/101014102011
imported on: 2026-06-08T13:40:52.236Z
last refreshed on: 2026-06-08T13:41:38.450Z
source accessed on: 2024-06-05T14:42:36Z
source last accessed on: 2024-06-05T14:42:36Z
label: Altri ric - Portali Internet @it
label: Autres rev - Portails Internet @fr
label: Otro ing-portales de Internet @es
label: Out rec - Portais internet @pt
label: Sonst. Erlös - Internetportale @de
label: Пр. врчк - Интернет-порталы объявл. @ru
label: その他売上高-ｲﾝﾀｰﾈｯﾄ･ﾎﾟｰﾀﾙ @ja
label: 其他收入-互联网门户网站 @zh
label: 其他收入-網路入口 @zh-hant
label: 기타 수익 - 인터넷 포털 @ko
definition: This segment includes revenue that Internet search engines generate from sources other than advertising.
notation: 101014102011
valid from: 2024-06-07

Internet Advertising Portals
type: BicsLevel5Segment
type: Classifier
type: NamedIndividual
is level5 segment of: Internet Media & Services
is contemporary version of: http://data.ga-group.nl/ics/bics/1010141020
is version of: http://data.ga-group.nl/ics/bics/1010141020
replaces: http://data.ga-group.nl/ics/bics/2020/1010141020
imported on: 2026-06-08T13:40:52.236Z
last refreshed on: 2026-06-08T13:41:38.450Z
source accessed on: 2024-06-05T14:42:36Z
source last accessed on: 2024-06-05T14:42:36Z
label: Portails pub internet @fr
label: Portais de propagando online @pt
label: Portale für Internetwerbung @de
label: Portales de anuncios en Internet @es
label: Portali annunci internet @it
label: Интернет-порталы объявлений @ru
label: 網路廣告入口 @zh-hant
label: 网络广告门户网站 @zh
label: 인터넷 광고 포털 @ko
label: ｲﾝﾀｰﾈｯﾄ広告ﾎﾟｰﾀﾙ @ja
definition: This segment includes companies that operate websites that use a search engine to generate and maintain extensive databases of Internet addresses and content in an easily searchable format.
notation: 1010141020
valid from: 2024-06-07

Adv Rev - Medical & Health Web
type: BicsLevel6Segment
type: Classifier
type: NamedIndividual
is level6 segment of: Medical & Health Web
is contemporary version of: http://data.ga-group.nl/ics/bics/101014102110
is version of: http://data.ga-group.nl/ics/bics/101014102110
replaces: http://data.ga-group.nl/ics/bics/2020/101014102110
imported on: 2026-06-08T13:40:52.236Z
last refreshed on: 2026-06-08T13:41:38.450Z
source accessed on: 2024-06-05T14:42:36Z
source last accessed on: 2024-06-05T14:42:36Z
label: Ingreso de publicidad-sitios web de salud @es
label: Rec prop - Web saúde e médico @pt
label: Rev pub - Cabinets médicaux et santé Web @fr
label: Ric pubb - Siti medicina e salute @it
label: Werbeerlös - Medizin- & Gesundheits-Webseiten @de
label: Рекламн. врчк - сайты по медицине и здоровью @ru
label: 广告收入-医疗与健康网站 @zh
label: 広告売上高-医療･健康Webｻｲﾄ @ja
label: 廣告收入-醫療及保健網站 @zh-hant
label: 광고 수익 - 의료 & 건강 웹 @ko
definition: This segment includes revenue that medical, health, and fitness websites generate from advertising.
notation: 101014102110
valid from: 2024-06-07

Other - Medical & Health Web
type: BicsLevel6Segment
type: Classifier
type: NamedIndividual
is level6 segment of: Medical & Health Web
is contemporary version of: http://data.ga-group.nl/ics/bics/101014102111
is version of: http://data.ga-group.nl/ics/bics/101014102111
replaces: http://data.ga-group.nl/ics/bics/2020/101014102111
imported on: 2026-06-08T13:40:52.236Z
last refreshed on: 2026-06-08T13:41:38.450Z
source accessed on: 2024-06-05T14:42:36Z
source last accessed on: 2024-06-05T14:42:36Z
label: Altro - Siti medicina e salute @it
label: Autres - Sites Web sur la santé et les soins médicaux @fr
label: Otro-web médicos y de sanidad @es
label: Out - Web saúde e médico @pt
label: Sonst. - Medizin- & Gesundheits-Webseiten @de
label: Пр. - сайты по медицине и здоровью @ru
label: その他売上高-医療･健康Webｻｲﾄ @ja
label: 其他-醫療及保健網站 @zh-hant
label: 其他收入-医疗与健康网站 @zh
label: 기타 - 의료 & 건강 웹 @ko
definition: This segment includes revenue that medical, health, and fitness websites generate from sources other than advertising.
notation: 101014102111
valid from: 2024-06-07

Medical & Health Web
type: BicsLevel5Segment
type: Classifier
type: NamedIndividual
is level5 segment of: Internet Media & Services
is contemporary version of: http://data.ga-group.nl/ics/bics/1010141021
is version of: http://data.ga-group.nl/ics/bics/1010141021
replaces: http://data.ga-group.nl/ics/bics/2020/1010141021
imported on: 2026-06-08T13:40:52.236Z
last refreshed on: 2026-06-08T13:41:38.450Z
source accessed on: 2024-06-05T14:42:36Z
source last accessed on: 2024-06-05T14:42:36Z
label: Medizin- & Gesundheits-Webseiten @de
label: Santé et soins médicaux Web @fr
label: Siti web medicina e salute @it
label: Web de saúde e médico @pt
label: Web médico y de salud @es
label: Сайты по медицине и здоровью @ru
label: 医疗与健康网站 @zh
label: 医療･健康Webｻｲﾄ @ja
label: 醫療及保健網站 @zh-hant
label: 의료 & 건강 웹 @ko
definition: This segment includes companies that provide medical, health, and fitness content online in an easily searchable format.
notation: 1010141021
valid from: 2024-06-07

Adv Rev-News/Sport/Entmt Web
type: BicsLevel6Segment
type: Classifier
type: NamedIndividual
is level6 segment of: News, Sports & Entmt Web
is contemporary version of: http://data.ga-group.nl/ics/bics/101014102210
is version of: http://data.ga-group.nl/ics/bics/101014102210
replaces: http://data.ga-group.nl/ics/bics/2020/101014102210
imported on: 2026-06-08T13:40:52.236Z
last refreshed on: 2026-06-08T13:41:38.450Z
source accessed on: 2024-06-05T14:42:36Z
source last accessed on: 2024-06-05T14:42:36Z
label: Ingreso de publicidad-sitios web de noticias, deportes y entretenimiento @es
label: Rec prop-Websites/notícias/esporte/entret @pt
label: Rev pub - Infos, sport et divertissement Web @fr
label: Ric pubb-Siti notizie/sport/intratt @it
label: Werbeerlös - Web: News, Sport & Unterhaltung @de
label: Рекламн. врчк - порталы новостей, спорта и развлечений @ru
label: 广告收入-新闻、体育及娱乐网站 @zh
label: 広告売上高-ﾆｭｰｽ･ｽﾎﾟｰﾂ･ｴﾝﾀﾒWebｻｲﾄ @ja
label: 廣告收入-新聞/體育/娛樂網站 @zh-hant
label: 광고 수익 - 뉴스/스포츠/엔터테인먼트 웹 @ko
definition: This segment includes revenue that news, sports, and entertainment portals generate from advertising.
notation: 101014102210
valid from: 2024-06-07

Other-News/Sport/Entmt Web
type: BicsLevel6Segment
type: Classifier
type: NamedIndividual
is level6 segment of: News, Sports & Entmt Web
is contemporary version of: http://data.ga-group.nl/ics/bics/101014102211
is version of: http://data.ga-group.nl/ics/bics/101014102211
replaces: http://data.ga-group.nl/ics/bics/2020/101014102211
imported on: 2026-06-08T13:40:52.236Z
last refreshed on: 2026-06-08T13:41:38.450Z
source accessed on: 2024-06-05T14:42:36Z
source last accessed on: 2024-06-05T14:42:36Z
label: Altro-Siti notizie/sport/intratt @it
label: Autres - Infos, sports et divertissement Web @fr
label: Otro - noticias, deportes, web de entretenimiento @es
label: Out-Web notícias/esporte/entret @pt
label: Sonst. - Web: News, Sport & Unterhaltung @de
label: Пр. - порталы новостей, спорта и развлечений @ru
label: その他売上高-ﾆｭｰｽ･ｽﾎﾟｰﾂ･ｴﾝﾀﾒWebｻｲﾄ @ja
label: 其他收入-新聞/體育/娛樂網站 @zh-hant
label: 其他收入-新闻、体育及娱乐网站 @zh
label: 기타 - 뉴스/스포츠/엔터테인먼트 웹 @ko
definition: This segment includes revenue that news, sports, and entertainment websites generate from sources other than advertising.
notation: 101014102211
valid from: 2024-06-07

News, Sports & Entmt Web
type: BicsLevel5Segment
type: Classifier
type: NamedIndividual
is level5 segment of: Internet Media & Services
is contemporary version of: http://data.ga-group.nl/ics/bics/1010141022
is version of: http://data.ga-group.nl/ics/bics/1010141022
replaces: http://data.ga-group.nl/ics/bics/2020/1010141022
imported on: 2026-06-08T13:40:52.236Z
last refreshed on: 2026-06-08T13:41:38.450Z
source accessed on: 2024-06-05T14:42:36Z
source last accessed on: 2024-06-05T14:42:36Z
label: Infos, sports et divertissement Web @fr
label: Siti notizie, sport e intratt @it
label: Web de noticias, deport y entret @es
label: Web notícias, esportes e entret @pt
label: Web: News, Sport & Unterhaltung @de
label: Порталы новостей, спорта и развлечений @ru
label: 新聞、體育及娛樂網站 @zh-hant
label: 新闻、体育及娱乐网站 @zh
label: 뉴스, 스포츠 & 엔터테인먼트 웹 @ko
label: ﾆｭｰｽ･ｽﾎﾟｰﾂ･ｴﾝﾀﾒWebｻｲﾄ @ja
definition: This segment includes companies that provide news, sports, and entertainment content online in an easily searchable format.
notation: 1010141022
valid from: 2024-06-07

Adv Rev - Social Networking Web
type: BicsLevel6Segment
type: Classifier
type: NamedIndividual
is level6 segment of: Social Networking Web
is contemporary version of: http://data.ga-group.nl/ics/bics/101014102310
is version of: http://data.ga-group.nl/ics/bics/101014102310
replaces: http://data.ga-group.nl/ics/bics/2020/101014102310
imported on: 2026-06-08T13:40:52.236Z
last refreshed on: 2026-06-08T13:41:38.450Z
source accessed on: 2024-06-05T14:42:36Z
source last accessed on: 2024-06-05T14:42:36Z
label: Ing publicidad - redes sociales @es
label: Rec prob - Sites da rede social @pt
label: Rev pub - Sites Web rés soc @fr
label: Ric pubb - Siti web rete sociale @it
label: Werbeerlös - Social-Networking-Web. @de
label: Рекламн. врчк - Веб-сайты Интернет-сообществ @ru
label: 广告收入-社交网络 @zh
label: 広告売上高-ｿｰｼｬﾙﾈｯﾄﾜｰｷﾝｸﾞWebｻｲﾄ @ja
label: 廣告收入-社交網站 @zh-hant
label: 광고 수익 - 소셜 네트워킹 웹 @ko
definition: This segment includes revenue that social networking websites generate from advertising.
notation: 101014102310
valid from: 2024-06-07

Other Rev - Social Networking Web
type: BicsLevel6Segment
type: Classifier
type: NamedIndividual
is level6 segment of: Social Networking Web
is contemporary version of: http://data.ga-group.nl/ics/bics/101014102311
is version of: http://data.ga-group.nl/ics/bics/101014102311
replaces: http://data.ga-group.nl/ics/bics/2020/101014102311
imported on: 2026-06-08T13:40:52.236Z
last refreshed on: 2026-06-08T13:41:38.450Z
source accessed on: 2024-06-05T14:42:36Z
source last accessed on: 2024-06-05T14:42:36Z
label: Altri ric - Web rete sociale @it
label: Autrs rev - Sites Web rés soc @fr
label: Otro ing - redes sociales @es
label: Out rec - Sites da rede social @pt
label: Sonst. Erl. - Social-Networking-Web. @de
label: Пр. врчк - Веб-сайты Интернет-сообществ @ru
label: その他売上高-ｿｰｼｬﾙﾈｯﾄﾜｰｷﾝｸﾞWebｻｲﾄ @ja
label: 其他收入-社交網站 @zh-hant
label: 其他收入-社交网络 @zh
label: 기타 수익 - 소셜 네트워킹 웹 @ko
definition: This segment includes revenue that social networking websites generate from sources other than advertising.
notation: 101014102311
valid from: 2024-06-07

Social Networking Web
type: BicsLevel5Segment
type: Classifier
type: NamedIndividual
is level5 segment of: Internet Media & Services
is contemporary version of: http://data.ga-group.nl/ics/bics/1010141023
is version of: http://data.ga-group.nl/ics/bics/1010141023
replaces: http://data.ga-group.nl/ics/bics/2020/1010141023
imported on: 2026-06-08T13:40:52.236Z
last refreshed on: 2026-06-08T13:41:38.450Z
source accessed on: 2024-06-05T14:42:36Z
source last accessed on: 2024-06-05T14:42:36Z
label: Réseau social sur Web @fr
label: Redes sociales @es
label: Sites redes sociais @pt
label: Social-Networking-Web @de
label: Web rete sociale @it
label: Веб-сайты социальных сетей @ru
label: 社交网络 @zh
label: 線上社群 @zh-hant
label: 소셜 네트워킹 웹 @ko
label: ｿｰｼｬﾙﾈｯﾄﾜｰｷﾝｸﾞWebｻｲﾄ @ja
label: ｿｰｼｬﾙﾈｯﾄﾜｰｷﾝｸﾞWebｻｲ�� @ja
definition: This segment includes companies that provide Web communities online, including social network services, an Internet forum, or a group of blogs.
notation: 1010141023
valid from: 2024-06-07

Online Food Delivery Svcs
type: BicsLevel6Segment
type: Classifier
type: NamedIndividual
is level6 segment of: Online Transport & Delivery Svcs
is contemporary version of: http://data.ga-group.nl/ics/bics/101014102410
is version of: http://data.ga-group.nl/ics/bics/101014102410
imported on: 2026-06-08T13:40:52.236Z
last refreshed on: 2026-06-08T13:41:38.450Z
source accessed on: 2024-06-05T14:42:36Z
source last accessed on: 2024-06-05T14:42:36Z
label: Online-Lebensmittellieferungen @de
label: Serv consegna cibo online @it
label: Serv en línea de entrega de comida @es
label: Serv online para entrega de alimentos @pt
label: Svcs de livraison de repas en ligne @fr
label: Онлайн услуги по доставки продуктов питания @ru
label: 在线外卖服务 @zh
label: 線上食品外送服務 @zh-hant
label: 온라인 식품 배달 서비스 @ko
label: ｵﾝﾗｲﾝ食品配達ｻｰﾋﾞｽ @ja
definition: This segment includes companies that offer food delivery services online or via applications. These companies do not own the mode of transportation.
notation: 101014102410
valid from: 2024-06-07

Ridesharing Svcs
type: BicsLevel6Segment
type: Classifier
type: NamedIndividual
is level6 segment of: Online Transport & Delivery Svcs
is contemporary version of: http://data.ga-group.nl/ics/bics/101014102411
is version of: http://data.ga-group.nl/ics/bics/101014102411
imported on: 2026-06-08T13:40:52.236Z
last refreshed on: 2026-06-08T13:41:38.450Z
source accessed on: 2024-06-05T14:42:36Z
source last accessed on: 2024-06-05T14:42:36Z
label: Mitfahrservice @de
label: Serv de transporte compartilhado @it
label: Serv transporte compartido @es
label: Svcs covoiturage @fr
label: Услуги райдшеринга @ru
label: 共乘服務 @zh-hant
label: 拼车服务 @zh
label: 차량공유 서비스 @ko
label: ﾗｲﾄﾞｼｪｱｻｰﾋﾞｽ @ja
label: ﾗｲﾄ��ｼｪｱｻｰﾋﾞｽ @ja
definition: This segment includes companies that offer ridesharing or other services for the transportation of individuals online or via applications. These companies do not own the mode of transportation.
notation: 101014102411
valid from: 2024-06-07

Online Transport & Delivery Svcs
type: BicsLevel5Segment
type: Classifier
type: NamedIndividual
is level5 segment of: Internet Media & Services
is contemporary version of: http://data.ga-group.nl/ics/bics/1010141024
is version of: http://data.ga-group.nl/ics/bics/1010141024
imported on: 2026-06-08T13:40:52.236Z
last refreshed on: 2026-06-08T13:41:38.450Z
source accessed on: 2024-06-05T14:42:36Z
source last accessed on: 2024-06-05T14:42:36Z
label: Online-Transport- & Lieferdienste @de
label: Serv di Trasporto e consegna online @it
label: Serv online de transporte e entrega @pt
label: Servicios de transporte y entrega en línea @es
label: Svcs transp/livraison en ligne @fr
label: Онлайн услуги транспортировки и доставки @ru
label: 在线快递物流服务 @zh
label: 線上運輸及外送服務 @zh-hant
label: 온라인 운송 및 배달 서비스 @ko
label: ｵﾝﾗｲﾝ輸送･配送ｻｰﾋﾞｽ @ja
definition: This segment includes companies that offer transportation or delivery services online or via applications. These companies do not own the mode of transportation.
notation: 1010141024
valid from: 2024-06-07

Internet Media & Services
type: BicsLevel4SubIndustry
type: Classifier
type: NamedIndividual
is sub industry of: Internet Media & Services
is contemporary version of: http://data.ga-group.nl/ics/bics/10101410
is version of: http://data.ga-group.nl/ics/bics/10101410
replaces: http://data.ga-group.nl/ics/bics/2020/10101410
imported on: 2026-06-08T13:40:52.236Z
last refreshed on: 2026-06-08T13:41:38.450Z
source accessed on: 2024-06-05T14:42:36Z
source last accessed on: 2024-06-05T14:42:36Z
label: Internetmedien & -dienste @de
label: Mídia e serviços de internet @pt
label: Media e servizi internet @it
label: Medios y servicios de Internet @es
label: Services et média Internet @fr
label: Услуги Интернета и СМИ @ru
label: 互联网媒体与服务 @zh
label: 網路媒體及服務 @zh-hant
label: 인터넷 미디어 & 서비스 @ko
label: ｲﾝﾀｰﾈｯﾄﾒﾃﾞｨｱ･ｻｰﾋﾞｽ @ja
definition: This industry subgroup includes websites that create and distribute content, or provide services online.
notation: 10101410
valid from: 2024-06-07

Internet Media & Services
type: BicsLevel3Industry
type: Classifier
type: NamedIndividual
is industry of: Media
is contemporary version of: http://data.ga-group.nl/ics/bics/101014
is version of: http://data.ga-group.nl/ics/bics/101014
replaces: http://data.ga-group.nl/ics/bics/2020/101014
imported on: 2026-06-08T13:40:52.236Z
last refreshed on: 2026-06-08T13:41:38.450Z
source accessed on: 2024-06-05T14:42:36Z
source last accessed on: 2024-06-05T14:42:36Z
label: Internet-Medien & -dienste @de
label: Mídia internet e serviços @pt
label: Media e servizi internet @it
label: Medios y servicios de Internet @es
label: Services et média Internet @fr
label: Услуги Интернета и СМИ @ru
label: 互联网媒体与服务 @zh
label: 網路媒體及服務 @zh-hant
label: 인터넷 미디어 & 서비스 @ko
label: ｲﾝﾀｰﾈｯﾄﾒﾃﾞｨｱ･ｻｰﾋﾞｽ @ja
label: ｲﾝﾀｰﾈｯﾄﾒﾃﾞｨｱ･���ｰﾋﾞｽ @ja
definition: This industry includes websites that create and distribute content, or provide services online.
notation: 101014
valid from: 2024-06-07

Media
type: BicsLevel2IndustryGroup
type: Classifier
type: NamedIndividual
is industry group of: Communications
is contemporary version of: http://data.ga-group.nl/ics/bics/1010
is version of: http://data.ga-group.nl/ics/bics/1010
replaces: http://data.ga-group.nl/ics/bics/2020/1010
imported on: 2026-06-08T13:40:52.236Z
last refreshed on: 2026-06-08T13:41:38.450Z
source accessed on: 2024-06-05T14:42:36Z
source last accessed on: 2024-06-05T14:42:36Z
label: Médias @fr
label: Mídia @pt
label: Medien @de
label: Prensa @es
label: СМИ @ru
label: 媒体 @zh
label: 媒體 @zh-hant
label: 미디어 @ko
label: ﾒﾃﾞｨｱ @ja
definition: This industry group includes companies that create, distribute, or publish media content. Media content includes many formats, such as print, advertisements, motion pictures, television, music, radio, and Internet websites. Also included are cable and satellite providers.
notation: 1010
valid from: 2024-06-07

Mobile Phone Services
type: BicsLevel6Segment
type: Classifier
type: NamedIndividual
is level6 segment of: Wireless Service Providers
is contemporary version of: http://data.ga-group.nl/ics/bics/101110101010
is version of: http://data.ga-group.nl/ics/bics/101110101010
replaces: http://data.ga-group.nl/ics/bics/2020/101110101010
imported on: 2026-06-08T13:40:52.236Z
last refreshed on: 2026-06-08T13:41:38.450Z
source accessed on: 2024-06-05T14:42:36Z
source last accessed on: 2024-06-05T14:42:36Z
label: Mobilfunkdienste @de
label: Serviços de telefone celular @pt
label: Services téléphoniques mobiles @fr
label: Servicios de teléfono móvil @es
label: Servizi telefonia mobile @it
label: Услуги мобильных телефонов @ru
label: 携帯電話ｻｰﾋﾞｽ @ja
label: 移动电话服务 @zh
label: 移动电话服�� @zh
label: 行動語音服務 @zh-hant
label: 휴대전화 서비스 @ko
definition: This segment includes wireless carriers that offer mobile voice services.
notation: 101110101010
valid from: 2024-06-07

Mobile Data Services
type: BicsLevel6Segment
type: Classifier
type: NamedIndividual
is level6 segment of: Wireless Service Providers
is contemporary version of: http://data.ga-group.nl/ics/bics/101110101011
is version of: http://data.ga-group.nl/ics/bics/101110101011
replaces: http://data.ga-group.nl/ics/bics/2020/101110101011
imported on: 2026-06-08T13:40:52.236Z
last refreshed on: 2026-06-08T13:41:38.450Z
source accessed on: 2024-06-05T14:42:36Z
source last accessed on: 2024-06-05T14:42:36Z
label: Mobile Datendienste @de
label: Serviços dados móvel @pt
label: Services données mobiles @fr
label: Servicios móviles de datos @es
label: Servizi dati Mobili @it
label: Мобильн. усл. данных @ru
label: 携帯通信ﾃﾞｰﾀｻｰﾋﾞｽ @ja
label: 移动数据服务 @zh
label: 行動數據服務 @zh-hant
label: 모바일 데이터 서비스 @ko
definition: This segment includes wireless carriers that provide a broad range of mobile data services, such as wireless Internet access, video, games, ring tones, and music.
notation: 101110101011
valid from: 2024-06-07

Mobile Text Messaging (SMS)
type: BicsLevel6Segment
type: Classifier
type: NamedIndividual
is level6 segment of: Wireless Service Providers
is contemporary version of: http://data.ga-group.nl/ics/bics/101110101012
is version of: http://data.ga-group.nl/ics/bics/101110101012
replaces: http://data.ga-group.nl/ics/bics/2020/101110101012
imported on: 2026-06-08T13:40:52.236Z
last refreshed on: 2026-06-08T13:41:38.450Z
source accessed on: 2024-06-05T14:42:36Z
source last accessed on: 2024-06-05T14:42:36Z
label: Mensagem de texto de telefone móvel @pt
label: Mensajes de texto en celulares (SMS) @es
label: Message texte (SMS) par mobile @fr
label: Messaggi (SMS) @it
label: Textnachrichten (SMS) @de
label: Мобильные текстовые сообщения (SMS) @ru
label: 手机短信 (SMS) @zh
label: 携帯ﾃｷｽﾄﾒｯｾｰｼﾞ(SMS) @ja
label: 行動簡訊(SMS) @zh-hant
label: 모바일 문자 메시지 (SMS) @ko
label: 모바일 문�� 메시지 (SMS) @ko
definition: This segment includes wireless carriers that offer mobile short message service (SMS), also known as text messaging.
notation: 101110101012
valid from: 2024-06-07

Mobile Roaming Services
type: BicsLevel6Segment
type: Classifier
type: NamedIndividual
is level6 segment of: Wireless Service Providers
is contemporary version of: http://data.ga-group.nl/ics/bics/101110101013
is version of: http://data.ga-group.nl/ics/bics/101110101013
replaces: http://data.ga-group.nl/ics/bics/2020/101110101013
imported on: 2026-06-08T13:40:52.236Z
last refreshed on: 2026-06-08T13:41:38.450Z
source accessed on: 2024-06-05T14:42:36Z
source last accessed on: 2024-06-05T14:42:36Z
label: Mobile Roaming-Dienste @de
label: Serviços roaming móvel @pt
label: Services d'itinérance de mobiles @fr
label: Servicios móviles de itinerancia @es
label: Servizi roaming Mobile @it
label: Мобильные услуги роуминга @ru
label: 携帯ﾛｰﾐﾝｸﾞｻｰﾋﾞｽ @ja
label: 移动漫游服务 @zh
label: 行動漫遊服務 @zh-hant
label: 모바일 로밍 서비스 @ko
definition: This segment includes wireless carriers that provide mobile roaming services. Such services allow subscribers from other carriers' networks to make and receive calls over its network.
notation: 101110101013
valid from: 2024-06-07

Wireless Infra Access Revenue
type: BicsLevel6Segment
type: Classifier
type: NamedIndividual
is level6 segment of: Wireless Service Providers
is contemporary version of: http://data.ga-group.nl/ics/bics/101110101014
is version of: http://data.ga-group.nl/ics/bics/101110101014
replaces: http://data.ga-group.nl/ics/bics/2020/101110101014
imported on: 2026-06-08T13:40:52.236Z
last refreshed on: 2026-06-08T13:41:38.450Z
source accessed on: 2024-06-05T14:42:36Z
source last accessed on: 2024-06-05T14:42:36Z
label: Erlös kabelloser Infrastrukturzugang @de
label: Ingreso de acceso al infraestructura inalámbrica @es
label: Receita de acesso infra sem fio @pt
label: Revenus d'accès infra sans fil @fr
label: Ricavi accesso infrastruttura senza fili @it
label: Врчк от предост. доступа к инфрастр-ре буспроводн. сети @ru
label: 无线基础设施使用收入 @zh
label: 無線基礎建設使用收入 @zh-hant
label: 無線ｲﾝﾌﾗ接続収入 @ja
label: 무선인프라 접속 수익 @ko
definition: This segment includes carriers that sell wireless network capacity on a wholesale basis to other wireless service providers who, in turn, use this network capacity to market branded mobile services to their customers.
notation: 101110101014
valid from: 2024-06-07

Wireless Service Providers
type: BicsLevel5Segment
type: Classifier
type: NamedIndividual
is level5 segment of: Wireless Telecommunications
is contemporary version of: http://data.ga-group.nl/ics/bics/1011101010
is version of: http://data.ga-group.nl/ics/bics/1011101010
replaces: http://data.ga-group.nl/ics/bics/2020/1011101010
imported on: 2026-06-08T13:40:52.236Z
last refreshed on: 2026-06-08T13:41:38.450Z
source accessed on: 2024-06-05T14:42:36Z
source last accessed on: 2024-06-05T14:42:36Z
label: Drahtlose Service-Anbieter @de
label: Fornitori servizi wireless @it
label: Fournisseurs services sans fil @fr
label: Provedores de serviços sem fios @pt
label: Proveedores de servicios inhalámbricos @es
label: Провайдеры беспроводной связи @ru
label: 无线服务供应商 @zh
label: 無線服務供應商 @zh-hant
label: 이동통신서비스 제공업체 @ko
label: ﾜｲﾔﾚｽｻｰﾋﾞｽﾌﾟﾛﾊﾞｲﾀﾞｰ @ja
definition: This segment includes companies that provide mobile phone services, such as telephone voice services, data services, text messaging services, and roaming services.
notation: 1011101010
valid from: 2024-06-07

Satellite Operators
type: BicsLevel5Segment
type: Classifier
type: NamedIndividual
is level5 segment of: Wireless Telecommunications
is contemporary version of: http://data.ga-group.nl/ics/bics/1011101011
is version of: http://data.ga-group.nl/ics/bics/1011101011
replaces: http://data.ga-group.nl/ics/bics/2020/1011101011
imported on: 2026-06-08T13:40:52.236Z
last refreshed on: 2026-06-08T13:41:38.450Z
source accessed on: 2024-06-05T14:42:36Z
source last accessed on: 2024-06-05T14:42:36Z
label: Opérateurs de satellite @fr
label: Operadores de satélite @es
label: Operatori satellitari @it
label: Satellitenbetreiber @de
label: Спутниковые операторы @ru
label: 卫星运营商 @zh
label: 衛星運営 @ja
label: 衛星電信(除電視) @zh-hant
label: 위성 운영업체 @ko
definition: This segment includes companies that own and operate satellites. Typically, these satellite operators offer satellite capacity for telecommunication networks or provide geospatial data for their clients.
notation: 1011101011
valid from: 2024-06-07

Mobile Comm Device Revenue
type: BicsLevel5Segment
type: Classifier
type: NamedIndividual
is level5 segment of: Wireless Telecommunications
is contemporary version of: http://data.ga-group.nl/ics/bics/1011101012
is version of: http://data.ga-group.nl/ics/bics/1011101012
replaces: http://data.ga-group.nl/ics/bics/2020/1011101012
imported on: 2026-06-08T13:40:52.236Z
last refreshed on: 2026-06-08T13:41:38.450Z
source accessed on: 2024-06-05T14:42:36Z
source last accessed on: 2024-06-05T14:42:36Z
label: Erlös aus mobilen Kommunikationsgeräten @de
label: Ingreso de dispositivos móviles de comunicaciones @es
label: Receita de aparelhos de comunicações móveis @pt
label: Revenu d'appareils de communication mobile @fr
label: Ricavi apparati comunicazione mobile @it
label: Выручка от устройств мобильной связи @ru
label: 移动通信设备收入 @zh
label: 移動体通信機器売上高 @ja
label: 行動通信裝置收入 @zh-hant
label: 이동통신기기 매출액 @ko
definition: This segment includes revenue that telecom carriers generate from the sale of mobile handsets and other wireless devices. These devices are frequently sold along with a prepaid or postpaid wireless subscription.
notation: 1011101012
valid from: 2024-06-07

Wireless Telecommunications
type: BicsLevel4SubIndustry
type: Classifier
type: NamedIndividual
is sub industry of: Telecommunications
is contemporary version of: http://data.ga-group.nl/ics/bics/10111010
is version of: http://data.ga-group.nl/ics/bics/10111010
replaces: http://data.ga-group.nl/ics/bics/2020/10111010
imported on: 2026-06-08T13:40:52.236Z
last refreshed on: 2026-06-08T13:41:38.450Z
source accessed on: 2024-06-05T14:42:36Z
source last accessed on: 2024-06-05T14:42:36Z
label: Drahtlose Telekommunikation @de
label: Télécommunications sans fil @fr
label: Telecomunicações rede s/fio @pt
label: Telecomunicación inalámbrica @es
label: Telecomunicazione senza fili @it
label: Беспроводная связь @ru
label: Беспроводная связ�� @ru
label: 无线电信 @zh
label: 無線通信 @ja
label: 無線通訊服務 @zh-hant
label: 무선 정보통신 @ko
definition: This industry subgroup includes companies that use a wireless infrastructure to provide a variety of services, such as wireless telephony services, wireless data services, text messaging/short messaging services (SMS), roaming, wireless Internet services, and satellite telecommunications. These companies have spectrum licenses and provide services using that spectrum.
notation: 10111010
valid from: 2024-06-07

VOIP Services
type: BicsLevel6Segment
type: Classifier
type: NamedIndividual
is level6 segment of: Wireline Phone Services
is contemporary version of: http://data.ga-group.nl/ics/bics/101110111010
is version of: http://data.ga-group.nl/ics/bics/101110111010
replaces: http://data.ga-group.nl/ics/bics/2020/101110111010
imported on: 2026-06-08T13:40:52.236Z
last refreshed on: 2026-06-08T13:41:38.450Z
source accessed on: 2024-06-05T14:42:36Z
source last accessed on: 2024-06-05T14:42:36Z
label: IP電話ｻｰﾋﾞｽ @ja
label: Serviços protocolo Voice over Internet (IP) @pt
label: Servicios de protocolo de Internet (IP) de "voice over" @es
label: Servizi Voice over Internet Protocol (VOIP) @it
label: Téléphonie sur Internet (VOIP) @fr
label: VoIP-Dienstleistungen @de
label: Услуги протокола VoIP @ru
label: 網路語音 (IP) 電話服務 @zh-hant
label: 网络(IP)电话服务 @zh
label: 음성 인터넷 프로토콜(IP) 서비스 @ko
definition: This segment includes carriers that offer voice-over-IP (VoIP) through a wired Internet or broadband connection. Includes the transmission of voice over the Internet or through another packet-switched network.
notation: 101110111010
valid from: 2024-06-07

Wireline Local Services
type: BicsLevel6Segment
type: Classifier
type: NamedIndividual
is level6 segment of: Wireline Phone Services
is contemporary version of: http://data.ga-group.nl/ics/bics/101110111011
is version of: http://data.ga-group.nl/ics/bics/101110111011
replaces: http://data.ga-group.nl/ics/bics/2020/101110111011
imported on: 2026-06-08T13:40:52.236Z
last refreshed on: 2026-06-08T13:41:38.450Z
source accessed on: 2024-06-05T14:42:36Z
source last accessed on: 2024-06-05T14:42:36Z
label: Kabelgebundene Ortsgespräche @de
label: Serv tel local-Inal @es
label: Serviços de telefonia fixa locais @pt
label: Services d'appels locaux filaires @fr
label: Tel urbano fisso @it
label: Проводная телефонная связь @ru
label: 固定回線市内電話ｻｰﾋﾞｽ @ja
label: 有線短途服務 @zh-hant
label: 本地电话服务-有线 @zh
label: 유선 지역 서비스 @ko
definition: This segment includes wireline carriers that offer fixed-line local phone service to business and residential customers.
notation: 101110111011
valid from: 2024-06-07

Wireline Long Distance Services
type: BicsLevel6Segment
type: Classifier
type: NamedIndividual
is level6 segment of: Wireline Phone Services
is contemporary version of: http://data.ga-group.nl/ics/bics/101110111012
is version of: http://data.ga-group.nl/ics/bics/101110111012
replaces: http://data.ga-group.nl/ics/bics/2020/101110111012
imported on: 2026-06-08T13:40:52.236Z
last refreshed on: 2026-06-08T13:41:38.450Z
source accessed on: 2024-06-05T14:42:36Z
source last accessed on: 2024-06-05T14:42:36Z
label: Kabelgebundene Ferngesprächsdienste @de
label: Serviços de telefonia fixa de longa distância @pt
label: Services d'appels longue distance filaires @fr
label: Servicios larga dist-alámbricos @es
label: Servizi telefonia fissa a lunga distanza @it
label: Услуги междугородной связи @ru
label: 固定回線長距離電話ｻｰﾋﾞｽ @ja
label: 固網長途服務 @zh-hant
label: 有限长途电话服务 @zh
label: 유선 장거리 서비스 @ko
definition: This segment includes carriers that offer domestic and international long-distance services over a wireline network.
notation: 101110111012
valid from: 2024-06-07

Wireline Rental
type: BicsLevel6Segment
type: Classifier
type: NamedIndividual
is level6 segment of: Wireline Phone Services
is contemporary version of: http://data.ga-group.nl/ics/bics/101110111013
is version of: http://data.ga-group.nl/ics/bics/101110111013
replaces: http://data.ga-group.nl/ics/bics/2020/101110111013
imported on: 2026-06-08T13:40:52.236Z
last refreshed on: 2026-06-08T13:41:38.450Z
source accessed on: 2024-06-05T14:42:36Z
source last accessed on: 2024-06-05T14:42:36Z
label: Alq líneas tel alám @es
label: Aluguel de telefonia fixa @pt
label: Kabelgebunden, Miete @de
label: Loc ligne téléph fil @fr
label: Noleggio linea telef @it
label: Аренда оборуд. для проводной связи @ru
label: 固定回線賃貸収入 @ja
label: 有線電話線出租 @zh-hant
label: 有线电话线出租收入 @zh
label: 유선 대여 @ko
definition: This segment includes revenue that fixed-line carriers generate from leasing lines.
notation: 101110111013
valid from: 2024-06-07

Wireline Phone Services
type: BicsLevel5Segment
type: Classifier
type: NamedIndividual
is level5 segment of: Wireline Telecommunications
is contemporary version of: http://data.ga-group.nl/ics/bics/1011101110
is version of: http://data.ga-group.nl/ics/bics/1011101110
replaces: http://data.ga-group.nl/ics/bics/2020/1011101110
imported on: 2026-06-08T13:40:52.236Z
last refreshed on: 2026-06-08T13:41:38.450Z
source accessed on: 2024-06-05T14:42:36Z
source last accessed on: 2024-06-05T14:42:36Z
label: Festnetzdienste @de
label: Serviços fixos - Telefone @pt
label: Servicios de teléfono por línea fija @es
label: Servizi telefonia linea fissa @it
label: Srvc téléphoniques filaires @fr
label: Услуги проводн. телеф. связи @ru
label: 固定電話ｻｰﾋﾞｽ @ja
label: 固網通話服務-電信 @zh-hant
label: 固话服务 @zh
label: 유선 전화 서비스 @ko
definition: This segment includes wireline network operators that offer voice services over a fixed-line network. Includes wireline local and long-distance services as well as voice-over-IP (VoIP) to residential and business customers.
notation: 1011101110
valid from: 2024-06-07

Wireline Internet Services
type: BicsLevel5Segment
type: Classifier
type: NamedIndividual
is level5 segment of: Wireline Telecommunications
is contemporary version of: http://data.ga-group.nl/ics/bics/1011101111
is version of: http://data.ga-group.nl/ics/bics/1011101111
replaces: http://data.ga-group.nl/ics/bics/2020/1011101111
imported on: 2026-06-08T13:40:52.236Z
last refreshed on: 2026-06-08T13:41:38.450Z
source accessed on: 2024-06-05T14:42:36Z
source last accessed on: 2024-06-05T14:42:36Z
label: Kabelgebundene Internetdienste @de
label: Serviços fixos - Internet @pt
label: Servicios de Internet por línea fija @es
label: Servizi internet linea fissa @it
label: Srvc Internet filaires @fr
label: Услуги проводн. Интернета @ru
label: 固定回線ｲﾝﾀｰﾈｯﾄｻｰﾋﾞｽ @ja
label: 固網網路服務 @zh-hant
label: 有线互联网服务 @zh
label: 유선 인터넷 서비스 @ko
definition: This segment includes companies that offer Internet access (including broadband) through a wireline network connection.
notation: 1011101111
valid from: 2024-06-07

Wireline Video Services
type: BicsLevel5Segment
type: Classifier
type: NamedIndividual
is level5 segment of: Wireline Telecommunications
is contemporary version of: http://data.ga-group.nl/ics/bics/1011101112
is version of: http://data.ga-group.nl/ics/bics/1011101112
replaces: http://data.ga-group.nl/ics/bics/2020/1011101112
imported on: 2026-06-08T13:40:52.236Z
last refreshed on: 2026-06-08T13:41:38.450Z
source accessed on: 2024-06-05T14:42:36Z
source last accessed on: 2024-06-05T14:42:36Z
label: Kabelgebundene Videodienste @de
label: Serviços fixos - Vídeo @pt
label: Servicios de video por línea fija @es
label: Servizi vide linea fissa @it
label: Srvc vidéo filaires @fr
label: Услуги проводн. видео @ru
label: 固定通信動画ｻｰﾋﾞｽ @ja
label: 固網影片服務-電信 @zh-hant
label: 有线视频服务 @zh
label: 유선 비디오 서비스 @ko
definition: This segment includes wireline network operators that offer video services over a fixed-line network.
notation: 1011101112
valid from: 2024-06-07

Wholesale Telecom Services
type: BicsLevel5Segment
type: Classifier
type: NamedIndividual
is level5 segment of: Wireline Telecommunications
is contemporary version of: http://data.ga-group.nl/ics/bics/1011101113
is version of: http://data.ga-group.nl/ics/bics/1011101113
replaces: http://data.ga-group.nl/ics/bics/2020/1011101113
imported on: 2026-06-08T13:40:52.236Z
last refreshed on: 2026-06-08T13:41:38.450Z
source accessed on: 2024-06-05T14:42:36Z
source last accessed on: 2024-06-05T14:42:36Z
label: Großhandels-Telekomm.-Dienste @de
label: Serviços telecom no atacado @pt
label: Services de télécom en gros @fr
label: Servicios mayoristas telecom @es
label: Servizi telecom all'ingrosso @it
label: Оптовые телеком. услуги @ru
label: 卸売通信ｻｰﾋﾞｽ @ja
label: 批發電信服務 @zh-hant
label: 电信批量业务服务 @zh
label: 도매 정보통신 서비스 @ko
definition: This segment includes network operators that either sell network capacity to resellers or lease their network facilities on a wholesale basis to other carriers and/or resellers.
notation: 1011101113
valid from: 2024-06-07

Data Centers
type: BicsLevel5Segment
type: Classifier
type: NamedIndividual
is level5 segment of: Wireline Telecommunications
is contemporary version of: http://data.ga-group.nl/ics/bics/1011101114
is version of: http://data.ga-group.nl/ics/bics/1011101114
replaces: http://data.ga-group.nl/ics/bics/2020/1011101114
imported on: 2026-06-08T13:40:52.236Z
last refreshed on: 2026-06-08T13:41:38.450Z
source accessed on: 2024-06-05T14:42:36Z
source last accessed on: 2024-06-05T14:42:36Z
label: Centrais de dados @pt
label: Centres informatiques @fr
label: Centri dati @it
label: Centros de datos @es
label: Datenzentren @de
label: Центры обработки данных @ru
label: 数据中心 @zh
label: 資料中心 @zh-hant
label: 데이터 센터 @ko
label: ﾃﾞｰﾀｾﾝﾀｰ @ja
definition: This segment includes companies that own data centers, which store computing and data storage equipment.
notation: 1011101114
valid from: 2024-06-07

Wireline Telecommunications
type: BicsLevel4SubIndustry
type: Classifier
type: NamedIndividual
is sub industry of: Telecommunications
is contemporary version of: http://data.ga-group.nl/ics/bics/10111011
is version of: http://data.ga-group.nl/ics/bics/10111011
replaces: http://data.ga-group.nl/ics/bics/2020/10111011
imported on: 2026-06-08T13:40:52.236Z
last refreshed on: 2026-06-08T13:41:38.450Z
source accessed on: 2024-06-05T14:42:36Z
source last accessed on: 2024-06-05T14:42:36Z
label: Kabelgebundene Telekommunikation @de
label: Télécommunications filaires @fr
label: Telecomunicações rede fixa @pt
label: Telecomunicación de línea fija @es
label: Telecomunicazione linea fissa @it
label: Проводная связь @ru
label: 固網電信 @zh-hant
label: 有線通信 @ja
label: 有线电信 @zh
label: 유선 정보통신 @ko
label: ���线电信 @zh
definition: This industry subgroup includes companies that operate facilities and infrastructure that supplies voice, data, text, and sound using wired switching and transmission networks.
notation: 10111011
valid from: 2024-06-07

Telecommunications
type: BicsLevel3Industry
type: Classifier
type: NamedIndividual
is industry of: Telecommunications
is contemporary version of: http://data.ga-group.nl/ics/bics/101110
is version of: http://data.ga-group.nl/ics/bics/101110
replaces: http://data.ga-group.nl/ics/bics/2020/101110
imported on: 2026-06-08T13:40:52.236Z
last refreshed on: 2026-06-08T13:41:38.450Z
source accessed on: 2024-06-05T14:42:36Z
source last accessed on: 2024-06-05T14:42:36Z
label: Télécommunications @fr
label: Telecomunicações @pt
label: Telecomunicaciones @es
label: Telecomunicazioni @it
label: Telekommunikation @de
label: Связь @ru
label: 电信 @zh
label: 電信 @zh-hant
label: 電気通信 @ja
label: 정보통신 @ko
definition: This industry includes companies that provide a broad range of telecommunications services including wireless and wireline services and satellite services including voice, video and/or data. Also includes companies that sell wholesale access to other service providers. Excludes cable multiple system operators (MSOs). (See Cable Cable & Satellite)
notation: 101110
valid from: 2024-06-07

Telecommunications
type: BicsLevel2IndustryGroup
type: Classifier
type: NamedIndividual
is industry group of: Communications
is contemporary version of: http://data.ga-group.nl/ics/bics/1011
is version of: http://data.ga-group.nl/ics/bics/1011
replaces: http://data.ga-group.nl/ics/bics/2020/1011
imported on: 2026-06-08T13:40:52.236Z
last refreshed on: 2026-06-08T13:41:38.450Z
source accessed on: 2024-06-05T14:42:36Z
source last accessed on: 2024-06-05T14:42:36Z
label: Télécommunications @fr
label: Telecomunicações @pt
label: Telecomunicaciones @es
label: Telecomunicazioni @it
label: Telekommunikation @de
label: Связь @ru
label: 电信 @zh
label: 電信 @zh-hant
label: 電気通信 @ja
label: 정보통신 @ko
definition: This industry group includes companies that provide telecommunication services. Excludes cable companies that offer telecommunication services.
notation: 1011
valid from: 2024-06-07

Communications
type: BicsLevel1Sector
type: Classifier
type: NamedIndividual
is contemporary version of: http://data.ga-group.nl/ics/bics/10
is version of: http://data.ga-group.nl/ics/bics/10
replaces: http://data.ga-group.nl/ics/bics/2020/10
imported on: 2026-06-08T13:40:52.236Z
last refreshed on: 2026-06-08T13:41:38.450Z
source accessed on: 2024-06-05T14:42:36Z
source last accessed on: 2024-06-05T14:42:36Z
label: Comunicações @pt
label: Comunicaciones @es
label: Comunicazioni @it
label: Kommunikation @de
label: Коммуникации @ru
label: 通信 @ja
label: 通訊 @zh-hant
label: 通讯 @zh
label: 통신 @ko
definition: This sector includes companies facilitating communication or creating and distributing content.
notation: 10
valid from: 2024-06-07

Children's Apparel
type: BicsLevel6Segment
type: Classifier
type: NamedIndividual
is level6 segment of: Apparel Design
is contemporary version of: http://data.ga-group.nl/ics/bics/111010101010
is version of: http://data.ga-group.nl/ics/bics/111010101010
replaces: http://data.ga-group.nl/ics/bics/2020/111010101010
imported on: 2026-06-08T13:40:52.236Z
last refreshed on: 2026-06-08T13:41:38.450Z
source accessed on: 2024-06-05T14:42:36Z
source last accessed on: 2024-06-05T14:42:36Z
label: Kinderbekleidung @de
label: Moda bambini @it
label: Ropa de niños @es
label: Vêtements pour enfants @fr
label: Vestuário infantil @pt
label: Детская одежда @ru
label: 兒童服飾 @zh-hant
label: 子供服 @ja
label: 童装设计 @zh
label: 아동용 의류 @ko
definition: This segment includes companies that design children's apparel.
notation: 111010101010
valid from: 2024-06-07

Men's Apparel
type: BicsLevel6Segment
type: Classifier
type: NamedIndividual
is level6 segment of: Apparel Design
is contemporary version of: http://data.ga-group.nl/ics/bics/111010101011
is version of: http://data.ga-group.nl/ics/bics/111010101011
replaces: http://data.ga-group.nl/ics/bics/2020/111010101011
imported on: 2026-06-08T13:40:52.236Z
last refreshed on: 2026-06-08T13:41:38.450Z
source accessed on: 2024-06-05T14:42:36Z
source last accessed on: 2024-06-05T14:42:36Z
label: Abbigliamento maschile @it
label: Herrenbekleidung @de
label: Ropa de hombres @es
label: Vêtements pour hommes @fr
label: Vestuário masculino @pt
label: Мужская одежда @ru
label: 男士服飾 @zh-hant
label: 男士服饰 @zh
label: 紳士服 @ja
label: 남성 의류 @ko
definition: This segment includes companies that design men's apparel.
notation: 111010101011
valid from: 2024-06-07

Women's Apparel
type: BicsLevel6Segment
type: Classifier
type: NamedIndividual
is level6 segment of: Apparel Design
is contemporary version of: http://data.ga-group.nl/ics/bics/111010101012
is version of: http://data.ga-group.nl/ics/bics/111010101012
replaces: http://data.ga-group.nl/ics/bics/2020/111010101012
imported on: 2026-06-08T13:40:52.236Z
last refreshed on: 2026-06-08T13:41:38.450Z
source accessed on: 2024-06-05T14:42:36Z
source last accessed on: 2024-06-05T14:42:36Z
label: Abbigliamento donna @it
label: Frauendesigner @de
label: Ropa de mujeres @es
label: Vêtements pour femmes @fr
label: Vestuário feminino @pt
label: Женская одежда @ru
label: 女士成衣设计 @zh
label: 女士服飾 @zh-hant
label: 婦人服 @ja
label: 여성 의류 @ko
definition: This segment includes companies that design women's apparel.
notation: 111010101012
valid from: 2024-06-07

Lingerie
type: BicsLevel6Segment
type: Classifier
type: NamedIndividual
is level6 segment of: Apparel Design
is contemporary version of: http://data.ga-group.nl/ics/bics/111010101013
is version of: http://data.ga-group.nl/ics/bics/111010101013
replaces: http://data.ga-group.nl/ics/bics/2020/111010101013
imported on: 2026-06-08T13:40:52.236Z
last refreshed on: 2026-06-08T13:41:38.450Z
source accessed on: 2024-06-05T14:42:36Z
source last accessed on: 2024-06-05T14:42:36Z
label: Dessous féminins @fr
label: Dessous @de
label: Intimo femminile @it
label: Lencería @es
label: Нижнее белье @ru
label: 內睡衣 @zh-hant
label: 女士內睡衣 @zh
label: 婦人用下着 @ja
label: 란제리 @ko
definition: This segment includes companies that design women's lingerie.
notation: 111010101013
valid from: 2024-06-07

Sports Apparel
type: BicsLevel6Segment
type: Classifier
type: NamedIndividual
is level6 segment of: Apparel Design
is contemporary version of: http://data.ga-group.nl/ics/bics/111010101014
is version of: http://data.ga-group.nl/ics/bics/111010101014
replaces: http://data.ga-group.nl/ics/bics/2020/111010101014
imported on: 2026-06-08T13:40:52.236Z
last refreshed on: 2026-06-08T13:41:38.450Z
source accessed on: 2024-06-05T14:42:36Z
source last accessed on: 2024-06-05T14:42:36Z
label: Abbigliamento sport @it
label: Ropa deportiva @es
label: Sportbekleidung @de
label: Vêtements de sport @fr
label: Vestuário esportivo @pt
label: Спортивная одежда @ru
label: 运动成衣设计 @zh
label: 運動服裝 @zh-hant
label: 스포츠 의류 @ko
label: ｽﾎﾟｰﾂｳｴｱ @ja
definition: This segment includes companies that design sports apparel.
notation: 111010101014
valid from: 2024-06-07

Fur & Leather Apparel
type: BicsLevel6Segment
type: Classifier
type: NamedIndividual
is level6 segment of: Apparel Design
is contemporary version of: http://data.ga-group.nl/ics/bics/111010101015
is version of: http://data.ga-group.nl/ics/bics/111010101015
replaces: http://data.ga-group.nl/ics/bics/2020/111010101015
imported on: 2026-06-08T13:40:52.236Z
last refreshed on: 2026-06-08T13:41:38.450Z
source accessed on: 2024-06-05T14:42:36Z
source last accessed on: 2024-06-05T14:42:36Z
label: Abbigliamento pelle e pellicce @it
label: Pelz & Lederbekleidung @de
label: Ropa de peluche y piel @es
label: Vêtement en fourrure et cuir @fr
label: Vestuário de pele e couro @pt
label: Изделия из меха и кожи @ru
label: 毛皮与皮革服装 @zh
label: 毛皮服飾 @zh-hant
label: 毛皮･革製衣服 @ja
label: 모피 & 가죽 의류 @ko
definition: This segment includes companies that design fur and leather products.
notation: 111010101015
valid from: 2024-06-07

Outerwear Apparel
type: BicsLevel6Segment
type: Classifier
type: NamedIndividual
is level6 segment of: Apparel Design
is contemporary version of: http://data.ga-group.nl/ics/bics/111010101016
is version of: http://data.ga-group.nl/ics/bics/111010101016
replaces: http://data.ga-group.nl/ics/bics/2020/111010101016
imported on: 2026-06-08T13:40:52.236Z
last refreshed on: 2026-06-08T13:41:38.450Z
source accessed on: 2024-06-05T14:42:36Z
source last accessed on: 2024-06-05T14:42:36Z
label: Abbigliam esterno @it
label: Prendas exteriores @es
label: Vêtements d'extérieur @fr
label: Vestuário de uso exterior @pt
label: Überbekleidung @de
label: Верхняя одежда @ru
label: 外出服 @zh-hant
label: 室外服饰设计 @zh
label: 아웃웨어 의류 @ko
label: ｱｳﾀｰｳｪｱ @ja
definition: This segment includes companies that design outerwear apparel.
notation: 111010101016
valid from: 2024-06-07

Professional Uniforms
type: BicsLevel6Segment
type: Classifier
type: NamedIndividual
is level6 segment of: Apparel Design
is contemporary version of: http://data.ga-group.nl/ics/bics/111010101017
is version of: http://data.ga-group.nl/ics/bics/111010101017
replaces: http://data.ga-group.nl/ics/bics/2020/111010101017
imported on: 2026-06-08T13:40:52.236Z
last refreshed on: 2026-06-08T13:41:38.450Z
source accessed on: 2024-06-05T14:42:36Z
source last accessed on: 2024-06-05T14:42:36Z
label: Arbeitsuniformen @de
label: Divise professionali @it
label: Uniformes profesionales @es
label: Uniformes professionnels @fr
label: Uniformes profissionais @pt
label: Профес. форменная одежда @ru
label: 专业制服 @zh
label: 專業制服 @zh-hant
label: 業務用制服 @ja
label: 직업 유니폼 @ko
definition: This segment includes companies that design apparel for specific professions, companies, or schools.
notation: 111010101017
valid from: 2024-06-07

Apparel Design
type: BicsLevel5Segment
type: Classifier
type: NamedIndividual
is level5 segment of: Apparel, Footwear & Acc Design
is contemporary version of: http://data.ga-group.nl/ics/bics/1110101010
is version of: http://data.ga-group.nl/ics/bics/1110101010
replaces: http://data.ga-group.nl/ics/bics/2020/1110101010
imported on: 2026-06-08T13:40:52.236Z
last refreshed on: 2026-06-08T13:41:38.450Z
source accessed on: 2024-06-05T14:42:36Z
source last accessed on: 2024-06-05T14:42:36Z
label: Design abbigliamento @it
label: Design de vêtements @fr
label: Design de vestuário @pt
label: Diseño de ropa @es
label: Kleidungsdesign @de
label: Дизайн одежды @ru
label: 成衣設計 @zh-hant
label: 成衣设计 @zh
label: 衣料品ﾃﾞｻﾞｲﾝ @ja
label: 의류 디자인 @ko
definition: This segment includes companies that design apparel.
notation: 1110101010
valid from: 2024-06-07

Apparel Brand Licensing
type: BicsLevel5Segment
type: Classifier
type: NamedIndividual
is level5 segment of: Apparel, Footwear & Acc Design
is contemporary version of: http://data.ga-group.nl/ics/bics/1110101011
is version of: http://data.ga-group.nl/ics/bics/1110101011
replaces: http://data.ga-group.nl/ics/bics/2020/1110101011
imported on: 2026-06-08T13:40:52.236Z
last refreshed on: 2026-06-08T13:41:38.450Z
source accessed on: 2024-06-05T14:42:36Z
source last accessed on: 2024-06-05T14:42:36Z
label: Alquiler de marcas de ropa @es
label: Concession de licence de marque vêtements @fr
label: Licença de marca de vestuário @pt
label: Licenza abbigliamento di marca @it
label: Markenlizenzierung von Bekleidung @de
label: Лицензирование торговых марок @ru
label: 服装品牌授权 @zh
label: 服飾品牌授權 @zh-hant
label: 衣料ﾌﾞﾗﾝﾄﾞﾗｲｾﾝｽ契約 @ja
label: 의류 브랜드 라이센스업 @ko
definition: This segment includes companies that generate revenue from licensing rights to their apparel, such as trademarks, brand names, or agreements for which a royalty payment or licensing fee is paid by others.
notation: 1110101011
valid from: 2024-06-07

Luggage
type: BicsLevel6Segment
type: Classifier
type: NamedIndividual
is level6 segment of: Bags, Leather Goods & Acc Design
is contemporary version of: http://data.ga-group.nl/ics/bics/111010101210
is version of: http://data.ga-group.nl/ics/bics/111010101210
replaces: http://data.ga-group.nl/ics/bics/2020/111010101210
imported on: 2026-06-08T13:40:52.236Z
last refreshed on: 2026-06-08T13:41:38.450Z
source accessed on: 2024-06-05T14:42:36Z
source last accessed on: 2024-06-05T14:42:36Z
label: Bagages @fr
label: Bagagli @it
label: Gepäck @de
label: Malas @pt
label: Maletas @es
label: Багаж @ru
label: かばん @ja
label: 旅行箱包 @zh
label: 行李箱 @zh-hant
label: 가방 @ko
definition: This segment includes companies that design luggage products typically used for travel.
notation: 111010101210
valid from: 2024-06-07

Personal Leather Goods
type: BicsLevel6Segment
type: Classifier
type: NamedIndividual
is level6 segment of: Bags, Leather Goods & Acc Design
is contemporary version of: http://data.ga-group.nl/ics/bics/111010101211
is version of: http://data.ga-group.nl/ics/bics/111010101211
replaces: http://data.ga-group.nl/ics/bics/2020/111010101211
imported on: 2026-06-08T13:40:52.236Z
last refreshed on: 2026-06-08T13:41:38.450Z
source accessed on: 2024-06-05T14:42:36Z
source last accessed on: 2024-06-05T14:42:36Z
label: Articles personnels en cuir @fr
label: Articoli personali in pelle @it
label: Artigos de couro pessoais @pt
label: Bienes personales de cuero @es
label: Persönliche Lederwaren @de
label: Личные кожаные изделия @ru
label: 个人皮革制品 @zh
label: 個人皮革製品 @zh-hant
label: 革製品 @ja
label: 개인 가죽제품 @ko
definition: This segment includes companies that design personal leather good products such as leather wallets, belts, and briefcases.
notation: 111010101211
valid from: 2024-06-07

Handbags & Purses
type: BicsLevel6Segment
type: Classifier
type: NamedIndividual
is level6 segment of: Bags, Leather Goods & Acc Design
is contemporary version of: http://data.ga-group.nl/ics/bics/111010101212
is version of: http://data.ga-group.nl/ics/bics/111010101212
replaces: http://data.ga-group.nl/ics/bics/2020/111010101212
imported on: 2026-06-08T13:40:52.236Z
last refreshed on: 2026-06-08T13:41:38.450Z
source accessed on: 2024-06-05T14:42:36Z
source last accessed on: 2024-06-05T14:42:36Z
label: Bolsas e carteiras @pt
label: Bolsas y monederos @es
label: Borse e borsette @it
label: Handtaschen @de
label: Sacs à main @fr
label: Женские сумки @ru
label: 手提包及皮包 @zh-hant
label: 手袋和钱包 @zh
label: 핸드백 & 지갑 @ko
label: ﾊﾝﾄﾞﾊﾞｯｸﾞ･財布 @ja
definition: This segment includes companies that design handbags.
notation: 111010101212
valid from: 2024-06-07

Bags, Leather Goods & Acc Design
type: BicsLevel5Segment
type: Classifier
type: NamedIndividual
is level5 segment of: Apparel, Footwear & Acc Design
is contemporary version of: http://data.ga-group.nl/ics/bics/1110101012
is version of: http://data.ga-group.nl/ics/bics/1110101012
replaces: http://data.ga-group.nl/ics/bics/2020/1110101012
imported on: 2026-06-08T13:40:52.236Z
last refreshed on: 2026-06-08T13:41:38.450Z
source accessed on: 2024-06-05T14:42:36Z
source last accessed on: 2024-06-05T14:42:36Z
label: Bolsas, artigos de couro e acess moda @pt
label: Design borse, articoli pelle @it
label: Design sacs/art. cuir/access. @fr
label: Diseño de bolsas/bienes de cuero/acc @es
label: Taschen, Lederwaren & Acc. Design @de
label: Дизайн сумок и изделий из кожи @ru
label: かばん･革製品･ｱｸｾｻﾘｰﾃﾞｻﾞｲﾝ @ja
label: 包类、皮革制品及配件设计 @zh
label: 手袋、皮革製品及配件設計 @zh-hant
label: 가방, 가죽제품 액세서리 & 디자인 @ko
definition: This segment includes companies that design luggage, personal leather goods, and handbags.
notation: 1110101012
valid from: 2024-06-07

Athletic Footwear
type: BicsLevel6Segment
type: Classifier
type: NamedIndividual
is level6 segment of: Footwear Design
is contemporary version of: http://data.ga-group.nl/ics/bics/111010101310
is version of: http://data.ga-group.nl/ics/bics/111010101310
replaces: http://data.ga-group.nl/ics/bics/2020/111010101310
imported on: 2026-06-08T13:40:52.236Z
last refreshed on: 2026-06-08T13:41:38.450Z
source accessed on: 2024-06-05T14:42:36Z
source last accessed on: 2024-06-05T14:42:36Z
label: Calzado atlético @es
label: Chaussures de sport @fr
label: Scarpe sportive @it
label: Sportschuhe @de
label: Valçados atléticos @pt
label: Спортивная обувь @ru
label: 运动鞋 @zh
label: 运动��� @zh
label: 運動靴 @ja
label: 運動鞋 @zh-hant
label: 운동화 @ko
definition: This segment includes companies that design footwear for athletic purposes, including specific sports or recreational activities.
notation: 111010101310
valid from: 2024-06-07

Men's Footwear
type: BicsLevel7Segment
type: Classifier
type: NamedIndividual
is level7 segment of: Non-Athletic Footwear
is contemporary version of: http://data.ga-group.nl/ics/bics/11101010131110
is version of: http://data.ga-group.nl/ics/bics/11101010131110
replaces: http://data.ga-group.nl/ics/bics/2020/11101010131110
imported on: 2026-06-08T13:40:52.236Z
last refreshed on: 2026-06-08T13:41:38.450Z
source accessed on: 2024-06-05T14:42:36Z
source last accessed on: 2024-06-05T14:42:36Z
label: Calçados masculinos @pt
label: Calzado varonil @es
label: Chaussures pour hommes @fr
label: Herrenschuhe @de
label: Scarpe per uomo @it
label: Мужская обувь @ru
label: 男鞋 @zh
label: 紳士用履物 @ja
label: 남성 신발 @ko
definition: This segment includes companies that design men's non-athletic footwear.
notation: 11101010131110
valid from: 2024-06-07

Women's Footwear
type: BicsLevel7Segment
type: Classifier
type: NamedIndividual
is level7 segment of: Non-Athletic Footwear
is contemporary version of: http://data.ga-group.nl/ics/bics/11101010131111
is version of: http://data.ga-group.nl/ics/bics/11101010131111
replaces: http://data.ga-group.nl/ics/bics/2020/11101010131111
imported on: 2026-06-08T13:40:52.236Z
last refreshed on: 2026-06-08T13:41:38.450Z
source accessed on: 2024-06-05T14:42:36Z
source last accessed on: 2024-06-05T14:42:36Z
label: Calçados femininos @pt
label: Calzado para mujeres @es
label: Chaussures pour femmes @fr
label: Damenschuhe @de
label: Scarpe per donna @it
label: Женская обувь @ru
label: 女鞋 @zh
label: 婦人用履物 @ja
label: 여성 신발 @ko
definition: This segment includes companies that design women's non-athletic footwear.
notation: 11101010131111
valid from: 2024-06-07

Non-Athletic Footwear
type: BicsLevel6Segment
type: Classifier
type: NamedIndividual
is level6 segment of: Footwear Design
is contemporary version of: http://data.ga-group.nl/ics/bics/111010101311
is version of: http://data.ga-group.nl/ics/bics/111010101311
replaces: http://data.ga-group.nl/ics/bics/2020/111010101311
imported on: 2026-06-08T13:40:52.236Z
last refreshed on: 2026-06-08T13:41:38.450Z
source accessed on: 2024-06-05T14:42:36Z
source last accessed on: 2024-06-05T14:42:36Z
label: Calçados não atléticos @pt
label: Calzado no atlético @es
label: Chaussures de ville @fr
label: Herstellung von Schuhen (nicht-Sport) @de
label: Scarpe non sportive @it
label: Неспортивная обувь @ru
label: 履物(除運動靴) @ja
label: 非运动鞋 @zh
label: 非運動鞋 @zh-hant
label: 운동화 제외 신발 @ko
definition: This segment includes companies that design footwear for fashion purposes.
notation: 111010101311
valid from: 2024-06-07

Footwear Design
type: BicsLevel5Segment
type: Classifier
type: NamedIndividual
is level5 segment of: Apparel, Footwear & Acc Design
is contemporary version of: http://data.ga-group.nl/ics/bics/1110101013
is version of: http://data.ga-group.nl/ics/bics/1110101013
replaces: http://data.ga-group.nl/ics/bics/2020/1110101013
imported on: 2026-06-08T13:40:52.236Z
last refreshed on: 2026-06-08T13:41:38.450Z
source accessed on: 2024-06-05T14:42:36Z
source last accessed on: 2024-06-05T14:42:36Z
label: Design de chaussures @fr
label: Design di scarpe @it
label: Design para calçados @pt
label: Design von Schuhen @de
label: Diseño de calzado @es
label: Дизайн женской обуви @ru
label: 履物ﾃﾞｻﾞｲﾝ @ja
label: 鞋类设计 @zh
label: 鞋類設計 @zh-hant
label: 신발 디자인 @ko
definition: This segment includes companies that design athletic and non-athletic footwear.
notation: 1110101013
valid from: 2024-06-07

Garment Outsourcing
type: BicsLevel5Segment
type: Classifier
type: NamedIndividual
is level5 segment of: Apparel, Footwear & Acc Design
is contemporary version of: http://data.ga-group.nl/ics/bics/1110101014
is version of: http://data.ga-group.nl/ics/bics/1110101014
replaces: http://data.ga-group.nl/ics/bics/2020/1110101014
imported on: 2026-06-08T13:40:52.236Z
last refreshed on: 2026-06-08T13:41:38.450Z
source accessed on: 2024-06-05T14:42:36Z
source last accessed on: 2024-06-05T14:42:36Z
label: Esternlz prod abbigl @it
label: Externalisation de fabrication de vêtements @fr
label: Outsourcing von Bekleidung @de
label: Subcontratación de prendas @es
label: Terceirização de vestuário @pt
label: Аутсорсинг одежды @ru
label: 衣料縫製ｱｳﾄｿｰｼﾝｸﾞ @ja
label: 衣物制造和外包服务 @zh
label: 衣物製作外包服務 @zh-hant
label: 의상제작 외주 @ko
definition: This segment includes companies that provide outsourced manufacturing services for apparel, footwear, and accessory designers. These companies manufacture under other brand names.
notation: 1110101014
valid from: 2024-06-07

Jewelry
type: BicsLevel6Segment
type: Classifier
type: NamedIndividual
is level6 segment of: Watch & Jewelry Design
is contemporary version of: http://data.ga-group.nl/ics/bics/111010101510
is version of: http://data.ga-group.nl/ics/bics/111010101510
replaces: http://data.ga-group.nl/ics/bics/2020/111010101510
imported on: 2026-06-08T13:40:52.236Z
last refreshed on: 2026-06-08T13:41:38.450Z
source accessed on: 2024-06-05T14:42:36Z
source last accessed on: 2024-06-05T14:42:36Z
label: Bijoux @fr
label: Gioielli @it
label: Joias @pt
label: Joyería @es
label: Schmuck @de
label: Ювелирные изделия @ru
label: 宝石 @ja
label: 珠宝 @zh
label: 珠寶 @zh-hant
label: 보석 @ko
definition: This segment includes companies that design, market, and/or manufacture jewelry of all types.
notation: 111010101510
valid from: 2024-06-07

Watch
type: BicsLevel6Segment
type: Classifier
type: NamedIndividual
is level6 segment of: Watch & Jewelry Design
is contemporary version of: http://data.ga-group.nl/ics/bics/111010101511
is version of: http://data.ga-group.nl/ics/bics/111010101511
replaces: http://data.ga-group.nl/ics/bics/2020/111010101511
imported on: 2026-06-08T13:40:52.236Z
last refreshed on: 2026-06-08T13:41:38.450Z
source accessed on: 2024-06-05T14:42:36Z
source last accessed on: 2024-06-05T14:42:36Z
label: Alerta @es
label: Armbanduhr @de
label: Montres @fr
label: Orologi @it
label: Relógios @pt
label: Наручные часы @ru
label: 手錶 @zh-hant
label: 腕時計 @ja
label: 钟表 @zh
label: 손목시계 @ko
definition: This segment includes companies that design and market watches.
notation: 111010101511
valid from: 2024-06-07

Watch & Jewelry Design
type: BicsLevel5Segment
type: Classifier
type: NamedIndividual
is level5 segment of: Apparel, Footwear & Acc Design
is contemporary version of: http://data.ga-group.nl/ics/bics/1110101015
is version of: http://data.ga-group.nl/ics/bics/1110101015
replaces: http://data.ga-group.nl/ics/bics/2020/1110101015
imported on: 2026-06-08T13:40:52.236Z
last refreshed on: 2026-06-08T13:41:38.450Z
source accessed on: 2024-06-05T14:42:36Z
source last accessed on: 2024-06-05T14:42:36Z
label: Design de jóias e relógios @pt
label: Design de montres et bijoux @fr
label: Design orologi e gioielli @it
label: Design von Uhren & Schmuck @de
label: Diseño de relojes y joyería @es
label: Дизайн часов и ювелирных украшений @ru
label: 手錶及珠寶設計 @zh-hant
label: 腕時計･宝石ﾃﾞｻﾞｲﾝ @ja
label: 钟表及珠宝设计 @zh
label: 손목시계 및 보석 디자인 @ko
definition: This segment includes companies that design and market watches and jewelry.
notation: 1110101015
valid from: 2024-06-07

Apparel, Footwear & Acc Design
type: BicsLevel4SubIndustry
type: Classifier
type: NamedIndividual
is sub industry of: Apparel & Textile Products
is contemporary version of: http://data.ga-group.nl/ics/bics/11101010
is version of: http://data.ga-group.nl/ics/bics/11101010
replaces: http://data.ga-group.nl/ics/bics/2020/11101010
imported on: 2026-06-08T13:40:52.236Z
last refreshed on: 2026-06-08T13:41:38.450Z
source accessed on: 2024-06-05T14:42:36Z
source last accessed on: 2024-06-05T14:42:36Z
label: Design abbigl, calzature e accessori @it
label: Design vêtements, chauss et acc @fr
label: Diseño de ropa, calzado y acc @es
label: Kleidung/Schuhe/Access. Design @de
label: Vestuário, calçados e design ac @pt
label: Дизайн одежды, обуви и аксессуаров @ru
label: 服装、鞋类及配饰设计 @zh
label: 服装、��类及配饰设计 @zh
label: 服飾、鞋類及配件設計 @zh-hant
label: 衣料･履物･装身具ﾃﾞｻﾞｲﾝ @ja
label: 의류, 신발 & 액세서리 디자인 @ko
definition: This industry subgroup includes companies that design and manufacturer apparel, footwear, and accessories. Excludes designers who own and operate their own retail store and the majority of their revenue comes from retail operations (see Specialty Apparel Stores).
notation: 11101010
valid from: 2024-06-07

Leather, Hide Tan & Finishing
type: BicsLevel5Segment
type: Classifier
type: NamedIndividual
is level5 segment of: Textile & Textile Products
is contemporary version of: http://data.ga-group.nl/ics/bics/1110101110
is version of: http://data.ga-group.nl/ics/bics/1110101110
replaces: http://data.ga-group.nl/ics/bics/2020/1110101110
imported on: 2026-06-08T13:40:52.236Z
last refreshed on: 2026-06-08T13:41:38.450Z
source accessed on: 2024-06-05T14:42:36Z
source last accessed on: 2024-06-05T14:42:36Z
label: Conciatura e rifinitura pelle e cuoio @it
label: Couro, curtimento e acabamenro @pt
label: Cuir, tannage/finissage des peaux @fr
label: Curtido, acabado cuero y piel @es
label: Leder, gerben & Endbehandl. @de
label: Дубление и отделка кожи и шкур @ru
label: なめし革 @ja
label: 皮革、鞣皮及染皮 @zh-hant
label: 皮革鞣制及整理 @zh
label: 피혁 가공업 @ko
definition: This segment includes companies that create leather from hides and skins.
notation: 1110101110
valid from: 2024-06-07

Fabric Coating Mills
type: BicsLevel7Segment
type: Classifier
type: NamedIndividual
is level7 segment of: Fabric Finishing
is contemporary version of: http://data.ga-group.nl/ics/bics/11101011111010
is version of: http://data.ga-group.nl/ics/bics/11101011111010
replaces: http://data.ga-group.nl/ics/bics/2020/11101011111010
imported on: 2026-06-08T13:40:52.236Z
last refreshed on: 2026-06-08T13:41:38.450Z
source accessed on: 2024-06-05T14:42:36Z
source last accessed on: 2024-06-05T14:42:36Z
label: Fábricas de revestimento de tecido @pt
label: Fabb rivest tessuto @it
label: Mol recubrim telas @es
label: Revêtement de tissus @fr
label: Stoffbeschichtungen @de
label: Фабрики по отделке текстиля @ru
label: 毛整业 @zh
label: 織物塗佈業 @zh-hant
label: 織物ｺｰﾃｨﾝｸﾞ @ja
label: 섬유 피복 제조업 @ko
definition: This segment includes companies that provide fabric coating, such as coating fabrics in wax to improve strength.
notation: 11101011111010
valid from: 2024-06-07

Nonwoven Textile & Fabric Finish
type: BicsLevel7Segment
type: Classifier
type: NamedIndividual
is level7 segment of: Fabric Finishing
is contemporary version of: http://data.ga-group.nl/ics/bics/11101011111011
is version of: http://data.ga-group.nl/ics/bics/11101011111011
replaces: http://data.ga-group.nl/ics/bics/2020/11101011111011
imported on: 2026-06-08T13:40:52.236Z
last refreshed on: 2026-06-08T13:41:38.450Z
source accessed on: 2024-06-05T14:42:36Z
source last accessed on: 2024-06-05T14:42:36Z
label: Acabamento de tecidos e não texturizados @pt
label: Faserstoff & Gewebe-Finish @de
label: Molienda de acabado de textiles y telas no de lana @es
label: Tessuto non tessuto e finitura tessuti @it
label: Textiles non tissés et finissage de tissus @fr
label: Покраска нетканевого текстиля и полотна @ru
label: 不織布紡織及織布整理 @zh-hant
label: 不織繊維･織物仕上げ @ja
label: 无纺布织物与面料加工 @zh
label: 부직포 & 직물 완제품 @ko
definition: This segment includes companies that provide finishing touches to non-fabric textile products.
notation: 11101011111011
valid from: 2024-06-07

Woven Fabric Finishing Mills
type: BicsLevel7Segment
type: Classifier
type: NamedIndividual
is level7 segment of: Fabric Finishing
is contemporary version of: http://data.ga-group.nl/ics/bics/11101011111012
is version of: http://data.ga-group.nl/ics/bics/11101011111012
replaces: http://data.ga-group.nl/ics/bics/2020/11101011111012
imported on: 2026-06-08T13:40:52.236Z
last refreshed on: 2026-06-08T13:41:38.450Z
source accessed on: 2024-06-05T14:42:36Z
source last accessed on: 2024-06-05T14:42:36Z
label: Fábrica de acabamento de tecidos @pt
label: Fabbriche di rifinitura tessuti @it
label: Molienda de tejidos y acabados de tejidos de lana @es
label: Usines de finissage de tissus @fr
label: Webereien für Webstoffbehandlungen @de
label: Фабрики по покраске тканевого полотна @ru
label: 人造纖維梭織物整理加工業 @zh-hant
label: 人造纤维织布精整厂 @zh
label: 織布物仕上げ @ja
label: 직물 가공업 @ko
definition: This segment includes companies that finish woven fabrics by providing basic stitching and other finishing touches.
notation: 11101011111012
valid from: 2024-06-07

Fabric Finishing
type: BicsLevel6Segment
type: Classifier
type: NamedIndividual
is level6 segment of: Textile
is contemporary version of: http://data.ga-group.nl/ics/bics/111010111110
is version of: http://data.ga-group.nl/ics/bics/111010111110
replaces: http://data.ga-group.nl/ics/bics/2020/111010111110
imported on: 2026-06-08T13:40:52.236Z
last refreshed on: 2026-06-08T13:41:38.450Z
source accessed on: 2024-06-05T14:42:36Z
source last accessed on: 2024-06-05T14:42:36Z
label: Acabamento de tecido @pt
label: Finition de tissu @fr
label: Gewebeherstellung @de
label: Rifinitura di stoffe @it
label: Terminados de telas @es
label: Отделка тканых полотен @ru
label: 織物仕上げ @ja
label: 織物整理加工 @zh-hant
label: 纤维加工 @zh
label: 직물가공업 @ko
definition: This segment includes mills that finish fabric, which may involve stitching or coating of fabric or other textiles.
notation: 111010111110
valid from: 2024-06-07

Nonwoven Fabric Mill
type: BicsLevel7Segment
type: Classifier
type: NamedIndividual
is level7 segment of: Fabric
is contemporary version of: http://data.ga-group.nl/ics/bics/11101011111110
is version of: http://data.ga-group.nl/ics/bics/11101011111110
replaces: http://data.ga-group.nl/ics/bics/2020/11101011111110
imported on: 2026-06-08T13:40:52.236Z
last refreshed on: 2026-06-08T13:41:38.450Z
source accessed on: 2024-06-05T14:42:36Z
source last accessed on: 2024-06-05T14:42:36Z
label: Conf telas no tejid @es
label: Fábrica de tecido não tecidos @pt
label: Fabb stoffe non tess @it
label: Stoffe o. Webstoffe @de
label: Usine text non tissé @fr
label: Фабрики по произв. нетканых полотен @ru
label: 不織繊維布 @ja
label: 无纺布 @zh
label: 非梭織布整理加工 @zh-hant
label: 부직포 가공업 @ko
definition: This segment includes mills that manufacture nonwoven fabric material. Nonwoven fabric is created by thermal, mechanical or chemical bonding rather than weaving or knitting.
notation: 11101011111110
valid from: 2024-06-07

Woven Fabric Mills
type: BicsLevel7Segment
type: Classifier
type: NamedIndividual
is level7 segment of: Fabric
is contemporary version of: http://data.ga-group.nl/ics/bics/11101011111111
is version of: http://data.ga-group.nl/ics/bics/11101011111111
replaces: http://data.ga-group.nl/ics/bics/2020/11101011111111
imported on: 2026-06-08T13:40:52.236Z
last refreshed on: 2026-06-08T13:41:38.450Z
source accessed on: 2024-06-05T14:42:36Z
source last accessed on: 2024-06-05T14:42:36Z
label: Fábricas de tecido especial @pt
label: Fabbriche tessitura @it
label: Molinería de tejidos @es
label: Usines de tissu @fr
label: Webstoffwebereien @de
label: Фабрики по произв. тканей @ru
label: 人造纖維梭織布業 @zh-hant
label: 人造纤维织布厂 @zh
label: 織布 @ja
label: 직물 제직업 @ko
definition: This segment includes companies that take fiber, yarn, and thread and weave them into fabrics used to make garments.
notation: 11101011111111
valid from: 2024-06-07

Fabric
type: BicsLevel6Segment
type: Classifier
type: NamedIndividual
is level6 segment of: Textile
is contemporary version of: http://data.ga-group.nl/ics/bics/111010111111
is version of: http://data.ga-group.nl/ics/bics/111010111111
replaces: http://data.ga-group.nl/ics/bics/2020/111010111111
imported on: 2026-06-08T13:40:52.236Z
last refreshed on: 2026-06-08T13:41:38.450Z
source accessed on: 2024-06-05T14:42:36Z
source last accessed on: 2024-06-05T14:42:36Z
label: Gewebe @de
label: Tecidos @pt
label: Telas @es
label: Tessuto @it
label: Tissus @fr
label: Ткань @ru
label: 織布 @zh-hant
label: 織物 @ja
label: 面料 @zh
label: 직물 @ko
definition: This segment includes mills that produce fabric or cloth used to make garments or other textile products.
notation: 111010111111
valid from: 2024-06-07

Synthetic Fiber & Thread
type: BicsLevel7Segment
type: Classifier
type: NamedIndividual
is level7 segment of: Fiber, Yarn & Thread
is contemporary version of: http://data.ga-group.nl/ics/bics/11101011111210
is version of: http://data.ga-group.nl/ics/bics/11101011111210
replaces: http://data.ga-group.nl/ics/bics/2020/11101011111210
imported on: 2026-06-08T13:40:52.236Z
last refreshed on: 2026-06-08T13:41:38.450Z
source accessed on: 2024-06-05T14:42:36Z
source last accessed on: 2024-06-05T14:42:36Z
label: Fibras y tejidos sintéticos @es
label: Fibres et fils synthétiques @fr
label: Fili e fibre sintetici @it
label: Fios e fibras sintéticas @pt
label: Synthetische Fasern & Fäden @de
label: Синтетические волокна и нити @ru
label: 合成繊維･紡績 @ja
label: 合成纖維及針織 @zh-hant
label: 合成纤维与线绳 @zh
label: 합성섬유 & 실 @ko
definition: This segment includes companies that manufacture synthetic fibers and threads, such as polyester, nylon, and acrylics.
notation: 11101011111210
valid from: 2024-06-07

Thread Mills
type: BicsLevel7Segment
type: Classifier
type: NamedIndividual
is level7 segment of: Fiber, Yarn & Thread
is contemporary version of: http://data.ga-group.nl/ics/bics/11101011111211
is version of: http://data.ga-group.nl/ics/bics/11101011111211
replaces: http://data.ga-group.nl/ics/bics/2020/11101011111211
imported on: 2026-06-08T13:40:52.236Z
last refreshed on: 2026-06-08T13:41:38.450Z
source accessed on: 2024-06-05T14:42:36Z
source last accessed on: 2024-06-05T14:42:36Z
label: Confección de hilos @es
label: Fábricas de fio @pt
label: Fabbriche di fili @it
label: Fadenspinnereien @de
label: Usines de fils @fr
label: Фабрики по изготовл. ниток @ru
label: 制线业 @zh
label: 紡績 @ja
label: 針織業 @zh-hant
label: 실 편조업 @ko
definition: This segment includes companies that produce threads, a thin type of yarn used to stitch fabrics.
notation: 11101011111211
valid from: 2024-06-07

Yarn Spinning Mills
type: BicsLevel7Segment
type: Classifier
type: NamedIndividual
is level7 segment of: Fiber, Yarn & Thread
is contemporary version of: http://data.ga-group.nl/ics/bics/11101011111212
is version of: http://data.ga-group.nl/ics/bics/11101011111212
replaces: http://data.ga-group.nl/ics/bics/2020/11101011111212
imported on: 2026-06-08T13:40:52.236Z
last refreshed on: 2026-06-08T13:41:38.450Z
source accessed on: 2024-06-05T14:42:36Z
source last accessed on: 2024-06-05T14:42:36Z
label: Fábricas de fiação de fios @pt
label: Fabbriche filatura @it
label: Garnspinnereien @de
label: Molinería hilos gir @es
label: Usines fils/filature @fr
label: Фабрики по прядению пряжи @ru
label: 紡紗業 @zh-hant
label: 缫丝业 @zh
label: 製糸 @ja
label: 연사 방적업 @ko
definition: This segment includes companies that spin yarn from fiber materials, such as cotton.
notation: 11101011111212
valid from: 2024-06-07

Yarn Texturizing, Throw & Twist
type: BicsLevel7Segment
type: Classifier
type: NamedIndividual
is level7 segment of: Fiber, Yarn & Thread
is contemporary version of: http://data.ga-group.nl/ics/bics/11101011111213
is version of: http://data.ga-group.nl/ics/bics/11101011111213
replaces: http://data.ga-group.nl/ics/bics/2020/11101011111213
imported on: 2026-06-08T13:40:52.236Z
last refreshed on: 2026-06-08T13:41:38.450Z
source accessed on: 2024-06-05T14:42:36Z
source last accessed on: 2024-06-05T14:42:36Z
label: Filato tramato/gettato/intrecciato @it
label: Molienda de hilos texturizados, tirados y devanados @es
label: Rntrelaçamento, fiação e texturização de fios @pt
label: Texturation, moulinage et retordage de fils @fr
label: Verzwirnen, Wickeln & Spulen von Garn @de
label: Текстурирование, кручение и переплетение пряжи @ru
label: 紡紗締鬈、延伸及撚紗 @zh-hant
label: 織糸･ねん糸･より糸 @ja
label: 纱线初步加工 @zh
label: 섬유사 텍스처가공, 연사 & 합사 @ko
definition: This segment includes companies that texturize yarn, which is a process in which multiple filament yarns are combined to create a strong, spun yarn.
notation: 11101011111213
valid from: 2024-06-07

Fiber, Yarn & Thread
type: BicsLevel6Segment
type: Classifier
type: NamedIndividual
is level6 segment of: Textile
is contemporary version of: http://data.ga-group.nl/ics/bics/111010111112
is version of: http://data.ga-group.nl/ics/bics/111010111112
replaces: http://data.ga-group.nl/ics/bics/2020/111010111112
imported on: 2026-06-08T13:40:52.236Z
last refreshed on: 2026-06-08T13:41:38.450Z
source accessed on: 2024-06-05T14:42:36Z
source last accessed on: 2024-06-05T14:42:36Z
label: Fasern, Garn & Faden @de
label: Fibras, hilos y tejidos @es
label: Fibre, filati e fili @it
label: Fibres, filés et fils @fr
label: Linhas, fios e fibras @pt
label: Волокно, пряжа и нити @ru
label: 繊維･製糸･紡績 @ja
label: 纖維、紗及線 @zh-hant
label: 纤维与纱线 @zh
label: 섬유, 제직사 & 봉제사 @ko
definition: This segment includes mills that spin, throw, or manufacture yarns, threads, or fibers.
notation: 111010111112
valid from: 2024-06-07

Textile
type: BicsLevel5Segment
type: Classifier
type: NamedIndividual
is level5 segment of: Textile & Textile Products
is contemporary version of: http://data.ga-group.nl/ics/bics/1110101111
is version of: http://data.ga-group.nl/ics/bics/1110101111
replaces: http://data.ga-group.nl/ics/bics/2020/1110101111
imported on: 2026-06-08T13:40:52.236Z
last refreshed on: 2026-06-08T13:41:38.450Z
source accessed on: 2024-06-05T14:42:36Z
source last accessed on: 2024-06-05T14:42:36Z
label: Têxteis @pt
label: Tessili @it
label: Textil @es
label: Textiles @fr
label: Textilien @de
label: Текстиль @ru
label: 紡織 @zh-hant
label: 繊維 @ja
label: 纺织品 @zh
label: 섬유 @ko
definition: This segment includes mills that manufacture and finish textiles.
notation: 1110101111
valid from: 2024-06-07

Canvas & Related Prods Mills
type: BicsLevel6Segment
type: Classifier
type: NamedIndividual
is level6 segment of: Textile Products
is contemporary version of: http://data.ga-group.nl/ics/bics/111010111210
is version of: http://data.ga-group.nl/ics/bics/111010111210
replaces: http://data.ga-group.nl/ics/bics/2020/111010111210
imported on: 2026-06-08T13:40:52.236Z
last refreshed on: 2026-06-08T13:41:38.450Z
source accessed on: 2024-06-05T14:42:36Z
source last accessed on: 2024-06-05T14:42:36Z
label: Fabbriche di tela e prodotti simili @it
label: Fabriken für Kanevas & zugeh. Prod. @de
label: Lonas e fábrica de produtos relacionados @pt
label: Molinería de lienzos y productos relacionados @es
label: Usines de grosse toile et prod connexes @fr
label: Фабрики по произв-ву холста и сопутствующих изделий @ru
label: 帆布制造 @zh
label: 帆布及其他產品 @zh-hant
label: 帆布･関連製品 @ja
label: 캔버스 및 관련제품 제조업 @ko
definition: This segment includes companies that produce canvas products.
notation: 111010111210
valid from: 2024-06-07

Cotton Farming
type: BicsLevel6Segment
type: Classifier
type: NamedIndividual
is level6 segment of: Textile Products
is contemporary version of: http://data.ga-group.nl/ics/bics/111010111211
is version of: http://data.ga-group.nl/ics/bics/111010111211
replaces: http://data.ga-group.nl/ics/bics/2020/111010111211
imported on: 2026-06-08T13:40:52.236Z
last refreshed on: 2026-06-08T13:41:38.450Z
source accessed on: 2024-06-05T14:42:36Z
source last accessed on: 2024-06-05T14:42:36Z
label: Anbau von Baumwolle @de
label: Coltivazione cotone @it
label: Cultivo de algodão @pt
label: Cultivo de algodón @es
label: Culture du coton @fr
label: Выращивание хлопка @ru
label: 棉花栽培 @zh-hant
label: 棉花种植 @zh
label: 綿花作農業 @ja
label: 면화 재배업 @ko
definition: This segment includes companies that grow cotton plants.
notation: 111010111211
valid from: 2024-06-07

Rope, Cordage & Twine Mills
type: BicsLevel6Segment
type: Classifier
type: NamedIndividual
is level6 segment of: Textile Products
is contemporary version of: http://data.ga-group.nl/ics/bics/111010111212
is version of: http://data.ga-group.nl/ics/bics/111010111212
replaces: http://data.ga-group.nl/ics/bics/2020/111010111212
imported on: 2026-06-08T13:40:52.236Z
last refreshed on: 2026-06-08T13:41:38.450Z
source accessed on: 2024-06-05T14:42:36Z
source last accessed on: 2024-06-05T14:42:36Z
label: Fábrica de cordel/cordame/corda @pt
label: Fabbriche di corda/cordame/spago @it
label: Molinería de cuerdas, cordones e hilos @es
label: Usines de corde, cordage et ficelle @fr
label: Webereien für Schiffstau/Tauwerk/Schnüre @de
label: Фабрики по произв-ву веревок/канатов/шпагатов @ru
label: 縄･ひも･より糸 @ja
label: 繩索業 @zh-hant
label: 绳索制造 @zh
label: 로프/망/망사 제조업 @ko
definition: This segment includes companies that spin fibers into rope, cordage, or twine.
notation: 111010111212
valid from: 2024-06-07

Textile Bag Mills
type: BicsLevel6Segment
type: Classifier
type: NamedIndividual
is level6 segment of: Textile Products
is contemporary version of: http://data.ga-group.nl/ics/bics/111010111213
is version of: http://data.ga-group.nl/ics/bics/111010111213
replaces: http://data.ga-group.nl/ics/bics/2020/111010111213
imported on: 2026-06-08T13:40:52.236Z
last refreshed on: 2026-06-08T13:41:38.450Z
source accessed on: 2024-06-05T14:42:36Z
source last accessed on: 2024-06-05T14:42:36Z
label: Conf bolsas textiles @es
label: Fábricas de sacos têxteis @pt
label: Fabb borse tessuto @it
label: Textilbeutelweberei @de
label: Usines sacs textile @fr
label: Фабрики по произв. сумок из текстиля @ru
label: 布包業 @zh-hant
label: 布製ﾊﾞｯｸﾞ @ja
label: 纺织手袋制造 @zh
label: 직물포대 편조업 @ko
definition: This segment includes companies that manufacture textile bags.
notation: 111010111213
valid from: 2024-06-07

Tire Cord & Tire Fabrics Mills
type: BicsLevel6Segment
type: Classifier
type: NamedIndividual
is level6 segment of: Textile Products
is contemporary version of: http://data.ga-group.nl/ics/bics/111010111214
is version of: http://data.ga-group.nl/ics/bics/111010111214
replaces: http://data.ga-group.nl/ics/bics/2020/111010111214
imported on: 2026-06-08T13:40:52.236Z
last refreshed on: 2026-06-08T13:41:38.450Z
source accessed on: 2024-06-05T14:42:36Z
source last accessed on: 2024-06-05T14:42:36Z
label: Fábrica de tecidos e cordões pneumáticos @pt
label: Fabbriche corde e stoffe pneumatici @it
label: Fabricación de cordón y tela de llantas @es
label: Fabriken für Reifencord & -gewebe @de
label: Usines de câbles et tissus pour pneus @fr
label: Фабрики по производству шинного корда и шинных тканей @ru
label: 輪胎簾布 @zh-hant
label: 轮胎帘子布及轮胎纤维制造 @zh
label: 타이어코드 & 타이어 직물 제조업 @ko
label: 타이어코��� & 타이어 직물 제조업 @ko
label: ﾀｲﾔｺｰﾄﾞ･ﾀｲﾔ用繊維 @ja
definition: This segment includes companies that produce tire cord.
notation: 111010111214
valid from: 2024-06-07

Textile Products
type: BicsLevel5Segment
type: Classifier
type: NamedIndividual
is level5 segment of: Textile & Textile Products
is contemporary version of: http://data.ga-group.nl/ics/bics/1110101112
is version of: http://data.ga-group.nl/ics/bics/1110101112
replaces: http://data.ga-group.nl/ics/bics/2020/1110101112
imported on: 2026-06-08T13:40:52.236Z
last refreshed on: 2026-06-08T13:41:38.450Z
source accessed on: 2024-06-05T14:42:36Z
source last accessed on: 2024-06-05T14:42:36Z
label: Prodotti tessili @it
label: Productos textiles @es
label: Produits textiles @fr
label: Produtos têxteis @pt
label: Textilprodukte @de
label: Текстильные изделия @ru
label: 紡織品 @zh-hant
label: 繊維製品 @ja
label: 纺织品 @zh
label: 섬유제품 @ko
definition: This segment includes companies that produce finished, non-apparel textile products.
notation: 1110101112
valid from: 2024-06-07

Textile & Textile Products
type: BicsLevel4SubIndustry
type: Classifier
type: NamedIndividual
is sub industry of: Apparel & Textile Products
is contemporary version of: http://data.ga-group.nl/ics/bics/11101011
is version of: http://data.ga-group.nl/ics/bics/11101011
replaces: http://data.ga-group.nl/ics/bics/2020/11101011
imported on: 2026-06-08T13:40:52.236Z
last refreshed on: 2026-06-08T13:41:38.450Z
source accessed on: 2024-06-05T14:42:36Z
source last accessed on: 2024-06-05T14:42:36Z
label: Têxteis e produtos têxteis @pt
label: Tessuti e prodotti tessili @it
label: Textile et produits textiles @fr
label: Textiles y productos de textiles @es
label: Textilien & Textilprodukte @de
label: Текстиль и текстильная продукция @ru
label: 紡織及紡織品 @zh-hant
label: 紡織��紡織品 @zh-hant
label: 繊維･繊維製品 @ja
label: 繊維･��維製品 @ja
label: 纺织品与纺织制品 @zh
label: 섬유 & 섬유제품 @ko
definition: This industry subgroup includes companies that produce textiles, such as yarns, threads, fabrics, and leather.
notation: 11101011
valid from: 2024-06-07

Apparel & Textile Products
type: BicsLevel3Industry
type: Classifier
type: NamedIndividual
is industry of: Consumer Discretionary Products
is contemporary version of: http://data.ga-group.nl/ics/bics/111010
is version of: http://data.ga-group.nl/ics/bics/111010
replaces: http://data.ga-group.nl/ics/bics/2020/111010
imported on: 2026-06-08T13:40:52.236Z
last refreshed on: 2026-06-08T13:41:38.450Z
source accessed on: 2024-06-05T14:42:36Z
source last accessed on: 2024-06-05T14:42:36Z
label: Bekleidungs- & Textilprodukte @de
label: Indumenti e prodotti tessili @it
label: Productos textiles confeccionados @es
label: Produits de tissus et vêtements @fr
label: Produtos têxteis e vestuário @pt
label: Одежда и текстильные изделия @ru
label: 服装和纺织产品 @zh
label: 紡織及服裝產品 @zh-hant
label: 衣料･繊維製品 @ja
label: 의류 & 섬유 제품 @ko
definition: This industry includes companies that design and manufacture apparel and textile products.
notation: 111010
valid from: 2024-06-07

Cars - Electric
type: BicsLevel6Segment
type: Classifier
type: NamedIndividual
is level6 segment of: Cars
is contemporary version of: http://data.ga-group.nl/ics/bics/111011101010
is version of: http://data.ga-group.nl/ics/bics/111011101010
replaces: http://data.ga-group.nl/ics/bics/2020/111011101010
imported on: 2026-06-08T13:40:52.236Z
last refreshed on: 2026-06-08T13:41:38.450Z
source accessed on: 2024-06-05T14:42:36Z
source last accessed on: 2024-06-05T14:42:36Z
label: Automobili - elettriche @it
label: Autos - Elektrisch @de
label: Autos - eléctricos @es
label: Carros - elétricos @pt
label: Voitures - électriques @fr
label: Автомобили - электрические @ru
label: 汽车-电动 @zh
label: 自動車-電気 @ja
label: 車輛-電力 @zh-hant
label: 자동차 - 전기 @ko
definition: This segment includes companies that manufacture electric passenger cars.
notation: 111011101010
valid from: 2024-06-07

Cars - Fossil Fuels
type: BicsLevel6Segment
type: Classifier
type: NamedIndividual
is level6 segment of: Cars
is contemporary version of: http://data.ga-group.nl/ics/bics/111011101011
is version of: http://data.ga-group.nl/ics/bics/111011101011
replaces: http://data.ga-group.nl/ics/bics/2020/111011101011
imported on: 2026-06-08T13:40:52.236Z
last refreshed on: 2026-06-08T13:41:38.450Z
source accessed on: 2024-06-05T14:42:36Z
source last accessed on: 2024-06-05T14:42:36Z
label: Automobili - combustibili fossili @it
label: Autos - Fossile Brennstoffe @de
label: Autos - combustibles fósiles @es
label: Carros - combustíveis fósseis @pt
label: Voitures - combustibles fossiles @fr
label: Автомобили - ископаемое топливо @ru
label: 汽车-化石燃料 @zh
label: 自動車-化石燃料 @ja
label: 車輛-化石燃料 @zh-hant
label: 자동차 - 화석연료 @ko
label: ��车-化石燃料 @zh
definition: This segment includes companies that manufacture fossil fuel passenger cars.
notation: 111011101011
valid from: 2024-06-07

Cars
type: BicsLevel5Segment
type: Classifier
type: NamedIndividual
is level5 segment of: Automobiles
is contemporary version of: http://data.ga-group.nl/ics/bics/1110111010
is version of: http://data.ga-group.nl/ics/bics/1110111010
replaces: http://data.ga-group.nl/ics/bics/2020/1110111010
imported on: 2026-06-08T13:40:52.236Z
last refreshed on: 2026-06-08T13:41:38.450Z
source accessed on: 2024-06-05T14:42:36Z
source last accessed on: 2024-06-05T14:42:36Z
label: Automobili @it
label: Autos @de
label: Carros @pt
label: Voitures @fr
label: Автомобили @ru
label: 汽车 @zh
label: 自動車 @ja
label: 車輛 @zh-hant
label: 자동차 @ko
definition: This segment includes companies that manufacture passenger cars. Such cars include sports cars, sedans, station wagons, hatchbacks, and microcars.
notation: 1110111010
valid from: 2024-06-07

Light Trucks - Electric
type: BicsLevel6Segment
type: Classifier
type: NamedIndividual
is level6 segment of: Light Trucks
is contemporary version of: http://data.ga-group.nl/ics/bics/111011101110
is version of: http://data.ga-group.nl/ics/bics/111011101110
replaces: http://data.ga-group.nl/ics/bics/2020/111011101110
imported on: 2026-06-08T13:40:52.236Z
last refreshed on: 2026-06-08T13:41:38.450Z
source accessed on: 2024-06-05T14:42:36Z
source last accessed on: 2024-06-05T14:42:36Z
label: Autocarri leggeri - Elettrici @it
label: Caminhões leves - eletricidade @pt
label: Camiones ligeros - eléctricos @es
label: Camions légers - électricité @fr
label: Leichte Lkws - Elektrisch @de
label: Легкие грузовые автомобили - на электричестве @ru
label: 軽ﾄﾗｯｸ-電気 @ja
label: 輕型卡車-電力 @zh-hant
label: 轻型卡车-电动 @zh
label: 경트럭 - 전기 @ko
definition: This segment includes companies that manufacture electric light duty trucks and utility vehicles.
notation: 111011101110
valid from: 2024-06-07

Light Trucks - Fossil Fuels
type: BicsLevel6Segment
type: Classifier
type: NamedIndividual
is level6 segment of: Light Trucks
is contemporary version of: http://data.ga-group.nl/ics/bics/111011101111
is version of: http://data.ga-group.nl/ics/bics/111011101111
replaces: http://data.ga-group.nl/ics/bics/2020/111011101111
imported on: 2026-06-08T13:40:52.236Z
last refreshed on: 2026-06-08T13:41:38.450Z
source accessed on: 2024-06-05T14:42:36Z
source last accessed on: 2024-06-05T14:42:36Z
label: Autocarri leggeri - Combustibili fossili @it
label: Caminhões leves - combustíveis fósseis @pt
label: Camiones ligeros - combustibles fósiles @es
label: Camions légers - combustibles fossiles @fr
label: Leichte Lkws - Fossile Brennstoffe @de
label: Легкие грузовые автомобили - ископаемое топливо @ru
label: 軽ﾄﾗｯｸ-化石燃料 @ja
label: 輕型卡車-化石燃料 @zh-hant
label: 轻型卡车-化石燃料 @zh
label: 경트럭 - 화석 연료 @ko
definition: This segment includes companies that manufacture fossil fuel light duty trucks and utility vehicles.
notation: 111011101111
valid from: 2024-06-07

Light Trucks
type: BicsLevel5Segment
type: Classifier
type: NamedIndividual
is level5 segment of: Automobiles
is contemporary version of: http://data.ga-group.nl/ics/bics/1110111011
is version of: http://data.ga-group.nl/ics/bics/1110111011
replaces: http://data.ga-group.nl/ics/bics/2020/1110111011
imported on: 2026-06-08T13:40:52.236Z
last refreshed on: 2026-06-08T13:41:38.450Z
source accessed on: 2024-06-05T14:42:36Z
source last accessed on: 2024-06-05T14:42:36Z
label: Autocarri leggeri @it
label: Caminhões leves @pt
label: Camiones ligeros @es
label: Camions légers @fr
label: Kleinlaster @de
label: Грузовики малой грузоподъемн. @ru
label: 輕型卡車 @zh-hant
label: 轻型卡车 @zh
label: 소형트럭 @ko
label: ﾗｲﾄﾄﾗｯｸ @ja
definition: This segment includes companies that manufacture light duty trucks and utility vehicles, including light trucks, pickup trucks, cabs, light duty vans, minivans, crossovers, and sport utility vehicles.
notation: 1110111011
valid from: 2024-06-07

Motorcycles - Electric
type: BicsLevel6Segment
type: Classifier
type: NamedIndividual
is level6 segment of: Motorcycles
is contemporary version of: http://data.ga-group.nl/ics/bics/111011101210
is version of: http://data.ga-group.nl/ics/bics/111011101210
replaces: http://data.ga-group.nl/ics/bics/2020/111011101210
imported on: 2026-06-08T13:40:52.236Z
last refreshed on: 2026-06-08T13:41:38.450Z
source accessed on: 2024-06-05T14:42:36Z
source last accessed on: 2024-06-05T14:42:36Z
label: Motocicletas - eléctricas @es
label: Motocicletas - eletricidade @pt
label: Motociclette - Elettriche @it
label: Motorräder - Elektrisch @de
label: Motos - électricité @fr
label: Мотоциклы - электрические @ru
label: 摩托车-电动 @zh
label: 機車-電力 @zh-hant
label: 自動二輪車-電気 @ja
label: 오토바이 - 전기 @ko
definition: This segment includes companies that manufacture electric motorcycles and scooters as well as parts specifically designed for electric motorcycles and scooters.
notation: 111011101210
valid from: 2024-06-07

Motorcycles - Fossil Fuels
type: BicsLevel6Segment
type: Classifier
type: NamedIndividual
is level6 segment of: Motorcycles
is contemporary version of: http://data.ga-group.nl/ics/bics/111011101211
is version of: http://data.ga-group.nl/ics/bics/111011101211
replaces: http://data.ga-group.nl/ics/bics/2020/111011101211
imported on: 2026-06-08T13:40:52.236Z
last refreshed on: 2026-06-08T13:41:38.450Z
source accessed on: 2024-06-05T14:42:36Z
source last accessed on: 2024-06-05T14:42:36Z
label: Motocicletas - combustíveis fósseis @pt
label: Motocicletas - combustibles fósiles @es
label: Motociclette - Combustibili fossili @it
label: Motorräder - Fossile Brennstoffe @de
label: Motos - combustibles fossiles @fr
label: Мотоциклы - ископаемое топливо @ru
label: 摩托车-化石燃料 @zh
label: 機車-化石燃料 @zh-hant
label: 自動二輪車-化石燃料 @ja
label: 오토바이 - 화석 연료 @ko
definition: This segment includes companies that manufacture fossil fuel motorcycles and scooters as well as parts specifically designed for fossil fuel motorcycles and scooters.
notation: 111011101211
valid from: 2024-06-07

Motorcycles
type: BicsLevel5Segment
type: Classifier
type: NamedIndividual
is level5 segment of: Automobiles
is contemporary version of: http://data.ga-group.nl/ics/bics/1110111012
is version of: http://data.ga-group.nl/ics/bics/1110111012
replaces: http://data.ga-group.nl/ics/bics/2020/1110111012
imported on: 2026-06-08T13:40:52.236Z
last refreshed on: 2026-06-08T13:41:38.450Z
source accessed on: 2024-06-05T14:42:36Z
source last accessed on: 2024-06-05T14:42:36Z
label: Motocicletas @es
label: Motociclette @it
label: Motorräder @de
label: Motos @fr
label: Мотоциклы @ru
label: 摩托車及零件製造 @zh-hant
label: 摩托车 @zh
label: 自動二輪車 @ja
label: 모터사이클 @ko
definition: This segment includes companies that manufacture motorcycles and scooters as well as parts specifically designed for motorcycles and scooters.
notation: 1110111012
valid from: 2024-06-07

Automobiles
type: BicsLevel4SubIndustry
type: Classifier
type: NamedIndividual
is sub industry of: Automotive
is contemporary version of: http://data.ga-group.nl/ics/bics/11101110
is version of: http://data.ga-group.nl/ics/bics/11101110
replaces: http://data.ga-group.nl/ics/bics/2020/11101110
imported on: 2026-06-08T13:40:52.236Z
last refreshed on: 2026-06-08T13:41:38.450Z
source accessed on: 2024-06-05T14:42:36Z
source last accessed on: 2024-06-05T14:42:36Z
label: Automóveis @pt
label: Automóviles @es
label: Autom��veis @pt
label: Automobili @it
label: Autos @de
label: Автомобили @ru
label: 汽車 @zh-hant
label: 汽车 @zh
label: 自動車 @ja
label: 자동차 @ko
definition: This industry subgroup includes companies that manufacture automobiles (passenger cars), light trucks, motorcycles and sport utility vehicles. Excludes passenger vehicles manufactured for commercial use, medium duty trucks and heavy duty trucks.
notation: 11101110
valid from: 2024-06-07

Alternative Vehicle Parts
type: BicsLevel5Segment
type: Classifier
type: NamedIndividual
is level5 segment of: Auto Parts
is contemporary version of: http://data.ga-group.nl/ics/bics/1110111110
is version of: http://data.ga-group.nl/ics/bics/1110111110
replaces: http://data.ga-group.nl/ics/bics/2020/1110111110
imported on: 2026-06-08T13:40:52.236Z
last refreshed on: 2026-06-08T13:41:38.450Z
source accessed on: 2024-06-05T14:42:36Z
source last accessed on: 2024-06-05T14:42:36Z
label: Alternative Fahrzeugteile @de
label: Partes alternativas de vehículos @es
label: Parti veicoli alternativi @it
label: Peças para veículos alternativo @pt
label: Pièces de véhicules alternatifs @fr
label: Запчасти для пр. альтерн. автомобилей @ru
label: 代替燃料車部品 @ja
label: 另類車輛零件 @zh-hant
label: 替代汽车零部件 @zh
label: 대체 차량 부품 @ko
definition: This segment includes companies that manufacture alternative drivetrain and hybrid systems and parts for automobiles. Includes motors and other components specifically for alternative energy systems.
notation: 1110111110
valid from: 2024-06-07

Auto Light Equipment
type: BicsLevel6Segment
type: Classifier
type: NamedIndividual
is level6 segment of: Auto Electrical & Electronics
is contemporary version of: http://data.ga-group.nl/ics/bics/111011111110
is version of: http://data.ga-group.nl/ics/bics/111011111110
replaces: http://data.ga-group.nl/ics/bics/2020/111011111110
imported on: 2026-06-08T13:40:52.236Z
last refreshed on: 2026-06-08T13:41:38.450Z
source accessed on: 2024-06-05T14:42:36Z
source last accessed on: 2024-06-05T14:42:36Z
label: Beleuchtungsvorrichtung für Autos @de
label: Equip illuminazione auto @it
label: Equipamentos para carros leves @pt
label: Equipements d'éclairage automobile @fr
label: Equipo ligero de autos @es
label: Автомоб. свет. оборудование @ru
label: 汽車照明設備 @zh-hant
label: 汽车照明设备 @zh
label: 自動車用照明 @ja
label: 자동차 경량 장비 @ko
definition: This segment includes companies that manufacture onboard electrical lighting products.
notation: 111011111110
valid from: 2024-06-07

Auto Electronics
type: BicsLevel6Segment
type: Classifier
type: NamedIndividual
is level6 segment of: Auto Electrical & Electronics
is contemporary version of: http://data.ga-group.nl/ics/bics/111011111111
is version of: http://data.ga-group.nl/ics/bics/111011111111
replaces: http://data.ga-group.nl/ics/bics/2020/111011111111
imported on: 2026-06-08T13:40:52.236Z
last refreshed on: 2026-06-08T13:41:38.450Z
source accessed on: 2024-06-05T14:42:36Z
source last accessed on: 2024-06-05T14:42:36Z
label: Autoelektronik @de
label: Dispositivos electrónicos de autos @es
label: Electronique automobile @fr
label: Eletrônicos auto @pt
label: Elettronica auto @it
label: Авто-электроника @ru
label: 其他電機設備製造 @zh-hant
label: 汽车电子 @zh
label: 汽车���子 @zh
label: 自動車用電子製品 @ja
label: 자동차 전자제품 @ko
definition: This segment includes companies that manufacture electrical and electronic equipment. Includes automotive systems, cruise control systems, power window systems, alternators, starters, engine control units, sensors, and wiper systems. Excludes car audio equipment (see Home & Car Audio Equipment).
notation: 111011111111
valid from: 2024-06-07

Auto Electrical & Electronics
type: BicsLevel5Segment
type: Classifier
type: NamedIndividual
is level5 segment of: Auto Parts
is contemporary version of: http://data.ga-group.nl/ics/bics/1110111111
is version of: http://data.ga-group.nl/ics/bics/1110111111
replaces: http://data.ga-group.nl/ics/bics/2020/1110111111
imported on: 2026-06-08T13:40:52.236Z
last refreshed on: 2026-06-08T13:41:38.450Z
source accessed on: 2024-06-05T14:42:36Z
source last accessed on: 2024-06-05T14:42:36Z
label: Auto comp elett, elettronici @it
label: Autoelektrik & -elektronik @de
label: Eléctricos y electrónicos de autos @es
label: Elétricos e eletrônicos auto @pt
label: Electrique/électro. automobile @fr
label: Электр. для автомобилей @ru
label: 汽車電機 @zh-hant
label: 汽车电气电子 @zh
label: 自動車用電装品･電子製品 @ja
label: 자동차 전기 & 전자 제품 @ko
definition: This segment includes companies that manufacture onboard electrical and electronic equipment for the automobile industry.
notation: 1110111111
valid from: 2024-06-07

Auto Glass
type: BicsLevel5Segment
type: Classifier
type: NamedIndividual
is level5 segment of: Auto Parts
is contemporary version of: http://data.ga-group.nl/ics/bics/1110111112
is version of: http://data.ga-group.nl/ics/bics/1110111112
replaces: http://data.ga-group.nl/ics/bics/2020/1110111112
imported on: 2026-06-08T13:40:52.236Z
last refreshed on: 2026-06-08T13:41:38.450Z
source accessed on: 2024-06-05T14:42:36Z
source last accessed on: 2024-06-05T14:42:36Z
label: Autoglas @de
label: Ventanas automotrices @es
label: Verre pour automobiles @fr
label: Vetri auto @it
label: Vidros automotivos @pt
label: Автомобильное стекло @ru
label: 汽車玻璃 @zh-hant
label: 汽车玻璃 @zh
label: 自動車用ガラス @ja
label: 자동차 유리 @ko
definition: This segment includes companies that manufacture automobile glass. Includes tinted and tintless windshields, windows, and sun and moon roofs.
notation: 1110111112
valid from: 2024-06-07

Auto HVAC Systems
type: BicsLevel5Segment
type: Classifier
type: NamedIndividual
is level5 segment of: Auto Parts
is contemporary version of: http://data.ga-group.nl/ics/bics/1110111113
is version of: http://data.ga-group.nl/ics/bics/1110111113
replaces: http://data.ga-group.nl/ics/bics/2020/1110111113
imported on: 2026-06-08T13:40:52.236Z
last refreshed on: 2026-06-08T13:41:38.450Z
source accessed on: 2024-06-05T14:42:36Z
source last accessed on: 2024-06-05T14:42:36Z
label: Auto HVAC-Systeme @de
label: Sistemas HVAC automóveis @pt
label: Sistemas HVAC de autos @es
label: Sistemi HVAC auto @it
label: Systèmes CVCA auto @fr
label: Оборуд. для обогрева и кондиционирования @ru
label: 汽車冷暖氣系統 @zh-hant
label: 汽车暖通空调系统 @zh
label: 自動車用冷暖房空調ｼｽﾃﾑ @ja
label: 자동차 HVAC 시스템 @ko
definition: This segment includes companies that manufacture heating, ventilation, and air conditioning (HVAC) systems and their components.
notation: 1110111113
valid from: 2024-06-07

Auto Metal Stamping
type: BicsLevel5Segment
type: Classifier
type: NamedIndividual
is level5 segment of: Auto Parts
is contemporary version of: http://data.ga-group.nl/ics/bics/1110111114
is version of: http://data.ga-group.nl/ics/bics/1110111114
replaces: http://data.ga-group.nl/ics/bics/2020/1110111114
imported on: 2026-06-08T13:40:52.236Z
last refreshed on: 2026-06-08T13:41:38.450Z
source accessed on: 2024-06-05T14:42:36Z
source last accessed on: 2024-06-05T14:42:36Z
label: Autometallstanzen @de
label: Estampa metal para automóveis @pt
label: Estampage de métal pour automobiles @fr
label: Estampas de metal de autos @es
label: Stampaggio metalli auto @it
label: Металлочеканные автодетали @ru
label: 汽車金屬沖壓 @zh-hant
label: 汽车金属冲压 @zh
label: 自動車金属ﾌﾟﾚｽ @ja
label: 자동차 금속 스탬핑 @ko
definition: This segment includes companies that manufacture auto parts primarily produced by the metal stamping fabrication process. Includes body parts, fenders, hubcaps, and tops.
notation: 1110111114
valid from: 2024-06-07

Auto Safety Equipment
type: BicsLevel5Segment
type: Classifier
type: NamedIndividual
is level5 segment of: Auto Parts
is contemporary version of: http://data.ga-group.nl/ics/bics/1110111115
is version of: http://data.ga-group.nl/ics/bics/1110111115
replaces: http://data.ga-group.nl/ics/bics/2020/1110111115
imported on: 2026-06-08T13:40:52.236Z
last refreshed on: 2026-06-08T13:41:38.450Z
source accessed on: 2024-06-05T14:42:36Z
source last accessed on: 2024-06-05T14:42:36Z
label: Autosicherheitsgeräte @de
label: Equipagg sicurezza auto @it
label: Equipamento de segurança automotiva @pt
label: Equipements de sécurité pour automobiles @fr
label: Equipo de seguridad automotriz @es
label: Оборудование автомобильной безопасности @ru
label: 汽車安全設備 @zh-hant
label: 汽车安全设备 @zh
label: 汽车��全设备 @zh
label: 自動車用安全機器 @ja
label: 자동차 안전 장비 @ko
definition: This segment includes companies that manufacture automotive safety equipment. Includes airbags and seatbelts.
notation: 1110111115
valid from: 2024-06-07

Automotive Engineering & Tech
type: BicsLevel5Segment
type: Classifier
type: NamedIndividual
is level5 segment of: Auto Parts
is contemporary version of: http://data.ga-group.nl/ics/bics/1110111116
is version of: http://data.ga-group.nl/ics/bics/1110111116
replaces: http://data.ga-group.nl/ics/bics/2020/1110111116
imported on: 2026-06-08T13:40:52.236Z
last refreshed on: 2026-06-08T13:41:38.450Z
source accessed on: 2024-06-05T14:42:36Z
source last accessed on: 2024-06-05T14:42:36Z
label: Automobiltechnologie @de
label: Engenharia automotiva e tecn @pt
label: Ingegneria e tec automobilistica @it
label: Ingeniería y tec automotriz @es
label: Tech et ingénierie automobile @fr
label: Автомобильное машиностр. и технологии @ru
label: 汽車工程及技術 @zh-hant
label: 汽车工程与技术 @zh
label: 自動車ｴﾝｼﾞﾆｱﾘﾝｸﾞ･ﾃｸﾉﾛｼﾞｰ @ja
label: 자동차공학 & 기술 @ko
definition: This segment includes companies that develop, license, or sell technology applied in the automobile industry but are not involved in the manufacturing process.
notation: 1110111116
valid from: 2024-06-07

Body & Chassis
type: BicsLevel5Segment
type: Classifier
type: NamedIndividual
is level5 segment of: Auto Parts
is contemporary version of: http://data.ga-group.nl/ics/bics/1110111117
is version of: http://data.ga-group.nl/ics/bics/1110111117
replaces: http://data.ga-group.nl/ics/bics/2020/1110111117
imported on: 2026-06-08T13:40:52.236Z
last refreshed on: 2026-06-08T13:41:38.450Z
source accessed on: 2024-06-05T14:42:36Z
source last accessed on: 2024-06-05T14:42:36Z
label: Carrocerías @es
label: Carroceria e chassi @pt
label: Carrosseries et châssis @fr
label: Karosserie & Fahrgestell @de
label: Telaio e carrozzeria @it
label: Шасси и кузова автомобилей @ru
label: 車体･ｼｬｰｼ @ja
label: 車體及底盤 @zh-hant
label: 车身与底盘 @zh
label: 본체 & 섀시 @ko
definition: This segment includes companies that manufacture body and chassis structures, such as frames, roll cages, and joints.
notation: 1110111117
valid from: 2024-06-07

Brake Systems
type: BicsLevel5Segment
type: Classifier
type: NamedIndividual
is level5 segment of: Auto Parts
is contemporary version of: http://data.ga-group.nl/ics/bics/1110111118
is version of: http://data.ga-group.nl/ics/bics/1110111118
replaces: http://data.ga-group.nl/ics/bics/2020/1110111118
imported on: 2026-06-08T13:40:52.236Z
last refreshed on: 2026-06-08T13:41:38.450Z
source accessed on: 2024-06-05T14:42:36Z
source last accessed on: 2024-06-05T14:42:36Z
label: Bremssysteme @de
label: Sistema de freios @pt
label: Sistemas de frenos @es
label: Sistemi frenanti @it
label: Systèmes de freinage @fr
label: Тормозные системы @ru
label: 制动系统 @zh
label: 煞車系統 @zh-hant
label: 브레이크 시스템 @ko
label: ﾌﾞﾚｰｷｼｽﾃﾑ @ja
definition: This segment includes companies that manufacture automobile braking systems and related components.
notation: 1110111118
valid from: 2024-06-07

Drivetrain Components
type: BicsLevel5Segment
type: Classifier
type: NamedIndividual
is level5 segment of: Auto Parts
is contemporary version of: http://data.ga-group.nl/ics/bics/1110111119
is version of: http://data.ga-group.nl/ics/bics/1110111119
replaces: http://data.ga-group.nl/ics/bics/2020/1110111119
imported on: 2026-06-08T13:40:52.236Z
last refreshed on: 2026-06-08T13:41:38.450Z
source accessed on: 2024-06-05T14:42:36Z
source last accessed on: 2024-06-05T14:42:36Z
label: Antriebskomponenten @de
label: Componentes de transmisión @es
label: Componentes de transmissão @pt
label: Componenti trasmissione @it
label: Composants de transmission @fr
label: Компоненты привода @ru
label: 傳動組件 @zh-hant
label: 动力传动元件 @zh
label: 駆動系部品 @ja
label: 구동계 부품 @ko
definition: This segment includes companies that manufacture automobile transmission and powertrain parts.
notation: 1110111119
valid from: 2024-06-07

Diesel Engines & Engine Parts
type: BicsLevel6Segment
type: Classifier
type: NamedIndividual
is level6 segment of: Engines & Parts
is contemporary version of: http://data.ga-group.nl/ics/bics/111011112010
is version of: http://data.ga-group.nl/ics/bics/111011112010
replaces: http://data.ga-group.nl/ics/bics/2020/111011112010
imported on: 2026-06-08T13:40:52.236Z
last refreshed on: 2026-06-08T13:41:38.450Z
source accessed on: 2024-06-05T14:42:36Z
source last accessed on: 2024-06-05T14:42:36Z
label: Dieselmotoren & Motorteile @de
label: Moteurs diesel et pièces de moteurs @fr
label: Motor a diesel e peças do motor @pt
label: Motores de diésel y partes @es
label: Motori diesel e parti motore @it
label: Дизельные двигатели и з/части @ru
label: 柴油发动机与发动机零部件 @zh
label: 柴油引擎及引擎零件 @zh-hant
label: 디젤 엔진 & 엔진 부품 @ko
label: ﾃﾞｨｰｾﾞﾙｴﾝｼﾞﾝ･ｴﾝｼﾞﾝ部品 @ja
definition: This segment includes companies that manufacture diesel engines and engine parts for automobiles.
notation: 111011112010
valid from: 2024-06-07

Gasoline Engines & Eng Parts
type: BicsLevel6Segment
type: Classifier
type: NamedIndividual
is level6 segment of: Engines & Parts
is contemporary version of: http://data.ga-group.nl/ics/bics/111011112011
is version of: http://data.ga-group.nl/ics/bics/111011112011
replaces: http://data.ga-group.nl/ics/bics/2020/111011112011
imported on: 2026-06-08T13:40:52.236Z
last refreshed on: 2026-06-08T13:41:38.450Z
source accessed on: 2024-06-05T14:42:36Z
source last accessed on: 2024-06-05T14:42:36Z
label: Benzinmotoren & Motorteile @de
label: Moteurs à essence et leurs pièces @fr
label: Motor de gasolina e peças do motor @pt
label: Motores de gasolina y partes @es
label: Motori benzina e parti motore @it
label: Бензиновые двигатели и з/части @ru
label: 汽油发动机与发动机零部件 @zh
label: 汽油引擎及引擎零件 @zh-hant
label: 휘발유 엔진 & 엔진부품 @ko
label: ｶﾞｿﾘﾝｴﾝｼﾞﾝ･ｴﾝｼﾞﾝ部品 @ja
label: ｶﾞｿﾘﾝｴﾝｼﾞ��･ｴﾝｼﾞﾝ部品 @ja
definition: This segment includes companies that manufacture gasoline engines and engine parts for automobiles.
notation: 111011112011
valid from: 2024-06-07

Engines & Parts
type: BicsLevel5Segment
type: Classifier
type: NamedIndividual
is level5 segment of: Auto Parts
is contemporary version of: http://data.ga-group.nl/ics/bics/1110111120
is version of: http://data.ga-group.nl/ics/bics/1110111120
replaces: http://data.ga-group.nl/ics/bics/2020/1110111120
imported on: 2026-06-08T13:40:52.236Z
last refreshed on: 2026-06-08T13:41:38.450Z
source accessed on: 2024-06-05T14:42:36Z
source last accessed on: 2024-06-05T14:42:36Z
label: Moteur et pièces @fr
label: Motor e peças @pt
label: Motoren & Teile @de
label: Motores y partes @es
label: Motori e parti @it
label: Двигатели и з/части @ru
label: 发动机与零部件 @zh
label: 引擎及零件 @zh-hant
label: 엔진 & 부품 @ko
label: ｴﾝｼﾞﾝ･部品 @ja
definition: This segment includes companies that manufacture automobile engines and engine parts. Includes gasoline and diesel engines and engine parts.
notation: 1110111120
valid from: 2024-06-07

Exhausts & Emissions
type: BicsLevel5Segment
type: Classifier
type: NamedIndividual
is level5 segment of: Auto Parts
is contemporary version of: http://data.ga-group.nl/ics/bics/1110111121
is version of: http://data.ga-group.nl/ics/bics/1110111121
replaces: http://data.ga-group.nl/ics/bics/2020/1110111121
imported on: 2026-06-08T13:40:52.236Z
last refreshed on: 2026-06-08T13:41:38.450Z
source accessed on: 2024-06-05T14:42:36Z
source last accessed on: 2024-06-05T14:42:36Z
label: Auspuffe @de
label: Escapes y emisiones @es
label: Exaustor e emissões @pt
label: Scarichi ed emissioni @it
label: Systèmes d'échappement et émissions @fr
label: Выхлопы и выбросы @ru
label: 尾气排放装置 @zh
label: 排気装置 @ja
label: 排氣及排放 @zh-hant
label: 배기가스 @ko
definition: This segment includes companies that manufacture exhaust and emissions systems. Includes exhaust manifolds, exhaust pipes, and catalytic converters.
notation: 1110111121
valid from: 2024-06-07

Seating & Trim
type: BicsLevel5Segment
type: Classifier
type: NamedIndividual
is level5 segment of: Auto Parts
is contemporary version of: http://data.ga-group.nl/ics/bics/1110111122
is version of: http://data.ga-group.nl/ics/bics/1110111122
replaces: http://data.ga-group.nl/ics/bics/2020/1110111122
imported on: 2026-06-08T13:40:52.236Z
last refreshed on: 2026-06-08T13:41:38.450Z
source accessed on: 2024-06-05T14:42:36Z
source last accessed on: 2024-06-05T14:42:36Z
label: Asientos y bordes @es
label: Assentos e acabamentos @pt
label: Sedili e rifinitura @it
label: Sièges et garnitures @fr
label: Sitze & Innenausstattung @de
label: Сидения и отделка салона @ru
label: 座椅与内饰 @zh
label: 座椅及內裝 @zh-hant
label: 自動車用座席･調度品 @ja
label: 자동차 의자 & 내장 @ko
definition: This segment includes companies that manufacture automobile seating equipment and interiors trims. Includes seats, panels, headliners, and textiles.
notation: 1110111122
valid from: 2024-06-07

Steering & Suspension
type: BicsLevel5Segment
type: Classifier
type: NamedIndividual
is level5 segment of: Auto Parts
is contemporary version of: http://data.ga-group.nl/ics/bics/1110111123
is version of: http://data.ga-group.nl/ics/bics/1110111123
replaces: http://data.ga-group.nl/ics/bics/2020/1110111123
imported on: 2026-06-08T13:40:52.236Z
last refreshed on: 2026-06-08T13:41:38.450Z
source accessed on: 2024-06-05T14:42:36Z
source last accessed on: 2024-06-05T14:42:36Z
label: Direção e suspensão @pt
label: Direcciones y suspensiones @es
label: Directions/suspensions @fr
label: Lenkung & Aufhängung @de
label: Sterzo e sospensione @it
label: Рулевые устройства и деталей подвески @ru
label: 車輛轉向及懸承元件 @zh-hant
label: 转向与悬挂 @zh
label: 스티어링 & 서스펜션 @ko
label: ｽﾃｱﾘﾝｸﾞ･ｻｽﾍﾟﾝｼｮﾝ部品 @ja
definition: This segment includes companies that manufacture steering, suspension parts, and shock absorbers. Excludes springs.
notation: 1110111123
valid from: 2024-06-07

Tire
type: BicsLevel5Segment
type: Classifier
type: NamedIndividual
is level5 segment of: Auto Parts
is contemporary version of: http://data.ga-group.nl/ics/bics/1110111124
is version of: http://data.ga-group.nl/ics/bics/1110111124
replaces: http://data.ga-group.nl/ics/bics/2020/1110111124
imported on: 2026-06-08T13:40:52.236Z
last refreshed on: 2026-06-08T13:41:38.450Z
source accessed on: 2024-06-05T14:42:36Z
source last accessed on: 2024-06-05T14:42:36Z
label: Llantas @es
label: Pneumatici @it
label: Pneus @fr
label: Reifen @de
label: Шины @ru
label: 輪胎 @zh-hant
label: 轮胎 @zh
label: 타이어 @ko
label: ﾀｲﾔ @ja
definition: This segment includes companies that manufacture tires and inner tubes from natural and synthetic rubber.
notation: 1110111124
valid from: 2024-06-07

Electric Vehicle Batteries
type: BicsLevel6Segment
type: Classifier
type: NamedIndividual
is level6 segment of: Vehicle Batteries
is contemporary version of: http://data.ga-group.nl/ics/bics/111011112510
is version of: http://data.ga-group.nl/ics/bics/111011112510
imported on: 2026-06-08T13:40:52.236Z
last refreshed on: 2026-06-08T13:41:38.450Z
source accessed on: 2024-06-05T14:42:36Z
source last accessed on: 2024-06-05T14:42:36Z
label: Baterías de vehículos eléctricos @es
label: Baterias para veículos elétricos @pt
label: Batterie per veicoli elettrici @it
label: Batterien für Elektrofahrzeuge @de
label: Batteries pr véhicules électriques @fr
label: Аккумуляторные батареи для электромобиля @ru
label: Аккумулятор��ые батареи для электромобиля @ru
label: 电动汽车电池 @zh
label: 電機車電池 @zh-hant
label: 電気自動車用電池 @ja
label: 전기차 배터리 @ko
definition: This segment includes companies that manufacture batteries which power the motors of electric vehicles. Excludes batteries for hybrid electric vehicles (HEV).
notation: 111011112510
valid from: 2024-06-07

Starter Batteries
type: BicsLevel6Segment
type: Classifier
type: NamedIndividual
is level6 segment of: Vehicle Batteries
is contemporary version of: http://data.ga-group.nl/ics/bics/111011112511
is version of: http://data.ga-group.nl/ics/bics/111011112511
imported on: 2026-06-08T13:40:52.236Z
last refreshed on: 2026-06-08T13:41:38.450Z
source accessed on: 2024-06-05T14:42:36Z
source last accessed on: 2024-06-05T14:42:36Z
label: Baterías de arranque @es
label: Baterias de arranque @pt
label: Batterie di avviamento @it
label: Batteries de démarrage @fr
label: Starterbatterien @de
label: Стартерные аккумуляторные батареи @ru
label: 启动用蓄电池 @zh
label: 始動用蓄電池 @ja
label: 起動式電池 @zh-hant
label: 시동용 배터리 @ko
definition: This segment includes companies that manufacture batteries which are used to start the motors of internal combustion engine vehicles (ICEV).
notation: 111011112511
valid from: 2024-06-07

Vehicle Batteries
type: BicsLevel5Segment
type: Classifier
type: NamedIndividual
is level5 segment of: Auto Parts
is contemporary version of: http://data.ga-group.nl/ics/bics/1110111125
is version of: http://data.ga-group.nl/ics/bics/1110111125
replaces: http://data.ga-group.nl/ics/bics/2020/1110111125
imported on: 2026-06-08T13:40:52.236Z
last refreshed on: 2026-06-08T13:41:38.450Z
source accessed on: 2024-06-05T14:42:36Z
source last accessed on: 2024-06-05T14:42:36Z
label: Baterías de vehículos @es
label: Batterie veicoli @it
label: Batteries de véhicules @fr
label: Fahrzeugbatterien @de
label: Veículos a bateria @pt
label: Аккумулят. батари д/автомобилей @ru
label: 汽车电池 @zh
label: 車両ﾊﾞｯﾃﾘｰ @ja
label: 車用電池 @zh-hant
label: 자동차 배터리 @ko
definition: This segment includes companies that manufacture batteries for automobiles.
notation: 1110111125
valid from: 2024-06-07

Vehicle Wheels
type: BicsLevel5Segment
type: Classifier
type: NamedIndividual
is level5 segment of: Auto Parts
is contemporary version of: http://data.ga-group.nl/ics/bics/1110111126
is version of: http://data.ga-group.nl/ics/bics/1110111126
replaces: http://data.ga-group.nl/ics/bics/2020/1110111126
imported on: 2026-06-08T13:40:52.236Z
last refreshed on: 2026-06-08T13:41:38.450Z
source accessed on: 2024-06-05T14:42:36Z
source last accessed on: 2024-06-05T14:42:36Z
label: Fahrzeugräder @de
label: Roda de veículo @pt
label: Roues de véhicules @fr
label: Ruedas de vehículos @es
label: Ruote veicoli @it
label: Колеса автомобиля @ru
label: 自動車用車輪 @ja
label: 車輪 @zh-hant
label: 车辆轮圈 @zh
label: 자동차 휠 @ko
definition: This segment includes companies that manufacture automobile wheels and rims. Products include steel, aluminum, and alloy wheels.
notation: 1110111126
valid from: 2024-06-07

Auto Parts
type: BicsLevel4SubIndustry
type: Classifier
type: NamedIndividual
is sub industry of: Automotive
is contemporary version of: http://data.ga-group.nl/ics/bics/11101111
is version of: http://data.ga-group.nl/ics/bics/11101111
replaces: http://data.ga-group.nl/ics/bics/2020/11101111
imported on: 2026-06-08T13:40:52.236Z
last refreshed on: 2026-06-08T13:41:38.450Z
source accessed on: 2024-06-05T14:42:36Z
source last accessed on: 2024-06-05T14:42:36Z
label: Auto-peças @pt
label: Autopartes @es
label: Autoteile @de
label: Parti automobilistiche @it
label: Pièces automobiles @fr
label: Автозапчасти @ru
label: 汽車零件 @zh-hant
label: 汽车配件 @zh
label: 自動車部品 @ja
label: 자동차 부품 @ko
definition: This industry subgroup includes companies that manufacture various types of automotive parts. Excludes companies that manufacture parts for commercial vehicles (see Commercial Vehicles) and motorcycles (see Motorcycles).
notation: 11101111
valid from: 2024-06-07

Automotive
type: BicsLevel3Industry
type: Classifier
type: NamedIndividual
is industry of: Consumer Discretionary Products
is contemporary version of: http://data.ga-group.nl/ics/bics/111011
is version of: http://data.ga-group.nl/ics/bics/111011
replaces: http://data.ga-group.nl/ics/bics/2020/111011
imported on: 2026-06-08T13:40:52.236Z
last refreshed on: 2026-06-08T13:41:38.450Z
source accessed on: 2024-06-05T14:42:36Z
source last accessed on: 2024-06-05T14:42:36Z
label: Auto @de
label: Automobile @it
label: Automotivo @pt
label: Automotriz @es
label: Industrie automobile @fr
label: Автомобили @ru
label: 汽車業 @zh-hant
label: 汽车 @zh
label: 自動車 @ja
label: 자동차 @ko
definition: This industry includes companies that manufacture automobiles or automobile parts.
notation: 111011
valid from: 2024-06-07

Single Family Homebuilding
type: BicsLevel5Segment
type: Classifier
type: NamedIndividual
is level5 segment of: Homebuilding
is contemporary version of: http://data.ga-group.nl/ics/bics/1110121010
is version of: http://data.ga-group.nl/ics/bics/1110121010
replaces: http://data.ga-group.nl/ics/bics/2020/1110121010
imported on: 2026-06-08T13:40:52.236Z
last refreshed on: 2026-06-08T13:41:38.450Z
source accessed on: 2024-06-05T14:42:36Z
source last accessed on: 2024-06-05T14:42:36Z
label: Bau von Einfamilienhäusern @de
label: Construção de casas unifamiliares @pt
label: Construc maisons individuelles @fr
label: Construcción de viv unifamiliares @es
label: Edilizia case monofamiliari @it
label: Стр-во жилья на одну семью @ru
label: 一戸建住宅建設 @ja
label: 單戶住宅建築 @zh-hant
label: 独栋住宅建造 @zh
label: 단일가구 주택건설 @ko
definition: This segment includes companies that build and sell single family homes.
notation: 1110121010
valid from: 2024-06-07

Multifamily Homebuilding
type: BicsLevel5Segment
type: Classifier
type: NamedIndividual
is level5 segment of: Homebuilding
is contemporary version of: http://data.ga-group.nl/ics/bics/1110121011
is version of: http://data.ga-group.nl/ics/bics/1110121011
replaces: http://data.ga-group.nl/ics/bics/2020/1110121011
imported on: 2026-06-08T13:40:52.236Z
last refreshed on: 2026-06-08T13:41:38.450Z
source accessed on: 2024-06-05T14:42:36Z
source last accessed on: 2024-06-05T14:42:36Z
label: Bau von Mehrfamilienhäusern @de
label: Construção de casas multifamiliares @pt
label: Construc résid multi-famille @fr
label: Construcción de viv multifamiliares @es
label: Edilizia case multifamiliari @it
label: Многокв. жилищное строит-во @ru
label: 多世帯住宅建設 @ja
label: 多戶住宅建築 @zh-hant
label: 多户房屋建筑 @zh
label: 다가구 주택건설 @ko
definition: This segment includes companies that build and sell multifamily homes. Includes townhouses, condominiums, and duplexes.
notation: 1110121011
valid from: 2024-06-07

Manufactured Home (Mobile)
type: BicsLevel5Segment
type: Classifier
type: NamedIndividual
is level5 segment of: Homebuilding
is contemporary version of: http://data.ga-group.nl/ics/bics/1110121012
is version of: http://data.ga-group.nl/ics/bics/1110121012
replaces: http://data.ga-group.nl/ics/bics/2020/1110121012
imported on: 2026-06-08T13:40:52.236Z
last refreshed on: 2026-06-08T13:41:38.450Z
source accessed on: 2024-06-05T14:42:36Z
source last accessed on: 2024-06-05T14:42:36Z
label: Casas fabricadas (móveis) @pt
label: Case prefabbricate (mobili) @it
label: Fertighäuser (Mobil) @de
label: Maisons préfab. (mobiles) @fr
label: Viviendas fabricadas (móviles) @es
label: Viviendas fabricadas (m��viles) @es
label: Готовые (передвижные) дома @ru
label: 移動住宅(ﾄﾚｰﾗｰ) @ja
label: 組合房屋(移動式) @zh-hant
label: 预制房屋(移动) @zh
label: 조립식 주택 (이동식) @ko
definition: This segment includes companies that build and sell manufactured or mobile homes and other buildings.
notation: 1110121012
valid from: 2024-06-07

Land Sales
type: BicsLevel5Segment
type: Classifier
type: NamedIndividual
is level5 segment of: Homebuilding
is contemporary version of: http://data.ga-group.nl/ics/bics/1110121013
is version of: http://data.ga-group.nl/ics/bics/1110121013
replaces: http://data.ga-group.nl/ics/bics/2020/1110121013
imported on: 2026-06-08T13:40:52.236Z
last refreshed on: 2026-06-08T13:41:38.450Z
source accessed on: 2024-06-05T14:42:36Z
source last accessed on: 2024-06-05T14:42:36Z
label: Grundstücksverkäufe @de
label: Vendas de terras @pt
label: Vendite di terreno @it
label: Ventas de tierra @es
label: Ventes de terrains @fr
label: Продажа земли @ru
label: 土地出售 @zh
label: 土地売却 @ja
label: 土地銷售 @zh-hant
label: 토지 매매 @ko
definition: This segment includes revenue derived from land sales by homebuilders.
notation: 1110121013
valid from: 2024-06-07

Homebuilding
type: BicsLevel4SubIndustry
type: Classifier
type: NamedIndividual
is sub industry of: Home Construction
is contemporary version of: http://data.ga-group.nl/ics/bics/11101210
is version of: http://data.ga-group.nl/ics/bics/11101210
replaces: http://data.ga-group.nl/ics/bics/2020/11101210
imported on: 2026-06-08T13:40:52.236Z
last refreshed on: 2026-06-08T13:41:38.450Z
source accessed on: 2024-06-05T14:42:36Z
source last accessed on: 2024-06-05T14:42:36Z
label: Construção de casa @pt
label: Construcción de viviendas @es
label: Construction de maisons @fr
label: Edilizia residenziale @it
label: Wohnungsbau @de
label: Жилищное строит-во @ru
label: 住宅建筑 @zh
label: 住宅營建 @zh-hant
label: 戸建住宅建設 @ja
label: 주택건설 @ko
definition: This industry subgroup includes companies that build and sell single family homes, townhouses, and other similar residential homes. Excludes companies that rent properties.
notation: 11101210
valid from: 2024-06-07

Carpet Flooring
type: BicsLevel6Segment
type: Classifier
type: NamedIndividual
is level6 segment of: Flooring
is contemporary version of: http://data.ga-group.nl/ics/bics/111012111010
is version of: http://data.ga-group.nl/ics/bics/111012111010
replaces: http://data.ga-group.nl/ics/bics/2020/111012111010
imported on: 2026-06-08T13:40:52.236Z
last refreshed on: 2026-06-08T13:41:38.450Z
source accessed on: 2024-06-05T14:42:36Z
source last accessed on: 2024-06-05T14:42:36Z
label: Moquette @it
label: Moquettes @fr
label: Piso de carpete @pt
label: Pisos de alfombras @es
label: Teppichbodenbelag @de
label: Ковровое покрытие @ru
label: 地毯及踏墊 @zh-hant
label: 地毯地面材料 @zh
label: 床用絨毯 @ja
label: 카펫 바닥재 @ko
definition: This segment includes companies that mill carpets and rugs.
notation: 111012111010
valid from: 2024-06-07

Tile Flooring
type: BicsLevel6Segment
type: Classifier
type: NamedIndividual
is level6 segment of: Flooring
is contemporary version of: http://data.ga-group.nl/ics/bics/111012111011
is version of: http://data.ga-group.nl/ics/bics/111012111011
replaces: http://data.ga-group.nl/ics/bics/2020/111012111011
imported on: 2026-06-08T13:40:52.236Z
last refreshed on: 2026-06-08T13:41:38.450Z
source accessed on: 2024-06-05T14:42:36Z
source last accessed on: 2024-06-05T14:42:36Z
label: Carrelage @fr
label: Fliesenbodenbelag @de
label: Piastrelle per pavimenti @it
label: Piso de azulejo @pt
label: Pisos de baldosa @es
label: Плитка для пола @ru
label: 地砖地面材料 @zh
label: 床ﾀｲﾙ @ja
label: 陶瓷牆及地板磁磚 @zh-hant
label: 타일 바닥재 @ko
definition: This segment includes companies that manufacture wall and floor tiles.
notation: 111012111011
valid from: 2024-06-07

Laminate & Wood Flooring
type: BicsLevel6Segment
type: Classifier
type: NamedIndividual
is level6 segment of: Flooring
is contemporary version of: http://data.ga-group.nl/ics/bics/111012111012
is version of: http://data.ga-group.nl/ics/bics/111012111012
replaces: http://data.ga-group.nl/ics/bics/2020/111012111012
imported on: 2026-06-08T13:40:52.236Z
last refreshed on: 2026-06-08T13:41:38.450Z
source accessed on: 2024-06-05T14:42:36Z
source last accessed on: 2024-06-05T14:42:36Z
label: Laminat & Holzfußboden @de
label: Parquets et laminés @fr
label: Pavimenti in legno e laminato @it
label: Piso de madeira sólida e laminados @pt
label: Pisos de laminado y madera @es
label: Ламинат и древесное покр. @ru
label: 层压板和木地板 @zh
label: 層板及木質地板 @zh-hant
label: 라미네이트 & 원목 바닥재 @ko
label: ﾗﾐﾈｰﾄﾌﾛｱ･木床 @ja
definition: This segment includes companies that plane and finish wood strips for unassembled wood flooring.
notation: 111012111012
valid from: 2024-06-07

Vinyl Flooring
type: BicsLevel6Segment
type: Classifier
type: NamedIndividual
is level6 segment of: Flooring
is contemporary version of: http://data.ga-group.nl/ics/bics/111012111013
is version of: http://data.ga-group.nl/ics/bics/111012111013
replaces: http://data.ga-group.nl/ics/bics/2020/111012111013
imported on: 2026-06-08T13:40:52.236Z
last refreshed on: 2026-06-08T13:41:38.450Z
source accessed on: 2024-06-05T14:42:36Z
source last accessed on: 2024-06-05T14:42:36Z
label: Pavimenti in vinile @it
label: Pisos de vinil @pt
label: Pisos de vinilo @es
label: Revêtements en vinyle @fr
label: Vinyl-Bodenbelag @de
label: Виниловые полы @ru
label: 塑胶地板 @zh
label: 塑膠彈性地板覆蓋物 @zh-hant
label: 비닐 바닥재 @ko
label: ﾋﾞﾆﾙ床 @ja
definition: This segment includes companies that manufacture vinyl and linoleum floor covering.
notation: 111012111013
valid from: 2024-06-07

Flooring
type: BicsLevel5Segment
type: Classifier
type: NamedIndividual
is level5 segment of: Building Products
is contemporary version of: http://data.ga-group.nl/ics/bics/1110121110
is version of: http://data.ga-group.nl/ics/bics/1110121110
replaces: http://data.ga-group.nl/ics/bics/2020/1110121110
imported on: 2026-06-08T13:40:52.236Z
last refreshed on: 2026-06-08T13:41:38.450Z
source accessed on: 2024-06-05T14:42:36Z
source last accessed on: 2024-06-05T14:42:36Z
label: Bodenbeläge @de
label: Pavimentazione @it
label: Pisos @es
label: Revêtements @fr
label: Настил полов @ru
label: 地板 @zh
label: 地板鋪設 @zh-hant
label: 床材 @ja
label: 바닥재 @ko
definition: This segment includes companies that manufacture flooring products. Includes carpet, hardwood, tile, vinyl, and laminate flooring.
notation: 1110121110
valid from: 2024-06-07

Cabinets & Countertops
type: BicsLevel5Segment
type: Classifier
type: NamedIndividual
is level5 segment of: Building Products
is contemporary version of: http://data.ga-group.nl/ics/bics/1110121111
is version of: http://data.ga-group.nl/ics/bics/1110121111
replaces: http://data.ga-group.nl/ics/bics/2020/1110121111
imported on: 2026-06-08T13:40:52.236Z
last refreshed on: 2026-06-08T13:41:38.450Z
source accessed on: 2024-06-05T14:42:36Z
source last accessed on: 2024-06-05T14:42:36Z
label: Armários e balcões @pt
label: Armadi e mensole @it
label: Armoires/comptoirs de cuisine @fr
label: Gabinetes y encimeras @es
label: Schränke & Arbeitsplatten @de
label: Кухонные шкафы и столешн. @ru
label: 厨柜与台面 @zh
label: 櫥櫃及檯面 @zh-hant
label: 수납장 및 조리대 @ko
label: ｷｬﾋﾞﾈｯﾄ･ｶｳﾝﾀｰﾄｯﾌﾟ @ja
definition: This segment includes companies that manufacture cabinets and countertops for kitchens and bathrooms.
notation: 1110121111
valid from: 2024-06-07

Plumbing Fixtures
type: BicsLevel5Segment
type: Classifier
type: NamedIndividual
is level5 segment of: Building Products
is contemporary version of: http://data.ga-group.nl/ics/bics/1110121112
is version of: http://data.ga-group.nl/ics/bics/1110121112
replaces: http://data.ga-group.nl/ics/bics/2020/1110121112
imported on: 2026-06-08T13:40:52.236Z
last refreshed on: 2026-06-08T13:41:38.450Z
source accessed on: 2024-06-05T14:42:36Z
source last accessed on: 2024-06-05T14:42:36Z
label: Impianti idraulici @it
label: Instalações hidráulicas @pt
label: Instalaciones de tuberías @es
label: Installationszubehör @de
label: Robinetterie sanitaire @fr
label: Сантехника @ru
label: 水暖设备 @zh
label: 配管產品 @zh-hant
label: 配管設備 @ja
label: 배관설비 @ko
definition: This segment includes companies that manufacture plumbing fixtures and bathroom accessories, such as sinks, bathtubs, faucets and hot tubs.
notation: 1110121112
valid from: 2024-06-07

Windows
type: BicsLevel6Segment
type: Classifier
type: NamedIndividual
is level6 segment of: Windows & Doors
is contemporary version of: http://data.ga-group.nl/ics/bics/111012111310
is version of: http://data.ga-group.nl/ics/bics/111012111310
replaces: http://data.ga-group.nl/ics/bics/2020/111012111310
imported on: 2026-06-08T13:40:52.236Z
last refreshed on: 2026-06-08T13:41:38.450Z
source accessed on: 2024-06-05T14:42:36Z
source last accessed on: 2024-06-05T14:42:36Z
label: Fenêtres @fr
label: Fenster @de
label: Finestre @it
label: Ventanas @es
label: Окна @ru
label: 窓 @ja
label: 窗 @zh
label: 金屬門窗 @zh-hant
label: 창 @ko
definition: This segment includes companies that manufacture windows.
notation: 111012111310
valid from: 2024-06-07

Doors
type: BicsLevel6Segment
type: Classifier
type: NamedIndividual
is level6 segment of: Windows & Doors
is contemporary version of: http://data.ga-group.nl/ics/bics/111012111311
is version of: http://data.ga-group.nl/ics/bics/111012111311
replaces: http://data.ga-group.nl/ics/bics/2020/111012111311
imported on: 2026-06-08T13:40:52.236Z
last refreshed on: 2026-06-08T13:41:38.450Z
source accessed on: 2024-06-05T14:42:36Z
source last accessed on: 2024-06-05T14:42:36Z
label: Portas @pt
label: Porte @it
label: Portes @fr
label: Puertas @es
label: Türen @de
label: Двери @ru
label: 木製門窗 @zh-hant
label: 门 @zh
label: 문 @ko
label: ﾄﾞｱ @ja
definition: This segment includes companies that manufacture doors.
notation: 111012111311
valid from: 2024-06-07

Windows & Doors
type: BicsLevel5Segment
type: Classifier
type: NamedIndividual
is level5 segment of: Building Products
is contemporary version of: http://data.ga-group.nl/ics/bics/1110121113
is version of: http://data.ga-group.nl/ics/bics/1110121113
replaces: http://data.ga-group.nl/ics/bics/2020/1110121113
imported on: 2026-06-08T13:40:52.236Z
last refreshed on: 2026-06-08T13:41:38.450Z
source accessed on: 2024-06-05T14:42:36Z
source last accessed on: 2024-06-05T14:42:36Z
label: Fenster & Türen @de
label: Finestre e porte @it
label: Janelas e portas @pt
label: Portes et fenêtres @fr
label: Ventanas y puertas @es
label: Окна и двери @ru
label: 窓･ﾄﾞｱ @ja
label: 窗及門-建築製品 @zh-hant
label: 门窗 @zh
label: 창 & 문 @ko
definition: This segment includes companies that manufacture wood, metal and vinyl windows and doors, sashes, windows and door frames.
notation: 1110121113
valid from: 2024-06-07

Building Products
type: BicsLevel4SubIndustry
type: Classifier
type: NamedIndividual
is sub industry of: Home Construction
is contemporary version of: http://data.ga-group.nl/ics/bics/11101211
is version of: http://data.ga-group.nl/ics/bics/11101211
replaces: http://data.ga-group.nl/ics/bics/2020/11101211
imported on: 2026-06-08T13:40:52.236Z
last refreshed on: 2026-06-08T13:41:38.450Z
source accessed on: 2024-06-05T14:42:36Z
source last accessed on: 2024-06-05T14:42:36Z
label: Baumaterialien @de
label: Prodotti edili @it
label: Productos de construcción @es
label: Produits de construction @fr
label: Produtos para construção @pt
label: Строительные изделия @ru
label: 居家修繕 @zh-hant
label: 建筑产品 @zh
label: 建築用品 @ja
label: 建築��品 @ja
label: 건축 제품 @ko
definition: This industry subgroup includes companies that manufacture building products, appliances, tools, and lawn and garden supplies. Excludes all raw materials classified under Materials.
notation: 11101211
valid from: 2024-06-07

Home Construction
type: BicsLevel3Industry
type: Classifier
type: NamedIndividual
is industry of: Consumer Discretionary Products
is contemporary version of: http://data.ga-group.nl/ics/bics/111012
is version of: http://data.ga-group.nl/ics/bics/111012
replaces: http://data.ga-group.nl/ics/bics/2020/111012
imported on: 2026-06-08T13:40:52.236Z
last refreshed on: 2026-06-08T13:41:38.450Z
source accessed on: 2024-06-05T14:42:36Z
source last accessed on: 2024-06-05T14:42:36Z
label: Construção de casas @pt
label: Construcción de viviendas @es
label: Construction résid @fr
label: Costruzione residenziale @it
label: Hausbau @de
label: Строительство домов @ru
label: 住宅建設 @ja
label: 住宅營建 @zh-hant
label: 房屋建设 @zh
label: 주택건설 @ko
definition: This industry includes companies involved in the construction and building of homes.
notation: 111012
valid from: 2024-06-07

Heating & Cooling Appliances
type: BicsLevel5Segment
type: Classifier
type: NamedIndividual
is level5 segment of: Household Appliances
is contemporary version of: http://data.ga-group.nl/ics/bics/1110131010
is version of: http://data.ga-group.nl/ics/bics/1110131010
replaces: http://data.ga-group.nl/ics/bics/2020/1110131010
imported on: 2026-06-08T13:40:52.236Z
last refreshed on: 2026-06-08T13:41:38.450Z
source accessed on: 2024-06-05T14:42:36Z
source last accessed on: 2024-06-05T14:42:36Z
label: App. chauffage/climatisation @fr
label: Eletrodomésticos de aquecimento e refrigeração @pt
label: Elettrodom riscald e raffredd @it
label: Enseres de calefacción y aire ac @es
label: Heiz- & Kühlgeräte @de
label: Отопление и кондицион. @ru
label: 供热和制冷设备 @zh
label: 冷暖房器具 @ja
label: 家用電動器具及電扇 @zh-hant
label: 난방 & 냉방기기 @ko
definition: This segment includes companies that manufacture portable appliances used for heating or cooling. Includes desk fans, window air conditioners, and space heaters.
notation: 1110131010
valid from: 2024-06-07

Cooking Appliances
type: BicsLevel5Segment
type: Classifier
type: NamedIndividual
is level5 segment of: Household Appliances
is contemporary version of: http://data.ga-group.nl/ics/bics/1110131011
is version of: http://data.ga-group.nl/ics/bics/1110131011
replaces: http://data.ga-group.nl/ics/bics/2020/1110131011
imported on: 2026-06-08T13:40:52.236Z
last refreshed on: 2026-06-08T13:41:38.450Z
source accessed on: 2024-06-05T14:42:36Z
source last accessed on: 2024-06-05T14:42:36Z
label: Apparecchi di cottura @it
label: Appareils de cuisine @fr
label: Enseres de cocina @es
label: Kochgeräte @de
label: Utensílios de cozinha @pt
label: Кухонная техника @ru
label: 家用烹飪電器 @zh-hant
label: 烹饪电器 @zh
label: 調理器具 @ja
label: 조리기구 @ko
definition: This segment includes companies that manufacture household cooking equipment.
notation: 1110131011
valid from: 2024-06-07

Washers & Dryers
type: BicsLevel5Segment
type: Classifier
type: NamedIndividual
is level5 segment of: Household Appliances
is contemporary version of: http://data.ga-group.nl/ics/bics/1110131012
is version of: http://data.ga-group.nl/ics/bics/1110131012
replaces: http://data.ga-group.nl/ics/bics/2020/1110131012
imported on: 2026-06-08T13:40:52.236Z
last refreshed on: 2026-06-08T13:41:38.450Z
source accessed on: 2024-06-05T14:42:36Z
source last accessed on: 2024-06-05T14:42:36Z
label: Lavadoras e secadoras @pt
label: Lavadoras y secadoras @es
label: Lavatrici e asciugatrici @it
label: Machines à laver et séchoirs @fr
label: Waschmaschinen & Trockner @de
label: Стиральные/сушильные машины @ru
label: 家用洗衣設備製造 @zh-hant
label: 洗濯機･乾燥機 @ja
label: 洗衣机与干衣机 @zh
label: 세탁기 & 건조기 @ko
definition: This segment includes companies that manufacture household laundry equipment.
notation: 1110131012
valid from: 2024-06-07

Refrigerators & Freezers
type: BicsLevel5Segment
type: Classifier
type: NamedIndividual
is level5 segment of: Household Appliances
is contemporary version of: http://data.ga-group.nl/ics/bics/1110131013
is version of: http://data.ga-group.nl/ics/bics/1110131013
replaces: http://data.ga-group.nl/ics/bics/2020/1110131013
imported on: 2026-06-08T13:40:52.236Z
last refreshed on: 2026-06-08T13:41:38.450Z
source accessed on: 2024-06-05T14:42:36Z
source last accessed on: 2024-06-05T14:42:36Z
label: Frigoriferi e congelatori @it
label: Kühlschränke & Gefriertruhen @de
label: Réfrigérateurs et congélateurs @fr
label: Refrigeradores e congeladores @pt
label: Refrigeradores y congeladores @es
label: Холодильники и морозильники @ru
label: 冷蔵庫･冷凍庫 @ja
label: 家用電冰箱及冷凍櫃 @zh-hant
label: 电冰箱与冰柜 @zh
label: 냉장고 및 냉동고 @ko
definition: This segment includes companies that manufacture household refrigerators and freezers. Excludes industrial or walk-in freezers (see A/C Heating & Fridge Equip).
notation: 1110131013
valid from: 2024-06-07

Vacuum Cleaners
type: BicsLevel5Segment
type: Classifier
type: NamedIndividual
is level5 segment of: Household Appliances
is contemporary version of: http://data.ga-group.nl/ics/bics/1110131014
is version of: http://data.ga-group.nl/ics/bics/1110131014
replaces: http://data.ga-group.nl/ics/bics/2020/1110131014
imported on: 2026-06-08T13:40:52.236Z
last refreshed on: 2026-06-08T13:41:38.450Z
source accessed on: 2024-06-05T14:42:36Z
source last accessed on: 2024-06-05T14:42:36Z
label: Aspiradoras @es
label: Aspiradores de pó @pt
label: Aspirapolveri @it
label: Aspirateurs ménagers @fr
label: Staubsauger @de
label: Пылесосы @ru
label: 家用吸塵器 @zh-hant
label: 掃除機 @ja
label: 真空吸尘器 @zh
label: 진공 청소기 @ko
definition: This segment includes companies that manufacture household vacuum cleaners, floor waxing, and carpet cleaning machines.
notation: 1110131014
valid from: 2024-06-07

Household Appliances
type: BicsLevel4SubIndustry
type: Classifier
type: NamedIndividual
is sub industry of: Home & Office Products
is contemporary version of: http://data.ga-group.nl/ics/bics/11101310
is version of: http://data.ga-group.nl/ics/bics/11101310
replaces: http://data.ga-group.nl/ics/bics/2020/11101310
imported on: 2026-06-08T13:40:52.236Z
last refreshed on: 2026-06-08T13:41:38.450Z
source accessed on: 2024-06-05T14:42:36Z
source last accessed on: 2024-06-05T14:42:36Z
label: Aparelhos domésticos @pt
label: Appareils électroménagers @fr
label: Electrodomésticos @es
label: Elettrodomestici @it
label: Haushaltsgeräte @de
label: Бытовая техника @ru
label: 家用电器 @zh
label: 家用電器 @zh-hant
label: 家電製品 @ja
label: 가전제품 @ko
definition: This industry subgroup includes companies that manufacture electric housewares, fans, vacuum cleaners, cooking appliances, and major household appliances including refrigerators, freezers, and laundry equipment.
notation: 11101310
valid from: 2024-06-07

Metal Furniture
type: BicsLevel6Segment
type: Classifier
type: NamedIndividual
is level6 segment of: Home Furniture
is contemporary version of: http://data.ga-group.nl/ics/bics/111013111010
is version of: http://data.ga-group.nl/ics/bics/111013111010
replaces: http://data.ga-group.nl/ics/bics/2020/111013111010
imported on: 2026-06-08T13:40:52.236Z
last refreshed on: 2026-06-08T13:41:38.450Z
source accessed on: 2024-06-05T14:42:36Z
source last accessed on: 2024-06-05T14:42:36Z
label: Móveis de metal @pt
label: Metallmöbel @de
label: Mobili di metallo @it
label: Mobilier en métal @fr
label: Muebles de metal @es
label: Мебель из металла @ru
label: 金属家具 @zh
label: 金属製家具 @ja
label: 金屬家具 @zh-hant
label: 금속 가구 @ko
definition: This segment includes companies that manufacture metal household furniture.
notation: 111013111010
valid from: 2024-06-07

Upholstered Wood Furniture
type: BicsLevel7Segment
type: Classifier
type: NamedIndividual
is level7 segment of: Wood Furniture
is contemporary version of: http://data.ga-group.nl/ics/bics/11101311101110
is version of: http://data.ga-group.nl/ics/bics/11101311101110
replaces: http://data.ga-group.nl/ics/bics/2020/11101311101110
imported on: 2026-06-08T13:40:52.236Z
last refreshed on: 2026-06-08T13:41:38.450Z
source accessed on: 2024-06-05T14:42:36Z
source last accessed on: 2024-06-05T14:42:36Z
label: Gepolsterte Holzmöbel @de
label: Móveis domésticos estofados @pt
label: Mobili legno non rivestiti @it
label: Mobilier en bois rembourré @fr
label: Muebles de madera tapizados @es
label: Произв. дерев. мебели с обивкой @ru
label: 家庭用室内装飾家具 @ja
label: 布面木製家具 @zh-hant
label: 带软垫木制家具 @zh
label: 내장 목재 가구 @ko
definition: This segment includes companies that manufacture upholstered wood household furniture.
notation: 11101311101110
valid from: 2024-06-07

Nonupholstered Wood Furniture
type: BicsLevel7Segment
type: Classifier
type: NamedIndividual
is level7 segment of: Wood Furniture
is contemporary version of: http://data.ga-group.nl/ics/bics/11101311101111
is version of: http://data.ga-group.nl/ics/bics/11101311101111
replaces: http://data.ga-group.nl/ics/bics/2020/11101311101111
imported on: 2026-06-08T13:40:52.236Z
last refreshed on: 2026-06-08T13:41:38.450Z
source accessed on: 2024-06-05T14:42:36Z
source last accessed on: 2024-06-05T14:42:36Z
label: Móveis de madeira não estofados @pt
label: Mobilier en bois non rembourré @fr
label: Muebles de madera no tapizados @es
label: Nicht gepolsterte Holzmöbel @de
label: Produzione mobili di legno non rivestiti @it
label: Произв. дерев. мебели без обивки @ru
label: 家庭用室内木製家具 @ja
label: 无软垫木制家具 @zh
label: 無布面木製家具 @zh-hant
label: 비내장 목재 가구 @ko
definition: This segment includes companies that manufacture non-upholstered wood household furniture.
notation: 11101311101111
valid from: 2024-06-07

Wood Furniture
type: BicsLevel6Segment
type: Classifier
type: NamedIndividual
is level6 segment of: Home Furniture
is contemporary version of: http://data.ga-group.nl/ics/bics/111013111011
is version of: http://data.ga-group.nl/ics/bics/111013111011
replaces: http://data.ga-group.nl/ics/bics/2020/111013111011
imported on: 2026-06-08T13:40:52.236Z
last refreshed on: 2026-06-08T13:41:38.450Z
source accessed on: 2024-06-05T14:42:36Z
source last accessed on: 2024-06-05T14:42:36Z
label: Holzmöbel @de
label: Móveis de madeira @pt
label: Mobili in legno @it
label: Mobilier en bois @fr
label: Muebles de madera @es
label: Деревянная мебель @ru
label: 木制家具 @zh
label: 木製家具 @ja
label: 木製家用家具 @zh-hant
label: 목제 가구 @ko
definition: This segment includes companies that manufacture upholstered, non-upholstered, and stand-alone wood furniture.
notation: 111013111011
valid from: 2024-06-07

Home Furniture
type: BicsLevel5Segment
type: Classifier
type: NamedIndividual
is level5 segment of: Furniture
is contemporary version of: http://data.ga-group.nl/ics/bics/1110131110
is version of: http://data.ga-group.nl/ics/bics/1110131110
replaces: http://data.ga-group.nl/ics/bics/2020/1110131110
imported on: 2026-06-08T13:40:52.236Z
last refreshed on: 2026-06-08T13:41:38.450Z
source accessed on: 2024-06-05T14:42:36Z
source last accessed on: 2024-06-05T14:42:36Z
label: Haushaltsmöbel @de
label: Móveis para casa @pt
label: Mobili per la casa @it
label: Mobilier de maison @fr
label: Muebles para el hogar @es
label: Мебель для дома @ru
label: 家具 @zh
label: 家庭用家具 @ja
label: 家用家具 @zh-hant
label: 가정용 가구 @ko
definition: This segment includes companies that manufacture furniture for home use.
notation: 1110131110
valid from: 2024-06-07

Office Furniture
type: BicsLevel5Segment
type: Classifier
type: NamedIndividual
is level5 segment of: Furniture
is contemporary version of: http://data.ga-group.nl/ics/bics/1110131111
is version of: http://data.ga-group.nl/ics/bics/1110131111
replaces: http://data.ga-group.nl/ics/bics/2020/1110131111
imported on: 2026-06-08T13:40:52.236Z
last refreshed on: 2026-06-08T13:41:38.450Z
source accessed on: 2024-06-05T14:42:36Z
source last accessed on: 2024-06-05T14:42:36Z
label: Büromöbel @de
label: Móveis para escritórios @pt
label: Mobili per ufficio @it
label: Mobilier de bureau @fr
label: Muebles de oficina @es
label: Офисная мебель @ru
label: 办公家具 @zh
label: 辦公家具 @zh-hant
label: 사무용 가구 @ko
label: ｵﾌｨｽ家具 @ja
definition: This segment includes companies that manufacture nonresidential furniture.
notation: 1110131111
valid from: 2024-06-07

Mattress
type: BicsLevel5Segment
type: Classifier
type: NamedIndividual
is level5 segment of: Furniture
is contemporary version of: http://data.ga-group.nl/ics/bics/1110131112
is version of: http://data.ga-group.nl/ics/bics/1110131112
replaces: http://data.ga-group.nl/ics/bics/2020/1110131112
imported on: 2026-06-08T13:40:52.236Z
last refreshed on: 2026-06-08T13:41:38.450Z
source accessed on: 2024-06-05T14:42:36Z
source last accessed on: 2024-06-05T14:42:36Z
label: Colchão @pt
label: Colchones @es
label: Matelas @fr
label: Materassi @it
label: Matratzen @de
label: Матрасы @ru
label: 床垫 @zh
label: 床墊 @zh-hant
label: 매트리스 @ko
label: ﾏｯﾄﾚｽ @ja
definition: This segment includes companies that manufacture foam rubber, memory material, innerspring, and non-innerspring mattresses, box springs and waterbeds.
notation: 1110131112
valid from: 2024-06-07

Furniture
type: BicsLevel4SubIndustry
type: Classifier
type: NamedIndividual
is sub industry of: Home & Office Products
is contemporary version of: http://data.ga-group.nl/ics/bics/11101311
is version of: http://data.ga-group.nl/ics/bics/11101311
replaces: http://data.ga-group.nl/ics/bics/2020/11101311
imported on: 2026-06-08T13:40:52.236Z
last refreshed on: 2026-06-08T13:41:38.450Z
source accessed on: 2024-06-05T14:42:36Z
source last accessed on: 2024-06-05T14:42:36Z
label: Móveis @pt
label: Möbel @de
label: Mobili @it
label: Mobilier @fr
label: Muebles @es
label: Мебель @ru
label: 家具 @ja
label: 家用家具 @zh-hant
label: 가구 @ko
definition: This industry subgroup includes companies that manufacture household furniture, office furniture, institutional furniture, mattresses, shades, and blinds.
notation: 11101311
valid from: 2024-06-07

Cookware & Tableware
type: BicsLevel5Segment
type: Classifier
type: NamedIndividual
is level5 segment of: Housewares
is contemporary version of: http://data.ga-group.nl/ics/bics/1110131210
is version of: http://data.ga-group.nl/ics/bics/1110131210
replaces: http://data.ga-group.nl/ics/bics/2020/1110131210
imported on: 2026-06-08T13:40:52.236Z
last refreshed on: 2026-06-08T13:41:38.450Z
source accessed on: 2024-06-05T14:42:36Z
source last accessed on: 2024-06-05T14:42:36Z
label: Coutellerie et couverts @fr
label: Kochgeschirr & Geschirr @de
label: Panelas e louças @pt
label: Pentole e stoviglie @it
label: Vajilla y utensilios de cocina @es
label: Кухонная утварь и посуда @ru
label: 厨具及餐具 @zh
label: 炊具及餐具 @zh-hant
label: 調理器具･食器 @ja
label: 조리용품 & 식기류 @ko
definition: This segment includes companies that manufacture plated metal cutlery and flatware, tableware, cookware, and other kitchen tools.
notation: 1110131210
valid from: 2024-06-07

Home Decoration Products
type: BicsLevel5Segment
type: Classifier
type: NamedIndividual
is level5 segment of: Housewares
is contemporary version of: http://data.ga-group.nl/ics/bics/1110131211
is version of: http://data.ga-group.nl/ics/bics/1110131211
replaces: http://data.ga-group.nl/ics/bics/2020/1110131211
imported on: 2026-06-08T13:40:52.236Z
last refreshed on: 2026-06-08T13:41:38.450Z
source accessed on: 2024-06-05T14:42:36Z
source last accessed on: 2024-06-05T14:42:36Z
label: Articles de décoration de maison @fr
label: Dekorationsartikel @de
label: Prod decorativi casa @it
label: Productos de decoración del hogar @es
label: Produtos de decoração de casa @pt
label: Предметы интерьера @ru
label: 家居装饰产品 @zh
label: 家庭装飾品 @ja
label: 家庭裝飾品 @zh-hant
label: 가정용 장식품 @ko
definition: This segment includes companies that manufacture products for interior and exterior home decoration.
notation: 1110131211
valid from: 2024-06-07

Housewares
type: BicsLevel4SubIndustry
type: Classifier
type: NamedIndividual
is sub industry of: Home & Office Products
is contemporary version of: http://data.ga-group.nl/ics/bics/11101312
is version of: http://data.ga-group.nl/ics/bics/11101312
replaces: http://data.ga-group.nl/ics/bics/2020/11101312
imported on: 2026-06-08T13:40:52.236Z
last refreshed on: 2026-06-08T13:41:38.450Z
source accessed on: 2024-06-05T14:42:36Z
source last accessed on: 2024-06-05T14:42:36Z
label: Artículos del hogar @es
label: Articles ménagers @fr
label: Casalinghi @it
label: Eletrodomésticos @pt
label: Haushaltswaren @de
label: Домаш. утварь @ru
label: 家庭廚具 @zh-hant
label: 家用器皿 @zh
label: 生活用品 @ja
label: 가정용품업 @ko
definition: This industry subgroup includes companies that manufacture small, durable household goods not elsewhere classifiable.
notation: 11101312
valid from: 2024-06-07

Stationery
type: BicsLevel5Segment
type: Classifier
type: NamedIndividual
is level5 segment of: Office Supplies
is contemporary version of: http://data.ga-group.nl/ics/bics/1110131310
is version of: http://data.ga-group.nl/ics/bics/1110131310
replaces: http://data.ga-group.nl/ics/bics/2020/1110131310
imported on: 2026-06-08T13:40:52.236Z
last refreshed on: 2026-06-08T13:41:38.450Z
source accessed on: 2024-06-05T14:42:36Z
source last accessed on: 2024-06-05T14:42:36Z
label: Artículos de papelería @es
label: Articles de papeterie @fr
label: Cancelleria @it
label: Papelaria @pt
label: Schreibwaren @de
label: Канцелярские товары @ru
label: 文具 @ja
label: 사무용품 @ko
definition: This segment includes companies that manufacture stationery and related office supplies, such as pads and notebooks.
notation: 1110131310
valid from: 2024-06-07

Writing Instruments
type: BicsLevel5Segment
type: Classifier
type: NamedIndividual
is level5 segment of: Office Supplies
is contemporary version of: http://data.ga-group.nl/ics/bics/1110131311
is version of: http://data.ga-group.nl/ics/bics/1110131311
replaces: http://data.ga-group.nl/ics/bics/2020/1110131311
imported on: 2026-06-08T13:40:52.236Z
last refreshed on: 2026-06-08T13:41:38.450Z
source accessed on: 2024-06-05T14:42:36Z
source last accessed on: 2024-06-05T14:42:36Z
label: Articles d'écriture @fr
label: Instrum de escritura @es
label: Instrumentos de escrita @pt
label: Schreibgeräte @de
label: Strumenti scrittura @it
label: Пишущие инструменты @ru
label: 书写工具 @zh
label: 書寫工具 @zh-hant
label: 筆記具 @ja
label: 필기도구 @ko
definition: This segment includes companies that manufacture writing instruments, such as pens, pencils, markers, chalk, and rubber stamps.
notation: 1110131311
valid from: 2024-06-07

Office Supplies
type: BicsLevel4SubIndustry
type: Classifier
type: NamedIndividual
is sub industry of: Home & Office Products
is contemporary version of: http://data.ga-group.nl/ics/bics/11101313
is version of: http://data.ga-group.nl/ics/bics/11101313
replaces: http://data.ga-group.nl/ics/bics/2020/11101313
imported on: 2026-06-08T13:40:52.236Z
last refreshed on: 2026-06-08T13:41:38.450Z
source accessed on: 2024-06-05T14:42:36Z
source last accessed on: 2024-06-05T14:42:36Z
label: Artículos oficina @es
label: Articoli per ufficio @it
label: Bürobedarf @de
label: Fournitures de bureau @fr
label: Mater escritório @pt
label: Канцтовары @ru
label: 事務用品 @ja
label: 办公用品 @zh
label: 辦公用品 @zh-hant
label: 사무용품 @ko
definition: This industry subgroup includes companies that manufacture office supplies such as envelopes, notebooks, writing instruments, folders, and carbon paper.
notation: 11101313
valid from: 2024-06-07

Home & Office Products
type: BicsLevel3Industry
type: Classifier
type: NamedIndividual
is industry of: Consumer Discretionary Products
is contemporary version of: http://data.ga-group.nl/ics/bics/111013
is version of: http://data.ga-group.nl/ics/bics/111013
replaces: http://data.ga-group.nl/ics/bics/2020/111013
imported on: 2026-06-08T13:40:52.236Z
last refreshed on: 2026-06-08T13:41:38.450Z
source accessed on: 2024-06-05T14:42:36Z
source last accessed on: 2024-06-05T14:42:36Z
label: Articles de maison et de bureau @fr
label: Haus- & Büroprodukte @de
label: Prodotti per casa e ufficio @it
label: Productos para el hogar y negocios @es
label: Produtos para casa e escritório @pt
label: Товары для дома и офиса @ru
label: 家居及办公用品 @zh
label: 家庭及辦公室產品 @zh-hant
label: 家庭･事務用品 @ja
label: 가정용 & 사무실용 제품 @ko
definition: This industry includes companies that manufacture non-affixed products used within a home or office. Typically, these products are used to furnish the interior of homes for decorative or functional purposes.
notation: 111013
valid from: 2024-06-07

Toys & Games
type: BicsLevel4SubIndustry
type: Classifier
type: NamedIndividual
is sub industry of: Leisure Products
is contemporary version of: http://data.ga-group.nl/ics/bics/11101410
is version of: http://data.ga-group.nl/ics/bics/11101410
replaces: http://data.ga-group.nl/ics/bics/2020/11101410
imported on: 2026-06-08T13:40:52.236Z
last refreshed on: 2026-06-08T13:41:38.450Z
source accessed on: 2024-06-05T14:42:36Z
source last accessed on: 2024-06-05T14:42:36Z
label: Brinquedos e jogos @pt
label: Giochi e giocattoli @it
label: Jeux et jouets @fr
label: Juguetes y juegos @es
label: Spielzeug & Spiele @de
label: Игрушки и игры @ru
label: 玩具与游戏 @zh
label: 玩具及遊戲 @zh-hant
label: 玩具･ｹﾞｰﾑ @ja
label: 완구 및 게임 @ko
definition: This industry subgroup includes companies that manufacture physical products used for leisure such as dolls, toys, board games, playing cards, puzzles, hobby items, and crafts. Excludes video game consoles (see Video Game Equipment), and their games (see Video Game Software).
notation: 11101410
valid from: 2024-06-07

Music Instruments
type: BicsLevel4SubIndustry
type: Classifier
type: NamedIndividual
is sub industry of: Leisure Products
is contemporary version of: http://data.ga-group.nl/ics/bics/11101411
is version of: http://data.ga-group.nl/ics/bics/11101411
replaces: http://data.ga-group.nl/ics/bics/2020/11101411
imported on: 2026-06-08T13:40:52.236Z
last refreshed on: 2026-06-08T13:41:38.450Z
source accessed on: 2024-06-05T14:42:36Z
source last accessed on: 2024-06-05T14:42:36Z
label: Instrumentos musicais @pt
label: Instrumentos musicales @es
label: Instruments de musique @fr
label: Musikinstrumente @de
label: Strumenti musicali @it
label: Музыкальные инструменты @ru
label: 乐器 @zh
label: 楽器 @ja
label: 樂器 @zh-hant
label: 악기 @ko
definition: This industry subgroup includes companies that manufacture stringed, keyboard, woodwind, brass, and percussion instruments used to perform music.
notation: 11101411
valid from: 2024-06-07

Leisure Boats & Yachts Building
type: BicsLevel5Segment
type: Classifier
type: NamedIndividual
is level5 segment of: Recreational Vehicles
is contemporary version of: http://data.ga-group.nl/ics/bics/1110141210
is version of: http://data.ga-group.nl/ics/bics/1110141210
replaces: http://data.ga-group.nl/ics/bics/2020/1110141210
imported on: 2026-06-08T13:40:52.236Z
last refreshed on: 2026-06-08T13:41:38.450Z
source accessed on: 2024-06-05T14:42:36Z
source last accessed on: 2024-06-05T14:42:36Z
label: Bau von Freizeitbooten & Yachten @de
label: Construção de barcos para lazer e iates @pt
label: Construc botes de ocio/yates @es
label: Construction de bateaux et yachts de plaisance @fr
label: Costruzione imbarcazioni da diporto e yacht @it
label: Лодки/яхты @ru
label: 休闲艇与游艇 @zh
label: 遊船遊艇建造 @zh-hant
label: 레저 보트 & 요트 건조 @ko
label: ﾚｼﾞｬｰ用小型船･ﾖｯﾄ @ja
definition: This segment includes companies that manufacture recreational watercraft, such as yachts, motorboats, sailboats, canoes, kayaks, rowboats, and inflatable rafts.
notation: 1110141210
valid from: 2024-06-07

Motorhomes
type: BicsLevel6Segment
type: Classifier
type: NamedIndividual
is level6 segment of: Motorhomes, Trailers & Campers
is contemporary version of: http://data.ga-group.nl/ics/bics/111014121110
is version of: http://data.ga-group.nl/ics/bics/111014121110
replaces: http://data.ga-group.nl/ics/bics/2020/111014121110
imported on: 2026-06-08T13:40:52.236Z
last refreshed on: 2026-06-08T13:41:38.450Z
source accessed on: 2024-06-05T14:42:36Z
source last accessed on: 2024-06-05T14:42:36Z
label: Autocaravanas @es
label: Camper @it
label: Mobile-homes @fr
label: Wohnmobile @de
label: Дома на колесах @ru
label: 房车 @zh
label: 車屋 @zh-hant
label: 이동식 주택 @ko
label: ﾓｰﾀｰﾎｰﾑ @ja
definition: This segment includes companies that manufacture motorhomes, which are vehicles equipped with living quarters.
notation: 111014121110
valid from: 2024-06-07

Travel Trailers & Campers
type: BicsLevel6Segment
type: Classifier
type: NamedIndividual
is level6 segment of: Motorhomes, Trailers & Campers
is contemporary version of: http://data.ga-group.nl/ics/bics/111014121111
is version of: http://data.ga-group.nl/ics/bics/111014121111
replaces: http://data.ga-group.nl/ics/bics/2020/111014121111
imported on: 2026-06-08T13:40:52.236Z
last refreshed on: 2026-06-08T13:41:38.450Z
source accessed on: 2024-06-05T14:42:36Z
source last accessed on: 2024-06-05T14:42:36Z
label: Caravanas de viajes y de campamento @es
label: Caravanes et camping cars @fr
label: Roulotte e camper @it
label: Trailers e caravanas @pt
label: Wohnwagen & Campingbusse @de
label: Туристические прицепы и автофургоны @ru
label: 旅行拖车及露营车 @zh
label: 旅行用ﾄﾚｰﾗｰ･ｷｬﾝﾋﾟﾝｸﾞｶｰ @ja
label: 旅行車及露營車 @zh-hant
label: 여행용 트레일러 & 캠핑카 @ko
definition: This segment includes companies that manufacture travel and camper trailers, which are towed behind a vehicle.
notation: 111014121111
valid from: 2024-06-07

Motorhomes, Trailers & Campers
type: BicsLevel5Segment
type: Classifier
type: NamedIndividual
is level5 segment of: Recreational Vehicles
is contemporary version of: http://data.ga-group.nl/ics/bics/1110141211
is version of: http://data.ga-group.nl/ics/bics/1110141211
replaces: http://data.ga-group.nl/ics/bics/2020/1110141211
imported on: 2026-06-08T13:40:52.236Z
last refreshed on: 2026-06-08T13:41:38.450Z
source accessed on: 2024-06-05T14:42:36Z
source last accessed on: 2024-06-05T14:42:36Z
label: Autocaravanas, remolques y campers @es
label: Camper e roulotte @it
label: Mobile-homes, caravanes et camping cars @fr
label: Motorhomes, trailers e caravanas @pt
label: Wohnmobile, Anhänger & Campingbusse @de
label: Дома на колесах, прицепы и автофургоны @ru
label: 房车、拖车及露营车 @zh
label: 車屋、露營拖車及露營車 @zh-hant
label: 이동식 주택, 트레일러 & 캠핑카 @ko
label: ﾓｰﾀｰﾎｰﾑ･ﾄﾚｰﾗｰ･ｷｬﾝﾋﾟﾝｸﾞｶｰ @ja
definition: This segment includes companies that manufacture motor homes, travel trailers, and campers.
notation: 1110141211
valid from: 2024-06-07

Recreational Vehicles
type: BicsLevel4SubIndustry
type: Classifier
type: NamedIndividual
is sub industry of: Leisure Products
is contemporary version of: http://data.ga-group.nl/ics/bics/11101412
is version of: http://data.ga-group.nl/ics/bics/11101412
replaces: http://data.ga-group.nl/ics/bics/2020/11101412
imported on: 2026-06-08T13:40:52.236Z
last refreshed on: 2026-06-08T13:41:38.450Z
source accessed on: 2024-06-05T14:42:36Z
source last accessed on: 2024-06-05T14:42:36Z
label: Véhicules de plaisance @fr
label: Veículos recreativos @pt
label: Vehículos recreativos @es
label: Veicoli ricreativi @it
label: Wohnmobile @de
label: Транспорт для отдыха @ru
label: 休旅車 @zh-hant
label: 休闲车 @zh
label: 娯楽用品 @ja
label: 레크레이션용 자동차 @ko
definition: This industry subgroup includes companies that manufacture motor homes, travel trailers, campers, and recreational vehicle equipment.
notation: 11101412
valid from: 2024-06-07

Bicycles
type: BicsLevel6Segment
type: Classifier
type: NamedIndividual
is level6 segment of: Bicycles & Parts
is contemporary version of: http://data.ga-group.nl/ics/bics/111014131010
is version of: http://data.ga-group.nl/ics/bics/111014131010
replaces: http://data.ga-group.nl/ics/bics/2020/111014131010
imported on: 2026-06-08T13:40:52.236Z
last refreshed on: 2026-06-08T13:41:38.450Z
source accessed on: 2024-06-05T14:42:36Z
source last accessed on: 2024-06-05T14:42:36Z
label: Bicicletas @es
label: Biciclette @it
label: Bicyclettes @fr
label: Fahrräder @de
label: Велосипеды @ru
label: 腳踏車 @zh-hant
label: 自行车 @zh
label: 自転車 @ja
label: 자전거 @ko
definition: This segment includes companies that manufacture bicycles.
notation: 111014131010
valid from: 2024-06-07

Bicycle Parts
type: BicsLevel6Segment
type: Classifier
type: NamedIndividual
is level6 segment of: Bicycles & Parts
is contemporary version of: http://data.ga-group.nl/ics/bics/111014131011
is version of: http://data.ga-group.nl/ics/bics/111014131011
replaces: http://data.ga-group.nl/ics/bics/2020/111014131011
imported on: 2026-06-08T13:40:52.236Z
last refreshed on: 2026-06-08T13:41:38.450Z
source accessed on: 2024-06-05T14:42:36Z
source last accessed on: 2024-06-05T14:42:36Z
label: Fahrradteile @de
label: Partes de bicicleta @es
label: Peças para bicicleta @pt
label: Pièces de bicyclettes @fr
label: Ricambi bici @it
label: Велосипед. запчасти @ru
label: 腳踏車零件 @zh-hant
label: 自行车零件 @zh
label: 自転車部品 @ja
label: 자전거 부품 @ko
definition: This segment includes companies that manufacture bicycle parts.
notation: 111014131011
valid from: 2024-06-07

Bicycles & Parts
type: BicsLevel5Segment
type: Classifier
type: NamedIndividual
is level5 segment of: Sporting Goods
is contemporary version of: http://data.ga-group.nl/ics/bics/1110141310
is version of: http://data.ga-group.nl/ics/bics/1110141310
replaces: http://data.ga-group.nl/ics/bics/2020/1110141310
imported on: 2026-06-08T13:40:52.236Z
last refreshed on: 2026-06-08T13:41:38.450Z
source accessed on: 2024-06-05T14:42:36Z
source last accessed on: 2024-06-05T14:42:36Z
label: Bicicleta e peças @pt
label: Bicicletas y partes @es
label: Biciclette e parti @it
label: Bicyclettes et leurs pièces @fr
label: Fahrräder & Teile @de
label: Велосипеды и з/части @ru
label: 腳踏車及零件 @zh-hant
label: 自行车及零件 @zh
label: 自転車･部品 @ja
label: 자전거 & 부품 @ko
definition: This segment includes companies that manufacture bicycles and bicycle parts.
notation: 1110141310
valid from: 2024-06-07

Golf Equipment
type: BicsLevel5Segment
type: Classifier
type: NamedIndividual
is level5 segment of: Sporting Goods
is contemporary version of: http://data.ga-group.nl/ics/bics/1110141311
is version of: http://data.ga-group.nl/ics/bics/1110141311
replaces: http://data.ga-group.nl/ics/bics/2020/1110141311
imported on: 2026-06-08T13:40:52.236Z
last refreshed on: 2026-06-08T13:41:38.450Z
source accessed on: 2024-06-05T14:42:36Z
source last accessed on: 2024-06-05T14:42:36Z
label: Attrezzi per il golf @it
label: Equipamentos para golfe @pt
label: Equipement de golf @fr
label: Equipo de golf @es
label: Golfausrüstung @de
label: Оборудование для гольфа @ru
label: 高尔夫设备 @zh
label: 高爾夫球裝備 @zh-hant
label: 골프 장비 @ko
label: ｺﾞﾙﾌ用品 @ja
definition: This segment includes companies that manufacture golfing equipment, such as bags, balls, caddy carts, clubs, and tees.
notation: 1110141311
valid from: 2024-06-07

Small Arms
type: BicsLevel5Segment
type: Classifier
type: NamedIndividual
is level5 segment of: Sporting Goods
is contemporary version of: http://data.ga-group.nl/ics/bics/1110141312
is version of: http://data.ga-group.nl/ics/bics/1110141312
replaces: http://data.ga-group.nl/ics/bics/2020/1110141312
imported on: 2026-06-08T13:40:52.236Z
last refreshed on: 2026-06-08T13:41:38.450Z
source accessed on: 2024-06-05T14:42:36Z
source last accessed on: 2024-06-05T14:42:36Z
label: Armas de pequeno porte @pt
label: Armas pequeñas @es
label: Armes légères @fr
label: Handfeuerwaffen @de
label: Piccole armi @it
label: Стрелков. оружие @ru
label: 小型武器 @zh-hant
label: 小型武器制造 @zh
label: 小火器 @ja
label: 소형무기 탄약 @ko
definition: This segment includes companies that manufacture small firearms, including pistols, rifles, and shotguns.
notation: 1110141312
valid from: 2024-06-07

Sporting Goods
type: BicsLevel4SubIndustry
type: Classifier
type: NamedIndividual
is sub industry of: Leisure Products
is contemporary version of: http://data.ga-group.nl/ics/bics/11101413
is version of: http://data.ga-group.nl/ics/bics/11101413
replaces: http://data.ga-group.nl/ics/bics/2020/11101413
imported on: 2026-06-08T13:40:52.236Z
last refreshed on: 2026-06-08T13:41:38.450Z
source accessed on: 2024-06-05T14:42:36Z
source last accessed on: 2024-06-05T14:42:36Z
label: Articles de sport @fr
label: Articoli sportivi @it
label: Bienes deportivos @es
label: Materiais esportivos @pt
label: Sportartikel @de
label: Спортивные товары @ru
label: 体育用品 @zh
label: 體育用品 @zh-hant
label: 스포츠 용품 @ko
label: ｽﾎﾟｰﾂ用品 @ja
definition: This industry subgroup includes companies that manufacture sporting equipment.
notation: 11101413
valid from: 2024-06-07

Leisure Products
type: BicsLevel3Industry
type: Classifier
type: NamedIndividual
is industry of: Consumer Discretionary Products
is contemporary version of: http://data.ga-group.nl/ics/bics/111014
is version of: http://data.ga-group.nl/ics/bics/111014
replaces: http://data.ga-group.nl/ics/bics/2020/111014
imported on: 2026-06-08T13:40:52.236Z
last refreshed on: 2026-06-08T13:41:38.450Z
source accessed on: 2024-06-05T14:42:36Z
source last accessed on: 2024-06-05T14:42:36Z
label: Articoli tempo libero @it
label: Freizeitartikel @de
label: Productos de tiempo libre @es
label: Produits de loisir @fr
label: Produtos de lazer @pt
label: Товары д/отдыха @ru
label: 休閒產品 @zh-hant
label: 休闲产品 @zh
label: 레저 상품 @ko
label: ﾚｼﾞｬｰ用品 @ja
definition: This industry includes companies that manufacture consumer products used for leisure, recreation, or hobbies.
notation: 111014
valid from: 2024-06-07

Consumer Discretionary Products
type: BicsLevel2IndustryGroup
type: Classifier
type: NamedIndividual
is industry group of: Consumer Discretionary
is contemporary version of: http://data.ga-group.nl/ics/bics/1110
is version of: http://data.ga-group.nl/ics/bics/1110
replaces: http://data.ga-group.nl/ics/bics/2020/1110
imported on: 2026-06-08T13:40:52.236Z
last refreshed on: 2026-06-08T13:41:38.450Z
source accessed on: 2024-06-05T14:42:36Z
source last accessed on: 2024-06-05T14:42:36Z
label: Prodotti discrezionali al consumo @it
label: Productos de consumo discrecional @es
label: Produits de conso discrétionnaire @fr
label: Produkte, Gebrauchsgüter @de
label: Produtos discricionários ao consumidor @pt
label: Товары выборочного спроса @ru
label: 一般消費財製品 @ja
label: 非必需消费品 @zh
label: 非核心消費產品 @zh-hant
label: 자유소비재 제품 @ko
definition: This industry group includes companies that manufacture cyclical products for household consumption.
notation: 1110
valid from: 2024-06-07

Consumer Elec & Applc Rental
type: BicsLevel5Segment
type: Classifier
type: NamedIndividual
is level5 segment of: Consumer Goods Rental
is contemporary version of: http://data.ga-group.nl/ics/bics/1111101010
is version of: http://data.ga-group.nl/ics/bics/1111101010
replaces: http://data.ga-group.nl/ics/bics/2020/1111101010
imported on: 2026-06-08T13:40:52.236Z
last refreshed on: 2026-06-08T13:41:38.450Z
source accessed on: 2024-06-05T14:42:36Z
source last accessed on: 2024-06-05T14:42:36Z
label: Affitto elettronica di consumo ed elettrodomestici @it
label: Alquiler aparatos electrodom @es
label: Aluguel elet consumo e eletrod @pt
label: Location appareils électroniques @fr
label: Verbraucherelektronik @de
label: Аренда бытовой электроники и приборов @ru
label: 家電ﾚﾝﾀﾙ @ja
label: 消費電子及電器用品出租 @zh-hant
label: 电子品与电器出租 @zh
label: 전자제품 임대업 @ko
definition: This segment includes companies that rent televisions, stereos, refrigerators, and other consumer electronics equipment and appliances.
notation: 1111101010
valid from: 2024-06-07

Home Health Equipment Rental
type: BicsLevel5Segment
type: Classifier
type: NamedIndividual
is level5 segment of: Consumer Goods Rental
is contemporary version of: http://data.ga-group.nl/ics/bics/1111101011
is version of: http://data.ga-group.nl/ics/bics/1111101011
replaces: http://data.ga-group.nl/ics/bics/2020/1111101011
imported on: 2026-06-08T13:40:52.236Z
last refreshed on: 2026-06-08T13:41:38.450Z
source accessed on: 2024-06-05T14:42:36Z
source last accessed on: 2024-06-05T14:42:36Z
label: Alquiler de equipo médico para el hogar @es
label: Aluguel de equipamentos de saúde para o lar @pt
label: Location d'équipement de santé pour domiciles @fr
label: Noleggio di apparecchiature sanitarie per la casa @it
label: Vermietung von Heimfitnessgeräten @de
label: Прокат домашнего медицинского оборудования @ru
label: 家庭用健康機器ﾚﾝﾀﾙ @ja
label: 家用保健设备出租 @zh
label: 家用健康設備出租 @zh-hant
label: 가정용 건강 장비 임대업 @ko
definition: This segment includes companies that rent wheelchairs, hospital beds, oxygen tanks, walkers, crutches, and other home health care equipment.
notation: 1111101011
valid from: 2024-06-07

Consumer Goods Rental
type: BicsLevel4SubIndustry
type: Classifier
type: NamedIndividual
is sub industry of: Consumer Services
is contemporary version of: http://data.ga-group.nl/ics/bics/11111010
is version of: http://data.ga-group.nl/ics/bics/11111010
replaces: http://data.ga-group.nl/ics/bics/2020/11111010
imported on: 2026-06-08T13:40:52.236Z
last refreshed on: 2026-06-08T13:41:38.450Z
source accessed on: 2024-06-05T14:42:36Z
source last accessed on: 2024-06-05T14:42:36Z
label: Alquiler bienes cons @es
label: Aluguel bens cons @pt
label: Konsumgütervermiet. @de
label: Location biens conso @fr
label: Locazione beni cons @it
label: Потреб. товары, лизинг @ru
label: 消費品出租 @zh-hant
label: 消費財ﾚﾝﾀﾙ @ja
label: 消費財ﾚﾝﾀ��� @ja
label: 消费品出租 @zh
label: 소비재 임대업 @ko
definition: This industry subgroup includes companies that rent consumer goods, such as appliances, formal wear, costumes, fitness equipment, and power tools.
notation: 11111010
valid from: 2024-06-07

Primary & Secondary Schools
type: BicsLevel5Segment
type: Classifier
type: NamedIndividual
is level5 segment of: Educational Services
is contemporary version of: http://data.ga-group.nl/ics/bics/1111101110
is version of: http://data.ga-group.nl/ics/bics/1111101110
replaces: http://data.ga-group.nl/ics/bics/2020/1111101110
imported on: 2026-06-08T13:40:52.236Z
last refreshed on: 2026-06-08T13:41:38.450Z
source accessed on: 2024-06-05T14:42:36Z
source last accessed on: 2024-06-05T14:42:36Z
label: Colegios de primaria y secundaria @es
label: Ecoles primaires et secondaires @fr
label: Grund- & Weiterführende Schulen @de
label: Scuole primarie e secondarie @it
label: 中小学 @zh
label: 小學及中學 @zh-hant
label: 小･中学校 @ja
label: 초등 및 중등학교 @ko
definition: This segment includes companies that offer primary and secondary education.
notation: 1111101110
valid from: 2024-06-07

Junior Colleges
type: BicsLevel5Segment
type: Classifier
type: NamedIndividual
is level5 segment of: Educational Services
is contemporary version of: http://data.ga-group.nl/ics/bics/1111101111
is version of: http://data.ga-group.nl/ics/bics/1111101111
replaces: http://data.ga-group.nl/ics/bics/2020/1111101111
imported on: 2026-06-08T13:40:52.236Z
last refreshed on: 2026-06-08T13:41:38.450Z
source accessed on: 2024-06-05T14:42:36Z
source last accessed on: 2024-06-05T14:42:36Z
label: Biennio universitario @it
label: Collèges communau. @fr
label: Faculdades júnior @pt
label: Junior colleges @es
label: US Junior Colleges @de
label: Двухгодичные колледжи @ru
label: 大专 @zh
label: 專科學校 @zh-hant
label: 短期大学 @ja
label: 초급대학 @ko
definition: This segment includes companies that offer academic courses that lead to associate degrees, certificates, or diplomas below the baccalaureate level.
notation: 1111101111
valid from: 2024-06-07

College, University & Pro Schools
type: BicsLevel5Segment
type: Classifier
type: NamedIndividual
is level5 segment of: Educational Services
is contemporary version of: http://data.ga-group.nl/ics/bics/1111101112
is version of: http://data.ga-group.nl/ics/bics/1111101112
replaces: http://data.ga-group.nl/ics/bics/2020/1111101112
imported on: 2026-06-08T13:40:52.236Z
last refreshed on: 2026-06-08T13:41:38.450Z
source accessed on: 2024-06-05T14:42:36Z
source last accessed on: 2024-06-05T14:42:36Z
label: Collèges, universités et écoles prof @fr
label: College, università e scuole prof @it
label: Colleges, Universitäten & Berufsschulen @de
label: Faculdades, universidades e escolas prof @pt
label: Universidades y escuelas de educación terciaria @es
label: Колледжи, университеты и проф. школы @ru
label: 大学･総合大学･専門学校 @ja
label: 大專、大學及職業學校 @zh-hant
label: 学院、大学及专科学校 @zh
label: 전문대, 대학교 & 직업학교 @ko
definition: This segment includes companies that offer academic courses leading to degrees at the baccalaureate, graduate, or doctoral level.
notation: 1111101112
valid from: 2024-06-07

Vocational Schools
type: BicsLevel5Segment
type: Classifier
type: NamedIndividual
is level5 segment of: Educational Services
is contemporary version of: http://data.ga-group.nl/ics/bics/1111101113
is version of: http://data.ga-group.nl/ics/bics/1111101113
replaces: http://data.ga-group.nl/ics/bics/2020/1111101113
imported on: 2026-06-08T13:40:52.236Z
last refreshed on: 2026-06-08T13:41:38.450Z
source accessed on: 2024-06-05T14:42:36Z
source last accessed on: 2024-06-05T14:42:36Z
label: Berufsschulen @de
label: Ecoles professionnelles @fr
label: Escuelas vocacionales @es
label: Scuole professionali @it
label: 职业学校 @zh
label: 職業學校 @zh-hant
label: 職業訓練学校 @ja
label: 직업학교 @ko
label: ���업학교 @ko
definition: This segment includes companies that offer courses specific to a profession, trade, or career, leading to a certification or license. Includes trade schools, mechanics schools, beauty schools and real estate licensing schools.
notation: 1111101113
valid from: 2024-06-07

Language Schools
type: BicsLevel5Segment
type: Classifier
type: NamedIndividual
is level5 segment of: Educational Services
is contemporary version of: http://data.ga-group.nl/ics/bics/1111101114
is version of: http://data.ga-group.nl/ics/bics/1111101114
replaces: http://data.ga-group.nl/ics/bics/2020/1111101114
imported on: 2026-06-08T13:40:52.236Z
last refreshed on: 2026-06-08T13:41:38.450Z
source accessed on: 2024-06-05T14:42:36Z
source last accessed on: 2024-06-05T14:42:36Z
label: Ecoles de langues @fr
label: Escolas de idiomas @pt
label: Escuelas de idiomas @es
label: Scuole di lingua @it
label: Sprachschulen @de
label: Школы по изучению иностр. языков @ru
label: 語学学校 @ja
label: 語言學校 @zh-hant
label: 语言学校 @zh
label: 언어 학원 @ko
definition: This segment includes companies that offer foreign language educational programs.
notation: 1111101114
valid from: 2024-06-07

Educational Services
type: BicsLevel4SubIndustry
type: Classifier
type: NamedIndividual
is sub industry of: Consumer Services
is contemporary version of: http://data.ga-group.nl/ics/bics/11111011
is version of: http://data.ga-group.nl/ics/bics/11111011
replaces: http://data.ga-group.nl/ics/bics/2020/11111011
imported on: 2026-06-08T13:40:52.236Z
last refreshed on: 2026-06-08T13:41:38.450Z
source accessed on: 2024-06-05T14:42:36Z
source last accessed on: 2024-06-05T14:42:36Z
label: Bildungsdienste @de
label: Serv educacionais @pt
label: Service enseignement @fr
label: Servicios educativos @es
label: Servizi istruzione @it
label: Услуги образования @ru
label: 教育服务 @zh
label: 教育服務 @zh-hant
label: 教育ｻｰﾋﾞｽ @ja
label: 교육 서비스 @ko
label: ���육 서비스 @ko
definition: This industry subgroup includes companies that provide instruction and training for a variety of social, business, and language sciences and subjects. Instruction and training may be facilitated on a full-time, part-time, distance learning, or occasional basis through institutions such as schools, colleges, universities, and professional institutes.
notation: 11111011
valid from: 2024-06-07

Funeral Homes & Services
type: BicsLevel5Segment
type: Classifier
type: NamedIndividual
is level5 segment of: Funeral Services
is contemporary version of: http://data.ga-group.nl/ics/bics/1111101210
is version of: http://data.ga-group.nl/ics/bics/1111101210
replaces: http://data.ga-group.nl/ics/bics/2020/1111101210
imported on: 2026-06-08T13:40:52.236Z
last refreshed on: 2026-06-08T13:41:38.450Z
source accessed on: 2024-06-05T14:42:36Z
source last accessed on: 2024-06-05T14:42:36Z
label: Bestattungsinstitute & Beerdigungsdienste @de
label: Salons et services funéraires @fr
label: Serv funerários e funerárias @pt
label: Servizi e pompe funebri @it
label: Servs de funerarias @es
label: Похоронные дома и услуги @ru
label: 殡仪馆和葬礼服务 @zh
label: 殯儀館及服務 @zh-hant
label: 殯��館及服務 @zh-hant
label: 葬儀屋･葬儀ｻｰﾋﾞｽ @ja
label: 장례식장 & 장의업 @ko
definition: This segment includes companies that operate funeral homes or provide funeral services.
notation: 1111101210
valid from: 2024-06-07

Cemeteries & Crematories
type: BicsLevel5Segment
type: Classifier
type: NamedIndividual
is level5 segment of: Funeral Services
is contemporary version of: http://data.ga-group.nl/ics/bics/1111101211
is version of: http://data.ga-group.nl/ics/bics/1111101211
replaces: http://data.ga-group.nl/ics/bics/2020/1111101211
imported on: 2026-06-08T13:40:52.236Z
last refreshed on: 2026-06-08T13:41:38.450Z
source accessed on: 2024-06-05T14:42:36Z
source last accessed on: 2024-06-05T14:42:36Z
label: Cementerios/crematorios @es
label: Cemitérios/crematórios @pt
label: Cimetières et crématoriums @fr
label: Cimiteri e crematori @it
label: Friedhöfe & Krematorien @de
label: Кладбища и крематории @ru
label: 墓地与火葬场 @zh
label: 墓地及火葬場 @zh-hant
label: 墓地･火葬 @ja
label: 묘지 및 화장업 @ko
definition: This segment includes companies that operate cemeteries and crematories.
notation: 1111101211
valid from: 2024-06-07

Funeral Services
type: BicsLevel4SubIndustry
type: Classifier
type: NamedIndividual
is sub industry of: Consumer Services
is contemporary version of: http://data.ga-group.nl/ics/bics/11111012
is version of: http://data.ga-group.nl/ics/bics/11111012
replaces: http://data.ga-group.nl/ics/bics/2020/11111012
imported on: 2026-06-08T13:40:52.236Z
last refreshed on: 2026-06-08T13:41:38.450Z
source accessed on: 2024-06-05T14:42:36Z
source last accessed on: 2024-06-05T14:42:36Z
label: Bestattungsdienste @de
label: Serviços funerários @pt
label: Services de pompes funèbres @fr
label: Servicios funerarios @es
label: Servizi pompe funebri @it
label: Похоронные услуги @ru
label: 殯葬服務 @zh-hant
label: 葬儀ｻｰﾋﾞｽ @ja
label: 葬礼服务 @zh
label: 장례 서비스 @ko
definition: This industry subgroup includes companies that provide services for burial or cremation of human or animal remains. Includes mortician services, burial plots, tombs, gravestones, and casket manufacturers.
notation: 11111012
valid from: 2024-06-07

Labor Unions
type: BicsLevel5Segment
type: Classifier
type: NamedIndividual
is level5 segment of: Non-Profit Organization
is contemporary version of: http://data.ga-group.nl/ics/bics/1111101310
is version of: http://data.ga-group.nl/ics/bics/1111101310
replaces: http://data.ga-group.nl/ics/bics/2020/1111101310
imported on: 2026-06-08T13:40:52.236Z
last refreshed on: 2026-06-08T13:41:38.450Z
source accessed on: 2024-06-05T14:42:36Z
source last accessed on: 2024-06-05T14:42:36Z
label: Gewerkschaften @de
label: Sindacati @it
label: Sindicatos de trabalhadores @pt
label: Sindicatos laborales @es
label: Syndicats @fr
label: Профсоюзы @ru
label: 労働組合 @ja
label: 工会 @zh
label: 工會 @zh-hant
label: 노동조합 @ko
definition: This segment includes companies that represent employees of a specific trade or profession for contract negotiations and collective bargaining benefits.
notation: 1111101310
valid from: 2024-06-07

Trade Associations
type: BicsLevel5Segment
type: Classifier
type: NamedIndividual
is level5 segment of: Non-Profit Organization
is contemporary version of: http://data.ga-group.nl/ics/bics/1111101311
is version of: http://data.ga-group.nl/ics/bics/1111101311
replaces: http://data.ga-group.nl/ics/bics/2020/1111101311
imported on: 2026-06-08T13:40:52.236Z
last refreshed on: 2026-06-08T13:41:38.450Z
source accessed on: 2024-06-05T14:42:36Z
source last accessed on: 2024-06-05T14:42:36Z
label: Asociaciones comerciales @es
label: Associações comerciais @pt
label: Associations professionnelles @fr
label: Associazioni commercianti @it
label: Handelsverbände @de
label: Торг. ассоциации @ru
label: 事業者団体 @ja
label: 同業公會 @zh-hant
label: 贸易协会 @zh
label: 무역협회 @ko
label: 무역협��� @ko
definition: This segment includes companies that represent firms and individuals that operate within a specific economic sector. These organizations provide best practices within the field, advocate on behalf of their members before governmental organizations, and provide networking opportunities for their members.
notation: 1111101311
valid from: 2024-06-07

Non-Profit Organization
type: BicsLevel4SubIndustry
type: Classifier
type: NamedIndividual
is sub industry of: Consumer Services
is contemporary version of: http://data.ga-group.nl/ics/bics/11111013
is version of: http://data.ga-group.nl/ics/bics/11111013
replaces: http://data.ga-group.nl/ics/bics/2020/11111013
imported on: 2026-06-08T13:40:52.236Z
last refreshed on: 2026-06-08T13:41:38.450Z
source accessed on: 2024-06-05T14:42:36Z
source last accessed on: 2024-06-05T14:42:36Z
label: Gemeinnützige Organisation @de
label: Instituição sem fins lucrativos @pt
label: Organisations à but non lucratif @fr
label: Organizaciones sin fines de lucro @es
label: Organizzazioni non-profit @it
label: Некоммерческие организации @ru
label: 非営利団体 @ja
label: 非盈利組織 @zh-hant
label: 非盈利��織 @zh-hant
label: 非营利机构 @zh
label: 비영리기관 @ko
definition: This industry subgroup includes organizations that provide consumer services on a non-profit basis not elsewhere classifiable, including charitable, humanitarian, or religious services, and advocate organizations.
notation: 11111013
valid from: 2024-06-07

Beauty Salons
type: BicsLevel5Segment
type: Classifier
type: NamedIndividual
is level5 segment of: Personal Care Services
is contemporary version of: http://data.ga-group.nl/ics/bics/1111101410
is version of: http://data.ga-group.nl/ics/bics/1111101410
replaces: http://data.ga-group.nl/ics/bics/2020/1111101410
imported on: 2026-06-08T13:40:52.236Z
last refreshed on: 2026-06-08T13:41:38.450Z
source accessed on: 2024-06-05T14:42:36Z
source last accessed on: 2024-06-05T14:42:36Z
label: Parrucchieri @it
label: Salões de beleza @pt
label: Salones de belleza @es
label: Salons de beauté @fr
label: Schönheitssalons @de
label: Салоны красоты @ru
label: 美容沙龍 @zh-hant
label: 美容院 @ja
label: 미용업 @ko
definition: This segment includes establishments that provide personal care services, including nail, hair, and tanning treatments.
notation: 1111101410
valid from: 2024-06-07

Weight Management Services
type: BicsLevel5Segment
type: Classifier
type: NamedIndividual
is level5 segment of: Personal Care Services
is contemporary version of: http://data.ga-group.nl/ics/bics/1111101411
is version of: http://data.ga-group.nl/ics/bics/1111101411
replaces: http://data.ga-group.nl/ics/bics/2020/1111101411
imported on: 2026-06-08T13:40:52.236Z
last refreshed on: 2026-06-08T13:41:38.450Z
source accessed on: 2024-06-05T14:42:36Z
source last accessed on: 2024-06-05T14:42:36Z
label: Gewichtsmanagement @de
label: Serv manutenção de peso @pt
label: Services contrôle du poids @fr
label: Servicios de control de peso @es
label: Servizi controllo peso @it
label: Услуги по оптимизации веса @ru
label: 体重管理服务 @zh
label: 体重管理ｻｰﾋﾞｽ @ja
label: 體重管理服務 @zh-hant
label: 체중관리 서비스 @ko
definition: This segment includes companies that offer weight loss programs that may include prepared meals, exercise programs, or calorie control methods.
notation: 1111101411
valid from: 2024-06-07

Personal Care Services
type: BicsLevel4SubIndustry
type: Classifier
type: NamedIndividual
is sub industry of: Consumer Services
is contemporary version of: http://data.ga-group.nl/ics/bics/11111014
is version of: http://data.ga-group.nl/ics/bics/11111014
replaces: http://data.ga-group.nl/ics/bics/2020/11111014
imported on: 2026-06-08T13:40:52.236Z
last refreshed on: 2026-06-08T13:41:38.450Z
source accessed on: 2024-06-05T14:42:36Z
source last accessed on: 2024-06-05T14:42:36Z
label: Körperpflegedienste @de
label: Serv cuidados pessoais @pt
label: Services soins personnels @fr
label: Servicios personales @es
label: Servizi cura personale @it
label: Услуги по уходу за собой @ru
label: 个人护理服务 @zh
label: 個人保健服務 @zh-hant
label: 개인관리 서비스 @ko
label: ﾊﾟｰｿﾅﾙｹｱｻｰﾋﾞｽ @ja
definition: This industry subgroup includes companies that provide services for personal wellness, including beauty salons and weight management services. This industry does not include fitness centers (see Fitness & Recreation Centers).
notation: 11111014
valid from: 2024-06-07

Photography Studios
type: BicsLevel5Segment
type: Classifier
type: NamedIndividual
is level5 segment of: Photography Services
is contemporary version of: http://data.ga-group.nl/ics/bics/1111101510
is version of: http://data.ga-group.nl/ics/bics/1111101510
replaces: http://data.ga-group.nl/ics/bics/2020/1111101510
imported on: 2026-06-08T13:40:52.236Z
last refreshed on: 2026-06-08T13:41:38.450Z
source accessed on: 2024-06-05T14:42:36Z
source last accessed on: 2024-06-05T14:42:36Z
label: Estúdios de fotografia @pt
label: Estudio fotográfico @es
label: Foto-Studio @de
label: Studi fotografici @it
label: Studios de photographie @fr
label: Фотостудии @ru
label: 写真ｽﾀｼﾞｵ @ja
label: 摄影工作室 @zh
label: 攝影工作室 @zh-hant
label: 사진 스튜디오 @ko
definition: This segment includes companies that operate photography studios or provide photography services. These companies may also process and print photos in various merchandise formats.
notation: 1111101510
valid from: 2024-06-07

Photo Printing Services
type: BicsLevel5Segment
type: Classifier
type: NamedIndividual
is level5 segment of: Photography Services
is contemporary version of: http://data.ga-group.nl/ics/bics/1111101511
is version of: http://data.ga-group.nl/ics/bics/1111101511
replaces: http://data.ga-group.nl/ics/bics/2020/1111101511
imported on: 2026-06-08T13:40:52.236Z
last refreshed on: 2026-06-08T13:41:38.450Z
source accessed on: 2024-06-05T14:42:36Z
source last accessed on: 2024-06-05T14:42:36Z
label: Fotodruckdienste @de
label: Serv impresión fotos @es
label: Serviços de revelação de fotos @pt
label: Servizi sviluppo foto @it
label: Tirage de photos @fr
label: Услуги печати фотографий @ru
label: 写真現像 @ja
label: 照片冲印服务 @zh
label: 相片沖印服務 @zh-hant
label: 사진 현상 서비스 @ko
definition: This segment includes companies that specialize in film development, processing, enlargement, and printing. Excludes companies that are involved in photography activities (see Photography Studios).
notation: 1111101511
valid from: 2024-06-07

Photography Services
type: BicsLevel4SubIndustry
type: Classifier
type: NamedIndividual
is sub industry of: Consumer Services
is contemporary version of: http://data.ga-group.nl/ics/bics/11111015
is version of: http://data.ga-group.nl/ics/bics/11111015
replaces: http://data.ga-group.nl/ics/bics/2020/11111015
imported on: 2026-06-08T13:40:52.236Z
last refreshed on: 2026-06-08T13:41:38.450Z
source accessed on: 2024-06-05T14:42:36Z
source last accessed on: 2024-06-05T14:42:36Z
label: Fotografiedienste @de
label: Serviços de fotografia @pt
label: Services de photographie @fr
label: Servicio de fotografía @es
label: Servizi totografici @it
label: Фотоуслуги @ru
label: 写真ｻｰﾋﾞｽ @ja
label: 摄影服务 @zh
label: 相片沖印服務 @zh-hant
label: 사진 서비스 @ko
definition: This industry subgroup includes companies that offer photography and videography services. Includes developing and printing services that utilize the photo in a retail product like picture books, cards, and coffee mugs.
notation: 11111015
valid from: 2024-06-07

Political Committees
type: BicsLevel4SubIndustry
type: Classifier
type: NamedIndividual
is sub industry of: Consumer Services
is contemporary version of: http://data.ga-group.nl/ics/bics/11111016
is version of: http://data.ga-group.nl/ics/bics/11111016
replaces: http://data.ga-group.nl/ics/bics/2020/11111016
imported on: 2026-06-08T13:40:52.236Z
last refreshed on: 2026-06-08T13:41:38.450Z
source accessed on: 2024-06-05T14:42:36Z
source last accessed on: 2024-06-05T14:42:36Z
label: Comités políticos @es
label: Comités politiques @fr
label: Comitês políticos @pt
label: Comitati di azione politica @it
label: Politische Kommitees @de
label: Политич. коммитеты @ru
label: 政治委员会 @zh
label: 政治委員会 @ja
label: 政治委員會 @zh-hant
label: 정치위원회 @ko
definition: This industry subgroup includes entities that collect and spend money in elections, or on political issues. These committees may be set up for candidates, corporations, trade associations, or by private citizens wishing to make independent expenditures.
notation: 11111016
valid from: 2024-06-07

Residential Contractors
type: BicsLevel4SubIndustry
type: Classifier
type: NamedIndividual
is sub industry of: Consumer Services
is contemporary version of: http://data.ga-group.nl/ics/bics/11111017
is version of: http://data.ga-group.nl/ics/bics/11111017
replaces: http://data.ga-group.nl/ics/bics/2020/11111017
imported on: 2026-06-08T13:40:52.236Z
last refreshed on: 2026-06-08T13:41:38.450Z
source accessed on: 2024-06-05T14:42:36Z
source last accessed on: 2024-06-05T14:42:36Z
label: Contratistas residenciales @es
label: Imprenditori residenziali @it
label: Sous-traitants - résidentiel @fr
label: Wohnungsbauauftragnehmer @de
label: 住宅承包商 @zh
label: 住宅改修 @ja
label: 주택도급업 @ko
definition: This industry subgroup includes companies that build additions or make alterations, renovations, or any other home improvements to residential buildings.
notation: 11111017
valid from: 2024-06-07

Consumer Goods Repair & Maint
type: BicsLevel5Segment
type: Classifier
type: NamedIndividual
is level5 segment of: Other Consumer Services
is contemporary version of: http://data.ga-group.nl/ics/bics/1111101810
is version of: http://data.ga-group.nl/ics/bics/1111101810
replaces: http://data.ga-group.nl/ics/bics/2020/1111101810
imported on: 2026-06-08T13:40:52.236Z
last refreshed on: 2026-06-08T13:41:38.450Z
source accessed on: 2024-06-05T14:42:36Z
source last accessed on: 2024-06-05T14:42:36Z
label: Entretien/répar biens de consommation @fr
label: Konsumgüter, Rep. & Wartung @de
label: Reparación y mantenimiento bienes de consumo @es
label: Reparos e manut de bens pessoais @pt
label: Riparazione e manut beni consumo @it
label: Ремонт и обслуж. потребит. товаров @ru
label: 家庭用品修理･保守 @ja
label: 消費用品維修及保養 @zh-hant
label: 消費用品���修及保養 @zh-hant
label: 消费品修理与维护 @zh
label: 소비재 수리 & 유지보수 @ko
definition: This segment includes companies that provide repair and maintenance services for consumer goods, such as household appliances, watches, and consumer electronics.
notation: 1111101810
valid from: 2024-06-07

Laundry Services
type: BicsLevel5Segment
type: Classifier
type: NamedIndividual
is level5 segment of: Other Consumer Services
is contemporary version of: http://data.ga-group.nl/ics/bics/1111101811
is version of: http://data.ga-group.nl/ics/bics/1111101811
replaces: http://data.ga-group.nl/ics/bics/2020/1111101811
imported on: 2026-06-08T13:40:52.236Z
last refreshed on: 2026-06-08T13:41:38.450Z
source accessed on: 2024-06-05T14:42:36Z
source last accessed on: 2024-06-05T14:42:36Z
label: Serviços de lavanderia @pt
label: Services de blanchissage @fr
label: Servicios de lavandería @es
label: Servizi di lavanderia @it
label: Wäschereidienste @de
label: Услуги прачечной @ru
label: 干洗服务 @zh
label: 洗衣服務 @zh-hant
label: 세탁 서비스 @ko
label: ﾗﾝﾄﾞﾘｰｻｰﾋﾞｽ @ja
definition: This segment includes companies that provide laundering or dry cleaning services. These companies may operate self-service laundromats or provide outsourced linen and garment cleaning services for commercial customers.
notation: 1111101811
valid from: 2024-06-07

Other Consumer Services
type: BicsLevel4SubIndustry
type: Classifier
type: NamedIndividual
is sub industry of: Consumer Services
is contemporary version of: http://data.ga-group.nl/ics/bics/11111018
is version of: http://data.ga-group.nl/ics/bics/11111018
replaces: http://data.ga-group.nl/ics/bics/2020/11111018
imported on: 2026-06-08T13:40:52.236Z
last refreshed on: 2026-06-08T13:41:38.450Z
source accessed on: 2024-06-05T14:42:36Z
source last accessed on: 2024-06-05T14:42:36Z
label: Altri servizi consumatore @it
label: Autres services aux consomm @fr
label: Otros servicios al consumidor @es
label: Outros serv ao consumidor @pt
label: Sonstige Verbraucherdienste @de
label: Проч. потребительские услуги @ru
label: その他消費者ｻｰﾋﾞｽ @ja
label: 其他消費者服務 @zh-hant
label: 其他消费服务 @zh
label: 기타 고객 서비스 @ko
definition: This industry subgroup includes companies that provide laundry services, consumer goods repair services, remodeling services, and consumer services not elsewhere classified.
notation: 11111018
valid from: 2024-06-07

Consumer Services
type: BicsLevel3Industry
type: Classifier
type: NamedIndividual
is industry of: Consumer Discretionary Services
is contemporary version of: http://data.ga-group.nl/ics/bics/111110
is version of: http://data.ga-group.nl/ics/bics/111110
replaces: http://data.ga-group.nl/ics/bics/2020/111110
imported on: 2026-06-08T13:40:52.236Z
last refreshed on: 2026-06-08T13:41:38.450Z
source accessed on: 2024-06-05T14:42:36Z
source last accessed on: 2024-06-05T14:42:36Z
label: Serv ao consumidor @pt
label: Services aux consomm @fr
label: Servicios al consumidor @es
label: Servizi consumatore @it
label: Verbraucherdienste @de
label: Потребительские услуги @ru
label: 消費者服務 @zh-hant
label: 消費者ｻｰﾋﾞｽ @ja
label: 消费者服务 @zh
label: 고객 서비스 @ko
definition: This industry includes companies that provide consumer services for non-transportation, non-leisure, or non-entertainment purposes.
notation: 111110
valid from: 2024-06-07

Casinos
type: BicsLevel5Segment
type: Classifier
type: NamedIndividual
is level5 segment of: Casinos & Gaming
is contemporary version of: http://data.ga-group.nl/ics/bics/1111111010
is version of: http://data.ga-group.nl/ics/bics/1111111010
replaces: http://data.ga-group.nl/ics/bics/2020/1111111010
imported on: 2026-06-08T13:40:52.236Z
last refreshed on: 2026-06-08T13:41:38.450Z
source accessed on: 2024-06-05T14:42:36Z
source last accessed on: 2024-06-05T14:42:36Z
label: Casino' @it
label: Casinos (no hoteles) @es
label: Kasinos @de
label: Казино @ru
label: 賭場(賭場飯店除外) @zh-hant
label: 赌场(除赌场旅馆外) @zh
label: 카지노 @ko
label: ｶｼﾞﾉ @ja
definition: This segment includes companies that own and operate gambling facilities.
notation: 1111111010
valid from: 2024-06-07

Gaming Equipment
type: BicsLevel5Segment
type: Classifier
type: NamedIndividual
is level5 segment of: Casinos & Gaming
is contemporary version of: http://data.ga-group.nl/ics/bics/1111111011
is version of: http://data.ga-group.nl/ics/bics/1111111011
replaces: http://data.ga-group.nl/ics/bics/2020/1111111011
imported on: 2026-06-08T13:40:52.236Z
last refreshed on: 2026-06-08T13:41:38.450Z
source accessed on: 2024-06-05T14:42:36Z
source last accessed on: 2024-06-05T14:42:36Z
label: Apparecchiature giochi @it
label: Equipamentos para jogos @pt
label: Equipement de jeu @fr
label: Equipo de juegos @es
label: Gaming-Equipment @de
label: Игровое оборудование @ru
label: 博弈設備 @zh-hant
label: 博彩设备 @zh
label: 게임 장비 @ko
label: ｹﾞｰﾐﾝｸﾞ機器 @ja
definition: This segment includes companies that manufacture or lease gaming equipment.
notation: 1111111011
valid from: 2024-06-07

Mobile & Online Gambling
type: BicsLevel5Segment
type: Classifier
type: NamedIndividual
is level5 segment of: Casinos & Gaming
is contemporary version of: http://data.ga-group.nl/ics/bics/1111111012
is version of: http://data.ga-group.nl/ics/bics/1111111012
replaces: http://data.ga-group.nl/ics/bics/2020/1111111012
imported on: 2026-06-08T13:40:52.236Z
last refreshed on: 2026-06-08T13:41:38.450Z
source accessed on: 2024-06-05T14:42:36Z
source last accessed on: 2024-06-05T14:42:36Z
label: Apuestas en línea y móviles @es
label: Gioco d'azzardo online e mobile @it
label: Jeux sur appareils mobiles et en ligne @fr
label: Jogos de apostas online @pt
label: Mobiles & Online-Glücksspiel @de
label: Мобильные и онлайн азартные игры @ru
label: 移动电话及在线赌博 @zh
label: 行動及線上博奕 @zh-hant
label: 모바일 & 온라인 도박 @ko
label: ﾓﾊﾞｲﾙ･ｵﾝﾗｲﾝｷﾞｬﾝﾌﾞﾙ @ja
definition: This segment includes companies that provide gambling services through Internet or mobile devices.
notation: 1111111012
valid from: 2024-06-07

Lottery Services
type: BicsLevel5Segment
type: Classifier
type: NamedIndividual
is level5 segment of: Casinos & Gaming
is contemporary version of: http://data.ga-group.nl/ics/bics/1111111013
is version of: http://data.ga-group.nl/ics/bics/1111111013
replaces: http://data.ga-group.nl/ics/bics/2020/1111111013
imported on: 2026-06-08T13:40:52.236Z
last refreshed on: 2026-06-08T13:41:38.450Z
source accessed on: 2024-06-05T14:42:36Z
source last accessed on: 2024-06-05T14:42:36Z
label: Lotteriedienstleistungen @de
label: Serviços lotéricos @pt
label: Services de lotterie @fr
label: Servicios de lotería @es
label: Servizi lotteria @it
label: Услуги лотереи @ru
label: 宝くじｻｰﾋﾞｽ @ja
label: 宝く���ｻｰﾋﾞｽ @ja
label: 彩券服務 @zh-hant
label: 彩票服务 @zh
label: 복권 서비스 @ko
definition: This segment includes companies that operate a lottery system.
notation: 1111111013
valid from: 2024-06-07

Racetracks
type: BicsLevel5Segment
type: Classifier
type: NamedIndividual
is level5 segment of: Casinos & Gaming
is contemporary version of: http://data.ga-group.nl/ics/bics/1111111014
is version of: http://data.ga-group.nl/ics/bics/1111111014
replaces: http://data.ga-group.nl/ics/bics/2020/1111111014
imported on: 2026-06-08T13:40:52.236Z
last refreshed on: 2026-06-08T13:41:38.450Z
source accessed on: 2024-06-05T14:42:36Z
source last accessed on: 2024-06-05T14:42:36Z
label: Champs de course @fr
label: Circuitos carreras @es
label: Pistas de corrida @pt
label: Piste @it
label: Rennbahnen @de
label: Гоночные треки @ru
label: 賽場 @zh-hant
label: 赛马 @zh
label: 레이스장 @ko
label: ﾚｰｽ場 @ja
definition: This segment includes companies that operate racetrack facilities.
notation: 1111111014
valid from: 2024-06-07

Betting
type: BicsLevel5Segment
type: Classifier
type: NamedIndividual
is level5 segment of: Casinos & Gaming
is contemporary version of: http://data.ga-group.nl/ics/bics/1111111015
is version of: http://data.ga-group.nl/ics/bics/1111111015
replaces: http://data.ga-group.nl/ics/bics/2020/1111111015
imported on: 2026-06-08T13:40:52.236Z
last refreshed on: 2026-06-08T13:41:38.450Z
source accessed on: 2024-06-05T14:42:36Z
source last accessed on: 2024-06-05T14:42:36Z
label: Apostas @pt
label: Apuestas @es
label: Paris @fr
label: Scommesse @it
label: Wetten @de
label: Пари @ru
label: 博彩 @zh
label: 投注 @zh-hant
label: 賭博 @ja
label: 베팅 @ko
definition: This segment includes companies that provide betting services, at betting shops, or over the phone via call centers. Includes sports betting and off-racetrack betting. Excludes betting services provided through the Internet (see Mobile & Online Gambling).
notation: 1111111015
valid from: 2024-06-07

Casinos & Gaming
type: BicsLevel4SubIndustry
type: Classifier
type: NamedIndividual
is sub industry of: Leisure Facilities & Services
is contemporary version of: http://data.ga-group.nl/ics/bics/11111110
is version of: http://data.ga-group.nl/ics/bics/11111110
replaces: http://data.ga-group.nl/ics/bics/2020/11111110
imported on: 2026-06-08T13:40:52.236Z
last refreshed on: 2026-06-08T13:41:38.450Z
source accessed on: 2024-06-05T14:42:36Z
source last accessed on: 2024-06-05T14:42:36Z
label: Casino' e gioco d'azzardo @it
label: Casinos y juegos @es
label: Casinos/jeu @fr
label: Cassinos e jogos @pt
label: Kasinos&Spielen @de
label: Казино и игры @ru
label: 賭場及博弈 @zh-hant
label: 赌场和博彩 @zh
label: 카지노 & 게이밍 @ko
label: ｶｼﾞﾉ･ｹﾞｰﾐﾝｸﾞ @ja
definition: This industry subgroup includes companies that provide casino gaming without lodging. Also includes online gaming, racetracks, gaming equipment manufacturers and lottery services.
notation: 11111110
valid from: 2024-06-07

Cruise Lines
type: BicsLevel4SubIndustry
type: Classifier
type: NamedIndividual
is sub industry of: Leisure Facilities & Services
is contemporary version of: http://data.ga-group.nl/ics/bics/11111111
is version of: http://data.ga-group.nl/ics/bics/11111111
replaces: http://data.ga-group.nl/ics/bics/2020/11111111
imported on: 2026-06-08T13:40:52.236Z
last refreshed on: 2026-06-08T13:41:38.450Z
source accessed on: 2024-06-05T14:42:36Z
source last accessed on: 2024-06-05T14:42:36Z
label: Croisières @fr
label: Kreuzfahrtlinien @de
label: Líneas de cruceros @es
label: Linee di crociera @it
label: Linhas de cruzeiro @pt
label: Круизные линии @ru
label: 海上旅客輸送 @ja
label: 游轮公司 @zh
label: 郵輪 @zh-hant
label: 유람선 @ko
definition: This industry subgroup includes companies that provide transportation and leisure entertainment, such as deep sea cruises and river cruises.
notation: 11111111
valid from: 2024-06-07

Food & Beverage Rev - Hotels
type: BicsLevel6Segment
type: Classifier
type: NamedIndividual
is level6 segment of: Hotel & Motel (excl Casino Hotel)
is contemporary version of: http://data.ga-group.nl/ics/bics/111111121010
is version of: http://data.ga-group.nl/ics/bics/111111121010
replaces: http://data.ga-group.nl/ics/bics/2020/111111121010
imported on: 2026-06-08T13:40:52.236Z
last refreshed on: 2026-06-08T13:41:38.450Z
source accessed on: 2024-06-05T14:42:36Z
source last accessed on: 2024-06-05T14:42:36Z
label: Erlös aus Speisen & Getränken - Hotels @de
label: Ingreso de alimento y bebidas - hoteles @es
label: Rec alimentos e bebidas - Hotéis @pt
label: Rev boissons et aliments - Hôtels @fr
label: Ric ristorazione - Alberghi @it
label: Врчк от еды и напитков - отели @ru
label: 食品与饮料收入-酒店 @zh
label: 食品及飲料收入-飯店 @zh-hant
label: 식음료 수익 - 호텔 @ko
label: ﾎﾃﾙ飲食収入 @ja
definition: This segment includes hotel revenue generated from food and beverage.
notation: 111111121010
valid from: 2024-06-07

Room Revenue - Hotels
type: BicsLevel6Segment
type: Classifier
type: NamedIndividual
is level6 segment of: Hotel & Motel (excl Casino Hotel)
is contemporary version of: http://data.ga-group.nl/ics/bics/111111121011
is version of: http://data.ga-group.nl/ics/bics/111111121011
replaces: http://data.ga-group.nl/ics/bics/2020/111111121011
imported on: 2026-06-08T13:40:52.236Z
last refreshed on: 2026-06-08T13:41:38.450Z
source accessed on: 2024-06-05T14:42:36Z
source last accessed on: 2024-06-05T14:42:36Z
label: Erlös aus Zimmern - Hotels @de
label: Ingreso de habitaciones - hoteles @es
label: Receita de quarto - Hotel @pt
label: Revenus des chambres - Hôtels @fr
label: Ricavi camere - Alberghi @it
label: Выручка за комнату - отели @ru
label: 客房收入-酒店 @zh
label: 房租收入-飯店 @zh-hant
label: 객실 수익 - 호텔 @ko
label: ﾎﾃﾙ室料収入 @ja
label: ���실 수익 - 호텔 @ko
definition: This segment includes hotel revenue generated from lodging.
notation: 111111121011
valid from: 2024-06-07

Time-Share Revenue - Hotels
type: BicsLevel6Segment
type: Classifier
type: NamedIndividual
is level6 segment of: Hotel & Motel (excl Casino Hotel)
is contemporary version of: http://data.ga-group.nl/ics/bics/111111121012
is version of: http://data.ga-group.nl/ics/bics/111111121012
replaces: http://data.ga-group.nl/ics/bics/2020/111111121012
imported on: 2026-06-08T13:40:52.236Z
last refreshed on: 2026-06-08T13:41:38.450Z
source accessed on: 2024-06-05T14:42:36Z
source last accessed on: 2024-06-05T14:42:36Z
label: Erlös aus Timesharing - Hotels @de
label: Ingreso de tiempo compartido - hoteles @es
label: Receita de time-share - Hotel @pt
label: Revenus de co-propriétés - Hôtels @fr
label: Ricavi Time-Share - Alberghi @it
label: Выручка от таймшер - отели @ru
label: 分时度假收入-旅店 @zh
label: 分時度假收入-飯店 @zh-hant
label: 사용공유 수익 - 호텔 @ko
label: ﾀｲﾑｼｪｱ収益 @ja
definition: This segment includes revenue from sales of vacation ownership or time-share units.
notation: 111111121012
valid from: 2024-06-07

Other Revenue - Hotels
type: BicsLevel6Segment
type: Classifier
type: NamedIndividual
is level6 segment of: Hotel & Motel (excl Casino Hotel)
is contemporary version of: http://data.ga-group.nl/ics/bics/111111121013
is version of: http://data.ga-group.nl/ics/bics/111111121013
replaces: http://data.ga-group.nl/ics/bics/2020/111111121013
imported on: 2026-06-08T13:40:52.236Z
last refreshed on: 2026-06-08T13:41:38.450Z
source accessed on: 2024-06-05T14:42:36Z
source last accessed on: 2024-06-05T14:42:36Z
label: Altri ricavi - Alberghi @it
label: Autres revenus - Hôtels @fr
label: Otro ingreso - hoteles @es
label: Outras receitas - Hotel @pt
label: Sonstiger Erlös - Hotels @de
label: Прочая выручка - отели @ru
label: その他ﾎﾃﾙ収入 @ja
label: 其他收入-酒店 @zh
label: 其他收入-飯店 @zh-hant
label: 기타 수익 - 호텔 @ko
definition: This segment includes hotel revenue generated from components other than room, food, or beverage.
notation: 111111121013
valid from: 2024-06-07

Hotel & Motel (excl Casino Hotel)
type: BicsLevel5Segment
type: Classifier
type: NamedIndividual
is level5 segment of: Lodging
is contemporary version of: http://data.ga-group.nl/ics/bics/1111111210
is version of: http://data.ga-group.nl/ics/bics/1111111210
replaces: http://data.ga-group.nl/ics/bics/2020/1111111210
imported on: 2026-06-08T13:40:52.236Z
last refreshed on: 2026-06-08T13:41:38.450Z
source accessed on: 2024-06-05T14:42:36Z
source last accessed on: 2024-06-05T14:42:36Z
label: Hôtels et motels (h hôtels-casinos) @fr
label: Hotéis e pousadas (ex hotel cassino) @pt
label: Hotel & Motel (exkl. Kasinohotel) @de
label: Hotel e motel (escl Hotel Casinò) @it
label: Hotel y motel (sin casino) @es
label: Гостиницы и мотели (искл. казино-отели) @ru
label: 酒店与汽车旅馆(除赌场酒店) @zh
label: 飯店及汽車旅館(賭場飯店除外) @zh-hant
label: 호텔 & 모텔(카지노 호텔제외) @ko
label: ﾎﾃﾙ･ﾓ-ﾃﾙ(除ｶｼﾞﾉﾎﾃﾙ) @ja
definition: This segment includes companies, excluding casino hotels, that provide short-term lodgings.
notation: 1111111210
valid from: 2024-06-07

Food & Bev Rev - Casino Hotels
type: BicsLevel6Segment
type: Classifier
type: NamedIndividual
is level6 segment of: Casino Hotels
is contemporary version of: http://data.ga-group.nl/ics/bics/111111121110
is version of: http://data.ga-group.nl/ics/bics/111111121110
replaces: http://data.ga-group.nl/ics/bics/2020/111111121110
imported on: 2026-06-08T13:40:52.236Z
last refreshed on: 2026-06-08T13:41:38.450Z
source accessed on: 2024-06-05T14:42:36Z
source last accessed on: 2024-06-05T14:42:36Z
label: Erl. aus Speisen & Getr. - Kasinohotels @de
label: Ingreso de alimento y bebidas - hoteles de casino @es
label: Rec alim e bebidas - Hotéis cassino @pt
label: Rev boissons et aliments - Hôtels-casinos @fr
label: Ric ristorazione - Hotel casinò @it
label: Врчк от еды и напитков - казино-отели @ru
label: 食品与饮料收入-赌场酒店 @zh
label: 食品及飲料收入-賭場飯店 @zh-hant
label: 식음료 수익 - 카지노 호텔 @ko
label: ｶｼﾞﾉﾎﾃﾙ飲食収入 @ja
definition: This segment includes casino hotel revenue generated from food and beverage.
notation: 111111121110
valid from: 2024-06-07

Room Revenue - Casino Hotels
type: BicsLevel6Segment
type: Classifier
type: NamedIndividual
is level6 segment of: Casino Hotels
is contemporary version of: http://data.ga-group.nl/ics/bics/111111121111
is version of: http://data.ga-group.nl/ics/bics/111111121111
replaces: http://data.ga-group.nl/ics/bics/2020/111111121111
imported on: 2026-06-08T13:40:52.236Z
last refreshed on: 2026-06-08T13:41:38.450Z
source accessed on: 2024-06-05T14:42:36Z
source last accessed on: 2024-06-05T14:42:36Z
label: Ingreso de habitaciones - hoteles de casinos @es
label: Receita de quarto - Hotéis cassino @pt
label: Revenus des chambres - Hôtels-casinos @fr
label: Ricavi camere - Hotel casinò @it
label: Zimmererlös - Kasinohotels @de
label: Выручка за комнату - казино-отели @ru
label: 客房收入-赌场酒店 @zh
label: 房租收入-賭場飯店 @zh-hant
label: 객실 수익 - 카지노 호텔 @ko
label: ｶｼﾞﾉﾎﾃﾙ室料収入 @ja
definition: This segment includes casino hotel revenue generated from lodging.
notation: 111111121111
valid from: 2024-06-07

Other Rev - Casino Hotels
type: BicsLevel6Segment
type: Classifier
type: NamedIndividual
is level6 segment of: Casino Hotels
is contemporary version of: http://data.ga-group.nl/ics/bics/111111121112
is version of: http://data.ga-group.nl/ics/bics/111111121112
replaces: http://data.ga-group.nl/ics/bics/2020/111111121112
imported on: 2026-06-08T13:40:52.236Z
last refreshed on: 2026-06-08T13:41:38.450Z
source accessed on: 2024-06-05T14:42:36Z
source last accessed on: 2024-06-05T14:42:36Z
label: Altri ric - Hotel casinò @it
label: Autres rev - Hôtels-casinos @fr
label: Otro ing-hoteles de casinos @es
label: Outras receitas - Hoteis cassino @pt
label: Sonst. Erlös - Kasinohotels @de
label: Пр. врчк - казино-отели @ru
label: その他ｶｼﾞﾉﾎﾃﾙ収入 @ja
label: 其他收入-賭場飯店 @zh-hant
label: 其他收入-赌场酒店 @zh
label: 기타 수익 - 카지노 호텔 @ko
label: 기타 수익 - 카지�� 호텔 @ko
definition: This segment includes casino hotel revenue attributed to the components other than room, food or beverage. Excludes gambling related revenues (see Casinos & Gaming).
notation: 111111121112
valid from: 2024-06-07

Casino Hotels
type: BicsLevel5Segment
type: Classifier
type: NamedIndividual
is level5 segment of: Lodging
is contemporary version of: http://data.ga-group.nl/ics/bics/1111111211
is version of: http://data.ga-group.nl/ics/bics/1111111211
replaces: http://data.ga-group.nl/ics/bics/2020/1111111211
imported on: 2026-06-08T13:40:52.236Z
last refreshed on: 2026-06-08T13:41:38.450Z
source accessed on: 2024-06-05T14:42:36Z
source last accessed on: 2024-06-05T14:42:36Z
label: Alberghi casino' @it
label: Casinos @es
label: Hôtels casino @fr
label: Hotéis-cassino @pt
label: Kasino-Hotels @de
label: Казино-отель @ru
label: 賭場旅館 @zh-hant
label: 赌场酒店 @zh
label: 카지노 호텔 @ko
label: ｶｼﾞﾉﾎﾃﾙ @ja
definition: This segment includes companies that provide short-term lodging in facilities with a casino on the premises.
notation: 1111111211
valid from: 2024-06-07

Bed & Breakfast Inns
type: BicsLevel5Segment
type: Classifier
type: NamedIndividual
is level5 segment of: Lodging
is contemporary version of: http://data.ga-group.nl/ics/bics/1111111212
is version of: http://data.ga-group.nl/ics/bics/1111111212
replaces: http://data.ga-group.nl/ics/bics/2020/1111111212
imported on: 2026-06-08T13:40:52.236Z
last refreshed on: 2026-06-08T13:41:38.450Z
source accessed on: 2024-06-05T14:42:36Z
source last accessed on: 2024-06-05T14:42:36Z
label: (민박)여관업 @ko
label: Bed e Breakfast @it
label: Gîtes touristiques @fr
label: Hotel garnis @de
label: Moteles con desayuno @es
label: Pousadas @pt
label: Мини-гостиницы @ru
label: 住宿加早餐的旅店 @zh
label: 民宿 @ja
definition: This segment includes companies that provide short-term lodging in a home-like setting where breakfast is provided.
notation: 1111111212
valid from: 2024-06-07

Lodging
type: BicsLevel4SubIndustry
type: Classifier
type: NamedIndividual
is sub industry of: Leisure Facilities & Services
is contemporary version of: http://data.ga-group.nl/ics/bics/11111112
is version of: http://data.ga-group.nl/ics/bics/11111112
replaces: http://data.ga-group.nl/ics/bics/2020/11111112
imported on: 2026-06-08T13:40:52.236Z
last refreshed on: 2026-06-08T13:41:38.450Z
source accessed on: 2024-06-05T14:42:36Z
source last accessed on: 2024-06-05T14:42:36Z
label: Alloggi @it
label: Alojamento @pt
label: Alojamiento @es
label: Hébergement @fr
label: Hotellerie @de
label: Гостиницы @ru
label: 住宿 @zh-hant
label: 宿泊施設 @ja
label: 旅店 @zh
label: 숙박 @ko
definition: This industry subgroup includes companies that provide temporary accommodation and usually charge a daily rate for their use.
notation: 11111112
valid from: 2024-06-07

Fast Casual Rest - Franchise
type: BicsLevel7Segment
type: Classifier
type: NamedIndividual
is level7 segment of: Fast Casual Restaurants
is contemporary version of: http://data.ga-group.nl/ics/bics/11111113101010
is version of: http://data.ga-group.nl/ics/bics/11111113101010
replaces: http://data.ga-group.nl/ics/bics/2020/11111113101010
imported on: 2026-06-08T13:40:52.236Z
last refreshed on: 2026-06-08T13:41:38.450Z
source accessed on: 2024-06-05T14:42:36Z
source last accessed on: 2024-06-05T14:42:36Z
label: Fast-Casual-Rest. - Franchise @de
label: Franquicia - rest de comida rápida informal @es
label: Restaur rapide - Franchise @fr
label: Restaurantes casuais - Franquia @pt
label: Ristorazione veloce - Franchise @it
label: Рестор. быстр. обслуж. - Франч. @ru
label: 休闲快餐厅-特许经营 @zh
label: 速食休閒餐廳 - 加盟 @zh-hant
label: 패스트 캐주얼 레스토랑 - 프랜차이즈 @ko
label: ﾌｧｽﾄｶｼﾞｭｱﾙﾚｽﾄﾗﾝ-ﾌﾗﾝﾁｬｲｽﾞ @ja
definition: This segment includes revenue that fast casual restaurants generate from their franchising operations such as revenue from licensing, royalties, or providing supplies and equipment to franchisees.
notation: 11111113101010
valid from: 2024-06-07

Fast Casual Rest - Owned
type: BicsLevel7Segment
type: Classifier
type: NamedIndividual
is level7 segment of: Fast Casual Restaurants
is contemporary version of: http://data.ga-group.nl/ics/bics/11111113101011
is version of: http://data.ga-group.nl/ics/bics/11111113101011
replaces: http://data.ga-group.nl/ics/bics/2020/11111113101011
imported on: 2026-06-08T13:40:52.236Z
last refreshed on: 2026-06-08T13:41:38.450Z
source accessed on: 2024-06-05T14:42:36Z
source last accessed on: 2024-06-05T14:42:36Z
label: Fast-Casual-Rest. - Eigentum @de
label: Propios - rest de comida rápida informal @es
label: Restaur rapide - Etablissements détenus @fr
label: Restaurantes casuais - Próprio @pt
label: Ristorazione veloce - Di proprietà @it
label: Рестор. быстр. обслуж.- Собств. @ru
label: 休闲快餐厅-自有店铺 @zh
label: 速食休閒餐廳 - 直營 @zh-hant
label: 패스트 캐주얼 레스토랑 - 자기매장 @ko
label: ﾌｧｽﾄｶｼﾞｭｱﾙﾚｽﾄﾗﾝ-直営店 @ja
definition: This segment includes revenue that fast casual restaurants generate from the operations of their company-owned restaurants.
notation: 11111113101011
valid from: 2024-06-07

Fast Casual Restaurants
type: BicsLevel6Segment
type: Classifier
type: NamedIndividual
is level6 segment of: Limited Service Restaurants
is contemporary version of: http://data.ga-group.nl/ics/bics/111111131010
is version of: http://data.ga-group.nl/ics/bics/111111131010
replaces: http://data.ga-group.nl/ics/bics/2020/111111131010
imported on: 2026-06-08T13:40:52.236Z
last refreshed on: 2026-06-08T13:41:38.450Z
source accessed on: 2024-06-05T14:42:36Z
source last accessed on: 2024-06-05T14:42:36Z
label: Fast-Casual-Restaurants @de
label: Restaurante de comida rápida informal @es
label: Restaurantes casuais @pt
label: Restauration rapide @fr
label: Ristorazione veloce @it
label: Рестор. быстр. обслуж. @ru
label: 休闲快餐厅 @zh
label: 速食休閒餐廳 @zh-hant
label: 패스트 캐주얼 레스토랑 @ko
label: 패스��� 캐주얼 레스토랑 @ko
label: ﾌｧｽﾄｶｼﾞｭｱﾙﾚｽﾄﾗﾝ @ja
definition: This segment includes restaurants that provide food services where food is made to order, often in front of the customer with customizable options. Patrons pay before self-seating in an upscale environment. Food and drink may be consumed on premises, taken out, or delivered.
notation: 111111131010
valid from: 2024-06-07

Fast Food Rest - Franchise
type: BicsLevel7Segment
type: Classifier
type: NamedIndividual
is level7 segment of: Fast Food Restaurants
is contemporary version of: http://data.ga-group.nl/ics/bics/11111113101110
is version of: http://data.ga-group.nl/ics/bics/11111113101110
replaces: http://data.ga-group.nl/ics/bics/2020/11111113101110
imported on: 2026-06-08T13:40:52.236Z
last refreshed on: 2026-06-08T13:41:38.450Z
source accessed on: 2024-06-05T14:42:36Z
source last accessed on: 2024-06-05T14:42:36Z
label: Fast Food - Franchise @it
label: Fast-Food-Rest. - Franchise @de
label: Franquicia - rest de comida rápida @es
label: Rest fast food - Franquia @pt
label: Restaur rapide - Franchises @fr
label: Рестор. быстрого питания - франшиза @ru
label: 快餐厅-特许经营 @zh
label: 速食餐廳-加盟 @zh-hant
label: 패스트푸드 음식점 - 프랜차이즈 @ko
label: ﾌｧｽﾄﾌｰﾄﾞﾚｽﾄﾗﾝ-ﾌﾗﾝﾁｬｲｽﾞ @ja
definition: This segment includes revenue that fast food restaurants generate from their franchising operations such as revenue from licensing, royalty, or providing supplies and equipment to franchisee owners.
notation: 11111113101110
valid from: 2024-06-07

Fast Food Rest - Owned
type: BicsLevel7Segment
type: Classifier
type: NamedIndividual
is level7 segment of: Fast Food Restaurants
is contemporary version of: http://data.ga-group.nl/ics/bics/11111113101111
is version of: http://data.ga-group.nl/ics/bics/11111113101111
replaces: http://data.ga-group.nl/ics/bics/2020/11111113101111
imported on: 2026-06-08T13:40:52.236Z
last refreshed on: 2026-06-08T13:41:38.450Z
source accessed on: 2024-06-05T14:42:36Z
source last accessed on: 2024-06-05T14:42:36Z
label: Fast Food - Di proprietà @it
label: Fast-Food-Rest. - In Besitz @de
label: Propios - rest de comida rápida @es
label: Rest fast food - Propriedade @pt
label: Restaur rapide - Détenu @fr
label: Рестор. быстрого питания - в собственности @ru
label: 快餐厅-自营 @zh
label: 速食餐廳-直營 @zh-hant
label: 패스트푸드 음식점 - 자가 @ko
label: ﾌｧｽﾄﾌｰﾄﾞﾚｽﾄﾗﾝ-直営店 @ja
definition: This segment includes revenue that fast food restaurants generate from the operations of their company-owned restaurants.
notation: 11111113101111
valid from: 2024-06-07

Fast Food Restaurants
type: BicsLevel6Segment
type: Classifier
type: NamedIndividual
is level6 segment of: Limited Service Restaurants
is contemporary version of: http://data.ga-group.nl/ics/bics/111111131011
is version of: http://data.ga-group.nl/ics/bics/111111131011
replaces: http://data.ga-group.nl/ics/bics/2020/111111131011
imported on: 2026-06-08T13:40:52.236Z
last refreshed on: 2026-06-08T13:41:38.450Z
source accessed on: 2024-06-05T14:42:36Z
source last accessed on: 2024-06-05T14:42:36Z
label: Fast Food @it
label: Fast-Food-Restaurants @de
label: Restaurantes de comida rápida @es
label: Restaurantes fast food @pt
label: Restauration rapide @fr
label: Рестораны быстрого питания @ru
label: 快餐店 @zh
label: 速食餐廳 @zh-hant
label: 패스트푸드 레스토랑 @ko
label: ﾌｧｽﾄﾌｰﾄﾞﾚｽﾄﾗﾝ @ja
definition: This segment includes restaurants that provide food services where patrons order their food and pay before eating. Food and drink may be consumed on premises, taken out, or delivered.
notation: 111111131011
valid from: 2024-06-07

Coffee & Snack - Franchise
type: BicsLevel7Segment
type: Classifier
type: NamedIndividual
is level7 segment of: Coffee & Snack
is contemporary version of: http://data.ga-group.nl/ics/bics/11111113101210
is version of: http://data.ga-group.nl/ics/bics/11111113101210
replaces: http://data.ga-group.nl/ics/bics/2020/11111113101210
imported on: 2026-06-08T13:40:52.236Z
last refreshed on: 2026-06-08T13:41:38.450Z
source accessed on: 2024-06-05T14:42:36Z
source last accessed on: 2024-06-05T14:42:36Z
label: Café e lanches - franquia @pt
label: Café et collations - franchise @fr
label: Café y tentempiés - franquicia @es
label: Caffè e snack - Franchising @it
label: Kaffee & Snacks - Franchise @de
label: Кофе и закуски - франшиза @ru
label: 咖啡与零食-特许经营 @zh
label: 咖啡及零食-加盟店 @zh-hant
label: 커피 & 스낵 - 프랜차이즈 @ko
label: ｺｰﾋｰ･ｽﾅｯｸ-ﾌﾗﾝﾁｬｲｽﾞ @ja
definition: This segment includes revenue that coffee and snack restaurants generate from their franchising operations, such as revenue from licensing, royalties, or providing supplies and equipment to franchisees.
notation: 11111113101210
valid from: 2024-06-07

Coffee & Snack - Owned
type: BicsLevel7Segment
type: Classifier
type: NamedIndividual
is level7 segment of: Coffee & Snack
is contemporary version of: http://data.ga-group.nl/ics/bics/11111113101211
is version of: http://data.ga-group.nl/ics/bics/11111113101211
replaces: http://data.ga-group.nl/ics/bics/2020/11111113101211
imported on: 2026-06-08T13:40:52.236Z
last refreshed on: 2026-06-08T13:41:38.450Z
source accessed on: 2024-06-05T14:42:36Z
source last accessed on: 2024-06-05T14:42:36Z
label: Café e lanches - próprios @pt
label: Café et collations - possédés @fr
label: Café y tentempiés - propietario @es
label: Caffè e snack - Di proprietà @it
label: Kaffee & Snacks - In Besitz @de
label: Кофе и закуски - в собств. @ru
label: 咖啡与零食-自营 @zh
label: 咖啡及零食-自有 @zh-hant
label: 커피 & 스낵 - 자가소유 @ko
label: ｺｰﾋｰ･ｽﾅｯｸ-直営店 @ja
definition: This segment includes revenue that coffee and snack restaurants generate from the operations of their company-owned restaurants.
notation: 11111113101211
valid from: 2024-06-07

Coffee & Snack
type: BicsLevel6Segment
type: Classifier
type: NamedIndividual
is level6 segment of: Limited Service Restaurants
is contemporary version of: http://data.ga-group.nl/ics/bics/111111131012
is version of: http://data.ga-group.nl/ics/bics/111111131012
replaces: http://data.ga-group.nl/ics/bics/2020/111111131012
imported on: 2026-06-08T13:40:52.236Z
last refreshed on: 2026-06-08T13:41:38.450Z
source accessed on: 2024-06-05T14:42:36Z
source last accessed on: 2024-06-05T14:42:36Z
label: Café e lanches @pt
label: Café et collations @fr
label: Café y tentempiés @es
label: Caffè e snack @it
label: Kaffee & Snacks @de
label: Кофе и закуски @ru
label: 咖啡与零食 @zh
label: 咖啡及零食 @zh-hant
label: 커피 & 스낵 @ko
label: ｺｰﾋｰ･ｽﾅｯｸ @ja
definition: This segment includes companies that prepare and/or serve specialty snacks such as ice cream, frozen yogurt, cookies or popcorn, or serve nonalcoholic beverages, such as coffee, juices, sodas, or smoothies.
notation: 111111131012
valid from: 2024-06-07

Bars & Taverns
type: BicsLevel6Segment
type: Classifier
type: NamedIndividual
is level6 segment of: Limited Service Restaurants
is contemporary version of: http://data.ga-group.nl/ics/bics/111111131013
is version of: http://data.ga-group.nl/ics/bics/111111131013
replaces: http://data.ga-group.nl/ics/bics/2020/111111131013
imported on: 2026-06-08T13:40:52.236Z
last refreshed on: 2026-06-08T13:41:38.450Z
source accessed on: 2024-06-05T14:42:36Z
source last accessed on: 2024-06-05T14:42:36Z
label: Bar e taverne @it
label: Bares e tavernas @pt
label: Bares y cantinas @es
label: Bars & Kneipen @de
label: Bars et tavernes @fr
label: Бары и таверны @ru
label: 酒吧与酒馆 @zh
label: 酒吧及小酒館 @zh-hant
label: 酒場 @ja
label: 바 & 주점 @ko
definition: This segment includes companies that operate bars, taverns, nightclubs, or other drinking establishments. Such companies may also provide limited food services.
notation: 111111131013
valid from: 2024-06-07

Limited Service Restaurants
type: BicsLevel5Segment
type: Classifier
type: NamedIndividual
is level5 segment of: Restaurantes
is contemporary version of: http://data.ga-group.nl/ics/bics/1111111310
is version of: http://data.ga-group.nl/ics/bics/1111111310
replaces: http://data.ga-group.nl/ics/bics/2020/1111111310
imported on: 2026-06-08T13:40:52.236Z
last refreshed on: 2026-06-08T13:41:38.450Z
source accessed on: 2024-06-05T14:42:36Z
source last accessed on: 2024-06-05T14:42:36Z
label: Restaurantes de serviço limitado @pt
label: Restaurantes de servicio limitado @es
label: Restaurants mit begrenztem Service @de
label: Restaurants service limité @fr
label: Ristoranti a servizio limitato @it
label: Рестораны с ограниченным обслуживанием @ru
label: 小型餐飲店 @zh-hant
label: 有限服务餐厅 @zh
label: 한정서비스 음식점 @ko
label: ｾﾙﾌｻｰﾋﾞｽﾚｽﾄﾗﾝ @ja
definition: This segment includes establishments that provide food services where patrons generally order or select items and pay before eating. Food and drink may be consumed on premises, taken out, or delivered.
notation: 1111111310
valid from: 2024-06-07

Casual Rest - Franchise
type: BicsLevel7Segment
type: Classifier
type: NamedIndividual
is level7 segment of: Casual Restaurants
is contemporary version of: http://data.ga-group.nl/ics/bics/11111113111010
is version of: http://data.ga-group.nl/ics/bics/11111113111010
replaces: http://data.ga-group.nl/ics/bics/2020/11111113111010
imported on: 2026-06-08T13:40:52.236Z
last refreshed on: 2026-06-08T13:41:38.450Z
source accessed on: 2024-06-05T14:42:36Z
source last accessed on: 2024-06-05T14:42:36Z
label: Franquicia - rest informal @es
label: Rest casuais - Franquia @pt
label: Restaurants familiaux - Franch @fr
label: Ristor informali - Franchise @it
label: Zwangloses Rest. - Franchise @de
label: Повседн. рестораны - франшиза @ru
label: 休閒家庭式餐廳-加盟 @zh-hant
label: 休闲餐厅-特许经营 @zh
label: 캐주얼 레스토랑- 프랜차이즈 @ko
label: ｶｼﾞｭｱﾙﾚｽﾄﾗﾝ-ﾌﾗﾝﾁｬｲｽﾞ @ja
definition: This segment includes revenue that casual restaurants generate from their franchising operations, such as revenue from licensing, royalties, or providing supplies and equipment to franchisees.
notation: 11111113111010
valid from: 2024-06-07

Casual Rest - Owned
type: BicsLevel7Segment
type: Classifier
type: NamedIndividual
is level7 segment of: Casual Restaurants
is contemporary version of: http://data.ga-group.nl/ics/bics/11111113111011
is version of: http://data.ga-group.nl/ics/bics/11111113111011
replaces: http://data.ga-group.nl/ics/bics/2020/11111113111011
imported on: 2026-06-08T13:40:52.236Z
last refreshed on: 2026-06-08T13:41:38.450Z
source accessed on: 2024-06-05T14:42:36Z
source last accessed on: 2024-06-05T14:42:36Z
label: Propios - rest informal @es
label: Rest casuais - Propriedade @pt
label: Restaurants familiaux - Dét @fr
label: Ristor informali - Di proprietà @it
label: Zwangloses Rest. - In Besitz @de
label: Повседн. рестораны - в собственности @ru
label: 休閒家庭式餐廳-直營 @zh-hant
label: 休闲餐厅-自营 @zh
label: 캐주얼 레스토랑 - 자가 @ko
label: ｶｼﾞｭｱﾙﾚｽﾄﾗﾝ-直営店 @ja
definition: This segment includes revenue that casual restaurants generate from the operations of their company-owned restaurants.
notation: 11111113111011
valid from: 2024-06-07

Casual Restaurants
type: BicsLevel6Segment
type: Classifier
type: NamedIndividual
is level6 segment of: Full Service Restaurants
is contemporary version of: http://data.ga-group.nl/ics/bics/111111131110
is version of: http://data.ga-group.nl/ics/bics/111111131110
replaces: http://data.ga-group.nl/ics/bics/2020/111111131110
imported on: 2026-06-08T13:40:52.236Z
last refreshed on: 2026-06-08T13:41:38.450Z
source accessed on: 2024-06-05T14:42:36Z
source last accessed on: 2024-06-05T14:42:36Z
label: Restaurantes casuais @pt
label: Restaurantes informales @es
label: Restaurants familiaux @fr
label: Ristoranti informali @it
label: Повседневные рестораны @ru
label: 休閒家庭式全套服務餐廳 @zh-hant
label: 休闲餐厅 @zh
label: 캐주얼 레스토랑 @ko
label: ｶｼﾞｭｱﾙﾚｽﾄﾗﾝ @ja
definition: This segment includes low to mid-priced restaurants that provide food services to patrons who order their food, are served by wait staff while seated, and pay after eating.
notation: 111111131110
valid from: 2024-06-07

Upscale Rest - Franchise
type: BicsLevel7Segment
type: Classifier
type: NamedIndividual
is level7 segment of: Upscale Restaurants
is contemporary version of: http://data.ga-group.nl/ics/bics/11111113111110
is version of: http://data.ga-group.nl/ics/bics/11111113111110
replaces: http://data.ga-group.nl/ics/bics/2020/11111113111110
imported on: 2026-06-08T13:40:52.236Z
last refreshed on: 2026-06-08T13:41:38.450Z
source accessed on: 2024-06-05T14:42:36Z
source last accessed on: 2024-06-05T14:42:36Z
label: Gehobene Rest. - Franchise @de
label: Rest sofisticado - Franquia @pt
label: Restaurantes de lujo - franquicia @es
label: Restaurants ht de gamme- Franch @fr
label: Ristor formali - Franchise @it
label: Элитн. рестораны - франшиза @ru
label: 高档餐厅-特许经营 @zh
label: 高級餐廳-加盟 @zh-hant
label: 高級ﾚｽﾄﾗﾝ-ﾌﾗﾝﾁｬｲｽﾞ @ja
label: 고급 레스토랑 - 프랜차이즈 @ko
definition: This segment includes revenue that upscale restaurants generate from their franchising operations, such as revenue from licensing, royalties, or providing supplies and equipment to franchisees.
notation: 11111113111110
valid from: 2024-06-07

Upscale Rest - Owned
type: BicsLevel7Segment
type: Classifier
type: NamedIndividual
is level7 segment of: Upscale Restaurants
is contemporary version of: http://data.ga-group.nl/ics/bics/11111113111111
is version of: http://data.ga-group.nl/ics/bics/11111113111111
replaces: http://data.ga-group.nl/ics/bics/2020/11111113111111
imported on: 2026-06-08T13:40:52.236Z
last refreshed on: 2026-06-08T13:41:38.450Z
source accessed on: 2024-06-05T14:42:36Z
source last accessed on: 2024-06-05T14:42:36Z
label: Gehobene Rest. - In Besitz @de
label: Rest sofisticado - Propriedade @pt
label: Restaurantes de lujo - propios @es
label: Restaurants ht de gamme- Dét @fr
label: Ristor formali - Di proprietà @it
label: Элитн. рестораны - в собственности @ru
label: 高档餐厅-自营 @zh
label: 高級餐廳-直營 @zh-hant
label: 高級ﾚｽﾄﾗﾝ-直営店 @ja
label: 고급 레스토랑 - 자가 @ko
definition: This segment includes revenue that upscale restaurants generate from the operations of their company-owned restaurants.
notation: 11111113111111
valid from: 2024-06-07

Upscale Restaurants
type: BicsLevel6Segment
type: Classifier
type: NamedIndividual
is level6 segment of: Full Service Restaurants
is contemporary version of: http://data.ga-group.nl/ics/bics/111111131111
is version of: http://data.ga-group.nl/ics/bics/111111131111
replaces: http://data.ga-group.nl/ics/bics/2020/111111131111
imported on: 2026-06-08T13:40:52.236Z
last refreshed on: 2026-06-08T13:41:38.450Z
source accessed on: 2024-06-05T14:42:36Z
source last accessed on: 2024-06-05T14:42:36Z
label: Gehobene Restaurants @de
label: Restaurantes de lujo @es
label: Restaurantes de luxo @pt
label: Restaurants haut de gamme @fr
label: Ristoranti formali @it
label: Элитные рестораны @ru
label: 高档餐厅 @zh
label: 高級全套服務餐廳 @zh-hant
label: 高級ﾚｽﾄﾗﾝ @ja
label: 고급 레스토랑 @ko
definition: This segment includes high-priced restaurants that provide food services to patrons who order their food, are served by wait staff while seated and pay after eating.
notation: 111111131111
valid from: 2024-06-07

Full Service Restaurants
type: BicsLevel5Segment
type: Classifier
type: NamedIndividual
is level5 segment of: Restaurantes
is contemporary version of: http://data.ga-group.nl/ics/bics/1111111311
is version of: http://data.ga-group.nl/ics/bics/1111111311
replaces: http://data.ga-group.nl/ics/bics/2020/1111111311
imported on: 2026-06-08T13:40:52.236Z
last refreshed on: 2026-06-08T13:41:38.450Z
source accessed on: 2024-06-05T14:42:36Z
source last accessed on: 2024-06-05T14:42:36Z
label: Full-Service-Restaurants @de
label: Restaurantes de serviço completo @pt
label: Restaurantes de servicio completo @es
label: Restaurants service complet @fr
label: Ristoranti a servizio completo @it
label: Рестораны с полным обслуживанием @ru
label: 全套服務餐廳 @zh-hant
label: 全方位服务餐厅 @zh
label: 풀서비스 레스토랑 @ko
label: 풀서비스 레스토��� @ko
label: ﾌﾙｻｰﾋﾞｽﾚｽﾄﾗﾝ @ja
definition: This segment includes restaurants that provide food services to patrons who order their food, are served by wait staff while seated, and pay after eating.
notation: 1111111311
valid from: 2024-06-07

Restaurantes
type: BicsLevel4SubIndustry
type: Classifier
type: NamedIndividual
is sub industry of: Leisure Facilities & Services
is contemporary version of: http://data.ga-group.nl/ics/bics/11111113
is version of: http://data.ga-group.nl/ics/bics/11111113
replaces: http://data.ga-group.nl/ics/bics/2020/11111113
imported on: 2026-06-08T13:40:52.236Z
last refreshed on: 2026-06-08T13:41:38.450Z
source accessed on: 2024-06-05T14:42:36Z
source last accessed on: 2024-06-05T14:42:36Z
label: Restaurants
label: Ristoranti @it
label: Рестораны @ru
label: 餐廳 @zh-hant
label: 餐饮业 @zh
label: 식당업 @ko
label: ﾚｽﾄﾗﾝ @ja
label: ﾚ���ﾄﾗﾝ @ja
definition: This industry subgroup includes companies that prepare, serve, or provide food for immediate consumption. The facilities can be seated, takeout, mobile vehicles, or carts.
notation: 11111113
valid from: 2024-06-07

Adult Nightclubs
type: BicsLevel5Segment
type: Classifier
type: NamedIndividual
is level5 segment of: Entertainment Facilities
is contemporary version of: http://data.ga-group.nl/ics/bics/1111111410
is version of: http://data.ga-group.nl/ics/bics/1111111410
replaces: http://data.ga-group.nl/ics/bics/2020/1111111410
imported on: 2026-06-08T13:40:52.236Z
last refreshed on: 2026-06-08T13:41:38.450Z
source accessed on: 2024-06-05T14:42:36Z
source last accessed on: 2024-06-05T14:42:36Z
label: Casa noturna @pt
label: Centros nocturnos @es
label: Erotikclub @de
label: Nightclub @it
label: Nightclubs adultes @fr
label: Ночные клубы для взрослых @ru
label: 成人夜总会 @zh
label: 成人夜總會 @zh-hant
label: 성인 나이트클럽 @ko
label: ﾅｲﾄｸﾗﾌﾞ @ja
definition: This segment includes companies that operate adult nightclubs.
notation: 1111111410
valid from: 2024-06-07

Amusement Arcades
type: BicsLevel6Segment
type: Classifier
type: NamedIndividual
is level6 segment of: Amusement & Theme Parks
is contemporary version of: http://data.ga-group.nl/ics/bics/111111141110
is version of: http://data.ga-group.nl/ics/bics/111111141110
replaces: http://data.ga-group.nl/ics/bics/2020/111111141110
imported on: 2026-06-08T13:40:52.236Z
last refreshed on: 2026-06-08T13:41:38.450Z
source accessed on: 2024-06-05T14:42:36Z
source last accessed on: 2024-06-05T14:42:36Z
label: Ferias atracciones @es
label: Salões de jogos @pt
label: Sale videogiochi @it
label: Salles jeux électro. @fr
label: Spielhallen @de
label: Залы игровых автоматов @ru
label: 娯楽ｱｰｹｰﾄﾞ @ja
label: 游乐场 @zh
label: 遊樂庭園 @zh-hant
label: 전자게임장운영업 @ko
definition: This segment includes companies that operate amusement arcades.
notation: 111111141110
valid from: 2024-06-07

Amuse Theme Parks
type: BicsLevel6Segment
type: Classifier
type: NamedIndividual
is level6 segment of: Amusement & Theme Parks
is contemporary version of: http://data.ga-group.nl/ics/bics/111111141111
is version of: http://data.ga-group.nl/ics/bics/111111141111
replaces: http://data.ga-group.nl/ics/bics/2020/111111141111
imported on: 2026-06-08T13:40:52.236Z
last refreshed on: 2026-06-08T13:41:38.450Z
source accessed on: 2024-06-05T14:42:36Z
source last accessed on: 2024-06-05T14:42:36Z
label: Lunapark e parchi divertimento @it
label: Parcs d'attractions et arcades @fr
label: Parques temáticos e de jogos @pt
label: Parques y ferias atracciones @es
label: Vergnügungsparks & Spielhallen @de
label: Парки развлечений и отдыха @ru
label: 游乐场与主题公园 @zh
label: 遊園地･ﾃｰﾏﾊﾟｰｸ @ja
label: 遊樂及主題樂園 @zh-hant
label: 유원지 테마파크&아케이드 @ko
definition: This segment includes companies that operate theme park facilities.
notation: 111111141111
valid from: 2024-06-07

Amusement & Theme Parks
type: BicsLevel5Segment
type: Classifier
type: NamedIndividual
is level5 segment of: Entertainment Facilities
is contemporary version of: http://data.ga-group.nl/ics/bics/1111111411
is version of: http://data.ga-group.nl/ics/bics/1111111411
replaces: http://data.ga-group.nl/ics/bics/2020/1111111411
imported on: 2026-06-08T13:40:52.236Z
last refreshed on: 2026-06-08T13:41:38.450Z
source accessed on: 2024-06-05T14:42:36Z
source last accessed on: 2024-06-05T14:42:36Z
label: Arcades et parcs thématiques @fr
label: Lunapark e parchi a tema @it
label: Parques de atracciones y centros de entretenimiento @es
label: Parques de diversão e parques temáticos @pt
label: Vergnügungs- & Themenparks @de
label: Парки развлечений и отдыха @ru
label: 娛樂及主題樂園 @zh-hant
label: 游乐场与主题公园 @zh
label: 遊園地･ﾃｰﾏﾊﾟｰｸ･ｱｰｹｰﾄﾞ @ja
label: 놀이공원 & 테마파크 @ko
definition: This segment includes companies that operate theme park facilities and amusement arcades.
notation: 1111111411
valid from: 2024-06-07

Entertainment Ticket Agencies
type: BicsLevel5Segment
type: Classifier
type: NamedIndividual
is level5 segment of: Entertainment Facilities
is contemporary version of: http://data.ga-group.nl/ics/bics/1111111412
is version of: http://data.ga-group.nl/ics/bics/1111111412
replaces: http://data.ga-group.nl/ics/bics/2020/1111111412
imported on: 2026-06-08T13:40:52.236Z
last refreshed on: 2026-06-08T13:41:38.450Z
source accessed on: 2024-06-05T14:42:36Z
source last accessed on: 2024-06-05T14:42:36Z
label: Agências de ingressos de entretenimento @pt
label: Agencias de boletos de entretenimiento @es
label: Agenzie biglietti intrattenimento @it
label: Billetteries de spectacles @fr
label: Unterhaltung, Kartenvorverkaufsstellen @de
label: Агентства по прдж билетов на развлек. мероприят. @ru
label: 娛樂活動售票機構 @zh-hant
label: 娛樂活動售��機構 @zh-hant
label: 娱乐售票代理 @zh
label: 엔터테인먼트 티켓 판매대리점 @ko
label: ﾁｹｯﾄ代理店 @ja
definition: This segment includes companies that act as agents in the sale of tickets.
notation: 1111111412
valid from: 2024-06-07

Movie Theaters
type: BicsLevel5Segment
type: Classifier
type: NamedIndividual
is level5 segment of: Entertainment Facilities
is contemporary version of: http://data.ga-group.nl/ics/bics/1111111413
is version of: http://data.ga-group.nl/ics/bics/1111111413
replaces: http://data.ga-group.nl/ics/bics/2020/1111111413
imported on: 2026-06-08T13:40:52.236Z
last refreshed on: 2026-06-08T13:41:38.450Z
source accessed on: 2024-06-05T14:42:36Z
source last accessed on: 2024-06-05T14:42:36Z
label: Cinémas @fr
label: Cinemas cinematográficos exc-drive -Ins @pt
label: Cines @es
label: Kinos @de
label: Sale cinema @it
label: Кинотеатры @ru
label: 映画館 @ja
label: 电影院 @zh
label: 電影院 @zh-hant
label: 영화관 @ko
definition: This segment includes cinema viewing facilities that project motion pictures.
notation: 1111111413
valid from: 2024-06-07

Museums & Galleries
type: BicsLevel6Segment
type: Classifier
type: NamedIndividual
is level6 segment of: Perform Arts & Museums
is contemporary version of: http://data.ga-group.nl/ics/bics/111111141410
is version of: http://data.ga-group.nl/ics/bics/111111141410
replaces: http://data.ga-group.nl/ics/bics/2020/111111141410
imported on: 2026-06-08T13:40:52.236Z
last refreshed on: 2026-06-08T13:41:38.450Z
source accessed on: 2024-06-05T14:42:36Z
source last accessed on: 2024-06-05T14:42:36Z
label: Musées/Galeries @fr
label: Museen & Gallerien @de
label: Musei e gallerie @it
label: Museos y galerías @es
label: Museus e galerias @pt
label: Музеи и галереи @ru
label: 博物館、藝廊及展場 @zh-hant
label: 博物馆、画廊及展馆 @zh
label: 美術館･画廊･展示場 @ja
label: 박물관 & 갤러리 @ko
label: ���物館、藝廊及展場 @zh-hant
definition: This segment includes companies that provide facilities to display educational, artistic, scientific, or cultural artifacts.
notation: 111111141410
valid from: 2024-06-07

Independent Artists
type: BicsLevel7Segment
type: Classifier
type: NamedIndividual
is level7 segment of: Performing Arts
is contemporary version of: http://data.ga-group.nl/ics/bics/11111114141110
is version of: http://data.ga-group.nl/ics/bics/11111114141110
replaces: http://data.ga-group.nl/ics/bics/2020/11111114141110
imported on: 2026-06-08T13:40:52.236Z
last refreshed on: 2026-06-08T13:41:38.450Z
source accessed on: 2024-06-05T14:42:36Z
source last accessed on: 2024-06-05T14:42:36Z
label: Artistas independentes @pt
label: Artistas independien @es
label: Artiste indépendant @fr
label: Artisti indipendenti @it
label: Unabhängige Künstler @de
label: Независимые художники @ru
label: 独立系ｱｰﾃｨｽﾄ @ja
label: 独立艺术家 @zh
label: 獨立藝術家 @zh-hant
label: 독립 아티스트 @ko
definition: This segment includes companies that provide performing arts production, such as choreography, cinematography, acting, and directing.
notation: 11111114141110
valid from: 2024-06-07

Event Promoters w/ Facilities
type: BicsLevel7Segment
type: Classifier
type: NamedIndividual
is level7 segment of: Performing Arts
is contemporary version of: http://data.ga-group.nl/ics/bics/11111114141111
is version of: http://data.ga-group.nl/ics/bics/11111114141111
replaces: http://data.ga-group.nl/ics/bics/2020/11111114141111
imported on: 2026-06-08T13:40:52.236Z
last refreshed on: 2026-06-08T13:41:38.450Z
source accessed on: 2024-06-05T14:42:36Z
source last accessed on: 2024-06-05T14:42:36Z
label: Organizzatori eventi c/strutture @it
label: Promoter mit Veranstaltungsort @de
label: Promoteurs évèn av installations @fr
label: Promotores de evento con inst @es
label: Promotores de eventos c/instalações @pt
label: Промоутеры событий в помещении @ru
label: 活动推广者(有设施) @zh
label: 自有設備活動推廣機構 @zh-hant
label: 芸術･ｽﾎﾟｰﾂｲﾍﾞﾝﾄ企画(有施設) @ja
label: 행사 홍보업체(시설포함) @ko
definition: This segment includes companies that produce and promote performing arts events for their own venues.
notation: 11111114141111
valid from: 2024-06-07

Event Promoters w/o Facilities
type: BicsLevel7Segment
type: Classifier
type: NamedIndividual
is level7 segment of: Performing Arts
is contemporary version of: http://data.ga-group.nl/ics/bics/11111114141112
is version of: http://data.ga-group.nl/ics/bics/11111114141112
replaces: http://data.ga-group.nl/ics/bics/2020/11111114141112
imported on: 2026-06-08T13:40:52.236Z
last refreshed on: 2026-06-08T13:41:38.450Z
source accessed on: 2024-06-05T14:42:36Z
source last accessed on: 2024-06-05T14:42:36Z
label: Organizzatori eventi sz strutture @it
label: Promoter ohne Veranstaltungsort @de
label: Promoteurs évèn sans installations @fr
label: Promotores de evento sin instalaciones @es
label: Promotores de eventos sem instalações @pt
label: Промоутеры событий без аппаратуры @ru
label: 活动推广者(无设施) @zh
label: 活动推��者(无设施) @zh
label: 無設備活動推廣機構 @zh-hant
label: 芸術･ｽﾎﾟｰﾂｲﾍﾞﾝﾄ企画(無施設) @ja
label: 행사 홍보업체(시설제외) @ko
definition: This segment includes companies that produce and promote performing arts events, but do not own venues.
notation: 11111114141112
valid from: 2024-06-07

Theaters & Dinner Theaters
type: BicsLevel7Segment
type: Classifier
type: NamedIndividual
is level7 segment of: Performing Arts
is contemporary version of: http://data.ga-group.nl/ics/bics/11111114141113
is version of: http://data.ga-group.nl/ics/bics/11111114141113
replaces: http://data.ga-group.nl/ics/bics/2020/11111114141113
imported on: 2026-06-08T13:40:52.236Z
last refreshed on: 2026-06-08T13:41:38.450Z
source accessed on: 2024-06-05T14:42:36Z
source last accessed on: 2024-06-05T14:42:36Z
label: Cinemas e cinemas com comida @pt
label: Compagnie di teatro @it
label: Teatros con y sin cena @es
label: Théâtres et cafés-théâtres @fr
label: Theater & Dinnertheater @de
label: Театры и минитеатры @ru
label: 剧院与餐馆剧院 @zh
label: 劇団･ﾃﾞｨﾅｰｼｱﾀｰ @ja
label: 劇院及晚宴劇院 @zh-hant
label: 극장 & 디너식 극장 @ko
definition: This segment includes companies that provide venues for live theatrical performances.
notation: 11111114141113
valid from: 2024-06-07

Performing Arts
type: BicsLevel6Segment
type: Classifier
type: NamedIndividual
is level6 segment of: Perform Arts & Museums
is contemporary version of: http://data.ga-group.nl/ics/bics/111111141411
is version of: http://data.ga-group.nl/ics/bics/111111141411
replaces: http://data.ga-group.nl/ics/bics/2020/111111141411
imported on: 2026-06-08T13:40:52.236Z
last refreshed on: 2026-06-08T13:41:38.450Z
source accessed on: 2024-06-05T14:42:36Z
source last accessed on: 2024-06-05T14:42:36Z
label: Arti spettacolo @it
label: Arts du spectacle @fr
label: Darstellende Künste @de
label: Espectáculos @es
label: Teatros @pt
label: Исполнительное искусство @ru
label: 舞台芸術 @ja
label: 表演艺术 @zh
label: 表演藝術 @zh-hant
label: 공연예술 @ko
definition: This segment includes companies that produce theater, dance, or music events.
notation: 111111141411
valid from: 2024-06-07

Perform Arts & Museums
type: BicsLevel5Segment
type: Classifier
type: NamedIndividual
is level5 segment of: Entertainment Facilities
is contemporary version of: http://data.ga-group.nl/ics/bics/1111111414
is version of: http://data.ga-group.nl/ics/bics/1111111414
replaces: http://data.ga-group.nl/ics/bics/2020/1111111414
imported on: 2026-06-08T13:40:52.236Z
last refreshed on: 2026-06-08T13:41:38.450Z
source accessed on: 2024-06-05T14:42:36Z
source last accessed on: 2024-06-05T14:42:36Z
label: Arti spettacolo e musei @it
label: Arts de la scène et musées @fr
label: Atividades de museu e artes cênicas @pt
label: Aufführungen & Museen @de
label: Muestra de artes y museos @es
label: Исполнит. искусство и музеи @ru
label: 舞台芸術･博物館･美術館 @ja
label: 表演艺术与博物馆 @zh
label: 表演藝術及博物館 @zh-hant
label: 공연예술 & 박물관 @ko
definition: This segment includes companies that provide theatrical performances, such as plays, concerts, dance, and opera. Also includes museums, zoos, and botanical gardens.
notation: 1111111414
valid from: 2024-06-07

Broadcast Rights - Sports Teams
type: BicsLevel6Segment
type: Classifier
type: NamedIndividual
is level6 segment of: Pro Sports & Related Activities
is contemporary version of: http://data.ga-group.nl/ics/bics/111111141510
is version of: http://data.ga-group.nl/ics/bics/111111141510
replaces: http://data.ga-group.nl/ics/bics/2020/111111141510
imported on: 2026-06-08T13:40:52.236Z
last refreshed on: 2026-06-08T13:41:38.450Z
source accessed on: 2024-06-05T14:42:36Z
source last accessed on: 2024-06-05T14:42:36Z
label: Derechos de transmisión - equipos deportivos @es
label: Direitos de transmissão- Equipes desportivas @pt
label: Diritti televisivi - Squadre sportive @it
label: Droits de diffusions - Equipes sportives @fr
label: Rundfunkrechte - Mannschaften @de
label: Права на трансляцию - спорт. команды @ru
label: 放送権-ｽﾎﾟｰﾂﾁｰﾑ @ja
label: 轉播權利金-運動團隊 @zh-hant
label: 转播权-运动队 @zh
label: 방영권 - 스포츠팀 @ko
definition: This segment includes companies that manage the media and broadcasting rights of sports teams.
notation: 111111141510
valid from: 2024-06-07

Gate Receipts
type: BicsLevel6Segment
type: Classifier
type: NamedIndividual
is level6 segment of: Pro Sports & Related Activities
is contemporary version of: http://data.ga-group.nl/ics/bics/111111141511
is version of: http://data.ga-group.nl/ics/bics/111111141511
replaces: http://data.ga-group.nl/ics/bics/2020/111111141511
imported on: 2026-06-08T13:40:52.236Z
last refreshed on: 2026-06-08T13:41:38.450Z
source accessed on: 2024-06-05T14:42:36Z
source last accessed on: 2024-06-05T14:42:36Z
label: 'Gate Receipts' @ru
label: Eintrittseinnahmen @de
label: Entrées - Sport @fr
label: Entrate cassa @it
label: Recibos de entrada @es
label: Recibos de portaria @pt
label: 入場料収入 @ja
label: 門票收入 @zh-hant
label: 门票收入 - 运动队 @zh
label: 입장수입 @ko
definition: This segment includes companies that provide ticket sales for live sporting events.
notation: 111111141511
valid from: 2024-06-07

Sports Merchandising
type: BicsLevel6Segment
type: Classifier
type: NamedIndividual
is level6 segment of: Pro Sports & Related Activities
is contemporary version of: http://data.ga-group.nl/ics/bics/111111141512
is version of: http://data.ga-group.nl/ics/bics/111111141512
replaces: http://data.ga-group.nl/ics/bics/2020/111111141512
imported on: 2026-06-08T13:40:52.236Z
last refreshed on: 2026-06-08T13:41:38.450Z
source accessed on: 2024-06-05T14:42:36Z
source last accessed on: 2024-06-05T14:42:36Z
label: Mercancía deportiva @es
label: Merce sportiva @it
label: Prod dériv sportifs @fr
label: Propaganda de esporte @pt
label: Werbeartikel Sport @de
label: Спортивные товары @ru
label: 商品 - 运动队 @zh
label: 商品 - 運動團隊 @zh-hant
label: 상품-스포츠팀 @ko
label: ﾁｰﾑｽﾎﾟｰﾂ商品販売 @ja
definition: This segment includes companies that utilize sports trademarks to sell branded merchandise.
notation: 111111141512
valid from: 2024-06-07

Sports Teams
type: BicsLevel6Segment
type: Classifier
type: NamedIndividual
is level6 segment of: Pro Sports & Related Activities
is contemporary version of: http://data.ga-group.nl/ics/bics/111111141513
is version of: http://data.ga-group.nl/ics/bics/111111141513
replaces: http://data.ga-group.nl/ics/bics/2020/111111141513
imported on: 2026-06-08T13:40:52.236Z
last refreshed on: 2026-06-08T13:41:38.450Z
source accessed on: 2024-06-05T14:42:36Z
source last accessed on: 2024-06-05T14:42:36Z
label: Equipes de esporte @pt
label: Equipes sportives @fr
label: Equipos deportivos @es
label: Sportmannschaften @de
label: Squadre sportive @it
label: Спорт. команды @ru
label: 运动队和俱乐部 @zh
label: 運動團體 @zh-hant
label: 스포츠 팀 /클럽 @ko
label: ｽﾎﾟｰﾂﾁｰﾑ @ja
definition: This segment includes sports clubs that participate in live sporting events, such as baseball and football.
notation: 111111141513
valid from: 2024-06-07

Pro Sports & Related Activities
type: BicsLevel5Segment
type: Classifier
type: NamedIndividual
is level5 segment of: Entertainment Facilities
is contemporary version of: http://data.ga-group.nl/ics/bics/1111111415
is version of: http://data.ga-group.nl/ics/bics/1111111415
replaces: http://data.ga-group.nl/ics/bics/2020/1111111415
imported on: 2026-06-08T13:40:52.236Z
last refreshed on: 2026-06-08T13:41:38.450Z
source accessed on: 2024-06-05T14:42:36Z
source last accessed on: 2024-06-05T14:42:36Z
label: Actividades deportivas profesionales @es
label: Berufssport @de
label: Esportes prof e atividades relacionadas @pt
label: Sport professionale e attività associate @it
label: Sport professionnel et activités connexes @fr
label: Спортивная деятельность @ru
label: 职业体育与相关活动 @zh
label: 職業體育及相關活動 @zh-hant
label: 프로 스포츠 & 관련 활동 @ko
label: ﾌﾟﾛｽﾎﾟｰﾂ･関連 @ja
definition: This segment includes companies that are involved in the production and promotion of sporting events.
notation: 1111111415
valid from: 2024-06-07

Bowling Centers
type: BicsLevel5Segment
type: Classifier
type: NamedIndividual
is level5 segment of: Entertainment Facilities
is contemporary version of: http://data.ga-group.nl/ics/bics/1111111416
is version of: http://data.ga-group.nl/ics/bics/1111111416
replaces: http://data.ga-group.nl/ics/bics/2020/1111111416
imported on: 2026-06-08T13:40:52.236Z
last refreshed on: 2026-06-08T13:41:38.450Z
source accessed on: 2024-06-05T14:42:36Z
source last accessed on: 2024-06-05T14:42:36Z
label: Bowlingzentren @de
label: Centri di bowling @it
label: Centros de boliche @es
label: Salles de bowling @fr
label: Боулинг-центры @ru
label: 保齡球場 @zh-hant
label: 保龄球中心 @zh
label: 볼링장 운영업 @ko
label: ﾎﾞｳﾘﾝｸﾞ場 @ja
definition: This segment includes companies that operate bowling alleys.
notation: 1111111416
valid from: 2024-06-07

Fitness & Recreation Centers
type: BicsLevel5Segment
type: Classifier
type: NamedIndividual
is level5 segment of: Entertainment Facilities
is contemporary version of: http://data.ga-group.nl/ics/bics/1111111417
is version of: http://data.ga-group.nl/ics/bics/1111111417
replaces: http://data.ga-group.nl/ics/bics/2020/1111111417
imported on: 2026-06-08T13:40:52.236Z
last refreshed on: 2026-06-08T13:41:38.450Z
source accessed on: 2024-06-05T14:42:36Z
source last accessed on: 2024-06-05T14:42:36Z
label: Centres de mise en forme et récréatifs @fr
label: Centros de ginástica e de recreação @pt
label: Fitness e centri ricreativi @it
label: Fitness- & Freizeitcenter @de
label: Gimnasios y centros recreativos @es
label: Фитнес-центры и центры отдыха @ru
label: 健身及休閒活動中心 @zh-hant
label: 健身和休闲运动中心 @zh
label: 휘트니스 & 레크레이션 센터 @ko
label: ﾌｨｯﾄﾈｽ･娯楽ｽﾎﾟｰﾂ施設 @ja
definition: This segment includes companies that operate fitness and recreation sports centers, such as athletic club facilities, health spas without accommodations, ice or roller skating rinks, and swimming pools.
notation: 1111111417
valid from: 2024-06-07

Golf Courses & Country Clubs
type: BicsLevel5Segment
type: Classifier
type: NamedIndividual
is level5 segment of: Entertainment Facilities
is contemporary version of: http://data.ga-group.nl/ics/bics/1111111418
is version of: http://data.ga-group.nl/ics/bics/1111111418
replaces: http://data.ga-group.nl/ics/bics/2020/1111111418
imported on: 2026-06-08T13:40:52.236Z
last refreshed on: 2026-06-08T13:41:38.450Z
source accessed on: 2024-06-05T14:42:36Z
source last accessed on: 2024-06-05T14:42:36Z
label: Campi da golf e country club @it
label: Campos de golf @es
label: Clubes de campo e cursos de golfe @pt
label: Golfplätze & Gesellschaftsklubs @de
label: Terrains de golf et country clubs @fr
label: Поля для гольфа и загородные клубы @ru
label: 高尔夫球场及乡村俱乐部 @zh
label: 高爾夫球場及鄉村俱樂部 @zh-hant
label: 골프장 및 골프클럽 운영업 @ko
label: ｺﾞﾙﾌｺｰｽ･ｶﾝﾄﾘｰｸﾗﾌﾞ @ja
definition: This segment includes companies that operate golf courses and country clubs.
notation: 1111111418
valid from: 2024-06-07

Marinas
type: BicsLevel5Segment
type: Classifier
type: NamedIndividual
is level5 segment of: Entertainment Facilities
is contemporary version of: http://data.ga-group.nl/ics/bics/1111111419
is version of: http://data.ga-group.nl/ics/bics/1111111419
replaces: http://data.ga-group.nl/ics/bics/2020/1111111419
imported on: 2026-06-08T13:40:52.236Z
last refreshed on: 2026-06-08T13:41:38.450Z
source accessed on: 2024-06-05T14:42:36Z
source last accessed on: 2024-06-05T14:42:36Z
label: Jachthäfen @de
label: Marinas turísticas @es
label: Marinhas @pt
label: Porti turistici @it
label: Пристани @ru
label: 码头 @zh
label: 船屋 @zh-hant
label: 수상오락 운영업 @ko
label: ﾏﾘｰﾅ @ja
definition: This segment includes docks, basins or other facilities that provide secure moorings for recreational boats and often offer supply, repair, and other boating related services.
notation: 1111111419
valid from: 2024-06-07

Skiing Facilities
type: BicsLevel5Segment
type: Classifier
type: NamedIndividual
is level5 segment of: Entertainment Facilities
is contemporary version of: http://data.ga-group.nl/ics/bics/1111111420
is version of: http://data.ga-group.nl/ics/bics/1111111420
replaces: http://data.ga-group.nl/ics/bics/2020/1111111420
imported on: 2026-06-08T13:40:52.236Z
last refreshed on: 2026-06-08T13:41:38.450Z
source accessed on: 2024-06-05T14:42:36Z
source last accessed on: 2024-06-05T14:42:36Z
label: Centres de ski @fr
label: Instalações de esqui @pt
label: Pistas para esquiar @es
label: Skianlagen @de
label: Strutture per lo sci @it
label: Лыжные базы @ru
label: 滑雪場 @zh-hant
label: 滑雪设施 @zh
label: 스키장 운영업 @ko
label: ｽｷｰ施設 @ja
definition: This segment includes companies that operate ski mountain trails, lifts, and ski resorts. These companies may provide lodging and dining in addition to the operation of ski trails.
notation: 1111111420
valid from: 2024-06-07

Entertainment Facilities
type: BicsLevel4SubIndustry
type: Classifier
type: NamedIndividual
is sub industry of: Leisure Facilities & Services
is contemporary version of: http://data.ga-group.nl/ics/bics/11111114
is version of: http://data.ga-group.nl/ics/bics/11111114
replaces: http://data.ga-group.nl/ics/bics/2020/11111114
imported on: 2026-06-08T13:40:52.236Z
last refreshed on: 2026-06-08T13:41:38.450Z
source accessed on: 2024-06-05T14:42:36Z
source last accessed on: 2024-06-05T14:42:36Z
label: Centres de divertissement @fr
label: Instalações entretenimento @pt
label: Instalaciones de entretenimiento @es
label: Servizi intrattenimento @it
label: Unterhaltungsanlagen @de
label: Места провед. развлекат. мероприят. @ru
label: 娛樂設施 @zh-hant
label: 娯楽施設 @ja
label: 娱乐设施 @zh
label: 엔터테인먼트 시설 @ko
definition: This industry subgroup includes companies that operate various types of entertainment and recreational facilities.
notation: 11111114
valid from: 2024-06-07

Tour Operators
type: BicsLevel5Segment
type: Classifier
type: NamedIndividual
is level5 segment of: Travel Services
is contemporary version of: http://data.ga-group.nl/ics/bics/1111111510
is version of: http://data.ga-group.nl/ics/bics/1111111510
replaces: http://data.ga-group.nl/ics/bics/2020/1111111510
imported on: 2026-06-08T13:40:52.236Z
last refreshed on: 2026-06-08T13:41:38.450Z
source accessed on: 2024-06-05T14:42:36Z
source last accessed on: 2024-06-05T14:42:36Z
label: Operadores turísticos @pt
label: Organiz excursiones @es
label: Reiseveranstalter @de
label: Tour operator @it
label: Voyagistes @fr
label: Тур-операторы @ru
label: 旅行安排 @zh
label: 行程規劃商 @zh-hant
label: 투어 오퍼레이터 @ko
label: ﾂｱｰｵﾍﾟﾚｰﾀｰ @ja
label: ﾂｱｰｵ���ﾟﾚｰﾀｰ @ja
definition: This segment includes companies that arrange and operate tours.
notation: 1111111510
valid from: 2024-06-07

Travel Agencies
type: BicsLevel5Segment
type: Classifier
type: NamedIndividual
is level5 segment of: Travel Services
is contemporary version of: http://data.ga-group.nl/ics/bics/1111111511
is version of: http://data.ga-group.nl/ics/bics/1111111511
replaces: http://data.ga-group.nl/ics/bics/2020/1111111511
imported on: 2026-06-08T13:40:52.236Z
last refreshed on: 2026-06-08T13:41:38.450Z
source accessed on: 2024-06-05T14:42:36Z
source last accessed on: 2024-06-05T14:42:36Z
label: Agências de viagens @pt
label: Agences de voyage @fr
label: Agencias de viaje @es
label: Agenzie viaggi @it
label: Reisebüros @de
label: Туристические фирмы @ru
label: 旅行代理店 @ja
label: 旅行社 @zh
label: 旅���代理店 @ja
label: 여행사 @ko
definition: This segment includes companies that act as agents in the sale of travel and tour packages.
notation: 1111111511
valid from: 2024-06-07

Travel Reservation Services
type: BicsLevel5Segment
type: Classifier
type: NamedIndividual
is level5 segment of: Travel Services
is contemporary version of: http://data.ga-group.nl/ics/bics/1111111512
is version of: http://data.ga-group.nl/ics/bics/1111111512
replaces: http://data.ga-group.nl/ics/bics/2020/1111111512
imported on: 2026-06-08T13:40:52.236Z
last refreshed on: 2026-06-08T13:41:38.450Z
source accessed on: 2024-06-05T14:42:36Z
source last accessed on: 2024-06-05T14:42:36Z
label: Reisebuchungen @de
label: Serviços de reserva de viagem @pt
label: Service de réservation voyage @fr
label: Servicios de viaje @es
label: Servizi prenotazione viaggio @it
label: Услуги резервирования путешествий @ru
label: Услуги резервировани�� путешествий @ru
label: 旅游预订服务 @zh
label: 旅行予約ｻｰﾋﾞｽ @ja
label: 旅行預訂服務 @zh-hant
label: 여행예약 서비스 @ko
definition: This segment includes companies that arrange travel reservation services and companies that provide time-share exchange services.
notation: 1111111512
valid from: 2024-06-07

Travel Services
type: BicsLevel4SubIndustry
type: Classifier
type: NamedIndividual
is sub industry of: Leisure Facilities & Services
is contemporary version of: http://data.ga-group.nl/ics/bics/11111115
is version of: http://data.ga-group.nl/ics/bics/11111115
replaces: http://data.ga-group.nl/ics/bics/2020/11111115
imported on: 2026-06-08T13:40:52.236Z
last refreshed on: 2026-06-08T13:41:38.450Z
source accessed on: 2024-06-05T14:42:36Z
source last accessed on: 2024-06-05T14:42:36Z
label: Reisebüros @de
label: Serviços de viagem @pt
label: Services de voyage @fr
label: Servicios de viaje @es
label: Servizi viaggi @it
label: Турист. услуги @ru
label: 旅行服务 @zh
label: 旅行ｻｰﾋﾞｽ @ja
label: 旅遊服務業 @zh-hant
label: 여행 서비스 @ko
definition: This industry subgroup includes companies that provide travel arrangement and/or tour operating services.
notation: 11111115
valid from: 2024-06-07

Leisure Facilities & Services
type: BicsLevel3Industry
type: Classifier
type: NamedIndividual
is industry of: Consumer Discretionary Services
is contemporary version of: http://data.ga-group.nl/ics/bics/111111
is version of: http://data.ga-group.nl/ics/bics/111111
replaces: http://data.ga-group.nl/ics/bics/2020/111111
imported on: 2026-06-08T13:40:52.236Z
last refreshed on: 2026-06-08T13:41:38.450Z
source accessed on: 2024-06-05T14:42:36Z
source last accessed on: 2024-06-05T14:42:36Z
label: Freizeitanlagen & -dienste @de
label: Instalações de lazer e serviços @pt
label: Instalaciones y sev p/tiempo libre @es
label: Services et sites de loisirs @fr
label: Servizi e strutt tempo libero @it
label: Места и услуги отдыха @ru
label: 休闲设施与服务 @zh
label: 博弈、住宿及餐廳 @zh-hant
label: 레저 시설 & 서비스 @ko
label: ﾚｼﾞｬｰ施設･ｻｰﾋﾞｽ @ja
definition: This industry includes companies that operate casinos and gambling establishments, cruise lines, lodging, passenger transportation, and restaurants.
notation: 111111
valid from: 2024-06-07

Consumer Discretionary Services
type: BicsLevel2IndustryGroup
type: Classifier
type: NamedIndividual
is industry group of: Consumer Discretionary
is contemporary version of: http://data.ga-group.nl/ics/bics/1111
is version of: http://data.ga-group.nl/ics/bics/1111
replaces: http://data.ga-group.nl/ics/bics/2020/1111
imported on: 2026-06-08T13:40:52.236Z
last refreshed on: 2026-06-08T13:41:38.450Z
source accessed on: 2024-06-05T14:42:36Z
source last accessed on: 2024-06-05T14:42:36Z
label: Dienstleistungen, Gebrauchsgüter @de
label: Serviços discricionário ao consumidor @pt
label: Services conso discrétionnaire @fr
label: Servicio de consumo discrecional @es
label: Servizi beni voluttuari @it
label: Товары выбор. спроса - Услуги @ru
label: 一般消費財ｻｰﾋﾞｽ @ja
label: 非必需消费品服务 @zh
label: 非核心消費服務 @zh-hant
label: 자유소비재 서비스 @ko
definition: This industry group includes companies that provide services to household consumers.
notation: 1111
valid from: 2024-06-07

Clothing & Accessories Whslrs
type: BicsLevel5Segment
type: Classifier
type: NamedIndividual
is level5 segment of: Apparel & Footwear Whslrs
is contemporary version of: http://data.ga-group.nl/ics/bics/1112101010
is version of: http://data.ga-group.nl/ics/bics/1112101010
replaces: http://data.ga-group.nl/ics/bics/2020/1112101010
imported on: 2026-06-08T13:40:52.236Z
last refreshed on: 2026-06-08T13:41:38.450Z
source accessed on: 2024-06-05T14:42:36Z
source last accessed on: 2024-06-05T14:42:36Z
label: Atac de roupas e acessórios @pt
label: Großhändler für Kleidung & Accessoires @de
label: Gross vêtements et accessoires @fr
label: Grossisti abbigl e accessori @it
label: Vta al por mayor de ropa y accesorios @es
label: Опт. торговля - одежда и аксессуары @ru
label: 服装与饰品批发商 @zh
label: 服裝及飾品批發 @zh-hant
label: 衣服･装飾品卸売 @ja
label: 의류 & 액세서리 도매업 @ko
definition: This segment includes companies that wholesale and distribute men's, women's, children's, and infants' clothing and accessories.
notation: 1112101010
valid from: 2024-06-07

Footwear Wholesalers
type: BicsLevel5Segment
type: Classifier
type: NamedIndividual
is level5 segment of: Apparel & Footwear Whslrs
is contemporary version of: http://data.ga-group.nl/ics/bics/1112101011
is version of: http://data.ga-group.nl/ics/bics/1112101011
replaces: http://data.ga-group.nl/ics/bics/2020/1112101011
imported on: 2026-06-08T13:40:52.236Z
last refreshed on: 2026-06-08T13:41:38.450Z
source accessed on: 2024-06-05T14:42:36Z
source last accessed on: 2024-06-05T14:42:36Z
label: Atacadistas de calçados @pt
label: Comercio al por mayor de calzado @es
label: Großhändler für Fußbekleidung @de
label: Grossistes en chaussures @fr
label: Grossisti calzature @it
label: Оптовая торговля - обувь @ru
label: 履物卸売 @ja
label: 鞋袜批发商 @zh
label: 鞋類批發 @zh-hant
label: 신발 제품 도매업 @ko
definition: This segment includes companies that wholesale and distribute athletic and non-athletic footwear.
notation: 1112101011
valid from: 2024-06-07

Jewelry & Watch Wholesalers
type: BicsLevel5Segment
type: Classifier
type: NamedIndividual
is level5 segment of: Apparel & Footwear Whslrs
is contemporary version of: http://data.ga-group.nl/ics/bics/1112101012
is version of: http://data.ga-group.nl/ics/bics/1112101012
replaces: http://data.ga-group.nl/ics/bics/2020/1112101012
imported on: 2026-06-08T13:40:52.236Z
last refreshed on: 2026-06-08T13:41:38.450Z
source accessed on: 2024-06-05T14:42:36Z
source last accessed on: 2024-06-05T14:42:36Z
label: Atacadistas de joias e relógios @pt
label: Großhändler für Schmuck & Armbanduhren @de
label: Grossistes en bijoux/montres @fr
label: Grossisti gioielli e orologi @it
label: Joyeros y relojeros mayoristas @es
label: Юв. изделия и часы - опт. торговля @ru
label: 宝石･時計卸売 @ja
label: 宝石��時計卸売 @ja
label: 珠宝与钟表批发商 @zh
label: 珠寶批發 @zh-hant
label: 보석 & 시계 도매상업 @ko
definition: This segment includes companies that wholesale and distribute jewelry, watches, precious stones, and precious metal goods.
notation: 1112101012
valid from: 2024-06-07

Apparel & Footwear Whslrs
type: BicsLevel4SubIndustry
type: Classifier
type: NamedIndividual
is sub industry of: Wholesale - Discretionary
is contemporary version of: http://data.ga-group.nl/ics/bics/11121010
is version of: http://data.ga-group.nl/ics/bics/11121010
replaces: http://data.ga-group.nl/ics/bics/2020/11121010
imported on: 2026-06-08T13:40:52.236Z
last refreshed on: 2026-06-08T13:41:38.450Z
source accessed on: 2024-06-05T14:42:36Z
source last accessed on: 2024-06-05T14:42:36Z
label: Atacad vestuário e calçados @pt
label: Bekleidung & Schuhe - GH @de
label: Grossistes vêtements et chaussures @fr
label: Grossisti abbigl e calzature @it
label: Mayoristas ropa y calzado @es
label: Одежда и обувь - Оптовики @ru
label: 服装与鞋类批发 @zh
label: 服飾及鞋類批發 @zh-hant
label: 衣料･履物卸売 @ja
label: 의류 & 신발 도매업 @ko
definition: This industry subgroup includes companies that wholesale and distribute fashion apparel, sports clothing, outerwear, and footwear.
notation: 11121010
valid from: 2024-06-07

Automobiles Wholesalers
type: BicsLevel5Segment
type: Classifier
type: NamedIndividual
is level5 segment of: Automotive Wholesalers
is contemporary version of: http://data.ga-group.nl/ics/bics/1112101110
is version of: http://data.ga-group.nl/ics/bics/1112101110
replaces: http://data.ga-group.nl/ics/bics/2020/1112101110
imported on: 2026-06-08T13:40:52.236Z
last refreshed on: 2026-06-08T13:41:38.450Z
source accessed on: 2024-06-05T14:42:36Z
source last accessed on: 2024-06-05T14:42:36Z
label: Atacadistas de automóveis @pt
label: Großhändler für Autos @de
label: Grossistes en automobiles @fr
label: Grossisti automobili @it
label: Mayoristas de automóviles @es
label: Опт. торговля - автомобили @ru
label: Опт. торговля - авто��обили @ru
label: 汽車批發商 @zh-hant
label: 汽车批发商 @zh
label: 自動車卸売 @ja
label: 자동차 도매업 @ko
definition: This segment includes companies that wholesale and distribute new and used passenger automobiles, trucks, trailers, and other motor vehicles, such as motorcycles, motorhomes, and snowmobiles. Also includes car auctions primarily for automotive retailers.
notation: 1112101110
valid from: 2024-06-07

Automotive Supplies Whslrs
type: BicsLevel5Segment
type: Classifier
type: NamedIndividual
is level5 segment of: Automotive Wholesalers
is contemporary version of: http://data.ga-group.nl/ics/bics/1112101111
is version of: http://data.ga-group.nl/ics/bics/1112101111
replaces: http://data.ga-group.nl/ics/bics/2020/1112101111
imported on: 2026-06-08T13:40:52.236Z
last refreshed on: 2026-06-08T13:41:38.450Z
source accessed on: 2024-06-05T14:42:36Z
source last accessed on: 2024-06-05T14:42:36Z
label: Atacad de produtos automotivos @pt
label: Autozulieferer Großhdl. @de
label: Gross fournitures pour autos @fr
label: Grossisti forniture automobili @it
label: Mayoristas prov automotrices @es
label: Опт. торговля - автомоб. з/части @ru
label: 汽車用品批發商 @zh-hant
label: 汽车用品批发商 @zh
label: 自動車部品卸売 @ja
label: 자동차 소모품 도매업 @ko
definition: This segment includes companies that wholesale and distribute motor vehicle parts, accessories, tools, and equipment.
notation: 1112101111
valid from: 2024-06-07

Tire Wholesalers
type: BicsLevel5Segment
type: Classifier
type: NamedIndividual
is level5 segment of: Automotive Wholesalers
is contemporary version of: http://data.ga-group.nl/ics/bics/1112101112
is version of: http://data.ga-group.nl/ics/bics/1112101112
replaces: http://data.ga-group.nl/ics/bics/2020/1112101112
imported on: 2026-06-08T13:40:52.236Z
last refreshed on: 2026-06-08T13:41:38.450Z
source accessed on: 2024-06-05T14:42:36Z
source last accessed on: 2024-06-05T14:42:36Z
label: Atacadistas de pneus @pt
label: Comercio al por mayor de llantas @es
label: Großhändler für Reifen @de
label: Grossistes de pneus @fr
label: Ingrosso ruote @it
label: Оптовая торговля шинами @ru
label: 輪胎及內胎商品批發 @zh-hant
label: 轮胎与内胎批发商 @zh
label: 타이어 도매업 @ko
label: ﾀｲﾔ卸売 @ja
definition: This segment includes companies that wholesale and distribute automotive tire products.
notation: 1112101112
valid from: 2024-06-07

Automotive Wholesalers
type: BicsLevel4SubIndustry
type: Classifier
type: NamedIndividual
is sub industry of: Wholesale - Discretionary
is contemporary version of: http://data.ga-group.nl/ics/bics/11121011
is version of: http://data.ga-group.nl/ics/bics/11121011
replaces: http://data.ga-group.nl/ics/bics/2020/11121011
imported on: 2026-06-08T13:40:52.236Z
last refreshed on: 2026-06-08T13:41:38.450Z
source accessed on: 2024-06-05T14:42:36Z
source last accessed on: 2024-06-05T14:42:36Z
label: Atacadistas automóveis @pt
label: Grossistes en automobiles @fr
label: Grossisti automobilistici @it
label: Kfz-Großhändler @de
label: Mayoristas de autos @es
label: Автомобильные оптовые магазины @ru
label: 汽車總經銷 @zh-hant
label: 汽车批发商 @zh
label: 自動車卸売 @ja
label: 자동차 도매업 @ko
definition: This industry subgroup includes companies that wholesale and distribute motor vehicles and parts. Excludes companies that manufacture motor vehicles or their parts.
notation: 11121011
valid from: 2024-06-07

Computer & Software Whslrs
type: BicsLevel5Segment
type: Classifier
type: NamedIndividual
is level5 segment of: Consumer Elec & Applc Whslrs
is contemporary version of: http://data.ga-group.nl/ics/bics/1112101210
is version of: http://data.ga-group.nl/ics/bics/1112101210
replaces: http://data.ga-group.nl/ics/bics/2020/1112101210
imported on: 2026-06-08T13:40:52.236Z
last refreshed on: 2026-06-08T13:41:38.450Z
source accessed on: 2024-06-05T14:42:36Z
source last accessed on: 2024-06-05T14:42:36Z
label: Atac computador e software @pt
label: Großhändler für Computer & Software @de
label: Gross ordinateurs et logiciels @fr
label: Grossisti computer e software @it
label: Vta al p/mayor de ordenadores y software @es
label: Опт. торговля - компьютеры и ПО @ru
label: 计算机与软件批发商 @zh
label: 電腦及軟體批發 @zh-hant
label: 컴퓨터 & 소프트웨어 도매업 @ko
label: ｺﾝﾋﾟｭｰﾀ機器･ｿﾌﾄｳｴｱ卸売 @ja
definition: This segment includes companies that wholesale and distribute computer and computer peripheral equipment. Includes computer boards, computer software, motherboards, and printers.
notation: 1112101210
valid from: 2024-06-07

Photo Equip & Supplies Whslrs
type: BicsLevel5Segment
type: Classifier
type: NamedIndividual
is level5 segment of: Consumer Elec & Applc Whslrs
is contemporary version of: http://data.ga-group.nl/ics/bics/1112101211
is version of: http://data.ga-group.nl/ics/bics/1112101211
replaces: http://data.ga-group.nl/ics/bics/2020/1112101211
imported on: 2026-06-08T13:40:52.236Z
last refreshed on: 2026-06-08T13:41:38.450Z
source accessed on: 2024-06-05T14:42:36Z
source last accessed on: 2024-06-05T14:42:36Z
label: Atac equip e suprimentos para fotos @pt
label: Comercio al por mayor de equipo fotográfico y provisiones @es
label: Großhändler für Fotogeräte & -zubehör @de
label: Gross fournitures et équip photo @fr
label: Grossisti app e forn foto @it
label: Опт. торговля - фотооборудование и товарами @ru
label: 写真機器･用品卸売 @ja
label: 摄影器材与用品批发商 @zh
label: 照相設備及用品批發 @zh-hant
label: 사진장비 & 용품 도매업 @ko
definition: This segment includes companies that wholesale and distribute photographic equipment and supplies. Include camera equipment, motion picture cameras, projection equipment, and theater equipment.
notation: 1112101211
valid from: 2024-06-07

Consumer Elec & Applc Whslrs
type: BicsLevel4SubIndustry
type: Classifier
type: NamedIndividual
is sub industry of: Wholesale - Discretionary
is contemporary version of: http://data.ga-group.nl/ics/bics/11121012
is version of: http://data.ga-group.nl/ics/bics/11121012
replaces: http://data.ga-group.nl/ics/bics/2020/11121012
imported on: 2026-06-08T13:40:52.236Z
last refreshed on: 2026-06-08T13:41:38.450Z
source accessed on: 2024-06-05T14:42:36Z
source last accessed on: 2024-06-05T14:42:36Z
label: Atac eletrod e elet consumo @pt
label: Großhändler für Verbraucherlektr. & HH-Geräte @de
label: Gross élctrn grd pbl/app mngrs @fr
label: Grossisti elett consumo e elettdom @it
label: Mayorista de enseres/elec cons @es
label: Опт. торговля - быт. техника и электрон. @ru
label: Опт. торговля - быт. техника и элек��рон. @ru
label: 家電卸売 @ja
label: 消費性電子產品及家電批發 @zh-hant
label: 消费电子电器批发商 @zh
label: 소비자전자&애플리케이션도매업 @ko
definition: This industry subgroup includes companies that wholesale and distribute household consumer electronics and appliances. Includes consumer electronics, household appliances, photography equipment, computers and software.
notation: 11121012
valid from: 2024-06-07

Hardware Wholesalers
type: BicsLevel5Segment
type: Classifier
type: NamedIndividual
is level5 segment of: Home & Office Product Whslrs
is contemporary version of: http://data.ga-group.nl/ics/bics/1112101310
is version of: http://data.ga-group.nl/ics/bics/1112101310
replaces: http://data.ga-group.nl/ics/bics/2020/1112101310
imported on: 2026-06-08T13:40:52.236Z
last refreshed on: 2026-06-08T13:41:38.450Z
source accessed on: 2024-06-05T14:42:36Z
source last accessed on: 2024-06-05T14:42:36Z
label: Atacadistas de hardware @pt
label: Comercio al por mayor de herrajes @es
label: Großhändler für Hardware @de
label: Grossistes en matériel informatique @fr
label: Grossisti ferramenta @it
label: Оптовая торговля - скобяные изделия @ru
label: 五金批发商 @zh
label: 五金批發 @zh-hant
label: 하드웨어 도매업 @ko
label: ﾊｰﾄﾞｳｴｱ卸売 @ja
definition: This segment includes companies that wholesale and distribute hand tools, fasteners, and hardware. Includes blades, staples, nuts, bolts, screws, and hand tools.
notation: 1112101310
valid from: 2024-06-07

Home Furnishing Wholesalers
type: BicsLevel5Segment
type: Classifier
type: NamedIndividual
is level5 segment of: Home & Office Product Whslrs
is contemporary version of: http://data.ga-group.nl/ics/bics/1112101311
is version of: http://data.ga-group.nl/ics/bics/1112101311
replaces: http://data.ga-group.nl/ics/bics/2020/1112101311
imported on: 2026-06-08T13:40:52.236Z
last refreshed on: 2026-06-08T13:41:38.450Z
source accessed on: 2024-06-05T14:42:36Z
source last accessed on: 2024-06-05T14:42:36Z
label: Atacadistas de mobílias para casa @pt
label: Großhändler für Einrichtungsgegenstände @de
label: Grossistes en ameublement de maison @fr
label: Grossisti arredi casa @it
label: Vta al por mayor de muebles para el hogar @es
label: Опт. торговля - мебель для дома @ru
label: 室内装飾品卸売 @ja
label: 家装批发商 @zh
label: 家飾品批發 @zh-hant
label: 가정용 가구 도매업 @ko
definition: This segment includes companies that wholesale and distribute home furnishings used to decorate a home.
notation: 1112101311
valid from: 2024-06-07

Office Equip Wholesalers
type: BicsLevel5Segment
type: Classifier
type: NamedIndividual
is level5 segment of: Home & Office Product Whslrs
is contemporary version of: http://data.ga-group.nl/ics/bics/1112101312
is version of: http://data.ga-group.nl/ics/bics/1112101312
replaces: http://data.ga-group.nl/ics/bics/2020/1112101312
imported on: 2026-06-08T13:40:52.236Z
last refreshed on: 2026-06-08T13:41:38.450Z
source accessed on: 2024-06-05T14:42:36Z
source last accessed on: 2024-06-05T14:42:36Z
label: Atacadistas de equip escritório @pt
label: Großhändler für Büromaschinen @de
label: Gross matériel de bureau @fr
label: Grossisti app ufficio @it
label: Vtas al por mayor de equipo oficina @es
label: Оптовая торговля - офисное оборудование @ru
label: 事務用機器卸売 @ja
label: 办公设备批发商 @zh
label: 辦公設備批發 @zh-hant
label: 사무장비 도매업 @ko
definition: This segment includes companies that wholesale and distribute office machines and related equipment. Includes accounting machines, cash registers, postage meters, safes, and copying machines.
notation: 1112101312
valid from: 2024-06-07

Paint Wholesalers
type: BicsLevel5Segment
type: Classifier
type: NamedIndividual
is level5 segment of: Home & Office Product Whslrs
is contemporary version of: http://data.ga-group.nl/ics/bics/1112101313
is version of: http://data.ga-group.nl/ics/bics/1112101313
replaces: http://data.ga-group.nl/ics/bics/2020/1112101313
imported on: 2026-06-08T13:40:52.236Z
last refreshed on: 2026-06-08T13:41:38.450Z
source accessed on: 2024-06-05T14:42:36Z
source last accessed on: 2024-06-05T14:42:36Z
label: Atacadistas de tintas @pt
label: Comercio al por mayor de pinturas @es
label: Großhändler für Farben @de
label: Grossistes en peinture @fr
label: Grossisti vernici @it
label: Оптовая торговля - краска @ru
label: 塗料卸売 @ja
label: 油漆批发商 @zh
label: 油漆用品批發 @zh-hant
label: 페인트 도매업 @ko
definition: This segment includes companies that wholesale and distribute paints, coatings, wallpaper, paintbrushes, rollers, and related supplies.
notation: 1112101313
valid from: 2024-06-07

Print & Writing Paper Whslrs
type: BicsLevel5Segment
type: Classifier
type: NamedIndividual
is level5 segment of: Home & Office Product Whslrs
is contemporary version of: http://data.ga-group.nl/ics/bics/1112101314
is version of: http://data.ga-group.nl/ics/bics/1112101314
replaces: http://data.ga-group.nl/ics/bics/2020/1112101314
imported on: 2026-06-08T13:40:52.236Z
last refreshed on: 2026-06-08T13:41:38.450Z
source accessed on: 2024-06-05T14:42:36Z
source last accessed on: 2024-06-05T14:42:36Z
label: Atac papel para escrita e impressão @pt
label: Comercio al por mayor de papeles de impresión y escritura @es
label: Großhändler für Druck- & Schreibpapier @de
label: Gross papier imprimerie/pour écrire @fr
label: Grossisti carta stampa e scrivere @it
label: Опт. торговля типограф. и писчей бумагой @ru
label: 列印及書寫用紙批發 @zh-hant
label: 印刷･筆記用紙卸売 @ja
label: 打印与书写纸张批发商 @zh
label: 인쇄 & 필기용지 도매업 @ko
definition: This segment includes companies that wholesale and distribute bulk printing and writing paper.
notation: 1112101314
valid from: 2024-06-07

Stationery & Office Sply Whslrs
type: BicsLevel5Segment
type: Classifier
type: NamedIndividual
is level5 segment of: Home & Office Product Whslrs
is contemporary version of: http://data.ga-group.nl/ics/bics/1112101315
is version of: http://data.ga-group.nl/ics/bics/1112101315
replaces: http://data.ga-group.nl/ics/bics/2020/1112101315
imported on: 2026-06-08T13:40:52.236Z
last refreshed on: 2026-06-08T13:41:38.450Z
source accessed on: 2024-06-05T14:42:36Z
source last accessed on: 2024-06-05T14:42:36Z
label: Atacad prod papelaria e escritório @pt
label: Gross forn uff e cancelleria @it
label: Grossistes papeterie/fourn bur @fr
label: Mayoristas prod papelería/oficina @es
label: Schreib- & Bürowaren Großhdl. @de
label: Опт. торговля - канцтовары @ru
label: 文具与办公用品批发商 @zh
label: 文具及辦公室用品批發 @zh-hant
label: 文房具･事務用品卸売 @ja
label: 문구 & 사무 용품 도매 @ko
definition: This segment includes companies that wholesale and distribute stationery, office supplies, and gift wrap.
notation: 1112101315
valid from: 2024-06-07

Home & Office Product Whslrs
type: BicsLevel4SubIndustry
type: Classifier
type: NamedIndividual
is sub industry of: Wholesale - Discretionary
is contemporary version of: http://data.ga-group.nl/ics/bics/11121013
is version of: http://data.ga-group.nl/ics/bics/11121013
replaces: http://data.ga-group.nl/ics/bics/2020/11121013
imported on: 2026-06-08T13:40:52.236Z
last refreshed on: 2026-06-08T13:41:38.450Z
source accessed on: 2024-06-05T14:42:36Z
source last accessed on: 2024-06-05T14:42:36Z
label: Atacad prod para casa e escritório @pt
label: Grossistes articles maison/bur @fr
label: Grossisti prod casa e ufficio @it
label: Haus- & Büroprodukte - GH @de
label: Mayoristas productos hogar y of @es
label: Товары для дома и офиса - Оптовики @ru
label: 家居和办公产品批发 @zh
label: 家庭及辦公室產品批發 @zh-hant
label: 家庭･事務用品卸売 @ja
label: 가정용 & 사무용품 도매업 @ko
definition: This industry subgroup includes companies that wholesale and distribute home or office furniture, home furnishings, office equipment, hardware, paint, wallpaper, and personal or office stationery.
notation: 11121013
valid from: 2024-06-07

Book, Periodical & News Whslrs
type: BicsLevel5Segment
type: Classifier
type: NamedIndividual
is level5 segment of: Other Wholesalers
is contemporary version of: http://data.ga-group.nl/ics/bics/1112101410
is version of: http://data.ga-group.nl/ics/bics/1112101410
replaces: http://data.ga-group.nl/ics/bics/2020/1112101410
imported on: 2026-06-08T13:40:52.236Z
last refreshed on: 2026-06-08T13:41:38.450Z
source accessed on: 2024-06-05T14:42:36Z
source last accessed on: 2024-06-05T14:42:36Z
label: Atac de livros, jornais e revistas @pt
label: Großhändler für Bücher, Zeitschriften & Zeitungen @de
label: Gross livres, magazines et journaux @fr
label: Grossisti libri, periodici, notizie @it
label: Vta al por mayor de libros, periódicos y noticias @es
label: Опт. торговля - книги, периодика и газеты @ru
label: 书刊报纸批发商 @zh
label: 書籍/期刊/報紙批發 @zh-hant
label: 書籍･定期刊行物･新聞卸売 @ja
label: 서적, 정기간행물 & 신문 도매업 @ko
definition: This segment includes companies that wholesale and distribute books, audiobooks, and periodicals.
notation: 1112101410
valid from: 2024-06-07

Fabric & Textile Wholesalers
type: BicsLevel5Segment
type: Classifier
type: NamedIndividual
is level5 segment of: Other Wholesalers
is contemporary version of: http://data.ga-group.nl/ics/bics/1112101411
is version of: http://data.ga-group.nl/ics/bics/1112101411
replaces: http://data.ga-group.nl/ics/bics/2020/1112101411
imported on: 2026-06-08T13:40:52.236Z
last refreshed on: 2026-06-08T13:41:38.450Z
source accessed on: 2024-06-05T14:42:36Z
source last accessed on: 2024-06-05T14:42:36Z
label: Atacadistas de tecidos e têxteis @pt
label: Comercio al por mayor de telas y textiles @es
label: Großhändler für Stoffe & Textilien @de
label: Grossistes en tissus et textiles @fr
label: Grossisti tessili e tessuti @it
label: Опт. торговля - ткани и текстильные изделия @ru
label: 紡織品批發 @zh-hant
label: 織物･繊維卸売 @ja
label: 面料与纺织品批发商 @zh
label: 직물 & 섬유 도매업 @ko
definition: This segment includes companies that wholesale and distribute fabrics and textiles, such as yarn, linen, and other fabrics.
notation: 1112101411
valid from: 2024-06-07

Florist Supplies Wholesalers
type: BicsLevel5Segment
type: Classifier
type: NamedIndividual
is level5 segment of: Other Wholesalers
is contemporary version of: http://data.ga-group.nl/ics/bics/1112101412
is version of: http://data.ga-group.nl/ics/bics/1112101412
replaces: http://data.ga-group.nl/ics/bics/2020/1112101412
imported on: 2026-06-08T13:40:52.236Z
last refreshed on: 2026-06-08T13:41:38.450Z
source accessed on: 2024-06-05T14:42:36Z
source last accessed on: 2024-06-05T14:42:36Z
label: Atacadista de suprimentos para floriculturas @pt
label: Großhändler für Floristenbedarf @de
label: Gross fournitures fleuristes @fr
label: Grossisti forniture fiorai @it
label: Mayoristas de provisiones a florerías @es
label: Опт. торговля - флористика @ru
label: 生花小売店備品卸売 @ja
label: 花卉用品批發 @zh-hant
label: 花店用品批发商 @zh
label: 화훼 용품 도매업 @ko
definition: This segment includes companies that wholesale and distribute flowers, florists supplies and nursery materials.
notation: 1112101412
valid from: 2024-06-07

Industrial Paper Wholesalers
type: BicsLevel5Segment
type: Classifier
type: NamedIndividual
is level5 segment of: Other Wholesalers
is contemporary version of: http://data.ga-group.nl/ics/bics/1112101413
is version of: http://data.ga-group.nl/ics/bics/1112101413
replaces: http://data.ga-group.nl/ics/bics/2020/1112101413
imported on: 2026-06-08T13:40:52.236Z
last refreshed on: 2026-06-08T13:41:38.450Z
source accessed on: 2024-06-05T14:42:36Z
source last accessed on: 2024-06-05T14:42:36Z
label: Atacadistas de papel industrial @pt
label: Comercio al por mayor de papel industrial @es
label: Großhändler für Industriepapier @de
label: Grossistes en papier industriel @fr
label: Grossisti carta industriale @it
label: Оптовая торговля промышленной бумагой @ru
label: 工业用纸批发商 @zh
label: 工業紙類批發 @zh-hant
label: 産業用紙卸売 @ja
label: 산업용 제지 도매업 @ko
definition: This segment includes companies that wholesale and distribute craft wrapping, paperboard, converted paper and disposable paper products.
notation: 1112101413
valid from: 2024-06-07

Ophthalmic Goods Wholesalers
type: BicsLevel5Segment
type: Classifier
type: NamedIndividual
is level5 segment of: Other Wholesalers
is contemporary version of: http://data.ga-group.nl/ics/bics/1112101414
is version of: http://data.ga-group.nl/ics/bics/1112101414
replaces: http://data.ga-group.nl/ics/bics/2020/1112101414
imported on: 2026-06-08T13:40:52.236Z
last refreshed on: 2026-06-08T13:41:38.450Z
source accessed on: 2024-06-05T14:42:36Z
source last accessed on: 2024-06-05T14:42:36Z
label: Atacadistas de produtos oftalmológicos @pt
label: Comercio al por mayor de bienes oftálmicos @es
label: Großhändler für ophthalmische Produkte @de
label: Grossistes en produits ophtalmiques @fr
label: Grossisti articoli oftalmici @it
label: Опт.-торговля -офтальмологические товары @ru
label: 眼科產品批發 @zh-hant
label: 眼科用品卸売 @ja
label: 眼科用品批发商 @zh
label: 안과용품 도매업 @ko
definition: This segment includes companies that wholesale and distribute professional equipment, instruments, and/or goods sold, prescribed, or used by ophthalmologists, optometrists, and opticians.
notation: 1112101414
valid from: 2024-06-07

Sporting Goods Wholesalers
type: BicsLevel5Segment
type: Classifier
type: NamedIndividual
is level5 segment of: Other Wholesalers
is contemporary version of: http://data.ga-group.nl/ics/bics/1112101415
is version of: http://data.ga-group.nl/ics/bics/1112101415
replaces: http://data.ga-group.nl/ics/bics/2020/1112101415
imported on: 2026-06-08T13:40:52.236Z
last refreshed on: 2026-06-08T13:41:38.450Z
source accessed on: 2024-06-05T14:42:36Z
source last accessed on: 2024-06-05T14:42:36Z
label: Atacadistas de artigos esportivos @pt
label: Comercio al por mayor de bienes deportivos @es
label: Großhändler für Sportprodukte @de
label: Grossistes en articles de sport @fr
label: Grossisti articoli sportivi @it
label: Опт. торговля - спортивные товары @ru
label: 体育用品批发商 @zh
label: 運動用品批發 @zh-hant
label: 스포츠용품 도매업 @ko
label: ｽﾎﾟｰﾂ用品卸売 @ja
definition: This segment includes companies that wholesale and distribute sporting goods and related products. Products include athletic uniforms and apparel, athletic equipment, and athletic supplies.
notation: 1112101415
valid from: 2024-06-07

Toys & Games Whslrs
type: BicsLevel5Segment
type: Classifier
type: NamedIndividual
is level5 segment of: Other Wholesalers
is contemporary version of: http://data.ga-group.nl/ics/bics/1112101416
is version of: http://data.ga-group.nl/ics/bics/1112101416
replaces: http://data.ga-group.nl/ics/bics/2020/1112101416
imported on: 2026-06-08T13:40:52.236Z
last refreshed on: 2026-06-08T13:41:38.450Z
source accessed on: 2024-06-05T14:42:36Z
source last accessed on: 2024-06-05T14:42:36Z
label: Atac brinquedos e artigos de hobby @pt
label: Großhändler für Spielzeug & Spiele @de
label: Gross jeux/jouets @fr
label: Grossisti giocattoli e giochi @it
label: Venta al por mayor de juguetes y juegos @es
label: Опт. торговля - игрушки и игры @ru
label: 玩具与游戏批发商 @zh
label: 玩具及遊戲批發 @zh-hant
label: 玩具･ｹﾞｰﾑ卸売 @ja
label: 완구 & 게임 도매업 @ko
definition: This segment includes companies that wholesale and distribute games, toys, and hobby-related products. Products include children's vehicles, electronic games, playing cards, and toys.
notation: 1112101416
valid from: 2024-06-07

Other Wholesalers
type: BicsLevel4SubIndustry
type: Classifier
type: NamedIndividual
is sub industry of: Wholesale - Discretionary
is contemporary version of: http://data.ga-group.nl/ics/bics/11121014
is version of: http://data.ga-group.nl/ics/bics/11121014
replaces: http://data.ga-group.nl/ics/bics/2020/11121014
imported on: 2026-06-08T13:40:52.236Z
last refreshed on: 2026-06-08T13:41:38.450Z
source accessed on: 2024-06-05T14:42:36Z
source last accessed on: 2024-06-05T14:42:36Z
label: Altri grossisti @it
label: Autres grossistes @fr
label: Otros mayoristas @es
label: Outros atacadistas @pt
label: Sonst. Großhändler @de
label: Другие оптовики @ru
label: 一般卸売 @ja
label: 其他批发商 @zh
label: 其他批發 @zh-hant
label: 기타 도매업 @ko
definition: This industry subgroup includes companies that wholesale and distribute products not elsewhere classified.
notation: 11121014
valid from: 2024-06-07

Import & Export
type: BicsLevel4SubIndustry
type: Classifier
type: NamedIndividual
is sub industry of: Wholesale - Discretionary
is contemporary version of: http://data.ga-group.nl/ics/bics/11121015
is version of: http://data.ga-group.nl/ics/bics/11121015
replaces: http://data.ga-group.nl/ics/bics/2020/11121015
imported on: 2026-06-08T13:40:52.236Z
last refreshed on: 2026-06-08T13:41:38.450Z
source accessed on: 2024-06-05T14:42:36Z
source last accessed on: 2024-06-05T14:42:36Z
label: Import-export @fr
label: Import/Export @it
label: Importação e exportação @pt
label: Importaciones y exportaciones @es
label: Импорт и экспорт @ru
label: 輸入･輸出 @ja
label: 进出口 @zh
label: 進口及出口 @zh-hant
label: 수입 & 수출 @ko
definition: This industry subgroup includes companies that wholesale international trade merchandise using their own money or on behalf of someone else for a fee.
notation: 11121015
valid from: 2024-06-07

Wholesale - Discretionary
type: BicsLevel3Industry
type: Classifier
type: NamedIndividual
is industry of: Retail & Whsle - Discretionary
is contemporary version of: http://data.ga-group.nl/ics/bics/111210
is version of: http://data.ga-group.nl/ics/bics/111210
replaces: http://data.ga-group.nl/ics/bics/2020/111210
imported on: 2026-06-08T13:40:52.236Z
last refreshed on: 2026-06-08T13:41:38.450Z
source accessed on: 2024-06-05T14:42:36Z
source last accessed on: 2024-06-05T14:42:36Z
label: All'ingrosso - Discrezionale @it
label: Atacado - Discricionário @pt
label: Großhandel - Gebrauchsgüter @de
label: Mayorista - discrecionario @es
label: Vte en gros - discrétionnaire @fr
label: Опт. торговля - выб. спрос @ru
label: 卸売-一般消費財 @ja
label: 批发-非必需品 @zh
label: 經銷商-非核心消費 @zh-hant
label: 도매 - 자유소비재 @ko
definition: This industry includes companies that wholesale and distribute consumer discretionary products. Such companies do not manufacture their own products, but instead distribute other companies' products in bulk to intermediaries in the supply chain or commercial and industrial clients.
notation: 111210
valid from: 2024-06-07

Auto Parts & Accessories Stores
type: BicsLevel5Segment
type: Classifier
type: NamedIndividual
is level5 segment of: Automotive Retailers
is contemporary version of: http://data.ga-group.nl/ics/bics/1112111010
is version of: http://data.ga-group.nl/ics/bics/1112111010
replaces: http://data.ga-group.nl/ics/bics/2020/1112111010
imported on: 2026-06-08T13:40:52.236Z
last refreshed on: 2026-06-08T13:41:38.450Z
source accessed on: 2024-06-05T14:42:36Z
source last accessed on: 2024-06-05T14:42:36Z
label: Läden für Autoteile & -zubehör @de
label: Lojas de auto peças e acessórios @pt
label: Magasin de pièces et accessoires automobiles @fr
label: Negozi autoricambi e accessori @it
label: Tiendas de autopartes y accesorios @es
label: З/части и аксессуары для автомоб. - магазины @ru
label: 汽車零件及配件店 @zh-hant
label: 汽车零配件商店 @zh
label: 自動車部品･ｱｸｾｻﾘｰ店 @ja
label: 자동차 부품 & 액세서리 매장 @ko
definition: This segment includes stores that specialize in retailing automotive parts, accessories, and related tools.
notation: 1112111010
valid from: 2024-06-07

Auto Repair Centers
type: BicsLevel5Segment
type: Classifier
type: NamedIndividual
is level5 segment of: Automotive Retailers
is contemporary version of: http://data.ga-group.nl/ics/bics/1112111011
is version of: http://data.ga-group.nl/ics/bics/1112111011
replaces: http://data.ga-group.nl/ics/bics/2020/1112111011
imported on: 2026-06-08T13:40:52.236Z
last refreshed on: 2026-06-08T13:41:38.450Z
source accessed on: 2024-06-05T14:42:36Z
source last accessed on: 2024-06-05T14:42:36Z
label: Autoreparaturwerkstätten @de
label: Centres de réparation de voitures @fr
label: Centri autoriparazioni @it
label: Oficinas de consertos de carros @pt
label: Reparación de automóviles @es
label: Авторемонтные центры @ru
label: 汽車修理中心 @zh-hant
label: 汽车维修中心 @zh
label: 自動車修理ｾﾝﾀｰ @ja
label: 自動車修理ｾﾝ���ｰ @ja
label: 자동차 수리 센터 @ko
definition: This segment includes companies that provide automotive repair and maintenance services.
notation: 1112111011
valid from: 2024-06-07

Car Dealers
type: BicsLevel5Segment
type: Classifier
type: NamedIndividual
is level5 segment of: Automotive Retailers
is contemporary version of: http://data.ga-group.nl/ics/bics/1112111012
is version of: http://data.ga-group.nl/ics/bics/1112111012
replaces: http://data.ga-group.nl/ics/bics/2020/1112111012
imported on: 2026-06-08T13:40:52.236Z
last refreshed on: 2026-06-08T13:41:38.450Z
source accessed on: 2024-06-05T14:42:36Z
source last accessed on: 2024-06-05T14:42:36Z
label: Autohändler @de
label: Concesionarios de autos @es
label: Concessionárias de automóveis @pt
label: Concessionari auto @it
label: Concessionnaires automobiles @fr
label: Дилеры автомобилей @ru
label: 汽車經銷商 @zh-hant
label: 汽车经销商 @zh
label: 自動車販売店 @ja
label: 자동차 딜러 @ko
definition: This segment includes companies that sell both new and used vehicles including passenger cars, light trucks, and utility vehicles.
notation: 1112111012
valid from: 2024-06-07

Passenger Veh Leasing - Electric
type: BicsLevel7Segment
type: Classifier
type: NamedIndividual
is level7 segment of: Passenger Vehicle Leasing
is contemporary version of: http://data.ga-group.nl/ics/bics/11121110131010
is version of: http://data.ga-group.nl/ics/bics/11121110131010
replaces: http://data.ga-group.nl/ics/bics/2020/11121110131010
imported on: 2026-06-08T13:40:52.236Z
last refreshed on: 2026-06-08T13:41:38.450Z
source accessed on: 2024-06-05T14:42:36Z
source last accessed on: 2024-06-05T14:42:36Z
label: Arrendamiento veh de pasajeros - eléctricos @es
label: Leasing veíc passageiros - eletricidade @pt
label: Leasing veicoli passeggeri - Elettrici @it
label: Location à bail de véh de passagers - électricité @fr
label: Pkw-Leasing - Elektrisch @de
label: Лизинг легковых автомобилей - на электрич. @ru
label: 乗用車ﾘｰｽ-電気 @ja
label: 乘用车辆租赁-电动 @zh
label: 客車租賃-電力 @zh-hant
label: 승용차 리스 - 전기 @ko
definition: This segment includes companies that lease electric passenger vehicles.
notation: 11121110131010
valid from: 2024-06-07

Passenger Veh Leasing - Fossil Fuels
type: BicsLevel7Segment
type: Classifier
type: NamedIndividual
is level7 segment of: Passenger Vehicle Leasing
is contemporary version of: http://data.ga-group.nl/ics/bics/11121110131011
is version of: http://data.ga-group.nl/ics/bics/11121110131011
replaces: http://data.ga-group.nl/ics/bics/2020/11121110131011
imported on: 2026-06-08T13:40:52.236Z
last refreshed on: 2026-06-08T13:41:38.450Z
source accessed on: 2024-06-05T14:42:36Z
source last accessed on: 2024-06-05T14:42:36Z
label: Arrendamiento veh de pasajero - combustibles fósiles @es
label: Leasing veíc passageiros - combustíveis fósseis @pt
label: Leasing veicoli passeggeri - Combustibili fossili @it
label: Location à bail de véh de passagers - combustibles fossiles @fr
label: Pkw-Leasing - Fossile Brennstoffe @de
label: Лизинг легковых автомобилей - ископ. топливо @ru
label: 乗用車ﾘｰｽ-化石燃料 @ja
label: 乘用车辆租赁-化石燃料 @zh
label: 客車租賃-化石燃料 @zh-hant
label: 승용차 리스 - 화석 연료 @ko
definition: This segment includes companies that lease fossil fuel passenger vehicles.
notation: 11121110131011
valid from: 2024-06-07

Passenger Vehicle Leasing
type: BicsLevel6Segment
type: Classifier
type: NamedIndividual
is level6 segment of: Passenger Car Rental & Leasing
is contemporary version of: http://data.ga-group.nl/ics/bics/111211101310
is version of: http://data.ga-group.nl/ics/bics/111211101310
replaces: http://data.ga-group.nl/ics/bics/2020/111211101310
imported on: 2026-06-08T13:40:52.236Z
last refreshed on: 2026-06-08T13:41:38.450Z
source accessed on: 2024-06-05T14:42:36Z
source last accessed on: 2024-06-05T14:42:36Z
label: Arrendamento de veículos de passageiros @pt
label: Arrendamiento de carros de pasajero @es
label: Crédit-bail de voitures particulières @fr
label: Leasing autoveicoli @it
label: Pkw-Leasing @de
label: Лизинг легковых автомобилей @ru
label: 乗用車ﾘｰｽ @ja
label: 客車租賃 @zh-hant
label: 客运车辆租赁 @zh
label: 승용차 리스 @ko
definition: This segment includes companies that lease passenger cars. Excludes companies that provide a driver for the vehicle (see Taxi Services).
notation: 111211101310
valid from: 2024-06-07

Passenger Veh Rental - Electric
type: BicsLevel7Segment
type: Classifier
type: NamedIndividual
is level7 segment of: Passenger Vehicle Rental
is contemporary version of: http://data.ga-group.nl/ics/bics/11121110131110
is version of: http://data.ga-group.nl/ics/bics/11121110131110
replaces: http://data.ga-group.nl/ics/bics/2020/11121110131110
imported on: 2026-06-08T13:40:52.236Z
last refreshed on: 2026-06-08T13:41:38.450Z
source accessed on: 2024-06-05T14:42:36Z
source last accessed on: 2024-06-05T14:42:36Z
label: Alquiler veh pasajeros - eléctricos @es
label: Aluguel veíc passageiros - eletricidade @pt
label: Location de véh de passagers - électricité @fr
label: Noleggio veicoli passeggeri - Elettrici @it
label: Pkw-Vermietung - Elektrisch @de
label: Аренда легковых автомобилей - на электрич. @ru
label: 乗用車ﾚﾝﾀﾙ-電気 @ja
label: 乘用车辆出租-电动 @zh
label: 客車出租-電力 @zh-hant
label: 승용차 렌탈 - 전기 @ko
definition: This segment includes companies that rent electric passenger vehicles.
notation: 11121110131110
valid from: 2024-06-07

Passenger Veh Rental - Fossil Fuels
type: BicsLevel7Segment
type: Classifier
type: NamedIndividual
is level7 segment of: Passenger Vehicle Rental
is contemporary version of: http://data.ga-group.nl/ics/bics/11121110131111
is version of: http://data.ga-group.nl/ics/bics/11121110131111
replaces: http://data.ga-group.nl/ics/bics/2020/11121110131111
imported on: 2026-06-08T13:40:52.236Z
last refreshed on: 2026-06-08T13:41:38.450Z
source accessed on: 2024-06-05T14:42:36Z
source last accessed on: 2024-06-05T14:42:36Z
label: Alquiler veh de pasajero - combustibles fósiles @es
label: Aluguel veíc passageiros - combustíveis fósseis @pt
label: Location de véh de passagers - combustibles fossiles @fr
label: Noleggio veicoli passeggeri - Combustibili fossili @it
label: Pkw-Vermietung - Fossile Brennstoffe @de
label: Аренда легковых автомобилей - ископ. топливо @ru
label: 乗用車ﾚﾝﾀﾙ-化石燃料 @ja
label: 乘用车辆出租-化石燃料 @zh
label: 客車出租-化石燃料 @zh-hant
label: 승용차 렌탈 - 화석 연료 @ko
definition: This segment includes companies that rent fossil fuel passenger vehicles.
notation: 11121110131111
valid from: 2024-06-07

Passenger Vehicle Rental
type: BicsLevel6Segment
type: Classifier
type: NamedIndividual
is level6 segment of: Passenger Car Rental & Leasing
is contemporary version of: http://data.ga-group.nl/ics/bics/111211101311
is version of: http://data.ga-group.nl/ics/bics/111211101311
replaces: http://data.ga-group.nl/ics/bics/2020/111211101311
imported on: 2026-06-08T13:40:52.236Z
last refreshed on: 2026-06-08T13:41:38.450Z
source accessed on: 2024-06-05T14:42:36Z
source last accessed on: 2024-06-05T14:42:36Z
label: Affitto autoveicoli @it
label: Alquiler de carros de pasajero @es
label: Aluguel de veículos de passageiros @pt
label: Location de voitures particulières @fr
label: Pkw-Vermietung @de
label: Аренда легковых автомобилей @ru
label: 乗用車ﾚﾝﾀﾙ @ja
label: 客車出租 @zh-hant
label: 客运车辆租赁 @zh
label: 승용차 렌트 @ko
definition: This segment includes companies that rent passenger cars. Excludes companies that provide a driver for the vehicle (see Taxi Services).
notation: 111211101311
valid from: 2024-06-07

Passenger Car Rental & Leasing
type: BicsLevel5Segment
type: Classifier
type: NamedIndividual
is level5 segment of: Automotive Retailers
is contemporary version of: http://data.ga-group.nl/ics/bics/1112111013
is version of: http://data.ga-group.nl/ics/bics/1112111013
replaces: http://data.ga-group.nl/ics/bics/2020/1112111013
imported on: 2026-06-08T13:40:52.236Z
last refreshed on: 2026-06-08T13:41:38.450Z
source accessed on: 2024-06-05T14:42:36Z
source last accessed on: 2024-06-05T14:42:36Z
label: Aluguel e leasing de carro de passageiro @pt
label: Aquiler y arrendamiento de carros de pasajero @es
label: Autovermietung & -leasing @de
label: Location et crédit-bail de voitures particulières @fr
label: Locazione e leasing automobili @it
label: Прокат и лизинг легковых автомобилей @ru
label: 乗用車ﾚﾝﾀﾙ･ﾘｰｽ @ja
label: 乘用车出租与租赁 @zh
label: 客車出租及租賃 @zh-hant
label: 승용차 렌트 & 리스 @ko
definition: This segment includes companies that rent and lease passenger cars.
notation: 1112111013
valid from: 2024-06-07

Automotive Retailers
type: BicsLevel4SubIndustry
type: Classifier
type: NamedIndividual
is sub industry of: Retail - Discretionary
is contemporary version of: http://data.ga-group.nl/ics/bics/11121110
is version of: http://data.ga-group.nl/ics/bics/11121110
replaces: http://data.ga-group.nl/ics/bics/2020/11121110
imported on: 2026-06-08T13:40:52.236Z
last refreshed on: 2026-06-08T13:41:38.450Z
source accessed on: 2024-06-05T14:42:36Z
source last accessed on: 2024-06-05T14:42:36Z
label: Auto-EH @de
label: Comercio al por menor autos @es
label: Détaillants pour automobiles @fr
label: Revendedores de automóveis @pt
label: Rivenditori automobili @it
label: Розничная продажа автомобилей @ru
label: 汽車零售商 @zh-hant
label: 汽车零售商 @zh
label: 自動車小売 @ja
label: 자동차 소매업 @ko
definition: This industry subgroup includes stores that specialize in retailing automotive parts and products. Such companies may also provide related repair or rental services.
notation: 11121110
valid from: 2024-06-07

Mail Catalog Retailers
type: BicsLevel5Segment
type: Classifier
type: NamedIndividual
is level5 segment of: Catalog & TV Based Retailers
is contemporary version of: http://data.ga-group.nl/ics/bics/1112111110
is version of: http://data.ga-group.nl/ics/bics/1112111110
replaces: http://data.ga-group.nl/ics/bics/2020/1112111110
imported on: 2026-06-08T13:40:52.236Z
last refreshed on: 2026-06-08T13:41:38.450Z
source accessed on: 2024-06-05T14:42:36Z
source last accessed on: 2024-06-05T14:42:36Z
label: Catálogo al por menor @es
label: Détaillants vente par correspondance @fr
label: Rivenditori catalogo posta @it
label: Varejistas de catálogo de correios @pt
label: Versandkatalog EH @de
label: Розничная продажа по каталогам @ru
label: 通信販売 @ja
label: 邮购商品零售商 @zh
label: 郵購型錄零售 @zh-hant
label: 우편주문 카탈로그 소매업 @ko
definition: This segment includes companies that retail merchandise through mail catalog as well as companies that retail from catalog showrooms.
notation: 1112111110
valid from: 2024-06-07

Multi-Level Marketing
type: BicsLevel5Segment
type: Classifier
type: NamedIndividual
is level5 segment of: Catalog & TV Based Retailers
is contemporary version of: http://data.ga-group.nl/ics/bics/1112111111
is version of: http://data.ga-group.nl/ics/bics/1112111111
replaces: http://data.ga-group.nl/ics/bics/2020/1112111111
imported on: 2026-06-08T13:40:52.236Z
last refreshed on: 2026-06-08T13:41:38.450Z
source accessed on: 2024-06-05T14:42:36Z
source last accessed on: 2024-06-05T14:42:36Z
label: Márketing múlt nivel @es
label: Marketing de vários níveis @pt
label: Mrkting multi-niveau @fr
label: Multi-Level Marketg @de
label: Vendita multilivello @it
label: Многоуровневый маркетинг @ru
label: 多层次市场营销 @zh
label: 多層次傳銷 @zh-hant
label: 복수 레벨 마케팅 @ko
label: ﾏﾙﾁ商法 @ja
definition: This segment includes companies that sell consumer products through a direct sales force.
notation: 1112111111
valid from: 2024-06-07

TV Based Retailers
type: BicsLevel5Segment
type: Classifier
type: NamedIndividual
is level5 segment of: Catalog & TV Based Retailers
is contemporary version of: http://data.ga-group.nl/ics/bics/1112111112
is version of: http://data.ga-group.nl/ics/bics/1112111112
replaces: http://data.ga-group.nl/ics/bics/2020/1112111112
imported on: 2026-06-08T13:40:52.236Z
last refreshed on: 2026-06-08T13:41:38.450Z
source accessed on: 2024-06-05T14:42:36Z
source last accessed on: 2024-06-05T14:42:36Z
label: Comercio al por menor basado en televisión @es
label: Détaillants Vente à la télé @fr
label: Rivenditori TV @it
label: TV-basierter Einzelhandel @de
label: TV홈쇼핑 소매업 @ko
label: Varejistas com base TV @pt
label: Телевизионная розничная торговля @ru
label: 电视购物零售商 @zh
label: 電視購物零售 @zh-hant
label: ﾃﾚﾋﾞ通販小売 @ja
definition: This segment includes companies that retail merchandise through television.
notation: 1112111112
valid from: 2024-06-07

Catalog & TV Based Retailers
type: BicsLevel4SubIndustry
type: Classifier
type: NamedIndividual
is sub industry of: Retail - Discretionary
is contemporary version of: http://data.ga-group.nl/ics/bics/11121111
is version of: http://data.ga-group.nl/ics/bics/11121111
replaces: http://data.ga-group.nl/ics/bics/2020/11121111
imported on: 2026-06-08T13:40:52.236Z
last refreshed on: 2026-06-08T13:41:38.450Z
source accessed on: 2024-06-05T14:42:36Z
source last accessed on: 2024-06-05T14:42:36Z
label: Détaillants vente par catalogue/à la télé @fr
label: Katalog- & TV-basierte EH @de
label: Minoristas basados en catálogo y tv @es
label: Rivenditori catalogo e TV @it
label: Varejista catálogo e TV @pt
label: Розничн. торговля - магазины с прдж по ТВ и через каталоги @ru
label: 邮购与电视购物零售商 @zh
label: 郵購及電視購物零售 @zh-hant
label: 카탈로그 & TV홈쇼핑 소매업 @ko
label: ｶﾀﾛｸﾞ･ﾃﾚﾋﾞ通販小売 @ja
definition: This industry subgroup includes companies that retail merchandise through mail catalogs or television.
notation: 11121111
valid from: 2024-06-07

Consumer Electronics Stores
type: BicsLevel5Segment
type: Classifier
type: NamedIndividual
is level5 segment of: Electronics & Appliances Stores
is contemporary version of: http://data.ga-group.nl/ics/bics/1112111210
is version of: http://data.ga-group.nl/ics/bics/1112111210
replaces: http://data.ga-group.nl/ics/bics/2020/1112111210
imported on: 2026-06-08T13:40:52.236Z
last refreshed on: 2026-06-08T13:41:38.450Z
source accessed on: 2024-06-05T14:42:36Z
source last accessed on: 2024-06-05T14:42:36Z
label: Lojas de eletrônicos para consumidores @pt
label: Magasins d'appareils électroniques grand public @fr
label: Negozi di elettronica @it
label: Tiendas de electrodomésticos @es
label: Verbraucherelektronikläden @de
label: Магазины бытовой электроники @ru
label: 家庭用電子機器店 @ja
label: 消費性電器店 @zh-hant
label: 电子消费品商店 @zh
label: 소비자 전자제품 매장 @ko
definition: This segment includes stores that specialize in retailing consumer electronics.
notation: 1112111210
valid from: 2024-06-07

Household Appliance Stores
type: BicsLevel5Segment
type: Classifier
type: NamedIndividual
is level5 segment of: Electronics & Appliances Stores
is contemporary version of: http://data.ga-group.nl/ics/bics/1112111211
is version of: http://data.ga-group.nl/ics/bics/1112111211
replaces: http://data.ga-group.nl/ics/bics/2020/1112111211
imported on: 2026-06-08T13:40:52.236Z
last refreshed on: 2026-06-08T13:41:38.450Z
source accessed on: 2024-06-05T14:42:36Z
source last accessed on: 2024-06-05T14:42:36Z
label: Läden für Haushaltsgeräte @de
label: Lojas de eletrodomésticos @pt
label: Magasins d'appareils ménagers @fr
label: Negozi elettrodomestici @it
label: Tiendas de aparatos domésticos @es
label: Магазины бытовой техники @ru
label: 家庭器具店 @zh-hant
label: 家庭用電気機器店 @ja
label: 家用电器商店 @zh
label: 가전제품 매장 @ko
definition: This segment includes stores that specialize in retailing household appliances.
notation: 1112111211
valid from: 2024-06-07

Electronics & Appliances Stores
type: BicsLevel4SubIndustry
type: Classifier
type: NamedIndividual
is sub industry of: Retail - Discretionary
is contemporary version of: http://data.ga-group.nl/ics/bics/11121112
is version of: http://data.ga-group.nl/ics/bics/11121112
replaces: http://data.ga-group.nl/ics/bics/2020/11121112
imported on: 2026-06-08T13:40:52.236Z
last refreshed on: 2026-06-08T13:41:38.450Z
source accessed on: 2024-06-05T14:42:36Z
source last accessed on: 2024-06-05T14:42:36Z
label: Geschäfte für Elektronik & Haushaltsgeräte @de
label: Lojas de eletrodomésticos e eletrônicos @pt
label: Mag d'électro/appareils ménag @fr
label: Negozi elettrodom e casalinghi @it
label: Tiendas de enseres y electrónicos @es
label: Бытовая электр. - магазины @ru
label: 家電店 @ja
label: 消費電子及家電品店 @zh-hant
label: 电子和家电商店 @zh
label: 전자 & 가전 제품 매장 @ko
definition: This industry subgroup includes stores that specialize in retailing consumer electronics, appliances, and other technology focused products.
notation: 11121112
valid from: 2024-06-07

High-End Department Stores
type: BicsLevel5Segment
type: Classifier
type: NamedIndividual
is level5 segment of: Department Stores
is contemporary version of: http://data.ga-group.nl/ics/bics/1112111310
is version of: http://data.ga-group.nl/ics/bics/1112111310
replaces: http://data.ga-group.nl/ics/bics/2020/1112111310
imported on: 2026-06-08T13:40:52.236Z
last refreshed on: 2026-06-08T13:41:38.450Z
source accessed on: 2024-06-05T14:42:36Z
source last accessed on: 2024-06-05T14:42:36Z
label: Grandi magazzini di lusso @it
label: Grands magasins haut de gamme @fr
label: Lojas de departamento de luxo @pt
label: Luxuskaufhäuser @de
label: Tiendas de departamento de lujo @es
label: Элитные универсальные магазины @ru
label: 高端百货商店 @zh
label: 高級百貨公司 @zh-hant
label: 高級百貨店 @ja
label: 최고급 백화점 @ko
definition: This segment includes department stores that retail high-end and luxury products.
notation: 1112111310
valid from: 2024-06-07

Mid-Tier Department Stores
type: BicsLevel5Segment
type: Classifier
type: NamedIndividual
is level5 segment of: Department Stores
is contemporary version of: http://data.ga-group.nl/ics/bics/1112111311
is version of: http://data.ga-group.nl/ics/bics/1112111311
replaces: http://data.ga-group.nl/ics/bics/2020/1112111311
imported on: 2026-06-08T13:40:52.236Z
last refreshed on: 2026-06-08T13:41:38.450Z
source accessed on: 2024-06-05T14:42:36Z
source last accessed on: 2024-06-05T14:42:36Z
label: Grandi mag liv medio @it
label: Grands magasins niveau-moyen @fr
label: Mid-Tier Kaufhäuser @de
label: Strs depart prazo médio @pt
label: Tiendas de depto de nivel medio @es
label: Магазины среднего уровня @ru
label: 中型百貨公司 @zh-hant
label: 中型百貨店 @ja
label: 中档百货店 @zh
label: 中档百��店 @zh
label: 중형급 백화점 @ko
definition: This segment includes department stores that retail low and mid-price products.
notation: 1112111311
valid from: 2024-06-07

Department Stores
type: BicsLevel4SubIndustry
type: Classifier
type: NamedIndividual
is sub industry of: Retail - Discretionary
is contemporary version of: http://data.ga-group.nl/ics/bics/11121113
is version of: http://data.ga-group.nl/ics/bics/11121113
replaces: http://data.ga-group.nl/ics/bics/2020/11121113
imported on: 2026-06-08T13:40:52.236Z
last refreshed on: 2026-06-08T13:41:38.450Z
source accessed on: 2024-06-05T14:42:36Z
source last accessed on: 2024-06-05T14:42:36Z
label: Grandi magazzini @it
label: Grands magasins @fr
label: Kaufhäuser @de
label: Lojas departamento @pt
label: Tiendas departamento @es
label: Универмаги @ru
label: 百貨公司 @zh-hant
label: 百貨店 @ja
label: 百货商店 @zh
label: 백화점 @ko
definition: This industry subgroup includes retail stores with separate departments for various merchandise lines, such as apparel, jewelry, home furnishings, and linens, each with separate cash registers and sales associates.
notation: 11121113
valid from: 2024-06-07

Brick & Stone Bldg Matl Dealers
type: BicsLevel6Segment
type: Classifier
type: NamedIndividual
is level6 segment of: Building Materials Dealers
is contemporary version of: http://data.ga-group.nl/ics/bics/111211141010
is version of: http://data.ga-group.nl/ics/bics/111211141010
replaces: http://data.ga-group.nl/ics/bics/2020/111211141010
imported on: 2026-06-08T13:40:52.236Z
last refreshed on: 2026-06-08T13:41:38.450Z
source accessed on: 2024-06-05T14:42:36Z
source last accessed on: 2024-06-05T14:42:36Z
label: Concessionari mat costruz mattoni e pietra @it
label: Dealers mat de edif ladrillo y piedra @es
label: Distrib matériaux de construction en pierres/briques @fr
label: Distrib tijolos, pedras e mat de constr @pt
label: Händler von Baumaterialien aus Backstein & Stein @de
label: Торговля кирпичом, камнем @ru
label: 煉瓦･石材･建築資材流通 @ja
label: 砖石建材经销商 @zh
label: 磚塊及石頭建材經銷商 @zh-hant
label: 벽돌 & 석재 건축자재 딜러 @ko
definition: This segment includes companies that wholesale and distribute brick, stone, and related construction materials.
notation: 111211141010
valid from: 2024-06-07

Plumbing & HVAC Dealers
type: BicsLevel6Segment
type: Classifier
type: NamedIndividual
is level6 segment of: Building Materials Dealers
is contemporary version of: http://data.ga-group.nl/ics/bics/111211141011
is version of: http://data.ga-group.nl/ics/bics/111211141011
replaces: http://data.ga-group.nl/ics/bics/2020/111211141011
imported on: 2026-06-08T13:40:52.236Z
last refreshed on: 2026-06-08T13:41:38.450Z
source accessed on: 2024-06-05T14:42:36Z
source last accessed on: 2024-06-05T14:42:36Z
label: Agentes equip tub e HVAC @pt
label: Comerc fontanería, HVAC @es
label: Distrib piombat e HVAC @it
label: Distrib. plomberie et CVCA @fr
label: Händler für Klempnerei & Heizung @de
label: Торговля сантехникой и отопительным оборудованием и материалами (жидкостными) @ru
label: 管道与HVAC经销商 @zh
label: 配管通風冷暖氣經銷商 @zh-hant
label: 配管･冷暖房空調設備流通 @ja
label: 배관 및 HVAC 판매업체 @ko
definition: This segment includes companies that wholesale and distribute consumer-grade plumbing and heating equipment and supplies. Excludes commercial-grade products (see Industrial Equip & Supplies Distr).
notation: 111211141011
valid from: 2024-06-07

Roof, Siding & Insulation Distr
type: BicsLevel6Segment
type: Classifier
type: NamedIndividual
is level6 segment of: Building Materials Dealers
is contemporary version of: http://data.ga-group.nl/ics/bics/111211141012
is version of: http://data.ga-group.nl/ics/bics/111211141012
replaces: http://data.ga-group.nl/ics/bics/2020/111211141012
imported on: 2026-06-08T13:40:52.236Z
last refreshed on: 2026-06-08T13:41:38.450Z
source accessed on: 2024-06-05T14:42:36Z
source last accessed on: 2024-06-05T14:42:36Z
label: Distrib mat isolamento, rev paredes, telhados @pt
label: Distrib tetti, esterni e isolamento @it
label: Distrib toiture, bardage et isolants @fr
label: Distribución de techos, cubrimientos y aislamiento @es
label: Händler von Dachdeckung, Hausverkleidung & Isolierung @de
label: Торговля матер. для кровли, сайдинга и изоляции @ru
label: 屋根材･壁材･絶縁材流通 @ja
label: 屋頂、牆及隔間材料經銷商 @zh-hant
label: 屋顶、墙板及绝缘材料分销商 @zh
label: 지붕, 판자벽 & 단열재 판매업 @ko
definition: This segment includes companies that wholesale and distribute roofing, siding, and insulation materials.
notation: 111211141012
valid from: 2024-06-07

Wood Products Dealers
type: BicsLevel6Segment
type: Classifier
type: NamedIndividual
is level6 segment of: Building Materials Dealers
is contemporary version of: http://data.ga-group.nl/ics/bics/111211141013
is version of: http://data.ga-group.nl/ics/bics/111211141013
replaces: http://data.ga-group.nl/ics/bics/2020/111211141013
imported on: 2026-06-08T13:40:52.236Z
last refreshed on: 2026-06-08T13:41:38.450Z
source accessed on: 2024-06-05T14:42:36Z
source last accessed on: 2024-06-05T14:42:36Z
label: Agentes prod madeira @pt
label: Comerciantes prod madera @es
label: Distrib. produits ligneux @fr
label: Distributori di legnami @it
label: Händler für Holzprodukte @de
label: Торговля лесоматериалами @ru
label: 木制品经销商 @zh
label: 木材製品流通 @ja
label: 木製品經銷商 @zh-hant
label: 목제품 판매업체 @ko
definition: This segment includes companies that wholesale and distribute lumber, plywood, millwork, and related wood products.
notation: 111211141013
valid from: 2024-06-07

Building Materials Dealers
type: BicsLevel5Segment
type: Classifier
type: NamedIndividual
is level5 segment of: Home Products Stores
is contemporary version of: http://data.ga-group.nl/ics/bics/1112111410
is version of: http://data.ga-group.nl/ics/bics/1112111410
replaces: http://data.ga-group.nl/ics/bics/2020/1112111410
imported on: 2026-06-08T13:40:52.236Z
last refreshed on: 2026-06-08T13:41:38.450Z
source accessed on: 2024-06-05T14:42:36Z
source last accessed on: 2024-06-05T14:42:36Z
label: Concessionari materiali edili @it
label: Dealers de mat de constr @es
label: Distribuidores de materiais de construção @pt
label: Distributeurs de matériaux de construction @fr
label: Händler von Baumaterialien @de
label: Продавцы строительных материалов @ru
label: 建材經銷商 @zh-hant
label: 建材经销商 @zh
label: 建築資材流通 @ja
label: 건축자재 딜러 @ko
definition: This segment includes companies that wholesale and distribute building materials and products.
notation: 1112111410
valid from: 2024-06-07

Hardware Stores
type: BicsLevel6Segment
type: Classifier
type: NamedIndividual
is level6 segment of: Home Improvement Stores
is contemporary version of: http://data.ga-group.nl/ics/bics/111211141110
is version of: http://data.ga-group.nl/ics/bics/111211141110
replaces: http://data.ga-group.nl/ics/bics/2020/111211141110
imported on: 2026-06-08T13:40:52.236Z
last refreshed on: 2026-06-08T13:41:38.450Z
source accessed on: 2024-06-05T14:42:36Z
source last accessed on: 2024-06-05T14:42:36Z
label: Eisenwarengeschäfte @de
label: Lojas de ferragens @pt
label: Negozi di ferramenta @it
label: Quincailleries @fr
label: Tiendas de herrajes y cerraduras @es
label: Магазины скобяных товаров @ru
label: 五金店 @zh
label: 五金行 @zh-hant
label: 金物店 @ja
label: 철물 매장 @ko
definition: This segment includes small-format home improvement stores.
notation: 111211141110
valid from: 2024-06-07

Home Centers
type: BicsLevel6Segment
type: Classifier
type: NamedIndividual
is level6 segment of: Home Improvement Stores
is contemporary version of: http://data.ga-group.nl/ics/bics/111211141111
is version of: http://data.ga-group.nl/ics/bics/111211141111
replaces: http://data.ga-group.nl/ics/bics/2020/111211141111
imported on: 2026-06-08T13:40:52.236Z
last refreshed on: 2026-06-08T13:41:38.450Z
source accessed on: 2024-06-05T14:42:36Z
source last accessed on: 2024-06-05T14:42:36Z
label: Centre de rénovation @fr
label: Centros p/el hogar @es
label: Home-Center @de
label: Negozi articoli casa @it
label: Домашние центры @ru
label: 家居用品中心 @zh
label: 가정용품 소매업 @ko
label: ﾎｰﾑｾﾝﾀｰ @ja
definition: This segment includes big-box home improvement stores offering a diversified range of products and specific departments for various merchandise lines.
notation: 111211141111
valid from: 2024-06-07

Nursery & Garden Centers
type: BicsLevel6Segment
type: Classifier
type: NamedIndividual
is level6 segment of: Home Improvement Stores
is contemporary version of: http://data.ga-group.nl/ics/bics/111211141112
is version of: http://data.ga-group.nl/ics/bics/111211141112
replaces: http://data.ga-group.nl/ics/bics/2020/111211141112
imported on: 2026-06-08T13:40:52.236Z
last refreshed on: 2026-06-08T13:41:38.450Z
source accessed on: 2024-06-05T14:42:36Z
source last accessed on: 2024-06-05T14:42:36Z
label: Centri coltivaz e giardin @it
label: Centros de invernaderos y jardinería @es
label: Gärtnereien & Gartengeschäfte @de
label: Pépinières et centres de jardinage @fr
label: Viveiro e jardinagem @pt
label: Рассадно-садовые центры @ru
label: 苗圃及园艺中心 @zh
label: 苗圃及園藝中心 @zh-hant
label: 苗木･園芸ｾﾝﾀｰ @ja
label: 종묘 & 정원 센터 @ko
definition: This segment includes home improvement stores specialized in seeds, plants, gardening supplies, and related equipment.
notation: 111211141112
valid from: 2024-06-07

Home Improvement Stores
type: BicsLevel5Segment
type: Classifier
type: NamedIndividual
is level5 segment of: Home Products Stores
is contemporary version of: http://data.ga-group.nl/ics/bics/1112111411
is version of: http://data.ga-group.nl/ics/bics/1112111411
replaces: http://data.ga-group.nl/ics/bics/2020/1112111411
imported on: 2026-06-08T13:40:52.236Z
last refreshed on: 2026-06-08T13:41:38.450Z
source accessed on: 2024-06-05T14:42:36Z
source last accessed on: 2024-06-05T14:42:36Z
label: Baumarkt @de
label: Lojas de renovação casas @pt
label: Magasins de bricolage/rénov @fr
label: Negozi fai da te @it
label: Tiendas proyectos domésticos @es
label: Магазины товаров для благоустройства дома @ru
label: 住宅関連用品店 @ja
label: 家居装饰店 @zh
label: 居家修繕商店 @zh-hant
label: 주택개량 상점 @ko
definition: This segment includes stores that specialize in retailing products used to build and improve homes such as gardening products, lumber, paint, plumbing, tools, lighting, hardware, and flooring.
notation: 1112111411
valid from: 2024-06-07

Home Furniture Stores
type: BicsLevel6Segment
type: Classifier
type: NamedIndividual
is level6 segment of: Home Furnishings Stores
is contemporary version of: http://data.ga-group.nl/ics/bics/111211141210
is version of: http://data.ga-group.nl/ics/bics/111211141210
replaces: http://data.ga-group.nl/ics/bics/2020/111211141210
imported on: 2026-06-08T13:40:52.236Z
last refreshed on: 2026-06-08T13:41:38.450Z
source accessed on: 2024-06-05T14:42:36Z
source last accessed on: 2024-06-05T14:42:36Z
label: Geschäfte für Haushaltsmöbel @de
label: Lojas de móveis para casa @pt
label: Magasins de meubles @fr
label: Mueblerías domésticas @es
label: Negozi mobili per la casa @it
label: Магаз. мебели для дома @ru
label: 家具店 @zh-hant
label: 家庭用家具店 @ja
label: 家用家具商店 @zh
label: 가정용 가구 매장 @ko
definition: This segment includes stores that specialize in retailing home furniture products.
notation: 111211141210
valid from: 2024-06-07

Houseware Stores
type: BicsLevel6Segment
type: Classifier
type: NamedIndividual
is level6 segment of: Home Furnishings Stores
is contemporary version of: http://data.ga-group.nl/ics/bics/111211141211
is version of: http://data.ga-group.nl/ics/bics/111211141211
replaces: http://data.ga-group.nl/ics/bics/2020/111211141211
imported on: 2026-06-08T13:40:52.236Z
last refreshed on: 2026-06-08T13:41:38.450Z
source accessed on: 2024-06-05T14:42:36Z
source last accessed on: 2024-06-05T14:42:36Z
label: Geschäfte für Haushaltswaren @de
label: Lojas de utensílios domésticos @pt
label: Mag d'accessoires de maison @fr
label: Negozi articoli casalinghi @it
label: Tiendas de artículos domésticos @es
label: Магаз. тов. для дома @ru
label: 家居用品商店 @zh
label: 家庭用品店 @ja
label: 家飾品店 @zh-hant
label: 가정용품 매장 @ko
definition: This segment includes stores that specialize in retailing housewares and decorative home products. Includes specialized container, bedding, candle, and kitchenware stores.
notation: 111211141211
valid from: 2024-06-07

Home Furnishings Stores
type: BicsLevel5Segment
type: Classifier
type: NamedIndividual
is level5 segment of: Home Products Stores
is contemporary version of: http://data.ga-group.nl/ics/bics/1112111412
is version of: http://data.ga-group.nl/ics/bics/1112111412
replaces: http://data.ga-group.nl/ics/bics/2020/1112111412
imported on: 2026-06-08T13:40:52.236Z
last refreshed on: 2026-06-08T13:41:38.450Z
source accessed on: 2024-06-05T14:42:36Z
source last accessed on: 2024-06-05T14:42:36Z
label: Einrichtungsläden @de
label: Lojas de móveis domésticos @pt
label: Magasins de meubles @fr
label: Mueblerías domésticas @es
label: Negozi di arredi per la casa @it
label: Мебельн. магазины @ru
label: 室内装飾品店 @ja
label: 家装用品商店 @zh
label: 家飾品店 @zh-hant
label: 홈퍼니싱 매장 @ko
definition: This segment includes stores that specialize in retailing products used to decorate and furnish homes.
notation: 1112111412
valid from: 2024-06-07

Home Products Stores
type: BicsLevel4SubIndustry
type: Classifier
type: NamedIndividual
is sub industry of: Retail - Discretionary
is contemporary version of: http://data.ga-group.nl/ics/bics/11121114
is version of: http://data.ga-group.nl/ics/bics/11121114
replaces: http://data.ga-group.nl/ics/bics/2020/11121114
imported on: 2026-06-08T13:40:52.236Z
last refreshed on: 2026-06-08T13:41:38.450Z
source accessed on: 2024-06-05T14:42:36Z
source last accessed on: 2024-06-05T14:42:36Z
label: Haushaltswarenläden @de
label: Lojas prod domést @pt
label: Mag. prod. maison @fr
label: Negozi casalinghi @it
label: Tiendas prods dom @es
label: Мгз товаров для дома @ru
label: 家居产品专卖店 @zh
label: 家居產品店 @zh-hant
label: 家庭用品店 @ja
label: 가정용품 매장 @ko
definition: This industry subgroup includes stores that specialize in retailing products involved in building, improving, furnishing, or decorating homes.
notation: 11121114
valid from: 2024-06-07

Jewelry Stores
type: BicsLevel5Segment
type: Classifier
type: NamedIndividual
is level5 segment of: Jewelry & Watch Stores
is contemporary version of: http://data.ga-group.nl/ics/bics/1112111510
is version of: http://data.ga-group.nl/ics/bics/1112111510
replaces: http://data.ga-group.nl/ics/bics/2020/1112111510
imported on: 2026-06-08T13:40:52.236Z
last refreshed on: 2026-06-08T13:41:38.450Z
source accessed on: 2024-06-05T14:42:36Z
source last accessed on: 2024-06-05T14:42:36Z
label: Bijouteries @fr
label: Gioiellerie @it
label: Joalherias @pt
label: Joyerías @es
label: Juweliergeschäfte @de
label: Ювелирные магазины @ru
label: 宝石･貴金属店 @ja
label: 珠宝店 @zh
label: 珠寶店 @zh-hant
label: 보석판매점 @ko
definition: This segment includes stores that specialize in retailing jewelry.
notation: 1112111510
valid from: 2024-06-07

Watch Stores
type: BicsLevel5Segment
type: Classifier
type: NamedIndividual
is level5 segment of: Jewelry & Watch Stores
is contemporary version of: http://data.ga-group.nl/ics/bics/1112111511
is version of: http://data.ga-group.nl/ics/bics/1112111511
replaces: http://data.ga-group.nl/ics/bics/2020/1112111511
imported on: 2026-06-08T13:40:52.236Z
last refreshed on: 2026-06-08T13:41:38.450Z
source accessed on: 2024-06-05T14:42:36Z
source last accessed on: 2024-06-05T14:42:36Z
label: Lojas de relógios @pt
label: Magasins de montres @fr
label: Orologerie @it
label: Tiendas de relojes @es
label: Uhrengeschäfte @de
label: Магазины часов @ru
label: 時計店 @ja
label: 鐘錶店 @zh-hant
label: 钟表店 @zh
label: 시계 매장 @ko
definition: This segment includes stores that specialize in retailing watches.
notation: 1112111511
valid from: 2024-06-07

Jewelry & Watch Stores
type: BicsLevel4SubIndustry
type: Classifier
type: NamedIndividual
is sub industry of: Retail - Discretionary
is contemporary version of: http://data.ga-group.nl/ics/bics/11121115
is version of: http://data.ga-group.nl/ics/bics/11121115
replaces: http://data.ga-group.nl/ics/bics/2020/11121115
imported on: 2026-06-08T13:40:52.236Z
last refreshed on: 2026-06-08T13:41:38.450Z
source accessed on: 2024-06-05T14:42:36Z
source last accessed on: 2024-06-05T14:42:36Z
label: Gioiellerie e orologerie @it
label: Joalherias e lojas de relógios @pt
label: Joyería y tiendas relojes @es
label: Juwelier- & Uhrengeschäfte @de
label: Mag de bijoux et montres @fr
label: Магазины ювелир. изд. и часов @ru
label: 宝飾品･時計店 @ja
label: 珠宝与钟表店 @zh
label: 珠寶及鐘錶店 @zh-hant
label: 보석 & 시계 매장 @ko
label: 보�� & 시계 매장 @ko
definition: This industry subgroup includes stores that specialize in retailing jewelry, watches, precious stones, and precious metal goods.
notation: 11121115
valid from: 2024-06-07

Apparel Stores - Franchising
type: BicsLevel5Segment
type: Classifier
type: NamedIndividual
is level5 segment of: Specialty Apparel Stores
is contemporary version of: http://data.ga-group.nl/ics/bics/1112111610
is version of: http://data.ga-group.nl/ics/bics/1112111610
replaces: http://data.ga-group.nl/ics/bics/2020/1112111610
imported on: 2026-06-08T13:40:52.236Z
last refreshed on: 2026-06-08T13:41:38.450Z
source accessed on: 2024-06-05T14:42:36Z
source last accessed on: 2024-06-05T14:42:36Z
label: Abbigliamento - Franchising @it
label: Bekleidungsgeschäfte - Franchise @de
label: Lojas de roupas - Franquia @pt
label: Magasins de vêtements - Franchises @fr
label: Tiendas de ropa - Franquicia @es
label: Магазины одежды - Франшизы @ru
label: 服装店 - 特许经营 @zh
label: 服装��� - 特许经营 @zh
label: 服飾店-加盟 @zh-hant
label: 衣料品店-ﾌﾗﾝﾁｬｲｽﾞ @ja
label: 의류매장-프랜차이즈 @ko
definition: This segment includes revenue that specialty apparel stores generate from their franchising operations.
notation: 1112111610
valid from: 2024-06-07

Child & Infant Clothing Stores
type: BicsLevel5Segment
type: Classifier
type: NamedIndividual
is level5 segment of: Specialty Apparel Stores
is contemporary version of: http://data.ga-group.nl/ics/bics/1112111611
is version of: http://data.ga-group.nl/ics/bics/1112111611
replaces: http://data.ga-group.nl/ics/bics/2020/1112111611
imported on: 2026-06-08T13:40:52.236Z
last refreshed on: 2026-06-08T13:41:38.450Z
source accessed on: 2024-06-05T14:42:36Z
source last accessed on: 2024-06-05T14:42:36Z
label: Kinderer- & Babybekleidungsgeschäfte @de
label: Lojas de roupas infantis @pt
label: Mag vêtements pour enfants et bébés @fr
label: Negozi abbigliamento bambini e neonati @it
label: Tiendas de ropa para niños e infantes @es
label: Магазины одежды д/детей и младенцев @ru
label: 儿童与婴儿服装店 @zh
label: 子供服･ﾍﾞﾋﾞｰ服店 @ja
label: 童裝及嬰兒用品店 @zh-hant
label: 아동복 & 유아복 매장 @ko
definition: This segment includes stores that specialize in children and infant clothing.
notation: 1112111611
valid from: 2024-06-07

Teen & Young Adult Cloth Stores
type: BicsLevel5Segment
type: Classifier
type: NamedIndividual
is level5 segment of: Specialty Apparel Stores
is contemporary version of: http://data.ga-group.nl/ics/bics/1112111612
is version of: http://data.ga-group.nl/ics/bics/1112111612
replaces: http://data.ga-group.nl/ics/bics/2020/1112111612
imported on: 2026-06-08T13:40:52.236Z
last refreshed on: 2026-06-08T13:41:38.450Z
source accessed on: 2024-06-05T14:42:36Z
source last accessed on: 2024-06-05T14:42:36Z
label: Bekleidungsgeschäfte für Teen, Tween & junge Heranwachsende @de
label: Lojas de vestuário para adolescentes, jovens adultos @pt
label: Mag vêtement préadolescents, adolescents et jeunes adultes @fr
label: Negozi abbigliamento giovani e giovanissimi @it
label: Tiendas de ropa juvenil @es
label: Магазины одежды д/подростков и молодежи @ru
label: 若者向け衣料店 @ja
label: 青少年及年輕人服飾店 @zh-hant
label: 青少年服装店 @zh
label: 청소년 & 청년 의류 매장 @ko
definition: This segment includes stores that specialize in retailing teen and young adult clothing.
notation: 1112111612
valid from: 2024-06-07

Family Clothing Stores
type: BicsLevel5Segment
type: Classifier
type: NamedIndividual
is level5 segment of: Specialty Apparel Stores
is contemporary version of: http://data.ga-group.nl/ics/bics/1112111613
is version of: http://data.ga-group.nl/ics/bics/1112111613
replaces: http://data.ga-group.nl/ics/bics/2020/1112111613
imported on: 2026-06-08T13:40:52.236Z
last refreshed on: 2026-06-08T13:41:38.450Z
source accessed on: 2024-06-05T14:42:36Z
source last accessed on: 2024-06-05T14:42:36Z
label: Familienbekleidungsgeschäfte @de
label: Lojas de roupas para família @pt
label: Magasins de vêtements pour la famille @fr
label: Negozi abbigliamento famiglie @it
label: Tiendas de ropa familiar @es
label: Магазины одежды для семьи @ru
label: 家庭服装店 @zh
label: 家庭服飾店 @zh-hant
label: 総合衣料品店 @ja
label: 가족 의류 매장 @ko
definition: This segment includes stores that specialize in retailing clothing for all ages, genders, and sizes.
notation: 1112111613
valid from: 2024-06-07

Men's Clothing Stores
type: BicsLevel5Segment
type: Classifier
type: NamedIndividual
is level5 segment of: Specialty Apparel Stores
is contemporary version of: http://data.ga-group.nl/ics/bics/1112111614
is version of: http://data.ga-group.nl/ics/bics/1112111614
replaces: http://data.ga-group.nl/ics/bics/2020/1112111614
imported on: 2026-06-08T13:40:52.236Z
last refreshed on: 2026-06-08T13:41:38.450Z
source accessed on: 2024-06-05T14:42:36Z
source last accessed on: 2024-06-05T14:42:36Z
label: Herrenbekleidungsgeschäfte @de
label: Lojas de roupas masculinas @pt
label: Magasins de vêtements pour hommes @fr
label: Negozi abbigliamento uomo @it
label: Tiendas de ropa varonil @es
label: Магазины мужской одежды @ru
label: 男士服装店 @zh
label: 男性服飾店 @zh-hant
label: 紳士服店 @ja
label: 남성의류 매장 @ko
definition: This segment includes stores that specialize in retailing men's clothing.
notation: 1112111614
valid from: 2024-06-07

Women's Clothing Stores
type: BicsLevel5Segment
type: Classifier
type: NamedIndividual
is level5 segment of: Specialty Apparel Stores
is contemporary version of: http://data.ga-group.nl/ics/bics/1112111615
is version of: http://data.ga-group.nl/ics/bics/1112111615
replaces: http://data.ga-group.nl/ics/bics/2020/1112111615
imported on: 2026-06-08T13:40:52.236Z
last refreshed on: 2026-06-08T13:41:38.450Z
source accessed on: 2024-06-05T14:42:36Z
source last accessed on: 2024-06-05T14:42:36Z
label: Frauenbekleidungsgeschäfte @de
label: Lojas de roupas femininas @pt
label: Magasins vêtements pr femmes @fr
label: Negozi abbigliamento donna @it
label: Tiendas de ropa para mujeres @es
label: Магазины женской одежды @ru
label: 女性服飾店 @zh-hant
label: 妇女服装商店 @zh
label: 婦人服店 @ja
label: 여성의류 매장 @ko
definition: This segment includes stores that specialize in retailing women's clothing.
notation: 1112111615
valid from: 2024-06-07

Off-Price Apparel
type: BicsLevel5Segment
type: Classifier
type: NamedIndividual
is level5 segment of: Specialty Apparel Stores
is contemporary version of: http://data.ga-group.nl/ics/bics/1112111616
is version of: http://data.ga-group.nl/ics/bics/1112111616
replaces: http://data.ga-group.nl/ics/bics/2020/1112111616
imported on: 2026-06-08T13:40:52.236Z
last refreshed on: 2026-06-08T13:41:38.450Z
source accessed on: 2024-06-05T14:42:36Z
source last accessed on: 2024-06-05T14:42:36Z
label: Abbigliam prezzi ridotti @it
label: Ropa a descuento @es
label: Unterpreisbekleidung @de
label: Vêtements à prix réduits @fr
label: Vestuário com descontos @pt
label: Качественная одежда по сниженным ценам @ru
label: 廉價服飾 @zh-hant
label: 特惠服装 @zh
label: 가격할인 의류 @ko
label: ﾃﾞｨｽｶｳﾝﾄ衣料品店 @ja
definition: This segment includes stores which offer merchandise at discounted prices by purchasing overstock inventory from manufacturers.
notation: 1112111616
valid from: 2024-06-07

Clothing Accessories Stores
type: BicsLevel5Segment
type: Classifier
type: NamedIndividual
is level5 segment of: Specialty Apparel Stores
is contemporary version of: http://data.ga-group.nl/ics/bics/1112111617
is version of: http://data.ga-group.nl/ics/bics/1112111617
replaces: http://data.ga-group.nl/ics/bics/2020/1112111617
imported on: 2026-06-08T13:40:52.236Z
last refreshed on: 2026-06-08T13:41:38.450Z
source accessed on: 2024-06-05T14:42:36Z
source last accessed on: 2024-06-05T14:42:36Z
label: Bekleidungsaccessoiregeschäfte @de
label: Lojas de acessórios para roupas @pt
label: Magasins d'accessoires vestimentaires @fr
label: Negozi di accessori per abbigliamento @it
label: Tiendas de accesorios de ropa @es
label: Магазины аксессуаров для одежды @ru
label: 服装饰品商店 @zh
label: 服飾配件店 @zh-hant
label: 装身具店 @ja
label: 의류 액세서리 매장 @ko
definition: This segment includes stores that specialize in retailing accessories such as handbags, luggage, leather goods, and other accessories.
notation: 1112111617
valid from: 2024-06-07

Footwear Stores
type: BicsLevel5Segment
type: Classifier
type: NamedIndividual
is level5 segment of: Specialty Apparel Stores
is contemporary version of: http://data.ga-group.nl/ics/bics/1112111618
is version of: http://data.ga-group.nl/ics/bics/1112111618
replaces: http://data.ga-group.nl/ics/bics/2020/1112111618
imported on: 2026-06-08T13:40:52.236Z
last refreshed on: 2026-06-08T13:41:38.450Z
source accessed on: 2024-06-05T14:42:36Z
source last accessed on: 2024-06-05T14:42:36Z
label: Lojas de calçados @pt
label: Mag. chaussures @fr
label: Negozi calzature @it
label: Schuhgeschäfte @de
label: Zapaterías @es
label: Магазины обуви @ru
label: 履物店 @ja
label: 鞋店 @zh-hant
label: 鞋类商店 @zh
label: 신발 매장 @ko
definition: This segment includes stores that specialize in retailing footwear products.
notation: 1112111618
valid from: 2024-06-07

Specialty Apparel Stores
type: BicsLevel4SubIndustry
type: Classifier
type: NamedIndividual
is sub industry of: Retail - Discretionary
is contemporary version of: http://data.ga-group.nl/ics/bics/11121116
is version of: http://data.ga-group.nl/ics/bics/11121116
replaces: http://data.ga-group.nl/ics/bics/2020/11121116
imported on: 2026-06-08T13:40:52.236Z
last refreshed on: 2026-06-08T13:41:38.450Z
source accessed on: 2024-06-05T14:42:36Z
source last accessed on: 2024-06-05T14:42:36Z
label: Geschäfte für Sonderbekleidung @de
label: Lojas vest espec @pt
label: Mag. vêtements spécialisés @fr
label: Negozi abbigliamento speciale @it
label: Tiendas ropa espec @es
label: Магазины спец. одежды @ru
label: 专业服饰店 @zh
label: 専門衣料品店 @ja
label: 特殊服飾商店 @zh-hant
label: 전문 의류 매장 @ko
definition: This industry subgroup includes stores that specialize in retailing apparel, footwear and accessories.
notation: 11121116
valid from: 2024-06-07

Sporting Goods Stores
type: BicsLevel4SubIndustry
type: Classifier
type: NamedIndividual
is sub industry of: Retail - Discretionary
is contemporary version of: http://data.ga-group.nl/ics/bics/11121117
is version of: http://data.ga-group.nl/ics/bics/11121117
replaces: http://data.ga-group.nl/ics/bics/2020/11121117
imported on: 2026-06-08T13:40:52.236Z
last refreshed on: 2026-06-08T13:41:38.450Z
source accessed on: 2024-06-05T14:42:36Z
source last accessed on: 2024-06-05T14:42:36Z
label: Lojas de materiais esportivos @pt
label: Magasins d'articles de sport @fr
label: Negozi per lo sport @it
label: Sportartikelläden @de
label: Tiendas de bienes deportivos @es
label: Магазины спортивных товаров @ru
label: 体育用品店 @zh
label: 運動用品店 @zh-hant
label: 스포츠 용품 매장 @ko
label: ｽﾎﾟｰﾂ用品店 @ja
definition: This industry subgroup includes stores that specialize in retailing sporting goods, outdoor recreational products, and small arms.
notation: 11121117
valid from: 2024-06-07

Arts & Crafts Stores
type: BicsLevel5Segment
type: Classifier
type: NamedIndividual
is level5 segment of: Other Spec Retail - Discr
is contemporary version of: http://data.ga-group.nl/ics/bics/1112111810
is version of: http://data.ga-group.nl/ics/bics/1112111810
replaces: http://data.ga-group.nl/ics/bics/2020/1112111810
imported on: 2026-06-08T13:40:52.236Z
last refreshed on: 2026-06-08T13:41:38.450Z
source accessed on: 2024-06-05T14:42:36Z
source last accessed on: 2024-06-05T14:42:36Z
label: Artigianato @it
label: Kunst- & Bastelläden @de
label: Lojas de artesanatos e artes @pt
label: Magasins d'art et de bricolage @fr
label: Tiendas de artesanías @es
label: Магазины товаров для искусства и худ. творчества @ru
label: 工艺品店 @zh
label: 工藝品店 @zh-hant
label: 美術工芸品店 @ja
label: 예술 & 공예품 매장 @ko
definition: This segment includes stores that specialize in retailing materials, supplies, and tools related to arts and craft activities.
notation: 1112111810
valid from: 2024-06-07

Book Stores
type: BicsLevel5Segment
type: Classifier
type: NamedIndividual
is level5 segment of: Other Spec Retail - Discr
is contemporary version of: http://data.ga-group.nl/ics/bics/1112111811
is version of: http://data.ga-group.nl/ics/bics/1112111811
replaces: http://data.ga-group.nl/ics/bics/2020/1112111811
imported on: 2026-06-08T13:40:52.236Z
last refreshed on: 2026-06-08T13:41:38.450Z
source accessed on: 2024-06-05T14:42:36Z
source last accessed on: 2024-06-05T14:42:36Z
label: Buchhandlungen @de
label: Librairies @fr
label: Librerías @es
label: Librerie @it
label: Livrarias @pt
label: Книжные магазины @ru
label: 书店 @zh
label: 書店 @ja
label: 서점 @ko
definition: This segment includes stores that specialize in retailing books.
notation: 1112111811
valid from: 2024-06-07

Cosmetics & Beauty Stores
type: BicsLevel5Segment
type: Classifier
type: NamedIndividual
is level5 segment of: Other Spec Retail - Discr
is contemporary version of: http://data.ga-group.nl/ics/bics/1112111812
is version of: http://data.ga-group.nl/ics/bics/1112111812
replaces: http://data.ga-group.nl/ics/bics/2020/1112111812
imported on: 2026-06-08T13:40:52.236Z
last refreshed on: 2026-06-08T13:41:38.450Z
source accessed on: 2024-06-05T14:42:36Z
source last accessed on: 2024-06-05T14:42:36Z
label: Cosmetici e negozi di bellezza @it
label: Kosmetik- & Schönheitsläden @de
label: Lojas de beleza e cosméticos @pt
label: Magasins de cosmétiques et produits de beauté @fr
label: Tiendas de cosméticos y belleza @es
label: Магазины косметических средств и товаров для красоты @ru
label: 化妆和美容用品商店 @zh
label: 化妝品及美容用品店 @zh-hant
label: 化粧品･美容用品店 @ja
label: 화장품 및 미용품 매장 @ko
definition: This segment includes stores that specialize in retailing cosmetics and hair care products.
notation: 1112111812
valid from: 2024-06-07

Florists
type: BicsLevel5Segment
type: Classifier
type: NamedIndividual
is level5 segment of: Other Spec Retail - Discr
is contemporary version of: http://data.ga-group.nl/ics/bics/1112111813
is version of: http://data.ga-group.nl/ics/bics/1112111813
replaces: http://data.ga-group.nl/ics/bics/2020/1112111813
imported on: 2026-06-08T13:40:52.236Z
last refreshed on: 2026-06-08T13:41:38.450Z
source accessed on: 2024-06-05T14:42:36Z
source last accessed on: 2024-06-05T14:42:36Z
label: Fioristi @it
label: Fleuristes @fr
label: Florerías @es
label: Floristas @pt
label: Floristen @de
label: Цветочные магазины @ru
label: 花商 @zh
label: 花店 @ja
label: 화훼장식업 @ko
definition: This segment includes stores that specialize in retailing cut flowers, floral arrangements, and potted plants.
notation: 1112111813
valid from: 2024-06-07

Gift, Novelty & Souvenir Stores
type: BicsLevel5Segment
type: Classifier
type: NamedIndividual
is level5 segment of: Other Spec Retail - Discr
is contemporary version of: http://data.ga-group.nl/ics/bics/1112111814
is version of: http://data.ga-group.nl/ics/bics/1112111814
replaces: http://data.ga-group.nl/ics/bics/2020/1112111814
imported on: 2026-06-08T13:40:52.236Z
last refreshed on: 2026-06-08T13:41:38.450Z
source accessed on: 2024-06-05T14:42:36Z
source last accessed on: 2024-06-05T14:42:36Z
label: Geschenk-, Novitäten- & Souvenirgeschäfte @de
label: Lojas de lembranças, novidades e presentes @pt
label: Magasins de cadeaux, souvenirs et gadgets @fr
label: Negozi articoli regalo e souvenir @it
label: Tiendas de regalos, novedades y recuerdos @es
label: Магазины подар., новинок и сувениров @ru
label: 礼物、精品及纪念品商店 @zh
label: 禮品、裝飾品、紀念品店 @zh-hant
label: 贈答品･記念品･みやげ物店 @ja
label: 선물, 판촉물 & 기념품 판매점 @ko
definition: This segment includes stores that specialize in retailing gift products and souvenirs. Includes duty free stores and gift shops.
notation: 1112111814
valid from: 2024-06-07

Health Supplement Stores
type: BicsLevel5Segment
type: Classifier
type: NamedIndividual
is level5 segment of: Other Spec Retail - Discr
is contemporary version of: http://data.ga-group.nl/ics/bics/1112111815
is version of: http://data.ga-group.nl/ics/bics/1112111815
replaces: http://data.ga-group.nl/ics/bics/2020/1112111815
imported on: 2026-06-08T13:40:52.236Z
last refreshed on: 2026-06-08T13:41:38.450Z
source accessed on: 2024-06-05T14:42:36Z
source last accessed on: 2024-06-05T14:42:36Z
label: Lojas de suplementos para saúde @pt
label: Magasins de suppléments alimentaires @fr
label: Nahrungsergänzungsmittelgeschäfte @de
label: Negozi di prodotti naturali @it
label: Tiendas de suplementos nutricionales @es
label: Магазины добавок для поддержания здоровья @ru
label: 保健食品商店 @zh
label: 保健食品店 @zh-hant
label: 健康補助食品店 @ja
label: 건강 보조식품 매장 @ko
definition: This segment includes stores that specialize in retailing health and fitness related food, shakes and supplements.
notation: 1112111815
valid from: 2024-06-07

Toy & Game Stores
type: BicsLevel5Segment
type: Classifier
type: NamedIndividual
is level5 segment of: Other Spec Retail - Discr
is contemporary version of: http://data.ga-group.nl/ics/bics/1112111816
is version of: http://data.ga-group.nl/ics/bics/1112111816
replaces: http://data.ga-group.nl/ics/bics/2020/1112111816
imported on: 2026-06-08T13:40:52.236Z
last refreshed on: 2026-06-08T13:41:38.450Z
source accessed on: 2024-06-05T14:42:36Z
source last accessed on: 2024-06-05T14:42:36Z
label: Lojas para brinquedos e jogos @pt
label: Magasins de jeux et jouets @fr
label: Negozi giocattoli e giochi @it
label: Spielzeug- & Spielwarenläden @de
label: Tiendas de juguetes y juegos @es
label: Магазины игрушек и игр @ru
label: 玩具与游戏商店 @zh
label: 玩具及遊戲店 @zh-hant
label: 玩具･ｹﾞｰﾑ店 @ja
label: 완구 & 게임 매장 @ko
definition: This segment includes stores that specialize in retailing physical products for entertainment and leisure such as toys, dolls, and hobby products.
notation: 1112111816
valid from: 2024-06-07

Movie & Video Game Rent Stores
type: BicsLevel5Segment
type: Classifier
type: NamedIndividual
is level5 segment of: Other Spec Retail - Discr
is contemporary version of: http://data.ga-group.nl/ics/bics/1112111817
is version of: http://data.ga-group.nl/ics/bics/1112111817
replaces: http://data.ga-group.nl/ics/bics/2020/1112111817
imported on: 2026-06-08T13:40:52.236Z
last refreshed on: 2026-06-08T13:41:38.450Z
source accessed on: 2024-06-05T14:42:36Z
source last accessed on: 2024-06-05T14:42:36Z
label: Film- & Videospielverleihgeschäfte @de
label: Locadoras de filmes e vídeo games @pt
label: Mag location de films et jeux vidéo @fr
label: Negozi noleggio film e videogiochi @it
label: Tiendas de alquiler de juegos de video y películas @es
label: Магазины проката видеоигр и видеофильм. @ru
label: 影片及電玩遊戲出租店 @zh-hant
label: 映画･ﾋﾞﾃﾞｵｹﾞｰﾑﾚﾝﾀﾙ店 @ja
label: 映画･ﾋﾞﾃﾞｵｹ��ｰﾑﾚﾝﾀﾙ店 @ja
label: 电影与视频游戏出租店 @zh
label: 영화 & 비디오 게임 대여점 @ko
definition: This segment includes stores that specialize in movie and video game rentals.
notation: 1112111817
valid from: 2024-06-07

Music & Movie Stores
type: BicsLevel5Segment
type: Classifier
type: NamedIndividual
is level5 segment of: Other Spec Retail - Discr
is contemporary version of: http://data.ga-group.nl/ics/bics/1112111818
is version of: http://data.ga-group.nl/ics/bics/1112111818
replaces: http://data.ga-group.nl/ics/bics/2020/1112111818
imported on: 2026-06-08T13:40:52.236Z
last refreshed on: 2026-06-08T13:41:38.450Z
source accessed on: 2024-06-05T14:42:36Z
source last accessed on: 2024-06-05T14:42:36Z
label: Läden für bespielte Musik & Filme @de
label: Lojas de filmes e músicas pré-gravados @pt
label: Magasins de films et musique pré-enregistrés @fr
label: Negozi di musica e video @it
label: Tiendas de música grabada y películas @es
label: Магазины музыкальных записей и видеофильмов @ru
label: 音楽･映画ｿﾌﾄ店 @ja
label: 預錄音樂及影片店 @zh-hant
label: 预录音乐及电影商店 @zh
label: 사전녹음 음반 & 영화매장 @ko
definition: This segment includes stores that specialize in retailing music and movie products.
notation: 1112111818
valid from: 2024-06-07

Musical Instrument Stores
type: BicsLevel5Segment
type: Classifier
type: NamedIndividual
is level5 segment of: Other Spec Retail - Discr
is contemporary version of: http://data.ga-group.nl/ics/bics/1112111819
is version of: http://data.ga-group.nl/ics/bics/1112111819
replaces: http://data.ga-group.nl/ics/bics/2020/1112111819
imported on: 2026-06-08T13:40:52.236Z
last refreshed on: 2026-06-08T13:41:38.450Z
source accessed on: 2024-06-05T14:42:36Z
source last accessed on: 2024-06-05T14:42:36Z
label: Lojas de instrumentos musicais @pt
label: Magasins d'instruments de musique @fr
label: Musikinstrumenthandlungen @de
label: Negozi strumenti musicali @it
label: Tiendas de instrumentos musicales @es
label: Магазины музыкальных инструментов @ru
label: 乐器店 @zh
label: 楽器店 @ja
label: 樂器店 @zh-hant
label: 악기 판매점 @ko
definition: This segment includes stores that specialize in retailing musical instruments.
notation: 1112111819
valid from: 2024-06-07

Office Sply & Stationery Stores
type: BicsLevel5Segment
type: Classifier
type: NamedIndividual
is level5 segment of: Other Spec Retail - Discr
is contemporary version of: http://data.ga-group.nl/ics/bics/1112111820
is version of: http://data.ga-group.nl/ics/bics/1112111820
replaces: http://data.ga-group.nl/ics/bics/2020/1112111820
imported on: 2026-06-08T13:40:52.236Z
last refreshed on: 2026-06-08T13:41:38.450Z
source accessed on: 2024-06-05T14:42:36Z
source last accessed on: 2024-06-05T14:42:36Z
label: Büro- & Schreibwarenläden @de
label: Mag fourn de bureau/papeterie @fr
label: Negozi art ufficio, cartoleria @it
label: Papelarias e lojas mat escritório @pt
label: Tiendas prod papelería/oficina @es
label: Магазины тов-в для офиса @ru
label: 事務用品･文房具店 @ja
label: 办公用品与文具商店 @zh
label: 辦公室用品及文具店 @zh-hant
label: 사무 용품 & 문구점 @ko
definition: This segment includes stores that specialize in retailing office related stationery, supplies, and equipment.
notation: 1112111820
valid from: 2024-06-07

Optical Goods Stores
type: BicsLevel5Segment
type: Classifier
type: NamedIndividual
is level5 segment of: Other Spec Retail - Discr
is contemporary version of: http://data.ga-group.nl/ics/bics/1112111821
is version of: http://data.ga-group.nl/ics/bics/1112111821
replaces: http://data.ga-group.nl/ics/bics/2020/1112111821
imported on: 2026-06-08T13:40:52.236Z
last refreshed on: 2026-06-08T13:41:38.450Z
source accessed on: 2024-06-05T14:42:36Z
source last accessed on: 2024-06-05T14:42:36Z
label: Geschäfte für optische Waren @de
label: Lojas de produtos óticos @pt
label: Magasins de produits optiques @fr
label: Negozi prod ottici @it
label: Tiendas de bienes ópticos @es
label: Магазины оптических товаров @ru
label: 光学产品店 @zh
label: 眼鏡店 @ja
label: 眼鏡用品店 @zh-hant
label: 광학용품 매장 @ko
definition: This segment includes stores that specialize in retailing eyeglasses, contact lenses, sunglasses, and related products.
notation: 1112111821
valid from: 2024-06-07

Pet & Pet Supplies Stores
type: BicsLevel5Segment
type: Classifier
type: NamedIndividual
is level5 segment of: Other Spec Retail - Discr
is contemporary version of: http://data.ga-group.nl/ics/bics/1112111822
is version of: http://data.ga-group.nl/ics/bics/1112111822
replaces: http://data.ga-group.nl/ics/bics/2020/1112111822
imported on: 2026-06-08T13:40:52.236Z
last refreshed on: 2026-06-08T13:41:38.450Z
source accessed on: 2024-06-05T14:42:36Z
source last accessed on: 2024-06-05T14:42:36Z
label: Animaleries et magasins de fournitures pour animaux @fr
label: Lojas de animais de estimação e suprimentos @pt
label: Negozi di animali domestici e accessori @it
label: Tiendas de animales domésticos y sus provisiones @es
label: Zoohandlungen und Heimtierbedarf @de
label: Магазины товаров для домашних животных @ru
label: 宠物和宠物用品商店 @zh
label: 寵物及寵物用品店 @zh-hant
label: 애완동물 및 애완동물 소모품 매장 @ko
label: ﾍﾟｯﾄ･ﾍﾟｯﾄ用品店 @ja
definition: This segment includes stores that specialize in retailing pets and pet care products.
notation: 1112111822
valid from: 2024-06-07

Used Merchandise Stores
type: BicsLevel5Segment
type: Classifier
type: NamedIndividual
is level5 segment of: Other Spec Retail - Discr
is contemporary version of: http://data.ga-group.nl/ics/bics/1112111823
is version of: http://data.ga-group.nl/ics/bics/1112111823
replaces: http://data.ga-group.nl/ics/bics/2020/1112111823
imported on: 2026-06-08T13:40:52.236Z
last refreshed on: 2026-06-08T13:41:38.450Z
source accessed on: 2024-06-05T14:42:36Z
source last accessed on: 2024-06-05T14:42:36Z
label: Gebrauchtwarengeschäfte @de
label: Lojas de mercadorias usadas @pt
label: Magasins de marchandises d'occasion @fr
label: Negozi dell'usato @it
label: Tiendas de mercancías usadas @es
label: Магазины товаров, бывших в употреблении @ru
label: 二手商品店 @zh-hant
label: 二手商店 @zh
label: 古物店 @ja
label: 중고품 판매업 @ko
definition: This segment includes stores that specialize in retailing used household merchandise.
notation: 1112111823
valid from: 2024-06-07

Video Game Stores
type: BicsLevel5Segment
type: Classifier
type: NamedIndividual
is level5 segment of: Other Spec Retail - Discr
is contemporary version of: http://data.ga-group.nl/ics/bics/1112111824
is version of: http://data.ga-group.nl/ics/bics/1112111824
replaces: http://data.ga-group.nl/ics/bics/2020/1112111824
imported on: 2026-06-08T13:40:52.236Z
last refreshed on: 2026-06-08T13:41:38.450Z
source accessed on: 2024-06-05T14:42:36Z
source last accessed on: 2024-06-05T14:42:36Z
label: Lojas de vídeo games @pt
label: Magasins de jeux vidéo @fr
label: Negozi videogiochi @it
label: Tiendas de juegos de video @es
label: Videospielgeschäfte @de
label: Магазины видеоигр @ru
label: 视频游戏商店 @zh
label: 電玩遊戲商店 @zh-hant
label: 비디오 게임 매장 @ko
label: ﾋﾞﾃﾞｵｹﾞｰﾑ店 @ja
definition: This segment includes stores that specialize in retailing video game equipment and their software.
notation: 1112111824
valid from: 2024-06-07

Electric Vehicle Charging Stations
type: BicsLevel5Segment
type: Classifier
type: NamedIndividual
is level5 segment of: Other Spec Retail - Discr
is contemporary version of: http://data.ga-group.nl/ics/bics/1112111825
is version of: http://data.ga-group.nl/ics/bics/1112111825
imported on: 2026-06-08T13:40:52.236Z
last refreshed on: 2026-06-08T13:41:38.450Z
source accessed on: 2024-06-05T14:42:36Z
source last accessed on: 2024-06-05T14:42:36Z
label: Bornes de recharge pr véhicules électriques @fr
label: Estações de recarga de veículos elétricos @pt
label: Estaciones de carga para vehículos eléctricos @es
label: Ladeeinrichtungen für Elektrofahrzeuge @de
label: Stazioni di ricarica per veicoli elettrici @it
label: Зарядные станции для электромобилей @ru
label: 电动汽车充电站 @zh
label: 電動車充電站 @zh-hant
label: 電気自動車充電ｽﾃｰｼｮﾝ @ja
label: 전기차 충전소 @ko
definition: This segment includes companies that own or operate electric vehicle charging stations. These are also known as charge points.
notation: 1112111825
valid from: 2024-06-07

Other Spec Retail - Discr
type: BicsLevel4SubIndustry
type: Classifier
type: NamedIndividual
is sub industry of: Retail - Discretionary
is contemporary version of: http://data.ga-group.nl/ics/bics/11121118
is version of: http://data.ga-group.nl/ics/bics/11121118
replaces: http://data.ga-group.nl/ics/bics/2020/11121118
imported on: 2026-06-08T13:40:52.236Z
last refreshed on: 2026-06-08T13:41:38.450Z
source accessed on: 2024-06-05T14:42:36Z
source last accessed on: 2024-06-05T14:42:36Z
label: Altro dett spec - Discr @it
label: Distrib. autres - non ess. @fr
label: Otro min espec - discr @es
label: Outro varejo espec-Discric @pt
label: Sonst.Spezial-EH - Discretionary @de
label: Розн. торг. товарами выб. спроса @ru
label: その他専門店-一般消費財 @ja
label: 其他专业零售-非必需品 @zh
label: 其他特殊品零售-非必需品 @zh-hant
label: 기타 전문소매업 - 자유소비재 @ko
definition: This industry subgroup includes stores that specialize in retailing consumer discretionary products not elsewhere classified.
notation: 11121118
valid from: 2024-06-07

Retail - Discretionary
type: BicsLevel3Industry
type: Classifier
type: NamedIndividual
is industry of: Retail & Whsle - Discretionary
is contemporary version of: http://data.ga-group.nl/ics/bics/111211
is version of: http://data.ga-group.nl/ics/bics/111211
replaces: http://data.ga-group.nl/ics/bics/2020/111211
imported on: 2026-06-08T13:40:52.236Z
last refreshed on: 2026-06-08T13:41:38.450Z
source accessed on: 2024-06-05T14:42:36Z
source last accessed on: 2024-06-05T14:42:36Z
label: Al dettaglio - Discrezionale @it
label: Comercio al por menor discrecional @es
label: EH - Nichtbasis @de
label: Varejo - Discricionário @pt
label: Vente au détail - Discrétionnaire @fr
label: Розн. торговля - товары выборочного спроса @ru
label: 小売-一般消費財 @ja
label: 零售-非必需品 @zh
label: 零售-非核心消費 @zh-hant
label: 소매 - 자유소비재 @ko
definition: This industry includes companies that retail consumer discretionary goods through storefront operations or non-internet based direct marketing.
notation: 111211
valid from: 2024-06-07

Online Marketplace
type: BicsLevel4SubIndustry
type: Classifier
type: NamedIndividual
is sub industry of: E-Commerce Discretionary
is contemporary version of: http://data.ga-group.nl/ics/bics/11121210
is version of: http://data.ga-group.nl/ics/bics/11121210
replaces: http://data.ga-group.nl/ics/bics/2020/11121210
imported on: 2026-06-08T13:40:52.236Z
last refreshed on: 2026-06-08T13:41:38.450Z
source accessed on: 2024-06-05T14:42:36Z
source last accessed on: 2024-06-05T14:42:36Z
label: Marché en ligne @fr
label: Mercado en línea @es
label: Mercado online @pt
label: Online-Marktplatz @de
label: Рынок онлайн @ru
label: 在线交易市场 @zh
label: 網路市場 @zh-hant
label: 온라인 마켓플레이스 @ko
label: ｵﾝﾗｲﾝ市場 @ja
definition: This industry subgroup includes companies that offer an online marketplace for third party sellers or diversified online retailers to sell merchandise.
notation: 11121210
valid from: 2024-06-07

Auto Parts - Online
type: BicsLevel5Segment
type: Classifier
type: NamedIndividual
is level5 segment of: Specialty Online Retailers
is contemporary version of: http://data.ga-group.nl/ics/bics/1112121110
is version of: http://data.ga-group.nl/ics/bics/1112121110
replaces: http://data.ga-group.nl/ics/bics/2020/1112121110
imported on: 2026-06-08T13:40:52.236Z
last refreshed on: 2026-06-08T13:41:38.450Z
source accessed on: 2024-06-05T14:42:36Z
source last accessed on: 2024-06-05T14:42:36Z
label: Autopeças - Online @pt
label: Autoricambi - Online @it
label: Autoteile - Online @de
label: Pièces automobiles en ligne @fr
label: Piezas de automóviles - en línea @es
label: Автозапчасти - онлайн @ru
label: 汽車零件供應-線上 @zh-hant
label: 汽车零部件-网上 @zh
label: 自動車部品-ｵﾝﾗｲﾝ @ja
label: 자동차 부품 - 온라인 @ko
definition: This segment includes companies that retail auto parts and accessories on the Internet.
notation: 1112121110
valid from: 2024-06-07

Consumer Electronics - Online
type: BicsLevel5Segment
type: Classifier
type: NamedIndividual
is level5 segment of: Specialty Online Retailers
is contemporary version of: http://data.ga-group.nl/ics/bics/1112121111
is version of: http://data.ga-group.nl/ics/bics/1112121111
replaces: http://data.ga-group.nl/ics/bics/2020/1112121111
imported on: 2026-06-08T13:40:52.236Z
last refreshed on: 2026-06-08T13:41:38.450Z
source accessed on: 2024-06-05T14:42:36Z
source last accessed on: 2024-06-05T14:42:36Z
label: Artigos eletrônicos para consumidores - Online @pt
label: Electrónica de consumo - en línea @es
label: Electronique grand public - En ligne @fr
label: Elettronica di consumo - Online @it
label: Verbraucherelektronik - Online @de
label: Бытовая электроника - онлайн @ru
label: 家電-ｵﾝﾗｲﾝ @ja
label: 消費性電子-線上 @zh-hant
label: 电子消费品-网上 @zh
label: 소비자 가전 - 온라인 @ko
definition: This segment includes companies that retail consumer electronics products on the Internet.
notation: 1112121111
valid from: 2024-06-07

Home & Office Products - Online
type: BicsLevel5Segment
type: Classifier
type: NamedIndividual
is level5 segment of: Specialty Online Retailers
is contemporary version of: http://data.ga-group.nl/ics/bics/1112121112
is version of: http://data.ga-group.nl/ics/bics/1112121112
replaces: http://data.ga-group.nl/ics/bics/2020/1112121112
imported on: 2026-06-08T13:40:52.236Z
last refreshed on: 2026-06-08T13:41:38.450Z
source accessed on: 2024-06-05T14:42:36Z
source last accessed on: 2024-06-05T14:42:36Z
label: Articles de maison et de bureau - En ligne @fr
label: Haus- & Büroprodukte - Online @de
label: Prodotti casa e ufficio - Online @it
label: Productos para el hogar y oficina - en línea @es
label: Produtos p/casa e escritório - Online @pt
label: Товары для дома и офиса - онлайн @ru
label: 家居及办公产品-网上 @zh
label: 家庭･事務用品-ｵﾝﾗｲﾝ @ja
label: 家用及辦公室用品-線上 @zh-hant
label: 가정 & 사무용품 - 온라인 @ko
definition: This segment includes companies that retail home and office products on the Internet.
notation: 1112121112
valid from: 2024-06-07

Apparel & Footwear - Online
type: BicsLevel5Segment
type: Classifier
type: NamedIndividual
is level5 segment of: Specialty Online Retailers
is contemporary version of: http://data.ga-group.nl/ics/bics/1112121113
is version of: http://data.ga-group.nl/ics/bics/1112121113
replaces: http://data.ga-group.nl/ics/bics/2020/1112121113
imported on: 2026-06-08T13:40:52.236Z
last refreshed on: 2026-06-08T13:41:38.450Z
source accessed on: 2024-06-05T14:42:36Z
source last accessed on: 2024-06-05T14:42:36Z
label: Abbigliamento e calzature - Online @it
label: Bekleidung & Schuhe - Online @de
label: Oдежда/обувь - Онлайн @ru
label: Ropa y calzado - en línea @es
label: Vêtements et chaussures - en ligne @fr
label: Vestuário e calçados - Online @pt
label: 服装鞋袜-网上 @zh
label: 服飾及鞋類-線上 @zh-hant
label: 衣料･履物-ｵﾝﾗｲﾝ @ja
label: 의류 & 신발 - 온라인 @ko
definition: This segment includes companies that retail apparel, clothing accessories, and footwear on the Internet.
notation: 1112121113
valid from: 2024-06-07

Books - Online
type: BicsLevel5Segment
type: Classifier
type: NamedIndividual
is level5 segment of: Specialty Online Retailers
is contemporary version of: http://data.ga-group.nl/ics/bics/1112121114
is version of: http://data.ga-group.nl/ics/bics/1112121114
replaces: http://data.ga-group.nl/ics/bics/2020/1112121114
imported on: 2026-06-08T13:40:52.236Z
last refreshed on: 2026-06-08T13:41:38.450Z
source accessed on: 2024-06-05T14:42:36Z
source last accessed on: 2024-06-05T14:42:36Z
label: Bücher - Online @de
label: Libri - Online @it
label: Libros - En línea @es
label: Livres - En ligne @fr
label: Livros - online @pt
label: Книги - Онлайн @ru
label: 图书 - 在线 @zh
label: 書籍-線上 @zh-hant
label: 書籍-ｵﾝﾗｲﾝ @ja
label: 서적 - 온라인 @ko
definition: This segment includes companies that retail books on the Internet.
notation: 1112121114
valid from: 2024-06-07

Cosmetics & Beauty - Online
type: BicsLevel5Segment
type: Classifier
type: NamedIndividual
is level5 segment of: Specialty Online Retailers
is contemporary version of: http://data.ga-group.nl/ics/bics/1112121115
is version of: http://data.ga-group.nl/ics/bics/1112121115
replaces: http://data.ga-group.nl/ics/bics/2020/1112121115
imported on: 2026-06-08T13:40:52.236Z
last refreshed on: 2026-06-08T13:41:38.450Z
source accessed on: 2024-06-05T14:42:36Z
source last accessed on: 2024-06-05T14:42:36Z
label: Cosméticos y belleza - En línea @es
label: Cosmétiques et produits de beauté - En ligne @fr
label: Cosmetici - online @it
label: Kosmetik & -zubehör - Online @de
label: Produtos de beleza e cosméticos - online @pt
label: Косметические средства и товары для красоты - Онлайн @ru
label: 化妆和美容用品- 在线 @zh
label: 化妝及美容用品店 - 線上 @zh-hant
label: 化粧品･美容用品-ｵﾝﾗｲﾝ @ja
label: 화장품 & 미용품 - 온라인 @ko
definition: This segment includes companies that retail cosmetics and hair care products on the Internet.
notation: 1112121115
valid from: 2024-06-07

Flowers - Online
type: BicsLevel5Segment
type: Classifier
type: NamedIndividual
is level5 segment of: Specialty Online Retailers
is contemporary version of: http://data.ga-group.nl/ics/bics/1112121116
is version of: http://data.ga-group.nl/ics/bics/1112121116
replaces: http://data.ga-group.nl/ics/bics/2020/1112121116
imported on: 2026-06-08T13:40:52.236Z
last refreshed on: 2026-06-08T13:41:38.450Z
source accessed on: 2024-06-05T14:42:36Z
source last accessed on: 2024-06-05T14:42:36Z
label: Blumen - Online @de
label: Fiori - Online @it
label: Fleurs - En ligne @fr
label: Flores - En línea @es
label: Flores - Online @pt
label: Цветы - Онлайн @ru
label: 花-ｵﾝﾗｲﾝ @ja
label: 花卉-在线 @zh
label: 花卉-線上 @zh-hant
label: 꽃-온라인 @ko
definition: This segment includes companies that retail cut flowers, floral arrangements, and potted plants on the Internet.
notation: 1112121116
valid from: 2024-06-07

Toys & Games - Online
type: BicsLevel5Segment
type: Classifier
type: NamedIndividual
is level5 segment of: Specialty Online Retailers
is contemporary version of: http://data.ga-group.nl/ics/bics/1112121117
is version of: http://data.ga-group.nl/ics/bics/1112121117
replaces: http://data.ga-group.nl/ics/bics/2020/1112121117
imported on: 2026-06-08T13:40:52.236Z
last refreshed on: 2026-06-08T13:41:38.450Z
source accessed on: 2024-06-05T14:42:36Z
source last accessed on: 2024-06-05T14:42:36Z
label: Brinquedos e jogos - Online @pt
label: Giochi e giocattoli - Online @it
label: Jeux et jouets - En ligne @fr
label: Juguetes y juegos - En línea @es
label: Juguetes y juegos - En l��nea @es
label: Spielzeug & Spiele - Online @de
label: Игрушки и игры - онлайн @ru
label: 玩具与游戏-网上 @zh
label: 玩具及遊戲-線上 @zh-hant
label: 玩具･ｹﾞｰﾑ-ｵﾝﾗｲﾝ @ja
label: 완구 & 게임 - 온라인 @ko
definition: This segment includes companies that retail toys, games, and hobby-related products on the Internet.
notation: 1112121117
valid from: 2024-06-07

Jewelry & Watch - Online
type: BicsLevel5Segment
type: Classifier
type: NamedIndividual
is level5 segment of: Specialty Online Retailers
is contemporary version of: http://data.ga-group.nl/ics/bics/1112121118
is version of: http://data.ga-group.nl/ics/bics/1112121118
replaces: http://data.ga-group.nl/ics/bics/2020/1112121118
imported on: 2026-06-08T13:40:52.236Z
last refreshed on: 2026-06-08T13:41:38.450Z
source accessed on: 2024-06-05T14:42:36Z
source last accessed on: 2024-06-05T14:42:36Z
label: Bijoux et montres - en ligne @fr
label: Gioielli e orologi - Online @it
label: Joias e relógios - Online @pt
label: Joyería y relojes - en línea @es
label: Schmuck & Armbanduhren - Online @de
label: Юв. изделия и часы - онлайн @ru
label: 宝石･時計-ｵﾝﾗｲﾝ @ja
label: 珠宝与钟表-网上 @zh
label: 珠寶-線上 @zh-hant
label: 보석 & 손목시계 - 온라인 @ko
definition: This segment includes companies that retail jewelry, watches, precious stones, and precious metal goods on the Internet.
notation: 1112121118
valid from: 2024-06-07

Music & Movies - Online
type: BicsLevel5Segment
type: Classifier
type: NamedIndividual
is level5 segment of: Specialty Online Retailers
is contemporary version of: http://data.ga-group.nl/ics/bics/1112121119
is version of: http://data.ga-group.nl/ics/bics/1112121119
replaces: http://data.ga-group.nl/ics/bics/2020/1112121119
imported on: 2026-06-08T13:40:52.236Z
last refreshed on: 2026-06-08T13:41:38.450Z
source accessed on: 2024-06-05T14:42:36Z
source last accessed on: 2024-06-05T14:42:36Z
label: Filmes e músicas - Online @pt
label: Música y películas - en línea @es
label: Musica e film - Online @it
label: Musik & Filme - Online @de
label: Musique et films - En ligne @fr
label: Музыка и кино - онлайн @ru
label: 音乐与电影-网上 @zh
label: 音楽･映画ｿﾌﾄ-ｵﾝﾗｲﾝ @ja
label: 音樂及電影-線上 @zh-hant
label: 음악 & 영화 - 온라인 @ko
definition: This segment includes companies that specialize in retailing music and movie products on the Internet.
notation: 1112121119
valid from: 2024-06-07

Musical Instrument - Online
type: BicsLevel5Segment
type: Classifier
type: NamedIndividual
is level5 segment of: Specialty Online Retailers
is contemporary version of: http://data.ga-group.nl/ics/bics/1112121120
is version of: http://data.ga-group.nl/ics/bics/1112121120
replaces: http://data.ga-group.nl/ics/bics/2020/1112121120
imported on: 2026-06-08T13:40:52.236Z
last refreshed on: 2026-06-08T13:41:38.450Z
source accessed on: 2024-06-05T14:42:36Z
source last accessed on: 2024-06-05T14:42:36Z
label: Instrument de musique - En ligne @fr
label: Instrumentos musicais - Online @pt
label: Instrumentos musicales - en línea @es
label: Musikinstrument - Online @de
label: Strumenti musicali - Online @it
label: Музыкальные инструменты - онлайн @ru
label: 乐器-网上 @zh
label: 楽器-ｵﾝﾗｲﾝ @ja
label: 樂器-線上 @zh-hant
label: 악기 - 온라인 @ko
definition: This segment includes companies that retail musical instruments and accessories on the Internet.
notation: 1112121120
valid from: 2024-06-07

Pets & Supplies - Online
type: BicsLevel5Segment
type: Classifier
type: NamedIndividual
is level5 segment of: Specialty Online Retailers
is contemporary version of: http://data.ga-group.nl/ics/bics/1112121121
is version of: http://data.ga-group.nl/ics/bics/1112121121
replaces: http://data.ga-group.nl/ics/bics/2020/1112121121
imported on: 2026-06-08T13:40:52.236Z
last refreshed on: 2026-06-08T13:41:38.450Z
source accessed on: 2024-06-05T14:42:36Z
source last accessed on: 2024-06-05T14:42:36Z
label: Animais de estimação e suprimentos - online @pt
label: Animali e forniture - online @it
label: Animaux et fournitures pour animaux - En ligne @fr
label: Haustiere & Haustierbedarf - Online @de
label: Mascotas y provisiones - En línea @es
label: Домашние животные и сопутств. товары - Онлайн @ru
label: 宠物及用品 - 在线 @zh
label: 寵物及寵物用品-線上 @zh-hant
label: 애완동물 & 소모품 - 온라인 @ko
label: ﾍﾟｯﾄ･ﾍﾟｯﾄ用品-ｵﾝﾗｲﾝ @ja
definition: This segment includes companies that specialize in retailing pets and pet care products on the Internet.
notation: 1112121121
valid from: 2024-06-07

Sporting Goods - Online
type: BicsLevel5Segment
type: Classifier
type: NamedIndividual
is level5 segment of: Specialty Online Retailers
is contemporary version of: http://data.ga-group.nl/ics/bics/1112121122
is version of: http://data.ga-group.nl/ics/bics/1112121122
replaces: http://data.ga-group.nl/ics/bics/2020/1112121122
imported on: 2026-06-08T13:40:52.236Z
last refreshed on: 2026-06-08T13:41:38.450Z
source accessed on: 2024-06-05T14:42:36Z
source last accessed on: 2024-06-05T14:42:36Z
label: Artículos deportivos - En línea @es
label: Articles de sport - En ligne @fr
label: Articoli sportivi - online @it
label: Bens desportivos - Online @pt
label: Sportartikel - Online @de
label: Спорттовары - Онлайн @ru
label: 运动用品-在线 @zh
label: 運動用品-線上 @zh-hant
label: 스포츠용품-온라인 @ko
label: ｽﾎﾟｰﾂ用品-ｵﾝﾗｲﾝ @ja
definition: This segment includes companies that specialize in retailing sporting goods, outdoor recreational products, and small arms on the Internet.
notation: 1112121122
valid from: 2024-06-07

Specialty Online Retailers
type: BicsLevel4SubIndustry
type: Classifier
type: NamedIndividual
is sub industry of: E-Commerce Discretionary
is contemporary version of: http://data.ga-group.nl/ics/bics/11121211
is version of: http://data.ga-group.nl/ics/bics/11121211
replaces: http://data.ga-group.nl/ics/bics/2020/11121211
imported on: 2026-06-08T13:40:52.236Z
last refreshed on: 2026-06-08T13:41:38.450Z
source accessed on: 2024-06-05T14:42:36Z
source last accessed on: 2024-06-05T14:42:36Z
label: Dettaglianti specializz online @it
label: Minoristas especializados en línea @es
label: Online-Fachhändler @de
label: Varejistas especiais online @pt
label: Vte détail spécial. en ligne @fr
label: Спец. онлайн-магазины @ru
label: 其他特殊產品零售-線上 @zh-hant
label: 特种在线零售商 @zh
label: 기타 전문 소매-온라인 @ko
label: ｵﾝﾗｲﾝ専門小売 @ja
definition: This industry subgroup includes companies that specialize in retailing specific merchandise lines on the Internet.
notation: 11121211
valid from: 2024-06-07

E-Commerce Discretionary
type: BicsLevel3Industry
type: Classifier
type: NamedIndividual
is industry of: Retail & Whsle - Discretionary
is contemporary version of: http://data.ga-group.nl/ics/bics/111212
is version of: http://data.ga-group.nl/ics/bics/111212
replaces: http://data.ga-group.nl/ics/bics/2020/111212
imported on: 2026-06-08T13:40:52.236Z
last refreshed on: 2026-06-08T13:41:38.450Z
source accessed on: 2024-06-05T14:42:36Z
source last accessed on: 2024-06-05T14:42:36Z
label: Discric coméc elet @pt
label: E-Commerce - Discretionary @de
label: E-Commerce discrecional @es
label: E-Commerce discrezionale @it
label: E-commerce discrétionnaire @fr
label: ЭК-Tовары выборочн. спроса @ru
label: 电子商务非必需品 @zh
label: 電子商務非必需品 @zh-hant
label: 電子商取引-一般消費財 @ja
label: 전자상거래 자유소비재 @ko
definition: This industry includes companies that retail consumer discretionary goods directly to the general public through websites.
notation: 111212
valid from: 2024-06-07

Retail & Whsle - Discretionary
type: BicsLevel2IndustryGroup
type: Classifier
type: NamedIndividual
is industry group of: Consumer Discretionary
is contemporary version of: http://data.ga-group.nl/ics/bics/1112
is version of: http://data.ga-group.nl/ics/bics/1112
replaces: http://data.ga-group.nl/ics/bics/2020/1112
imported on: 2026-06-08T13:40:52.236Z
last refreshed on: 2026-06-08T13:41:38.450Z
source accessed on: 2024-06-05T14:42:36Z
source last accessed on: 2024-06-05T14:42:36Z
label: Al dettaglio e all'ingrosso - Discrez @it
label: Détail et gros - Conso discrét @fr
label: EH & GH - Gebrauchsgüter @de
label: Minorista y mayor- discrecional @es
label: Varejo e atacado - Discric @pt
label: Розн. и опт. торговля - товары выбор. спроса @ru
label: 小売･卸売-一般消費財 @ja
label: 零售与批发-非必需品 @zh
label: 零售及批發-非核心 @zh-hant
label: 소매 & 도매 - 자유 @ko
definition: This industry group includes companies that provide distribution channels for consumer discretionary products.
notation: 1112
valid from: 2024-06-07

Consumer Discretionary
type: BicsLevel1Sector
type: Classifier
type: NamedIndividual
is contemporary version of: http://data.ga-group.nl/ics/bics/11
is version of: http://data.ga-group.nl/ics/bics/11
replaces: http://data.ga-group.nl/ics/bics/2020/11
imported on: 2026-06-08T13:40:52.236Z
last refreshed on: 2026-06-08T13:41:38.450Z
source accessed on: 2024-06-05T14:42:36Z
source last accessed on: 2024-06-05T14:42:36Z
label: Conso discrétionnaire @fr
label: Consumo discrecional @es
label: Consumo discrezionale @it
label: Consumo discricionário @pt
label: Gebrauchsgüter @de
label: Товары выборочного спроса @ru
label: 一般消費財 @ja
label: 一般���費財 @ja
label: 非必需消费品 @zh
label: 非核心消費 @zh-hant
label: 자유 소비재 @ko
definition: This sector includes companies that design, manufacture, distribute, or retail consumer discretionary products and services.
notation: 11
valid from: 2024-06-07

Animal Feed
type: BicsLevel5Segment
type: Classifier
type: NamedIndividual
is level5 segment of: Agricultural Producers
is contemporary version of: http://data.ga-group.nl/ics/bics/1210101010
is version of: http://data.ga-group.nl/ics/bics/1210101010
replaces: http://data.ga-group.nl/ics/bics/2020/1210101010
imported on: 2026-06-08T13:40:52.236Z
last refreshed on: 2026-06-08T13:41:38.450Z
source accessed on: 2024-06-05T14:42:36Z
source last accessed on: 2024-06-05T14:42:36Z
label: Alimento de animales @es
label: Alimentos para animais @pt
label: Aliments pour animaux @fr
label: Mangimi per animali @it
label: Tierfutter @de
label: Животный корм @ru
label: 动物饲料 @zh
label: 動物飼料製造 @zh-hant
label: 家畜飼料 @ja
label: 동물 사료 @ko
definition: This segment includes companies that produce food consumed by farm and other animals.
notation: 1210101010
valid from: 2024-06-07

Beef Cattle Ranch & Farming
type: BicsLevel7Segment
type: Classifier
type: NamedIndividual
is level7 segment of: Cattle Ranching & Farming
is contemporary version of: http://data.ga-group.nl/ics/bics/12101010111010
is version of: http://data.ga-group.nl/ics/bics/12101010111010
replaces: http://data.ga-group.nl/ics/bics/2020/12101010111010
imported on: 2026-06-08T13:40:52.236Z
last refreshed on: 2026-06-08T13:41:38.450Z
source accessed on: 2024-06-05T14:42:36Z
source last accessed on: 2024-06-05T14:42:36Z
label: Allev vacche da carne e coltivazione @it
label: Elevage de bovins de boucherie et agriculture @fr
label: Pecuária de gados para cortes @pt
label: Ranchos de ganado de res y cultivo @es
label: Schlachtrinderzucht & Landwirtschaft @de
label: Разведение и выращивание крупного рогатого скота @ru
label: 肉牛放牧与养殖 @zh
label: 肉牛放牧飼育業 @zh-hant
label: 肉用牛畜産 @ja
label: 육우 사육업 @ko
definition: This segment includes companies that raise cattle for beef.
notation: 12101010111010
valid from: 2024-06-07

Dairy Cattle & Milk Production
type: BicsLevel7Segment
type: Classifier
type: NamedIndividual
is level7 segment of: Cattle Ranching & Farming
is contemporary version of: http://data.ga-group.nl/ics/bics/12101010111011
is version of: http://data.ga-group.nl/ics/bics/12101010111011
replaces: http://data.ga-group.nl/ics/bics/2020/12101010111011
imported on: 2026-06-08T13:40:52.236Z
last refreshed on: 2026-06-08T13:41:38.450Z
source accessed on: 2024-06-05T14:42:36Z
source last accessed on: 2024-06-05T14:42:36Z
label: Elevage de bovins laitiers et production laitière @fr
label: Explotación de bovinos para leche @es
label: Milchviehzucht & Milchproduktion @de
label: Produção de leite e gado leiteiro @pt
label: Vacche e produzione latte @it
label: Молочное скотоводство и пр-во молока @ru
label: 乳牛及牛奶生產 @zh-hant
label: 奶牛与牛奶生产 @zh
label: 酪農･牛乳生産 @ja
label: 젖소 & 우유 생산 @ko
definition: This segment includes companies that raise and breed dairy cattle and companies that produce raw milk.
notation: 12101010111011
valid from: 2024-06-07

Cattle Ranching & Farming
type: BicsLevel6Segment
type: Classifier
type: NamedIndividual
is level6 segment of: Animal Production & Process
is contemporary version of: http://data.ga-group.nl/ics/bics/121010101110
is version of: http://data.ga-group.nl/ics/bics/121010101110
replaces: http://data.ga-group.nl/ics/bics/2020/121010101110
imported on: 2026-06-08T13:40:52.236Z
last refreshed on: 2026-06-08T13:41:38.450Z
source accessed on: 2024-06-05T14:42:36Z
source last accessed on: 2024-06-05T14:42:36Z
label: Allev bestiame e coltivazione @it
label: Elevage d'animaux de boucherie et agriculture @fr
label: Pecuária de gados @pt
label: Ranchos de ganado y cultivo @es
label: Schlachtrinderzucht @de
label: Мясное скотоводство @ru
label: 养牛 @zh
label: 牛放牧飼育業 @zh-hant
label: 牛畜産 @ja
label: 목우 축산업 @ko
definition: This segment includes companies that raise cattle.
notation: 121010101110
valid from: 2024-06-07

Hog & Pig Farming
type: BicsLevel6Segment
type: Classifier
type: NamedIndividual
is level6 segment of: Animal Production & Process
is contemporary version of: http://data.ga-group.nl/ics/bics/121010101111
is version of: http://data.ga-group.nl/ics/bics/121010101111
replaces: http://data.ga-group.nl/ics/bics/2020/121010101111
imported on: 2026-06-08T13:40:52.236Z
last refreshed on: 2026-06-08T13:41:38.450Z
source accessed on: 2024-06-05T14:42:36Z
source last accessed on: 2024-06-05T14:42:36Z
label: Allev suini e maiali @it
label: Cultivo de suínos e @pt
label: Elevage de porcs @fr
label: Porcinos en granja @es
label: Schweinezucht @de
label: Свиноводство @ru
label: 养猪场 @zh
label: 豬飼育 @zh-hant
label: 養豚 @ja
label: 양돈 사육업 @ko
definition: This segment includes companies that raise and breed hogs and pigs.
notation: 121010101111
valid from: 2024-06-07

Poultry Farming
type: BicsLevel6Segment
type: Classifier
type: NamedIndividual
is level6 segment of: Animal Production & Process
is contemporary version of: http://data.ga-group.nl/ics/bics/121010101112
is version of: http://data.ga-group.nl/ics/bics/121010101112
replaces: http://data.ga-group.nl/ics/bics/2020/121010101112
imported on: 2026-06-08T13:40:52.236Z
last refreshed on: 2026-06-08T13:41:38.450Z
source accessed on: 2024-06-05T14:42:36Z
source last accessed on: 2024-06-05T14:42:36Z
label: Allevamenti avicoli @it
label: Cría de aves @es
label: Elevage de volaille @fr
label: Geflügelzucht @de
label: Prod de frango @pt
label: Птицеводство @ru
label: 家禽飼育 @zh-hant
label: 家禽･鶏卵 @ja
label: 禽类养殖 @zh
label: 가금류 사육업 @ko
definition: This segment includes companies that hatch and raise poultry.
notation: 121010101112
valid from: 2024-06-07

Meat Processing
type: BicsLevel7Segment
type: Classifier
type: NamedIndividual
is level7 segment of: Animal Processing
is contemporary version of: http://data.ga-group.nl/ics/bics/12101010111310
is version of: http://data.ga-group.nl/ics/bics/12101010111310
replaces: http://data.ga-group.nl/ics/bics/2020/12101010111310
imported on: 2026-06-08T13:40:52.236Z
last refreshed on: 2026-06-08T13:41:38.450Z
source accessed on: 2024-06-05T14:42:36Z
source last accessed on: 2024-06-05T14:42:36Z
label: Fleischverarbeitung @de
label: Lavorazione della carne @it
label: Procesamiento de carnes @es
label: Processamento de carne @pt
label: Transformation de viande @fr
label: Обработка мяса @ru
label: と畜 @ja
label: 肉类加工 @zh
label: 肉類加工處理 @zh-hant
label: 육류가공업 @ko
definition: This segment includes companies that slaughter, dress, and process animals.
notation: 12101010111310
valid from: 2024-06-07

Poultry Processing
type: BicsLevel7Segment
type: Classifier
type: NamedIndividual
is level7 segment of: Animal Processing
is contemporary version of: http://data.ga-group.nl/ics/bics/12101010111311
is version of: http://data.ga-group.nl/ics/bics/12101010111311
replaces: http://data.ga-group.nl/ics/bics/2020/12101010111311
imported on: 2026-06-08T13:40:52.236Z
last refreshed on: 2026-06-08T13:41:38.450Z
source accessed on: 2024-06-05T14:42:36Z
source last accessed on: 2024-06-05T14:42:36Z
label: Geflügelverarbeitung @de
label: Lavorazione pollame @it
label: Proc aves de corral @es
label: Processamento de aves @pt
label: Transfor. volaille @fr
label: Переработка птицы @ru
label: 家きん処理 @ja
label: 家禽加工處理 @zh-hant
label: 家禽处理加工 @zh
label: 가금류 가공업 @ko
definition: This segment includes companies that slaughter, dress and process poultry, such as chickens, turkeys, ducks, and geese.
notation: 12101010111311
valid from: 2024-06-07

Rendering & Meat Byproducts
type: BicsLevel7Segment
type: Classifier
type: NamedIndividual
is level7 segment of: Animal Processing
is contemporary version of: http://data.ga-group.nl/ics/bics/12101010111312
is version of: http://data.ga-group.nl/ics/bics/12101010111312
replaces: http://data.ga-group.nl/ics/bics/2020/12101010111312
imported on: 2026-06-08T13:40:52.236Z
last refreshed on: 2026-06-08T13:41:38.450Z
source accessed on: 2024-06-05T14:42:36Z
source last accessed on: 2024-06-05T14:42:36Z
label: Fonte et sous-produits de viande @fr
label: Lavorzne sottoprodotti carne @it
label: Preparación de embutidos y otras conservas de carne @es
label: Tierkörperverwertungs- & Fleischnebenprodukte @de
label: Tratamento e processamento de carne @pt
label: Перераб. непищев. животного сырья и мясные побочные продукты @ru
label: 動物性脂肪精製･食肉副産物 @ja
label: 油脂炼制和肉副产品 @zh
label: 油脂精煉及肉類副產品 @zh-hant
label: 가공 및 육류 부산물 @ko
definition: This segment includes companies that render fats and oils from animals and plants. It includes companies that render grease and lard.
notation: 12101010111312
valid from: 2024-06-07

Animal Processing
type: BicsLevel6Segment
type: Classifier
type: NamedIndividual
is level6 segment of: Animal Production & Process
is contemporary version of: http://data.ga-group.nl/ics/bics/121010101113
is version of: http://data.ga-group.nl/ics/bics/121010101113
replaces: http://data.ga-group.nl/ics/bics/2020/121010101113
imported on: 2026-06-08T13:40:52.236Z
last refreshed on: 2026-06-08T13:41:38.450Z
source accessed on: 2024-06-05T14:42:36Z
source last accessed on: 2024-06-05T14:42:36Z
label: Lavorazione animali @it
label: Procesamiento de animales @es
label: Processamento de animal @pt
label: Tierverarbeitung @de
label: Transformation animale @fr
label: Переработка скота @ru
label: 动物加工 @zh
label: 動物加工處理 @zh-hant
label: 食肉加工 @ja
label: 축산가공업 @ko
definition: This segment includes companies that are involved in animal processing.
notation: 121010101113
valid from: 2024-06-07

Animal Production & Process
type: BicsLevel5Segment
type: Classifier
type: NamedIndividual
is level5 segment of: Agricultural Producers
is contemporary version of: http://data.ga-group.nl/ics/bics/1210101011
is version of: http://data.ga-group.nl/ics/bics/1210101011
replaces: http://data.ga-group.nl/ics/bics/2020/1210101011
imported on: 2026-06-08T13:40:52.236Z
last refreshed on: 2026-06-08T13:41:38.450Z
source accessed on: 2024-06-05T14:42:36Z
source last accessed on: 2024-06-05T14:42:36Z
label: Cría de animales @es
label: Elevage et transformation @fr
label: Produção e processo animal @pt
label: Produzione e lavorazione animali @it
label: Tierproduktion & -verarbeitung @de
label: Животновод. производство и переработка @ru
label: 动物养殖与加工 @zh
label: 動物產品及加工 @zh-hant
label: 畜産農業･加工 @ja
label: 가축 사육업 & 가공업 @ko
definition: This segment includes companies that raise, process, and/or slaughter animals for use in food products.
notation: 1210101011
valid from: 2024-06-07

Finfish Farm & Fish Hatcheries
type: BicsLevel7Segment
type: Classifier
type: NamedIndividual
is level7 segment of: Aquaculture
is contemporary version of: http://data.ga-group.nl/ics/bics/12101010121010
is version of: http://data.ga-group.nl/ics/bics/12101010121010
replaces: http://data.ga-group.nl/ics/bics/2020/12101010121010
imported on: 2026-06-08T13:40:52.236Z
last refreshed on: 2026-06-08T13:41:38.450Z
source accessed on: 2024-06-05T14:42:36Z
source last accessed on: 2024-06-05T14:42:36Z
label: Acuicultura e incubación @es
label: Allevamento pesci e incubatoi @it
label: Finnwalzucht & Fischbrutstätten @de
label: Piscicultura e incubadoras @pt
label: Pisciculture et écloseries @fr
label: Развед. рыбы и рыбные питомники @ru
label: 養魚･魚卵孵化場 @ja
label: 鰭魚類養殖及魚類孵化 @zh-hant
label: 鱼类养殖及孵卵 @zh
label: 참어류 양식/어류 부화장 @ko
definition: This segment includes companies that farm finfish.
notation: 12101010121010
valid from: 2024-06-07

Shellfish Farming
type: BicsLevel7Segment
type: Classifier
type: NamedIndividual
is level7 segment of: Aquaculture
is contemporary version of: http://data.ga-group.nl/ics/bics/12101010121011
is version of: http://data.ga-group.nl/ics/bics/12101010121011
replaces: http://data.ga-group.nl/ics/bics/2020/12101010121011
imported on: 2026-06-08T13:40:52.236Z
last refreshed on: 2026-06-08T13:41:38.450Z
source accessed on: 2024-06-05T14:42:36Z
source last accessed on: 2024-06-05T14:42:36Z
label: Allevam crostacei @it
label: Aquaculture crustacé @fr
label: Cultivo de crustáceos @pt
label: Explotac mariscos @es
label: Schalentierzucht @de
label: Разведение моллюсков @ru
label: 虾、贝类养殖 @zh
label: 貝類養殖 @ja
label: 갑각류 양식업 @ko
definition: This segment includes companies that farm shellfish.
notation: 12101010121011
valid from: 2024-06-07

Aquaculture
type: BicsLevel6Segment
type: Classifier
type: NamedIndividual
is level6 segment of: Aquaculture Fishing
is contemporary version of: http://data.ga-group.nl/ics/bics/121010101210
is version of: http://data.ga-group.nl/ics/bics/121010101210
replaces: http://data.ga-group.nl/ics/bics/2020/121010101210
imported on: 2026-06-08T13:40:52.236Z
last refreshed on: 2026-06-08T13:41:38.450Z
source accessed on: 2024-06-05T14:42:36Z
source last accessed on: 2024-06-05T14:42:36Z
label: Acquicoltura @it
label: Acuacultura @es
label: Aqüicultura @pt
label: Aquakultur @de
label: Аквакультура @ru
label: 水产业 @zh
label: 水產養殖 @zh-hant
label: 養殖水産品 @ja
label: 양식업 @ko
definition: This segment includes companies that farm aquatic life.
notation: 121010101210
valid from: 2024-06-07

Finfish Fishing
type: BicsLevel7Segment
type: Classifier
type: NamedIndividual
is level7 segment of: Fishing
is contemporary version of: http://data.ga-group.nl/ics/bics/12101010121110
is version of: http://data.ga-group.nl/ics/bics/12101010121110
replaces: http://data.ga-group.nl/ics/bics/2020/12101010121110
imported on: 2026-06-08T13:40:52.236Z
last refreshed on: 2026-06-08T13:41:38.450Z
source accessed on: 2024-06-05T14:42:36Z
source last accessed on: 2024-06-05T14:42:36Z
label: Acuicultura @es
label: Finnwalfischerei @de
label: Pêche (nageoires) @fr
label: Pesca de peixes moluscos @pt
label: Pesca pesci pinne @it
label: Рыболовство @ru
label: 魚類漁業 @ja
label: 鰭魚類漁業 @zh-hant
label: 鱼类捕捞 @zh
label: 물고기류 어업 @ko
definition: This segment includes companies that catch finfish in their natural habitat.
notation: 12101010121110
valid from: 2024-06-07

Shellfish Fishing
type: BicsLevel7Segment
type: Classifier
type: NamedIndividual
is level7 segment of: Fishing
is contemporary version of: http://data.ga-group.nl/ics/bics/12101010121111
is version of: http://data.ga-group.nl/ics/bics/12101010121111
replaces: http://data.ga-group.nl/ics/bics/2020/12101010121111
imported on: 2026-06-08T13:40:52.236Z
last refreshed on: 2026-06-08T13:41:38.450Z
source accessed on: 2024-06-05T14:42:36Z
source last accessed on: 2024-06-05T14:42:36Z
label: Pêche mollu/crustacé @fr
label: Pesca de crustáceos @pt
label: Pesca de mariscos @es
label: Pesca di crostacei @it
label: Schalentierfischerei @de
label: Ловля моллюсков @ru
label: 虾、贝类捕捞 @zh
label: 貝類漁業 @ja
label: 갑각류 어업 @ko
definition: This segment includes companies that catch shellfish in their natural habitat.
notation: 12101010121111
valid from: 2024-06-07

Fishing
type: BicsLevel6Segment
type: Classifier
type: NamedIndividual
is level6 segment of: Aquaculture Fishing
is contemporary version of: http://data.ga-group.nl/ics/bics/121010101211
is version of: http://data.ga-group.nl/ics/bics/121010101211
replaces: http://data.ga-group.nl/ics/bics/2020/121010101211
imported on: 2026-06-08T13:40:52.236Z
last refreshed on: 2026-06-08T13:41:38.450Z
source accessed on: 2024-06-05T14:42:36Z
source last accessed on: 2024-06-05T14:42:36Z
label: Fischerei @de
label: Pêche @fr
label: Pesca @es
label: Рыболовство @ru
label: 渔业 @zh
label: 漁業 @ja
label: 어업 @ko
definition: This segment includes companies that fish aquatic life in their natural habitats.
notation: 121010101211
valid from: 2024-06-07

Aquaculture Fishing
type: BicsLevel5Segment
type: Classifier
type: NamedIndividual
is level5 segment of: Agricultural Producers
is contemporary version of: http://data.ga-group.nl/ics/bics/1210101012
is version of: http://data.ga-group.nl/ics/bics/1210101012
replaces: http://data.ga-group.nl/ics/bics/2020/1210101012
imported on: 2026-06-08T13:40:52.236Z
last refreshed on: 2026-06-08T13:41:38.450Z
source accessed on: 2024-06-05T14:42:36Z
source last accessed on: 2024-06-05T14:42:36Z
label: Acquicoltura e pesca @it
label: Acuacultura y pesca @es
label: Agriculture et pêche @fr
label: Aquakultur&Fischerei @de
label: Pesca de aquicultura @pt
label: Рыбоводное хозяйство и рыболовство @ru
label: 农业与渔业 @zh
label: 水產養殖及漁業 @zh-hant
label: 養殖･漁業 @ja
label: 양식업 & 어업 @ko
definition: This segment includes companies involved in aquaculture and fishing.
notation: 1210101012
valid from: 2024-06-07

Cocoa Farming
type: BicsLevel6Segment
type: Classifier
type: NamedIndividual
is level6 segment of: Food Crop Production
is contemporary version of: http://data.ga-group.nl/ics/bics/121010101310
is version of: http://data.ga-group.nl/ics/bics/121010101310
replaces: http://data.ga-group.nl/ics/bics/2020/121010101310
imported on: 2026-06-08T13:40:52.236Z
last refreshed on: 2026-06-08T13:41:38.450Z
source accessed on: 2024-06-05T14:42:36Z
source last accessed on: 2024-06-05T14:42:36Z
label: Coltivazione cacao @it
label: Cultivo de cacao @es
label: Cultivo de cacau @pt
label: Kakaoanbau @de
label: Plantation de cacao @fr
label: Возделывание деревьев какао @ru
label: 可可种植 @zh
label: 可可耕作 @zh-hant
label: 코코아 재배 @ko
label: ｺｺｱ栽培 @ja
definition: This segment includes companies that grow cocoa.
notation: 121010101310
valid from: 2024-06-07

Apple Orchards
type: BicsLevel7Segment
type: Classifier
type: NamedIndividual
is level7 segment of: Fruit Farming
is contemporary version of: http://data.ga-group.nl/ics/bics/12101010131110
is version of: http://data.ga-group.nl/ics/bics/12101010131110
replaces: http://data.ga-group.nl/ics/bics/2020/12101010131110
imported on: 2026-06-08T13:40:52.236Z
last refreshed on: 2026-06-08T13:41:38.450Z
source accessed on: 2024-06-05T14:42:36Z
source last accessed on: 2024-06-05T14:42:36Z
label: Apfelplantagen @de
label: Culture de pommes @fr
label: Frutteti di mele @it
label: Huertos de manzanas @es
label: Pomares de maçã @pt
label: Яблоневые сады @ru
label: Яблоне��ые сады @ru
label: りんご園 @ja
label: 苹果园 @zh
label: 蘋果園 @zh-hant
label: 사과 재배업 @ko
definition: This segment includes companies that grow apples.
notation: 12101010131110
valid from: 2024-06-07

Citrus Groves (excl Oranges)
type: BicsLevel7Segment
type: Classifier
type: NamedIndividual
is level7 segment of: Fruit Farming
is contemporary version of: http://data.ga-group.nl/ics/bics/12101010131111
is version of: http://data.ga-group.nl/ics/bics/12101010131111
replaces: http://data.ga-group.nl/ics/bics/2020/12101010131111
imported on: 2026-06-08T13:40:52.236Z
last refreshed on: 2026-06-08T13:41:38.450Z
source accessed on: 2024-06-05T14:42:36Z
source last accessed on: 2024-06-05T14:42:36Z
label: Agrumeti (escluso arance) @it
label: Cultivos cítricos (sin naranjas) @es
label: Culture d'agrumes h. oranges @fr
label: Pomares (excl laranjas) @pt
label: Zitrushain (exkl. Orangen) @de
label: Цитрусовые (искл. апельсины) @ru
label: 柑橘园(除橙子) @zh
label: 柑橘園(橘子除外) @zh-hant
label: 柑橘類(除ｵﾚﾝｼﾞ) @ja
label: 감귤류 재배업 (오렌지 제외) @ko
definition: This segment includes companies that grow citrus fruits other than oranges.
notation: 12101010131111
valid from: 2024-06-07

Grape Vineyards
type: BicsLevel7Segment
type: Classifier
type: NamedIndividual
is level7 segment of: Fruit Farming
is contemporary version of: http://data.ga-group.nl/ics/bics/12101010131112
is version of: http://data.ga-group.nl/ics/bics/12101010131112
replaces: http://data.ga-group.nl/ics/bics/2020/12101010131112
imported on: 2026-06-08T13:40:52.236Z
last refreshed on: 2026-06-08T13:41:38.450Z
source accessed on: 2024-06-05T14:42:36Z
source last accessed on: 2024-06-05T14:42:36Z
label: Viñedos @es
label: Vigneti d'uva @it
label: Vignobles @fr
label: Vinhedos de uva @pt
label: Weintraubenplantagen @de
label: Виноградники @ru
label: ぶどう園 @ja
label: 葡萄园 @zh
label: 葡萄園 @zh-hant
label: 포도 재배업 @ko
definition: This segment includes companies that grow grapes.
notation: 12101010131112
valid from: 2024-06-07

Orange Groves
type: BicsLevel7Segment
type: Classifier
type: NamedIndividual
is level7 segment of: Fruit Farming
is contemporary version of: http://data.ga-group.nl/ics/bics/12101010131113
is version of: http://data.ga-group.nl/ics/bics/12101010131113
replaces: http://data.ga-group.nl/ics/bics/2020/12101010131113
imported on: 2026-06-08T13:40:52.236Z
last refreshed on: 2026-06-08T13:41:38.450Z
source accessed on: 2024-06-05T14:42:36Z
source last accessed on: 2024-06-05T14:42:36Z
label: Aranceti @it
label: Arvoredos de laranja @pt
label: Cultivo de naranja @es
label: Culture d'oranges @fr
label: Orangenanbau @de
label: Апельсиновые рощи @ru
label: 橘園 @zh-hant
label: 橙林 @zh
label: 오렌지 재배업 @ko
label: ｵﾚﾝｼﾞ畑 @ja
definition: This segment includes companies that grow oranges.
notation: 12101010131113
valid from: 2024-06-07

Strawberry Farming
type: BicsLevel7Segment
type: Classifier
type: NamedIndividual
is level7 segment of: Fruit Farming
is contemporary version of: http://data.ga-group.nl/ics/bics/12101010131114
is version of: http://data.ga-group.nl/ics/bics/12101010131114
replaces: http://data.ga-group.nl/ics/bics/2020/12101010131114
imported on: 2026-06-08T13:40:52.236Z
last refreshed on: 2026-06-08T13:41:38.450Z
source accessed on: 2024-06-05T14:42:36Z
source last accessed on: 2024-06-05T14:42:36Z
label: Coltivazione fragole @it
label: Cultivo de fresas @es
label: Cultivo de morango @pt
label: Culture de fraises @fr
label: Erdbeeranbau @de
label: Выращивание клубники @ru
label: いちご園 @ja
label: 草苺栽培 @zh-hant
label: 草莓种植 @zh
label: 딸기 재배업 @ko
definition: This segment includes companies that grow strawberries.
notation: 12101010131114
valid from: 2024-06-07

Fruit Farming
type: BicsLevel6Segment
type: Classifier
type: NamedIndividual
is level6 segment of: Food Crop Production
is contemporary version of: http://data.ga-group.nl/ics/bics/121010101311
is version of: http://data.ga-group.nl/ics/bics/121010101311
replaces: http://data.ga-group.nl/ics/bics/2020/121010101311
imported on: 2026-06-08T13:40:52.236Z
last refreshed on: 2026-06-08T13:41:38.450Z
source accessed on: 2024-06-05T14:42:36Z
source last accessed on: 2024-06-05T14:42:36Z
label: Coltivazione frutta @it
label: Cultivo de frutas @es
label: Culture de fruits @fr
label: Fruticultura @pt
label: Obstanbau @de
label: Выращивание фруктов @ru
label: 果物生産 @ja
label: 水果栽培 @zh-hant
label: 水果种植 @zh
label: 과일 재배업 @ko
definition: This segment includes companies that grow fruit.
notation: 121010101311
valid from: 2024-06-07

Corn Farming
type: BicsLevel7Segment
type: Classifier
type: NamedIndividual
is level7 segment of: Grain Farming
is contemporary version of: http://data.ga-group.nl/ics/bics/12101010131210
is version of: http://data.ga-group.nl/ics/bics/12101010131210
replaces: http://data.ga-group.nl/ics/bics/2020/12101010131210
imported on: 2026-06-08T13:40:52.236Z
last refreshed on: 2026-06-08T13:41:38.450Z
source accessed on: 2024-06-05T14:42:36Z
source last accessed on: 2024-06-05T14:42:36Z
label: Coltivazione di mais @it
label: Cultivo de maíz @es
label: Cultivo de milho @pt
label: Culture du maïs @fr
label: Maisanbau @de
label: Выращивание кукурузы @ru
label: 玉米栽培 @zh-hant
label: 玉米种植 @zh
label: 옥수수 재배업 @ko
label: ﾄｳﾓﾛｺｼ作農業 @ja
definition: This segment includes companies that grow corn.
notation: 12101010131210
valid from: 2024-06-07

Rice Farming
type: BicsLevel7Segment
type: Classifier
type: NamedIndividual
is level7 segment of: Grain Farming
is contemporary version of: http://data.ga-group.nl/ics/bics/12101010131211
is version of: http://data.ga-group.nl/ics/bics/12101010131211
replaces: http://data.ga-group.nl/ics/bics/2020/12101010131211
imported on: 2026-06-08T13:40:52.236Z
last refreshed on: 2026-06-08T13:41:38.450Z
source accessed on: 2024-06-05T14:42:36Z
source last accessed on: 2024-06-05T14:42:36Z
label: Coltivazione di riso @it
label: Cultivo de arroz @es
label: Culture du riz @fr
label: Reisanbau @de
label: Выращивание риса @ru
label: 稻作栽培 @zh-hant
label: 稻类种植 @zh
label: 米作農業 @ja
label: 쌀 재배업 @ko
definition: This segment includes companies that grow rice.
notation: 12101010131211
valid from: 2024-06-07

Wheat Farming
type: BicsLevel7Segment
type: Classifier
type: NamedIndividual
is level7 segment of: Grain Farming
is contemporary version of: http://data.ga-group.nl/ics/bics/12101010131212
is version of: http://data.ga-group.nl/ics/bics/12101010131212
replaces: http://data.ga-group.nl/ics/bics/2020/12101010131212
imported on: 2026-06-08T13:40:52.236Z
last refreshed on: 2026-06-08T13:41:38.450Z
source accessed on: 2024-06-05T14:42:36Z
source last accessed on: 2024-06-05T14:42:36Z
label: Coltivaz frumento @it
label: Cultivo de trigo @es
label: Culture du blé @fr
label: Weizenanbau @de
label: Выращивание пшеницы @ru
label: 小麥栽培 @zh-hant
label: 小麦种植 @zh
label: 麦作農業 @ja
label: 밀 재배업 @ko
definition: This segment includes companies that grow wheat.
notation: 12101010131212
valid from: 2024-06-07

Grain Farming
type: BicsLevel6Segment
type: Classifier
type: NamedIndividual
is level6 segment of: Food Crop Production
is contemporary version of: http://data.ga-group.nl/ics/bics/121010101312
is version of: http://data.ga-group.nl/ics/bics/121010101312
replaces: http://data.ga-group.nl/ics/bics/2020/121010101312
imported on: 2026-06-08T13:40:52.236Z
last refreshed on: 2026-06-08T13:41:38.450Z
source accessed on: 2024-06-05T14:42:36Z
source last accessed on: 2024-06-05T14:42:36Z
label: Coltivazione grano @it
label: Cultivo de grãos @pt
label: Cultivo de granos @es
label: Cultures céréalières @fr
label: Getreideanbau @de
label: Возделывание зерновых @ru
label: 榖物栽培 @zh-hant
label: 穀物生産 @ja
label: 谷物种植 @zh
label: 곡물 재배업 @ko
definition: This segment includes companies that grow grains, such as corn, wheat, and soybeans.
notation: 121010101312
valid from: 2024-06-07

Mushroom Production
type: BicsLevel6Segment
type: Classifier
type: NamedIndividual
is level6 segment of: Food Crop Production
is contemporary version of: http://data.ga-group.nl/ics/bics/121010101313
is version of: http://data.ga-group.nl/ics/bics/121010101313
replaces: http://data.ga-group.nl/ics/bics/2020/121010101313
imported on: 2026-06-08T13:40:52.236Z
last refreshed on: 2026-06-08T13:41:38.450Z
source accessed on: 2024-06-05T14:42:36Z
source last accessed on: 2024-06-05T14:42:36Z
label: Coltivazione funghi @it
label: Culture champignons @fr
label: Pilzzucht @de
label: Produção de cogumelo @pt
label: Produc champiñones @es
label: Выращивание грибов @ru
label: Выращивание ��рибов @ru
label: きのこ類生産 @ja
label: 蘑菇生产 @zh
label: 蘑菇生產 @zh-hant
label: 버섯 재배업 @ko
definition: This segment includes companies that grow mushrooms.
notation: 121010101313
valid from: 2024-06-07

Palm Oil Farming
type: BicsLevel7Segment
type: Classifier
type: NamedIndividual
is level7 segment of: Oilseed Farming
is contemporary version of: http://data.ga-group.nl/ics/bics/12101010131410
is version of: http://data.ga-group.nl/ics/bics/12101010131410
replaces: http://data.ga-group.nl/ics/bics/2020/12101010131410
imported on: 2026-06-08T13:40:52.236Z
last refreshed on: 2026-06-08T13:41:38.450Z
source accessed on: 2024-06-05T14:42:36Z
source last accessed on: 2024-06-05T14:42:36Z
label: Aceite de palma @es
label: Coltivaz olio palma @it
label: Cultivo de óleo de palma @pt
label: Culture huile palme @fr
label: Palmölanbau @de
label: Производство пальм. масла @ru
label: 棕榈油种植 @zh
label: 棕櫚油栽培 @zh-hant
label: 팜유 재배업 @ko
label: ﾊﾟｰﾑ油生産 @ja
definition: This segment includes companies that grow palms for palm oil production.
notation: 12101010131410
valid from: 2024-06-07

Soybean Farming
type: BicsLevel7Segment
type: Classifier
type: NamedIndividual
is level7 segment of: Oilseed Farming
is contemporary version of: http://data.ga-group.nl/ics/bics/12101010131411
is version of: http://data.ga-group.nl/ics/bics/12101010131411
replaces: http://data.ga-group.nl/ics/bics/2020/12101010131411
imported on: 2026-06-08T13:40:52.236Z
last refreshed on: 2026-06-08T13:41:38.450Z
source accessed on: 2024-06-05T14:42:36Z
source last accessed on: 2024-06-05T14:42:36Z
label: Coltivazione di soia @it
label: Cultivo de haba @es
label: Cultivo de semente de soja @pt
label: Culture du soja @fr
label: Sojabohnenanbau @de
label: Выращивание соевых бобов @ru
label: 大豆种植 @zh
label: 大豆農業 @ja
label: 黃豆栽培 @zh-hant
label: 대두 재배업 @ko
definition: This segment includes companies that grow soybeans or soybean by-products.
notation: 12101010131411
valid from: 2024-06-07

Oilseed Farming
type: BicsLevel6Segment
type: Classifier
type: NamedIndividual
is level6 segment of: Food Crop Production
is contemporary version of: http://data.ga-group.nl/ics/bics/121010101314
is version of: http://data.ga-group.nl/ics/bics/121010101314
replaces: http://data.ga-group.nl/ics/bics/2020/121010101314
imported on: 2026-06-08T13:40:52.236Z
last refreshed on: 2026-06-08T13:41:38.450Z
source accessed on: 2024-06-05T14:42:36Z
source last accessed on: 2024-06-05T14:42:36Z
label: Agricultura oleaginosas @pt
label: Coltivazione di semi oleosi @it
label: Cultivo de semillas oleaginosas @es
label: Culture d'oléagineux @fr
label: Ölsaatenanbau @de
label: Возделывание маслиничных растений @ru
label: 油料種子生産 @ja
label: 油籽栽培 @zh-hant
label: 油籽种植 @zh
label: 오일시드 재배업 @ko
definition: This segment includes companies that grow oilseed-producing plants, such as sunflowers, safflower, flax, cape, canola, and sesame.
notation: 121010101314
valid from: 2024-06-07

Sugarcane Farming
type: BicsLevel6Segment
type: Classifier
type: NamedIndividual
is level6 segment of: Food Crop Production
is contemporary version of: http://data.ga-group.nl/ics/bics/121010101315
is version of: http://data.ga-group.nl/ics/bics/121010101315
replaces: http://data.ga-group.nl/ics/bics/2020/121010101315
imported on: 2026-06-08T13:40:52.236Z
last refreshed on: 2026-06-08T13:41:38.450Z
source accessed on: 2024-06-05T14:42:36Z
source last accessed on: 2024-06-05T14:42:36Z
label: Anbau von Zuckerrohr @de
label: Canne à sucre @fr
label: Coltivaz canna zucch @it
label: Cultivo caña azúcar @es
label: Cultivo de cana-de-açúcar @pt
label: Выращивание сахарного тростника @ru
label: 甘蔗栽培 @zh-hant
label: 甘蔗种植 @zh
label: 사탕수수 재배업 @ko
label: 사탕수수 ��배업 @ko
label: ｻﾄｳｷﾋﾞ作農業 @ja
definition: This segment includes companies that grow sugarcane.
notation: 121010101315
valid from: 2024-06-07

Tree Nut Farming
type: BicsLevel6Segment
type: Classifier
type: NamedIndividual
is level6 segment of: Food Crop Production
is contemporary version of: http://data.ga-group.nl/ics/bics/121010101316
is version of: http://data.ga-group.nl/ics/bics/121010101316
replaces: http://data.ga-group.nl/ics/bics/2020/121010101316
imported on: 2026-06-08T13:40:52.236Z
last refreshed on: 2026-06-08T13:41:38.450Z
source accessed on: 2024-06-05T14:42:36Z
source last accessed on: 2024-06-05T14:42:36Z
label: Anbau von Baumnüssen @de
label: Coltivazione di noci @it
label: Cultivo de frutos de casca @pt
label: Cultivo frut nueces @es
label: Culture de noix @fr
label: Выращивание грецких орехов @ru
label: 堅果栽培 @zh-hant
label: 木の実作農業 @ja
label: 树生坚果种植 @zh
label: 견과나무 재배업 @ko
definition: This segment includes companies that grow tree nuts.
notation: 121010101316
valid from: 2024-06-07

Vegetable Farming
type: BicsLevel6Segment
type: Classifier
type: NamedIndividual
is level6 segment of: Food Crop Production
is contemporary version of: http://data.ga-group.nl/ics/bics/121010101317
is version of: http://data.ga-group.nl/ics/bics/121010101317
replaces: http://data.ga-group.nl/ics/bics/2020/121010101317
imported on: 2026-06-08T13:40:52.236Z
last refreshed on: 2026-06-08T13:41:38.450Z
source accessed on: 2024-06-05T14:42:36Z
source last accessed on: 2024-06-05T14:42:36Z
label: Coltivazione verdure @it
label: Cultivo de vegetais @pt
label: Cultivo de verduras @es
label: Cultures maraîchères @fr
label: Gemüseanbau @de
label: Выращивание овощей @ru
label: 蔬菜栽培 @zh-hant
label: 蔬菜种植 @zh
label: 野菜生産 @ja
label: 야채 재배업 @ko
definition: This segment includes companies that grow vegetables.
notation: 121010101317
valid from: 2024-06-07

Support Services - Crop Prod
type: BicsLevel6Segment
type: Classifier
type: NamedIndividual
is level6 segment of: Food Crop Production
is contemporary version of: http://data.ga-group.nl/ics/bics/121010101318
is version of: http://data.ga-group.nl/ics/bics/121010101318
replaces: http://data.ga-group.nl/ics/bics/2020/121010101318
imported on: 2026-06-08T13:40:52.236Z
last refreshed on: 2026-06-08T13:41:38.450Z
source accessed on: 2024-06-05T14:42:36Z
source last accessed on: 2024-06-05T14:42:36Z
label: Serv de asistencia - prod de cosecha @es
label: Serv de soutien - Prod agricole @fr
label: Serviços de apoio-Prod agrícola @pt
label: Servizi supporto - Prod raccolto @it
label: Supportdienste - Pflanzenbau @de
label: Выращивание культур - вспомог. деятельность @ru
label: 支持服务-农作物生产 @zh
label: 穀物生産支援ｻｰﾋﾞｽ @ja
label: 穀��生産支援ｻｰﾋﾞｽ @ja
label: 農作物生產輔助業 @zh-hant
label: 지원 서비스 - 작물 생산 @ko
definition: This segment includes companies that support activities (either pre or post harvest) for crop production.
notation: 121010101318
valid from: 2024-06-07

Coffee Farming
type: BicsLevel6Segment
type: Classifier
type: NamedIndividual
is level6 segment of: Food Crop Production
is contemporary version of: http://data.ga-group.nl/ics/bics/121010101319
is version of: http://data.ga-group.nl/ics/bics/121010101319
imported on: 2026-06-08T13:40:52.236Z
last refreshed on: 2026-06-08T13:41:38.450Z
source accessed on: 2024-06-05T14:42:36Z
source last accessed on: 2024-06-05T14:42:36Z
label: Coltivazione di caffè @it
label: Cultivo de café @es
label: Culture du café @fr
label: Kaffeeanbau @de
label: Выращивание кофе @ru
label: 咖啡栽培 @zh-hant
label: 咖啡种植 @zh
label: 커피 재배 @ko
label: ｺｰﾋ豆栽培 @ja
definition: This segment includes companies that grow coffee.
notation: 121010101319
valid from: 2024-06-07

Food Crop Production
type: BicsLevel5Segment
type: Classifier
type: NamedIndividual
is level5 segment of: Agricultural Producers
is contemporary version of: http://data.ga-group.nl/ics/bics/1210101013
is version of: http://data.ga-group.nl/ics/bics/1210101013
replaces: http://data.ga-group.nl/ics/bics/2020/1210101013
imported on: 2026-06-08T13:40:52.236Z
last refreshed on: 2026-06-08T13:41:38.450Z
source accessed on: 2024-06-05T14:42:36Z
source last accessed on: 2024-06-05T14:42:36Z
label: Coltivazione @it
label: Cultivos @es
label: Cultures vivrières @fr
label: Futterpflanzenprod. @de
label: Produção de culturas alimentares @pt
label: Производство продовольственных культур @ru
label: 粮食作物生产 @zh
label: 糧食作物生產 @zh-hant
label: 農作物生産 @ja
label: 식량작물 생산업 @ko
label: 식량작물 생산��� @ko
definition: This segment includes companies that produce crops for food consumption.
notation: 1210101013
valid from: 2024-06-07

Fats & Oil Refining
type: BicsLevel7Segment
type: Classifier
type: NamedIndividual
is level7 segment of: Grain & Oilseed Milling
is contemporary version of: http://data.ga-group.nl/ics/bics/12101010141010
is version of: http://data.ga-group.nl/ics/bics/12101010141010
replaces: http://data.ga-group.nl/ics/bics/2020/12101010141010
imported on: 2026-06-08T13:40:52.236Z
last refreshed on: 2026-06-08T13:41:38.450Z
source accessed on: 2024-06-05T14:42:36Z
source last accessed on: 2024-06-05T14:42:36Z
label: Raff grassi e oli @it
label: Raff. Fette & Öle @de
label: Raffin graisse/huile @fr
label: Refin grasas aceites @es
label: Refinação de gordura e óleo @pt
label: Переработка жиров и масел @ru
label: 油脂精炼及加工 @zh
label: 油脂精煉及混合 @zh-hant
label: 油脂精製 @ja
label: 지방&정제혼합제조 @ko
definition: This segment includes companies that refine cooking oils from purchased fats.
notation: 12101010141010
valid from: 2024-06-07

Flour Milling
type: BicsLevel7Segment
type: Classifier
type: NamedIndividual
is level7 segment of: Grain & Oilseed Milling
is contemporary version of: http://data.ga-group.nl/ics/bics/12101010141011
is version of: http://data.ga-group.nl/ics/bics/12101010141011
replaces: http://data.ga-group.nl/ics/bics/2020/12101010141011
imported on: 2026-06-08T13:40:52.236Z
last refreshed on: 2026-06-08T13:41:38.450Z
source accessed on: 2024-06-05T14:42:36Z
source last accessed on: 2024-06-05T14:42:36Z
label: Macinatura di farina @it
label: Mehlverarbeitung @de
label: Minoterie de farine @fr
label: Moagem de trigo @pt
label: Molinería harina @es
label: Помол муки @ru
label: 磨粉 @zh-hant
label: 製粉 @ja
label: 面粉加工 @zh
label: 제분업 @ko
definition: This segment includes companies that mill grains into flour used in food products.
notation: 12101010141011
valid from: 2024-06-07

Malt
type: BicsLevel7Segment
type: Classifier
type: NamedIndividual
is level7 segment of: Grain & Oilseed Milling
is contemporary version of: http://data.ga-group.nl/ics/bics/12101010141012
is version of: http://data.ga-group.nl/ics/bics/12101010141012
replaces: http://data.ga-group.nl/ics/bics/2020/12101010141012
imported on: 2026-06-08T13:40:52.236Z
last refreshed on: 2026-06-08T13:41:38.450Z
source accessed on: 2024-06-05T14:42:36Z
source last accessed on: 2024-06-05T14:42:36Z
label: Malta @es
label: Malte @pt
label: Malto @it
label: Malz @de
label: Солод @ru
label: 麥芽 @zh-hant
label: 麦芽 @ja
label: 맥아 @ko
definition: This segment includes companies that process grains into malt for use in breweries and distilleries. These companies use a multi-step process to dry, steep, germinate, and kiln the grains into malt.
notation: 12101010141012
valid from: 2024-06-07

Palm Oil Processing
type: BicsLevel7Segment
type: Classifier
type: NamedIndividual
is level7 segment of: Grain & Oilseed Milling
is contemporary version of: http://data.ga-group.nl/ics/bics/12101010141013
is version of: http://data.ga-group.nl/ics/bics/12101010141013
replaces: http://data.ga-group.nl/ics/bics/2020/12101010141013
imported on: 2026-06-08T13:40:52.236Z
last refreshed on: 2026-06-08T13:41:38.450Z
source accessed on: 2024-06-05T14:42:36Z
source last accessed on: 2024-06-05T14:42:36Z
label: Aceite de palma @es
label: Lavoraz olio palma @it
label: Palmölverarbeitung @de
label: Processamento de óleo de palma @pt
label: Traitmt huile palme @fr
label: Обработка пальм. масла @ru
label: 棕榈油加工处理 @zh
label: 棕櫚油加工處理 @zh-hant
label: 팜유 가공업 @ko
label: ﾊﾟｰﾑ油加工 @ja
definition: This segment includes companies that produce palm oil.
notation: 12101010141013
valid from: 2024-06-07

Rice Milling
type: BicsLevel7Segment
type: Classifier
type: NamedIndividual
is level7 segment of: Grain & Oilseed Milling
is contemporary version of: http://data.ga-group.nl/ics/bics/12101010141014
is version of: http://data.ga-group.nl/ics/bics/12101010141014
replaces: http://data.ga-group.nl/ics/bics/2020/12101010141014
imported on: 2026-06-08T13:40:52.236Z
last refreshed on: 2026-06-08T13:41:38.450Z
source accessed on: 2024-06-05T14:42:36Z
source last accessed on: 2024-06-05T14:42:36Z
label: Macinatura di riso @it
label: Minoterie de riz @fr
label: Moagem de arroz @pt
label: Molinería de arroz @es
label: Reisverarbeitung @de
label: Шлифование риса @ru
label: 大米碾磨 @zh
label: 碾米 @zh-hant
label: 精米 @ja
label: 정미업 @ko
label: ���米 @zh-hant
definition: This segment includes companies that process and mill raw rice.
notation: 12101010141014
valid from: 2024-06-07

Soybean Processing
type: BicsLevel7Segment
type: Classifier
type: NamedIndividual
is level7 segment of: Grain & Oilseed Milling
is contemporary version of: http://data.ga-group.nl/ics/bics/12101010141015
is version of: http://data.ga-group.nl/ics/bics/12101010141015
replaces: http://data.ga-group.nl/ics/bics/2020/12101010141015
imported on: 2026-06-08T13:40:52.236Z
last refreshed on: 2026-06-08T13:41:38.450Z
source accessed on: 2024-06-05T14:42:36Z
source last accessed on: 2024-06-05T14:42:36Z
label: Lavorazione soia @it
label: Procesamiento haba @es
label: Processamento de soja @pt
label: Sojabohnenverarbeitg @de
label: Transformation soja @fr
label: Переработка соевых бобов (AON) @ru
label: 大豆加工 @ja
label: 大豆加工处理 @zh
label: 黃豆處理 @zh-hant
label: 대두 가공업 @ko
definition: This segment includes companies that process soybeans into tofu, oils, animal feed, and other edibles.
notation: 12101010141015
valid from: 2024-06-07

Wet Corn Milling
type: BicsLevel7Segment
type: Classifier
type: NamedIndividual
is level7 segment of: Grain & Oilseed Milling
is contemporary version of: http://data.ga-group.nl/ics/bics/12101010141016
is version of: http://data.ga-group.nl/ics/bics/12101010141016
replaces: http://data.ga-group.nl/ics/bics/2020/12101010141016
imported on: 2026-06-08T13:40:52.236Z
last refreshed on: 2026-06-08T13:41:38.450Z
source accessed on: 2024-06-05T14:42:36Z
source last accessed on: 2024-06-05T14:42:36Z
label: Macin mais bagnato @it
label: Maisverarbeitung @de
label: Moagem de pasta de milho @pt
label: Molin maíz mojado @es
label: Mouture humide maïs @fr
label: Влажный помол кукурузы @ru
label: 玉米湿磨 @zh
label: 玉米濕式輾磨 @zh-hant
label: 옥수수가루 제조업 @ko
label: ﾄｳﾓﾛｺｼ粉 @ja
definition: This segment includes companies that mill wet corn into corn flour.
notation: 12101010141016
valid from: 2024-06-07

Grain & Oilseed Milling
type: BicsLevel6Segment
type: Classifier
type: NamedIndividual
is level6 segment of: Food Crop Processing
is contemporary version of: http://data.ga-group.nl/ics/bics/121010101410
is version of: http://data.ga-group.nl/ics/bics/121010101410
replaces: http://data.ga-group.nl/ics/bics/2020/121010101410
imported on: 2026-06-08T13:40:52.236Z
last refreshed on: 2026-06-08T13:41:38.450Z
source accessed on: 2024-06-05T14:42:36Z
source last accessed on: 2024-06-05T14:42:36Z
label: Macinatura di grano e semi oleosi @it
label: Moagem de oleaginosas e grãos @pt
label: Molienda de granos y de semillas oleaginosas @es
label: Mouture de céréales et de graines oléagineuses @fr
label: Mouture de céréales et de graines ol��agineuses @fr
label: Verarbeitung von Korn und Ölsaat @de
label: Очистка и товарная переработка зерна и масличных семян @ru
label: 穀物及油籽輾磨 @zh-hant
label: 穀物･油料種子加工 @ja
label: 谷物及油籽碾磨 @zh
label: 곡물 & 채유종자 제분 @ko
definition: This segment includes companies that grind various grains, and produce consumable oils from fruits and vegetables.
notation: 121010101410
valid from: 2024-06-07

Beet Sugar
type: BicsLevel7Segment
type: Classifier
type: NamedIndividual
is level7 segment of: Sugar
is contemporary version of: http://data.ga-group.nl/ics/bics/12101010141110
is version of: http://data.ga-group.nl/ics/bics/12101010141110
replaces: http://data.ga-group.nl/ics/bics/2020/12101010141110
imported on: 2026-06-08T13:40:52.236Z
last refreshed on: 2026-06-08T13:41:38.450Z
source accessed on: 2024-06-05T14:42:36Z
source last accessed on: 2024-06-05T14:42:36Z
label: Açúcar de beterraba @pt
label: Azúcar de remolacha @es
label: Barbabietole da zucchero @it
label: Rübenzucker @de
label: Sucre de betterave @fr
label: Сахарная свекла @ru
label: 甜菜糖 @zh
label: 점재당 @ko
label: ﾃﾝｻｲ糖 @ja
definition: This segment includes companies that produce beet sugar.
notation: 12101010141110
valid from: 2024-06-07

Cane Sugar Refining
type: BicsLevel7Segment
type: Classifier
type: NamedIndividual
is level7 segment of: Sugar
is contemporary version of: http://data.ga-group.nl/ics/bics/12101010141111
is version of: http://data.ga-group.nl/ics/bics/12101010141111
replaces: http://data.ga-group.nl/ics/bics/2020/12101010141111
imported on: 2026-06-08T13:40:52.236Z
last refreshed on: 2026-06-08T13:41:38.450Z
source accessed on: 2024-06-05T14:42:36Z
source last accessed on: 2024-06-05T14:42:36Z
label: Raffi. sucre canne @fr
label: Raffinaz canna zucch @it
label: Refinação da cana-de-açúcar @pt
label: Refinación de azúcar @es
label: Rohzuckerraffination @de
label: Переработка тростникового сахара @ru
label: 蔗糖提炼 @zh
label: 蔗糖精煉 @zh-hant
label: 사탕수수 정제업 @ko
label: ｻﾄｳｷﾋﾞ糖精製 @ja
definition: This segment includes companies that produce sugar products from purchased raw cane sugar.
notation: 12101010141111
valid from: 2024-06-07

Sugarcane Mills
type: BicsLevel7Segment
type: Classifier
type: NamedIndividual
is level7 segment of: Sugar
is contemporary version of: http://data.ga-group.nl/ics/bics/12101010141112
is version of: http://data.ga-group.nl/ics/bics/12101010141112
replaces: http://data.ga-group.nl/ics/bics/2020/12101010141112
imported on: 2026-06-08T13:40:52.236Z
last refreshed on: 2026-06-08T13:41:38.450Z
source accessed on: 2024-06-05T14:42:36Z
source last accessed on: 2024-06-05T14:42:36Z
label: Broyage canne sucre @fr
label: Fábricas de cana-de -açúcar @pt
label: Fabb canna zucchero @it
label: Mol caña de azúcar @es
label: Zuckerrohrverarbeitg @de
label: Заводы по обр. сах. тростника @ru
label: 甘蔗糖廠 @zh-hant
label: 蔗糖轧制机器 @zh
label: 사탕수수 제조업 @ko
label: ｻﾄｳｷﾋﾞ糖 @ja
definition: This segment includes companies that produce sugar manufactured by their own sugarcane mills, including brown sugar, white sugar, and molasses.
notation: 12101010141112
valid from: 2024-06-07

Sugar
type: BicsLevel6Segment
type: Classifier
type: NamedIndividual
is level6 segment of: Food Crop Processing
is contemporary version of: http://data.ga-group.nl/ics/bics/121010101411
is version of: http://data.ga-group.nl/ics/bics/121010101411
replaces: http://data.ga-group.nl/ics/bics/2020/121010101411
imported on: 2026-06-08T13:40:52.236Z
last refreshed on: 2026-06-08T13:41:38.450Z
source accessed on: 2024-06-05T14:42:36Z
source last accessed on: 2024-06-05T14:42:36Z
label: Açúcar @pt
label: Azúcar @es
label: Sucre @fr
label: Zucchero @it
label: Zucker @de
label: Сахар @ru
label: 砂糖 @ja
label: 糖 @zh
label: 설탕 @ko
definition: This segment includes companies that produce sugar in all forms.
notation: 121010101411
valid from: 2024-06-07

Cocoa Processing
type: BicsLevel7Segment
type: Classifier
type: NamedIndividual
is level7 segment of: Cocoa & Coffee Processing
is contemporary version of: http://data.ga-group.nl/ics/bics/12101010141210
is version of: http://data.ga-group.nl/ics/bics/12101010141210
imported on: 2026-06-08T13:40:52.236Z
last refreshed on: 2026-06-08T13:41:38.450Z
source accessed on: 2024-06-05T14:42:36Z
source last accessed on: 2024-06-05T14:42:36Z
label: Kakaoverarbeitung @de
label: Lavorazione del cacao @it
label: Procesamiento de cacao @es
label: Processamento de cacau @pt
label: Traitement du cacao @fr
label: Обработка какао @ru
label: 可可加工 @zh
label: 可可處理 @zh-hant
label: 코코아 가공 @ko
label: ｺｺｱ加工 @ja
definition: This segment includes companies that process cocoa beans or seeds.
notation: 12101010141210
valid from: 2024-06-07

Coffee Processing
type: BicsLevel7Segment
type: Classifier
type: NamedIndividual
is level7 segment of: Cocoa & Coffee Processing
is contemporary version of: http://data.ga-group.nl/ics/bics/12101010141211
is version of: http://data.ga-group.nl/ics/bics/12101010141211
imported on: 2026-06-08T13:40:52.236Z
last refreshed on: 2026-06-08T13:41:38.450Z
source accessed on: 2024-06-05T14:42:36Z
source last accessed on: 2024-06-05T14:42:36Z
label: Kaffeeverarbeitung @de
label: Lavorazione del caffè @it
label: Procesamiento de café @es
label: Processamento de café @pt
label: Traitement du café @fr
label: Обработка кофе @ru
label: 咖啡加工 @zh
label: 咖啡處理 @zh-hant
label: 커피 가공 @ko
label: ｺｰﾋｰ加工 @ja
definition: This segment includes companies that process coffee beans or seeds.
notation: 12101010141211
valid from: 2024-06-07

Cocoa & Coffee Processing
type: BicsLevel6Segment
type: Classifier
type: NamedIndividual
is level6 segment of: Food Crop Processing
is contemporary version of: http://data.ga-group.nl/ics/bics/121010101412
is version of: http://data.ga-group.nl/ics/bics/121010101412
imported on: 2026-06-08T13:40:52.236Z
last refreshed on: 2026-06-08T13:41:38.450Z
source accessed on: 2024-06-05T14:42:36Z
source last accessed on: 2024-06-05T14:42:36Z
label: Kakao- & Kaffeeverarbeitung @de
label: Lavorazione cacao e caffè @it
label: Procesamiento de cacao y café @es
label: Processamento de café e cacau @pt
label: Transformation du cacao et café @fr
label: Обработка какао и кофе @ru
label: 可可与咖啡加工 @zh
label: 可可及咖啡處理 @zh-hant
label: 코코아 & 커피 가공 @ko
label: ｺｺｱ&ｺｰﾋｰ加工 @ja
definition: This segment includes companies that process cocoa and coffee beans or seeds.
notation: 121010101412
valid from: 2024-06-07

Food Crop Processing
type: BicsLevel5Segment
type: Classifier
type: NamedIndividual
is level5 segment of: Agricultural Producers
is contemporary version of: http://data.ga-group.nl/ics/bics/1210101014
is version of: http://data.ga-group.nl/ics/bics/1210101014
replaces: http://data.ga-group.nl/ics/bics/2020/1210101014
imported on: 2026-06-08T13:40:52.236Z
last refreshed on: 2026-06-08T13:41:38.450Z
source accessed on: 2024-06-05T14:42:36Z
source last accessed on: 2024-06-05T14:42:36Z
label: Lavorazione delle colture alimentari @it
label: Procesamiento de cosechas de alimentos @es
label: Processamento de culturas alimentícias @pt
label: Traitement des récoltes alimentaires @fr
label: Verarbeitung von Nahrungspflanzen @de
label: Обработка пищевых культур @ru
label: 粮食作物加工 @zh
label: 糧食作物處理 @zh-hant
label: 食用作物加工 @ja
label: 식량작물 가공 @ko
definition: This segment includes companies that produce consumables from the processing of sugar, grains, seeds, fruits, vegetables, and other plants.
notation: 1210101014
valid from: 2024-06-07

Agricultural Producers
type: BicsLevel4SubIndustry
type: Classifier
type: NamedIndividual
is sub industry of: Food
is contemporary version of: http://data.ga-group.nl/ics/bics/12101010
is version of: http://data.ga-group.nl/ics/bics/12101010
replaces: http://data.ga-group.nl/ics/bics/2020/12101010
imported on: 2026-06-08T13:40:52.236Z
last refreshed on: 2026-06-08T13:41:38.450Z
source accessed on: 2024-06-05T14:42:36Z
source last accessed on: 2024-06-05T14:42:36Z
label: LaWi-Erzeuger @de
label: Producteurs agricoles @fr
label: Productores agrícolas @es
label: Produtores agrícolas @pt
label: Produttori agricoli @it
label: Сельскохоз. продукты @ru
label: 农产品生产商 @zh
label: 農業生產者 @zh-hant
label: 農産物 @ja
label: 농산물 생산자 @ko
definition: This industry subgroup includes companies that grow, raise or produce raw crop or animal ingredient for consumption. Typically, these companies do not market or package their products for retail sales but are suppliers to food manufacturing companies and other commercial customers. Excludes crops not utilized for food consumption purposes, such as ornamental plants, tobacco, cotton or rubber trees.
notation: 12101010
valid from: 2024-06-07

Baked Goods
type: BicsLevel6Segment
type: Classifier
type: NamedIndividual
is level6 segment of: Bakery Products
is contemporary version of: http://data.ga-group.nl/ics/bics/121010111010
is version of: http://data.ga-group.nl/ics/bics/121010111010
replaces: http://data.ga-group.nl/ics/bics/2020/121010111010
imported on: 2026-06-08T13:40:52.236Z
last refreshed on: 2026-06-08T13:41:38.450Z
source accessed on: 2024-06-05T14:42:36Z
source last accessed on: 2024-06-05T14:42:36Z
label: Backwaren @de
label: Podutos de pastelaria e doces @pt
label: Prodotti da forno @it
label: Productos de panadería @es
label: Produits de pâtisserie @fr
label: Хлебобулочные изделия @ru
label: 烘培製品 @zh-hant
label: 烘焙食品 @zh
label: 제빵제품 @ko
label: ﾍﾞｰｶﾘｰ製品 @ja
definition: This segment includes companies that produce fresh baked goods, such as bread, biscuits, croutons, doughnuts, pies and pastries.
notation: 121010111010
valid from: 2024-06-07

Frozen Cakes & Pastries
type: BicsLevel6Segment
type: Classifier
type: NamedIndividual
is level6 segment of: Bakery Products
is contemporary version of: http://data.ga-group.nl/ics/bics/121010111011
is version of: http://data.ga-group.nl/ics/bics/121010111011
replaces: http://data.ga-group.nl/ics/bics/2020/121010111011
imported on: 2026-06-08T13:40:52.236Z
last refreshed on: 2026-06-08T13:41:38.450Z
source accessed on: 2024-06-05T14:42:36Z
source last accessed on: 2024-06-05T14:42:36Z
label: Bolos congelados e doces @pt
label: Gâteaux et pâtisseries congelés @fr
label: Pasteles congelados y productos @es
label: Prod torte e paste surgelate @it
label: Tiefkühltorten & -backwaren @de
label: Замороженные торты и пирожные @ru
label: 冷冻蛋糕和甜点 @zh
label: 冷凍蛋糕及酥餅 @zh-hant
label: 冷凍ｹｰｷ･焼菓子 @ja
label: 냉동 케이크 및 페이스트리 @ko
definition: This segment includes companies that produce frozen baked goods.
notation: 121010111011
valid from: 2024-06-07

Bakery Products
type: BicsLevel5Segment
type: Classifier
type: NamedIndividual
is level5 segment of: Packaged Food
is contemporary version of: http://data.ga-group.nl/ics/bics/1210101110
is version of: http://data.ga-group.nl/ics/bics/1210101110
replaces: http://data.ga-group.nl/ics/bics/2020/1210101110
imported on: 2026-06-08T13:40:52.236Z
last refreshed on: 2026-06-08T13:41:38.450Z
source accessed on: 2024-06-05T14:42:36Z
source last accessed on: 2024-06-05T14:42:36Z
label: Backwaren @de
label: Prodotti da forno @it
label: Productos de repostería @es
label: Produits de boulangerie @fr
label: Produtos de panificadora @pt
label: Хлебобул. изделия @ru
label: 烘焙制品 @zh
label: 麵包及烘培製品 @zh-hant
label: 제빵 제품 @ko
label: ﾊﾟﾝ類製品 @ja
definition: This segment includes companies that provide baked grain products.
notation: 1210101110
valid from: 2024-06-07

Massas
type: BicsLevel6Segment
type: Classifier
type: NamedIndividual
is level6 segment of: Pasta, Noodles & Rice
is contemporary version of: http://data.ga-group.nl/ics/bics/121010111110
is version of: http://data.ga-group.nl/ics/bics/121010111110
replaces: http://data.ga-group.nl/ics/bics/2020/121010111110
imported on: 2026-06-08T13:40:52.236Z
last refreshed on: 2026-06-08T13:41:38.450Z
source accessed on: 2024-06-05T14:42:36Z
source last accessed on: 2024-06-05T14:42:36Z
label: Pâtes @fr
label: Pasta
label: Макароны @ru
label: 意大利面条 @zh
label: 義大利麵 @zh-hant
label: 파스타 @ko
label: ﾊﾟｽﾀ @ja
definition: This segment includes companies that produce pasta.
notation: 121010111110
valid from: 2024-06-07

Noodles
type: BicsLevel6Segment
type: Classifier
type: NamedIndividual
is level6 segment of: Pasta, Noodles & Rice
is contemporary version of: http://data.ga-group.nl/ics/bics/121010111111
is version of: http://data.ga-group.nl/ics/bics/121010111111
replaces: http://data.ga-group.nl/ics/bics/2020/121010111111
imported on: 2026-06-08T13:40:52.236Z
last refreshed on: 2026-06-08T13:41:38.450Z
source accessed on: 2024-06-05T14:42:36Z
source last accessed on: 2024-06-05T14:42:36Z
label: Fideos @es
label: Macarrão @pt
label: Nouilles @fr
label: Nudeln @de
label: Pasta @it
label: Лапша @ru
label: 面条 @zh
label: 麵類 @zh-hant
label: 麺類 @ja
label: 면류 @ko
definition: This segment includes companies that manufacture instant noodles.
notation: 121010111111
valid from: 2024-06-07

Rice
type: BicsLevel6Segment
type: Classifier
type: NamedIndividual
is level6 segment of: Pasta, Noodles & Rice
is contemporary version of: http://data.ga-group.nl/ics/bics/121010111112
is version of: http://data.ga-group.nl/ics/bics/121010111112
replaces: http://data.ga-group.nl/ics/bics/2020/121010111112
imported on: 2026-06-08T13:40:52.236Z
last refreshed on: 2026-06-08T13:41:38.450Z
source accessed on: 2024-06-05T14:42:36Z
source last accessed on: 2024-06-05T14:42:36Z
label: Arroz @es
label: Reis @de
label: Riso @it
label: Riz @fr
label: Рис @ru
label: 大米 @zh
label: 米 @ja
label: 쌀 @ko
definition: This segment includes companies that package rice or produce flavored rice blends, pre-cooked rice products, or rice meals.
notation: 121010111112
valid from: 2024-06-07

Pasta, Noodles & Rice
type: BicsLevel5Segment
type: Classifier
type: NamedIndividual
is level5 segment of: Packaged Food
is contemporary version of: http://data.ga-group.nl/ics/bics/1210101111
is version of: http://data.ga-group.nl/ics/bics/1210101111
replaces: http://data.ga-group.nl/ics/bics/2020/1210101111
imported on: 2026-06-08T13:40:52.236Z
last refreshed on: 2026-06-08T13:41:38.450Z
source accessed on: 2024-06-05T14:42:36Z
source last accessed on: 2024-06-05T14:42:36Z
label: Massa, macarrão e arroz @pt
label: Pâtes, nouilles et riz @fr
label: Pasta, Nudeln & Reis @de
label: Pasta, fideos y arroz @es
label: Pasta, pasta lunga e riso @it
label: Макароны, рис @ru
label: 通心粉、面条和大米 @zh
label: 麵粉製品(非麵包） @zh-hant
label: 파스타, 면류 & 쌀 @ko
label: ﾊﾟｽﾀ･麺類･米 @ja
definition: This segment includes companies that produce pasta, noodles, rice, and other non-baked grain products.
notation: 1210101111
valid from: 2024-06-07

Sauces, Dressings & Condiments
type: BicsLevel5Segment
type: Classifier
type: NamedIndividual
is level5 segment of: Packaged Food
is contemporary version of: http://data.ga-group.nl/ics/bics/1210101112
is version of: http://data.ga-group.nl/ics/bics/1210101112
replaces: http://data.ga-group.nl/ics/bics/2020/1210101112
imported on: 2026-06-08T13:40:52.236Z
last refreshed on: 2026-06-08T13:41:38.450Z
source accessed on: 2024-06-05T14:42:36Z
source last accessed on: 2024-06-05T14:42:36Z
label: Molhos, temperos e condimentos @pt
label: Salsas, aderezos y condimentos @es
label: Salse e condimenti @it
label: Sauces, assaisonn., condiments @fr
label: Soßen, Dressings & Gewürze @de
label: Соусы и приправы @ru
label: 調味品 @zh-hant
label: 酱汁、调味汁和调味料 @zh
label: 소스, 드레싱 & 조미료 @ko
label: ｿｰｽ･ﾄﾞﾚｯｼﾝｸﾞ･調味料 @ja
definition: This segment includes companies that manufacture sauces, dressing, condiments, and other complex mixtures used as a flavor additive.
notation: 1210101112
valid from: 2024-06-07

Beurre
type: BicsLevel6Segment
type: Classifier
type: NamedIndividual
is level6 segment of: Dairy Products
is contemporary version of: http://data.ga-group.nl/ics/bics/121010111310
is version of: http://data.ga-group.nl/ics/bics/121010111310
replaces: http://data.ga-group.nl/ics/bics/2020/121010111310
imported on: 2026-06-08T13:40:52.236Z
last refreshed on: 2026-06-08T13:41:38.450Z
source accessed on: 2024-06-05T14:42:36Z
source last accessed on: 2024-06-05T14:42:36Z
label: Burro @it
label: Butter
label: Manteiga @pt
label: Mantequilla @es
label: Сливочное масло @ru
label: 奶油 @zh-hant
label: 黄油 @zh
label: 버터 @ko
label: ﾊﾞﾀｰ @ja
definition: This segment includes companies that produce butter. Excludes manufacturers of margarine (see Oils & Fats).
notation: 121010111310
valid from: 2024-06-07

Cheese
type: BicsLevel6Segment
type: Classifier
type: NamedIndividual
is level6 segment of: Dairy Products
is contemporary version of: http://data.ga-group.nl/ics/bics/121010111311
is version of: http://data.ga-group.nl/ics/bics/121010111311
replaces: http://data.ga-group.nl/ics/bics/2020/121010111311
imported on: 2026-06-08T13:40:52.236Z
last refreshed on: 2026-06-08T13:41:38.450Z
source accessed on: 2024-06-05T14:42:36Z
source last accessed on: 2024-06-05T14:42:36Z
label: Formaggio @it
label: Fromages @fr
label: Käse @de
label: Queijo @pt
label: Queso @es
label: Сыр @ru
label: 乳酪 @zh
label: 치즈 @ko
label: ﾁｰｽﾞ @ja
definition: This segment includes companies that produce all types of cheese.
notation: 121010111311
valid from: 2024-06-07

Dry & Condensed Dairy Products
type: BicsLevel6Segment
type: Classifier
type: NamedIndividual
is level6 segment of: Dairy Products
is contemporary version of: http://data.ga-group.nl/ics/bics/121010111312
is version of: http://data.ga-group.nl/ics/bics/121010111312
replaces: http://data.ga-group.nl/ics/bics/2020/121010111312
imported on: 2026-06-08T13:40:52.236Z
last refreshed on: 2026-06-08T13:41:38.450Z
source accessed on: 2024-06-05T14:42:36Z
source last accessed on: 2024-06-05T14:42:36Z
label: Latticini condensati e secchi @it
label: Productos de leche en polvo y condensada @es
label: Produits laitiers secs et condensés @fr
label: Produtos lácteos desidratados e condensados @pt
label: Trockene & kondensierte Milchprodukte @de
label: Сух. и сгущ. молочные продукты @ru
label: 乾燥、濃縮乳品 @zh-hant
label: 乾燥･濃縮乳製品 @ja
label: 干制、浓缩奶制品 @zh
label: 건조 & 농축 낙농제품 @ko
definition: This segment includes companies that produce dry and condensed dairy, such as powdered milk, canned milk products, and coffee creamers.
notation: 121010111312
valid from: 2024-06-07

Eggs
type: BicsLevel6Segment
type: Classifier
type: NamedIndividual
is level6 segment of: Dairy Products
is contemporary version of: http://data.ga-group.nl/ics/bics/121010111313
is version of: http://data.ga-group.nl/ics/bics/121010111313
replaces: http://data.ga-group.nl/ics/bics/2020/121010111313
imported on: 2026-06-08T13:40:52.236Z
last refreshed on: 2026-06-08T13:41:38.450Z
source accessed on: 2024-06-05T14:42:36Z
source last accessed on: 2024-06-05T14:42:36Z
label: Eier @de
label: Huevos @es
label: Oeufs @fr
label: Ovoso @pt
label: Uova @it
label: Яйца @ru
label: 蛋 @zh-hant
label: 蛋类 @zh
label: 養鶏･鶏卵 @ja
label: 계란집하업 @ko
definition: This segment includes companies that produce poultry eggs.
notation: 121010111313
valid from: 2024-06-07

Milk
type: BicsLevel6Segment
type: Classifier
type: NamedIndividual
is level6 segment of: Dairy Products
is contemporary version of: http://data.ga-group.nl/ics/bics/121010111314
is version of: http://data.ga-group.nl/ics/bics/121010111314
replaces: http://data.ga-group.nl/ics/bics/2020/121010111314
imported on: 2026-06-08T13:40:52.236Z
last refreshed on: 2026-06-08T13:41:38.450Z
source accessed on: 2024-06-05T14:42:36Z
source last accessed on: 2024-06-05T14:42:36Z
label: Lait @fr
label: Latte @it
label: Leche @es
label: Leite @pt
label: Milch @de
label: Молоко @ru
label: 液態乳品 @zh-hant
label: 牛乳 @ja
label: 牛奶 @zh
label: 우유 @ko
definition: This segment includes companies that produce milk. Excludes yogurt beverages, flavored milk beverages, non-dairy milk alternatives, and dry or condensed milk. (See Non-Alcoholic Beverages).
notation: 121010111314
valid from: 2024-06-07

Ice Cream
type: BicsLevel6Segment
type: Classifier
type: NamedIndividual
is level6 segment of: Dairy Products
is contemporary version of: http://data.ga-group.nl/ics/bics/121010111315
is version of: http://data.ga-group.nl/ics/bics/121010111315
replaces: http://data.ga-group.nl/ics/bics/2020/121010111315
imported on: 2026-06-08T13:40:52.236Z
last refreshed on: 2026-06-08T13:41:38.450Z
source accessed on: 2024-06-05T14:42:36Z
source last accessed on: 2024-06-05T14:42:36Z
label: Eiscreme @de
label: Gelato @it
label: Glaces @fr
label: Helados @es
label: Sorvete @pt
label: Мороженое @ru
label: 冰淇淋 @zh
label: 빙과류 @ko
label: ｱｲｽｸﾘｰﾑ @ja
definition: This segment includes companies that produce ice cream, sherbet, frozen yogurt, custard, and any other frozen desserts.
notation: 121010111315
valid from: 2024-06-07

Dairy Products
type: BicsLevel5Segment
type: Classifier
type: NamedIndividual
is level5 segment of: Packaged Food
is contemporary version of: http://data.ga-group.nl/ics/bics/1210101113
is version of: http://data.ga-group.nl/ics/bics/1210101113
replaces: http://data.ga-group.nl/ics/bics/2020/1210101113
imported on: 2026-06-08T13:40:52.236Z
last refreshed on: 2026-06-08T13:41:38.450Z
source accessed on: 2024-06-05T14:42:36Z
source last accessed on: 2024-06-05T14:42:36Z
label: Latticini @it
label: Milchprodukte @de
label: Productos lácteos @es
label: Produits laitiers @fr
label: Produtos lácteos @pt
label: Молочные продукты @ru
label: 乳制品 @zh
label: 乳品及蛋品 @zh-hant
label: 乳製品 @ja
label: 유제품 @ko
definition: This segment includes companies that process dairy based products. Also includes companies that produce poultry eggs.
notation: 1210101113
valid from: 2024-06-07

Flour Mixes & Dough
type: BicsLevel6Segment
type: Classifier
type: NamedIndividual
is level6 segment of: Food Ingredients
is contemporary version of: http://data.ga-group.nl/ics/bics/121010111410
is version of: http://data.ga-group.nl/ics/bics/121010111410
replaces: http://data.ga-group.nl/ics/bics/2020/121010111410
imported on: 2026-06-08T13:40:52.236Z
last refreshed on: 2026-06-08T13:41:38.450Z
source accessed on: 2024-06-05T14:42:36Z
source last accessed on: 2024-06-05T14:42:36Z
label: Farina miscelata e Pasta @it
label: Massas e misturas de farinhas @pt
label: Mehlmischungen & Teig @de
label: Mezclas de harina y masa @es
label: Pâtes et mélanges à base de farine @fr
label: Мучные смеси и тесто @ru
label: 混合麵粉及麵糰業 @zh-hant
label: 面粉混合物与面团 @zh
label: 혼합 밀가루 & 반죽 @ko
label: ﾐｯｸｽ粉･ﾊﾟﾝ生地 @ja
definition: This segment includes companies that produce flour mixes and dough.
notation: 121010111410
valid from: 2024-06-07

Syrup, Sugar & Sweeteners
type: BicsLevel6Segment
type: Classifier
type: NamedIndividual
is level6 segment of: Food Ingredients
is contemporary version of: http://data.ga-group.nl/ics/bics/121010111411
is version of: http://data.ga-group.nl/ics/bics/121010111411
replaces: http://data.ga-group.nl/ics/bics/2020/121010111411
imported on: 2026-06-08T13:40:52.236Z
last refreshed on: 2026-06-08T13:41:38.450Z
source accessed on: 2024-06-05T14:42:36Z
source last accessed on: 2024-06-05T14:42:36Z
label: Jarabes, azúcar y endulzantes @es
label: Sciroppi, zucchero e dolcific @it
label: Sirops, sucre et édulcorants @fr
label: Sirup, Zucker & Süßstoff @de
label: Xarope, açúcar e adoçantes @pt
label: Сироп, сахар и подсласт. @ru
label: 糖浆、糖与甜味剂 @zh
label: 調味糖漿及濃縮汁 @zh-hant
label: 시럽, 설탕 & 감미료 @ko
label: ｼﾛｯﾌﾟ･砂糖･甘味料 @ja
definition: This segment includes companies that produce natural or artificial sweeteners in solid or syrup form.
notation: 121010111411
valid from: 2024-06-07

Spices, Extracts & Flavorings
type: BicsLevel6Segment
type: Classifier
type: NamedIndividual
is level6 segment of: Food Ingredients
is contemporary version of: http://data.ga-group.nl/ics/bics/121010111412
is version of: http://data.ga-group.nl/ics/bics/121010111412
replaces: http://data.ga-group.nl/ics/bics/2020/121010111412
imported on: 2026-06-08T13:40:52.236Z
last refreshed on: 2026-06-08T13:41:38.450Z
source accessed on: 2024-06-05T14:42:36Z
source last accessed on: 2024-06-05T14:42:36Z
label: Epices, extraits, aromatisants @fr
label: Especias, extractos y aromatizantes @es
label: Gewürze, Extrakte & Aromastoffe @de
label: Spezie, estratti e aromi @it
label: Temperos, extratos e aromatizantes @pt
label: Специи, экстракты @ru
label: 香料與香精 @zh-hant
label: 香辛料、提取物和调味品 @zh
label: 香辛料･ｴｷｽ調味料･香味料 @ja
label: 향신료, 추출 & 향신료 @ko
definition: This segment includes companies that produce spices, salt, or liquid flavor extracts.
notation: 121010111412
valid from: 2024-06-07

Oils & Fats
type: BicsLevel6Segment
type: Classifier
type: NamedIndividual
is level6 segment of: Food Ingredients
is contemporary version of: http://data.ga-group.nl/ics/bics/121010111413
is version of: http://data.ga-group.nl/ics/bics/121010111413
replaces: http://data.ga-group.nl/ics/bics/2020/121010111413
imported on: 2026-06-08T13:40:52.236Z
last refreshed on: 2026-06-08T13:41:38.450Z
source accessed on: 2024-06-05T14:42:36Z
source last accessed on: 2024-06-05T14:42:36Z
label: Aceites y grasas @es
label: Huiles/graisses @fr
label: Oli e grassi @it
label: Óleos e gorduras @pt
label: Öle & Fette @de
label: Масла и жиры @ru
label: 油脂 @ja
label: 油脂产品 @zh
label: 유지 & 지방 @ko
definition: This segment includes companies that produce solid or liquid cooking oils, fats, and margarine.
notation: 121010111413
valid from: 2024-06-07

Food Ingredients
type: BicsLevel5Segment
type: Classifier
type: NamedIndividual
is level5 segment of: Packaged Food
is contemporary version of: http://data.ga-group.nl/ics/bics/1210101114
is version of: http://data.ga-group.nl/ics/bics/1210101114
replaces: http://data.ga-group.nl/ics/bics/2020/1210101114
imported on: 2026-06-08T13:40:52.236Z
last refreshed on: 2026-06-08T13:41:38.450Z
source accessed on: 2024-06-05T14:42:36Z
source last accessed on: 2024-06-05T14:42:36Z
label: Ingrédients alimentaires @fr
label: Ingredientes de alimentos @es
label: Ingredientes para alimentos @pt
label: Ingredienti alimentari @it
label: Lebensmittelzutaten @de
label: Пищевые ингредиенты @ru
label: 食品原料 @zh-hant
label: 食品成分 @ja
label: 食品配料 @zh
label: 식품성분 @ko
definition: This segment includes companies that manufacture and produce basic, natural, or artificial consumer facing food ingredients. Excludes additives primarily used by food processing companies (see Food Additives).
notation: 1210101114
valid from: 2024-06-07

Fruit & Vegetable Canning
type: BicsLevel7Segment
type: Classifier
type: NamedIndividual
is level7 segment of: Canned Food
is contemporary version of: http://data.ga-group.nl/ics/bics/12101011151010
is version of: http://data.ga-group.nl/ics/bics/12101011151010
replaces: http://data.ga-group.nl/ics/bics/2020/12101011151010
imported on: 2026-06-08T13:40:52.236Z
last refreshed on: 2026-06-08T13:41:38.450Z
source accessed on: 2024-06-05T14:42:36Z
source last accessed on: 2024-06-05T14:42:36Z
label: Enlatado de fruta y verduras @es
label: Enlatados de vegetais e frutas @pt
label: Früchte- & Gemüsekonservierung @de
label: Inscatolamento frutta e verdura @it
label: Mise en conserve de fruits et légumes @fr
label: Консервирование фруктов и овощей @ru
label: 果物･野菜缶詰 @ja
label: 水果及蔬菜罐装 @zh
label: 蔬果罐裝 @zh-hant
label: 과일 & 채소 통조림 @ko
definition: This segment includes companies that can fruit and vegetable products.
notation: 12101011151010
valid from: 2024-06-07

Specialty Canning
type: BicsLevel7Segment
type: Classifier
type: NamedIndividual
is level7 segment of: Canned Food
is contemporary version of: http://data.ga-group.nl/ics/bics/12101011151011
is version of: http://data.ga-group.nl/ics/bics/12101011151011
replaces: http://data.ga-group.nl/ics/bics/2020/12101011151011
imported on: 2026-06-08T13:40:52.236Z
last refreshed on: 2026-06-08T13:41:38.450Z
source accessed on: 2024-06-05T14:42:36Z
source last accessed on: 2024-06-05T14:42:36Z
label: Conservas de especialidades @pt
label: Conserve spécialités @fr
label: Enlatado especial @es
label: Inscat spec aliment @it
label: Spezialkonservierung @de
label: Консервирование деликатесов @ru
label: 特殊罐装 @zh
label: 特殊食品罐裝 @zh-hant
label: 特殊食品���裝 @zh-hant
label: 調理缶詰 @ja
label: 특수식품통조림제조 @ko
definition: This segment includes companies that can complex food products such as soups and meal dishes.
notation: 12101011151011
valid from: 2024-06-07

Canned Food
type: BicsLevel6Segment
type: Classifier
type: NamedIndividual
is level6 segment of: Frozen, Canned & Perish Food
is contemporary version of: http://data.ga-group.nl/ics/bics/121010111510
is version of: http://data.ga-group.nl/ics/bics/121010111510
replaces: http://data.ga-group.nl/ics/bics/2020/121010111510
imported on: 2026-06-08T13:40:52.236Z
last refreshed on: 2026-06-08T13:41:38.450Z
source accessed on: 2024-06-05T14:42:36Z
source last accessed on: 2024-06-05T14:42:36Z
label: Alimentos enlatados @es
label: Aliments en boîte @fr
label: Cibo in scatola @it
label: Konserven @de
label: Консервы @ru
label: 缶詰食品 @ja
label: 罐装食品 @zh
label: 罐裝食品業 @zh-hant
label: 통조림식품 @ko
definition: This segment includes companies that can fruits, vegetables, and soups. Excludes canned seafood (see Seafood Canning).
notation: 121010111510
valid from: 2024-06-07

Dried & Dehydrated Food
type: BicsLevel6Segment
type: Classifier
type: NamedIndividual
is level6 segment of: Frozen, Canned & Perish Food
is contemporary version of: http://data.ga-group.nl/ics/bics/121010111511
is version of: http://data.ga-group.nl/ics/bics/121010111511
replaces: http://data.ga-group.nl/ics/bics/2020/121010111511
imported on: 2026-06-08T13:40:52.236Z
last refreshed on: 2026-06-08T13:41:38.450Z
source accessed on: 2024-06-05T14:42:36Z
source last accessed on: 2024-06-05T14:42:36Z
label: Alim secos y deshidratados @es
label: Alimenti secchi e disidratati @it
label: Alimentos secos e desidratados @pt
label: Aliments séchés et déshydratés @fr
label: Getrocknete & Trockennahrung @de
label: Сушен. прод. питания @ru
label: 乾燥及脫水食品 @zh-hant
label: 乾燥野菜 @ja
label: 干燥及脱水食品 @zh
label: 건조 & 탈수식품 @ko
definition: This segment includes companies that produce dried fruit and vegetable products, such as dried figs, dates, apricots, raisins, and prunes.
notation: 121010111511
valid from: 2024-06-07

Frozen Fruit & Vegetable
type: BicsLevel7Segment
type: Classifier
type: NamedIndividual
is level7 segment of: Frozen Food
is contemporary version of: http://data.ga-group.nl/ics/bics/12101011151210
is version of: http://data.ga-group.nl/ics/bics/12101011151210
replaces: http://data.ga-group.nl/ics/bics/2020/12101011151210
imported on: 2026-06-08T13:40:52.236Z
last refreshed on: 2026-06-08T13:41:38.450Z
source accessed on: 2024-06-05T14:42:36Z
source last accessed on: 2024-06-05T14:42:36Z
label: Fruits et légumes congelés @fr
label: Frutas e vegetais congelados @pt
label: Frutas y verduras congeladas @es
label: Frutta e verdure surgelate @it
label: Gefrorenen Früchte & Gemüse @de
label: Заморож. фрукты/овощи @ru
label: Заморож. фрукты/о��ощи @ru
label: 冷冻水果及蔬菜 @zh
label: 冷凍果実･野菜 @ja
label: 冷凍水果/果汁/蔬菜 @zh-hant
label: 냉동 과일 & 채소 @ko
definition: This segment includes companies that produce frozen fruits, vegetables, or concentrated juices.
notation: 12101011151210
valid from: 2024-06-07

Frozen Specialty Food
type: BicsLevel7Segment
type: Classifier
type: NamedIndividual
is level7 segment of: Frozen Food
is contemporary version of: http://data.ga-group.nl/ics/bics/12101011151211
is version of: http://data.ga-group.nl/ics/bics/12101011151211
replaces: http://data.ga-group.nl/ics/bics/2020/12101011151211
imported on: 2026-06-08T13:40:52.236Z
last refreshed on: 2026-06-08T13:41:38.450Z
source accessed on: 2024-06-05T14:42:36Z
source last accessed on: 2024-06-05T14:42:36Z
label: Aalimentos especializados congelados @pt
label: Alimentos congelados especiales @es
label: Gefrorene Delikatessen @de
label: Spécialités culinaires congelées @fr
label: Specialità alimentari surgelate @it
label: Замороженные деликатесные изделия @ru
label: 冷冻特色食品 @zh
label: 特殊冷凍食品 @zh-hant
label: 調理冷凍食品 @ja
label: 냉동 특수식품 @ko
definition: This segment includes companies that produce other frozen specialty foods, such as dinners, noodles, and microwave dishes.
notation: 12101011151211
valid from: 2024-06-07

Frozen Food
type: BicsLevel6Segment
type: Classifier
type: NamedIndividual
is level6 segment of: Frozen, Canned & Perish Food
is contemporary version of: http://data.ga-group.nl/ics/bics/121010111512
is version of: http://data.ga-group.nl/ics/bics/121010111512
replaces: http://data.ga-group.nl/ics/bics/2020/121010111512
imported on: 2026-06-08T13:40:52.236Z
last refreshed on: 2026-06-08T13:41:38.450Z
source accessed on: 2024-06-05T14:42:36Z
source last accessed on: 2024-06-05T14:42:36Z
label: Alimentari surgelate @it
label: Alimentos congelados @es
label: Aliments congelés @fr
label: Comida congelada @pt
label: Gefrierkost @de
label: Замороженные продукты питания @ru
label: 冷冻食品 @zh
label: 冷凍食品 @ja
label: 냉동식품 @ko
definition: This segment includes companies that produce frozen, packaged food products.
notation: 121010111512
valid from: 2024-06-07

Perishable Prepared Food
type: BicsLevel6Segment
type: Classifier
type: NamedIndividual
is level6 segment of: Frozen, Canned & Perish Food
is contemporary version of: http://data.ga-group.nl/ics/bics/121010111513
is version of: http://data.ga-group.nl/ics/bics/121010111513
replaces: http://data.ga-group.nl/ics/bics/2020/121010111513
imported on: 2026-06-08T13:40:52.236Z
last refreshed on: 2026-06-08T13:41:38.450Z
source accessed on: 2024-06-05T14:42:36Z
source last accessed on: 2024-06-05T14:42:36Z
label: Alimenti deperibili preparati @it
label: Alimento fresco consumo inmediato @es
label: Alimentos perecíveis @pt
label: Aliments préparés périssables @fr
label: Leicht verderbliche LM @de
label: Готовые скоропортящиеся пищевые продукты @ru
label: 新鮮調理食品 @zh-hant
label: 易腐调制食品 @zh
label: 調理済み生鮮食品 @ja
label: 무방부제 가공식품 @ko
definition: This segment includes companies that prepare and package perishable foods, primarily pre-made meals. This does not include companies that produce frozen or microwave meals.
notation: 121010111513
valid from: 2024-06-07

Fresh & Frozen Seafood Process
type: BicsLevel7Segment
type: Classifier
type: NamedIndividual
is level7 segment of: Seafood Products Prep & Pkg
is contemporary version of: http://data.ga-group.nl/ics/bics/12101011151410
is version of: http://data.ga-group.nl/ics/bics/12101011151410
replaces: http://data.ga-group.nl/ics/bics/2020/12101011151410
imported on: 2026-06-08T13:40:52.236Z
last refreshed on: 2026-06-08T13:41:38.450Z
source accessed on: 2024-06-05T14:42:36Z
source last accessed on: 2024-06-05T14:42:36Z
label: Elaboración de mariscos frescos y congelados @es
label: Lav frutti mare freschi e surgelati @it
label: Processamento de frutos do mar frescos e congelados @pt
label: Trait fruits de mer frais/congelés @fr
label: Verarbeitung von frischen & gefrorenen Meeresfrüchten @de
label: Переработка свежих и заморож. морепродуктов @ru
label: 新鮮及冷凍海產處理 @zh-hant
label: 新鲜及冷冻海鲜加工 @zh
label: 海鮮品･冷凍水産品加工 @ja
label: 신선 & 냉동수산물 가공업 @ko
definition: This segment includes companies that prepare and package fresh and frozen seafood products.
notation: 12101011151410
valid from: 2024-06-07

Seafood Canning
type: BicsLevel7Segment
type: Classifier
type: NamedIndividual
is level7 segment of: Seafood Products Prep & Pkg
is contemporary version of: http://data.ga-group.nl/ics/bics/12101011151411
is version of: http://data.ga-group.nl/ics/bics/12101011151411
replaces: http://data.ga-group.nl/ics/bics/2020/12101011151411
imported on: 2026-06-08T13:40:52.236Z
last refreshed on: 2026-06-08T13:41:38.450Z
source accessed on: 2024-06-05T14:42:36Z
source last accessed on: 2024-06-05T14:42:36Z
label: Condit fruits de mer @fr
label: Conservas de frutos do mar @pt
label: Enlatado mariscos @es
label: Fischkonservierung @de
label: Inscatol frutti mare @it
label: Консервирование морепродуктов @ru
label: 水産品缶詰 @ja
label: 海產罐裝 @zh-hant
label: 海鲜罐装 @zh
label: 수산물통조림제조 @ko
definition: This segment includes companies that can purchased seafood products but are not involved in fishing or fish farming.
notation: 12101011151411
valid from: 2024-06-07

Seafood Products Prep & Pkg
type: BicsLevel6Segment
type: Classifier
type: NamedIndividual
is level6 segment of: Frozen, Canned & Perish Food
is contemporary version of: http://data.ga-group.nl/ics/bics/121010111514
is version of: http://data.ga-group.nl/ics/bics/121010111514
replaces: http://data.ga-group.nl/ics/bics/2020/121010111514
imported on: 2026-06-08T13:40:52.236Z
last refreshed on: 2026-06-08T13:41:38.450Z
source accessed on: 2024-06-05T14:42:36Z
source last accessed on: 2024-06-05T14:42:36Z
label: Emb e prep produtos de frutos do mar @pt
label: Préparation et emball fruits de mer @fr
label: Prep e conf frutti di mare @it
label: Preparación y empaquetado de productos de mariscos @es
label: Vorbereitung & Verpackung von Meeresfrüchten @de
label: Приготовл. и упаковка морепродуктов @ru
label: 水産品加工･包装 @ja
label: 海產調理及包裝 @zh-hant
label: 海鲜产品调理与包装 @zh
label: 해산물제품 가공 & 포장 @ko
definition: This segment includes companies that prepare and package seafood, including fish and shellfish.
notation: 121010111514
valid from: 2024-06-07

Frozen, Canned & Perish Food
type: BicsLevel5Segment
type: Classifier
type: NamedIndividual
is level5 segment of: Packaged Food
is contemporary version of: http://data.ga-group.nl/ics/bics/1210101115
is version of: http://data.ga-group.nl/ics/bics/1210101115
replaces: http://data.ga-group.nl/ics/bics/2020/1210101115
imported on: 2026-06-08T13:40:52.236Z
last refreshed on: 2026-06-08T13:41:38.450Z
source accessed on: 2024-06-05T14:42:36Z
source last accessed on: 2024-06-05T14:42:36Z
label: Alimentari surgelati, in scatola e deperibili @it
label: Alimentos congelados, enlatados y perecederos @es
label: Alimentos perecíveis, enlatados e congelados @pt
label: Aliments congelés, en boîte et périssables @fr
label: Gefrorene, konservierte & verderbliche LM @de
label: Замороженные, консерв. и скоропортящ. продукты питания @ru
label: 冷冻、罐装及易腐食品 @zh
label: 冷凍、罐裝及生鮮產品 @zh-hant
label: 冷凍･缶詰･生鮮食品 @ja
label: 냉동, 통조림 & 무방부제 식품 @ko
definition: This segment includes companies that specialize in manufacturing preserved foods by canning, drying, or freezing. Also includes companies that manufacture pre-prepared perishable meals.
notation: 1210101115
valid from: 2024-06-07

Cured & Smoked Meat
type: BicsLevel6Segment
type: Classifier
type: NamedIndividual
is level6 segment of: Meat Products
is contemporary version of: http://data.ga-group.nl/ics/bics/121010111610
is version of: http://data.ga-group.nl/ics/bics/121010111610
replaces: http://data.ga-group.nl/ics/bics/2020/121010111610
imported on: 2026-06-08T13:40:52.236Z
last refreshed on: 2026-06-08T13:41:38.450Z
source accessed on: 2024-06-05T14:42:36Z
source last accessed on: 2024-06-05T14:42:36Z
label: Carne curada ahumada @es
label: Carne lavorata affum @it
label: Carnes curadas e defumadas @pt
label: Sülze & geräuchertes Fleisch @de
label: Viande salée et fumée @fr
label: Консервированное и копченое мясо @ru
label: 塩漬･燻製肉 @ja
label: 腌制及熏制肉品 @zh
label: 醃漬及煙燻肉品 @zh-hant
label: 염지 & 훈제육 @ko
definition: This segment includes companies that process cured and smoked meat, typically for use in sandwiches. Such meats include bacon, bologna, hams, pastrami and canned meats.
notation: 121010111610
valid from: 2024-06-07

Fresh Meat Products
type: BicsLevel6Segment
type: Classifier
type: NamedIndividual
is level6 segment of: Meat Products
is contemporary version of: http://data.ga-group.nl/ics/bics/121010111611
is version of: http://data.ga-group.nl/ics/bics/121010111611
replaces: http://data.ga-group.nl/ics/bics/2020/121010111611
imported on: 2026-06-08T13:40:52.236Z
last refreshed on: 2026-06-08T13:41:38.450Z
source accessed on: 2024-06-05T14:42:36Z
source last accessed on: 2024-06-05T14:42:36Z
label: Frischfleischprodukte @de
label: Prodotti carne fresca @it
label: Productos de carne fresca @es
label: Produits à base de viande fraîche @fr
label: Produtos carne fresca @pt
label: Продукты из свежего мяса @ru
label: 生鮮肉品 @zh-hant
label: 生鮮肉製品 @ja
label: 生鲜肉制品 @zh
label: 신선 육류제품 @ko
definition: This segment includes companies that produce and package fresh meat.
notation: 121010111611
valid from: 2024-06-07

Poultry Products
type: BicsLevel6Segment
type: Classifier
type: NamedIndividual
is level6 segment of: Meat Products
is contemporary version of: http://data.ga-group.nl/ics/bics/121010111612
is version of: http://data.ga-group.nl/ics/bics/121010111612
replaces: http://data.ga-group.nl/ics/bics/2020/121010111612
imported on: 2026-06-08T13:40:52.236Z
last refreshed on: 2026-06-08T13:41:38.450Z
source accessed on: 2024-06-05T14:42:36Z
source last accessed on: 2024-06-05T14:42:36Z
label: Geflügelprodukte @de
label: Prodotti avicoli @it
label: Productos de aves @es
label: Produits de volaille @fr
label: Produtos de frango @pt
label: Продукц. птицеводства @ru
label: 禽类产品 @zh
label: 雞肉類產品 @zh-hant
label: 鶏肉製品 @ja
label: 가금류 제품 @ko
definition: This segment includes companies that produce fresh or packaged chicken meat products. Includes chicken nuggets, sauced chicken wings, cordon bleu, chicken kebabs and chicken patties.
notation: 121010111612
valid from: 2024-06-07

Meat Products
type: BicsLevel5Segment
type: Classifier
type: NamedIndividual
is level5 segment of: Packaged Food
is contemporary version of: http://data.ga-group.nl/ics/bics/1210101116
is version of: http://data.ga-group.nl/ics/bics/1210101116
replaces: http://data.ga-group.nl/ics/bics/2020/1210101116
imported on: 2026-06-08T13:40:52.236Z
last refreshed on: 2026-06-08T13:41:38.450Z
source accessed on: 2024-06-05T14:42:36Z
source last accessed on: 2024-06-05T14:42:36Z
label: Fleischprodukte @de
label: Prodotti a base carne @it
label: Productos de carne @es
label: Produits à base de viande @fr
label: Produtos de carne @pt
label: Мясные прод. @ru
label: 肉制品 @zh
label: 肉類產品 @zh-hant
label: 食肉製品 @ja
label: 육류제품 @ko
definition: This segment includes companies that produce packaged meat products.
notation: 1210101116
valid from: 2024-06-07

Pet Food
type: BicsLevel5Segment
type: Classifier
type: NamedIndividual
is level5 segment of: Packaged Food
is contemporary version of: http://data.ga-group.nl/ics/bics/1210101117
is version of: http://data.ga-group.nl/ics/bics/1210101117
replaces: http://data.ga-group.nl/ics/bics/2020/1210101117
imported on: 2026-06-08T13:40:52.236Z
last refreshed on: 2026-06-08T13:41:38.450Z
source accessed on: 2024-06-05T14:42:36Z
source last accessed on: 2024-06-05T14:42:36Z
label: Alimentos para animais de estimação @pt
label: Alimentos para mascotas @es
label: Cibo per animali domestici @it
label: Heimtierfutter @de
label: Nourriture pour animaux @fr
label: Корм для животных @ru
label: 宠物食品 @zh
label: 寵物食品 @zh-hant
label: 애완동물식품 @ko
label: ﾍﾟｯﾄﾌｰﾄﾞ @ja
definition: This segment includes companies that produce food consumed by household pets.
notation: 1210101117
valid from: 2024-06-07

Chocolate Confectionery
type: BicsLevel7Segment
type: Classifier
type: NamedIndividual
is level7 segment of: Confectionery
is contemporary version of: http://data.ga-group.nl/ics/bics/12101011181010
is version of: http://data.ga-group.nl/ics/bics/12101011181010
replaces: http://data.ga-group.nl/ics/bics/2020/12101011181010
imported on: 2026-06-08T13:40:52.236Z
last refreshed on: 2026-06-08T13:41:38.450Z
source accessed on: 2024-06-05T14:42:36Z
source last accessed on: 2024-06-05T14:42:36Z
label: Confiseries en chocolat @fr
label: Confitería de chocolate @es
label: Doces de chocolate @pt
label: Pasticceria al cioccolato @it
label: Schokoladenkonfekt @de
label: Шоколадные изделия @ru
label: 巧克力及糖果 @zh-hant
label: 巧克力糖果 @zh
label: 초콜릿과자 @ko
label: ﾁｮｺﾚｰﾄ菓子 @ja
definition: This segment includes companies that produce confectionery products, such as candy and other desserts, that are primarily made of chocolate.
notation: 12101011181010
valid from: 2024-06-07

Sugar & Other Confectionery
type: BicsLevel7Segment
type: Classifier
type: NamedIndividual
is level7 segment of: Confectionery
is contemporary version of: http://data.ga-group.nl/ics/bics/12101011181011
is version of: http://data.ga-group.nl/ics/bics/12101011181011
replaces: http://data.ga-group.nl/ics/bics/2020/12101011181011
imported on: 2026-06-08T13:40:52.236Z
last refreshed on: 2026-06-08T13:41:38.450Z
source accessed on: 2024-06-05T14:42:36Z
source last accessed on: 2024-06-05T14:42:36Z
label: Açúcar e outras confeitarias @pt
label: Azúcar y otra confitería @es
label: Sucre et autres confiseries @fr
label: Zucchero e altri prodotti dolciari @it
label: Zucker & Süßwaren @de
label: Сахар и прочие кондитерские изделия @ru
label: 砂糖･その他菓子類 @ja
label: 糖及其它糖果 @zh-hant
label: 糖和其他糖果 @zh
label: 설탕 & 기타 제과 @ko
definition: This segment includes companies that produce confectionery products, such as candy and other desserts, that are not primarily made of chocolate.
notation: 12101011181011
valid from: 2024-06-07

Confectionery
type: BicsLevel6Segment
type: Classifier
type: NamedIndividual
is level6 segment of: Snack Food & Confectionery
is contemporary version of: http://data.ga-group.nl/ics/bics/121010111810
is version of: http://data.ga-group.nl/ics/bics/121010111810
replaces: http://data.ga-group.nl/ics/bics/2020/121010111810
imported on: 2026-06-08T13:40:52.236Z
last refreshed on: 2026-06-08T13:41:38.450Z
source accessed on: 2024-06-05T14:42:36Z
source last accessed on: 2024-06-05T14:42:36Z
label: Bolos e doces @pt
label: Confiseries @fr
label: Confitería @es
label: Dolciumi @it
label: Süßwaren @de
label: Кондитерские изделия @ru
label: 糖果 @zh
label: 菓子 @ja
label: 제과 @ko
definition: This segment includes companies that produce confectionery products.
notation: 121010111810
valid from: 2024-06-07

Breakfast Cereal
type: BicsLevel7Segment
type: Classifier
type: NamedIndividual
is level7 segment of: Snack Food
is contemporary version of: http://data.ga-group.nl/ics/bics/12101011181110
is version of: http://data.ga-group.nl/ics/bics/12101011181110
replaces: http://data.ga-group.nl/ics/bics/2020/12101011181110
imported on: 2026-06-08T13:40:52.236Z
last refreshed on: 2026-06-08T13:41:38.450Z
source accessed on: 2024-06-05T14:42:36Z
source last accessed on: 2024-06-05T14:42:36Z
label: Céréales pour le petit déjeuner @fr
label: Cereal de café da manhã @pt
label: Cereales para el desayuno @es
label: Cereali prima colazione @it
label: Frühstückszerealien @de
label: Зерновые прдкт 'для завтрака' @ru
label: 早餐穀類食品 @zh-hant
label: 早餐谷类食品 @zh
label: 朝食用ｼﾘｱﾙ @ja
label: 식사용시리얼 @ko
definition: This segment includes companies that produce breakfast cereals, such as granola, oatmeal, and corn-based cereals.
notation: 12101011181110
valid from: 2024-06-07

Cookies & Crackers
type: BicsLevel7Segment
type: Classifier
type: NamedIndividual
is level7 segment of: Snack Food
is contemporary version of: http://data.ga-group.nl/ics/bics/12101011181111
is version of: http://data.ga-group.nl/ics/bics/12101011181111
replaces: http://data.ga-group.nl/ics/bics/2020/12101011181111
imported on: 2026-06-08T13:40:52.236Z
last refreshed on: 2026-06-08T13:41:38.450Z
source accessed on: 2024-06-05T14:42:36Z
source last accessed on: 2024-06-05T14:42:36Z
label: Biscoitos e bolachas @pt
label: Biscotti e cracker @it
label: Biscuits et crackers @fr
label: Galletas dulces y saladas @es
label: Gebäck & Cracker @de
label: Печенье и крекеры @ru
label: 曲奇与饼干 @zh
label: 餅乾 @zh-hant
label: 쿠키 & 크래커 @ko
label: ｸｯｷｰ･ｸﾗｯｶｰ @ja
definition: This segment includes companies that produce cookies and crackers.
notation: 12101011181111
valid from: 2024-06-07

Roast Nuts & Peanut Butter
type: BicsLevel7Segment
type: Classifier
type: NamedIndividual
is level7 segment of: Snack Food
is contemporary version of: http://data.ga-group.nl/ics/bics/12101011181112
is version of: http://data.ga-group.nl/ics/bics/12101011181112
replaces: http://data.ga-group.nl/ics/bics/2020/12101011181112
imported on: 2026-06-08T13:40:52.236Z
last refreshed on: 2026-06-08T13:41:38.450Z
source accessed on: 2024-06-05T14:42:36Z
source last accessed on: 2024-06-05T14:42:36Z
label: Amendoim torrado e pasta de amendoim @pt
label: Geröstete Nüsse & Erdnussbutter @de
label: Noci tostate e burro di arachidi @it
label: Noix grillées et beurre de cacahuètes @fr
label: Nueces horneadas y crema de cacahuate @es
label: Жаренные орехи и арахисовое масло @ru
label: 烘烤坚果与花生酱 @zh
label: 烘烤核果及花生醬 @zh-hant
label: 구운 땅콩 & 땅콩버터 @ko
label: ﾛｰｽﾄﾅｯﾂ･ﾋﾟｰﾅｯﾂﾊﾞﾀｰ @ja
definition: This segment includes companies that roast and preserve nuts, nut foods, or pastes like peanut butter.
notation: 12101011181112
valid from: 2024-06-07

Snack Food
type: BicsLevel6Segment
type: Classifier
type: NamedIndividual
is level6 segment of: Snack Food & Confectionery
is contemporary version of: http://data.ga-group.nl/ics/bics/121010111811
is version of: http://data.ga-group.nl/ics/bics/121010111811
replaces: http://data.ga-group.nl/ics/bics/2020/121010111811
imported on: 2026-06-08T13:40:52.236Z
last refreshed on: 2026-06-08T13:41:38.450Z
source accessed on: 2024-06-05T14:42:36Z
source last accessed on: 2024-06-05T14:42:36Z
label: Alimentos livianos @es
label: Aliments à grignoter @fr
label: Petiscos @pt
label: Snackartikel @de
label: Stuzzichini @it
label: Снэки @ru
label: 休闲食品 @zh
label: 零食 @zh-hant
label: 스낵류 @ko
label: ｽﾅｯｸ食品 @ja
definition: This segment includes companies that manufacture snack foods.
notation: 121010111811
valid from: 2024-06-07

Snack Food & Confectionery
type: BicsLevel5Segment
type: Classifier
type: NamedIndividual
is level5 segment of: Packaged Food
is contemporary version of: http://data.ga-group.nl/ics/bics/1210101118
is version of: http://data.ga-group.nl/ics/bics/1210101118
replaces: http://data.ga-group.nl/ics/bics/2020/1210101118
imported on: 2026-06-08T13:40:52.236Z
last refreshed on: 2026-06-08T13:41:38.450Z
source accessed on: 2024-06-05T14:42:36Z
source last accessed on: 2024-06-05T14:42:36Z
label: Aliments à grignoter et confiseries @fr
label: Confeitaria e petiscos @pt
label: Refrigerios y confección @es
label: Snack e dolciumi @it
label: Snacks & Süßwaren @de
label: Снэки и кондитерские изделия @ru
label: 零食及糖果 @zh-hant
label: 零食和糖果 @zh
label: 스낵 & 제과 @ko
label: ｽﾅｯｸ食品･菓子 @ja
definition: This segment includes companies that produce snack foods and confectionery products.
notation: 1210101118
valid from: 2024-06-07

Nutritional Supplements
type: BicsLevel5Segment
type: Classifier
type: NamedIndividual
is level5 segment of: Packaged Food
is contemporary version of: http://data.ga-group.nl/ics/bics/1210101119
is version of: http://data.ga-group.nl/ics/bics/1210101119
replaces: http://data.ga-group.nl/ics/bics/2020/1210101119
imported on: 2026-06-08T13:40:52.236Z
last refreshed on: 2026-06-08T13:41:38.450Z
source accessed on: 2024-06-05T14:42:36Z
source last accessed on: 2024-06-05T14:42:36Z
label: Integratori nutrizionali @it
label: Nahrungsergänzungsmittel @de
label: Suplementos nutricionais @pt
label: Suplementos nutricionales @es
label: Suppléments nutritionnels @fr
label: Детское питание @ru
label: 栄養補助食品 @ja
label: 營養品 @zh-hant
label: 營���品 @zh-hant
label: 营养品 @zh
label: 영양 보조제 @ko
definition: This segment includes companies that produce food or shakes that focus on adding nutritional value for dietary health or fitness. Includes protein shakes, baby formulas, sports nutrition, and other meal replacement shakes. Excludes vitamins, dietary minerals, and amino acids (see Consumer Healthcare Products)
notation: 1210101119
valid from: 2024-06-07

Dairy Alternatives
type: BicsLevel6Segment
type: Classifier
type: NamedIndividual
is level6 segment of: Protein, Dairy & Other Food Alt
is contemporary version of: http://data.ga-group.nl/ics/bics/121010112010
is version of: http://data.ga-group.nl/ics/bics/121010112010
imported on: 2026-06-08T13:40:52.236Z
last refreshed on: 2026-06-08T13:41:38.450Z
source accessed on: 2024-06-05T14:42:36Z
source last accessed on: 2024-06-05T14:42:36Z
label: Alternativas a productos lácteos @es
label: Alternativas aos laticínios @pt
label: Alternative casearie @it
label: Milchalternativen @de
label: Substituts de produits laitiers @fr
label: Альтернатива молочным продуктам @ru
label: 乳制品替代品 @zh
label: 乳製品代替食品 @ja
label: 乳製品替代品 @zh-hant
label: 유제품 대체제 @ko
definition: This segment includes companies that produce milk and traditionally milk based products made from something other than dairy. Dairy alternatives are commonly sourced from oats, nuts and vegetables.
notation: 121010112010
valid from: 2024-06-07

Protein Alternatives
type: BicsLevel6Segment
type: Classifier
type: NamedIndividual
is level6 segment of: Protein, Dairy & Other Food Alt
is contemporary version of: http://data.ga-group.nl/ics/bics/121010112011
is version of: http://data.ga-group.nl/ics/bics/121010112011
imported on: 2026-06-08T13:40:52.236Z
last refreshed on: 2026-06-08T13:41:38.450Z
source accessed on: 2024-06-05T14:42:36Z
source last accessed on: 2024-06-05T14:42:36Z
label: Alternativas à proteína @pt
label: Alternativas a proteínas @es
label: Alternative proteiche @it
label: Proteinalternativen @de
label: Substituts de protéines @fr
label: Альтернативные белки @ru
label: 蛋白質替代品 @zh-hant
label: 蛋白质替代品 @zh
label: 단백질 대체제 @ko
label: ﾀﾝﾊﾟｸ質代替食品 @ja
definition: This segment includes companies that produce alternative protein foods such as plant based meat analogs and lab-grown meat. Excludes long standing meat alternatives such as tofu.
notation: 121010112011
valid from: 2024-06-07

Protein, Dairy & Other Food Alt
type: BicsLevel5Segment
type: Classifier
type: NamedIndividual
is level5 segment of: Packaged Food
is contemporary version of: http://data.ga-group.nl/ics/bics/1210101120
is version of: http://data.ga-group.nl/ics/bics/1210101120
imported on: 2026-06-08T13:40:52.236Z
last refreshed on: 2026-06-08T13:41:38.450Z
source accessed on: 2024-06-05T14:42:36Z
source last accessed on: 2024-06-05T14:42:36Z
label: Alt proteínas, lácteos y otros alim @es
label: Proteína, laticínios e outras alternativas alimentares @pt
label: Protein-, Milch- & sonstige LM-Alternativen @de
label: Proteine, latticini e altri alimenti alt @it
label: Substituts de protéines, lait et autres alim @fr
label: Альтернативы белкам, молочным продуктам и другие продукты питания @ru
label: 蛋白質、乳製品及其它食品替代品 @zh-hant
label: 蛋白质、乳制品及其他食品替代品 @zh
label: 단백질, 유제품 & 기타 식품 대체제 @ko
label: ﾀﾝﾊﾟｸ質､乳製品&その他代替食品 @ja
definition: This segment includes companies that produce alternatives to traditional protein, dairy and other packaged food products.
notation: 1210101120
valid from: 2024-06-07

Packaged Food
type: BicsLevel4SubIndustry
type: Classifier
type: NamedIndividual
is sub industry of: Food
is contemporary version of: http://data.ga-group.nl/ics/bics/12101011
is version of: http://data.ga-group.nl/ics/bics/12101011
replaces: http://data.ga-group.nl/ics/bics/2020/12101011
imported on: 2026-06-08T13:40:52.236Z
last refreshed on: 2026-06-08T13:41:38.450Z
source accessed on: 2024-06-05T14:42:36Z
source last accessed on: 2024-06-05T14:42:36Z
label: Alimentos embalados @pt
label: Alimentos envasados @es
label: Aliments emballés @fr
label: Cibi confezionati @it
label: Verpackte Lebensmittel @de
label: Фасованные пищевые продукты @ru
label: 加工食品 @ja
label: 包装食品 @zh
label: 包裝食品製造業 @zh-hant
label: 포장 식품 @ko
definition: This industry subgroup includes companies that process and package finished food products. Typically, these products are marketed for retail consumers, carry a brand name, and can be found on food retailer's shelves. Also includes packaged pet foods.
notation: 12101011
valid from: 2024-06-07

Food
type: BicsLevel3Industry
type: Classifier
type: NamedIndividual
is industry of: Consumer Staple Products
is contemporary version of: http://data.ga-group.nl/ics/bics/121010
is version of: http://data.ga-group.nl/ics/bics/121010
replaces: http://data.ga-group.nl/ics/bics/2020/121010
imported on: 2026-06-08T13:40:52.236Z
last refreshed on: 2026-06-08T13:41:38.450Z
source accessed on: 2024-06-05T14:42:36Z
source last accessed on: 2024-06-05T14:42:36Z
label: Alim @pt
label: Alimentari @it
label: Alimentos @es
label: Aliments @fr
label: Lebensmittel @de
label: Пр. питания @ru
label: 食品 @ja
label: 식품 @ko
definition: This industry includes companies that grow, produce, or manufacture food.
notation: 121010
valid from: 2024-06-07

Brewers
type: BicsLevel5Segment
type: Classifier
type: NamedIndividual
is level5 segment of: Alcoholic Beverages
is contemporary version of: http://data.ga-group.nl/ics/bics/1210111010
is version of: http://data.ga-group.nl/ics/bics/1210111010
replaces: http://data.ga-group.nl/ics/bics/2020/1210111010
imported on: 2026-06-08T13:40:52.236Z
last refreshed on: 2026-06-08T13:41:38.450Z
source accessed on: 2024-06-05T14:42:36Z
source last accessed on: 2024-06-05T14:42:36Z
label: Brasseries @fr
label: Brauer @de
label: Cerveceros @es
label: Cervejarias @pt
label: Fabbriche di birra @it
label: Пивоварни @ru
label: 啤酒厂 @zh
label: 釀酒商 @zh-hant
label: 양조업 @ko
label: ﾋﾞｰﾙ @ja
definition: This segment includes companies that produce beer, malt liquor, and non-alcoholic beer.
notation: 1210111010
valid from: 2024-06-07

Distillers
type: BicsLevel5Segment
type: Classifier
type: NamedIndividual
is level5 segment of: Alcoholic Beverages
is contemporary version of: http://data.ga-group.nl/ics/bics/1210111011
is version of: http://data.ga-group.nl/ics/bics/1210111011
replaces: http://data.ga-group.nl/ics/bics/2020/1210111011
imported on: 2026-06-08T13:40:52.236Z
last refreshed on: 2026-06-08T13:41:38.450Z
source accessed on: 2024-06-05T14:42:36Z
source last accessed on: 2024-06-05T14:42:36Z
label: Alambique @pt
label: Brenner @de
label: Destiladores @es
label: Distillerie @it
label: Distilleries @fr
label: Спиртоводочные заводы @ru
label: 蒸留酒 @ja
label: 蒸餾酒 @zh-hant
label: 酿酒厂 @zh
label: 증류주 제조업 @ko
definition: This segment includes companies that produce distilled, potable, alcoholic beverages like bourbon, scotch, and gin.
notation: 1210111011
valid from: 2024-06-07

Vintners
type: BicsLevel5Segment
type: Classifier
type: NamedIndividual
is level5 segment of: Alcoholic Beverages
is contemporary version of: http://data.ga-group.nl/ics/bics/1210111012
is version of: http://data.ga-group.nl/ics/bics/1210111012
replaces: http://data.ga-group.nl/ics/bics/2020/1210111012
imported on: 2026-06-08T13:40:52.236Z
last refreshed on: 2026-06-08T13:41:38.450Z
source accessed on: 2024-06-05T14:42:36Z
source last accessed on: 2024-06-05T14:42:36Z
label: Négociants en vin @fr
label: Vinificatori @it
label: Viticultores @es
label: Winzer @de
label: Винные заводы @ru
label: 葡萄酒商 @zh
label: 葡萄酒業 @zh-hant
label: 양조업 @ko
label: ﾜｲﾝ @ja
definition: This segment includes companies that produce wine, brandies, and other fruit-based alcoholic drinks.
notation: 1210111012
valid from: 2024-06-07

Alcoholic Beverages
type: BicsLevel4SubIndustry
type: Classifier
type: NamedIndividual
is sub industry of: Beverages
is contemporary version of: http://data.ga-group.nl/ics/bics/12101110
is version of: http://data.ga-group.nl/ics/bics/12101110
replaces: http://data.ga-group.nl/ics/bics/2020/12101110
imported on: 2026-06-08T13:40:52.236Z
last refreshed on: 2026-06-08T13:41:38.450Z
source accessed on: 2024-06-05T14:42:36Z
source last accessed on: 2024-06-05T14:42:36Z
label: Alkoholische Getränke @de
label: Bebidas alcoólicas @pt
label: Bebidas alcohólicas @es
label: Bevande alcoliche @it
label: Boissons alcoolisées @fr
label: Алкогольные напитки @ru
label: 含酒精饮料 @zh
label: 酒精飲料 @zh-hant
label: 알콜음료 @ko
label: ｱﾙｺｰﾙ飲料 @ja
definition: This industry subgroup includes companies that brew beer, manufacture wine and brandies, and distill and mix liquors.
notation: 12101110
valid from: 2024-06-07

Coffee
type: BicsLevel5Segment
type: Classifier
type: NamedIndividual
is level5 segment of: Non-Alcoholic Beverages
is contemporary version of: http://data.ga-group.nl/ics/bics/1210111110
is version of: http://data.ga-group.nl/ics/bics/1210111110
replaces: http://data.ga-group.nl/ics/bics/2020/1210111110
imported on: 2026-06-08T13:40:52.236Z
last refreshed on: 2026-06-08T13:41:38.450Z
source accessed on: 2024-06-05T14:42:36Z
source last accessed on: 2024-06-05T14:42:36Z
label: Café @es
label: Caffè @it
label: Kaffee @de
label: Кофе @ru
label: 咖啡 @zh
label: 커피 @ko
label: ｺｰﾋｰ @ja
definition: This segment includes companies that manufacture bottled coffee beverages or roasted coffee beans.
notation: 1210111110
valid from: 2024-06-07

Tea
type: BicsLevel5Segment
type: Classifier
type: NamedIndividual
is level5 segment of: Non-Alcoholic Beverages
is contemporary version of: http://data.ga-group.nl/ics/bics/1210111111
is version of: http://data.ga-group.nl/ics/bics/1210111111
replaces: http://data.ga-group.nl/ics/bics/2020/1210111111
imported on: 2026-06-08T13:40:52.236Z
last refreshed on: 2026-06-08T13:41:38.450Z
source accessed on: 2024-06-05T14:42:36Z
source last accessed on: 2024-06-05T14:42:36Z
label: Chá @pt
label: Tè @it
label: Té @es
label: Tee @de
label: Thé @fr
label: Чай @ru
label: 茶 @ja
label: 차류 @ko
definition: This segment includes companies that manufacture bottled tea beverages, bagged teas, boxed teas, and loose-leaf teas.
notation: 1210111111
valid from: 2024-06-07

Bottled Water
type: BicsLevel5Segment
type: Classifier
type: NamedIndividual
is level5 segment of: Non-Alcoholic Beverages
is contemporary version of: http://data.ga-group.nl/ics/bics/1210111112
is version of: http://data.ga-group.nl/ics/bics/1210111112
replaces: http://data.ga-group.nl/ics/bics/2020/1210111112
imported on: 2026-06-08T13:40:52.236Z
last refreshed on: 2026-06-08T13:41:38.450Z
source accessed on: 2024-06-05T14:42:36Z
source last accessed on: 2024-06-05T14:42:36Z
label: Acqua imbottigliata @it
label: Agua embotellada @es
label: Eau en bouteille @fr
label: Tafelwasser @de
label: Água engarrafada @pt
label: Вода в бутылках @ru
label: 瓶装水 @zh
label: 罐裝水 @zh-hant
label: 생수 @ko
label: ﾎﾞﾄﾙ飲料水 @ja
definition: This segment includes companies that manufacture bottled water.
notation: 1210111112
valid from: 2024-06-07

Carbonated Soft Drinks
type: BicsLevel5Segment
type: Classifier
type: NamedIndividual
is level5 segment of: Non-Alcoholic Beverages
is contemporary version of: http://data.ga-group.nl/ics/bics/1210111113
is version of: http://data.ga-group.nl/ics/bics/1210111113
replaces: http://data.ga-group.nl/ics/bics/2020/1210111113
imported on: 2026-06-08T13:40:52.236Z
last refreshed on: 2026-06-08T13:41:38.450Z
source accessed on: 2024-06-05T14:42:36Z
source last accessed on: 2024-06-05T14:42:36Z
label: Bebidas carbonatadas @es
label: Bevande gassate @it
label: Boissons gazeuses @fr
label: Kohlensäurehaltige Softdrinks @de
label: Refrigerantes @pt
label: Газир. б/а напитки @ru
label: 炭酸飲料 @ja
label: 碳酸软饮料 @zh
label: 非酒類飲料 @zh-hant
label: 탄산 청량음료 @ko
definition: This segment includes companies that manufacture soft drinks.
notation: 1210111113
valid from: 2024-06-07

Fruit & Vegetable Juice
type: BicsLevel5Segment
type: Classifier
type: NamedIndividual
is level5 segment of: Non-Alcoholic Beverages
is contemporary version of: http://data.ga-group.nl/ics/bics/1210111114
is version of: http://data.ga-group.nl/ics/bics/1210111114
replaces: http://data.ga-group.nl/ics/bics/2020/1210111114
imported on: 2026-06-08T13:40:52.236Z
last refreshed on: 2026-06-08T13:41:38.450Z
source accessed on: 2024-06-05T14:42:36Z
source last accessed on: 2024-06-05T14:42:36Z
label: Jugos de frutas y verduras @es
label: Jus de fruits et légumes @fr
label: Obst- & Gemüsesaft @de
label: Succhi frutta e verdure @it
label: Suco de frutas e vegetais @pt
label: Фруктовые и овощные соки @ru
label: 果物･野菜ｼﾞｭｰｽ @ja
label: 水果蔬菜汁 @zh
label: 蔬果汁 @zh-hant
label: 과일 & 채소 주스 @ko
definition: This segment includes companies that manufacture fruit, vegetable, nut, and bean based beverages.
notation: 1210111114
valid from: 2024-06-07

Sports & Energy Drinks
type: BicsLevel5Segment
type: Classifier
type: NamedIndividual
is level5 segment of: Non-Alcoholic Beverages
is contemporary version of: http://data.ga-group.nl/ics/bics/1210111115
is version of: http://data.ga-group.nl/ics/bics/1210111115
replaces: http://data.ga-group.nl/ics/bics/2020/1210111115
imported on: 2026-06-08T13:40:52.236Z
last refreshed on: 2026-06-08T13:41:38.450Z
source accessed on: 2024-06-05T14:42:36Z
source last accessed on: 2024-06-05T14:42:36Z
label: Bebidas energéticas y para deportes @es
label: Bebidas esportivas e energéticos @pt
label: Bevande sportive ed energetiche @it
label: Boissons énergie/sportifs @fr
label: Sport- & Energiegetränke @de
label: Спорт. и энергет. напитки @ru
label: 运动与能量饮料 @zh
label: 運動及能量飲料 @zh-hant
label: 스포츠 & 에너지 음료 @ko
label: ｽﾎﾟｰﾂ･ｴﾈﾙｷﾞｰ飲料 @ja
definition: This segment includes companies that manufacture beverages that are marketed to restore energy or are marketed to provide hydration in sports applications.
notation: 1210111115
valid from: 2024-06-07

Non-Alcoholic Beverages
type: BicsLevel4SubIndustry
type: Classifier
type: NamedIndividual
is sub industry of: Beverages
is contemporary version of: http://data.ga-group.nl/ics/bics/12101111
is version of: http://data.ga-group.nl/ics/bics/12101111
replaces: http://data.ga-group.nl/ics/bics/2020/12101111
imported on: 2026-06-08T13:40:52.236Z
last refreshed on: 2026-06-08T13:41:38.450Z
source accessed on: 2024-06-05T14:42:36Z
source last accessed on: 2024-06-05T14:42:36Z
label: Alkoholfreie Getränke @de
label: Bebidas não alcoólicas @pt
label: Bebidas no alcohólicas @es
label: Bevande non alcoliche @it
label: Boissons non alcoolisées @fr
label: Напитки - безалкогольные @ru
label: 非酒精飲料 @zh-hant
label: 非酒精饮料 @zh
label: 무알콜 음료 @ko
label: ﾉﾝｱﾙｺｰﾙ飲料 @ja
definition: This industry subgroup includes companies that manufacture non-alcoholic beverages.
notation: 12101111
valid from: 2024-06-07

Beverages
type: BicsLevel3Industry
type: Classifier
type: NamedIndividual
is industry of: Consumer Staple Products
is contemporary version of: http://data.ga-group.nl/ics/bics/121011
is version of: http://data.ga-group.nl/ics/bics/121011
replaces: http://data.ga-group.nl/ics/bics/2020/121011
imported on: 2026-06-08T13:40:52.236Z
last refreshed on: 2026-06-08T13:41:38.450Z
source accessed on: 2024-06-05T14:42:36Z
source last accessed on: 2024-06-05T14:42:36Z
label: Bebidas @es
label: Bevande @it
label: Boissons @fr
label: Getränke @de
label: Напитки @ru
label: 飲料 @ja
label: 饮料 @zh
label: 음료 @ko
definition: This industry includes companies that manufacture alcoholic beverages, non-alcoholic beverages, coffees, and teas.
notation: 121011
valid from: 2024-06-07

Tobacco Farming
type: BicsLevel5Segment
type: Classifier
type: NamedIndividual
is level5 segment of: Tobacco
is contemporary version of: http://data.ga-group.nl/ics/bics/1210121010
is version of: http://data.ga-group.nl/ics/bics/1210121010
replaces: http://data.ga-group.nl/ics/bics/2020/1210121010
imported on: 2026-06-08T13:40:52.236Z
last refreshed on: 2026-06-08T13:41:38.450Z
source accessed on: 2024-06-05T14:42:36Z
source last accessed on: 2024-06-05T14:42:36Z
label: Anbau von Tabak @de
label: Coltivazione tabacco @it
label: Cultivo de tabaco @pt
label: Cultivo del tabaco @es
label: Culture du tabac @fr
label: Выращивание табака @ru
label: たばこ作農業 @ja
label: 烟叶种植 @zh
label: 菸草栽培 @zh-hant
label: 담배 재배업 @ko
definition: This segment includes companies that grow tobacco plants.
notation: 1210121010
valid from: 2024-06-07

Tobacco Leaf
type: BicsLevel5Segment
type: Classifier
type: NamedIndividual
is level5 segment of: Tobacco
is contemporary version of: http://data.ga-group.nl/ics/bics/1210121011
is version of: http://data.ga-group.nl/ics/bics/1210121011
replaces: http://data.ga-group.nl/ics/bics/2020/1210121011
imported on: 2026-06-08T13:40:52.236Z
last refreshed on: 2026-06-08T13:41:38.450Z
source accessed on: 2024-06-05T14:42:36Z
source last accessed on: 2024-06-05T14:42:36Z
label: Feuilles de tabac @fr
label: Folha de tabaco @pt
label: Hoja de tabaco @es
label: Tabacco fogl @it
label: Tabakblatt @de
label: Листья табака @ru
label: たばこ葉 @ja
label: 烟叶 @zh
label: 菸葉 @zh-hant
label: 담배 잎 @ko
definition: This segment includes companies that process tobacco leaf from which other companies produce finished tobacco products.
notation: 1210121011
valid from: 2024-06-07

Cigar
type: BicsLevel6Segment
type: Classifier
type: NamedIndividual
is level6 segment of: Tobacco Products
is contemporary version of: http://data.ga-group.nl/ics/bics/121012101210
is version of: http://data.ga-group.nl/ics/bics/121012101210
replaces: http://data.ga-group.nl/ics/bics/2020/121012101210
imported on: 2026-06-08T13:40:52.236Z
last refreshed on: 2026-06-08T13:41:38.450Z
source accessed on: 2024-06-05T14:42:36Z
source last accessed on: 2024-06-05T14:42:36Z
label: Cigares @fr
label: Prod charutos @pt
label: Puros @es
label: Sigari @it
label: Zigarren @de
label: Сигары @ru
label: 葉巻 @ja
label: 雪茄 @zh
label: 시가 @ko
definition: This segment includes companies that manufacture cigars.
notation: 121012101210
valid from: 2024-06-07

Cigarette
type: BicsLevel6Segment
type: Classifier
type: NamedIndividual
is level6 segment of: Tobacco Products
is contemporary version of: http://data.ga-group.nl/ics/bics/121012101211
is version of: http://data.ga-group.nl/ics/bics/121012101211
replaces: http://data.ga-group.nl/ics/bics/2020/121012101211
imported on: 2026-06-08T13:40:52.236Z
last refreshed on: 2026-06-08T13:41:38.450Z
source accessed on: 2024-06-05T14:42:36Z
source last accessed on: 2024-06-05T14:42:36Z
label: Cigarettes @fr
label: Cigarrillos @es
label: Cigarros @pt
label: Sigarette @it
label: Zigaretten @de
label: Сигареты @ru
label: 卷烟 @zh
label: 紙巻たばこ @ja
label: 香菸 @zh-hant
label: 담배 @ko
definition: This segment includes companies that manufacture cigarettes.
notation: 121012101211
valid from: 2024-06-07

Smokeless Tobacco
type: BicsLevel6Segment
type: Classifier
type: NamedIndividual
is level6 segment of: Tobacco Products
is contemporary version of: http://data.ga-group.nl/ics/bics/121012101212
is version of: http://data.ga-group.nl/ics/bics/121012101212
replaces: http://data.ga-group.nl/ics/bics/2020/121012101212
imported on: 2026-06-08T13:40:52.236Z
last refreshed on: 2026-06-08T13:41:38.450Z
source accessed on: 2024-06-05T14:42:36Z
source last accessed on: 2024-06-05T14:42:36Z
label: Kautabak @de
label: Tabac sans fumée @fr
label: Tabacco non da fumo @it
label: Tabaco sem fumaça @pt
label: Tabaco sin combustión @es
label: Бездымный табак @ru
label: 无烟烟草 @zh
label: 無煙菸草 @zh-hant
label: 無煙ﾀﾊﾞｺ @ja
label: 무연담배 @ko
definition: This segment includes companies that produce smokeless tobacco products or nicotine delivery products such as chewing tobacco, snuff, electronic cigarettes, or vaporizers.
notation: 121012101212
valid from: 2024-06-07

Tobacco Products
type: BicsLevel5Segment
type: Classifier
type: NamedIndividual
is level5 segment of: Tobacco
is contemporary version of: http://data.ga-group.nl/ics/bics/1210121012
is version of: http://data.ga-group.nl/ics/bics/1210121012
replaces: http://data.ga-group.nl/ics/bics/2020/1210121012
imported on: 2026-06-08T13:40:52.236Z
last refreshed on: 2026-06-08T13:41:38.450Z
source accessed on: 2024-06-05T14:42:36Z
source last accessed on: 2024-06-05T14:42:36Z
label: Prodotti del tabacco @it
label: Productos de tabaco @es
label: Produits du tabac @fr
label: Produtos de tabaco @pt
label: Tabakwaren @de
label: Табачные изделия @ru
label: たばこ製品 @ja
label: 烟草制品 @zh
label: 菸草品 @zh-hant
label: 담배제품 @ko
definition: This segment includes companies that produce finished consumer tobacco products as well related equipment or accessories.
notation: 1210121012
valid from: 2024-06-07

Tobacco
type: BicsLevel4SubIndustry
type: Classifier
type: NamedIndividual
is sub industry of: Tobacco & Cannabis
is contemporary version of: http://data.ga-group.nl/ics/bics/12101210
is version of: http://data.ga-group.nl/ics/bics/12101210
replaces: http://data.ga-group.nl/ics/bics/2020/12101210
imported on: 2026-06-08T13:40:52.236Z
last refreshed on: 2026-06-08T13:41:38.450Z
source accessed on: 2024-06-05T14:42:36Z
source last accessed on: 2024-06-05T14:42:36Z
label: Tabac @fr
label: Tabacco @it
label: Tabaco @es
label: Tabakwaren @de
label: Табак @ru
label: たばこ @ja
label: 烟草 @zh
label: 菸草 @zh-hant
label: 담배 @ko
definition: This industry subgroup includes companies that process tobacco leaf and/or produce finished tobacco products.
notation: 12101210
valid from: 2024-06-07

Cannabis
type: BicsLevel4SubIndustry
type: Classifier
type: NamedIndividual
is sub industry of: Tobacco & Cannabis
is contemporary version of: http://data.ga-group.nl/ics/bics/12101211
is version of: http://data.ga-group.nl/ics/bics/12101211
replaces: http://data.ga-group.nl/ics/bics/2020/12101211
imported on: 2026-06-08T13:40:52.236Z
last refreshed on: 2026-06-08T13:41:38.450Z
source accessed on: 2024-06-05T14:42:36Z
source last accessed on: 2024-06-05T14:42:36Z
label: Конопля @ru
label: カンナビス @ja
label: 大麻 @zh
label: 대마초 @ko
definition: This industry subgroup includes companies involved in growing, manufacturing, wholesaling, or retailing cannabis products used for recreational or medicinal purposes. Excludes companies indirectly involved in the supply chain such as consultants or equipment manufacturers.
notation: 12101211
valid from: 2024-06-07

Tobacco & Cannabis
type: BicsLevel3Industry
type: Classifier
type: NamedIndividual
is industry of: Consumer Staple Products
is contemporary version of: http://data.ga-group.nl/ics/bics/121012
is version of: http://data.ga-group.nl/ics/bics/121012
replaces: http://data.ga-group.nl/ics/bics/2020/121012
imported on: 2026-06-08T13:40:52.236Z
last refreshed on: 2026-06-08T13:41:38.450Z
source accessed on: 2024-06-05T14:42:36Z
source last accessed on: 2024-06-05T14:42:36Z
label: Tabac et cannabis @fr
label: Tabacco e cannabis @it
label: Tabaco e canábis @pt
label: Tabaco y cannabis @es
label: Tabak & Cannabis @de
label: Табак и конопля @ru
label: たばこ・カンナビス @ja
label: 烟草与大麻 @zh
label: 菸草及大麻 @zh-hant
label: 담배 & 대마초 @ko
definition: This industry includes companies involved in the creation of tobacco or cannabis products.
notation: 121012
valid from: 2024-06-07

Electric Lamp Bulb & Parts
type: BicsLevel5Segment
type: Classifier
type: NamedIndividual
is level5 segment of: Home Products
is contemporary version of: http://data.ga-group.nl/ics/bics/1210131010
is version of: http://data.ga-group.nl/ics/bics/1210131010
replaces: http://data.ga-group.nl/ics/bics/2020/1210131010
imported on: 2026-06-08T13:40:52.236Z
last refreshed on: 2026-06-08T13:41:38.450Z
source accessed on: 2024-06-05T14:42:36Z
source last accessed on: 2024-06-05T14:42:36Z
label: Ampoule électriques et pièces @fr
label: Elektr. Lampen, Birnen & Teile @de
label: Focos y partes para lámparas @es
label: Lâmpadas e peças elétricas @pt
label: Lampadine elettriche e parti @it
label: Лампочки и з/части @ru
label: 电灯泡及零件 @zh
label: 電燈泡及其零件 @zh-hant
label: 電球･部品 @ja
label: 전기램프 전구 & 부품 @ko
definition: This segment includes companies that manufacture electric lamp bulbs and associated parts.
notation: 1210131010
valid from: 2024-06-07

Home Cleaning & Detergents
type: BicsLevel5Segment
type: Classifier
type: NamedIndividual
is level5 segment of: Home Products
is contemporary version of: http://data.ga-group.nl/ics/bics/1210131011
is version of: http://data.ga-group.nl/ics/bics/1210131011
replaces: http://data.ga-group.nl/ics/bics/2020/1210131011
imported on: 2026-06-08T13:40:52.236Z
last refreshed on: 2026-06-08T13:41:38.450Z
source accessed on: 2024-06-05T14:42:36Z
source last accessed on: 2024-06-05T14:42:36Z
label: Haushaltsreiniger & Waschmittel @de
label: Limpeza de casa e detergentes @pt
label: Limpieza y detergentes domésticos @es
label: Produits d'entretien ménager @fr
label: Pulizia casa e detergenti @it
label: Чист. и моющие средства @ru
label: 家居清洁和洗涤剂 @zh
label: 家庭清潔用品 @zh-hant
label: 家庭用洗剤 @ja
label: 가정용 청소 & 세제 @ko
definition: This segment includes companies that manufacture household cleaning products, such as ammonia, bleaches, degreasers, disinfectants, polishes, fabric softeners, laundry detergent, dish soap, and bathroom cleaners.
notation: 1210131011
valid from: 2024-06-07

Household Batteries
type: BicsLevel5Segment
type: Classifier
type: NamedIndividual
is level5 segment of: Home Products
is contemporary version of: http://data.ga-group.nl/ics/bics/1210131012
is version of: http://data.ga-group.nl/ics/bics/1210131012
replaces: http://data.ga-group.nl/ics/bics/2020/1210131012
imported on: 2026-06-08T13:40:52.236Z
last refreshed on: 2026-06-08T13:41:38.450Z
source accessed on: 2024-06-05T14:42:36Z
source last accessed on: 2024-06-05T14:42:36Z
label: Baterías domésticas @es
label: Bateria doméstica @pt
label: Batterie uso domestico @it
label: Haushaltsbatterien @de
label: Piles à usage domestique @fr
label: Бытовые батареи @ru
label: 家庭用電池 @ja
label: 家用电池 @zh
label: 家用電池 @zh-hant
label: 가정용 전지 @ko
definition: This segment includes companies that manufacture disposable and rechargeable household batteries. Includes alkaline batteries, lithium batteries, watch batteries, and dry cell primary batteries (AAA, AA, C, D, 9V).
notation: 1210131012
valid from: 2024-06-07

Home Products
type: BicsLevel4SubIndustry
type: Classifier
type: NamedIndividual
is sub industry of: Household Products
is contemporary version of: http://data.ga-group.nl/ics/bics/12101310
is version of: http://data.ga-group.nl/ics/bics/12101310
replaces: http://data.ga-group.nl/ics/bics/2020/12101310
imported on: 2026-06-08T13:40:52.236Z
last refreshed on: 2026-06-08T13:41:38.450Z
source accessed on: 2024-06-05T14:42:36Z
source last accessed on: 2024-06-05T14:42:36Z
label: Prodotti per la casa @it
label: Productos para el hogar @es
label: Produits pour la maison @fr
label: Produkte fürs Haus @de
label: Produtos para o lar @pt
label: Товары для дома @ru
label: 家居產品 @zh-hant
label: 家庭用品 @ja
label: 가정용품 @ko
definition: This industry subgroup includes companies that manufacture products that consumers typically need to maintain or operate their house.
notation: 12101310
valid from: 2024-06-07

Cosmetics
type: BicsLevel5Segment
type: Classifier
type: NamedIndividual
is level5 segment of: Personal Care Products
is contemporary version of: http://data.ga-group.nl/ics/bics/1210131110
is version of: http://data.ga-group.nl/ics/bics/1210131110
replaces: http://data.ga-group.nl/ics/bics/2020/1210131110
imported on: 2026-06-08T13:40:52.236Z
last refreshed on: 2026-06-08T13:41:38.450Z
source accessed on: 2024-06-05T14:42:36Z
source last accessed on: 2024-06-05T14:42:36Z
label: Cosméticos @es
label: Cosmétiques @fr
label: Cosmetici @it
label: Kosmetika @de
label: Косметика @ru
label: 化妆品 @zh
label: 化妝品 @zh-hant
label: 化粧品 @ja
label: 화장품 @ko
definition: This segment includes companies that manufacture cosmetics.
notation: 1210131110
valid from: 2024-06-07

Razor & Razor Blade
type: BicsLevel5Segment
type: Classifier
type: NamedIndividual
is level5 segment of: Personal Care Products
is contemporary version of: http://data.ga-group.nl/ics/bics/1210131111
is version of: http://data.ga-group.nl/ics/bics/1210131111
replaces: http://data.ga-group.nl/ics/bics/2020/1210131111
imported on: 2026-06-08T13:40:52.236Z
last refreshed on: 2026-06-08T13:41:38.450Z
source accessed on: 2024-06-05T14:42:36Z
source last accessed on: 2024-06-05T14:42:36Z
label: Navalha e lâminas @pt
label: Rasierer & Rasierklingen @de
label: Rasoi e lame da rasoio @it
label: Rasoirs et lames de rasoir @fr
label: Rastrillos y hojas de rasurar @es
label: Бритвы и бритвенные лезвия @ru
label: かみそり･かみそり刃 @ja
label: 刮胡刀及刀片 @zh
label: 刮鬍器及刮鬍刀 @zh-hant
label: 면도기 & 면도칼 @ko
definition: This segment includes companies that manufacture manual and electric razors and razor blades.
notation: 1210131111
valid from: 2024-06-07

Sanitary Paper Products
type: BicsLevel5Segment
type: Classifier
type: NamedIndividual
is level5 segment of: Personal Care Products
is contemporary version of: http://data.ga-group.nl/ics/bics/1210131112
is version of: http://data.ga-group.nl/ics/bics/1210131112
replaces: http://data.ga-group.nl/ics/bics/2020/1210131112
imported on: 2026-06-08T13:40:52.236Z
last refreshed on: 2026-06-08T13:41:38.450Z
source accessed on: 2024-06-05T14:42:36Z
source last accessed on: 2024-06-05T14:42:36Z
label: Hygienepapierprodukte @de
label: Prodotti cartacei sanitari @it
label: Productos de papel sanitarios @es
label: Produits hygiéniques en papier @fr
label: Produtos de papel sanitário @pt
label: Санитарно-гигиен. изд. из бумаги @ru
label: 卫生纸制品 @zh
label: 紙製衛生用品 @ja
label: 衛生紙產品 @zh-hant
label: 위생용 종이제품 @ko
definition: This segment includes companies that manufacture sanitary paper-based products.
notation: 1210131112
valid from: 2024-06-07

Hand & Body Soap
type: BicsLevel5Segment
type: Classifier
type: NamedIndividual
is level5 segment of: Personal Care Products
is contemporary version of: http://data.ga-group.nl/ics/bics/1210131113
is version of: http://data.ga-group.nl/ics/bics/1210131113
replaces: http://data.ga-group.nl/ics/bics/2020/1210131113
imported on: 2026-06-08T13:40:52.236Z
last refreshed on: 2026-06-08T13:41:38.450Z
source accessed on: 2024-06-05T14:42:36Z
source last accessed on: 2024-06-05T14:42:36Z
label: Hand- & Körperseife @de
label: Jabón @es
label: Sabão e sabonete @pt
label: Sapone mani e corpo @it
label: Savons pour mains et corps @fr
label: Мыло для тела/рук @ru
label: せっけん･ﾎﾞﾃﾞｨｰｿｰﾌﾟ @ja
label: 润肤香皂 @zh
label: 肥皂及其他清潔劑 @zh-hant
label: 핸드 & 바디 비누 @ko
definition: This segment includes companies that manufacture soaps that are applied directly to the body for hygienic purposes.
notation: 1210131113
valid from: 2024-06-07

Personal Care Products
type: BicsLevel4SubIndustry
type: Classifier
type: NamedIndividual
is sub industry of: Household Products
is contemporary version of: http://data.ga-group.nl/ics/bics/12101311
is version of: http://data.ga-group.nl/ics/bics/12101311
replaces: http://data.ga-group.nl/ics/bics/2020/12101311
imported on: 2026-06-08T13:40:52.236Z
last refreshed on: 2026-06-08T13:41:38.450Z
source accessed on: 2024-06-05T14:42:36Z
source last accessed on: 2024-06-05T14:42:36Z
label: Körperpflegeprodukte @de
label: Prodotti per la cura personale @it
label: Productos de higiene personal @es
label: Produits de soins personnels @fr
label: Produtos de cuidados pessoais @pt
label: Товары личной гигиены @ru
label: 个人护理产品 @zh
label: 個人保健用品 @zh-hant
label: 개인관리용품 @ko
label: ﾊﾟｰｿﾅﾙｹｱ用品 @ja
definition: This industry subgroup includes companies that manufacture personal hygiene products.
notation: 12101311
valid from: 2024-06-07

Household Products
type: BicsLevel3Industry
type: Classifier
type: NamedIndividual
is industry of: Consumer Staple Products
is contemporary version of: http://data.ga-group.nl/ics/bics/121013
is version of: http://data.ga-group.nl/ics/bics/121013
replaces: http://data.ga-group.nl/ics/bics/2020/121013
imported on: 2026-06-08T13:40:52.236Z
last refreshed on: 2026-06-08T13:41:38.450Z
source accessed on: 2024-06-05T14:42:36Z
source last accessed on: 2024-06-05T14:42:36Z
label: Haushaltsprodukte @de
label: Prodotti per la casa @it
label: Productos domésticos @es
label: Produits ménagers @fr
label: Produtos domésticos @pt
label: Бытовые товары @ru
label: 家庭用品 @ja
label: 家用产品 @zh
label: 가정용품 @ko
definition: This industry includes companies that manufacture products or supplies needed for basic household maintenance and operation.
notation: 121013
valid from: 2024-06-07

Consumer Staple Products
type: BicsLevel2IndustryGroup
type: Classifier
type: NamedIndividual
is industry group of: Consumer Staples
is contemporary version of: http://data.ga-group.nl/ics/bics/1210
is version of: http://data.ga-group.nl/ics/bics/1210
replaces: http://data.ga-group.nl/ics/bics/2020/1210
imported on: 2026-06-08T13:40:52.236Z
last refreshed on: 2026-06-08T13:41:38.450Z
source accessed on: 2024-06-05T14:42:36Z
source last accessed on: 2024-06-05T14:42:36Z
label: Basiskonsumgüter @de
label: Prodotti necessari al consumo @it
label: Productos de consumo básico @es
label: Produits de conso de base @fr
label: Produtos de consumo básico @pt
label: Основные товары @ru
label: 必需消费品 @zh
label: 消費者產品 @zh-hant
label: 生活必需品 @ja
label: 필수 소비재 @ko
definition: This industry group includes companies that manufacture noncyclical products for household and consumer consumption.
notation: 1210
valid from: 2024-06-07

Farm Supplies Wholesalers
type: BicsLevel5Segment
type: Classifier
type: NamedIndividual
is level5 segment of: Agricultural Products Whslrs
is contemporary version of: http://data.ga-group.nl/ics/bics/1211101010
is version of: http://data.ga-group.nl/ics/bics/1211101010
replaces: http://data.ga-group.nl/ics/bics/2020/1211101010
imported on: 2026-06-08T13:40:52.236Z
last refreshed on: 2026-06-08T13:41:38.450Z
source accessed on: 2024-06-05T14:42:36Z
source last accessed on: 2024-06-05T14:42:36Z
label: Atacadistas de suprimentos agrícolas @pt
label: GH für LaWi Betriebsmittel @de
label: Grossistes en fournitures agricoles @fr
label: Grossisti provviste per fattorie @it
label: Vta al por mayor de provisiones agrícola @es
label: Оптовая торговля - товары для с/х @ru
label: 农业用品批发商 @zh
label: 農業用品卸売 @ja
label: 農業用品批發 @zh-hant
label: 농업용품 도매업 @ko
definition: This segment includes companies that wholesale and distribute consumable farm and garden supplies.
notation: 1211101010
valid from: 2024-06-07

Grain & Field Bean Whslrs
type: BicsLevel5Segment
type: Classifier
type: NamedIndividual
is level5 segment of: Agricultural Products Whslrs
is contemporary version of: http://data.ga-group.nl/ics/bics/1211101011
is version of: http://data.ga-group.nl/ics/bics/1211101011
replaces: http://data.ga-group.nl/ics/bics/2020/1211101011
imported on: 2026-06-08T13:40:52.236Z
last refreshed on: 2026-06-08T13:41:38.450Z
source accessed on: 2024-06-05T14:42:36Z
source last accessed on: 2024-06-05T14:42:36Z
label: Atac grãos e feijões @pt
label: Comercio al por mayor de granos @es
label: GH für Getreide & Feldbohnen @de
label: Gross céréales et fèveroles @fr
label: Grossisti grano e fagiolini @it
label: Опт. торговля - зерно и кормовые бобы @ru
label: 穀物卸売 @ja
label: 穀類及豆類批發 @zh-hant
label: 谷物及豆类批发商 @zh
label: 곡물 & 종실용 콩 도매업 @ko
definition: This segment includes companies that wholesale and distribute grains and beans.
notation: 1211101011
valid from: 2024-06-07

Livestock Wholesalers
type: BicsLevel5Segment
type: Classifier
type: NamedIndividual
is level5 segment of: Agricultural Products Whslrs
is contemporary version of: http://data.ga-group.nl/ics/bics/1211101012
is version of: http://data.ga-group.nl/ics/bics/1211101012
replaces: http://data.ga-group.nl/ics/bics/2020/1211101012
imported on: 2026-06-08T13:40:52.236Z
last refreshed on: 2026-06-08T13:41:38.450Z
source accessed on: 2024-06-05T14:42:36Z
source last accessed on: 2024-06-05T14:42:36Z
label: Atacadistas de gado @pt
label: Großhändler für Nutzvieh @de
label: Grossistes en bétail sur pied @fr
label: Grossisti bestiame @it
label: Vta al por mayor de ganadería @es
label: Оптовая торговля - живой скот @ru
label: 牲畜批發 @zh-hant
label: 畜産物卸売 @ja
label: 畜类批发商 @zh
label: 축산물 도매업 @ko
definition: This segment includes companies that wholesale and distribute livestock.
notation: 1211101012
valid from: 2024-06-07

Agricultural Products Whslrs
type: BicsLevel4SubIndustry
type: Classifier
type: NamedIndividual
is sub industry of: Wholesale - Consumer Staples
is contemporary version of: http://data.ga-group.nl/ics/bics/12111010
is version of: http://data.ga-group.nl/ics/bics/12111010
replaces: http://data.ga-group.nl/ics/bics/2020/12111010
imported on: 2026-06-08T13:40:52.236Z
last refreshed on: 2026-06-08T13:41:38.450Z
source accessed on: 2024-06-05T14:42:36Z
source last accessed on: 2024-06-05T14:42:36Z
label: Atac produtos agrícolas @pt
label: GH für Agrarerzeugnisse @de
label: Gross produits agricoles @fr
label: Grossisti prodotti agricoli @it
label: Mayoristas prods agrícola @es
label: Опт. торговля - С/х продукты @ru
label: 农产品批发商 @zh
label: 農產品批發 @zh-hant
label: 農産物卸売 @ja
label: 농산물 도매업 @ko
definition: This industry subgroup includes companies that wholesale and distribute agricultural supplies, such as grains, beans, livestock, and other farm supplies. Excludes companies that wholesale agricultural machinery and equipment (see Farm/Garden Mach/Equip Whslrs).
notation: 12111010
valid from: 2024-06-07

Beer & Ale Wholesalers
type: BicsLevel5Segment
type: Classifier
type: NamedIndividual
is level5 segment of: Food & Beverage Wholesalers
is contemporary version of: http://data.ga-group.nl/ics/bics/1211101110
is version of: http://data.ga-group.nl/ics/bics/1211101110
replaces: http://data.ga-group.nl/ics/bics/2020/1211101110
imported on: 2026-06-08T13:40:52.236Z
last refreshed on: 2026-06-08T13:41:38.450Z
source accessed on: 2024-06-05T14:42:36Z
source last accessed on: 2024-06-05T14:42:36Z
label: Atacadistas de cervejas @pt
label: Comercio al por mayor de cerveceros @es
label: Großhändler für Bier & Ale @de
label: Grossistes en bières et ales @fr
label: Grossisti birra e malto @it
label: Оптовая торговля - пиво и эль @ru
label: 啤酒与麦酒批发商 @zh
label: 啤酒及麥酒批發 @zh-hant
label: 맥주류 도매업 @ko
label: ﾋﾞｰﾙ･ｴｰﾙ卸売 @ja
definition: This segment includes companies that wholesale and distribute beer and malt beverages.
notation: 1211101110
valid from: 2024-06-07

Confectionery Wholesalers
type: BicsLevel5Segment
type: Classifier
type: NamedIndividual
is level5 segment of: Food & Beverage Wholesalers
is contemporary version of: http://data.ga-group.nl/ics/bics/1211101111
is version of: http://data.ga-group.nl/ics/bics/1211101111
replaces: http://data.ga-group.nl/ics/bics/2020/1211101111
imported on: 2026-06-08T13:40:52.236Z
last refreshed on: 2026-06-08T13:41:38.450Z
source accessed on: 2024-06-05T14:42:36Z
source last accessed on: 2024-06-05T14:42:36Z
label: Atacadistas de produtos de confeitaria @pt
label: Großhändler für Süßwaren @de
label: Grossistes en confiseries @fr
label: Grossisti pasticcini @it
label: Mayoristas de confección @es
label: Опт. торговля - кондитерские изделия @ru
label: 糖果批发商 @zh
label: 糖果批發 @zh-hant
label: 菓子卸売 @ja
label: 제과 도매업 @ko
definition: This segment includes companies that wholesale and distribute confectioneries, nuts, chips, and fountain syrups.
notation: 1211101111
valid from: 2024-06-07

Dairy Prods Whslrs (ex Dry/Can)
type: BicsLevel5Segment
type: Classifier
type: NamedIndividual
is level5 segment of: Food & Beverage Wholesalers
is contemporary version of: http://data.ga-group.nl/ics/bics/1211101112
is version of: http://data.ga-group.nl/ics/bics/1211101112
replaces: http://data.ga-group.nl/ics/bics/2020/1211101112
imported on: 2026-06-08T13:40:52.236Z
last refreshed on: 2026-06-08T13:41:38.450Z
source accessed on: 2024-06-05T14:42:36Z
source last accessed on: 2024-06-05T14:42:36Z
label: Atac prod lácteos (exc em pó/enlatado) @pt
label: Comercio al por mayor de lácteos (excepto secos o enlatados) @es
label: GH für Milchprod. exkl. getrocknet/in Dosen @de
label: Gross produits laitiers (h désyd/boîte) @fr
label: Grossisti latticini (escl secco/scat) @it
label: Опт. торговля - молочные продукты (кроме сухих и консервир.) @ru
label: 乳製品(乾貨或罐頭除外)批發 @zh-hant
label: 乳製品(除粉･缶製品)卸売 @ja
label: 奶产品批发商(除干制与罐装） @zh
label: 유제품(건제 또는 캔류 외) 도매업 @ko
definition: This segment includes companies that wholesale and distribute dairy products, excluding dried or canned dairy products.
notation: 1211101112
valid from: 2024-06-07

Fish & Seafood Wholesalers
type: BicsLevel5Segment
type: Classifier
type: NamedIndividual
is level5 segment of: Food & Beverage Wholesalers
is contemporary version of: http://data.ga-group.nl/ics/bics/1211101113
is version of: http://data.ga-group.nl/ics/bics/1211101113
replaces: http://data.ga-group.nl/ics/bics/2020/1211101113
imported on: 2026-06-08T13:40:52.236Z
last refreshed on: 2026-06-08T13:41:38.450Z
source accessed on: 2024-06-05T14:42:36Z
source last accessed on: 2024-06-05T14:42:36Z
label: Atacadistas de peixes e frutos do mar @pt
label: Comercio al por mayor de mariscos @es
label: Großhändler für Fisch & Meeresfrüchte @de
label: Grossistes en poissons et fruits de mer @fr
label: Grossisti pesce e frutti mare @it
label: Опт. торговля - рыба и морепродукты @ru
label: 水産物卸売 @ja
label: 魚類及海鮮批發 @zh-hant
label: 鱼类与海鲜批发商 @zh
label: 수산물 도매업 @ko
definition: This segment includes companies that wholesale and distribute fish and other seafood.
notation: 1211101113
valid from: 2024-06-07

Fresh Fruit & Vegetable Whslrs
type: BicsLevel5Segment
type: Classifier
type: NamedIndividual
is level5 segment of: Food & Beverage Wholesalers
is contemporary version of: http://data.ga-group.nl/ics/bics/1211101114
is version of: http://data.ga-group.nl/ics/bics/1211101114
replaces: http://data.ga-group.nl/ics/bics/2020/1211101114
imported on: 2026-06-08T13:40:52.236Z
last refreshed on: 2026-06-08T13:41:38.450Z
source accessed on: 2024-06-05T14:42:36Z
source last accessed on: 2024-06-05T14:42:36Z
label: Atac vegetais e frutas frescas @pt
label: Comercio al por mayor de frutas y verduras frescas @es
label: GH für frisches Obst & Gemüse @de
label: Gross fruits et légumes frais @fr
label: Grossisti frutta e verdura fresca @it
label: Опт. торговля - свежие фрукты и овощи @ru
label: 新鮮水果及蔬菜批發 @zh-hant
label: 新鲜水果与蔬菜批发商 @zh
label: 青果･野菜卸売 @ja
label: 신선과일 & 채소 도매업 @ko
definition: This segment includes companies that wholesale and distribute fresh fruit and vegetables.
notation: 1211101114
valid from: 2024-06-07

General-Line Grocery Whslrs
type: BicsLevel5Segment
type: Classifier
type: NamedIndividual
is level5 segment of: Food & Beverage Wholesalers
is contemporary version of: http://data.ga-group.nl/ics/bics/1211101115
is version of: http://data.ga-group.nl/ics/bics/1211101115
replaces: http://data.ga-group.nl/ics/bics/2020/1211101115
imported on: 2026-06-08T13:40:52.236Z
last refreshed on: 2026-06-08T13:41:38.450Z
source accessed on: 2024-06-05T14:42:36Z
source last accessed on: 2024-06-05T14:42:36Z
label: Atac de artigos de mercearia em geral @pt
label: Großhändler für allgemeine Lebensmittel @de
label: Gross produits d'épicerie généraux @fr
label: Grossisti alimentari @it
label: Vta abarrotes en general @es
label: Опт. торговля - смешанный ассортимент продуктов питания @ru
label: 一般食品卸売 @ja
label: 百货批发商 @zh
label: 綜合性雜貨批發 @zh-hant
label: 일반식료품 도매업 @ko
definition: This segment includes companies that wholesale and distribute general groceries.
notation: 1211101115
valid from: 2024-06-07

Meat Products Wholesalers
type: BicsLevel5Segment
type: Classifier
type: NamedIndividual
is level5 segment of: Food & Beverage Wholesalers
is contemporary version of: http://data.ga-group.nl/ics/bics/1211101116
is version of: http://data.ga-group.nl/ics/bics/1211101116
replaces: http://data.ga-group.nl/ics/bics/2020/1211101116
imported on: 2026-06-08T13:40:52.236Z
last refreshed on: 2026-06-08T13:41:38.450Z
source accessed on: 2024-06-05T14:42:36Z
source last accessed on: 2024-06-05T14:42:36Z
label: Atacadistas de produtos de carne @pt
label: Großhändler für Fleischprodukte @de
label: Gross produits à base de viande @fr
label: Grossisti prodotti carne @it
label: Vta al p/mayor productos de carne @es
label: Оптовая торговля - мясные продукты @ru
label: 肉制品批发商 @zh
label: 肉類及肉類產品批發 @zh-hant
label: 食肉･食肉製品卸売 @ja
label: 육류제품 도매업 @ko
definition: This segment includes companies that wholesale and distribute fresh meat and other meat products.
notation: 1211101116
valid from: 2024-06-07

Packaged Frozen Food Whslrs
type: BicsLevel5Segment
type: Classifier
type: NamedIndividual
is level5 segment of: Food & Beverage Wholesalers
is contemporary version of: http://data.ga-group.nl/ics/bics/1211101117
is version of: http://data.ga-group.nl/ics/bics/1211101117
replaces: http://data.ga-group.nl/ics/bics/2020/1211101117
imported on: 2026-06-08T13:40:52.236Z
last refreshed on: 2026-06-08T13:41:38.450Z
source accessed on: 2024-06-05T14:42:36Z
source last accessed on: 2024-06-05T14:42:36Z
label: Atacadistas de congelados embalados @pt
label: Comercio al por mayor de alimentos congelados en envase @es
label: Großhändler für Lebensmittel, gefroren & abgepackt @de
label: Gross aliments congelés emballés @fr
label: Grossisti di alimenti surgelati confezionati @it
label: Оптовая торговля - Упакованные замороженные продукты питания @ru
label: 冷凍包裝食品批發 @zh-hant
label: 冷凍調理食品卸売 @ja
label: 包装冷冻食品批发商 @zh
label: 냉동포장식품 도매상업 @ko
definition: This segment includes companies that wholesale and distribute packaged frozen foods.
notation: 1211101117
valid from: 2024-06-07

Poultry Products Wholesalers
type: BicsLevel5Segment
type: Classifier
type: NamedIndividual
is level5 segment of: Food & Beverage Wholesalers
is contemporary version of: http://data.ga-group.nl/ics/bics/1211101118
is version of: http://data.ga-group.nl/ics/bics/1211101118
replaces: http://data.ga-group.nl/ics/bics/2020/1211101118
imported on: 2026-06-08T13:40:52.236Z
last refreshed on: 2026-06-08T13:41:38.450Z
source accessed on: 2024-06-05T14:42:36Z
source last accessed on: 2024-06-05T14:42:36Z
label: Atacadistas de produtos de aves @pt
label: Großhändler für Geflügelprodukte @de
label: Gross produits de volaille @fr
label: Grossisti prodotti avicoli @it
label: Vta al por mayor productos de aves @es
label: Опт. торговля - продукц. птицеводства @ru
label: 家きん･家きん製品卸売 @ja
label: 家禽及家禽產品批發 @zh-hant
label: 家禽及家禽��品批發 @zh-hant
label: 禽类产品批发商 @zh
label: 가금류제품 도매업 @ko
definition: This segment includes companies that wholesale and distribute fresh poultry and poultry-based products.
notation: 1211101118
valid from: 2024-06-07

Tobacco Products Wholesalers
type: BicsLevel5Segment
type: Classifier
type: NamedIndividual
is level5 segment of: Food & Beverage Wholesalers
is contemporary version of: http://data.ga-group.nl/ics/bics/1211101119
is version of: http://data.ga-group.nl/ics/bics/1211101119
replaces: http://data.ga-group.nl/ics/bics/2020/1211101119
imported on: 2026-06-08T13:40:52.236Z
last refreshed on: 2026-06-08T13:41:38.450Z
source accessed on: 2024-06-05T14:42:36Z
source last accessed on: 2024-06-05T14:42:36Z
label: Atacadistas de produtos de tabacos @pt
label: Großhändler für Tabakwaren @de
label: Grossistes en produits du tabac @fr
label: Grossisti prodotti del tabacco @it
label: Vta al por mayor productos de tabaco @es
label: Опт. торговля - табачные изделия @ru
label: Опт. торговля - табачн��е изделия @ru
label: たばこ製品卸売 @ja
label: 烟草制品批发商 @zh
label: 菸草製品批發 @zh-hant
label: 담배제품 도매업 @ko
definition: This segment includes companies that wholesale and distribute tobacco and other tobacco-based products.
notation: 1211101119
valid from: 2024-06-07

Wine & Distilled Alcohol Whslrs
type: BicsLevel5Segment
type: Classifier
type: NamedIndividual
is level5 segment of: Food & Beverage Wholesalers
is contemporary version of: http://data.ga-group.nl/ics/bics/1211101120
is version of: http://data.ga-group.nl/ics/bics/1211101120
replaces: http://data.ga-group.nl/ics/bics/2020/1211101120
imported on: 2026-06-08T13:40:52.236Z
last refreshed on: 2026-06-08T13:41:38.450Z
source accessed on: 2024-06-05T14:42:36Z
source last accessed on: 2024-06-05T14:42:36Z
label: Atac de bebidas alcoólicas destiladas e vinhos @pt
label: Comercio al por mayor de vino y bebidas de alcohol destilado @es
label: Großhändler für Wein & destillierten Alkohol @de
label: Gross vin et boissons alcool distill @fr
label: Grossisti vino e distillati @it
label: Опт. торговля - вино и спиртные напитки @ru
label: 葡萄酒及蒸餾酒精飲料批發 @zh-hant
label: 葡萄酒及蒸馏酒批发商 @zh
label: 와인 & 증류주 도매업 @ko
label: ﾜｲﾝ･蒸留酒卸売 @ja
definition: This segment includes companies that wholesale and distribute wine and distilled alcoholic beverages.
notation: 1211101120
valid from: 2024-06-07

Food & Beverage Wholesalers
type: BicsLevel4SubIndustry
type: Classifier
type: NamedIndividual
is sub industry of: Wholesale - Consumer Staples
is contemporary version of: http://data.ga-group.nl/ics/bics/12111011
is version of: http://data.ga-group.nl/ics/bics/12111011
replaces: http://data.ga-group.nl/ics/bics/2020/12111011
imported on: 2026-06-08T13:40:52.236Z
last refreshed on: 2026-06-08T13:41:38.450Z
source accessed on: 2024-06-05T14:42:36Z
source last accessed on: 2024-06-05T14:42:36Z
label: Atacadistas prod alimentícios @pt
label: Grossistes aliment. @fr
label: Grossisti alimentari e bevande @it
label: Lebensmittel & Getränke Grhdl. @de
label: Mayoristas de alimentos y bebidas @es
label: Прод. пит./напитки - опт. торг. @ru
label: 食品批發商 @zh-hant
label: 食品饮料批发商 @zh
label: 食品･飲料製品卸売 @ja
label: 식품 & 음료 도매업 @ko
definition: This industry subgroup includes companies that wholesale and distribute food and beverages.
notation: 12111011
valid from: 2024-06-07

Other Wholesalers - Staples
type: BicsLevel4SubIndustry
type: Classifier
type: NamedIndividual
is sub industry of: Wholesale - Consumer Staples
is contemporary version of: http://data.ga-group.nl/ics/bics/12111012
is version of: http://data.ga-group.nl/ics/bics/12111012
replaces: http://data.ga-group.nl/ics/bics/2020/12111012
imported on: 2026-06-08T13:40:52.236Z
last refreshed on: 2026-06-08T13:41:38.450Z
source accessed on: 2024-06-05T14:42:36Z
source last accessed on: 2024-06-05T14:42:36Z
label: Altri grossisti - Prima necessità @it
label: Autres gross - Conso essentielle @fr
label: Otros mayoristas - básico @es
label: Outros atacadistas - Básicos @pt
label: Sonstige GH - Basisgüter @de
label: Др. оптовики - основные товары @ru
label: その他卸売-生活必需品 @ja
label: 其他批发商-必需品 @zh
label: 其他批發-核心消費 @zh-hant
label: 기타도매업-생필품 @ko
definition: This industry subgroup includes companies that wholesale and distribute consumer staples not elsewhere classified.
notation: 12111012
valid from: 2024-06-07

Wholesale - Consumer Staples
type: BicsLevel3Industry
type: Classifier
type: NamedIndividual
is industry of: Retail & Wholesale - Staples
is contemporary version of: http://data.ga-group.nl/ics/bics/121110
is version of: http://data.ga-group.nl/ics/bics/121110
replaces: http://data.ga-group.nl/ics/bics/2020/121110
imported on: 2026-06-08T13:40:52.236Z
last refreshed on: 2026-06-08T13:41:38.450Z
source accessed on: 2024-06-05T14:42:36Z
source last accessed on: 2024-06-05T14:42:36Z
label: All'ingrosso - Beni necessari @it
label: Atacadistas - Consumo básico @pt
label: Großhandel - Basiskonsumgüter @de
label: Mayoristas - consumo básico @es
label: Vte en gros - essentielle @fr
label: Опт. торговля - потреб. товары @ru
label: Опт. торговля - потреб. товар�� @ru
label: 卸売-生活必需品 @ja
label: 批发-必需消费品 @zh
label: 經銷商-核心消費 @zh-hant
label: 도매 - 필수소비재 @ko
definition: This industry includes companies that wholesale and distribute consumer staple products. These companies do not produce their own products but instead distribute other companies' products in bulk to intermediaries in the supply chain or to commercial and industrial clients.
notation: 121110
valid from: 2024-06-07

Hypermarkets
type: BicsLevel6Segment
type: Classifier
type: NamedIndividual
is level6 segment of: Supermarkets
is contemporary version of: http://data.ga-group.nl/ics/bics/121111101010
is version of: http://data.ga-group.nl/ics/bics/121111101010
replaces: http://data.ga-group.nl/ics/bics/2020/121111101010
imported on: 2026-06-08T13:40:52.236Z
last refreshed on: 2026-06-08T13:41:38.450Z
source accessed on: 2024-06-05T14:42:36Z
source last accessed on: 2024-06-05T14:42:36Z
label: Hipermercados @es
label: Hypermärkte @de
label: Hypermarchés @fr
label: Ipermercati @it
label: Гипермаркет @ru
label: 大規模超級市場 @zh-hant
label: 超大型自助商场 @zh
label: 超大型���助商场 @zh
label: 하이퍼마켓 @ko
label: ﾊｲﾊﾟｰﾏｰｹｯﾄ @ja
definition: This segment includes large stores that originally specialized in retailing fresh food products but overtime diversified into general merchandise. Excludes large general merchandise stores who overtime diversified into retailing fresh food. (See Supercenters).
notation: 121111101010
valid from: 2024-06-07

Traditional Supermarkets
type: BicsLevel6Segment
type: Classifier
type: NamedIndividual
is level6 segment of: Supermarkets
is contemporary version of: http://data.ga-group.nl/ics/bics/121111101011
is version of: http://data.ga-group.nl/ics/bics/121111101011
replaces: http://data.ga-group.nl/ics/bics/2020/121111101011
imported on: 2026-06-08T13:40:52.236Z
last refreshed on: 2026-06-08T13:41:38.450Z
source accessed on: 2024-06-05T14:42:36Z
source last accessed on: 2024-06-05T14:42:36Z
label: Supermarchés traditionnels @fr
label: Supermercados tradicionais @pt
label: Supermercados tradicionales @es
label: Supermercati tradizionali @it
label: Traditionelle Supermärkte @de
label: Традиционные супермаркеты @ru
label: 传统超市 @zh
label: 傳統超市 @zh-hant
label: 従来型ｽｰﾊﾟｰ @ja
label: 기존 슈퍼마켓 @ko
definition: This segment includes smaller food stores that retail a wide range of packaged food, fresh food and household products.
notation: 121111101011
valid from: 2024-06-07

Supermarket - Online
type: BicsLevel6Segment
type: Classifier
type: NamedIndividual
is level6 segment of: Supermarkets
is contemporary version of: http://data.ga-group.nl/ics/bics/121111101012
is version of: http://data.ga-group.nl/ics/bics/121111101012
replaces: http://data.ga-group.nl/ics/bics/2020/121111101012
imported on: 2026-06-08T13:40:52.236Z
last refreshed on: 2026-06-08T13:41:38.450Z
source accessed on: 2024-06-05T14:42:36Z
source last accessed on: 2024-06-05T14:42:36Z
label: Supermarchés - En ligne @fr
label: Supermarkt - Online @de
label: Supermercado - en línea @es
label: Supermercado-Online @pt
label: Supermercato - Online @it
label: Супермаркет - Онлайн @ru
label: 超市 - 在线 @zh
label: 超市 - 線上 @zh-hant
label: 수퍼마켓 - 온라인 @ko
label: ｽｰﾊﾟｰﾏｰｹｯﾄ-ｵﾝﾗｲﾝ @ja
definition: This segment includes companies that retail a wide range of packaged food, fresh food, and household products on the Internet.
notation: 121111101012
valid from: 2024-06-07

Supermarkets
type: BicsLevel5Segment
type: Classifier
type: NamedIndividual
is level5 segment of: Food & Drug Stores
is contemporary version of: http://data.ga-group.nl/ics/bics/1211111010
is version of: http://data.ga-group.nl/ics/bics/1211111010
replaces: http://data.ga-group.nl/ics/bics/2020/1211111010
imported on: 2026-06-08T13:40:52.236Z
last refreshed on: 2026-06-08T13:41:38.450Z
source accessed on: 2024-06-05T14:42:36Z
source last accessed on: 2024-06-05T14:42:36Z
label: Supermärkte @de
label: Supermarchés @fr
label: Supermercados @es
label: Supermercati @it
label: Супермаркеты @ru
label: 超市 @zh
label: 超級市場 @zh-hant
label: 슈퍼마켓 @ko
label: ｽｰﾊﾟｰﾏｰｹｯﾄ @ja
definition: This segment includes stores that retail a wide range of packaged food, fresh food, and household products.
notation: 1211111010
valid from: 2024-06-07

Retail Bakeries
type: BicsLevel6Segment
type: Classifier
type: NamedIndividual
is level6 segment of: Specialty Food & Staples Stores
is contemporary version of: http://data.ga-group.nl/ics/bics/121111101110
is version of: http://data.ga-group.nl/ics/bics/121111101110
replaces: http://data.ga-group.nl/ics/bics/2020/121111101110
imported on: 2026-06-08T13:40:52.236Z
last refreshed on: 2026-06-08T13:41:38.450Z
source accessed on: 2024-06-05T14:42:36Z
source last accessed on: 2024-06-05T14:42:36Z
label: Boulangeries/Pâtisseries @fr
label: EH-Bäckereien @de
label: Padarias no varejo @pt
label: Panaderías al por menor @es
label: Panifici al dettaglio @it
label: Рознич. пекарни @ru
label: 零售糕點 @zh-hant
label: 零售面包店 @zh
label: 소매 제과점 @ko
label: ﾊﾟﾝ店 @ja
definition: This segment includes stores that specialize in retailing baked goods.
notation: 121111101110
valid from: 2024-06-07

Beer, Wine & Liquor Stores
type: BicsLevel6Segment
type: Classifier
type: NamedIndividual
is level6 segment of: Specialty Food & Staples Stores
is contemporary version of: http://data.ga-group.nl/ics/bics/121111101111
is version of: http://data.ga-group.nl/ics/bics/121111101111
replaces: http://data.ga-group.nl/ics/bics/2020/121111101111
imported on: 2026-06-08T13:40:52.236Z
last refreshed on: 2026-06-08T13:41:38.450Z
source accessed on: 2024-06-05T14:42:36Z
source last accessed on: 2024-06-05T14:42:36Z
label: Bier-, Wein- &Spirituosenläden @de
label: Licorerías @es
label: Lojas de bebidas @pt
label: Magasins de bière, vin et spiritueux @fr
label: Negozi liquori, birra e vino @it
label: Магазины пива, вина и ликеро-водочной продукции @ru
label: 啤酒、葡萄酒及酒類店 @zh-hant
label: 酒类商店 @zh
label: 맥주, 와인 & 주류 매장 @ko
label: ﾋﾞｰﾙ･ﾜｲﾝ･酒屋 @ja
label: ��агазины пива, вина и ликеро-водочной продукции @ru
definition: This segment includes stores that specialize in retailing packaged alcoholic beverages.
notation: 121111101111
valid from: 2024-06-07

Health & Natural Food Stores
type: BicsLevel6Segment
type: Classifier
type: NamedIndividual
is level6 segment of: Specialty Food & Staples Stores
is contemporary version of: http://data.ga-group.nl/ics/bics/121111101112
is version of: http://data.ga-group.nl/ics/bics/121111101112
replaces: http://data.ga-group.nl/ics/bics/2020/121111101112
imported on: 2026-06-08T13:40:52.236Z
last refreshed on: 2026-06-08T13:41:38.450Z
source accessed on: 2024-06-05T14:42:36Z
source last accessed on: 2024-06-05T14:42:36Z
label: Lojas de alimentos naturais e saúde @pt
label: Magasins d'aliments naturels et de santé @fr
label: Negozi alimentari naturali/biologici @it
label: Reformhaus & Bioläden @de
label: Tiendas de alimentos naturales y saludables @es
label: Мгзн товаров д/здоровья и натуральных пищевых продуктов @ru
label: 健康及天然食品商店 @zh-hant
label: 健康及天然食品店 @zh
label: 健康･自然食品店 @ja
label: 건강 & 천연식품 매장 @ko
definition: This segment includes stores that specialize in retailing food products considered to be healthy and/or derived from natural ingredients.
notation: 121111101112
valid from: 2024-06-07

Specialty Food & Staples Stores
type: BicsLevel5Segment
type: Classifier
type: NamedIndividual
is level5 segment of: Food & Drug Stores
is contemporary version of: http://data.ga-group.nl/ics/bics/1211111011
is version of: http://data.ga-group.nl/ics/bics/1211111011
replaces: http://data.ga-group.nl/ics/bics/2020/1211111011
imported on: 2026-06-08T13:40:52.236Z
last refreshed on: 2026-06-08T13:41:38.450Z
source accessed on: 2024-06-05T14:42:36Z
source last accessed on: 2024-06-05T14:42:36Z
label: Geschäfte für spezielle Nahrungsmittel & Basisgüter @de
label: Lojas alimentos especializados e básicos @pt
label: Magasins d'alimentation spécialisée et de première nécessité @fr
label: Negozi alimentari specializzati e prima necessità @it
label: Tiendas alim especial y cons básico @es
label: Мгзн осн. и спец. продуктов питания @ru
label: 特色食品及主食商店 @zh-hant
label: 特色食品及必需品商店 @zh
label: 食品専門店 @ja
label: 전문식품 & 생필품점 @ko
definition: This segment includes stores that specialize in retailing a specific type of food or beverage product.
notation: 1211111011
valid from: 2024-06-07

Convenience Stores
type: BicsLevel5Segment
type: Classifier
type: NamedIndividual
is level5 segment of: Food & Drug Stores
is contemporary version of: http://data.ga-group.nl/ics/bics/1211111012
is version of: http://data.ga-group.nl/ics/bics/1211111012
replaces: http://data.ga-group.nl/ics/bics/2020/1211111012
imported on: 2026-06-08T13:40:52.236Z
last refreshed on: 2026-06-08T13:41:38.450Z
source accessed on: 2024-06-05T14:42:36Z
source last accessed on: 2024-06-05T14:42:36Z
label: Dépanneurs @fr
label: Lojas conven @pt
label: Mini-Märkte @de
label: Minimarket @it
label: Tiendas @es
label: Мини-маг. товаров повс. спроса @ru
label: 便利商店 @zh-hant
label: 便利店 @zh
label: 편의점 @ko
label: ｺﾝﾋﾞﾆｴﾝｽｽﾄｱ @ja
definition: This segment includes stores that specialize in retailing a limited selection of everyday consumer staple products.
notation: 1211111012
valid from: 2024-06-07

Pharmacies
type: BicsLevel6Segment
type: Classifier
type: NamedIndividual
is level6 segment of: Pharmacies & Drug Stores
is contemporary version of: http://data.ga-group.nl/ics/bics/121111101310
is version of: http://data.ga-group.nl/ics/bics/121111101310
replaces: http://data.ga-group.nl/ics/bics/2020/121111101310
imported on: 2026-06-08T13:40:52.236Z
last refreshed on: 2026-06-08T13:41:38.450Z
source accessed on: 2024-06-05T14:42:36Z
source last accessed on: 2024-06-05T14:42:36Z
label: Apotheken @de
label: Farmácias @pt
label: Farmacias @es
label: Farmacie @it
label: Аптеки @ru
label: 美妝藥局 @zh-hant
label: 药房 @zh
label: 調剤薬局 @ja
label: 제약 @ko
definition: This segment includes companies that operate stores where pharmacy revenue accounts for the majority of sales.
notation: 121111101310
valid from: 2024-06-07

Drug Stores
type: BicsLevel6Segment
type: Classifier
type: NamedIndividual
is level6 segment of: Pharmacies & Drug Stores
is contemporary version of: http://data.ga-group.nl/ics/bics/121111101311
is version of: http://data.ga-group.nl/ics/bics/121111101311
replaces: http://data.ga-group.nl/ics/bics/2020/121111101311
imported on: 2026-06-08T13:40:52.236Z
last refreshed on: 2026-06-08T13:41:38.450Z
source accessed on: 2024-06-05T14:42:36Z
source last accessed on: 2024-06-05T14:42:36Z
label: Drogarias @pt
label: Drogerien @de
label: Drugstores @fr
label: Farmacias @es
label: Farmacie @it
label: Аптеки @ru
label: 美妝藥局 @zh-hant
label: 药店 @zh
label: 薬店 @ja
label: 약국 @ko
definition: This segment includes stores that specialize in retailing toiletries, health care products, and prescriptions, but where pharmacy revenue is a small portion of total sales.
notation: 121111101311
valid from: 2024-06-07

Pharmacies & Drug - Online
type: BicsLevel6Segment
type: Classifier
type: NamedIndividual
is level6 segment of: Pharmacies & Drug Stores
is contemporary version of: http://data.ga-group.nl/ics/bics/121111101312
is version of: http://data.ga-group.nl/ics/bics/121111101312
replaces: http://data.ga-group.nl/ics/bics/2020/121111101312
imported on: 2026-06-08T13:40:52.236Z
last refreshed on: 2026-06-08T13:41:38.450Z
source accessed on: 2024-06-05T14:42:36Z
source last accessed on: 2024-06-05T14:42:36Z
label: Apotheken & Drogerien - Online @de
label: Farmácias e drogarias - online @pt
label: Farmacias y medicinas - En línea @es
label: Farmacie e farmaci - online @it
label: Pharmacies et médicaments - en ligne @fr
label: Фармацевтич. и лекарств. препараты-Онлайн @ru
label: Фармацевтич. и лекарств. препара��ы-Онлайн @ru
label: 药店和药品 - 在线 @zh
label: 薬局･薬店-ｵﾝﾗｲﾝ @ja
label: 藥物-線上 @zh-hant
label: 약국 및 약품 - 온라인 @ko
definition: This segment includes companies that specialize in retailing prescription drugs and medications on the Internet.
notation: 121111101312
valid from: 2024-06-07

Pharmacies & Drug Stores
type: BicsLevel5Segment
type: Classifier
type: NamedIndividual
is level5 segment of: Food & Drug Stores
is contemporary version of: http://data.ga-group.nl/ics/bics/1211111013
is version of: http://data.ga-group.nl/ics/bics/1211111013
replaces: http://data.ga-group.nl/ics/bics/2020/1211111013
imported on: 2026-06-08T13:40:52.236Z
last refreshed on: 2026-06-08T13:41:38.450Z
source accessed on: 2024-06-05T14:42:36Z
source last accessed on: 2024-06-05T14:42:36Z
label: Arzneimittelgeschäfte @de
label: Farmác e drogarias @pt
label: Farmacias @es
label: Farmacie @it
label: Pharmacies @fr
label: Аптеки и магазины лекарств. @ru
label: 药房与药店 @zh
label: 薬局･薬店 @ja
label: 藥品店 @zh-hant
label: 약품 및 약국 @ko
definition: This segment includes stores that specialize in retailing prescription drugs and medications.
notation: 1211111013
valid from: 2024-06-07

Food & Drug Stores
type: BicsLevel4SubIndustry
type: Classifier
type: NamedIndividual
is sub industry of: Retail - Consumer Staples
is contemporary version of: http://data.ga-group.nl/ics/bics/12111110
is version of: http://data.ga-group.nl/ics/bics/12111110
replaces: http://data.ga-group.nl/ics/bics/2020/12111110
imported on: 2026-06-08T13:40:52.236Z
last refreshed on: 2026-06-08T13:41:38.450Z
source accessed on: 2024-06-05T14:42:36Z
source last accessed on: 2024-06-05T14:42:36Z
label: LM-Geschäfte & Drogerien @de
label: Lojas de alimentos e drogarias @pt
label: Negozi alimentari e farmacie @it
label: Supermarchés et pharmacies @fr
label: Tiendas de alimentos y fármacos @es
label: Маг. прод. питания/аптеки @ru
label: 食品及药品店 @zh
label: 食品及藥品商店 @zh-hant
label: 食品･薬店 @ja
label: 식품 & 약품 매장 @ko
definition: This industry subgroup includes stores that specialize in retailing food, beverages, or pharmaceuticals.
notation: 12111110
valid from: 2024-06-07

Supercenters
type: BicsLevel5Segment
type: Classifier
type: NamedIndividual
is level5 segment of: Mass Merchants
is contemporary version of: http://data.ga-group.nl/ics/bics/1211111110
is version of: http://data.ga-group.nl/ics/bics/1211111110
replaces: http://data.ga-group.nl/ics/bics/2020/1211111110
imported on: 2026-06-08T13:40:52.236Z
last refreshed on: 2026-06-08T13:41:38.450Z
source accessed on: 2024-06-05T14:42:36Z
source last accessed on: 2024-06-05T14:42:36Z
label: Súpercentros @es
label: Super centres @fr
label: Supercenter @de
label: Supercentri @it
label: Supercentros @pt
label: Суперцентры @ru
label: 超級購物中心 @zh-hant
label: 超级购物中心 @zh
label: 대형쇼핑센터 @ko
label: ｽｰﾊﾟｰｾﾝﾀｰ @ja
definition: This segment includes big-box stores that carry a wide selection of general merchandise and food.
notation: 1211111110
valid from: 2024-06-07

Warehouse Clubs
type: BicsLevel5Segment
type: Classifier
type: NamedIndividual
is level5 segment of: Mass Merchants
is contemporary version of: http://data.ga-group.nl/ics/bics/1211111111
is version of: http://data.ga-group.nl/ics/bics/1211111111
replaces: http://data.ga-group.nl/ics/bics/2020/1211111111
imported on: 2026-06-08T13:40:52.236Z
last refreshed on: 2026-06-08T13:41:38.450Z
source accessed on: 2024-06-05T14:42:36Z
source last accessed on: 2024-06-05T14:42:36Z
label: Club a grande sconto @it
label: Clubes almacén @es
label: Clubes de depósito @pt
label: Clubs, hypermarchés @fr
label: Grosshandelsmärkte @de
label: Склады @ru
label: 仓储式俱乐部 @zh
label: 会員制ﾃﾞｨｽｶｳﾝﾄｽﾄｱ @ja
label: 倉儲式俱樂部 @zh-hant
label: 회원제할인마트 @ko
definition: This segment includes stores that offer a wide variety of merchandise, usually in wholesale quantities, and require an annual membership in order to shop.
notation: 1211111111
valid from: 2024-06-07

Discount Stores
type: BicsLevel5Segment
type: Classifier
type: NamedIndividual
is level5 segment of: Mass Merchants
is contemporary version of: http://data.ga-group.nl/ics/bics/1211111112
is version of: http://data.ga-group.nl/ics/bics/1211111112
replaces: http://data.ga-group.nl/ics/bics/2020/1211111112
imported on: 2026-06-08T13:40:52.236Z
last refreshed on: 2026-06-08T13:41:38.450Z
source accessed on: 2024-06-05T14:42:36Z
source last accessed on: 2024-06-05T14:42:36Z
label: Discounter @de
label: Lojas de desconto @pt
label: Magasins à rabais @fr
label: Negozi di articoli scontati @it
label: Tiendas de descuento @es
label: Магазины уцененных товаров @ru
label: 折扣商店 @zh
label: 할인 매장 @ko
label: ﾃﾞｨｽｶｳﾝﾄｽﾄｱ @ja
definition: This segment includes stores that offer a wide range of general merchandise at discounted prices.
notation: 1211111112
valid from: 2024-06-07

Dollar Stores
type: BicsLevel5Segment
type: Classifier
type: NamedIndividual
is level5 segment of: Mass Merchants
is contemporary version of: http://data.ga-group.nl/ics/bics/1211111113
is version of: http://data.ga-group.nl/ics/bics/1211111113
replaces: http://data.ga-group.nl/ics/bics/2020/1211111113
imported on: 2026-06-08T13:40:52.236Z
last refreshed on: 2026-06-08T13:41:38.450Z
source accessed on: 2024-06-05T14:42:36Z
source last accessed on: 2024-06-05T14:42:36Z
label: Lojas de $1 dólar @pt
label: Magasins à un dollar @fr
label: Negozi ad un dollaro @it
label: Ramschläden @de
label: Tiendas de un dólar @es
label: Долларовые магазины @ru
label: 一元商店 @zh-hant
label: 一元店 @zh
label: 염가매장 @ko
label: ﾀﾞﾗｰｽﾄｱ @ja
definition: This segment includes stores that offer a wide range of general merchandise at a single targeted price-point.
notation: 1211111113
valid from: 2024-06-07

Mass Merchants
type: BicsLevel4SubIndustry
type: Classifier
type: NamedIndividual
is sub industry of: Retail - Consumer Staples
is contemporary version of: http://data.ga-group.nl/ics/bics/12111111
is version of: http://data.ga-group.nl/ics/bics/12111111
replaces: http://data.ga-group.nl/ics/bics/2020/12111111
imported on: 2026-06-08T13:40:52.236Z
last refreshed on: 2026-06-08T13:41:38.450Z
source accessed on: 2024-06-05T14:42:36Z
source last accessed on: 2024-06-05T14:42:36Z
label: Comerc em massa @pt
label: Comerciantes masivos @es
label: Commerçants grand public @fr
label: Mass-Merchants @de
label: Negozianti di massa @it
label: Товары смеш. ассорт. @ru
label: Товары смеш. ��ссорт. @ru
label: 大型零售商 @zh
label: 大規模小売店 @ja
label: 量販店 @zh-hant
label: 대형 할인점 @ko
definition: This industry subgroup includes retail stores that carry a broad range of merchandise.
notation: 12111111
valid from: 2024-06-07

Retail - Consumer Staples
type: BicsLevel3Industry
type: Classifier
type: NamedIndividual
is industry of: Retail & Wholesale - Staples
is contemporary version of: http://data.ga-group.nl/ics/bics/121111
is version of: http://data.ga-group.nl/ics/bics/121111
replaces: http://data.ga-group.nl/ics/bics/2020/121111
imported on: 2026-06-08T13:40:52.236Z
last refreshed on: 2026-06-08T13:41:38.450Z
source accessed on: 2024-06-05T14:42:36Z
source last accessed on: 2024-06-05T14:42:36Z
label: Al dettaglio - Beni consumo @it
label: Comercio al por menor - consumo básico @es
label: Einzelhandel - Basisgüter @de
label: Varejo - Consumo básico @pt
label: Vente au détail - Consommation essentielle @fr
label: Розничная торговля основными потребит. товарами @ru
label: 小売-生活必需品 @ja
label: 零售-必需消费品 @zh
label: 零售-核心消費 @zh-hant
label: 소매업-필수소비재 @ko
definition: This industry includes companies that retail consumer staple products through storefront operations.
notation: 121111
valid from: 2024-06-07

Retail & Wholesale - Staples
type: BicsLevel2IndustryGroup
type: Classifier
type: NamedIndividual
is industry group of: Consumer Staples
is contemporary version of: http://data.ga-group.nl/ics/bics/1211
is version of: http://data.ga-group.nl/ics/bics/1211
replaces: http://data.ga-group.nl/ics/bics/2020/1211
imported on: 2026-06-08T13:40:52.236Z
last refreshed on: 2026-06-08T13:41:38.450Z
source accessed on: 2024-06-05T14:42:36Z
source last accessed on: 2024-06-05T14:42:36Z
label: Al dett e all'ingrosso - Beni consumo @it
label: Einzel- & Großhandel - Basisgüter @de
label: Minorista y mayorista - consumo básico @es
label: Varejo e atacado - Básico @pt
label: Vente gros/détail - Conso de base @fr
label: Розн. и опт. торговля товарами 1-й необх-ти @ru
label: 小売･卸売-生活必需品 @ja
label: 小売･���売-生活必需品 @ja
label: 零售与批发-必需品 @zh
label: 零售及批發-核心 @zh-hant
label: 소매 & 도매 - 필수 @ko
definition: This industry group includes companies that provide distribution channels for consumer staple products.
notation: 1211
valid from: 2024-06-07

Consumer Staples
type: BicsLevel1Sector
type: Classifier
type: NamedIndividual
is contemporary version of: http://data.ga-group.nl/ics/bics/12
is version of: http://data.ga-group.nl/ics/bics/12
replaces: http://data.ga-group.nl/ics/bics/2020/12
imported on: 2026-06-08T13:40:52.236Z
last refreshed on: 2026-06-08T13:41:38.450Z
source accessed on: 2024-06-05T14:42:36Z
source last accessed on: 2024-06-05T14:42:36Z
label: Basiskonsumgüter @de
label: Beni prima necessità @it
label: Conso de base @fr
label: Consumo básico @es
label: Товары первой необходимости @ru
label: 必需消费品 @zh
label: 核心消費 @zh-hant
label: 生活必需品 @ja
label: 기본소비재 @ko
definition: This sector includes companies that produce, manufacture, distribute, or retail consumer staple goods and services.
notation: 12
valid from: 2024-06-07

Integrated Oils
type: BicsLevel4SubIndustry
type: Classifier
type: NamedIndividual
is sub industry of: Oil & Gas Supply Chain
is contemporary version of: http://data.ga-group.nl/ics/bics/13101010
is version of: http://data.ga-group.nl/ics/bics/13101010
replaces: http://data.ga-group.nl/ics/bics/2020/13101010
imported on: 2026-06-08T13:40:52.236Z
last refreshed on: 2026-06-08T13:41:38.450Z
source accessed on: 2024-06-05T14:42:36Z
source last accessed on: 2024-06-05T14:42:36Z
label: Integriertes Öl @de
label: Pétrolières intégrées @fr
label: Petr integrado @pt
label: Petróleos integrados @es
label: Petrolio integrato @it
label: Интегрир. нефт. комп. @ru
label: 石油:総合 @ja
label: 綜合性石油業 @zh-hant
label: 综合石油 @zh
label: 통합 석유 @ko
definition: This industry subgroup includes large companies that are vertically integrated into exploration, production, and refining.
notation: 13101010
valid from: 2024-06-07

Crude Oil Production
type: BicsLevel6Segment
type: Classifier
type: NamedIndividual
is level6 segment of: Crude Oil & Natural Gas E&P
is contemporary version of: http://data.ga-group.nl/ics/bics/131010111010
is version of: http://data.ga-group.nl/ics/bics/131010111010
replaces: http://data.ga-group.nl/ics/bics/2020/131010111010
imported on: 2026-06-08T13:40:52.236Z
last refreshed on: 2026-06-08T13:41:38.450Z
source accessed on: 2024-06-05T14:42:36Z
source last accessed on: 2024-06-05T14:42:36Z
label: Produção de petróleo bruto @pt
label: Producción de crudo @es
label: Production de pétrole @fr
label: Produzione di greggio @it
label: Rohölproduktion @de
label: Добыча сырой нефти @ru
label: 原油生产 @zh
label: 原油生産 @ja
label: 原油產量 @zh-hant
label: 원유 생산 @ko
definition: This segment includes companies that explore and develop crude oil deposits on land or sea.
notation: 131010111010
valid from: 2024-06-07

Oil Sands Production
type: BicsLevel6Segment
type: Classifier
type: NamedIndividual
is level6 segment of: Crude Oil & Natural Gas E&P
is contemporary version of: http://data.ga-group.nl/ics/bics/131010111011
is version of: http://data.ga-group.nl/ics/bics/131010111011
replaces: http://data.ga-group.nl/ics/bics/2020/131010111011
imported on: 2026-06-08T13:40:52.236Z
last refreshed on: 2026-06-08T13:41:38.450Z
source accessed on: 2024-06-05T14:42:36Z
source last accessed on: 2024-06-05T14:42:36Z
label: Produção de areias petrolíferas @pt
label: Producción de arenas petrolíferas @es
label: Production de sables bitumeux @fr
label: Produzione sabbie petrolifere @it
label: Ölsandförderung @de
label: Добыча нефтеносного песка @ru
label: 油砂生产 @zh
label: 油砂產量 @zh-hant
label: 오일샌드 생산량 @ko
label: ｵｲﾙｻﾝﾄﾞ生産 @ja
definition: This segment includes companies that find and develop oil sands deposits.
notation: 131010111011
valid from: 2024-06-07

Natural Gas Liquids Production
type: BicsLevel6Segment
type: Classifier
type: NamedIndividual
is level6 segment of: Crude Oil & Natural Gas E&P
is contemporary version of: http://data.ga-group.nl/ics/bics/131010111012
is version of: http://data.ga-group.nl/ics/bics/131010111012
replaces: http://data.ga-group.nl/ics/bics/2020/131010111012
imported on: 2026-06-08T13:40:52.236Z
last refreshed on: 2026-06-08T13:41:38.450Z
source accessed on: 2024-06-05T14:42:36Z
source last accessed on: 2024-06-05T14:42:36Z
label: Líquidos de gás natural @pt
label: Liquidi gas naturale @it
label: Producción de gas natural licuado @es
label: Production de liquides du gaz naturel @fr
label: Produktion von Erdgaskondensat @de
label: СПГ @ru
label: 天然气凝析液生产 @zh
label: 天然氣凝結油生產 @zh-hant
label: 天然ｶﾞｽ液生産 @ja
label: 천연가스액체 생산 @ko
definition: This segment includes companies that produce natural gas liquids (NGLs).
notation: 131010111012
valid from: 2024-06-07

Natural Gas Production
type: BicsLevel6Segment
type: Classifier
type: NamedIndividual
is level6 segment of: Crude Oil & Natural Gas E&P
is contemporary version of: http://data.ga-group.nl/ics/bics/131010111013
is version of: http://data.ga-group.nl/ics/bics/131010111013
replaces: http://data.ga-group.nl/ics/bics/2020/131010111013
imported on: 2026-06-08T13:40:52.236Z
last refreshed on: 2026-06-08T13:41:38.450Z
source accessed on: 2024-06-05T14:42:36Z
source last accessed on: 2024-06-05T14:42:36Z
label: Erdgasproduktion @de
label: Produção de gás natural @pt
label: Producción de gas natural @es
label: Production de gaz naturel @fr
label: Produzione gas naturale @it
label: Добыча природного газа @ru
label: 天然气生产 @zh
label: 天然氣產量 @zh-hant
label: 天然ｶﾞｽ生産 @ja
label: 천연가스 생산 @ko
definition: This segment includes companies that find and develop natural gas deposits.
notation: 131010111013
valid from: 2024-06-07

Negative Royalties
type: BicsLevel6Segment
type: Classifier
type: NamedIndividual
is level6 segment of: Crude Oil & Natural Gas E&P
is contemporary version of: http://data.ga-group.nl/ics/bics/131010111014
is version of: http://data.ga-group.nl/ics/bics/131010111014
replaces: http://data.ga-group.nl/ics/bics/2020/131010111014
imported on: 2026-06-08T13:40:52.236Z
last refreshed on: 2026-06-08T13:41:38.450Z
source accessed on: 2024-06-05T14:42:36Z
source last accessed on: 2024-06-05T14:42:36Z
label: Neg. Förderungsabg. @de
label: Regalías negativas @es
label: Rendite negative @it
label: Royalties négatifs @fr
label: Royalties negativos @pt
label: Отрицат. лицензион. сборы @ru
label: 負採礦權 - 能源 @zh-hant
label: 负特许使用权 @zh
label: 역방향로열티 @ko
label: ﾈｶﾞﾃｨﾌﾞﾛｲﾔﾙﾃｨ @ja
label: ﾈｶﾞﾃｨﾌﾞﾛｲﾔﾙﾃ��� @ja
definition: This segment includes companies that pay royalty fees to government bodies for the production of fossil fuels.
notation: 131010111014
valid from: 2024-06-07

Crude Oil & Natural Gas E&P
type: BicsLevel5Segment
type: Classifier
type: NamedIndividual
is level5 segment of: Exploration & Production
is contemporary version of: http://data.ga-group.nl/ics/bics/1310101110
is version of: http://data.ga-group.nl/ics/bics/1310101110
replaces: http://data.ga-group.nl/ics/bics/2020/1310101110
imported on: 2026-06-08T13:40:52.236Z
last refreshed on: 2026-06-08T13:41:38.450Z
source accessed on: 2024-06-05T14:42:36Z
source last accessed on: 2024-06-05T14:42:36Z
label: Crudo y gas natural E&P @es
label: E&P Rohöl & Erdgas @de
label: E&P de petróleo e gás natural @pt
label: E&P greggio e gas naturale @it
label: Explo/prod gaz naturel/pétrole @fr
label: Сыр. нефть и прир. газ, E&P @ru
label: 原油及天然氣探勘與生產 @zh-hant
label: 原油和天然气勘探与生产 @zh
label: 原油･天然ｶﾞｽ 探鉱･生産 @ja
label: 원유& 천연가스 E&P @ko
definition: This segment includes companies that explore and develop deposits of crude oil and natural gas.
notation: 1310101110
valid from: 2024-06-07

Oil & Natural Gas Mkt & Trading
type: BicsLevel5Segment
type: Classifier
type: NamedIndividual
is level5 segment of: Exploration & Production
is contemporary version of: http://data.ga-group.nl/ics/bics/1310101111
is version of: http://data.ga-group.nl/ics/bics/1310101111
replaces: http://data.ga-group.nl/ics/bics/2020/1310101111
imported on: 2026-06-08T13:40:52.236Z
last refreshed on: 2026-06-08T13:41:38.450Z
source accessed on: 2024-06-05T14:42:36Z
source last accessed on: 2024-06-05T14:42:36Z
label: Comercialización/operaciones de gas natural y petróleo @es
label: Mkt e negoc petróleo e gás natural @pt
label: Mkt e trading greggio e gas naturale @it
label: Mktg et négociation pétrole/gaz naturel @fr
label: Öl & Erdgas Mkt & Handel @de
label: Продажи нефти и ПГ @ru
label: 石油与天然气营销与交易 @zh
label: 石油及天然氣行銷與交易 @zh-hant
label: 石油･天然ｶﾞｽ 販売･取引 @ja
label: 석유 & 천연가스 판매 & 거래 @ko
definition: This segment includes companies that market and resell third-party purchased raw crude oil and natural gas volumes.
notation: 1310101111
valid from: 2024-06-07

Royalty Income - Oil & Gas
type: BicsLevel5Segment
type: Classifier
type: NamedIndividual
is level5 segment of: Exploration & Production
is contemporary version of: http://data.ga-group.nl/ics/bics/1310101112
is version of: http://data.ga-group.nl/ics/bics/1310101112
replaces: http://data.ga-group.nl/ics/bics/2020/1310101112
imported on: 2026-06-08T13:40:52.236Z
last refreshed on: 2026-06-08T13:41:38.450Z
source accessed on: 2024-06-05T14:42:36Z
source last accessed on: 2024-06-05T14:42:36Z
label: Ingreso de regalías - Petróleo y gas @es
label: Lizenzertrag - Erdöl & Erdgas @de
label: Redd concessione-Petr e gas @it
label: Renda de Royalties-Petróleo e gás @pt
label: Revenus de royalty - pétrole et gaz @fr
label: Нефть и газ - дхд от лиц. поступл. @ru
label: 權利金收入-油氣 @zh-hant
label: 特许权收入-石油和天然气 @zh
label: 로얄티수입 - 석유 & 가스 @ko
label: ﾛｲﾔﾙﾃｨ収益-石油ｶﾞｽ @ja
definition: This segment includes companies that receive royalties from energy properties, such as oil and gas fields.
notation: 1310101112
valid from: 2024-06-07

Exploration & Production
type: BicsLevel4SubIndustry
type: Classifier
type: NamedIndividual
is sub industry of: Oil & Gas Supply Chain
is contemporary version of: http://data.ga-group.nl/ics/bics/13101011
is version of: http://data.ga-group.nl/ics/bics/13101011
replaces: http://data.ga-group.nl/ics/bics/2020/13101011
imported on: 2026-06-08T13:40:52.236Z
last refreshed on: 2026-06-08T13:41:38.450Z
source accessed on: 2024-06-05T14:42:36Z
source last accessed on: 2024-06-05T14:42:36Z
label: Esplorazione e produzione @it
label: Exploración y prod @es
label: Exploration & Produktion @de
label: Exploration/production @fr
label: Prod e Exploração @pt
label: Разведка и добыча @ru
label: 勘探及生产 @zh
label: 探勘及生產 @zh-hant
label: 探鉱･生産 @ja
label: 탐사 & 생산 @ko
definition: This industry subgroup includes companies that explore for, extract, or produce crude oil and natural gas products.
notation: 13101011
valid from: 2024-06-07

Crude Oil Pipelines & Storage
type: BicsLevel7Segment
type: Classifier
type: NamedIndividual
is level7 segment of: Oil Pipelines & Storage
is contemporary version of: http://data.ga-group.nl/ics/bics/13101012101010
is version of: http://data.ga-group.nl/ics/bics/13101012101010
replaces: http://data.ga-group.nl/ics/bics/2020/13101012101010
imported on: 2026-06-08T13:40:52.236Z
last refreshed on: 2026-06-08T13:41:38.450Z
source accessed on: 2024-06-05T14:42:36Z
source last accessed on: 2024-06-05T14:42:36Z
label: Almacenamiento de oleoductos de crudo @es
label: Oleodotti e stoccaggio greggio @it
label: Oleodutos de bruto e armazenagem @pt
label: Pipeline de pétrole brut et stockage @fr
label: Rohöl-Pipelines & -lagerung @de
label: Трубопроводы для сырой нефти и хранение @ru
label: 原油管線及儲存 @zh-hant
label: 原油管道与存储 @zh
label: 原油ﾊﾟｲﾌﾟﾗｲﾝ･貯蔵 @ja
label: 원유 파이프라인 & 저장 @ko
definition: This segment includes companies that own and operate pipelines and terminal facilities for crude oil. These companies utilize their distribution network to link crude-oil production companies and refineries.
notation: 13101012101010
valid from: 2024-06-07

Refined Products Pipelines & Sto
type: BicsLevel7Segment
type: Classifier
type: NamedIndividual
is level7 segment of: Oil Pipelines & Storage
is contemporary version of: http://data.ga-group.nl/ics/bics/13101012101011
is version of: http://data.ga-group.nl/ics/bics/13101012101011
replaces: http://data.ga-group.nl/ics/bics/2020/13101012101011
imported on: 2026-06-08T13:40:52.236Z
last refreshed on: 2026-06-08T13:41:38.450Z
source accessed on: 2024-06-05T14:42:36Z
source last accessed on: 2024-06-05T14:42:36Z
label: Ductos de productos refinados y sto @es
label: Dutos e arm de produtos refinados @pt
label: Oleodotti e stoccaggio prod raffinati @it
label: Pipelines prod raffinés/stockage @fr
label: Raffinierter Prod. Pipelines & Lagerung @de
label: Трубопровод д/ продуктов нефтеперераб. и хранение @ru
label: 精炼产品管道与存储 @zh
label: 精煉產品管線及儲存 @zh-hant
label: 精製品ﾊﾟｲﾌﾟﾗｲﾝ･貯蔵 @ja
label: 정유제품 파이프라인 & 저장 @ko
definition: This segment includes companies that own and operate pipelines and terminal facilities for refined oil products. These companies utilize their distribution network to link refineries to their end users.
notation: 13101012101011
valid from: 2024-06-07

Oil Pipelines & Storage
type: BicsLevel6Segment
type: Classifier
type: NamedIndividual
is level6 segment of: Oil & Liquid Rich Gas Pipelines
is contemporary version of: http://data.ga-group.nl/ics/bics/131010121010
is version of: http://data.ga-group.nl/ics/bics/131010121010
replaces: http://data.ga-group.nl/ics/bics/2020/131010121010
imported on: 2026-06-08T13:40:52.236Z
last refreshed on: 2026-06-08T13:41:38.450Z
source accessed on: 2024-06-05T14:42:36Z
source last accessed on: 2024-06-05T14:42:36Z
label: Condotte e scorte greggio @it
label: Oleoductos y almacenamiento @es
label: Oleodutos e armaz @pt
label: Pipelines de pétrole et stockage @fr
label: Öl-Pipelines & -lagerung @de
label: Нефтепроводы и хранилищи @ru
label: 石油管線及貯存 @zh-hant
label: 石油管道与存储 @zh
label: 石油ﾊﾟｲﾌﾟﾗｲﾝ･貯蔵 @ja
label: 석유 파이프라인 & 저장 @ko
definition: This segment includes companies that own and operate pipelines and terminal facilities for oil products.
notation: 131010121010
valid from: 2024-06-07

Nat Gas Gathering & Processing
type: BicsLevel7Segment
type: Classifier
type: NamedIndividual
is level7 segment of: NGL Pipelines & Services
is contemporary version of: http://data.ga-group.nl/ics/bics/13101012101110
is version of: http://data.ga-group.nl/ics/bics/13101012101110
replaces: http://data.ga-group.nl/ics/bics/2020/13101012101110
imported on: 2026-06-08T13:40:52.236Z
last refreshed on: 2026-06-08T13:41:38.450Z
source accessed on: 2024-06-05T14:42:36Z
source last accessed on: 2024-06-05T14:42:36Z
label: Captura y proceso gas natural @es
label: Collecte et traitement gaz nat @fr
label: Erdgaserfassung & -aufbereitung @de
label: Processamento e recolhimento de gás nat @pt
label: Raccolta e lavorazione gas nat @it
label: ПГ - сбор и переработка @ru
label: 天然气收集与加工 @zh
label: 天然氣收集及處理 @zh-hant
label: 天然ｶﾞｽ処理 @ja
label: 천연가스 수집 & 처리 @ko
definition: This segment includes companies that own and operates pipelines that transport raw natural gas from wellheads. Also includes companies that treat, process, and finally separate raw natural gas into dry natural gas and natural gas liquids.
notation: 13101012101110
valid from: 2024-06-07

NGL Fractionation & Marketing
type: BicsLevel7Segment
type: Classifier
type: NamedIndividual
is level7 segment of: NGL Pipelines & Services
is contemporary version of: http://data.ga-group.nl/ics/bics/13101012101111
is version of: http://data.ga-group.nl/ics/bics/13101012101111
replaces: http://data.ga-group.nl/ics/bics/2020/13101012101111
imported on: 2026-06-08T13:40:52.236Z
last refreshed on: 2026-06-08T13:41:38.450Z
source accessed on: 2024-06-05T14:42:36Z
source last accessed on: 2024-06-05T14:42:36Z
label: Fraccionamiento y comercialización GNL @es
label: Fracionamento e marketing de GNL @pt
label: Fractionnement LGN et marketing @fr
label: LGN Frazionamento e marketing @it
label: NGL Fraktionierung & Marketing @de
label: NGL 부분분리 & 판매 @ko
label: Фракционирование СПГ и маркетинг @ru
label: 天然气凝析液分馏与营销 @zh
label: 天然氣凝結油分餾及行銷 @zh-hant
label: 天然ｶﾞｽ液分留 @ja
definition: This segment includes companies that separate natural gas liquids (NGLs) into different liquids, such as ethane, propane, and butane.
notation: 13101012101111
valid from: 2024-06-07

Nat Gas Liquids Pipelines
type: BicsLevel7Segment
type: Classifier
type: NamedIndividual
is level7 segment of: NGL Pipelines & Services
is contemporary version of: http://data.ga-group.nl/ics/bics/13101012101112
is version of: http://data.ga-group.nl/ics/bics/13101012101112
replaces: http://data.ga-group.nl/ics/bics/2020/13101012101112
imported on: 2026-06-08T13:40:52.236Z
last refreshed on: 2026-06-08T13:41:38.450Z
source accessed on: 2024-06-05T14:42:36Z
source last accessed on: 2024-06-05T14:42:36Z
label: Condotte liquidi gas nat @it
label: Ductos de gas natural licuado @es
label: Dutos de líquidos de gás nat @pt
label: Erdgaskondensat-Pipelines @de
label: Pipelines LGN @fr
label: Трубопроводы для СПГ @ru
label: 天然气凝析液管道 @zh
label: 天然氣凝結油管線 @zh-hant
label: 天然ｶﾞｽ液ﾊﾟｲﾌﾟﾗｲﾝ @ja
label: 천연가스액체 파이프라인 @ko
definition: This segment includes companies that own and operate pipelines for natural gas liquids. These companies utilize their distribution network to link raw natural gas processing plants to NGL fractionation plants.
notation: 13101012101112
valid from: 2024-06-07

NGL Pipelines & Services
type: BicsLevel6Segment
type: Classifier
type: NamedIndividual
is level6 segment of: Oil & Liquid Rich Gas Pipelines
is contemporary version of: http://data.ga-group.nl/ics/bics/131010121011
is version of: http://data.ga-group.nl/ics/bics/131010121011
replaces: http://data.ga-group.nl/ics/bics/2020/131010121011
imported on: 2026-06-08T13:40:52.236Z
last refreshed on: 2026-06-08T13:41:38.450Z
source accessed on: 2024-06-05T14:42:36Z
source last accessed on: 2024-06-05T14:42:36Z
label: Condotte e servizi GNL @it
label: Gasoductos y servicios GNL @es
label: NGL Pipelines & Dienste @de
label: NGL 파이프라인 & 서비스 @ko
label: NGL管道与服务 @zh
label: Oleodutos e serv LGN @pt
label: Pipelines et services GNL @fr
label: ГКЖ-Трубопроводы и услуги @ru
label: 天然氣凝結油管線及服務 @zh-hant
label: 天然ｶﾞｽ液(NGL)ﾊﾟｲﾌﾟﾗｲﾝ･ｻｰﾋﾞｽ @ja
definition: This segment includes companies that transport, store, and process raw natural gas and their NGL byproducts.
notation: 131010121011
valid from: 2024-06-07

Oil & Liquid Rich Gas Pipelines
type: BicsLevel5Segment
type: Classifier
type: NamedIndividual
is level5 segment of: Midstream - Oil & Gas
is contemporary version of: http://data.ga-group.nl/ics/bics/1310101210
is version of: http://data.ga-group.nl/ics/bics/1310101210
replaces: http://data.ga-group.nl/ics/bics/2020/1310101210
imported on: 2026-06-08T13:40:52.236Z
last refreshed on: 2026-06-08T13:41:38.450Z
source accessed on: 2024-06-05T14:42:36Z
source last accessed on: 2024-06-05T14:42:36Z
label: Ductos de petróleo y gas rico en líquidos @es
label: Gasdotti greggio e gas ricco liquidi @it
label: Oleodutos e gasodutos Liquid Rich @pt
label: Pipelines de gaz riche liquide/pétrole @fr
label: Öl & Flüssigkeiten Starkgas-Pipelines @de
label: Трубопроводы д/нефти и насыщ. жидкого газа @ru
label: 石油与天然气凝析液管道 @zh
label: 石油与天���气凝析液管道 @zh
label: 石油與含液天然氣管線 @zh-hant
label: 石油･ｶﾞｽ液ﾊﾟｲﾌﾟﾗｲﾝ @ja
label: 석유 & 액체가스 파이프라인 @ko
definition: This segment includes companies that own and operate pipelines and terminal facilities for oil and liquid rich gas. Also includes companies that process liquid rich gas into final end products.
notation: 1310101210
valid from: 2024-06-07

Dry Natural Gas Pipelines
type: BicsLevel5Segment
type: Classifier
type: NamedIndividual
is level5 segment of: Midstream - Oil & Gas
is contemporary version of: http://data.ga-group.nl/ics/bics/1310101211
is version of: http://data.ga-group.nl/ics/bics/1310101211
replaces: http://data.ga-group.nl/ics/bics/2020/1310101211
imported on: 2026-06-08T13:40:52.236Z
last refreshed on: 2026-06-08T13:41:38.450Z
source accessed on: 2024-06-05T14:42:36Z
source last accessed on: 2024-06-05T14:42:36Z
label: Dutos de gás natural seco @pt
label: Gasdotti gas naturale secco @it
label: Gasoductos seco @es
label: Pipelines de gaz naturel sec @fr
label: Trockenerdgas-Pipelines @de
label: Сухие газопроводы @ru
label: 天然氣運輸 @zh-hant
label: 天然ｶﾞｽﾊﾟｲﾌﾟﾗｲﾝ @ja
label: 干天然气管道 @zh
label: 건성천연가스 파이프라인 @ko
definition: This segment includes companies that own and operate pipelines for dry natural gas. These companies utilize their distribution network to link raw natural gas processing plants to utilities, liquefied natural gas (LNG) facilities, and other end users.
notation: 1310101211
valid from: 2024-06-07

LNG Liquefaction
type: BicsLevel6Segment
type: Classifier
type: NamedIndividual
is level6 segment of: Liquefied Natural Gas (LNG)
is contemporary version of: http://data.ga-group.nl/ics/bics/131010121210
is version of: http://data.ga-group.nl/ics/bics/131010121210
replaces: http://data.ga-group.nl/ics/bics/2020/131010121210
imported on: 2026-06-08T13:40:52.236Z
last refreshed on: 2026-06-08T13:41:38.450Z
source accessed on: 2024-06-05T14:42:36Z
source last accessed on: 2024-06-05T14:42:36Z
label: LNG Liquefaktion @de
label: LNG液化 @ja
label: LNG액화 @ko
label: Licuación de LNG @es
label: Liquéfaction du GNL @fr
label: Liquefação GNL @pt
label: Liquefazione GNL @it
label: Разжижение СПГ @ru
label: Ра��жижение СПГ @ru
label: 液化天然气液化 @zh
label: 液化天然氣液化 @zh-hant
definition: This segment includes companies that own or operate facilities where liquefied natural gas (LNG) is cooled to a liquid state for shipping.
notation: 131010121210
valid from: 2024-06-07

LNG Regasification
type: BicsLevel6Segment
type: Classifier
type: NamedIndividual
is level6 segment of: Liquefied Natural Gas (LNG)
is contemporary version of: http://data.ga-group.nl/ics/bics/131010121211
is version of: http://data.ga-group.nl/ics/bics/131010121211
replaces: http://data.ga-group.nl/ics/bics/2020/131010121211
imported on: 2026-06-08T13:40:52.236Z
last refreshed on: 2026-06-08T13:41:38.450Z
source accessed on: 2024-06-05T14:42:36Z
source last accessed on: 2024-06-05T14:42:36Z
label: LNG Regasifizierung @de
label: LNG再气化 @zh
label: LNG再ｶﾞｽ化 @ja
label: LNG再ｶﾞｽ��� @ja
label: LNG재기화 @ko
label: Regaseificação GNL @pt
label: Regasificación de GNL @es
label: Regazéification du GNL @fr
label: Rigassificazione GNL @it
label: Регазификация СПГ @ru
label: 液化天然氣再氣化 @zh-hant
definition: This segment includes companies that own or operate facilities where liquefied natural gas (LNG) is heated back to its gaseous state, making it ready for transmission and distribution along utility networks.
notation: 131010121211
valid from: 2024-06-07

Liquefied Natural Gas (LNG)
type: BicsLevel5Segment
type: Classifier
type: NamedIndividual
is level5 segment of: Midstream - Oil & Gas
is contemporary version of: http://data.ga-group.nl/ics/bics/1310101212
is version of: http://data.ga-group.nl/ics/bics/1310101212
replaces: http://data.ga-group.nl/ics/bics/2020/1310101212
imported on: 2026-06-08T13:40:52.236Z
last refreshed on: 2026-06-08T13:41:38.450Z
source accessed on: 2024-06-05T14:42:36Z
source last accessed on: 2024-06-05T14:42:36Z
label: Flüssigerdgas (LNG) @de
label: Gás natural liquefeito (GNL) @pt
label: Gas natural licuado (GNL) @es
label: Gas naturale liquefatto (GNL) @it
label: Gaz naturel liquéfié (GNL) @fr
label: Сжиженный природный газ (СПГ) @ru
label: 液化天然气(LNG) @zh
label: 液化天然氣(LNG) @zh-hant
label: 液化天然ｶﾞｽ(LNG) @ja
label: 액화천연가스(LNG) @ko
definition: This segment includes companies that operate infrastructure used to for the transport of natural gas in its liquified state. Includes infrastructure used for the liquification, storage, tanker loading and offloading, and regassification of liquefied natural gas (LNG).
notation: 1310101212
valid from: 2024-06-07

Midstream - Oil & Gas
type: BicsLevel4SubIndustry
type: Classifier
type: NamedIndividual
is sub industry of: Oil & Gas Supply Chain
is contemporary version of: http://data.ga-group.nl/ics/bics/13101012
is version of: http://data.ga-group.nl/ics/bics/13101012
replaces: http://data.ga-group.nl/ics/bics/2020/13101012
imported on: 2026-06-08T13:40:52.236Z
last refreshed on: 2026-06-08T13:41:38.450Z
source accessed on: 2024-06-05T14:42:36Z
source last accessed on: 2024-06-05T14:42:36Z
label: Midstream - Öl & Gas @de
label: Midstream-Greggio e gas @it
label: Midstream-Pétro/gaz nat @fr
label: Petr e gás integr @pt
label: Transporte - petróleo y gas @es
label: Нефть/Газ - Переработка @ru
label: 中游-油气 @zh
label: 中游石油及天然氣業 @zh-hant
label: 石油･ｶﾞｽﾊﾟｲﾌﾟﾗｲﾝ @ja
label: 미드스트림-석유 & 가스 @ko
definition: This industry subgroup includes companies that own and operate infrastructure used to transport oil, oil products, and natural gas. These companies may realize revenue through toll transportation and storage services or through purchasing and reselling the underlying products after transportation.
notation: 13101012
valid from: 2024-06-07

Petroleum Refining
type: BicsLevel5Segment
type: Classifier
type: NamedIndividual
is level5 segment of: Refining & Marketing
is contemporary version of: http://data.ga-group.nl/ics/bics/1310101310
is version of: http://data.ga-group.nl/ics/bics/1310101310
replaces: http://data.ga-group.nl/ics/bics/2020/1310101310
imported on: 2026-06-08T13:40:52.236Z
last refreshed on: 2026-06-08T13:41:38.450Z
source accessed on: 2024-06-05T14:42:36Z
source last accessed on: 2024-06-05T14:42:36Z
label: Petroleumraffination @de
label: Raffinage de pétrole @fr
label: Raffinaz di petrolio @it
label: Refinación petróleo @es
label: Refinaria petróelo @pt
label: Нефтепереработка @ru
label: 石油提炼 @zh
label: 石油煉製 @zh-hant
label: 石油精製 @ja
label: 석유정제 @ko
definition: This segment includes companies that own and operate refineries which produce refined petroleum product such as gasoline, liquefied petroleum gas, diesel, and kerosene. Excludes petrochemicals (see Organic Chem & Intermediates) or lubricants (see Fluid & Lubricant Additives).
notation: 1310101310
valid from: 2024-06-07

Company Owned Stations
type: BicsLevel7Segment
type: Classifier
type: NamedIndividual
is level7 segment of: Petroleum Retailers
is contemporary version of: http://data.ga-group.nl/ics/bics/13101013111010
is version of: http://data.ga-group.nl/ics/bics/13101013111010
replaces: http://data.ga-group.nl/ics/bics/2020/13101013111010
imported on: 2026-06-08T13:40:52.236Z
last refreshed on: 2026-06-08T13:41:38.450Z
source accessed on: 2024-06-05T14:42:36Z
source last accessed on: 2024-06-05T14:42:36Z
label: Distributori benzina proprietà società @it
label: Gasolineras propias de la empresa @es
label: Postos propriedade da empresa @pt
label: Stations détenues par la société @fr
label: Unternehmenseigene Tankstellen @de
label: Станции в собственности компании @ru
label: 公司油站 @zh-hant
label: 公司自有加油站 @zh
label: 公司��有加油站 @zh
label: 회사직영 주유소 @ko
label: ｶﾞｿﾘﾝｽﾀﾝﾄﾞ-元売系 @ja
definition: This segment includes companies that own and operate gas stations that are integrated with an oil and gas company. Typically, these would be retailing arms of integrated oil or petroleum refining companies.
notation: 13101013111010
valid from: 2024-06-07

Filling Stations
type: BicsLevel7Segment
type: Classifier
type: NamedIndividual
is level7 segment of: Petroleum Retailers
is contemporary version of: http://data.ga-group.nl/ics/bics/13101013111011
is version of: http://data.ga-group.nl/ics/bics/13101013111011
replaces: http://data.ga-group.nl/ics/bics/2020/13101013111011
imported on: 2026-06-08T13:40:52.236Z
last refreshed on: 2026-06-08T13:41:38.450Z
source accessed on: 2024-06-05T14:42:36Z
source last accessed on: 2024-06-05T14:42:36Z
label: Abfüllstationen @de
label: Estações de serviço @pt
label: Estaciones de servicio @es
label: Stations service @fr
label: Stazioni di servizio @it
label: Заправочн. станции @ru
label: 加油站 @zh
label: 주유소 @ko
label: ｶﾞｿﾘﾝｽﾀﾝﾄﾞ-独立系 @ja
definition: This segment includes companies that own and operate independent gas stations.
notation: 13101013111011
valid from: 2024-06-07

Petroleum Retailers
type: BicsLevel6Segment
type: Classifier
type: NamedIndividual
is level6 segment of: Petroleum Marketing
is contemporary version of: http://data.ga-group.nl/ics/bics/131010131110
is version of: http://data.ga-group.nl/ics/bics/131010131110
replaces: http://data.ga-group.nl/ics/bics/2020/131010131110
imported on: 2026-06-08T13:40:52.236Z
last refreshed on: 2026-06-08T13:41:38.450Z
source accessed on: 2024-06-05T14:42:36Z
source last accessed on: 2024-06-05T14:42:36Z
label: Comercialização gasolina @pt
label: Comercio al por menor de petróleo @es
label: Détaillants en pétrole @fr
label: Kraftstoffhändler @de
label: Rivenditori petrolio @it
label: Розничные магазины нефтепродуктов @ru
label: 石油零售 @zh-hant
label: 石油零售商 @zh
label: 석유소매업 @ko
label: ｶﾞｿﾘﾝｽﾀﾝﾄﾞ @ja
definition: This segment includes companies that retail refined petroleum products through storefront operations.
notation: 131010131110
valid from: 2024-06-07

Petroleum Wholesalers
type: BicsLevel6Segment
type: Classifier
type: NamedIndividual
is level6 segment of: Petroleum Marketing
is contemporary version of: http://data.ga-group.nl/ics/bics/131010131111
is version of: http://data.ga-group.nl/ics/bics/131010131111
replaces: http://data.ga-group.nl/ics/bics/2020/131010131111
imported on: 2026-06-08T13:40:52.236Z
last refreshed on: 2026-06-08T13:41:38.450Z
source accessed on: 2024-06-05T14:42:36Z
source last accessed on: 2024-06-05T14:42:36Z
label: Atacadistas de petróleo @pt
label: Erdölgroßhändler @de
label: Grossistes de pétrole @fr
label: Grossisti di petrolio @it
label: Mayoristas de petróleo @es
label: Опт. продавцы продукции из нефти @ru
label: 石油卸売 @ja
label: 石油批发商 @zh
label: 石油批發商 @zh-hant
label: 석유 도매업 @ko
definition: This segment includes companies that wholesale and distribute refined petroleum products. These companies do not produce their own products but instead distribute other companies' products in bulk to intermediaries in the supply chain or to commercial and industrial clients.
notation: 131010131111
valid from: 2024-06-07

Petroleum Marketing
type: BicsLevel5Segment
type: Classifier
type: NamedIndividual
is level5 segment of: Refining & Marketing
is contemporary version of: http://data.ga-group.nl/ics/bics/1310101311
is version of: http://data.ga-group.nl/ics/bics/1310101311
replaces: http://data.ga-group.nl/ics/bics/2020/1310101311
imported on: 2026-06-08T13:40:52.236Z
last refreshed on: 2026-06-08T13:41:38.450Z
source accessed on: 2024-06-05T14:42:36Z
source last accessed on: 2024-06-05T14:42:36Z
label: Márketing petróleo @es
label: Marketing pétrolier @fr
label: Marketing petróleo @pt
label: Marketing petrolio @it
label: Petroleum-Marketing @de
label: Маркетинг нефтепродуктов @ru
label: 石油营销 @zh
label: 石油行銷 @zh-hant
label: 石油販売 @ja
label: 석유판매 @ko
definition: This segment includes companies that provide distribution channels for refined petroleum products.
notation: 1310101311
valid from: 2024-06-07

Refining & Marketing
type: BicsLevel4SubIndustry
type: Classifier
type: NamedIndividual
is sub industry of: Oil & Gas Supply Chain
is contemporary version of: http://data.ga-group.nl/ics/bics/13101013
is version of: http://data.ga-group.nl/ics/bics/13101013
replaces: http://data.ga-group.nl/ics/bics/2020/13101013
imported on: 2026-06-08T13:40:52.236Z
last refreshed on: 2026-06-08T13:41:38.450Z
source accessed on: 2024-06-05T14:42:36Z
source last accessed on: 2024-06-05T14:42:36Z
label: Raffinage/marketing @fr
label: Raffinaz e marketing @it
label: Raffinierung & Marketing @de
label: Refinación/márketing @es
label: Refino e comercialização @pt
label: Нефтеперер. и маркетинг @ru
label: 提煉及行銷 @zh-hant
label: 精炼与营销 @zh
label: 精製･販売 @ja
label: 정제 & 마케팅 @ko
definition: This industry subgroup includes companies that process crude petroleum into refined petroleum products, such as gasoline and kerosene. Also includes companies that market these refined petroleum products to downstream users.
notation: 13101013
valid from: 2024-06-07

Oil & Gas Supply Chain
type: BicsLevel3Industry
type: Classifier
type: NamedIndividual
is industry of: Oil & Gas
is contemporary version of: http://data.ga-group.nl/ics/bics/131010
is version of: http://data.ga-group.nl/ics/bics/131010
replaces: http://data.ga-group.nl/ics/bics/2020/131010
imported on: 2026-06-08T13:40:52.236Z
last refreshed on: 2026-06-08T13:41:38.450Z
source accessed on: 2024-06-05T14:42:36Z
source last accessed on: 2024-06-05T14:42:36Z
label: Cadeia de fornecimento de petróleo e gás @pt
label: Cadena de suministro de petróleo y gas @es
label: Catena di approvvigionamento di petrolio e gas @it
label: Chaîne logistique pét/gaz @fr
label: Öl- & Gaslieferkette @de
label: Цепочка поставок нефти и газа @ru
label: 油气供应链 @zh
label: 石油及天然氣供應鏈 @zh-hant
label: 石油･ｶﾞｽｻﾌﾟﾗｲﾁｪｰﾝ @ja
label: 석유 및 가스 공급망 @ko
definition: This industry includes companies that extract, transport, process, wholesale, distribute, or retail fossil fuel energy resources.
notation: 131010
valid from: 2024-06-07

Onshore Drilling
type: BicsLevel5Segment
type: Classifier
type: NamedIndividual
is level5 segment of: Drilling & Drilling Support
is contemporary version of: http://data.ga-group.nl/ics/bics/1310111010
is version of: http://data.ga-group.nl/ics/bics/1310111010
replaces: http://data.ga-group.nl/ics/bics/2020/1310111010
imported on: 2026-06-08T13:40:52.236Z
last refreshed on: 2026-06-08T13:41:38.450Z
source accessed on: 2024-06-05T14:42:36Z
source last accessed on: 2024-06-05T14:42:36Z
label: Forage onshore @fr
label: Onshore-Bohrung @de
label: Perforación dom @es
label: Perfuração doméstica @pt
label: Trivellaz onshore @it
label: Наземное бурение @ru
label: 境內合約鑽井 @zh-hant
label: 沿岸採掘請負 @ja
label: 陆上钻井 @zh
label: 내륙석유청부시추 @ko
definition: This segment includes companies that drill for oil and natural gas onshore on a contract basis.
notation: 1310111010
valid from: 2024-06-07

Offshore Drilling
type: BicsLevel5Segment
type: Classifier
type: NamedIndividual
is level5 segment of: Drilling & Drilling Support
is contemporary version of: http://data.ga-group.nl/ics/bics/1310111011
is version of: http://data.ga-group.nl/ics/bics/1310111011
replaces: http://data.ga-group.nl/ics/bics/2020/1310111011
imported on: 2026-06-08T13:40:52.236Z
last refreshed on: 2026-06-08T13:41:38.450Z
source accessed on: 2024-06-05T14:42:36Z
source last accessed on: 2024-06-05T14:42:36Z
label: Forage offshore @fr
label: Offshore-Bohrung @de
label: Perforación externa @es
label: Perfuração Offshore @pt
label: Trivellaz offshore @it
label: Шельфовое бурение @ru
label: 境外合约钻井 @zh
label: 海上採掘請負 @ja
label: 海域鑽井 @zh-hant
label: 해저석유청부시추 @ko
label: ��外合约钻井 @zh
definition: This segment includes companies that drill for oil and natural gas offshore on a contract basis. These companies own and operate various drilling rigs in order to provide these services for exploration and production companies.
notation: 1310111011
valid from: 2024-06-07

Drill Support
type: BicsLevel5Segment
type: Classifier
type: NamedIndividual
is level5 segment of: Drilling & Drilling Support
is contemporary version of: http://data.ga-group.nl/ics/bics/1310111012
is version of: http://data.ga-group.nl/ics/bics/1310111012
replaces: http://data.ga-group.nl/ics/bics/2020/1310111012
imported on: 2026-06-08T13:40:52.236Z
last refreshed on: 2026-06-08T13:41:38.450Z
source accessed on: 2024-06-05T14:42:36Z
source last accessed on: 2024-06-05T14:42:36Z
label: Apoyo perf @es
label: Suporte perfuraç @pt
label: Support für Bohrungen @de
label: Support forage @fr
label: Supporto triv @it
label: Обеспечение бурения @ru
label: 採掘支援 @ja
label: 鑽井支援 @zh-hant
label: 钻井支持 @zh
label: 시추 지원 @ko
definition: This segment includes companies that provide support services for drilling operations or manufacture specialized drilling equipment. Support services include supplying oil country tubular goods, casing, drilling and completion fluids, and equipment to drilling platforms. Also includes services such as cementing, logging-while-drilling, specialty waste management, inspection, and transportation services. Specialized drilling hardware and equipment includes drill bits, reamers, and stabilizers.
notation: 1310111012
valid from: 2024-06-07

Drilling & Drilling Support
type: BicsLevel4SubIndustry
type: Classifier
type: NamedIndividual
is sub industry of: Oil & Gas Services & Equip
is contemporary version of: http://data.ga-group.nl/ics/bics/13101110
is version of: http://data.ga-group.nl/ics/bics/13101110
replaces: http://data.ga-group.nl/ics/bics/2020/13101110
imported on: 2026-06-08T13:40:52.236Z
last refreshed on: 2026-06-08T13:41:38.450Z
source accessed on: 2024-06-05T14:42:36Z
source last accessed on: 2024-06-05T14:42:36Z
label: Bohrungen und Support für Bohrungen @de
label: Forage/Support de forage @fr
label: Perforación y apoyo @es
label: Perfur e sup perfuração @pt
label: Trivellazioni e supporto @it
label: Бурение и его обеспечение @ru
label: 採掘･採掘支援 @ja
label: 鑽井及鑽井支援 @zh-hant
label: 钻井与钻井支持 @zh
label: 시추 및 시추지원 @ko
definition: This industry subgroup includes companies that provide contract drilling services or provide support services for drilling operations and drilling platforms.
notation: 13101110
valid from: 2024-06-07

Onshore Oilfield Services
type: BicsLevel5Segment
type: Classifier
type: NamedIndividual
is level5 segment of: Oilfield Services & Equipment
is contemporary version of: http://data.ga-group.nl/ics/bics/1310111110
is version of: http://data.ga-group.nl/ics/bics/1310111110
replaces: http://data.ga-group.nl/ics/bics/2020/1310111110
imported on: 2026-06-08T13:40:52.236Z
last refreshed on: 2026-06-08T13:41:38.450Z
source accessed on: 2024-06-05T14:42:36Z
source last accessed on: 2024-06-05T14:42:36Z
label: Onshore Ölfelddienste @de
label: Serviços de campo de petróleo onshore @pt
label: Servicios de yacimientos de petróleo @es
label: Servizi campi petr onshore @it
label: Srvc chps pétrolifères onshore @fr
label: Оншорные нефтесервисы @ru
label: 境內油田服務 @zh-hant
label: 陆地油田服务 @zh
label: 陸上油田ｻｰﾋﾞｽ @ja
label: 육상 유전 서비스 @ko
definition: This segment includes companies that provide oilfield services and equipment in onshore applications.
notation: 1310111110
valid from: 2024-06-07

Subsea & Offshore Oilfield Svcs
type: BicsLevel5Segment
type: Classifier
type: NamedIndividual
is level5 segment of: Oilfield Services & Equipment
is contemporary version of: http://data.ga-group.nl/ics/bics/1310111111
is version of: http://data.ga-group.nl/ics/bics/1310111111
replaces: http://data.ga-group.nl/ics/bics/2020/1310111111
imported on: 2026-06-08T13:40:52.236Z
last refreshed on: 2026-06-08T13:41:38.450Z
source accessed on: 2024-06-05T14:42:36Z
source last accessed on: 2024-06-05T14:42:36Z
label: Serv campi petr sottomar offsh @it
label: Serv campos petrolíferos submarinos e offshore @pt
label: Serv petr submarinos/alta mar @es
label: Srvc chps pétro ss-mar/offsh @fr
label: Unterw. & Offsh. Ölfelddienste @de
label: Подводн. и онш. нефтесервисы @ru
label: 海底与海上油田服务 @zh
label: 海底油田服務 @zh-hant
label: 海底･ｵﾌｼｮｱ油田ｻｰﾋﾞｽ @ja
label: 해저 유전 서비스 @ko
definition: This segment includes companies that provide oilfield services and equipment in offshore and subsea applications. Includes underwater installation, inspection, repair, and decommissioning services of subsea pipelines, wells, and umbilicals.
notation: 1310111111
valid from: 2024-06-07

Seismic Surveying
type: BicsLevel5Segment
type: Classifier
type: NamedIndividual
is level5 segment of: Oilfield Services & Equipment
is contemporary version of: http://data.ga-group.nl/ics/bics/1310111112
is version of: http://data.ga-group.nl/ics/bics/1310111112
replaces: http://data.ga-group.nl/ics/bics/2020/1310111112
imported on: 2026-06-08T13:40:52.236Z
last refreshed on: 2026-06-08T13:41:38.450Z
source accessed on: 2024-06-05T14:42:36Z
source last accessed on: 2024-06-05T14:42:36Z
label: Agrimensura sísmica @es
label: Etude sismique @fr
label: Rilevazione sismico @it
label: Seismische Vermessg @de
label: Сейсморазведка @ru
label: 地震勘测-油气 @zh
label: 地震探鉱 @ja
label: 油氣震測探勘 @zh-hant
label: 탄성파탐사 @ko
definition: This segment includes companies that survey oil and natural gas fields through seismic technology.
notation: 1310111112
valid from: 2024-06-07

Oilfield Services & Equipment
type: BicsLevel4SubIndustry
type: Classifier
type: NamedIndividual
is sub industry of: Oil & Gas Services & Equip
is contemporary version of: http://data.ga-group.nl/ics/bics/13101111
is version of: http://data.ga-group.nl/ics/bics/13101111
replaces: http://data.ga-group.nl/ics/bics/2020/13101111
imported on: 2026-06-08T13:40:52.236Z
last refreshed on: 2026-06-08T13:41:38.450Z
source accessed on: 2024-06-05T14:42:36Z
source last accessed on: 2024-06-05T14:42:36Z
label: Serv e app campi petroliferi @it
label: Serv y eq de yacimientos petrolíferos @es
label: Serviços e equipamento de campo de petróleo @pt
label: Services et équipements pour champs pétroliers @fr
label: Ölfelddienste & Equipment @de
label: Нефтепромысловые услуги и оборудование @ru
label: 油田服务与设备 @zh
label: 油田服務及設備製造 @zh-hant
label: 油田ｻｰﾋﾞｽ･設備 @ja
label: 유전 서비스 & 장비 @ko
definition: This industry subgroup includes companies that provide services or manufacture equipment for non-drilling applications. Includes services such as well servicing and maintenance, fluid handling, snubbing, coiled-tubing, pressure pumping, wire-line, artificial lift, and production testing. Also includes suppliers or manufacturers of subsea, completion, and surface equipment and hydraulic fracturing proppants.
notation: 13101111
valid from: 2024-06-07

Oil & Gas Services & Equip
type: BicsLevel3Industry
type: Classifier
type: NamedIndividual
is industry of: Oil & Gas
is contemporary version of: http://data.ga-group.nl/ics/bics/131011
is version of: http://data.ga-group.nl/ics/bics/131011
replaces: http://data.ga-group.nl/ics/bics/2020/131011
imported on: 2026-06-08T13:40:52.236Z
last refreshed on: 2026-06-08T13:41:38.450Z
source accessed on: 2024-06-05T14:42:36Z
source last accessed on: 2024-06-05T14:42:36Z
label: Serv e app petrolio e gas @it
label: Serv e equip de petróleo e gás @pt
label: Serv et équip pétrole et gaz @fr
label: Servs y eq de petr/gas @es
label: Öl & Gas, Dienste & Equipm. @de
label: Нефть и газ: услуги и оборуд. @ru
label: 石油与天然气服务与设备 @zh
label: 石油及天然氣服務及設備 @zh-hant
label: 石油･ｶﾞｽｻｰﾋﾞｽ･設備 @ja
label: 石油･ｶﾞ��ｻｰﾋﾞｽ･設備 @ja
label: 석유 & 가스 서비스 & 장비 @ko
definition: This industry includes companies that specialize in providing support services or manufacture equipment for oil and natural gas exploration and production companies.
notation: 131011
valid from: 2024-06-07

Oil & Gas
type: BicsLevel2IndustryGroup
type: Classifier
type: NamedIndividual
is industry group of: Energy
is contemporary version of: http://data.ga-group.nl/ics/bics/1310
is version of: http://data.ga-group.nl/ics/bics/1310
replaces: http://data.ga-group.nl/ics/bics/2020/1310
imported on: 2026-06-08T13:40:52.236Z
last refreshed on: 2026-06-08T13:41:38.450Z
source accessed on: 2024-06-05T14:42:36Z
source last accessed on: 2024-06-05T14:42:36Z
label: Pétrole et gaz @fr
label: Petróleo e gás @pt
label: Petróleo y gas @es
label: Petrolio e gas @it
label: Öl & Gas @de
label: Нефть и газ @ru
label: 石油及天然氣 @zh-hant
label: 石油和天然气 @zh
label: 石油･ｶﾞｽ @ja
label: 석유 & 가스 @ko
definition: This industry group includes companies involved in the extraction and processing of fossil fuel resources.
notation: 1310
valid from: 2024-06-07

Biofuel Feedstock Suppliers
type: BicsLevel5Segment
type: Classifier
type: NamedIndividual
is level5 segment of: Biofuels
is contemporary version of: http://data.ga-group.nl/ics/bics/1311101010
is version of: http://data.ga-group.nl/ics/bics/1311101010
replaces: http://data.ga-group.nl/ics/bics/2020/1311101010
imported on: 2026-06-08T13:40:52.236Z
last refreshed on: 2026-06-08T13:41:38.450Z
source accessed on: 2024-06-05T14:42:36Z
source last accessed on: 2024-06-05T14:42:36Z
label: Ausgangsmateriallieferant - Biokraftstoff @de
label: Fornecedores de matéria-prima para biocombustível @pt
label: Fornitori prod interm biofuel @it
label: Fournisseurs de biocarburant @fr
label: Proveedores de piensos de biocarburante @es
label: Поставщики сырья для произв-ва биотоплива @ru
label: 生化燃料進料供應商 @zh-hant
label: 生物燃料原料供应商 @zh
label: 바이오연료 공급원료 공급업체 @ko
label: ﾊﾞｲｵ燃料原料ｻﾌﾟﾗｲﾔｰ @ja
definition: This segment includes companies that produce raw material feedstock for biofuel production.
notation: 1311101010
valid from: 2024-06-07

Diesel Substitutes
type: BicsLevel5Segment
type: Classifier
type: NamedIndividual
is level5 segment of: Biofuels
is contemporary version of: http://data.ga-group.nl/ics/bics/1311101011
is version of: http://data.ga-group.nl/ics/bics/1311101011
replaces: http://data.ga-group.nl/ics/bics/2020/1311101011
imported on: 2026-06-08T13:40:52.236Z
last refreshed on: 2026-06-08T13:41:38.450Z
source accessed on: 2024-06-05T14:42:36Z
source last accessed on: 2024-06-05T14:42:36Z
label: Dieselersatz @de
label: Substitutos do diesel @pt
label: Substituts de diesel @fr
label: Succedanei diesel @it
label: Sustitutos de diesel @es
label: Заменители дизеля @ru
label: 柴油代用品 @zh-hant
label: 柴油替代品 @zh
label: 디젤유 대체품 @ko
label: ﾃﾞｨｰｾﾞﾙ代替物 @ja
definition: This segment includes companies that produce diesel substitutes primarily from vegetable oil or animal fats.
notation: 1311101011
valid from: 2024-06-07

Gasoline Substitutes
type: BicsLevel5Segment
type: Classifier
type: NamedIndividual
is level5 segment of: Biofuels
is contemporary version of: http://data.ga-group.nl/ics/bics/1311101012
is version of: http://data.ga-group.nl/ics/bics/1311101012
replaces: http://data.ga-group.nl/ics/bics/2020/1311101012
imported on: 2026-06-08T13:40:52.236Z
last refreshed on: 2026-06-08T13:41:38.450Z
source accessed on: 2024-06-05T14:42:36Z
source last accessed on: 2024-06-05T14:42:36Z
label: Benzinersatz @de
label: Substitutos da gasolina @pt
label: Substituts d'essence @fr
label: Succedanei benzina @it
label: Sustitutos de gasolina @es
label: Заменители бензина @ru
label: 汽油代用品 @zh-hant
label: 汽油替代品 @zh
label: 휘발유 대체품 @ko
label: ｶﾞｿﾘﾝ代替物 @ja
definition: This segment includes companies that produce ethanol fuel additives, typically made from corn or sugar.
notation: 1311101012
valid from: 2024-06-07

Biofuels
type: BicsLevel4SubIndustry
type: Classifier
type: NamedIndividual
is sub industry of: Renewable Energy
is contemporary version of: http://data.ga-group.nl/ics/bics/13111010
is version of: http://data.ga-group.nl/ics/bics/13111010
replaces: http://data.ga-group.nl/ics/bics/2020/13111010
imported on: 2026-06-08T13:40:52.236Z
last refreshed on: 2026-06-08T13:41:38.450Z
source accessed on: 2024-06-05T14:42:36Z
source last accessed on: 2024-06-05T14:42:36Z
label: Biocarburantes @es
label: Biocarburants @fr
label: Biocombustíveis @pt
label: Biofuel @it
label: Biokraftstoff @de
label: Биотопливо @ru
label: 生物燃料 @zh
label: 生質燃料 @zh-hant
label: 바이오연료 @ko
label: ﾊﾞｲｵ燃料 @ja
definition: This industry subgroup includes companies that produce fuel by using renewable resources rather than fossil fuels.
notation: 13111010
valid from: 2024-06-07

Polysilicon
type: BicsLevel6Segment
type: Classifier
type: NamedIndividual
is level6 segment of: Solar Energy Equipment
is contemporary version of: http://data.ga-group.nl/ics/bics/131110111010
is version of: http://data.ga-group.nl/ics/bics/131110111010
replaces: http://data.ga-group.nl/ics/bics/2020/131110111010
imported on: 2026-06-08T13:40:52.236Z
last refreshed on: 2026-06-08T13:41:38.450Z
source accessed on: 2024-06-05T14:42:36Z
source last accessed on: 2024-06-05T14:42:36Z
label: Polisilicio @es
label: Polissilícios @pt
label: Polysilicium @fr
label: Polysilikon @de
label: Silicio policristallino @it
label: Поликремний @ru
label: 多晶矽 @zh-hant
label: 多晶硅 @zh
label: 폴리실리콘 @ko
label: ﾎﾟﾘｼﾘｺﾝ @ja
definition: This segment includes companies that manufacture polysilicon feedstock for solar energy equipment.
notation: 131110111010
valid from: 2024-06-07

PV Cells
type: BicsLevel6Segment
type: Classifier
type: NamedIndividual
is level6 segment of: Solar Energy Equipment
is contemporary version of: http://data.ga-group.nl/ics/bics/131110111011
is version of: http://data.ga-group.nl/ics/bics/131110111011
replaces: http://data.ga-group.nl/ics/bics/2020/131110111011
imported on: 2026-06-08T13:40:52.236Z
last refreshed on: 2026-06-08T13:41:38.450Z
source accessed on: 2024-06-05T14:42:36Z
source last accessed on: 2024-06-05T14:42:36Z
label: Células PV @pt
label: Cell fotov @it
label: Cellules photovoltaïques @fr
label: PV Pilas @es
label: PV 셀 @ko
label: PV-Zellen @de
label: PV電池 @zh-hant
label: PVｾﾙ @ja
label: Фотогальванические ячейки @ru
label: 光伏电池 @zh
definition: This segment includes companies that manufacture photovoltaic (PV) cells, also known as solar cells.
notation: 131110111011
valid from: 2024-06-07

PV Modules
type: BicsLevel6Segment
type: Classifier
type: NamedIndividual
is level6 segment of: Solar Energy Equipment
is contemporary version of: http://data.ga-group.nl/ics/bics/131110111012
is version of: http://data.ga-group.nl/ics/bics/131110111012
replaces: http://data.ga-group.nl/ics/bics/2020/131110111012
imported on: 2026-06-08T13:40:52.236Z
last refreshed on: 2026-06-08T13:41:38.450Z
source accessed on: 2024-06-05T14:42:36Z
source last accessed on: 2024-06-05T14:42:36Z
label: Módulos PV @pt
label: Modules photovoltaïques @fr
label: Moduli fotovoltaici @it
label: PV Módulos @es
label: PV 모듈 @ko
label: PV-Module @de
label: PV模組 @zh-hant
label: PVﾓｼﾞｭｰﾙ @ja
label: Фотогальванические модули @ru
label: 光伏组件 @zh
definition: This segment includes companies that manufacture photovoltaic (PV) modules, also known as solar modules.
notation: 131110111012
valid from: 2024-06-07

PV Wafers
type: BicsLevel6Segment
type: Classifier
type: NamedIndividual
is level6 segment of: Solar Energy Equipment
is contemporary version of: http://data.ga-group.nl/ics/bics/131110111013
is version of: http://data.ga-group.nl/ics/bics/131110111013
replaces: http://data.ga-group.nl/ics/bics/2020/131110111013
imported on: 2026-06-08T13:40:52.236Z
last refreshed on: 2026-06-08T13:41:38.450Z
source accessed on: 2024-06-05T14:42:36Z
source last accessed on: 2024-06-05T14:42:36Z
label: Circuiti fotovolt @it
label: Gaufrettes photovoltaïques @fr
label: PV Obleas @es
label: PV 웨이퍼 @ko
label: PV-Scheiben @de
label: PV晶圓 @zh-hant
label: PVｳｴﾊｰ @ja
label: Фотогальванические пластины @ru
label: 光伏晶片 @zh
definition: This segment includes companies that manufacture PV wafers used in the creation of PV cells.
notation: 131110111013
valid from: 2024-06-07

Solar Inverters
type: BicsLevel6Segment
type: Classifier
type: NamedIndividual
is level6 segment of: Solar Energy Equipment
is contemporary version of: http://data.ga-group.nl/ics/bics/131110111014
is version of: http://data.ga-group.nl/ics/bics/131110111014
replaces: http://data.ga-group.nl/ics/bics/2020/131110111014
imported on: 2026-06-08T13:40:52.236Z
last refreshed on: 2026-06-08T13:41:38.450Z
source accessed on: 2024-06-05T14:42:36Z
source last accessed on: 2024-06-05T14:42:36Z
label: Inversores solares @pt
label: Invertitori solari @it
label: Onduleurs solaires @fr
label: Solarwechselrichter @de
label: Transformador solar @es
label: Инверторы солнечной энергии @ru
label: 太阳能逆变器 @zh
label: 太陽光ｲﾝﾊﾞｰﾀｰ @ja
label: 太陽能變頻器 @zh-hant
label: 태양열 변환기 @ko
definition: This segment includes companies that manufacture inverter equipment for use with solar panel arrays.
notation: 131110111014
valid from: 2024-06-07

Solar Thermal Elec Gen Equip
type: BicsLevel6Segment
type: Classifier
type: NamedIndividual
is level6 segment of: Solar Energy Equipment
is contemporary version of: http://data.ga-group.nl/ics/bics/131110111015
is version of: http://data.ga-group.nl/ics/bics/131110111015
replaces: http://data.ga-group.nl/ics/bics/2020/131110111015
imported on: 2026-06-08T13:40:52.236Z
last refreshed on: 2026-06-08T13:41:38.450Z
source accessed on: 2024-06-05T14:42:36Z
source last accessed on: 2024-06-05T14:42:36Z
label: Equip génér élec solaire thermique @fr
label: Equipaggiamenti generaz energia elettr solare @it
label: Equipamento de geração de eletricidade termo solar @pt
label: Equipo de generación eléctrica solar termal @es
label: Solartherm. Stromerz. Equip. @de
label: Оборудование для выработки гелиотеплоэнергии @ru
label: 太阳能光热发电设备 @zh
label: 太阳能光热���电设备 @zh
label: 太陽熱発電設備 @ja
label: 太陽熱能發電設備 @zh-hant
label: 태양열 전기생산 장비 @ko
definition: This segment includes companies that manufacture solar thermal electricity generation equipment.
notation: 131110111015
valid from: 2024-06-07

Thin Film Modules
type: BicsLevel6Segment
type: Classifier
type: NamedIndividual
is level6 segment of: Solar Energy Equipment
is contemporary version of: http://data.ga-group.nl/ics/bics/131110111016
is version of: http://data.ga-group.nl/ics/bics/131110111016
replaces: http://data.ga-group.nl/ics/bics/2020/131110111016
imported on: 2026-06-08T13:40:52.236Z
last refreshed on: 2026-06-08T13:41:38.450Z
source accessed on: 2024-06-05T14:42:36Z
source last accessed on: 2024-06-05T14:42:36Z
label: Dünnfilmmodule @de
label: Módulos de filme fino @es
label: Módulos públicos de película fina @pt
label: Modules couche mince @fr
label: Moduli pellicola sottile @it
label: Тонкопленочные модули @ru
label: 薄膜模組 @zh-hant
label: 薄膜组件 @zh
label: 薄膜ﾓｼﾞｭｰﾙ @ja
label: 박막 모듈 @ko
definition: This segment includes companies that manufacture thin film photovoltaic (PV) modules, also known as thin film solar modules.
notation: 131110111016
valid from: 2024-06-07

Solar Energy Equipment
type: BicsLevel5Segment
type: Classifier
type: NamedIndividual
is level5 segment of: Renewable Energy Equipment
is contemporary version of: http://data.ga-group.nl/ics/bics/1311101110
is version of: http://data.ga-group.nl/ics/bics/1311101110
replaces: http://data.ga-group.nl/ics/bics/2020/1311101110
imported on: 2026-06-08T13:40:52.236Z
last refreshed on: 2026-06-08T13:41:38.450Z
source accessed on: 2024-06-05T14:42:36Z
source last accessed on: 2024-06-05T14:42:36Z
label: Apparecchiature energia solare @it
label: Equipamento de energia solar @pt
label: Equipements énergie solaire @fr
label: Equipo de energía solar @es
label: Solarenergie-Equipment @de
label: Оборудование д/солнечной энергии @ru
label: 太阳能设备 @zh
label: 太陽光発電設備 @ja
label: 太陽能設備 @zh-hant
label: 태양에너지 @ko
definition: This segment includes companies that manufacture equipment used to capture solar energy, such as polysilicon feedstock, photovoltaic (PV) panels, PV cells, PV modules, thin film modules, concentrated photovoltaics, crystalline silicon wafers, and related equipment.
notation: 1311101110
valid from: 2024-06-07

Wind Turbines
type: BicsLevel6Segment
type: Classifier
type: NamedIndividual
is level6 segment of: Wind Energy Equipment
is contemporary version of: http://data.ga-group.nl/ics/bics/131110111110
is version of: http://data.ga-group.nl/ics/bics/131110111110
replaces: http://data.ga-group.nl/ics/bics/2020/131110111110
imported on: 2026-06-08T13:40:52.236Z
last refreshed on: 2026-06-08T13:41:38.450Z
source accessed on: 2024-06-05T14:42:36Z
source last accessed on: 2024-06-05T14:42:36Z
label: Turbina eólica @pt
label: Turbinas eólicas @es
label: Turbine eoliche @it
label: Turbines éoliennes @fr
label: Windturbinen @de
label: Ветряные турбины @ru
label: 風力渦輪機 @zh-hant
label: 風力ﾀｰﾋﾞﾝ @ja
label: 风机 @zh
label: 풍력터빈 @ko
definition: This segment includes companies that manufacture wind turbines. Excludes companies that only manufacture specific parts of wind turbines (see "Wind Turbine Components").
notation: 131110111110
valid from: 2024-06-07

Wind Turbine Components
type: BicsLevel6Segment
type: Classifier
type: NamedIndividual
is level6 segment of: Wind Energy Equipment
is contemporary version of: http://data.ga-group.nl/ics/bics/131110111111
is version of: http://data.ga-group.nl/ics/bics/131110111111
replaces: http://data.ga-group.nl/ics/bics/2020/131110111111
imported on: 2026-06-08T13:40:52.236Z
last refreshed on: 2026-06-08T13:41:38.450Z
source accessed on: 2024-06-05T14:42:36Z
source last accessed on: 2024-06-05T14:42:36Z
label: Componentes de turbinas de viento @es
label: Componentes turbina eólica @pt
label: Componenti turbine eoliche @it
label: Composants de turbines éoliennes @fr
label: Windturbinenkomponenten @de
label: Компоненты ветротурбины @ru
label: 風力渦輪機組件 @zh-hant
label: 風力ﾀｰﾋﾞﾝ部品 @ja
label: 风力机组件 @zh
label: 풍력터빈부품 @ko
definition: This segment includes companies that manufacture components for wind turbines, such as bearings, blades, gearboxes, generators, pitch systems, towers, and tower foundations.
notation: 131110111111
valid from: 2024-06-07

Wind Energy Equipment
type: BicsLevel5Segment
type: Classifier
type: NamedIndividual
is level5 segment of: Renewable Energy Equipment
is contemporary version of: http://data.ga-group.nl/ics/bics/1311101111
is version of: http://data.ga-group.nl/ics/bics/1311101111
replaces: http://data.ga-group.nl/ics/bics/2020/1311101111
imported on: 2026-06-08T13:40:52.236Z
last refreshed on: 2026-06-08T13:41:38.450Z
source accessed on: 2024-06-05T14:42:36Z
source last accessed on: 2024-06-05T14:42:36Z
label: Apparecchiatura energia eolica @it
label: Equipamento para energia eólica @pt
label: Equipements pour énergie éolienne @fr
label: Equipo de energía eólica @es
label: Windenergie, Equipment @de
label: Оборудование для ветровой энергии @ru
label: 風力発電設備 @ja
label: 風力能源 @zh-hant
label: 风能设备 @zh
label: 풍력에너지 장비 @ko
label: 풍력에너지 ���비 @ko
definition: This segment includes companies that manufacture equipment used to capture wind energy, such as wind-power generation machinery, towers, and components.
notation: 1311101111
valid from: 2024-06-07

Geothermal Energy Equipment
type: BicsLevel5Segment
type: Classifier
type: NamedIndividual
is level5 segment of: Renewable Energy Equipment
is contemporary version of: http://data.ga-group.nl/ics/bics/1311101112
is version of: http://data.ga-group.nl/ics/bics/1311101112
replaces: http://data.ga-group.nl/ics/bics/2020/1311101112
imported on: 2026-06-08T13:40:52.236Z
last refreshed on: 2026-06-08T13:41:38.450Z
source accessed on: 2024-06-05T14:42:36Z
source last accessed on: 2024-06-05T14:42:36Z
label: Equipagg energia geotermica @it
label: Equipamento de energia geotérmica @pt
label: Equipements énergie géothermique @fr
label: Equipo de energía geotermal @es
label: Geothermisches Energie-Equipment @de
label: Геотермальная энергия-Оборудование @ru
label: 地热能源设备 @zh
label: 地熱発電設備 @ja
label: 地熱能源設備 @zh-hant
label: 지열에너지 장비 @ko
definition: This segment includes companies that manufacture equipment used to capture geothermal energy, such as thermoelectric generators and other geothermal energy components.
notation: 1311101112
valid from: 2024-06-07

Hydro Energy Equipment
type: BicsLevel5Segment
type: Classifier
type: NamedIndividual
is level5 segment of: Renewable Energy Equipment
is contemporary version of: http://data.ga-group.nl/ics/bics/1311101113
is version of: http://data.ga-group.nl/ics/bics/1311101113
replaces: http://data.ga-group.nl/ics/bics/2020/1311101113
imported on: 2026-06-08T13:40:52.236Z
last refreshed on: 2026-06-08T13:41:38.450Z
source accessed on: 2024-06-05T14:42:36Z
source last accessed on: 2024-06-05T14:42:36Z
label: Equipaggiam idroenergia @it
label: Equipamento de hidroenergia @pt
label: Equipements pour hydro-électricité @fr
label: Equipo de energía hidráulica @es
label: Wasserkraft - Equipment @de
label: Гидроэнергия-Оборудование @ru
label: 水力発電設備 @ja
label: 水力能源設備 @zh-hant
label: 水力能源设备 @zh
label: 수력에너지 장비 @ko
definition: This segment includes companies that manufacture equipment used to capture energy from the storage and movement of water.
notation: 1311101113
valid from: 2024-06-07

Marine Energy Equipment
type: BicsLevel5Segment
type: Classifier
type: NamedIndividual
is level5 segment of: Renewable Energy Equipment
is contemporary version of: http://data.ga-group.nl/ics/bics/1311101114
is version of: http://data.ga-group.nl/ics/bics/1311101114
replaces: http://data.ga-group.nl/ics/bics/2020/1311101114
imported on: 2026-06-08T13:40:52.236Z
last refreshed on: 2026-06-08T13:41:38.450Z
source accessed on: 2024-06-05T14:42:36Z
source last accessed on: 2024-06-05T14:42:36Z
label: Equipagg energia marina @it
label: Equipamento de energia marítima @pt
label: Equipements d'énergie maritime @fr
label: Equipo de energía marina @es
label: Maritime Energie - Equipment @de
label: Морская энергия-Оборудование @ru
label: 海洋発電設備 @ja
label: 海洋能源設備 @zh-hant
label: 海洋能源设备 @zh
label: 海洋能源���备 @zh
label: 해양 에너지 장비 @ko
definition: This segment includes companies that manufacture equipment used to capture energy from the ocean, such as ocean thermal convertors, wave energy convertors, tidal stream turbines, and other marine energy equipment components.
notation: 1311101114
valid from: 2024-06-07

Fuel Cells
type: BicsLevel6Segment
type: Classifier
type: NamedIndividual
is level6 segment of: Other Renewable Energy Equip
is contemporary version of: http://data.ga-group.nl/ics/bics/131110111510
is version of: http://data.ga-group.nl/ics/bics/131110111510
replaces: http://data.ga-group.nl/ics/bics/2020/131110111510
imported on: 2026-06-08T13:40:52.236Z
last refreshed on: 2026-06-08T13:41:38.450Z
source accessed on: 2024-06-05T14:42:36Z
source last accessed on: 2024-06-05T14:42:36Z
label: Brennstoffzellen @de
label: Células de combustível @pt
label: Pila a combustibile @it
label: Pilas de carburante @es
label: Piles à combustible @fr
label: Топливные элементы @ru
label: 燃料電池 @ja
label: 电动汽车电池 @zh
label: 연료전지 @ko
definition: This segment includes companies that manufacture fuel cell equipment that is primarily for industrial- or utility-scale purposes.
notation: 131110111510
valid from: 2024-06-07

Smart Grid Equipment
type: BicsLevel6Segment
type: Classifier
type: NamedIndividual
is level6 segment of: Other Renewable Energy Equip
is contemporary version of: http://data.ga-group.nl/ics/bics/131110111511
is version of: http://data.ga-group.nl/ics/bics/131110111511
replaces: http://data.ga-group.nl/ics/bics/2020/131110111511
imported on: 2026-06-08T13:40:52.236Z
last refreshed on: 2026-06-08T13:41:38.450Z
source accessed on: 2024-06-05T14:42:36Z
source last accessed on: 2024-06-05T14:42:36Z
label: Equipagg smart grid @it
label: Equipamento de rede inteligente @pt
label: Equipements de réseaux intelligents @fr
label: Equipo de la red inteligente @es
label: Intelligente Stromnetzgeräte @de
label: Оборудование 'умной сети' @ru
label: 智慧電網設備 @zh-hant
label: 智能电网设备 @zh
label: 스마트그리드 장비 @ko
label: ｽﾏｰﾄｸﾞﾘｯﾄﾞ設備 @ja
definition: This segment includes companies that manufacture equipment used to improve the efficiency of an electrical grid by interacting with software, improving monitoring, and increasing automation.
notation: 131110111511
valid from: 2024-06-07

Energy Storage Systems
type: BicsLevel6Segment
type: Classifier
type: NamedIndividual
is level6 segment of: Other Renewable Energy Equip
is contemporary version of: http://data.ga-group.nl/ics/bics/131110111512
is version of: http://data.ga-group.nl/ics/bics/131110111512
replaces: http://data.ga-group.nl/ics/bics/2020/131110111512
imported on: 2026-06-08T13:40:52.236Z
last refreshed on: 2026-06-08T13:41:38.450Z
source accessed on: 2024-06-05T14:42:36Z
source last accessed on: 2024-06-05T14:42:36Z
label: Energiespeichersysteme @de
label: Sistemas de almacenaje de energía @es
label: Sistemas de armazenamento de energia @pt
label: Sistemi stoccaggio energia @it
label: Systèmes de stockage d'énergie @fr
label: Системы для хран. энергии @ru
label: 储能系统 @zh
label: 工業用電池 @zh-hant
label: 에너지 저장 시스템 @ko
label: ｴﾈﾙｷﾞｰ貯蔵ｼｽﾃﾑ @ja
definition: This segment includes companies that manufacture industrial or utility scale systems which store captured energy for future use. Includes large scale battery banks and gravity or kinetic energy-based storage systems.
notation: 131110111512
valid from: 2024-06-07

Other Renewable Energy Equip
type: BicsLevel5Segment
type: Classifier
type: NamedIndividual
is level5 segment of: Renewable Energy Equipment
is contemporary version of: http://data.ga-group.nl/ics/bics/1311101115
is version of: http://data.ga-group.nl/ics/bics/1311101115
replaces: http://data.ga-group.nl/ics/bics/2020/1311101115
imported on: 2026-06-08T13:40:52.236Z
last refreshed on: 2026-06-08T13:41:38.450Z
source accessed on: 2024-06-05T14:42:36Z
source last accessed on: 2024-06-05T14:42:36Z
label: Altre app energia rinnovabile @it
label: Equip autres énergies renouvelables @fr
label: Otro equipo de energía renovable @es
label: Outros equip de energia renovável @pt
label: Sonstige Erneuerbare Energie Equip. @de
label: Оборуд. для других возобновл. источников энергии @ru
label: その他再生可能ｴﾈﾙｷﾞｰ設備 @ja
label: 其他再生能源設備 @zh-hant
label: 其他可再生能源设备 @zh
label: 기타 신재생에너지 장비 @ko
definition: This segment includes companies that manufacture equipment used to capture energy from renewable energy sources not elsewhere classified, as well as equipment used to improve the efficiency of electricity use and storage.
notation: 1311101115
valid from: 2024-06-07

Renewable Energy Equipment
type: BicsLevel4SubIndustry
type: Classifier
type: NamedIndividual
is sub industry of: Renewable Energy
is contemporary version of: http://data.ga-group.nl/ics/bics/13111011
is version of: http://data.ga-group.nl/ics/bics/13111011
replaces: http://data.ga-group.nl/ics/bics/2020/13111011
imported on: 2026-06-08T13:40:52.236Z
last refreshed on: 2026-06-08T13:41:38.450Z
source accessed on: 2024-06-05T14:42:36Z
source last accessed on: 2024-06-05T14:42:36Z
label: App energia rinnovabile @it
label: Eq energía renov @es
label: Equip énergie renouv @fr
label: Equip energ renov @pt
label: Erneuerbare Energiegeräte @de
label: Оборуд. возобновл. энергии @ru
label: 再生可能ｴﾈﾙｷﾞｰ設備 @ja
label: 可再生能源設備 @zh-hant
label: 可再生能源设备 @zh
label: 재생에너지 장비 @ko
definition: This industry subgroup includes companies that manufacture equipment used to capture or store power from renewable energy sources.
notation: 13111011
valid from: 2024-06-07

Biomass Plant Construction
type: BicsLevel6Segment
type: Classifier
type: NamedIndividual
is level6 segment of: Development & Construction
is contemporary version of: http://data.ga-group.nl/ics/bics/131110121010
is version of: http://data.ga-group.nl/ics/bics/131110121010
replaces: http://data.ga-group.nl/ics/bics/2020/131110121010
imported on: 2026-06-08T13:40:52.236Z
last refreshed on: 2026-06-08T13:41:38.450Z
source accessed on: 2024-06-05T14:42:36Z
source last accessed on: 2024-06-05T14:42:36Z
label: Biomasse, Anlagenbau @de
label: Construção de planta biomassa @pt
label: Construcción de plantas de biomasa @es
label: Construction d'usine biomasse @fr
label: Costruz impianti biomassa @it
label: Строительство электростанции, работающ. на биомассе @ru
label: Строительство электростанции, рабо��ающ. на биомассе @ru
label: 生物质能发电厂建设 @zh
label: 生質能廠建造 @zh-hant
label: 바이오매스 발전소 건설 @ko
label: ﾊﾞｲｵﾏｽ発電所建設 @ja
definition: This segment includes companies that develop, build, and manage biomass energy projects.
notation: 131110121010
valid from: 2024-06-07

Solar Plant Construction
type: BicsLevel6Segment
type: Classifier
type: NamedIndividual
is level6 segment of: Development & Construction
is contemporary version of: http://data.ga-group.nl/ics/bics/131110121011
is version of: http://data.ga-group.nl/ics/bics/131110121011
replaces: http://data.ga-group.nl/ics/bics/2020/131110121011
imported on: 2026-06-08T13:40:52.236Z
last refreshed on: 2026-06-08T13:41:38.450Z
source accessed on: 2024-06-05T14:42:36Z
source last accessed on: 2024-06-05T14:42:36Z
label: Construção de planta solar @pt
label: Construcción de plantas solares @es
label: Construction d'usine solaire @fr
label: Costruz impianti solari @it
label: Solaranlage, Bau @de
label: Строительство солнечной электростанции @ru
label: 太阳能发电厂建设 @zh
label: 太陽光発電所建設 @ja
label: 太陽能廠建造 @zh-hant
label: 태양열 발전소 건설 @ko
definition: This segment includes companies that develop, build, and manage solar energy projects.
notation: 131110121011
valid from: 2024-06-07

Wind Farm Construction
type: BicsLevel6Segment
type: Classifier
type: NamedIndividual
is level6 segment of: Development & Construction
is contemporary version of: http://data.ga-group.nl/ics/bics/131110121012
is version of: http://data.ga-group.nl/ics/bics/131110121012
replaces: http://data.ga-group.nl/ics/bics/2020/131110121012
imported on: 2026-06-08T13:40:52.236Z
last refreshed on: 2026-06-08T13:41:38.450Z
source accessed on: 2024-06-05T14:42:36Z
source last accessed on: 2024-06-05T14:42:36Z
label: Construção de fazenda eólica @pt
label: Construcción de plantas de viento @es
label: Construction de parc éolien @fr
label: Costruz impianti eolici @it
label: Windpark, Bau @de
label: Строительство ветроэлектростанции @ru
label: 風力発電所建設 @ja
label: 風力電廠建造 @zh-hant
label: 风力发电厂建设 @zh
label: 풍력단지 건설 @ko
definition: This segment includes companies that develop, build, and manage wind energy projects.
notation: 131110121012
valid from: 2024-06-07

Development & Construction
type: BicsLevel5Segment
type: Classifier
type: NamedIndividual
is level5 segment of: Renewable Energy Project Dev
is contemporary version of: http://data.ga-group.nl/ics/bics/1311101210
is version of: http://data.ga-group.nl/ics/bics/1311101210
replaces: http://data.ga-group.nl/ics/bics/2020/1311101210
imported on: 2026-06-08T13:40:52.236Z
last refreshed on: 2026-06-08T13:41:38.450Z
source accessed on: 2024-06-05T14:42:36Z
source last accessed on: 2024-06-05T14:42:36Z
label: Développement et construction @fr
label: Desarrollo y producción @es
label: Desenvolvimento e construção @pt
label: Erschließung & Bau @de
label: Sviluppo e costruzioni @it
label: Разработка и строительство @ru
label: 开发与建设 @zh
label: 開発･建設 @ja
label: 開發及建造 @zh-hant
label: 개발 & 건설 @ko
definition: This segment includes companies that develop, build, and manage renewable energy projects.
notation: 1311101210
valid from: 2024-06-07

Operations & Maintenance
type: BicsLevel5Segment
type: Classifier
type: NamedIndividual
is level5 segment of: Renewable Energy Project Dev
is contemporary version of: http://data.ga-group.nl/ics/bics/1311101211
is version of: http://data.ga-group.nl/ics/bics/1311101211
replaces: http://data.ga-group.nl/ics/bics/2020/1311101211
imported on: 2026-06-08T13:40:52.236Z
last refreshed on: 2026-06-08T13:41:38.450Z
source accessed on: 2024-06-05T14:42:36Z
source last accessed on: 2024-06-05T14:42:36Z
label: Betrieb & Wartung @de
label: Opérations et maintenance @fr
label: Operações e manutenção @pt
label: Operaciones y mantenimiento @es
label: Operazioni e manutenzione @it
label: Эксплуатация и обслуживание @ru
label: 營運及維護 @zh-hant
label: 经营与维修 @zh
label: 運用･保守 @ja
label: 운영 & 관리 @ko
definition: This segment includes companies that provide operations and maintenance services for renewable energy projects, including repair and day-to-day upkeep of these sites.
notation: 1311101211
valid from: 2024-06-07

Renewable Energy Project Dev
type: BicsLevel4SubIndustry
type: Classifier
type: NamedIndividual
is sub industry of: Renewable Energy
is contemporary version of: http://data.ga-group.nl/ics/bics/13111012
is version of: http://data.ga-group.nl/ics/bics/13111012
replaces: http://data.ga-group.nl/ics/bics/2020/13111012
imported on: 2026-06-08T13:40:52.236Z
last refreshed on: 2026-06-08T13:41:38.450Z
source accessed on: 2024-06-05T14:42:36Z
source last accessed on: 2024-06-05T14:42:36Z
label: Const proj energ renov @pt
label: Constr proy energía renov @es
label: Erneuerb. Energie-Projektentwickler @de
label: Imprendit progetti energie rinnovabili @it
label: Promoteurs projets d'énergie renouv @fr
label: Девелоперы проектов возобн. энергии @ru
label: Девел��перы проектов возобн. энергии @ru
label: 再生可能ｴﾈﾙｷﾞｰﾌﾟﾛｼﾞｪｸﾄ開発 @ja
label: 再生能源專案開發商 @zh-hant
label: 可再生能源项目开发商 @zh
label: 재생에너지 프로젝트 개발자 @ko
definition: This industry subgroup includes companies that develop, build, and manage renewable energy projects. Includes companies that provide operations and maintenance services.
notation: 13111012
valid from: 2024-06-07

Renewable Energy
type: BicsLevel3Industry
type: Classifier
type: NamedIndividual
is industry of: Renewable Energy
is contemporary version of: http://data.ga-group.nl/ics/bics/131110
is version of: http://data.ga-group.nl/ics/bics/131110
replaces: http://data.ga-group.nl/ics/bics/2020/131110
imported on: 2026-06-08T13:40:52.236Z
last refreshed on: 2026-06-08T13:41:38.450Z
source accessed on: 2024-06-05T14:42:36Z
source last accessed on: 2024-06-05T14:42:36Z
label: Energía renovable @es
label: Energia renovável @pt
label: Energie renouvelable @fr
label: Energie rinnovabili @it
label: Erneuerbare Energie @de
label: Возобнов. источники энергии @ru
label: 再生可能ｴﾈﾙｷﾞｰ @ja
label: 再生能源 @zh-hant
label: 可再生能源 @zh
label: 신재생에너지 @ko
definition: This industry includes companies that are involved in the extraction and capturing of renewable energy resources.
notation: 131110
valid from: 2024-06-07

Renewable Energy
type: BicsLevel2IndustryGroup
type: Classifier
type: NamedIndividual
is industry group of: Energy
is contemporary version of: http://data.ga-group.nl/ics/bics/1311
is version of: http://data.ga-group.nl/ics/bics/1311
replaces: http://data.ga-group.nl/ics/bics/2020/1311
imported on: 2026-06-08T13:40:52.236Z
last refreshed on: 2026-06-08T13:41:38.450Z
source accessed on: 2024-06-05T14:42:36Z
source last accessed on: 2024-06-05T14:42:36Z
label: Energía renovable @es
label: Energia renovável @pt
label: Energie renouvelable @fr
label: Energie rinnovabili @it
label: Erneuerbare Energie @de
label: Возобнов. источники энергии @ru
label: 再生可能ｴﾈﾙｷﾞｰ @ja
label: 再生能源 @zh-hant
label: 可再生能源 @zh
label: 신재생에너지 @ko
definition: This industry group includes companies that are involved in the extraction and capturing of renewable energy resources.
notation: 1311
valid from: 2024-06-07

Energy
type: BicsLevel1Sector
type: Classifier
type: NamedIndividual
is contemporary version of: http://data.ga-group.nl/ics/bics/13
is version of: http://data.ga-group.nl/ics/bics/13
replaces: http://data.ga-group.nl/ics/bics/2020/13
imported on: 2026-06-08T13:40:52.236Z
last refreshed on: 2026-06-08T13:41:38.450Z
source accessed on: 2024-06-05T14:42:36Z
source last accessed on: 2024-06-05T14:42:36Z
label: Energía @es
label: Energia @it
label: Energie @de
label: Энергия @ru
label: 能源 @zh
label: 에너지 @ko
label: ｴﾈﾙｷﾞｰ @ja
definition: This sector includes companies involved in extracting, capturing, or processing energy producing resources.
notation: 13
valid from: 2024-06-07

Diversified Banks
type: BicsLevel4SubIndustry
type: Classifier
type: NamedIndividual
is sub industry of: Banking
is contemporary version of: http://data.ga-group.nl/ics/bics/14101010
is version of: http://data.ga-group.nl/ics/bics/14101010
replaces: http://data.ga-group.nl/ics/bics/2020/14101010
imported on: 2026-06-08T13:40:52.236Z
last refreshed on: 2026-06-08T13:41:38.450Z
source accessed on: 2024-06-05T14:42:36Z
source last accessed on: 2024-06-05T14:42:36Z
label: Banche diversificate @it
label: Bancos divers @pt
label: Bancos diversif @es
label: Banques diversifiées @fr
label: Div. Banken @de
label: Многоотрасл. банки @ru
label: 多元化銀行 @zh-hant
label: 総合銀行 @ja
label: 综合性银行 @zh
label: 다각화은행 @ko
definition: This industry subgroup includes companies that have multinational bank operations with significant institutional brokerage operations.
notation: 14101010
valid from: 2024-06-07

Corporate Banking
type: BicsLevel5Segment
type: Classifier
type: NamedIndividual
is level5 segment of: Banks
is contemporary version of: http://data.ga-group.nl/ics/bics/1410101110
is version of: http://data.ga-group.nl/ics/bics/1410101110
replaces: http://data.ga-group.nl/ics/bics/2020/1410101110
imported on: 2026-06-08T13:40:52.236Z
last refreshed on: 2026-06-08T13:41:38.450Z
source accessed on: 2024-06-05T14:42:36Z
source last accessed on: 2024-06-05T14:42:36Z
label: Banca corporativa @es
label: Bancos corporativos @pt
label: Banques d'affaires @fr
label: Firmenkundengschäft der Banken @de
label: Корп. банк. услуги @ru
label: 企業金融 @zh-hant
label: 公司银行 @zh
label: 法人銀行 @ja
label: 기업금융 @ko
definition: This segment includes companies that accept deposits and make loans to corporations and large businesses.
notation: 1410101110
valid from: 2024-06-07

Retail Banking
type: BicsLevel5Segment
type: Classifier
type: NamedIndividual
is level5 segment of: Banks
is contemporary version of: http://data.ga-group.nl/ics/bics/1410101111
is version of: http://data.ga-group.nl/ics/bics/1410101111
replaces: http://data.ga-group.nl/ics/bics/2020/1410101111
imported on: 2026-06-08T13:40:52.236Z
last refreshed on: 2026-06-08T13:41:38.450Z
source accessed on: 2024-06-05T14:42:36Z
source last accessed on: 2024-06-05T14:42:36Z
label: Banc-varej @pt
label: Banca al por menor @es
label: Banq détail @fr
label: Privatbankwesen @de
label: Розничные банковские услуги @ru
label: 零售銀行 @zh-hant
label: 零售银行 @zh
label: 소매금융업 @ko
label: ﾘﾃｰﾙ銀行 @ja
definition: This segment includes companies that accept deposits and make loans to retail (individual) customers.
notation: 1410101111
valid from: 2024-06-07

Islamic Banking
type: BicsLevel5Segment
type: Classifier
type: NamedIndividual
is level5 segment of: Banks
is contemporary version of: http://data.ga-group.nl/ics/bics/1410101112
is version of: http://data.ga-group.nl/ics/bics/1410101112
replaces: http://data.ga-group.nl/ics/bics/2020/1410101112
imported on: 2026-06-08T13:40:52.236Z
last refreshed on: 2026-06-08T13:41:38.450Z
source accessed on: 2024-06-05T14:42:36Z
source last accessed on: 2024-06-05T14:42:36Z
label: Banca islámica @es
label: Banca islamica @it
label: Banco islâmico @pt
label: Banque islamique @fr
label: Islam. Bankwesen @de
label: Банк. система-Исламск. @ru
label: 伊斯兰银行 @zh
label: 伊斯蘭銀行 @zh-hant
label: 이슬람 은행업 @ko
label: ｲｽﾗﾑ銀行 @ja
definition: This segment includes companies that accept deposits and make loans in compliance with Sharia law.
notation: 1410101112
valid from: 2024-06-07

Banks
type: BicsLevel4SubIndustry
type: Classifier
type: NamedIndividual
is sub industry of: Banking
is contemporary version of: http://data.ga-group.nl/ics/bics/14101011
is version of: http://data.ga-group.nl/ics/bics/14101011
replaces: http://data.ga-group.nl/ics/bics/2020/14101011
imported on: 2026-06-08T13:40:52.236Z
last refreshed on: 2026-06-08T13:41:38.450Z
source accessed on: 2024-06-05T14:42:36Z
source last accessed on: 2024-06-05T14:42:36Z
label: Banche @it
label: Banco regional @pt
label: Bancos @es
label: Banken @de
label: Banques @fr
label: Банки @ru
label: 銀行 @ja
label: 银行 @zh
label: 은행 @ko
definition: This industry subgroup includes companies that accept deposits and make loans.
notation: 14101011
valid from: 2024-06-07

Banking
type: BicsLevel3Industry
type: Classifier
type: NamedIndividual
is industry of: Banking
is contemporary version of: http://data.ga-group.nl/ics/bics/141010
is version of: http://data.ga-group.nl/ics/bics/141010
replaces: http://data.ga-group.nl/ics/bics/2020/141010
imported on: 2026-06-08T13:40:52.236Z
last refreshed on: 2026-06-08T13:41:38.450Z
source accessed on: 2024-06-05T14:42:36Z
source last accessed on: 2024-06-05T14:42:36Z
label: Banca @es
label: Bankwesen @de
label: Banque @fr
label: Serviços bancários @pt
label: Servizi bancari @it
label: Банковские услуги @ru
label: 銀行 @ja
label: 银行业 @zh
label: 은행 @ko
definition: This industry includes companies that provide banking services. These companies accept deposits and use these deposits as their primary funding source for their lending activities.
notation: 141010
valid from: 2024-06-07

Banking
type: BicsLevel2IndustryGroup
type: Classifier
type: NamedIndividual
is industry group of: Financials
is contemporary version of: http://data.ga-group.nl/ics/bics/1410
is version of: http://data.ga-group.nl/ics/bics/1410
replaces: http://data.ga-group.nl/ics/bics/2020/1410
imported on: 2026-06-08T13:40:52.236Z
last refreshed on: 2026-06-08T13:41:38.450Z
source accessed on: 2024-06-05T14:42:36Z
source last accessed on: 2024-06-05T14:42:36Z
label: Banca @es
label: Bankwesen @de
label: Banque @fr
label: Serviços bancários @pt
label: Servizi bancari @it
label: Банковские услуги @ru
label: 銀行 @ja
label: 银行业 @zh
label: 은행 @ko
definition: This industry group includes companies that provide banking services. These companies accept deposits and use these deposits as their primary funding source for their lending activities.
notation: 1410
valid from: 2024-06-07

Investment Holding Companies
type: BicsLevel5Segment
type: Classifier
type: NamedIndividual
is level5 segment of: Investment Companies
is contemporary version of: http://data.ga-group.nl/ics/bics/1411101010
is version of: http://data.ga-group.nl/ics/bics/1411101010
replaces: http://data.ga-group.nl/ics/bics/2020/1411101010
imported on: 2026-06-08T13:40:52.236Z
last refreshed on: 2026-06-08T13:41:38.450Z
source accessed on: 2024-06-05T14:42:36Z
source last accessed on: 2024-06-05T14:42:36Z
label: Compañías de inversión de tenencias @es
label: Empresas holding de investimento @pt
label: Holding d'investimento @it
label: Investmentholdinggesellschaften @de
label: Sociétés de portefeuille @fr
label: Инвестиц. холдинговые компании @ru
label: 投資持株会社 @ja
label: 投資控股公司 @zh-hant
label: 投资控股公司 @zh
label: 투자지주회사 @ko
definition: This segment includes companies that hold securities of other companies for investment purposes.
notation: 1411101010
valid from: 2024-06-07

BDC
type: BicsLevel5Segment
type: Classifier
type: NamedIndividual
is level5 segment of: Investment Companies
is contemporary version of: http://data.ga-group.nl/ics/bics/1411101011
is version of: http://data.ga-group.nl/ics/bics/1411101011
replaces: http://data.ga-group.nl/ics/bics/2020/1411101011
imported on: 2026-06-08T13:40:52.236Z
last refreshed on: 2026-06-08T13:41:38.450Z
source accessed on: 2024-06-05T14:42:36Z
source last accessed on: 2024-06-05T14:42:36Z
label: BDCs
label: Sté développ commercial @fr
label: 事業開発会社(BDC) @ja
label: 事業��発会社(BDC) @ja
definition: This segment includes business development companies (BDCs). A BDC provides capital and management to primarily private small- and medium-sized companies that may not be able to obtain traditional financing. A company must qualify as a BDC. Companies with other similar structures are included.
notation: 1411101011
valid from: 2024-06-07

Cryptocurrency Investment Co
type: BicsLevel5Segment
type: Classifier
type: NamedIndividual
is level5 segment of: Investment Companies
is contemporary version of: http://data.ga-group.nl/ics/bics/1411101013
is version of: http://data.ga-group.nl/ics/bics/1411101013
imported on: 2026-06-08T13:40:52.236Z
last refreshed on: 2026-06-08T13:41:38.450Z
source accessed on: 2024-06-05T14:42:36Z
source last accessed on: 2024-06-05T14:42:36Z
label: Emp investimento criptomoedas @pt
label: Empr inversión criptomonedas @es
label: Krypto-Investmentgesellschaften @de
label: Stà d'investimento in criptovalute @it
label: Stés d'investissement en cryptodevises @fr
label: Инвестиционные компании, спец. в криптовалюте @ru
label: 仮想通貨投資会社 @ja
label: 加密貨幣投資公司 @zh-hant
label: 加密货币投资公司 @zh
label: 암호화폐 투자회사 @ko
definition: This segment includes companies that mine cryptocurrency or hold cryptocurrency as an investment.
notation: 1411101013
valid from: 2024-06-07

Investment Companies
type: BicsLevel4SubIndustry
type: Classifier
type: NamedIndividual
is sub industry of: Asset Management
is contemporary version of: http://data.ga-group.nl/ics/bics/14111010
is version of: http://data.ga-group.nl/ics/bics/14111010
replaces: http://data.ga-group.nl/ics/bics/2020/14111010
imported on: 2026-06-08T13:40:52.236Z
last refreshed on: 2026-06-08T13:41:38.450Z
source accessed on: 2024-06-05T14:42:36Z
source last accessed on: 2024-06-05T14:42:36Z
label: Compañías de inversión @es
label: Empresas de investimento @pt
label: Investmentfirmen @de
label: Sociétés d'investissement @fr
label: Società d'investimento @it
label: Инвестиционные компании @ru
label: 投資会社 @ja
label: 投資公司 @zh-hant
label: 投资公司 @zh
label: 투자기업 @ko
definition: This industry subgroup includes companies that manage and invest a company-owned portfolio for their own direct gain.
notation: 14111010
valid from: 2024-06-07

Equities
type: BicsLevel5Segment
type: Classifier
type: NamedIndividual
is level5 segment of: Investment Management
is contemporary version of: http://data.ga-group.nl/ics/bics/1411101110
is version of: http://data.ga-group.nl/ics/bics/1411101110
replaces: http://data.ga-group.nl/ics/bics/2020/1411101110
imported on: 2026-06-08T13:40:52.236Z
last refreshed on: 2026-06-08T13:41:38.450Z
source accessed on: 2024-06-05T14:42:36Z
source last accessed on: 2024-06-05T14:42:36Z
label: Ações @pt
label: Acciones @es
label: Actions @fr
label: Aktien @de
label: Azioni @it
label: Акции @ru
label: 株式 @ja
label: 股票 @zh
label: 주식 @ko
definition: This segment includes companies that provide traditional investment management services for individual and institutional investors by investing in equities.
notation: 1411101110
valid from: 2024-06-07

Fixed Income
type: BicsLevel5Segment
type: Classifier
type: NamedIndividual
is level5 segment of: Investment Management
is contemporary version of: http://data.ga-group.nl/ics/bics/1411101111
is version of: http://data.ga-group.nl/ics/bics/1411101111
replaces: http://data.ga-group.nl/ics/bics/2020/1411101111
imported on: 2026-06-08T13:40:52.236Z
last refreshed on: 2026-06-08T13:41:38.450Z
source accessed on: 2024-06-05T14:42:36Z
source last accessed on: 2024-06-05T14:42:36Z
label: Festverzinsliche @de
label: Obligataire @fr
label: Reddito Fisso @it
label: Renda fixa @pt
label: Renta Fija @es
label: Фиксированный доход @ru
label: 債券 @ja
label: 固定收益 @zh
label: 채권 @ko
definition: This segment includes companies that provide traditional investment management services for individual and institutional investors by investing in fixed income investments.
notation: 1411101111
valid from: 2024-06-07

Hedge Fund Investments
type: BicsLevel5Segment
type: Classifier
type: NamedIndividual
is level5 segment of: Investment Management
is contemporary version of: http://data.ga-group.nl/ics/bics/1411101112
is version of: http://data.ga-group.nl/ics/bics/1411101112
replaces: http://data.ga-group.nl/ics/bics/2020/1411101112
imported on: 2026-06-08T13:40:52.236Z
last refreshed on: 2026-06-08T13:41:38.450Z
source accessed on: 2024-06-05T14:42:36Z
source last accessed on: 2024-06-05T14:42:36Z
label: Hedgefonds-Investitionen @de
label: Inversiones de fondos de cobertura @es
label: Investimenti hedge fund @it
label: Investimentos de fundos hedge @pt
label: Investissements fonds de couverture @fr
label: Инвестиции хедж-фондов @ru
label: 对冲基金投资 @zh
label: 對沖基金投資 @zh-hant
label: 헤지펀드 투자 @ko
label: ﾍｯｼﾞﾌｧﾝﾄﾞ投資 @ja
definition: This segment includes companies that provide investment management services for individual and institutional investors by investing in a diverse range of assets, such as equities, bonds, and commodities. Hedge funds employ a variety of investment strategies to maintain a hedged portfolio designed to protect investors from downturns in the market and maximize returns in upward markets.
notation: 1411101112
valid from: 2024-06-07

Mixed Asset
type: BicsLevel5Segment
type: Classifier
type: NamedIndividual
is level5 segment of: Investment Management
is contemporary version of: http://data.ga-group.nl/ics/bics/1411101113
is version of: http://data.ga-group.nl/ics/bics/1411101113
replaces: http://data.ga-group.nl/ics/bics/2020/1411101113
imported on: 2026-06-08T13:40:52.236Z
last refreshed on: 2026-06-08T13:41:38.450Z
source accessed on: 2024-06-05T14:42:36Z
source last accessed on: 2024-06-05T14:42:36Z
label: Actifs mixtes @fr
label: Activo mixto @es
label: Asset misti @it
label: Ativo misto @pt
label: Gemischte Anlagen @de
label: Смешанные активы @ru
label: 混合資產 @zh-hant
label: 混合資産 @ja
label: 混合资产 @zh
label: 혼합형 자산 @ko
definition: This segment includes companies that provide traditional investment management services for individual and institutional investors by investing in a mixed asset portfolio. A mixed asset fund invests in a mix of bonds and equities to spread the investment risk.
notation: 1411101113
valid from: 2024-06-07

Investment Management
type: BicsLevel4SubIndustry
type: Classifier
type: NamedIndividual
is sub industry of: Asset Management
is contemporary version of: http://data.ga-group.nl/ics/bics/14111011
is version of: http://data.ga-group.nl/ics/bics/14111011
replaces: http://data.ga-group.nl/ics/bics/2020/14111011
imported on: 2026-06-08T13:40:52.236Z
last refreshed on: 2026-06-08T13:41:38.450Z
source accessed on: 2024-06-05T14:42:36Z
source last accessed on: 2024-06-05T14:42:36Z
label: Gerenc invest @pt
label: Gestión inversión @es
label: Gestion d'investissements @fr
label: Gestione investimento @it
label: Investmentmanagement @de
label: Управление инвестиц. @ru
label: 投資管理 @ja
label: 投资管理 @zh
label: 투자관리 @ko
definition: This industry subgroup includes companies that provide traditional investment management services for individual and institutional investors.
notation: 14111011
valid from: 2024-06-07

Co-Investments
type: BicsLevel5Segment
type: Classifier
type: NamedIndividual
is level5 segment of: Capital privado
is contemporary version of: http://data.ga-group.nl/ics/bics/1411101210
is version of: http://data.ga-group.nl/ics/bics/1411101210
replaces: http://data.ga-group.nl/ics/bics/2020/1411101210
imported on: 2026-06-08T13:40:52.236Z
last refreshed on: 2026-06-08T13:41:38.450Z
source accessed on: 2024-06-05T14:42:36Z
source last accessed on: 2024-06-05T14:42:36Z
label: Co-Investimentos @pt
label: Co-Investitionen @de
label: Co-investimenti @it
label: Co-investissements @fr
label: Coinversiones @es
label: Со-инвестиции @ru
label: 共同投資 @ja
label: 合作投資 @zh-hant
label: 联合投资 @zh
label: 공동투자 @ko
definition: This segment includes companies that invest in a co-investment asset class of private equity financial sponsors.
notation: 1411101210
valid from: 2024-06-07

Debt Investments
type: BicsLevel5Segment
type: Classifier
type: NamedIndividual
is level5 segment of: Capital privado
is contemporary version of: http://data.ga-group.nl/ics/bics/1411101211
is version of: http://data.ga-group.nl/ics/bics/1411101211
replaces: http://data.ga-group.nl/ics/bics/2020/1411101211
imported on: 2026-06-08T13:40:52.236Z
last refreshed on: 2026-06-08T13:41:38.450Z
source accessed on: 2024-06-05T14:42:36Z
source last accessed on: 2024-06-05T14:42:36Z
label: Emprunts de capitaux @fr
label: Inversiones de deuda @es
label: Investimenti debito @it
label: Investimentos de dívida @pt
label: Schulden, Investitionen @de
label: Долговые инвестиции @ru
label: 债务投资 @zh
label: 債務投資 @zh-hant
label: 特殊状況投資 @ja
label: 特殊状��投資 @ja
label: 채권투자 @ko
definition: This segment includes companies that invest in the fixed income asset class of private equity financial sponsors. These debt investments will provide rescue financing to companies undergoing operational or financial challenges.
notation: 1411101211
valid from: 2024-06-07

Fund of Funds
type: BicsLevel5Segment
type: Classifier
type: NamedIndividual
is level5 segment of: Capital privado
is contemporary version of: http://data.ga-group.nl/ics/bics/1411101212
is version of: http://data.ga-group.nl/ics/bics/1411101212
replaces: http://data.ga-group.nl/ics/bics/2020/1411101212
imported on: 2026-06-08T13:40:52.236Z
last refreshed on: 2026-06-08T13:41:38.450Z
source accessed on: 2024-06-05T14:42:36Z
source last accessed on: 2024-06-05T14:42:36Z
label: Dachfonds @de
label: Fondo de fondos @es
label: Fondo di fondi @it
label: Fonds de fonds @fr
label: Fundo de fundos @pt
label: Фонд фондов @ru
label: 組合型基金 @zh-hant
label: 综合基金 @zh
label: 재간접펀드 @ko
label: ﾌｧﾝﾄﾞｵﾌﾞﾌｧﾝｽﾞ @ja
definition: This segment includes companies that operate a fund of funds investment strategy. A fund of funds holds a portfolio composed of investments in other fund types and does not hold direct investments.
notation: 1411101212
valid from: 2024-06-07

Growth Capital
type: BicsLevel5Segment
type: Classifier
type: NamedIndividual
is level5 segment of: Capital privado
is contemporary version of: http://data.ga-group.nl/ics/bics/1411101213
is version of: http://data.ga-group.nl/ics/bics/1411101213
replaces: http://data.ga-group.nl/ics/bics/2020/1411101213
imported on: 2026-06-08T13:40:52.236Z
last refreshed on: 2026-06-08T13:41:38.450Z
source accessed on: 2024-06-05T14:42:36Z
source last accessed on: 2024-06-05T14:42:36Z
label: Capital crescimento @pt
label: Capital de crec @es
label: Capital de croiss @fr
label: Capitale crescita @it
label: Kapitalzuwachs @de
label: Рост капитала @ru
label: 成長型資本 @zh-hant
label: 成長資本 @ja
label: 成长型资本 @zh
label: 성장 자본 @ko
definition: This segment includes companies that provide growth capital investments. Typically, these are minority investments that are provided to companies that are more mature in their life-cycle development with positive cash flow. These investments may be utilized for facility expansions, product development, or equipment.
notation: 1411101213
valid from: 2024-06-07

Leveraged Buyout
type: BicsLevel5Segment
type: Classifier
type: NamedIndividual
is level5 segment of: Capital privado
is contemporary version of: http://data.ga-group.nl/ics/bics/1411101214
is version of: http://data.ga-group.nl/ics/bics/1411101214
replaces: http://data.ga-group.nl/ics/bics/2020/1411101214
imported on: 2026-06-08T13:40:52.236Z
last refreshed on: 2026-06-08T13:41:38.450Z
source accessed on: 2024-06-05T14:42:36Z
source last accessed on: 2024-06-05T14:42:36Z
label: Acquisition par emprunt @fr
label: Compra alavancada @pt
label: Inversiones apalancadas @es
label: Leverage-Buyout @de
label: Выкуп с привлеч. заемных средств @ru
label: 杠杆收购 @zh
label: 融資收購 @zh-hant
label: 차입매수 @ko
label: ﾚﾊﾞﾚｯｼﾞﾄﾞﾊﾞｲｱｳﾄ投資 @ja
definition: This segment includes companies that invest in a leveraged buyout asset class of private equity financial sponsors.
notation: 1411101214
valid from: 2024-06-07

Real Assets Investments
type: BicsLevel5Segment
type: Classifier
type: NamedIndividual
is level5 segment of: Capital privado
is contemporary version of: http://data.ga-group.nl/ics/bics/1411101215
is version of: http://data.ga-group.nl/ics/bics/1411101215
replaces: http://data.ga-group.nl/ics/bics/2020/1411101215
imported on: 2026-06-08T13:40:52.236Z
last refreshed on: 2026-06-08T13:41:38.450Z
source accessed on: 2024-06-05T14:42:36Z
source last accessed on: 2024-06-05T14:42:36Z
label: Inversiones inmobiliarias @es
label: Investimenti attivi reali @it
label: Investimentos em ativos reais @pt
label: Investissements en immobilisations @fr
label: Liegenschaften, Investitionen @de
label: Инвестиц. в реальные активы @ru
label: 实际资产投资 @zh
label: 實質資產投資 @zh-hant
label: 실물자산투자 @ko
label: ｲﾝﾌﾗ投資 @ja
definition: This segment includes companies that invest in an infrastructure asset class of private equity financial sponsors. An infrastructure investment includes transportation, water and waste, and natural resources investments.
notation: 1411101215
valid from: 2024-06-07

Real Estate Investments
type: BicsLevel5Segment
type: Classifier
type: NamedIndividual
is level5 segment of: Capital privado
is contemporary version of: http://data.ga-group.nl/ics/bics/1411101216
is version of: http://data.ga-group.nl/ics/bics/1411101216
replaces: http://data.ga-group.nl/ics/bics/2020/1411101216
imported on: 2026-06-08T13:40:52.236Z
last refreshed on: 2026-06-08T13:41:38.450Z
source accessed on: 2024-06-05T14:42:36Z
source last accessed on: 2024-06-05T14:42:36Z
label: Immobilieninvestitionen @de
label: Inversiones inmobiliarias @es
label: Investim immobiliari @it
label: Investimentos imobiliários @pt
label: Investissements immobiliers @fr
label: Инвестиции в недвижимость @ru
label: 不動產投資 @zh-hant
label: 不動産投資 @ja
label: 房地产投资 @zh
label: 부동산 투자 @ko
definition: This segment includes companies that invest in a real estate asset class of private equity financial sponsors. A real estate investment consists of equity and debt investments in property that involves an active management strategy.
notation: 1411101216
valid from: 2024-06-07

Secondary Transactions
type: BicsLevel5Segment
type: Classifier
type: NamedIndividual
is level5 segment of: Capital privado
is contemporary version of: http://data.ga-group.nl/ics/bics/1411101217
is version of: http://data.ga-group.nl/ics/bics/1411101217
replaces: http://data.ga-group.nl/ics/bics/2020/1411101217
imported on: 2026-06-08T13:40:52.236Z
last refreshed on: 2026-06-08T13:41:38.450Z
source accessed on: 2024-06-05T14:42:36Z
source last accessed on: 2024-06-05T14:42:36Z
label: Sekundäre Transaktionen @de
label: Transacciones secundarias @es
label: Transactions secondaires @fr
label: Transazioni secondarie @it
label: Ttransações secundárias @pt
label: Вторичные транзакции @ru
label: 二级市场交易 @zh
label: 次級交易 @zh-hant
label: 유통시장거래 @ko
label: ｾｶﾝﾀﾞﾘ取引投資 @ja
definition: This segment includes companies that invest in a secondary transaction asset class of private equity financial sponsors. A secondary transaction investment consists of buying and selling of preexisting investor commitments to private equity and other alternative investment funds. Types of secondary transaction investments are the sale of a limited partnership interest and the sale of a direct interest.
notation: 1411101217
valid from: 2024-06-07

Capital de risco
type: BicsLevel5Segment
type: Classifier
type: NamedIndividual
is level5 segment of: Capital privado
is contemporary version of: http://data.ga-group.nl/ics/bics/1411101218
is version of: http://data.ga-group.nl/ics/bics/1411101218
replaces: http://data.ga-group.nl/ics/bics/2020/1411101218
imported on: 2026-06-08T13:40:52.236Z
last refreshed on: 2026-06-08T13:41:38.450Z
source accessed on: 2024-06-05T14:42:36Z
source last accessed on: 2024-06-05T14:42:36Z
label: Capital riesgo @es
label: Capitale di rischio @it
label: Venture Capital
label: Венчурный капитал @ru
label: 創投 @zh-hant
label: 风险资本 @zh
label: 벤처캐피털 @ko
label: ﾍﾞﾝﾁｬｰｷｬﾋﾟﾀﾙ投資 @ja
definition: This segment includes companies that provide venture capital investments. Such investments are provided to early-stage, high-potential, high-risk, growth startup companies.
notation: 1411101218
valid from: 2024-06-07

Capital privado
type: BicsLevel4SubIndustry
type: Classifier
type: NamedIndividual
is sub industry of: Asset Management
is contemporary version of: http://data.ga-group.nl/ics/bics/14111012
is version of: http://data.ga-group.nl/ics/bics/14111012
replaces: http://data.ga-group.nl/ics/bics/2020/14111012
imported on: 2026-06-08T13:40:52.236Z
last refreshed on: 2026-06-08T13:41:38.450Z
source accessed on: 2024-06-05T14:42:36Z
source last accessed on: 2024-06-05T14:42:36Z
label: Private Equity
label: Private equity @it
label: Частн. капитал @ru
label: 私募股权 @zh
label: 私募股權 @zh-hant
label: 사모 @ko
label: ﾌﾟﾗｲﾍﾞｰﾄｴｸｲﾃｨ投資 @ja
definition: This industry subgroup includes investment firms investing in private companies. Such firms engage in leveraged buyout (LBO) transactions, private placements of securities, and ownership of private companies for investment purposes.
notation: 14111012
valid from: 2024-06-07

Financial Plan & Invst Advisory
type: BicsLevel5Segment
type: Classifier
type: NamedIndividual
is level5 segment of: Wealth Management
is contemporary version of: http://data.ga-group.nl/ics/bics/1411101310
is version of: http://data.ga-group.nl/ics/bics/1411101310
replaces: http://data.ga-group.nl/ics/bics/2020/1411101310
imported on: 2026-06-08T13:40:52.236Z
last refreshed on: 2026-06-08T13:41:38.450Z
source accessed on: 2024-06-05T14:42:36Z
source last accessed on: 2024-06-05T14:42:36Z
label: Asesoría de planeación financiera e inversión @es
label: Conseils placmt et planif financière @fr
label: Consultor de invest e plan financeiro @pt
label: Finanzplanung & InvestBeratung @de
label: Piano finanziario e consulenza invest @it
label: Фин. планирование и инвест. консультации @ru
label: 理財規劃及投資顧問 @zh-hant
label: 财务规划与投资顾问 @zh
label: 재무설계 & 투자자문 @ko
label: ﾌｧｲﾅﾝｼｬﾙﾌﾟﾗﾆﾝｸﾞ･投資ｱﾄﾞﾊﾞｲｽ @ja
definition: This segment includes companies that provide financial planning and investment advice to clients on a fee basis but do not have authority to execute trades. Financial planning involves creating and preserving personal wealth, retirement planning, and tax- and estate-planning services.
notation: 1411101310
valid from: 2024-06-07

Private Banking
type: BicsLevel5Segment
type: Classifier
type: NamedIndividual
is level5 segment of: Wealth Management
is contemporary version of: http://data.ga-group.nl/ics/bics/1411101311
is version of: http://data.ga-group.nl/ics/bics/1411101311
replaces: http://data.ga-group.nl/ics/bics/2020/1411101311
imported on: 2026-06-08T13:40:52.236Z
last refreshed on: 2026-06-08T13:41:38.450Z
source accessed on: 2024-06-05T14:42:36Z
source last accessed on: 2024-06-05T14:42:36Z
label: Banca privada @es
label: Banco priv @pt
label: Banque privée @fr
label: Privatbankwesen @de
label: Частные банковские услуги @ru
label: 私人銀行 @zh-hant
label: 私人银行 @zh
label: 프라이빗 뱅킹(PB) @ko
label: ﾌﾟﾗｲﾍﾞｰﾄﾊﾞﾝｷﾝｸﾞ @ja
definition: This segment includes companies that provide personalized banking services to high-net-worth individuals.
notation: 1411101311
valid from: 2024-06-07

Retail Securities Brokerage
type: BicsLevel5Segment
type: Classifier
type: NamedIndividual
is level5 segment of: Wealth Management
is contemporary version of: http://data.ga-group.nl/ics/bics/1411101312
is version of: http://data.ga-group.nl/ics/bics/1411101312
replaces: http://data.ga-group.nl/ics/bics/2020/1411101312
imported on: 2026-06-08T13:40:52.236Z
last refreshed on: 2026-06-08T13:41:38.450Z
source accessed on: 2024-06-05T14:42:36Z
source last accessed on: 2024-06-05T14:42:36Z
label: Brokeraggio di titoli - Retail @it
label: Corretaje de valores al por menor @es
label: Corretora de ativos no varejo @pt
label: Courtage de titres (détail) @fr
label: Retail Brokerage für Wertpapiere @de
label: Розничные брокерские операции с ЦБ @ru
label: 個人投資家向け証券仲介 @ja
label: 零售證券經紀 @zh-hant
label: 零售证券经纪 @zh
label: 소매증권 중개업 @ko
definition: This segment includes companies that provide securities brokerage services to retail investors.
notation: 1411101312
valid from: 2024-06-07

Wealth Management
type: BicsLevel4SubIndustry
type: Classifier
type: NamedIndividual
is sub industry of: Asset Management
is contemporary version of: http://data.ga-group.nl/ics/bics/14111013
is version of: http://data.ga-group.nl/ics/bics/14111013
replaces: http://data.ga-group.nl/ics/bics/2020/14111013
imported on: 2026-06-08T13:40:52.236Z
last refreshed on: 2026-06-08T13:41:38.450Z
source accessed on: 2024-06-05T14:42:36Z
source last accessed on: 2024-06-05T14:42:36Z
label: Administração bens @pt
label: Gestión patrimonio @es
label: Gestion de fortune @fr
label: Gestione patrimonio @it
label: Vermögensverwaltung @de
label: Управл. состоянием @ru
label: 財富管理 @zh-hant
label: 财富管理 @zh
label: 재산관리 @ko
label: ｳｪﾙｽﾏﾈｼﾞﾒﾝﾄ @ja
definition: This industry subgroup includes companies that specialize in managing the wealth of affluent and high-net-worth individuals. Typically, these companies behave as a one-stop shop and offer other related financial services for the convenience of their clients.
notation: 14111013
valid from: 2024-06-07

Asset Management
type: BicsLevel3Industry
type: Classifier
type: NamedIndividual
is industry of: Financial Services
is contemporary version of: http://data.ga-group.nl/ics/bics/141110
is version of: http://data.ga-group.nl/ics/bics/141110
replaces: http://data.ga-group.nl/ics/bics/2020/141110
imported on: 2026-06-08T13:40:52.236Z
last refreshed on: 2026-06-08T13:41:38.450Z
source accessed on: 2024-06-05T14:42:36Z
source last accessed on: 2024-06-05T14:42:36Z
label: Gerenc ativo @pt
label: Gestión de activos @es
label: Gestion actifs @fr
label: Vermögensverwaltung @de
label: Управление активами @ru
label: 資產管理 @zh-hant
label: 資産管理 @ja
label: 资产管理 @zh
label: 자산 운용 @ko
definition: This industry includes companies that manage investments for others.
notation: 141110
valid from: 2024-06-07

General Equip Finance & Leasing
type: BicsLevel6Segment
type: Classifier
type: NamedIndividual
is level6 segment of: Comml Equip Finance & Leasing
is contemporary version of: http://data.ga-group.nl/ics/bics/141111101010
is version of: http://data.ga-group.nl/ics/bics/141111101010
replaces: http://data.ga-group.nl/ics/bics/2020/141111101010
imported on: 2026-06-08T13:40:52.236Z
last refreshed on: 2026-06-08T13:41:38.450Z
source accessed on: 2024-06-05T14:42:36Z
source last accessed on: 2024-06-05T14:42:36Z
label: App generale finanz e leasing @it
label: Fin/crédit-bail équipement gén @fr
label: Financiamento e leasing de equip em geral @pt
label: Financiamiento y arrendamiento de equipo en general @es
label: Finanzierung & Leasing von allg. Equip. @de
label: Аренда и лизинг оборуд. общ. назначения @ru
label: 一般設備機器 金融･ﾘｰｽ @ja
label: 一般設備融資及租賃 @zh-hant
label: 通用设备融资与租赁 @zh
label: 일반장비 금융 & 리스 @ko
definition: This segment includes companies that finance or lease generic equipment with broad applications across industries.
notation: 141111101010
valid from: 2024-06-07

Ind Equip Finance & Leasing
type: BicsLevel6Segment
type: Classifier
type: NamedIndividual
is level6 segment of: Comml Equip Finance & Leasing
is contemporary version of: http://data.ga-group.nl/ics/bics/141111101011
is version of: http://data.ga-group.nl/ics/bics/141111101011
replaces: http://data.ga-group.nl/ics/bics/2020/141111101011
imported on: 2026-06-08T13:40:52.236Z
last refreshed on: 2026-06-08T13:41:38.450Z
source accessed on: 2024-06-05T14:42:36Z
source last accessed on: 2024-06-05T14:42:36Z
label: App industriale finanz e leasing @it
label: Fin/crédit-bail équipement ind @fr
label: Financiamento e leasing de equip ind @pt
label: Financiamiento y arrendamiento de equipo ind @es
label: Finanzierung & Leasing von ind. Equip. @de
label: Аренда и лизинг пром. оборуд. @ru
label: 工业设备融资与租赁 @zh
label: 工業設備融資及租賃 @zh-hant
label: 産業用設備機器 ﾘｰｽ @ja
label: 산업용장비 금융 & 리스 @ko
definition: This segment includes companies that finance or lease electrical equipment or other industrial products not elsewhere classified.
notation: 141111101011
valid from: 2024-06-07

Machinery Finance & Leasing
type: BicsLevel6Segment
type: Classifier
type: NamedIndividual
is level6 segment of: Comml Equip Finance & Leasing
is contemporary version of: http://data.ga-group.nl/ics/bics/141111101012
is version of: http://data.ga-group.nl/ics/bics/141111101012
replaces: http://data.ga-group.nl/ics/bics/2020/141111101012
imported on: 2026-06-08T13:40:52.236Z
last refreshed on: 2026-06-08T13:41:38.450Z
source accessed on: 2024-06-05T14:42:36Z
source last accessed on: 2024-06-05T14:42:36Z
label: Finance et crédit-bail de machinerie @fr
label: Financiamento e arrendamento de maquinário @pt
label: Financiamiento y arrendamiento de maquinaria @es
label: Finanz macchinari e leasing @it
label: Maschinenfinanzierung & Leasing @de
label: Финансиривание и лизинг машин. оборудования @ru
label: 机械融资租赁 @zh
label: 機械 金融･ﾘｰｽ @ja
label: 機械融資及租賃 @zh-hant
label: 기계류 금융 & 리스 @ko
definition: This segment includes companies that finance or lease machinery, including machines used for construction, farming, and mining.
notation: 141111101012
valid from: 2024-06-07

Comml Equip Finance & Leasing
type: BicsLevel5Segment
type: Classifier
type: NamedIndividual
is level5 segment of: Commercial Finance
is contemporary version of: http://data.ga-group.nl/ics/bics/1411111010
is version of: http://data.ga-group.nl/ics/bics/1411111010
replaces: http://data.ga-group.nl/ics/bics/2020/1411111010
imported on: 2026-06-08T13:40:52.236Z
last refreshed on: 2026-06-08T13:41:38.450Z
source accessed on: 2024-06-05T14:42:36Z
source last accessed on: 2024-06-05T14:42:36Z
label: App comm finanz e leasing @it
label: Financ/crédit-bail équipement comm @fr
label: Financiamento e leasing de equip comerc @pt
label: Financiamiento y arrendamiento de equipo comercial @es
label: Finanzierung & Leasing von gewerbl. Equip. @de
label: Аренда и лизинг коммерч. оборуд. @ru
label: 商业设备融资与租赁 @zh
label: 商業設備金融･ﾘｰｽ @ja
label: 商用設備融資及租賃 @zh-hant
label: 상업용장비 금융 & 리스 @ko
definition: This segment includes companies that finance or lease equipment used by commercial or industrial users. In such a situation, a contractual agreement is established and usually reached through a dealer.
notation: 1411111010
valid from: 2024-06-07

Aircraft Finance & Leasing
type: BicsLevel6Segment
type: Classifier
type: NamedIndividual
is level6 segment of: Transp Equip Finance & Leasing
is contemporary version of: http://data.ga-group.nl/ics/bics/141111101110
is version of: http://data.ga-group.nl/ics/bics/141111101110
replaces: http://data.ga-group.nl/ics/bics/2020/141111101110
imported on: 2026-06-08T13:40:52.236Z
last refreshed on: 2026-06-08T13:41:38.450Z
source accessed on: 2024-06-05T14:42:36Z
source last accessed on: 2024-06-05T14:42:36Z
label: Finance et crédit-bail d'avions @fr
label: Financiamento e arrendamento de aeronave @pt
label: Financiamiento y arrendamiento de aviones @es
label: Finanz e noleggio aerei @it
label: Flugzeugfinanzierung & -Leasing @de
label: Аренда и лизинг самолетов @ru
label: 航空機金融･ﾘｰｽ @ja
label: 飛機融資及租賃 @zh-hant
label: 飞机融资租赁 @zh
label: 항공기 금융 & 리스 @ko
definition: This segment includes companies that finance or lease aircrafts.
notation: 141111101110
valid from: 2024-06-07

Comml Veh Fin & Leasing - Electric
type: BicsLevel7Segment
type: Classifier
type: NamedIndividual
is level7 segment of: Commercial Veh Fin & Leasing
is contemporary version of: http://data.ga-group.nl/ics/bics/14111110111110
is version of: http://data.ga-group.nl/ics/bics/14111110111110
replaces: http://data.ga-group.nl/ics/bics/2020/14111110111110
imported on: 2026-06-08T13:40:52.236Z
last refreshed on: 2026-06-08T13:41:38.450Z
source accessed on: 2024-06-05T14:42:36Z
source last accessed on: 2024-06-05T14:42:36Z
label: Fin e leasing veíc comerciais - eletricidade @pt
label: Fin et crédit-bail véh comm - électricité @fr
label: Fin y arrendamiento veh com - eléctricos @es
label: Fin. & Leasing Nutzfahrzeuge - Elektrisch @de
label: Finanz e leasing veic comm - Elettrici @it
label: Фин. и лизинг коммерч. транспорта - на электричестве @ru
label: 商業用自動車金融･ﾘｰｽ-電気 @ja
label: 商用車融資及租賃-電力 @zh-hant
label: 商用车辆融资租赁-电动 @zh
label: 상업용 차량 금융 & 리스 - 전기 @ko
definition: This segment includes companies that finance or lease electric commercial vehicles.
notation: 14111110111110
valid from: 2024-06-07

Comml Veh Fin & Leasing - Fossil Fuels
type: BicsLevel7Segment
type: Classifier
type: NamedIndividual
is level7 segment of: Commercial Veh Fin & Leasing
is contemporary version of: http://data.ga-group.nl/ics/bics/14111110111111
is version of: http://data.ga-group.nl/ics/bics/14111110111111
replaces: http://data.ga-group.nl/ics/bics/2020/14111110111111
imported on: 2026-06-08T13:40:52.236Z
last refreshed on: 2026-06-08T13:41:38.450Z
source accessed on: 2024-06-05T14:42:36Z
source last accessed on: 2024-06-05T14:42:36Z
label: Fin e leasing veíc comerciais - combustíveis fósseis @pt
label: Fin et crédit-bail véh comm - combustibles fossiles @fr
label: Fin y arrendamiento veh com - combustibles fósiles @es
label: Fin. & Leasing Nutzfahrzeuge - Fossile Brennstoffe @de
label: Finanz e leasing veic comm - Combustibili fossili @it
label: Фин. и лизинг коммерч. транспорта - ископаемое топливо @ru
label: 商業用自動車金融･ﾘｰｽ-化石燃料 @ja
label: 商用車融資及租賃-化石燃料 @zh-hant
label: 商用车辆融资租赁-化石燃料 @zh
label: 상업용 차량 금융 & 리스 - 화석 연료 @ko
definition: This segment includes companies that finance or lease fossil fuel commercial vehicles.
notation: 14111110111111
valid from: 2024-06-07

Commercial Veh Fin & Leasing
type: BicsLevel6Segment
type: Classifier
type: NamedIndividual
is level6 segment of: Transp Equip Finance & Leasing
is contemporary version of: http://data.ga-group.nl/ics/bics/141111101111
is version of: http://data.ga-group.nl/ics/bics/141111101111
replaces: http://data.ga-group.nl/ics/bics/2020/141111101111
imported on: 2026-06-08T13:40:52.236Z
last refreshed on: 2026-06-08T13:41:38.450Z
source accessed on: 2024-06-05T14:42:36Z
source last accessed on: 2024-06-05T14:42:36Z
label: Finance et crédit-bail de véhicules commerciaux @fr
label: Financiamento e arrendamento de veículos comerciais @pt
label: Financiamiento y arrendamiento de vehículos comerciales @es
label: Finanz e leasing veicoli commerciali @it
label: Nutzfahrzeugfinanzierung & Leasing @de
label: Финансиривание и лизинг коммерч. автомобилей @ru
label: 商業用自動車 金融･ﾘｰｽ @ja
label: 商用車融資及租賃 @zh-hant
label: 商用车辆融资与租赁 @zh
label: 상업용 차량 금융 & 리스 @ko
definition: This segment includes companies that finance or lease commercial vehicles. In such a situation, a contractual agreement is established and usually reached through a dealer.
notation: 141111101111
valid from: 2024-06-07

Railcar Fin & Leasing - Electric
type: BicsLevel7Segment
type: Classifier
type: NamedIndividual
is level7 segment of: Railroad Car Finance & Leasing
is contemporary version of: http://data.ga-group.nl/ics/bics/14111110111210
is version of: http://data.ga-group.nl/ics/bics/14111110111210
replaces: http://data.ga-group.nl/ics/bics/2020/14111110111210
imported on: 2026-06-08T13:40:52.236Z
last refreshed on: 2026-06-08T13:41:38.450Z
source accessed on: 2024-06-05T14:42:36Z
source last accessed on: 2024-06-05T14:42:36Z
label: Fin e leasing vagão ferroviário - eletricidade @pt
label: Fin et crédit-bail de wagons - électricité @fr
label: Fin y arrendamiento vagones - eléctrico @es
label: Fin. & Leasing Eisenbahnwagen - Elektrisch @de
label: Finanz e leasing vagoni ferroviari - Elettrici @it
label: Финанс. и лизинг ж/д вагонов - на электрич. @ru
label: Финанс. и лизинг ж/д вагонов - на электри��. @ru
label: 有轨车融资与租赁-电力 @zh
label: 火車廂融資及租賃-電力 @zh-hant
label: 鉄道車両金融･ﾘｰｽ-電気 @ja
label: 철도차량 금융 & 리스 - 전기 @ko
definition: This segment includes companies that finance or lease electric railroad cars or locomotives. Electric as defined here excludes hybrids that make partial use of fossil fuels.
notation: 14111110111210
valid from: 2024-06-07

Railcar Fin & Leasing - Fossil Fuels
type: BicsLevel7Segment
type: Classifier
type: NamedIndividual
is level7 segment of: Railroad Car Finance & Leasing
is contemporary version of: http://data.ga-group.nl/ics/bics/14111110111211
is version of: http://data.ga-group.nl/ics/bics/14111110111211
replaces: http://data.ga-group.nl/ics/bics/2020/14111110111211
imported on: 2026-06-08T13:40:52.236Z
last refreshed on: 2026-06-08T13:41:38.450Z
source accessed on: 2024-06-05T14:42:36Z
source last accessed on: 2024-06-05T14:42:36Z
label: Fin e leasing vagão ferroviário - combustíveis fósseis @pt
label: Fin et crédit-bail de wagons - combustibles fossiles @fr
label: Fin y arrendamiento vagones - combustibles fósiles @es
label: Fin. & Leasing Eisenbahnwagen - Fossile Brennstoffe @de
label: Finanz e leasing vagoni ferroviari - Combustibili fossili @it
label: Финанс. и лизинг ж/д вагонов - ископаемое топливо @ru
label: 有轨车融资与租赁-化石燃料 @zh
label: 火車廂融資及租賃-化石燃料 @zh-hant
label: 鉄道車両金融･ﾘｰｽ-化石燃料 @ja
label: 철도차량 금융 & 리스 - 화석 연료 @ko
definition: This segment includes companies that finance or lease fossil fuel railroad cars or locomotives.
notation: 14111110111211
valid from: 2024-06-07

Railroad Car Finance & Leasing
type: BicsLevel6Segment
type: Classifier
type: NamedIndividual
is level6 segment of: Transp Equip Finance & Leasing
is contemporary version of: http://data.ga-group.nl/ics/bics/141111101112
is version of: http://data.ga-group.nl/ics/bics/141111101112
replaces: http://data.ga-group.nl/ics/bics/2020/141111101112
imported on: 2026-06-08T13:40:52.236Z
last refreshed on: 2026-06-08T13:41:38.450Z
source accessed on: 2024-06-05T14:42:36Z
source last accessed on: 2024-06-05T14:42:36Z
label: Finance et crédit-bail pour wagons @fr
label: Financiamento e leasing de vagão de trem @pt
label: Financiamiento y arrendamiento de trenes @es
label: Finanzierung & Leasing von Eisenbahnwaggons @de
label: Vagoni finanz e leasing @it
label: Аренда и лизинг ж/д вагонов @ru
label: 火車車廂融資及租賃 @zh-hant
label: 火车车厢融资与租赁 @zh
label: 鉄道車両金融･ﾘｰｽ @ja
label: 철도차량 금융 & 리스 @ko
definition: This segment includes companies that finance or lease railroad cars or locomotives.
notation: 141111101112
valid from: 2024-06-07

Ship & Boat Finance & Leasing
type: BicsLevel6Segment
type: Classifier
type: NamedIndividual
is level6 segment of: Transp Equip Finance & Leasing
is contemporary version of: http://data.ga-group.nl/ics/bics/141111101113
is version of: http://data.ga-group.nl/ics/bics/141111101113
replaces: http://data.ga-group.nl/ics/bics/2020/141111101113
imported on: 2026-06-08T13:40:52.236Z
last refreshed on: 2026-06-08T13:41:38.450Z
source accessed on: 2024-06-05T14:42:36Z
source last accessed on: 2024-06-05T14:42:36Z
label: Finance et crédit bail pour navires et bateaux @fr
label: Financiamento e leasing de navios e barcos @pt
label: Financiamiento y arrendamiento de barcos @es
label: Finanzierung & Leasing von Schiffen & Booten @de
label: Navi e barche finanz e leasing @it
label: Аренда и лизинг кораблей и судов @ru
label: 船只融资与租赁 @zh
label: 船舶融資及租賃 @zh-hant
label: 船舶金融･ﾘｰｽ @ja
label: 배 및 보트 금융 & 리스 @ko
definition: This segment includes companies that finance or lease boats and ships.
notation: 141111101113
valid from: 2024-06-07

Transp Equip Finance & Leasing
type: BicsLevel5Segment
type: Classifier
type: NamedIndividual
is level5 segment of: Commercial Finance
is contemporary version of: http://data.ga-group.nl/ics/bics/1411111011
is version of: http://data.ga-group.nl/ics/bics/1411111011
replaces: http://data.ga-group.nl/ics/bics/2020/1411111011
imported on: 2026-06-08T13:40:52.236Z
last refreshed on: 2026-06-08T13:41:38.450Z
source accessed on: 2024-06-05T14:42:36Z
source last accessed on: 2024-06-05T14:42:36Z
label: App trasp finanz e leasing @it
label: Fin/crédit-bail équipement transp @fr
label: Financiamento e leasing equip transp @pt
label: Financiamiento y arrendamiento de equipo de transporte @es
label: Finanzierung & Leasing von TranspEinr. @de
label: Аренда и лизинг транспор. оборуд. @ru
label: 輸送用機器金融･ﾘｰｽ @ja
label: 运输设备融资与租赁 @zh
label: 運輸設備融資及租賃 @zh-hant
label: 운송장비 금융 & 리스 @ko
definition: This segment includes companies that provide loans for purchase or contracts permitting the use of transportation such as aircraft, railroad cars, and ocean vessels.
notation: 1411111011
valid from: 2024-06-07

Commercial Finance
type: BicsLevel4SubIndustry
type: Classifier
type: NamedIndividual
is sub industry of: Specialty Finance
is contemporary version of: http://data.ga-group.nl/ics/bics/14111110
is version of: http://data.ga-group.nl/ics/bics/14111110
replaces: http://data.ga-group.nl/ics/bics/2020/14111110
imported on: 2026-06-08T13:40:52.236Z
last refreshed on: 2026-06-08T13:41:38.450Z
source accessed on: 2024-06-05T14:42:36Z
source last accessed on: 2024-06-05T14:42:36Z
label: Finan comerc @pt
label: Finan comerciales @es
label: Finance commerciale @fr
label: Finanza commerciale @it
label: Kundenkreditbank @de
label: Коммерч. финанс. @ru
label: 商业金融 @zh
label: 商業金融 @ja
label: 상업금융 @ko
definition: This industry subgroup includes companies that provide loans, factoring, and other financing to businesses. Includes the leasing of commercial, industrial, and transportation equipment.
notation: 14111110
valid from: 2024-06-07

Auto Finance - Electric
type: BicsLevel6Segment
type: Classifier
type: NamedIndividual
is level6 segment of: Auto Finance
is contemporary version of: http://data.ga-group.nl/ics/bics/141111111010
is version of: http://data.ga-group.nl/ics/bics/141111111010
replaces: http://data.ga-group.nl/ics/bics/2020/141111111010
imported on: 2026-06-08T13:40:52.236Z
last refreshed on: 2026-06-08T13:41:38.450Z
source accessed on: 2024-06-05T14:42:36Z
source last accessed on: 2024-06-05T14:42:36Z
label: Autofinanzierung - Elektrisch @de
label: Financement automobile - électricité @fr
label: Financiación de autos - eléctricos @es
label: Financiamento de automóveis - eletricidade @pt
label: Finanziamento auto - Elettriche @it
label: Авто-финансирование - на электричестве @ru
label: 汽車融資-電力 @zh-hant
label: 汽车金融-电动 @zh
label: 自動車金融-電気 @ja
label: 자동차금융 - 전기 @ko
definition: This segment includes companies that originate, service and/or collect auto loans for electric vehicles.
notation: 141111111010
valid from: 2024-06-07

Auto Finance - Fossil Fuels
type: BicsLevel6Segment
type: Classifier
type: NamedIndividual
is level6 segment of: Auto Finance
is contemporary version of: http://data.ga-group.nl/ics/bics/141111111011
is version of: http://data.ga-group.nl/ics/bics/141111111011
replaces: http://data.ga-group.nl/ics/bics/2020/141111111011
imported on: 2026-06-08T13:40:52.236Z
last refreshed on: 2026-06-08T13:41:38.450Z
source accessed on: 2024-06-05T14:42:36Z
source last accessed on: 2024-06-05T14:42:36Z
label: Autofinanzierung - Fossile Brennstoffe @de
label: Financement automobile - combustibles fossiles @fr
label: Financiación de autos - combustibles fósiles @es
label: Financiamento de automóveis - combustíveis fósseis @pt
label: Finanziamento auto - Combustibili fossili @it
label: Авто-финансирование - ископаемое топливо @ru
label: 汽車融資-化石燃料 @zh-hant
label: 汽车金融-化石燃料 @zh
label: 自動車金融-化石燃料 @ja
label: 자동차금융 - 화석 연료 @ko
definition: This segment includes companies that originate, service, and/or collect auto loans for fossil fuel vehicles.
notation: 141111111011
valid from: 2024-06-07

Auto Finance
type: BicsLevel5Segment
type: Classifier
type: NamedIndividual
is level5 segment of: Consumer Finance
is contemporary version of: http://data.ga-group.nl/ics/bics/1411111110
is version of: http://data.ga-group.nl/ics/bics/1411111110
replaces: http://data.ga-group.nl/ics/bics/2020/1411111110
imported on: 2026-06-08T13:40:52.236Z
last refreshed on: 2026-06-08T13:41:38.450Z
source accessed on: 2024-06-05T14:42:36Z
source last accessed on: 2024-06-05T14:42:36Z
label: Auto finance @fr
label: Auto-Finanz. @de
label: Finan auto @pt
label: Finanz auto @it
label: Finanzas de autos @es
label: Финансирование приобрет. автомобилей @ru
label: 汽車融資 @zh-hant
label: 汽车金融 @zh
label: 自動車金融 @ja
label: 자동차금융 @ko
definition: This segment includes companies that originate, service, and/or collect auto loans to consumers.
notation: 1411111110
valid from: 2024-06-07

Consumer Microlending
type: BicsLevel5Segment
type: Classifier
type: NamedIndividual
is level5 segment of: Consumer Finance
is contemporary version of: http://data.ga-group.nl/ics/bics/1411111111
is version of: http://data.ga-group.nl/ics/bics/1411111111
replaces: http://data.ga-group.nl/ics/bics/2020/1411111111
imported on: 2026-06-08T13:40:52.236Z
last refreshed on: 2026-06-08T13:41:38.450Z
source accessed on: 2024-06-05T14:42:36Z
source last accessed on: 2024-06-05T14:42:36Z
label: Micro-empréstimos ao consumidor @pt
label: Microcrédit à la consommation @fr
label: Micropréstamos al consumidor @es
label: Microprestito consumatore @it
label: Verbraucher-Microlending @de
label: Потребительские микрокредиты @ru
label: 消費性小額貸款 @zh-hant
label: 消費者向け小口融資 @ja
label: 消费性小额贷款 @zh
label: 소비자 소액대출 @ko
definition: This segment includes companies that provide small amount lending to consumers, including payday loans and pawn shop loans. These loans often are made to consumers who have limited access to credit, are short term in duration, have fixed fees and have easy and fast processing.
notation: 1411111111
valid from: 2024-06-07

Credit Card Lending
type: BicsLevel5Segment
type: Classifier
type: NamedIndividual
is level5 segment of: Consumer Finance
is contemporary version of: http://data.ga-group.nl/ics/bics/1411111112
is version of: http://data.ga-group.nl/ics/bics/1411111112
replaces: http://data.ga-group.nl/ics/bics/2020/1411111112
imported on: 2026-06-08T13:40:52.236Z
last refreshed on: 2026-06-08T13:41:38.450Z
source accessed on: 2024-06-05T14:42:36Z
source last accessed on: 2024-06-05T14:42:36Z
label: Empréstimos de cartão de crédito @pt
label: Kreditkartenkredite @de
label: Préstamos de tarjetas de crédito @es
label: Prêts par cartes de crédit @fr
label: Prestiti carte di credito @it
label: Кредиты по кред. картам @ru
label: 信用卡借貸 @zh-hant
label: 信用卡贷款 @zh
label: 신용카드 대출 @ko
label: ｸﾚｼﾞｯﾄｶｰﾄﾞ貸出 @ja
definition: This segment includes companies that issue credit cards.
notation: 1411111112
valid from: 2024-06-07

Student Lending
type: BicsLevel5Segment
type: Classifier
type: NamedIndividual
is level5 segment of: Consumer Finance
is contemporary version of: http://data.ga-group.nl/ics/bics/1411111113
is version of: http://data.ga-group.nl/ics/bics/1411111113
replaces: http://data.ga-group.nl/ics/bics/2020/1411111113
imported on: 2026-06-08T13:40:52.236Z
last refreshed on: 2026-06-08T13:41:38.450Z
source accessed on: 2024-06-05T14:42:36Z
source last accessed on: 2024-06-05T14:42:36Z
label: Empr estud @pt
label: Préstamos estudiantiles @es
label: Prêts étudiants @fr
label: Prestiti studenti @it
label: Studentendarlehen @de
label: Студенческое кредитование @ru
label: 学生贷款 @zh
label: 学生ﾛｰﾝ @ja
label: 學生貸款 @zh-hant
label: 학자대출업 @ko
definition: This segment includes companies that originate, service, and/or collect student loans for educational purposes.
notation: 1411111113
valid from: 2024-06-07

Consumer Finance
type: BicsLevel4SubIndustry
type: Classifier
type: NamedIndividual
is sub industry of: Specialty Finance
is contemporary version of: http://data.ga-group.nl/ics/bics/14111111
is version of: http://data.ga-group.nl/ics/bics/14111111
replaces: http://data.ga-group.nl/ics/bics/2020/14111111
imported on: 2026-06-08T13:40:52.236Z
last refreshed on: 2026-06-08T13:41:38.450Z
source accessed on: 2024-06-05T14:42:36Z
source last accessed on: 2024-06-05T14:42:36Z
label: Crédit à la conso @fr
label: Credito al consumo @it
label: Finan cons @pt
label: Finan de consumo @es
label: Privatkundengeschäft @de
label: Потреб. кредиты @ru
label: 消費者金融 @ja
label: 消費金融 @zh-hant
label: 消费金融 @zh
label: 소비자금융 @ko
definition: This industry subgroup includes companies that provide loans to consumers, including auto loans, consumer microlending, credit and debit, and student loans.
notation: 14111111
valid from: 2024-06-07

Mortgage Lenders
type: BicsLevel5Segment
type: Classifier
type: NamedIndividual
is level5 segment of: Mortgage Finance
is contemporary version of: http://data.ga-group.nl/ics/bics/1411111210
is version of: http://data.ga-group.nl/ics/bics/1411111210
replaces: http://data.ga-group.nl/ics/bics/2020/1411111210
imported on: 2026-06-08T13:40:52.236Z
last refreshed on: 2026-06-08T13:41:38.450Z
source accessed on: 2024-06-05T14:42:36Z
source last accessed on: 2024-06-05T14:42:36Z
label: Conc hipot @pt
label: Hypothekengeber @de
label: Prêteurs hypo @fr
label: Prestamistas hipotecarios @es
label: Prestatori ipoteche @it
label: Ипотечный кредитор @ru
label: 抵押貸款貸方 @zh-hant
label: 抵押贷款机构 @zh
label: 모기지대출업 @ko
label: ﾓｰｹﾞｰｼﾞ融資 @ja
definition: This segment includes companies that provide home financing, such as mortgages and home equity loans.
notation: 1411111210
valid from: 2024-06-07

Mortgage Loan Brokers
type: BicsLevel5Segment
type: Classifier
type: NamedIndividual
is level5 segment of: Mortgage Finance
is contemporary version of: http://data.ga-group.nl/ics/bics/1411111211
is version of: http://data.ga-group.nl/ics/bics/1411111211
replaces: http://data.ga-group.nl/ics/bics/2020/1411111211
imported on: 2026-06-08T13:40:52.236Z
last refreshed on: 2026-06-08T13:41:38.450Z
source accessed on: 2024-06-05T14:42:36Z
source last accessed on: 2024-06-05T14:42:36Z
label: Brokers de préstamos hipotecarios @es
label: Corretoras de empréstimos hipotecários @pt
label: Courtiers en prêts hypothécaires @fr
label: Hypothekenmakler @de
label: Mediatori prestiti ipotecari @it
label: Брокеры ипотечного кредита @ru
label: 抵押貸款經紀商 @zh-hant
label: 抵押贷款经纪人 @zh
label: 抵��貸款經紀商 @zh-hant
label: 모기지 대출 브로커 @ko
label: ﾓｰｹﾞｰｼﾞﾛｰﾝ仲介 @ja
definition: This segment includes companies that arrange home loans between borrowers and lenders on a commission or fee basis.
notation: 1411111211
valid from: 2024-06-07

Mortgage Services
type: BicsLevel5Segment
type: Classifier
type: NamedIndividual
is level5 segment of: Mortgage Finance
is contemporary version of: http://data.ga-group.nl/ics/bics/1411111212
is version of: http://data.ga-group.nl/ics/bics/1411111212
replaces: http://data.ga-group.nl/ics/bics/2020/1411111212
imported on: 2026-06-08T13:40:52.236Z
last refreshed on: 2026-06-08T13:41:38.450Z
source accessed on: 2024-06-05T14:42:36Z
source last accessed on: 2024-06-05T14:42:36Z
label: Hypothekendienste @de
label: Serv hipotecarios @es
label: Serviços hipotecários @pt
label: Servizi ipotecari @it
label: Srv prêt hypothéc @fr
label: Обслуживание ипотек @ru
label: 抵押貸款服務 @zh-hant
label: 抵押贷款服务 @zh
label: 모기지 서비스 @ko
label: ﾓｰｹﾞｰｼﾞｻｰﾋﾞｽ @ja
definition: This segment includes companies that provide mortgage services other than mortgage lending or mortgage brokerage services.
notation: 1411111212
valid from: 2024-06-07

Mortgage Insurance Premiums
type: BicsLevel6Segment
type: Classifier
type: NamedIndividual
is level6 segment of: Mortgage Insurance
is contemporary version of: http://data.ga-group.nl/ics/bics/141111121310
is version of: http://data.ga-group.nl/ics/bics/141111121310
replaces: http://data.ga-group.nl/ics/bics/2020/141111121310
imported on: 2026-06-08T13:40:52.236Z
last refreshed on: 2026-06-08T13:41:38.450Z
source accessed on: 2024-06-05T14:42:36Z
source last accessed on: 2024-06-05T14:42:36Z
label: Prêmio de seguro hipotecário @pt
label: Premi assicurazione ipotecaria @it
label: Primas hipotecarias de seguros @es
label: Primes pour assurance hypothécaire @fr
label: Versicherungsbeiträge von Hypotheken @de
label: Ипотечное страхование - премии @ru
label: 保険料-ﾓｰｹﾞｰｼﾞ @ja
label: 抵押貸款保險保費 @zh-hant
label: 抵押贷款保险保费 @zh
label: 모기지보험 보험료 @ko
definition: This segment includes revenue generated from mortgage insurance premiums.
notation: 141111121310
valid from: 2024-06-07

Investment Income - Mortg Ins
type: BicsLevel7Segment
type: Classifier
type: NamedIndividual
is level7 segment of: Mortgage Insurance Non-Prem
is contemporary version of: http://data.ga-group.nl/ics/bics/14111112131110
is version of: http://data.ga-group.nl/ics/bics/14111112131110
replaces: http://data.ga-group.nl/ics/bics/2020/14111112131110
imported on: 2026-06-08T13:40:52.236Z
last refreshed on: 2026-06-08T13:41:38.450Z
source accessed on: 2024-06-05T14:42:36Z
source last accessed on: 2024-06-05T14:42:36Z
label: Ingreso de inversión - seg hipot @es
label: Investitionsertrag - HypVers. @de
label: Produit financier - Assurance prêts hypo @fr
label: Receita de investimentos - Seg hipot @pt
label: Reddito investimento - Assic ipot @it
label: Инвестиционный доход - ипотечн. страх. @ru
label: 投資収益-ﾓｰｹﾞｰｼﾞ保険 @ja
label: 投資收入 - 抵押貸款保險 @zh-hant
label: 投资收入-抵押贷款保险 @zh
label: 투자수익-모기지보험 @ko
definition: This segment includes investment income generated from mortgage insurance.
notation: 14111112131110
valid from: 2024-06-07

Realized Gain/Loss - Mortg Ins
type: BicsLevel7Segment
type: Classifier
type: NamedIndividual
is level7 segment of: Mortgage Insurance Non-Prem
is contemporary version of: http://data.ga-group.nl/ics/bics/14111112131111
is version of: http://data.ga-group.nl/ics/bics/14111112131111
replaces: http://data.ga-group.nl/ics/bics/2020/14111112131111
imported on: 2026-06-08T13:40:52.236Z
last refreshed on: 2026-06-08T13:41:38.450Z
source accessed on: 2024-06-05T14:42:36Z
source last accessed on: 2024-06-05T14:42:36Z
label: Beneficio/Pérdida realizada - seguro hipotecario @es
label: Gains/Pertes réalisés - Assur prêts hypo @fr
label: Ganhos/perdas realizados - Seg hipot @pt
label: P/P realizzati - Assic ipot @it
label: Realisierter G/V - HypVers. @de
label: Реализованная прибыль/убытки - ипотечн. страх. @ru
label: 実現損益-ﾓｰｹﾞｰｼﾞ保険 @ja
label: 已实现损益-抵押贷款保险 @zh
label: 已實現損益 - 抵押貸款保險 @zh-hant
label: 실현손익-모기지보험 @ko
definition: This segment includes realized gains/losses generated from mortgage insurance.
notation: 14111112131111
valid from: 2024-06-07

Other Income - Mortgage Ins
type: BicsLevel7Segment
type: Classifier
type: NamedIndividual
is level7 segment of: Mortgage Insurance Non-Prem
is contemporary version of: http://data.ga-group.nl/ics/bics/14111112131112
is version of: http://data.ga-group.nl/ics/bics/14111112131112
replaces: http://data.ga-group.nl/ics/bics/2020/14111112131112
imported on: 2026-06-08T13:40:52.236Z
last refreshed on: 2026-06-08T13:41:38.450Z
source accessed on: 2024-06-05T14:42:36Z
source last accessed on: 2024-06-05T14:42:36Z
label: Altro reddito - assicurazione ipotecaria @it
label: Autres revenus - Assurance prêts hypothécaires @fr
label: Otro ingreso - Seguro hipotecario @es
label: Outras receitas - seguro de hipotecas @pt
label: Sonstiger Ertrag - Hypothekenversicherung @de
label: Прочие доход - Ипотечное страхование @ru
label: Прочие до��од - Ипотечное страхование @ru
label: その他収益-ﾓｰｹﾞｰｼﾞ保険 @ja
label: 其他收入 - 抵押貸款保險 @zh-hant
label: 其他收入-抵押贷款保险 @zh
label: 기타 수익 - 모기지 보험 @ko
definition: This segment includes other income generated from mortgage insurance.
notation: 14111112131112
valid from: 2024-06-07

Mortgage Insurance Non-Prem
type: BicsLevel6Segment
type: Classifier
type: NamedIndividual
is level6 segment of: Mortgage Insurance
is contemporary version of: http://data.ga-group.nl/ics/bics/141111121311
is version of: http://data.ga-group.nl/ics/bics/141111121311
replaces: http://data.ga-group.nl/ics/bics/2020/141111121311
imported on: 2026-06-08T13:40:52.236Z
last refreshed on: 2026-06-08T13:41:38.450Z
source accessed on: 2024-06-05T14:42:36Z
source last accessed on: 2024-06-05T14:42:36Z
label: Hypothekenversicherung, nicht Beiträge @de
label: Não prêmio de seguro hipotecário @pt
label: Non premi assic ipotecaria @it
label: Rev assur prêts hypo hors primes @fr
label: Seguro hipotecario sin prima @es
label: Ипотечное страхование - неприм. @ru
label: 保険料外収入-ﾓｰｹﾞｰｼﾞ @ja
label: 抵押貸款保險非保費收入 @zh-hant
label: 抵押贷款保险非保费 @zh
label: 모기지보험 보험료외 @ko
definition: This segment includes total non-premium revenue generated from mortgage insurance.
notation: 141111121311
valid from: 2024-06-07

Mortgage Insurance
type: BicsLevel5Segment
type: Classifier
type: NamedIndividual
is level5 segment of: Mortgage Finance
is contemporary version of: http://data.ga-group.nl/ics/bics/1411111213
is version of: http://data.ga-group.nl/ics/bics/1411111213
replaces: http://data.ga-group.nl/ics/bics/2020/1411111213
imported on: 2026-06-08T13:40:52.236Z
last refreshed on: 2026-06-08T13:41:38.450Z
source accessed on: 2024-06-05T14:42:36Z
source last accessed on: 2024-06-05T14:42:36Z
label: Assicurazioni ipot @it
label: Assurance hypo @fr
label: Hypothekenversicherung @de
label: Seguro hipot @pt
label: Seguros hipotecarios @es
label: Страхование ипотеки @ru
label: 抵押貸款保險 @zh-hant
label: 抵押贷款保险 @zh
label: 모기지 보험 @ko
label: ﾓｰｹﾞｰｼﾞ保険 @ja
definition: This segment includes companies that provide insurance to cover losses from defaults on mortgage loans. Also known as private mortgage insurance (PMI).
notation: 1411111213
valid from: 2024-06-07

Direct Title Insurance Premiums
type: BicsLevel6Segment
type: Classifier
type: NamedIndividual
is level6 segment of: Title Insurance
is contemporary version of: http://data.ga-group.nl/ics/bics/141111121410
is version of: http://data.ga-group.nl/ics/bics/141111121410
replaces: http://data.ga-group.nl/ics/bics/2020/141111121410
imported on: 2026-06-08T13:40:52.236Z
last refreshed on: 2026-06-08T13:41:38.450Z
source accessed on: 2024-06-05T14:42:36Z
source last accessed on: 2024-06-05T14:42:36Z
label: Direkte Rechtstitelversicherung, Beiträge @de
label: Prêmios de seguro de título direto @pt
label: Premi assicurazione title diretta @it
label: Primas de seguro título directo @es
label: Primes pour assurance directe de titres de propriété @fr
label: Прямое страхование титула - премии @ru
label: 保険料-不動産権原保険 @ja
label: 直接产权保险保费 @zh
label: 直接產權保險保費 @zh-hant
label: 권원보험 보험료 @ko
definition: This segment includes revenue generated from direct title premiums.
notation: 141111121410
valid from: 2024-06-07

Investment Inc - Direct Title Ins
type: BicsLevel7Segment
type: Classifier
type: NamedIndividual
is level7 segment of: Direct Title Insurance Non-Prem
is contemporary version of: http://data.ga-group.nl/ics/bics/14111112141110
is version of: http://data.ga-group.nl/ics/bics/14111112141110
replaces: http://data.ga-group.nl/ics/bics/2020/14111112141110
imported on: 2026-06-08T13:40:52.236Z
last refreshed on: 2026-06-08T13:41:38.450Z
source accessed on: 2024-06-05T14:42:36Z
source last accessed on: 2024-06-05T14:42:36Z
label: Ingreso de inversión - seguro directo de título @es
label: Investitionsertr. - Direkte Rechtstitelvers. @de
label: Prod financier - Assur directe titres de propriété @fr
label: Redd investimento - Assic title diretta @it
label: Renda investimentos - Seg título direto @pt
label: Инвестиц. доход - прямое страхов. титула @ru
label: 投資収益-不動産権原保険 @ja
label: 投資收入 - 直接產權保險 @zh-hant
label: 投资收入-直接产权保险 @zh
label: 투자수익-권원보험 @ko
definition: This segment includes investment income generated from direct title insurance.
notation: 14111112141110
valid from: 2024-06-07

Realized G/L - Direct Title Ins
type: BicsLevel7Segment
type: Classifier
type: NamedIndividual
is level7 segment of: Direct Title Insurance Non-Prem
is contemporary version of: http://data.ga-group.nl/ics/bics/14111112141111
is version of: http://data.ga-group.nl/ics/bics/14111112141111
replaces: http://data.ga-group.nl/ics/bics/2020/14111112141111
imported on: 2026-06-08T13:40:52.236Z
last refreshed on: 2026-06-08T13:41:38.450Z
source accessed on: 2024-06-05T14:42:36Z
source last accessed on: 2024-06-05T14:42:36Z
label: G/P réalisés - Assur directe titres de propriété @fr
label: P/G realizados - Seg título direto @pt
label: P/G realizados - Seguro directo de título @es
label: P/P realizzati - Assic title diretta @it
label: Real. G/V - Direkte Rechtstitelvers. @de
label: Реализованные П/У - прямое страхов. титула @ru
label: 実現損益-不動産権原保険 @ja
label: 已实现损益-直接产权保险 @zh
label: 已實現損益 - 直接產權保險 @zh-hant
label: 실현손익-권원보험 @ko
definition: This segment includes realized gains/losses generated from direct title insurance.
notation: 14111112141111
valid from: 2024-06-07

Other Income - Direct Title Ins
type: BicsLevel7Segment
type: Classifier
type: NamedIndividual
is level7 segment of: Direct Title Insurance Non-Prem
is contemporary version of: http://data.ga-group.nl/ics/bics/14111112141112
is version of: http://data.ga-group.nl/ics/bics/14111112141112
replaces: http://data.ga-group.nl/ics/bics/2020/14111112141112
imported on: 2026-06-08T13:40:52.236Z
last refreshed on: 2026-06-08T13:41:38.450Z
source accessed on: 2024-06-05T14:42:36Z
source last accessed on: 2024-06-05T14:42:36Z
label: Altro reddito - Assic title diretta @it
label: Autres rev - Assur directe titres de propriété @fr
label: Otro ingreso - seguro directo título @es
label: Outras rendas - Seg título direto @pt
label: Sonst. Ertrag - Direkte Rechtstitelvers. @de
label: Пр. доход - прямое страхование титула @ru
label: その他収益-不動産権原保険 @ja
label: 其他收入 - 直接產權保險 @zh-hant
label: 其他收入-直接产权保险 @zh
label: 기타수익-권원보험 @ko
definition: This segment includes other income generated from direct title insurance.
notation: 14111112141112
valid from: 2024-06-07

Direct Title Insurance Non-Prem
type: BicsLevel6Segment
type: Classifier
type: NamedIndividual
is level6 segment of: Title Insurance
is contemporary version of: http://data.ga-group.nl/ics/bics/141111121411
is version of: http://data.ga-group.nl/ics/bics/141111121411
replaces: http://data.ga-group.nl/ics/bics/2020/141111121411
imported on: 2026-06-08T13:40:52.236Z
last refreshed on: 2026-06-08T13:41:38.450Z
source accessed on: 2024-06-05T14:42:36Z
source last accessed on: 2024-06-05T14:42:36Z
label: Assurance directe titres de propriété hors primes @fr
label: Direkte Rechtstitelversicherung, nicht Beiträge @de
label: Não prêmio de seguro título direto @pt
label: Non premi assicurazione title diretta @it
label: Seguro título directo sin prima @es
label: Прямое страхование титула- неприм. @ru
label: 保険料外収入-不動産権原保険 @ja
label: 直接产权保险非保费 @zh
label: 直接產權保險非保費收入 @zh-hant
label: 권원보험 보험료외 @ko
definition: This segment includes total non-premium revenue generated from direct title insurance.
notation: 141111121411
valid from: 2024-06-07

Title Insurance
type: BicsLevel5Segment
type: Classifier
type: NamedIndividual
is level5 segment of: Mortgage Finance
is contemporary version of: http://data.ga-group.nl/ics/bics/1411111214
is version of: http://data.ga-group.nl/ics/bics/1411111214
replaces: http://data.ga-group.nl/ics/bics/2020/1411111214
imported on: 2026-06-08T13:40:52.236Z
last refreshed on: 2026-06-08T13:41:38.450Z
source accessed on: 2024-06-05T14:42:36Z
source last accessed on: 2024-06-05T14:42:36Z
label: Assurance tit proprio @fr
label: Rechtstitelversicherung @de
label: Seg título @pt
label: Seguros título @es
label: Страхование правового титула @ru
label: 产权保险 @zh
label: 権原保険 @ja
label: 権原��険 @ja
label: 產權保險 @zh-hant
label: 권원보험 @ko
definition: This segment includes companies that directly underwrite title insurance policies.
notation: 1411111214
valid from: 2024-06-07

Commercial Mortgage - REIT
type: BicsLevel6Segment
type: Classifier
type: NamedIndividual
is level6 segment of: Mortgage REIT
is contemporary version of: http://data.ga-group.nl/ics/bics/141111121510
is version of: http://data.ga-group.nl/ics/bics/141111121510
replaces: http://data.ga-group.nl/ics/bics/2020/141111121510
imported on: 2026-06-08T13:40:52.236Z
last refreshed on: 2026-06-08T13:41:38.450Z
source accessed on: 2024-06-05T14:42:36Z
source last accessed on: 2024-06-05T14:42:36Z
label: Gewerbehypothek - REIT @de
label: Hipoteca comercial - REIT @es
label: Ipoteche commerciali - REIT @it
label: Prêts hypothécaires commerciaux - REIT @fr
label: Коммерческая ипотека - REIT @ru
label: 商业抵押贷款 - REIT @zh
label: 商業抵押貸款 - REIT @zh-hant
label: 商業用不動産ﾓｰｹﾞｰｼﾞREIT @ja
label: 상업용 모기지 - 리츠(REIT) @ko
definition: This segment includes real estate investment trusts (REITs) that invest in commercial mortgage securities.
notation: 141111121510
valid from: 2024-06-07

Residential Mortgage - REIT
type: BicsLevel6Segment
type: Classifier
type: NamedIndividual
is level6 segment of: Mortgage REIT
is contemporary version of: http://data.ga-group.nl/ics/bics/141111121511
is version of: http://data.ga-group.nl/ics/bics/141111121511
replaces: http://data.ga-group.nl/ics/bics/2020/141111121511
imported on: 2026-06-08T13:40:52.236Z
last refreshed on: 2026-06-08T13:41:38.450Z
source accessed on: 2024-06-05T14:42:36Z
source last accessed on: 2024-06-05T14:42:36Z
label: Hipoteca residencial - REIT @es
label: Ipoteche residenziali - REIT @it
label: Prêts hypothécaires résidentiels - REIT @fr
label: Wohnhypothek - REIT @de
label: Жилая ипотека - REIT @ru
label: 住宅抵押貸款 - REIT @zh-hant
label: 住宅抵押贷款 - REIT @zh
label: 住宅用不動産ﾓｰｹﾞｰｼﾞREIT @ja
label: 주거용 모기지 - 리츠(REIT) @ko
definition: This segment includes real estate investment trusts (REITs) that invest in residential mortgage securities.
notation: 141111121511
valid from: 2024-06-07

Mortgage REIT
type: BicsLevel5Segment
type: Classifier
type: NamedIndividual
is level5 segment of: Mortgage Finance
is contemporary version of: http://data.ga-group.nl/ics/bics/1411111215
is version of: http://data.ga-group.nl/ics/bics/1411111215
replaces: http://data.ga-group.nl/ics/bics/2020/1411111215
imported on: 2026-06-08T13:40:52.236Z
last refreshed on: 2026-06-08T13:41:38.450Z
source accessed on: 2024-06-05T14:42:36Z
source last accessed on: 2024-06-05T14:42:36Z
label: Hypotheken-REITs @de
label: REIT hipotecario @es
label: REIT hipotecas @pt
label: REIT ipoteche @it
label: REIT prêts hypothécaires @fr
label: Ипотечные REIT @ru
label: 抵押貸款REIT @zh-hant
label: 抵押贷款REIT @zh
label: 모기지 리츠(REIT) @ko
label: ﾓｰｹﾞｰｼﾞREIT @ja
definition: This segment includes companies that invest in real estate loans and related securities, and meet the criteria necessary to be eligible for real estate investment trust (REIT) tax status.
notation: 1411111215
valid from: 2024-06-07

Mortgage Finance
type: BicsLevel4SubIndustry
type: Classifier
type: NamedIndividual
is sub industry of: Specialty Finance
is contemporary version of: http://data.ga-group.nl/ics/bics/14111112
is version of: http://data.ga-group.nl/ics/bics/14111112
replaces: http://data.ga-group.nl/ics/bics/2020/14111112
imported on: 2026-06-08T13:40:52.236Z
last refreshed on: 2026-06-08T13:41:38.450Z
source accessed on: 2024-06-05T14:42:36Z
source last accessed on: 2024-06-05T14:42:36Z
label: Finan hipotecas @es
label: Finanças hipotec @pt
label: Finanza ipoteche @it
label: Hypothekenfinanz @de
label: Prêts hypothécaires @fr
label: Ипотеч. финансир. @ru
label: 住宅金融 @ja
label: 抵押貸款金融 @zh-hant
label: 抵押金融 @zh
label: 모기지금융 @ko
definition: This industry subgroup includes companies that provide mortgage financing services. Includes mortgage lenders, mortgage bankers, mortgage real estate investment trusts (REITs), mortgage loan brokers, mortgage insurers, and title insurers.
notation: 14111112
valid from: 2024-06-07

Receivables Collection & Mgmt
type: BicsLevel5Segment
type: Classifier
type: NamedIndividual
is level5 segment of: Other Financial Services
is contemporary version of: http://data.ga-group.nl/ics/bics/1411111310
is version of: http://data.ga-group.nl/ics/bics/1411111310
imported on: 2026-06-08T13:40:52.236Z
last refreshed on: 2026-06-08T13:41:38.450Z
source accessed on: 2024-06-05T14:42:36Z
source last accessed on: 2024-06-05T14:42:36Z
label: Coleta e gest de contas a receber @pt
label: Einziehung & Verwaltung von Ford. @de
label: Gestion et recouvrement des comptes fournisseurs @fr
label: Raccolta e gestione crediti @it
label: Recolección y gestión de cuentas por cobrar @es
label: Сбор и управление дебиторской здлжн @ru
label: 債権回収･管理 @ja
label: 应收账款代收与管理 @zh
label: 應收款代收及管理 @zh-hant
label: 미수채권 추심 & 관리 @ko
definition: This segment includes companies that collect payments for claims. Collected payments are remitted to the company's clients or kept by the company if the company has purchased the claims.
notation: 1411111310
valid from: 2024-06-07

Financial Transaction Processors
type: BicsLevel5Segment
type: Classifier
type: NamedIndividual
is level5 segment of: Other Financial Services
is contemporary version of: http://data.ga-group.nl/ics/bics/1411111311
is version of: http://data.ga-group.nl/ics/bics/1411111311
replaces: http://data.ga-group.nl/ics/bics/2020/1911111210
imported on: 2026-06-08T13:40:52.236Z
last refreshed on: 2026-06-08T13:41:38.450Z
source accessed on: 2024-06-05T14:42:36Z
source last accessed on: 2024-06-05T14:42:36Z
label: Finanzielle Transaktionsprozessoren @de
label: Procesadores de transacciones financieras @es
label: Processamento de transações financeiras @pt
label: Processori transazioni finanz @it
label: Traitement transactions financ @fr
label: Процессоры финанс. данных @ru
label: 金融交易处理 @zh
label: 金融交易處理服務 @zh-hant
label: 金融ﾄﾗﾝｻﾞｸｼｮﾝ処理 @ja
label: 금융 거래 처리장치 @ko
definition: This segment includes companies that process or facilitate financial transactions. Includes companies that process credit cards, debit cards, or gift cards payments and credit card networks.
notation: 1411111311
valid from: 2024-06-07

Credit Agencies
type: BicsLevel6Segment
type: Classifier
type: NamedIndividual
is level6 segment of: Financial Info Services
is contemporary version of: http://data.ga-group.nl/ics/bics/141111131210
is version of: http://data.ga-group.nl/ics/bics/141111131210
replaces: http://data.ga-group.nl/ics/bics/2020/191111111010
imported on: 2026-06-08T13:40:52.236Z
last refreshed on: 2026-06-08T13:41:38.450Z
source accessed on: 2024-06-05T14:42:36Z
source last accessed on: 2024-06-05T14:42:36Z
label: Agências de crédito @pt
label: Agences de notation @fr
label: Agencias de crédito @es
label: Agenzie credito @it
label: Kreditbüros @de
label: Кредитные агентства @ru
label: 信用機構 @zh-hant
label: 信用調査 @ja
label: 信贷机构 @zh
label: 신용기관 @ko
definition: This segment includes companies that collect credit and employment information on individuals and businesses.
notation: 141111131210
valid from: 2024-06-07

Data & Analytics
type: BicsLevel6Segment
type: Classifier
type: NamedIndividual
is level6 segment of: Financial Info Services
is contemporary version of: http://data.ga-group.nl/ics/bics/141111131211
is version of: http://data.ga-group.nl/ics/bics/141111131211
replaces: http://data.ga-group.nl/ics/bics/2020/191111111011
imported on: 2026-06-08T13:40:52.236Z
last refreshed on: 2026-06-08T13:41:38.450Z
source accessed on: 2024-06-05T14:42:36Z
source last accessed on: 2024-06-05T14:42:36Z
label: Dados e análise @pt
label: Daten & Analyse @de
label: Dati e analisi @it
label: Datos y análisis @es
label: Données et analyses @fr
label: Данные и аналитика @ru
label: 数据和分析 @zh
label: 資料及分析 @zh-hant
label: 데이터 & 분석 @ko
label: ﾃﾞｰﾀ･分析 @ja
definition: This segment includes companies that provide pricing data, news, and analytics along with trading capabilities across major asset classes.
notation: 141111131211
valid from: 2024-06-07

Financial Info Services
type: BicsLevel5Segment
type: Classifier
type: NamedIndividual
is level5 segment of: Other Financial Services
is contemporary version of: http://data.ga-group.nl/ics/bics/1411111312
is version of: http://data.ga-group.nl/ics/bics/1411111312
replaces: http://data.ga-group.nl/ics/bics/2020/1911111110
imported on: 2026-06-08T13:40:52.236Z
last refreshed on: 2026-06-08T13:41:38.450Z
source accessed on: 2024-06-05T14:42:36Z
source last accessed on: 2024-06-05T14:42:36Z
label: Finanzieller Informationsservice @de
label: Serviços de informações financeiras @pt
label: Services d'information financière @fr
label: Servicios de información financiera @es
label: Servizi informazione finanziaria @it
label: Услуги финансовой информации @ru
label: 金融信息服务 @zh
label: 金融情報ｻｰﾋﾞｽ @ja
label: 金融資訊服務 @zh-hant
label: 금융 정보 서비스 @ko
definition: This segment includes companies that provide financial data and information.
notation: 1411111312
valid from: 2024-06-07

Other Financial Services
type: BicsLevel4SubIndustry
type: Classifier
type: NamedIndividual
is sub industry of: Specialty Finance
is contemporary version of: http://data.ga-group.nl/ics/bics/14111113
is version of: http://data.ga-group.nl/ics/bics/14111113
replaces: http://data.ga-group.nl/ics/bics/2020/14111113
imported on: 2026-06-08T13:40:52.236Z
last refreshed on: 2026-06-08T13:41:38.450Z
source accessed on: 2024-06-05T14:42:36Z
source last accessed on: 2024-06-05T14:42:36Z
label: Altri servizi finanziari @it
label: Autres serv financiers @fr
label: Otros servs financ @es
label: Outros serv financ @pt
label: Sonst. Finanzdienste @de
label: Прочие фин. услуги @ru
label: その他金融ｻｰﾋﾞｽ @ja
label: 其他金融服务 @zh
label: 其他金融服務 @zh-hant
label: 기타 금융 서비스 @ko
definition: This industry subgroup includes companies that provide other types of financial services not elsewhere classified.
notation: 14111113
valid from: 2024-06-07

Specialty Finance
type: BicsLevel3Industry
type: Classifier
type: NamedIndividual
is industry of: Financial Services
is contemporary version of: http://data.ga-group.nl/ics/bics/141111
is version of: http://data.ga-group.nl/ics/bics/141111
replaces: http://data.ga-group.nl/ics/bics/2020/141111
imported on: 2026-06-08T13:40:52.236Z
last refreshed on: 2026-06-08T13:41:38.450Z
source accessed on: 2024-06-05T14:42:36Z
source last accessed on: 2024-06-05T14:42:36Z
label: Finan-espec @pt
label: Finance spécialisée @fr
label: Finanza specializzata @it
label: Finanzas especiales @es
label: Sonderfinanzierung @de
label: Специальные финансовые услуги @ru
label: 特殊金融 @ja
label: 特种金融 @zh
label: 전문금융 @ko
definition: This industry includes companies that provide specialized loans and financing. Typically, these companies focus on one type of financing and derive their funding from capital markets. Also includes other non-institutional financial services.
notation: 141111
valid from: 2024-06-07

Financial Advisory Services
type: BicsLevel6Segment
type: Classifier
type: NamedIndividual
is level6 segment of: Investment Banking
is contemporary version of: http://data.ga-group.nl/ics/bics/141112101010
is version of: http://data.ga-group.nl/ics/bics/141112101010
replaces: http://data.ga-group.nl/ics/bics/2020/141112101010
imported on: 2026-06-08T13:40:52.236Z
last refreshed on: 2026-06-08T13:41:38.450Z
source accessed on: 2024-06-05T14:42:36Z
source last accessed on: 2024-06-05T14:42:36Z
label: Finanzdienstleistungen @de
label: Serviços de consultoria financeira @pt
label: Services de conseils financiers @fr
label: Servicios de asesoría financiera @es
label: Servizi di consulenza finanziaria @it
label: Финансово-консультационные услуги @ru
label: 財務顧問服務 @zh-hant
label: 財務顧問ｻｰﾋﾞｽ @ja
label: 财务顾问服务 @zh
label: 재무자문 서비스 @ko
definition: This segment includes companies that provide advice on corporate financial matters, including restructuring, mergers and acquisitions, financial valuations, and litigation.
notation: 141112101010
valid from: 2024-06-07

Debt Underwriting Services
type: BicsLevel7Segment
type: Classifier
type: NamedIndividual
is level7 segment of: Underwriting Services
is contemporary version of: http://data.ga-group.nl/ics/bics/14111210101110
is version of: http://data.ga-group.nl/ics/bics/14111210101110
replaces: http://data.ga-group.nl/ics/bics/2020/14111210101110
imported on: 2026-06-08T13:40:52.236Z
last refreshed on: 2026-06-08T13:41:38.450Z
source accessed on: 2024-06-05T14:42:36Z
source last accessed on: 2024-06-05T14:42:36Z
label: Serviços de subscrição da dívida @pt
label: Services d'émission d'obligations @fr
label: Servicios de colocación de deuda @es
label: Servizi di sottoscrizione debito @it
label: Underwriting-Service: Schulden @de
label: Услуги андеррайтинга долга @ru
label: 债券承销服务 @zh
label: 債券引受ｻｰﾋﾞｽ @ja
label: 債務承銷服務 @zh-hant
label: 債務承��服務 @zh-hant
label: 채권 주관 서비스 @ko
definition: This segment includes companies that provide access to capital through the sale of debt securities.
notation: 14111210101110
valid from: 2024-06-07

Equity Underwriting Services
type: BicsLevel7Segment
type: Classifier
type: NamedIndividual
is level7 segment of: Underwriting Services
is contemporary version of: http://data.ga-group.nl/ics/bics/14111210101111
is version of: http://data.ga-group.nl/ics/bics/14111210101111
replaces: http://data.ga-group.nl/ics/bics/2020/14111210101111
imported on: 2026-06-08T13:40:52.236Z
last refreshed on: 2026-06-08T13:41:38.450Z
source accessed on: 2024-06-05T14:42:36Z
source last accessed on: 2024-06-05T14:42:36Z
label: Serviços de subscrição de ações @pt
label: Services d'émission d'actions @fr
label: Servicios de colocación de acciones @es
label: Servizi di sottoscrizione azioni @it
label: Underwriting-Service: Aktien @de
label: Услуги андеррайтинга акций @ru
label: 株式引受ｻｰﾋﾞｽ @ja
label: 股票承銷服務 @zh-hant
label: 股票承销服务 @zh
label: 주식 인수 서비스 @ko
definition: This segment includes companies that provide access to capital through the sale of equity securities.
notation: 14111210101111
valid from: 2024-06-07

Underwriting Services
type: BicsLevel6Segment
type: Classifier
type: NamedIndividual
is level6 segment of: Investment Banking
is contemporary version of: http://data.ga-group.nl/ics/bics/141112101011
is version of: http://data.ga-group.nl/ics/bics/141112101011
replaces: http://data.ga-group.nl/ics/bics/2020/141112101011
imported on: 2026-06-08T13:40:52.236Z
last refreshed on: 2026-06-08T13:41:38.450Z
source accessed on: 2024-06-05T14:42:36Z
source last accessed on: 2024-06-05T14:42:36Z
label: Serviços de subscrição @pt
label: Services d'émission @fr
label: Servicios de colocación @es
label: Servizi di sottoscrizione @it
label: Underwriting-Service @de
label: Услуги андеррайтинга @ru
label: 引受業務 @ja
label: 承銷服務 @zh-hant
label: 承销服务 @zh
label: 주관사 서비스 @ko
definition: This segment includes companies that provide access to capital through the sale of debt and equity securities.
notation: 141112101011
valid from: 2024-06-07

Investment Banking
type: BicsLevel5Segment
type: Classifier
type: NamedIndividual
is level5 segment of: Brokeraggio istituzionale
is contemporary version of: http://data.ga-group.nl/ics/bics/1411121010
is version of: http://data.ga-group.nl/ics/bics/1411121010
replaces: http://data.ga-group.nl/ics/bics/2020/1411121010
imported on: 2026-06-08T13:40:52.236Z
last refreshed on: 2026-06-08T13:41:38.450Z
source accessed on: 2024-06-05T14:42:36Z
source last accessed on: 2024-06-05T14:42:36Z
label: Banca inversiones @es
label: Banche investimento @it
label: Banco de Investimento @pt
label: Banque d'affaires @fr
label: Investmentbanking @de
label: Инвестиционные банки @ru
label: 投資銀行 @ja
label: 投資銀行活動 @zh-hant
label: 投资银行业务活动 @zh
label: 투자은행 영업 @ko
definition: This segment includes companies that provide financial advisory and securities underwriting services on a fee basis.
notation: 1411121010
valid from: 2024-06-07

Commodities Brokerage
type: BicsLevel6Segment
type: Classifier
type: NamedIndividual
is level6 segment of: Security & Commodity Brokerage
is contemporary version of: http://data.ga-group.nl/ics/bics/141112101110
is version of: http://data.ga-group.nl/ics/bics/141112101110
replaces: http://data.ga-group.nl/ics/bics/2020/141112101110
imported on: 2026-06-08T13:40:52.236Z
last refreshed on: 2026-06-08T13:41:38.450Z
source accessed on: 2024-06-05T14:42:36Z
source last accessed on: 2024-06-05T14:42:36Z
label: Brokeraggio commodity @it
label: Corretagem de commodities @pt
label: Corretaje de materias primas @es
label: Courtage en matières premières @fr
label: Rohstoffmakler @de
label: Брокерские операции с сырьевыми товарами @ru
label: 商品先物仲介 @ja
label: 商品經紀 @zh-hant
label: 商品经纪公司 @zh
label: 상품 중개업 @ko
definition: This segment includes companies that facilitate the buying and selling of commodity contracts and options on a commission or fee basis.
notation: 141112101110
valid from: 2024-06-07

Instl Securities Brokerage
type: BicsLevel6Segment
type: Classifier
type: NamedIndividual
is level6 segment of: Security & Commodity Brokerage
is contemporary version of: http://data.ga-group.nl/ics/bics/141112101111
is version of: http://data.ga-group.nl/ics/bics/141112101111
replaces: http://data.ga-group.nl/ics/bics/2020/141112101111
imported on: 2026-06-08T13:40:52.236Z
last refreshed on: 2026-06-08T13:41:38.450Z
source accessed on: 2024-06-05T14:42:36Z
source last accessed on: 2024-06-05T14:42:36Z
label: Activité de courtage institutionnel @fr
label: Brokeraggio di titoli istituzionali @it
label: Corretagem de ativos institucionais @pt
label: Corretaje institucional de valores @es
label: Maklergesellschaft für institutionelle Wertpapiere @de
label: Институциональные брокерские операции с ЦБ @ru
label: 机构证券经纪 @zh
label: 機構證券經紀 @zh-hant
label: 機関投資家向け証券仲介 @ja
label: 기관 증권 중개업 @ko
definition: This segment includes companies that facilitate the buying and selling of non-commodity securities on a commission or fee basis.
notation: 141112101111
valid from: 2024-06-07

Security & Commodity Brokerage
type: BicsLevel5Segment
type: Classifier
type: NamedIndividual
is level5 segment of: Brokeraggio istituzionale
is contemporary version of: http://data.ga-group.nl/ics/bics/1411121011
is version of: http://data.ga-group.nl/ics/bics/1411121011
replaces: http://data.ga-group.nl/ics/bics/2020/1411121011
imported on: 2026-06-08T13:40:52.236Z
last refreshed on: 2026-06-08T13:41:38.450Z
source accessed on: 2024-06-05T14:42:36Z
source last accessed on: 2024-06-05T14:42:36Z
label: Actividades de corretaje de valores y materias primas @es
label: Brokeraggio titoli e commodity @it
label: Corretagem de commodities e ativos @pt
label: Courtage en titres et mat prem @fr
label: Wertpapier- & Commodity-Brokerage @de
label: Ценные бмг и сырьевые товары @ru
label: 証券･商品先物仲介 @ja
label: 證券及商品經紀 @zh-hant
label: 证券与商品经纪 @zh
label: 증권 & 상품 중개업 @ko
definition: This segment includes companies that facilitate the buying and selling of securities on a commission or fee per basis.
notation: 1411121011
valid from: 2024-06-07

Equities Trading
type: BicsLevel6Segment
type: Classifier
type: NamedIndividual
is level6 segment of: Trading & Principal Investment
is contemporary version of: http://data.ga-group.nl/ics/bics/141112101210
is version of: http://data.ga-group.nl/ics/bics/141112101210
replaces: http://data.ga-group.nl/ics/bics/2020/141112101210
imported on: 2026-06-08T13:40:52.236Z
last refreshed on: 2026-06-08T13:41:38.450Z
source accessed on: 2024-06-05T14:42:36Z
source last accessed on: 2024-06-05T14:42:36Z
label: Aktienhandel @de
label: Négociation d'actions @fr
label: Negociação de ações @pt
label: Operaciones de acciones @es
label: Trading azioni @it
label: Торговля акциями @ru
label: 株式取引 @ja
label: 股票交易 @zh
label: 주식 트레이딩 @ko
definition: This segment includes companies that buy and sell equity securities for market-making, provide specialist activities, and trade their own principal investments.
notation: 141112101210
valid from: 2024-06-07

Commodities Contract Dealing
type: BicsLevel6Segment
type: Classifier
type: NamedIndividual
is level6 segment of: Trading & Principal Investment
is contemporary version of: http://data.ga-group.nl/ics/bics/141112101211
is version of: http://data.ga-group.nl/ics/bics/141112101211
replaces: http://data.ga-group.nl/ics/bics/2020/141112101211
imported on: 2026-06-08T13:40:52.236Z
last refreshed on: 2026-06-08T13:41:38.450Z
source accessed on: 2024-06-05T14:42:36Z
source last accessed on: 2024-06-05T14:42:36Z
label: Négociation de contrats de commodities @fr
label: Negociação contratual de commodities @pt
label: Negociación de contratos de materias primas @es
label: Operaz contratti materie prime @it
label: Rohstoffkontrakthandel @de
label: Дилерская деательность с сырьевыми контрактами @ru
label: 商品先物取引 @ja
label: 商品合約交易 @zh-hant
label: 商品合约经纪 @zh
label: 상품 계약 거래 @ko
definition: This segment includes companies that buy and sell commodities and commodity-related securities for client-driven and proprietary trading.
notation: 141112101211
valid from: 2024-06-07

Currencies Trading
type: BicsLevel6Segment
type: Classifier
type: NamedIndividual
is level6 segment of: Trading & Principal Investment
is contemporary version of: http://data.ga-group.nl/ics/bics/141112101212
is version of: http://data.ga-group.nl/ics/bics/141112101212
replaces: http://data.ga-group.nl/ics/bics/2020/141112101212
imported on: 2026-06-08T13:40:52.236Z
last refreshed on: 2026-06-08T13:41:38.450Z
source accessed on: 2024-06-05T14:42:36Z
source last accessed on: 2024-06-05T14:42:36Z
label: Devisenhandel @de
label: Negociação de moedas @pt
label: Operaciones divisas @es
label: Trading de devises @fr
label: Trading delle valute @it
label: Торговля валютой @ru
label: 外匯交易 @zh-hant
label: 外国為替取引 @ja
label: 外汇交易 @zh
label: 통화 트레이딩 @ko
definition: This segment includes companies that buy and sell currencies in the cash and derivatives markets for client-driven and proprietary trading.
notation: 141112101212
valid from: 2024-06-07

Fixed Income Trading
type: BicsLevel6Segment
type: Classifier
type: NamedIndividual
is level6 segment of: Trading & Principal Investment
is contemporary version of: http://data.ga-group.nl/ics/bics/141112101213
is version of: http://data.ga-group.nl/ics/bics/141112101213
replaces: http://data.ga-group.nl/ics/bics/2020/141112101213
imported on: 2026-06-08T13:40:52.236Z
last refreshed on: 2026-06-08T13:41:38.450Z
source accessed on: 2024-06-05T14:42:36Z
source last accessed on: 2024-06-05T14:42:36Z
label: Negociação de renda fixa @pt
label: Operación renta fija @es
label: Rentenhandel @de
label: Trading obligataire @fr
label: Trading redd fisso @it
label: Торги фикс. доходом @ru
label: 債券取引 @ja
label: 固定收益-交易 @zh-hant
label: 固定收益交易 @zh
label: 채권매매 @ko
definition: This segment includes companies that buy and sell fixed income securities and other interest rate products for client-driven and proprietary trading.
notation: 141112101213
valid from: 2024-06-07

Trading & Principal Investment
type: BicsLevel5Segment
type: Classifier
type: NamedIndividual
is level5 segment of: Brokeraggio istituzionale
is contemporary version of: http://data.ga-group.nl/ics/bics/1411121012
is version of: http://data.ga-group.nl/ics/bics/1411121012
replaces: http://data.ga-group.nl/ics/bics/2020/1411121012
imported on: 2026-06-08T13:40:52.236Z
last refreshed on: 2026-06-08T13:41:38.450Z
source accessed on: 2024-06-05T14:42:36Z
source last accessed on: 2024-06-05T14:42:36Z
label: Handel & Kapitalinvestitionen @de
label: Inversión de operaciones y principal @es
label: Investimento principal e negociação @pt
label: Négociation et investissement de capital @fr
label: Trading e investimento capitale @it
label: Торговля и инвестиции @ru
label: 交易与本金投资 @zh
label: 交易及自營投資 @zh-hant
label: 트레이딩 & 자기자본투자 @ko
label: ﾄﾚｰﾃﾞｨﾝｸﾞ･ﾌﾟﾘﾝｼﾊﾟﾙｲﾝﾍﾞｽﾄﾒﾝﾄ @ja
definition: This segment includes companies that buy and sell equities, fixed income, currencies, commodities, and related securities for client-driven and proprietary trading.
notation: 1411121012
valid from: 2024-06-07

Brokeraggio istituzionale
type: BicsLevel4SubIndustry
type: Classifier
type: NamedIndividual
is sub industry of: Institutional Financial Svcs
is contemporary version of: http://data.ga-group.nl/ics/bics/14111210
is version of: http://data.ga-group.nl/ics/bics/14111210
replaces: http://data.ga-group.nl/ics/bics/2020/14111210
imported on: 2026-06-08T13:40:52.236Z
last refreshed on: 2026-06-08T13:41:38.450Z
source accessed on: 2024-06-05T14:42:36Z
source last accessed on: 2024-06-05T14:42:36Z
label: Corret inst @pt
label: Corretaje instit @es
label: Courtage institutionnel @fr
label: Institutional Brokerage
label: Институц. брок. услуги @ru
label: 机构经纪商 @zh
label: 機構經紀 @zh-hant
label: 機関投資家向け証券仲介 @ja
label: 기관 중개업 @ko
definition: This industry subgroup includes companies that provide brokerage services to institutional investors. These companies buy or sell securities on behalf of organizations, such as banks, insurance companies, hedge funds, pension funds, and mutual funds. Includes companies that provide financial advice and/or underwriting for corporations and governments.
notation: 14111210
valid from: 2024-06-07

Asset & Investment Servicing
type: BicsLevel5Segment
type: Classifier
type: NamedIndividual
is level5 segment of: Instl Trust, Fiduciary & Custody
is contemporary version of: http://data.ga-group.nl/ics/bics/1411121110
is version of: http://data.ga-group.nl/ics/bics/1411121110
replaces: http://data.ga-group.nl/ics/bics/2020/1411121110
imported on: 2026-06-08T13:40:52.236Z
last refreshed on: 2026-06-08T13:41:38.450Z
source accessed on: 2024-06-05T14:42:36Z
source last accessed on: 2024-06-05T14:42:36Z
label: Administration d'actifs et placements @fr
label: Asset- & Investitionsdienstleistungen @de
label: Serv attivi e investimenti @it
label: Serviços de investimentos e ativos @pt
label: Servicio de activos e inversiones @es
label: Обслуж. активов и инвестиций @ru
label: 資產及投資服務 @zh-hant
label: 資産･投資ｻｰﾋﾞｼﾝｸﾞ @ja
label: 资产与投资服务 @zh
label: 자산 & 투자서비스 @ko
definition: This segment includes companies that provide investment and other asset services on a fee basis and fund administration.
notation: 1411121110
valid from: 2024-06-07

Execution & Clearing Services
type: BicsLevel5Segment
type: Classifier
type: NamedIndividual
is level5 segment of: Instl Trust, Fiduciary & Custody
is contemporary version of: http://data.ga-group.nl/ics/bics/1411121111
is version of: http://data.ga-group.nl/ics/bics/1411121111
replaces: http://data.ga-group.nl/ics/bics/2020/1411121111
imported on: 2026-06-08T13:40:52.236Z
last refreshed on: 2026-06-08T13:41:38.450Z
source accessed on: 2024-06-05T14:42:36Z
source last accessed on: 2024-06-05T14:42:36Z
label: Ausführungs- & Clearing-Services @de
label: Serviços de compensação e execução @pt
label: Services d'exécution et de compensation @fr
label: Servicios de ejecución y compensación @es
label: Servizi compensazione ed esecuzione @it
label: Клир. усл. и услуги исполн. @ru
label: 執行及清算服務 @zh-hant
label: 執行･清算ｻｰﾋﾞｽ @ja
label: 执行与清算服务 @zh
label: 체결 & 청산서비스 @ko
definition: This segment includes companies that provide trade execution and clearance services on a fee basis.
notation: 1411121111
valid from: 2024-06-07

Issuer Services
type: BicsLevel5Segment
type: Classifier
type: NamedIndividual
is level5 segment of: Instl Trust, Fiduciary & Custody
is contemporary version of: http://data.ga-group.nl/ics/bics/1411121112
is version of: http://data.ga-group.nl/ics/bics/1411121112
replaces: http://data.ga-group.nl/ics/bics/2020/1411121112
imported on: 2026-06-08T13:40:52.236Z
last refreshed on: 2026-06-08T13:41:38.450Z
source accessed on: 2024-06-05T14:42:36Z
source last accessed on: 2024-06-05T14:42:36Z
label: Emittentendienste @de
label: Serviços do emissor @pt
label: Services d'émetteurs @fr
label: Servicios de emisor @es
label: Servizi emissione @it
label: Услуги эмитента @ru
label: 发行人服务 @zh
label: 発行体ｻｰﾋﾞｽ @ja
label: 發行人服務 @zh-hant
label: 발행사 서비스 @ko
definition: This segment includes companies that provide securities issuance and related services on a fee basis.
notation: 1411121112
valid from: 2024-06-07

Transaction Services
type: BicsLevel5Segment
type: Classifier
type: NamedIndividual
is level5 segment of: Instl Trust, Fiduciary & Custody
is contemporary version of: http://data.ga-group.nl/ics/bics/1411121113
is version of: http://data.ga-group.nl/ics/bics/1411121113
replaces: http://data.ga-group.nl/ics/bics/2020/1411121113
imported on: 2026-06-08T13:40:52.236Z
last refreshed on: 2026-06-08T13:41:38.450Z
source accessed on: 2024-06-05T14:42:36Z
source last accessed on: 2024-06-05T14:42:36Z
label: Serviços de transação @pt
label: Services de transactions @fr
label: Servicios de transaccuiones @es
label: Servizi transazioni @it
label: Transaktionsdienste @de
label: Услуги обработки финансовых транзакций @ru
label: 交易服务 @zh
label: 交易服務 @zh-hant
label: 取引事務処理ｻｰﾋﾞｽ @ja
label: 거래처리 서비스 @ko
definition: This segment includes companies that provide cash management, funds transfer, or liquidity management services on a fee basis.
notation: 1411121113
valid from: 2024-06-07

Instl Trust, Fiduciary & Custody
type: BicsLevel4SubIndustry
type: Classifier
type: NamedIndividual
is sub industry of: Institutional Financial Svcs
is contemporary version of: http://data.ga-group.nl/ics/bics/14111211
is version of: http://data.ga-group.nl/ics/bics/14111211
replaces: http://data.ga-group.nl/ics/bics/2020/14111211
imported on: 2026-06-08T13:40:52.236Z
last refreshed on: 2026-06-08T13:41:38.450Z
source accessed on: 2024-06-05T14:42:36Z
source last accessed on: 2024-06-05T14:42:36Z
label: Ativ cust, fiduc e truste inst @pt
label: Fideicomisos, fiduciarios y custodios inst @es
label: Fiduciari ist e custodia @it
label: Inst. Trust, Treuhand & Verwahr. @de
label: Trust, fiducie, garde - Instit @fr
label: Инст. траст., фидуц. и попеч. деят. @ru
label: 机构信托、信托与托管 @zh
label: 機構信託活動 @zh-hant
label: 機関投資家向け信託･受託･保管 @ja
label: 기관 신탁, 수탁 & 보관업 @ko
definition: This industry subgroup includes companies that are authorized to hold assets in trust and provide services for registering securities and transferring ownership.
notation: 14111211
valid from: 2024-06-07

Security & Cmdty Exchanges
type: BicsLevel4SubIndustry
type: Classifier
type: NamedIndividual
is sub industry of: Institutional Financial Svcs
is contemporary version of: http://data.ga-group.nl/ics/bics/14111212
is version of: http://data.ga-group.nl/ics/bics/14111212
replaces: http://data.ga-group.nl/ics/bics/2020/14111212
imported on: 2026-06-08T13:40:52.236Z
last refreshed on: 2026-06-08T13:41:38.450Z
source accessed on: 2024-06-05T14:42:36Z
source last accessed on: 2024-06-05T14:42:36Z
label: Bolsas cmdty e ativos @pt
label: Bolsas val/mat pr @es
label: Borse azioni/commodity @it
label: Bourses de valeurs/mat prem @fr
label: WP- & Rohstoffbörsen @de
label: Фондовые и товарные биржи @ru
label: 証券･商品先物取引 @ja
label: 證券及商品交易所 @zh-hant
label: 证券与商品交易所 @zh
label: 증권 & 상품 거래소 @ko
definition: This industry subgroup includes firms that operate a marketplace for the buying and selling of securities, commodities, or other financial instruments.
notation: 14111212
valid from: 2024-06-07

Institutional Financial Svcs
type: BicsLevel3Industry
type: Classifier
type: NamedIndividual
is industry of: Financial Services
is contemporary version of: http://data.ga-group.nl/ics/bics/141112
is version of: http://data.ga-group.nl/ics/bics/141112
replaces: http://data.ga-group.nl/ics/bics/2020/141112
imported on: 2026-06-08T13:40:52.236Z
last refreshed on: 2026-06-08T13:41:38.450Z
source accessed on: 2024-06-05T14:42:36Z
source last accessed on: 2024-06-05T14:42:36Z
label: Institutionelle Finanzdienstleistungen @de
label: Serv financeiros institucionais @pt
label: Serv financiers institut @fr
label: Serv finanziari istituzionali @it
label: Servicios financieros institucionales @es
label: Институц. финансовые услуги @ru
label: 机构金融服务 @zh
label: 機構金融服務 @zh-hant
label: 機関投資家向け金融ｻｰﾋﾞｽ @ja
label: 機関��資家向け金融ｻｰﾋﾞｽ @ja
label: 기관 금융서비스 @ko
definition: This industry includes companies that provide financial services primarily for large financial institutions, corporations, or governments.
notation: 141112
valid from: 2024-06-07

Financial Services
type: BicsLevel2IndustryGroup
type: Classifier
type: NamedIndividual
is industry group of: Financials
is contemporary version of: http://data.ga-group.nl/ics/bics/1411
is version of: http://data.ga-group.nl/ics/bics/1411
replaces: http://data.ga-group.nl/ics/bics/2020/1411
imported on: 2026-06-08T13:40:52.236Z
last refreshed on: 2026-06-08T13:41:38.450Z
source accessed on: 2024-06-05T14:42:36Z
source last accessed on: 2024-06-05T14:42:36Z
label: Finanzdienstleistungen @de
label: Serviços financeiros @pt
label: Services financiers @fr
label: Servicios financieros @es
label: Servizi finanziari @it
label: Финансовые услуги @ru
label: 金融服务 @zh
label: 金融服務 @zh-hant
label: 金融ｻｰﾋﾞｽ @ja
label: 금융서비스 @ko
definition: This industry group includes companies that provide services which focuses on the growth or transaction of money and assets.
notation: 1411
valid from: 2024-06-07

Protection Prods Premiums
type: BicsLevel6Segment
type: Classifier
type: NamedIndividual
is level6 segment of: Life Insurance Premiums
is contemporary version of: http://data.ga-group.nl/ics/bics/141210101010
is version of: http://data.ga-group.nl/ics/bics/141210101010
replaces: http://data.ga-group.nl/ics/bics/2020/141210101010
imported on: 2026-06-08T13:40:52.236Z
last refreshed on: 2026-06-08T13:41:38.450Z
source accessed on: 2024-06-05T14:42:36Z
source last accessed on: 2024-06-05T14:42:36Z
label: Prêmios de prod proteção @pt
label: Premi prod protezione @it
label: Primas de productos de protección @es
label: Primes prod protection @fr
label: Schutzprod., Beiträge @de
label: Продукты защиты - премии @ru
label: 保护产品保费 @zh
label: 保険料-保障商品 @ja
label: 保障型產品保費 @zh-hant
label: 보장형상품 보험료 @ko
definition: This segment includes premium income generated from life insurance protection products, including individual and group life, accidental death, and disability policies.
notation: 141210101010
valid from: 2024-06-07

Saving & Retire Prods Premiums
type: BicsLevel6Segment
type: Classifier
type: NamedIndividual
is level6 segment of: Life Insurance Premiums
is contemporary version of: http://data.ga-group.nl/ics/bics/141210101011
is version of: http://data.ga-group.nl/ics/bics/141210101011
replaces: http://data.ga-group.nl/ics/bics/2020/141210101011
imported on: 2026-06-08T13:40:52.236Z
last refreshed on: 2026-06-08T13:41:38.450Z
source accessed on: 2024-06-05T14:42:36Z
source last accessed on: 2024-06-05T14:42:36Z
label: Prêmios prod aposentadoria e poupança @pt
label: Premi prod risparmio e pensione @it
label: Primas de ahorros y productos de jubilación @es
label: Prime prod épargne et retraite @fr
label: Spar- & Ruhestandsbeiträge @de
label: Сберегат. и пенс. прод. - премии @ru
label: 保険料-預金･退職後資金商品 @ja
label: 储蓄与退休产品保费 @zh
label: 儲蓄及退休產品保費 @zh-hant
label: 저축 & 퇴직상품 보험료 @ko
definition: This segment includes premium income generated from individual or group life insurance savings and retirement products or fixed and variable annuities.
notation: 141210101011
valid from: 2024-06-07

Life Insurance Premiums
type: BicsLevel5Segment
type: Classifier
type: NamedIndividual
is level5 segment of: Life Insurance
is contemporary version of: http://data.ga-group.nl/ics/bics/1412101010
is version of: http://data.ga-group.nl/ics/bics/1412101010
replaces: http://data.ga-group.nl/ics/bics/2020/1412101010
imported on: 2026-06-08T13:40:52.236Z
last refreshed on: 2026-06-08T13:41:38.450Z
source accessed on: 2024-06-05T14:42:36Z
source last accessed on: 2024-06-05T14:42:36Z
label: Lebensversicherungsbeiträge @de
label: Prêmios de seguro de vida @pt
label: Premi assicurazione vita @it
label: Primas de seguros de vida @es
label: Primes pour assurance-vie @fr
label: Страхование жизни - премии @ru
label: 人壽保險保費 @zh-hant
label: 保険料-生命保険 @ja
label: 寿险保费 @zh
label: 생명보험보험료 @ko
definition: This segment includes premium income generated from life insurance products, including life, accidental death, disability, and annuities.
notation: 1412101010
valid from: 2024-06-07

Investment Income - Life Ins
type: BicsLevel6Segment
type: Classifier
type: NamedIndividual
is level6 segment of: Life Insurance Non-Premium
is contemporary version of: http://data.ga-group.nl/ics/bics/141210101110
is version of: http://data.ga-group.nl/ics/bics/141210101110
replaces: http://data.ga-group.nl/ics/bics/2020/141210101110
imported on: 2026-06-08T13:40:52.236Z
last refreshed on: 2026-06-08T13:41:38.450Z
source accessed on: 2024-06-05T14:42:36Z
source last accessed on: 2024-06-05T14:42:36Z
label: Ingreso de inversión - seg vida @es
label: Investitionsertrag - LV @de
label: Produit financier - Assur-vie @fr
label: Reddito investimento - Assic vita @it
label: Renda de investimento - Seg vida @pt
label: Инвест. доход - страх. жизни @ru
label: 投資収益-生命保険 @ja
label: 投資収���-生命保険 @ja
label: 投資收入-壽險 @zh-hant
label: 投资收入-寿险 @zh
label: 투자수익-생보 @ko
definition: This segment includes investment income generated from direct life insurance.
notation: 141210101110
valid from: 2024-06-07

Invst Inc - Protection Prods
type: BicsLevel7Segment
type: Classifier
type: NamedIndividual
is level7 segment of: Protect Prods Non-Premium
is contemporary version of: http://data.ga-group.nl/ics/bics/14121010111110
is version of: http://data.ga-group.nl/ics/bics/14121010111110
replaces: http://data.ga-group.nl/ics/bics/2020/14121010111110
imported on: 2026-06-08T13:40:52.236Z
last refreshed on: 2026-06-08T13:41:38.450Z
source accessed on: 2024-06-05T14:42:36Z
source last accessed on: 2024-06-05T14:42:36Z
label: Ingreso de inversión - Productos de protección @es
label: Investitionsertrag - Schutzprodukte @de
label: Produit financier - Produits de protection @fr
label: Receita de investimentos - produtos de proteção @pt
label: Redd investimenti - prodotti di protezione @it
label: Инвестиционный доход - Продукты защиты @ru
label: 投資収益-保障商品 @ja
label: 投資收入 - 保障型產品 @zh-hant
label: 投资收入-保护产品 @zh
label: 투자수익 - 보상형 상품 @ko
definition: This segment includes investment income generated from life insurance protection products, including individual and group life, accidental death, and disability policies.
notation: 14121010111110
valid from: 2024-06-07

Realized G/L - Protection Prods
type: BicsLevel7Segment
type: Classifier
type: NamedIndividual
is level7 segment of: Protect Prods Non-Premium
is contemporary version of: http://data.ga-group.nl/ics/bics/14121010111111
is version of: http://data.ga-group.nl/ics/bics/14121010111111
replaces: http://data.ga-group.nl/ics/bics/2020/14121010111111
imported on: 2026-06-08T13:40:52.236Z
last refreshed on: 2026-06-08T13:41:38.450Z
source accessed on: 2024-06-05T14:42:36Z
source last accessed on: 2024-06-05T14:42:36Z
label: G/P realizados - Prod proteção @pt
label: P/G realizados - productos de protección @es
label: P/P - Prod protection @fr
label: P/P realizzati - Prod protezione @it
label: Real. G/V - Schutzprod. @de
label: Реализ. П/У - прод. защиты @ru
label: 実現損益-保障商品 @ja
label: 已实现损益-保护产品 @zh
label: 已實現損益 - 保障型產品 @zh-hant
label: 실현손익-보장형상품 @ko
definition: This segment includes realized gains/losses generated from life insurance protection products, including individual and group life, accidental death, and disability policies.
notation: 14121010111111
valid from: 2024-06-07

Fees & Other Inc - Protect Prods
type: BicsLevel7Segment
type: Classifier
type: NamedIndividual
is level7 segment of: Protect Prods Non-Premium
is contemporary version of: http://data.ga-group.nl/ics/bics/14121010111112
is version of: http://data.ga-group.nl/ics/bics/14121010111112
replaces: http://data.ga-group.nl/ics/bics/2020/14121010111112
imported on: 2026-06-08T13:40:52.236Z
last refreshed on: 2026-06-08T13:41:38.450Z
source accessed on: 2024-06-05T14:42:36Z
source last accessed on: 2024-06-05T14:42:36Z
label: Frais et autres rev - Prod protection @fr
label: Gebühren & sonst. Eink.- Schutzprod. @de
label: Tarifas y otro ingreso - productos de protección @es
label: Tariffe e altro redd - Prod protezione @it
label: Taxas e outras rec - Prod proteção @pt
label: Сборы и пр. дхд - прод. защиты @ru
label: 手数料･その他収益-保障商品 @ja
label: 手续费与其他收入-保护产品 @zh
label: 費用及其他收入 - 保障型產品 @zh-hant
label: 수수료 & 기타수익-보장형상품 @ko
definition: This segment includes fees and other non-premium income generated from life insurance protection products, including individual and group life, accidental death, and disability policies.
notation: 14121010111112
valid from: 2024-06-07

Protect Prods Non-Premium
type: BicsLevel6Segment
type: Classifier
type: NamedIndividual
is level6 segment of: Life Insurance Non-Premium
is contemporary version of: http://data.ga-group.nl/ics/bics/141210101111
is version of: http://data.ga-group.nl/ics/bics/141210101111
replaces: http://data.ga-group.nl/ics/bics/2020/141210101111
imported on: 2026-06-08T13:40:52.236Z
last refreshed on: 2026-06-08T13:41:38.450Z
source accessed on: 2024-06-05T14:42:36Z
source last accessed on: 2024-06-05T14:42:36Z
label: Não prêmio prod proteção @pt
label: Non premi prod protezione @it
label: Prod de protection h primes @fr
label: Productos de protección sin prima @es
label: Schutzprod., nicht Beiträge @de
label: Прод. защиты - непрем. доход @ru
label: 保护产品非保费 @zh
label: 保障商品-保険料外収入 @ja
label: 保障型產品非保費 @zh-hant
label: 보장형상품 보험료외 @ko
definition: This segment includes non-premium income generated from life insurance protection products, including individual and group life, accidental death, and disability policies.
notation: 141210101111
valid from: 2024-06-07

Realized G/L - Life Insurance
type: BicsLevel6Segment
type: Classifier
type: NamedIndividual
is level6 segment of: Life Insurance Non-Premium
is contemporary version of: http://data.ga-group.nl/ics/bics/141210101112
is version of: http://data.ga-group.nl/ics/bics/141210101112
replaces: http://data.ga-group.nl/ics/bics/2020/141210101112
imported on: 2026-06-08T13:40:52.236Z
last refreshed on: 2026-06-08T13:41:38.450Z
source accessed on: 2024-06-05T14:42:36Z
source last accessed on: 2024-06-05T14:42:36Z
label: G/P realizados - Seguro de vida @pt
label: P/G realizados - seguro de vida @es
label: P/P réalisés - Assur-vie @fr
label: P/P realizzati - Assicurazione vita @it
label: Realisierter G/V - LV @de
label: Реализ. П/У - страх. жизни @ru
label: 実現損益-生命保険 @ja
label: 已实现损益-寿险 @zh
label: 已實現損益 - 人壽保險 @zh-hant
label: 실현손익-생명보험 @ko
definition: This segment includes realized gains/losses generated from direct life insurance.
notation: 141210101112
valid from: 2024-06-07

Investment Income - Life Invst
type: BicsLevel7Segment
type: Classifier
type: NamedIndividual
is level7 segment of: Saving & Retire Prods Non-Prem
is contemporary version of: http://data.ga-group.nl/ics/bics/14121010111310
is version of: http://data.ga-group.nl/ics/bics/14121010111310
replaces: http://data.ga-group.nl/ics/bics/2020/14121010111310
imported on: 2026-06-08T13:40:52.236Z
last refreshed on: 2026-06-08T13:41:38.450Z
source accessed on: 2024-06-05T14:42:36Z
source last accessed on: 2024-06-05T14:42:36Z
label: Ingreso de inversión - vida @es
label: Investitionsertrag - LV Inv. @de
label: Produit financier - Investiss vie @fr
label: Receita de investimentos - Inv vida @pt
label: Reddito investimento - Invst vita @it
label: Сборы и пр. дхд - нв. стр. жизни @ru
label: 投資収益-投資型生命保険商品 @ja
label: 投資收入 - 人壽投資產品 @zh-hant
label: 投资收入-寿险投资 @zh
label: 투자수익-생명 투자 @ko
definition: This segment includes investment income generated from life insurance savings and retirement products, including individual and group fixed and variable annuities.
notation: 14121010111310
valid from: 2024-06-07

Realized G/L - Life Investment
type: BicsLevel7Segment
type: Classifier
type: NamedIndividual
is level7 segment of: Saving & Retire Prods Non-Prem
is contemporary version of: http://data.ga-group.nl/ics/bics/14121010111311
is version of: http://data.ga-group.nl/ics/bics/14121010111311
replaces: http://data.ga-group.nl/ics/bics/2020/14121010111311
imported on: 2026-06-08T13:40:52.236Z
last refreshed on: 2026-06-08T13:41:38.450Z
source accessed on: 2024-06-05T14:42:36Z
source last accessed on: 2024-06-05T14:42:36Z
label: G/P realizados - Investimentos de vida @pt
label: P/G realizados - inversión de vida @es
label: P/P réalisés - Investiss vie @fr
label: P/P realizzati - Investimento vita @it
label: Realisierter G/V - LV Inv. @de
label: Реализ. П/У - страх. жизни @ru
label: 実現損益-投資型生命保険商品 @ja
label: 実現���益-投資型生命保険商品 @ja
label: 已实现损益-寿险投资 @zh
label: 已實現損益 - 人壽投資產品 @zh-hant
label: 실현손익 - 생명 투자 @ko
definition: This segment includes realized gains/losses generated from life insurance savings and retirement products, including individual and group fixed and variable annuities.
notation: 14121010111311
valid from: 2024-06-07

Fees & Other Income - Life Invst
type: BicsLevel7Segment
type: Classifier
type: NamedIndividual
is level7 segment of: Saving & Retire Prods Non-Prem
is contemporary version of: http://data.ga-group.nl/ics/bics/14121010111312
is version of: http://data.ga-group.nl/ics/bics/14121010111312
replaces: http://data.ga-group.nl/ics/bics/2020/14121010111312
imported on: 2026-06-08T13:40:52.236Z
last refreshed on: 2026-06-08T13:41:38.450Z
source accessed on: 2024-06-05T14:42:36Z
source last accessed on: 2024-06-05T14:42:36Z
label: Commissioni e altro reddito - Invst vita @it
label: Frais et autres rev - Investiss vie @fr
label: Gebühren & sonstiger Ertrag - LV Inv. @de
label: Tarifas y otro ingreso - productos de inversión de vida @es
label: Taxas e outras receitas - Inv de vida @pt
label: Сборы и пр. дхд - инвест. страх. жизни @ru
label: 手数料･その他収益-投資型生命保険商品 @ja
label: 手续费与其他收入-寿险投资 @zh
label: 費用及其他收入 - 人壽投資產品 @zh-hant
label: 수수료 & 기타 수익 -생명 투자 @ko
definition: This segment includes fees and other non-premium income generated from individual or group life insurance savings retirement products and fixed and variable annuities.
notation: 14121010111312
valid from: 2024-06-07

Saving & Retire Prods Non-Prem
type: BicsLevel6Segment
type: Classifier
type: NamedIndividual
is level6 segment of: Life Insurance Non-Premium
is contemporary version of: http://data.ga-group.nl/ics/bics/141210101113
is version of: http://data.ga-group.nl/ics/bics/141210101113
replaces: http://data.ga-group.nl/ics/bics/2020/141210101113
imported on: 2026-06-08T13:40:52.236Z
last refreshed on: 2026-06-08T13:41:38.450Z
source accessed on: 2024-06-05T14:42:36Z
source last accessed on: 2024-06-05T14:42:36Z
label: Não prêm prod aposentadoria e poupança @pt
label: Non prem prod risparmio e pensione @it
label: Prod épargne et retraite h primes @fr
label: Sin primas de ahorros y productos de jubilación @es
label: Spar- & Ruhestandsprod., nicht Beiträge @de
label: Сберегат. и пенс. прод. - непрем. @ru
label: 储蓄与退休产品非保费 @zh
label: 儲蓄及退休產品非保費收入 @zh-hant
label: 預金･退職後資金商品-保険料外収入 @ja
label: 저축 & 퇴직상품 보험료외 @ko
definition: This segment includes non-premium income generated from individual or group life insurance, savings and retirement products, or fixed and variable annuities.
notation: 141210101113
valid from: 2024-06-07

Fees & Other Income - Life Ins
type: BicsLevel6Segment
type: Classifier
type: NamedIndividual
is level6 segment of: Life Insurance Non-Premium
is contemporary version of: http://data.ga-group.nl/ics/bics/141210101114
is version of: http://data.ga-group.nl/ics/bics/141210101114
replaces: http://data.ga-group.nl/ics/bics/2020/141210101114
imported on: 2026-06-08T13:40:52.236Z
last refreshed on: 2026-06-08T13:41:38.450Z
source accessed on: 2024-06-05T14:42:36Z
source last accessed on: 2024-06-05T14:42:36Z
label: Commissioni e altro reddito - Assic vita @it
label: Frais et autres revenus - Assur-vie @fr
label: Gebühren & sonstige Einkünfte - Lebensvers. @de
label: Tarifas y otro ingreso - seguro de vida @es
label: Taxas e outras receitas - Seg vida @pt
label: Сборы и прочий доход - страх. жизни @ru
label: 手数料･その他収益-生命保険 @ja
label: 手续费与其他收入-寿险 @zh
label: 費用及其他收入 - 人壽保險 @zh-hant
label: 수수료 & 기타 수익-생보 @ko
definition: This segment includes other income generated from direct life insurance.
notation: 141210101114
valid from: 2024-06-07

Life Insurance Non-Premium
type: BicsLevel5Segment
type: Classifier
type: NamedIndividual
is level5 segment of: Life Insurance
is contemporary version of: http://data.ga-group.nl/ics/bics/1412101011
is version of: http://data.ga-group.nl/ics/bics/1412101011
replaces: http://data.ga-group.nl/ics/bics/2020/1412101011
imported on: 2026-06-08T13:40:52.236Z
last refreshed on: 2026-06-08T13:41:38.450Z
source accessed on: 2024-06-05T14:42:36Z
source last accessed on: 2024-06-05T14:42:36Z
label: Assurance-vie hors prime @fr
label: Lebensversicherung, nicht Beiträge @de
label: Mão prêmio seguro de vida @pt
label: Non premi assicurazione vita @it
label: Seguros de vida sin prima @es
label: Страх. жизни - непрем. доход @ru
label: 人壽保險非保費收入 @zh-hant
label: 保険料外収入-生命保険 @ja
label: 寿险非保费 @zh
label: 생명보험 보험료외 @ko
definition: This segment includes total non-premium revenue generated from direct life business.
notation: 1412101011
valid from: 2024-06-07

Life Insurance
type: BicsLevel4SubIndustry
type: Classifier
type: NamedIndividual
is sub industry of: Insurance
is contemporary version of: http://data.ga-group.nl/ics/bics/14121010
is version of: http://data.ga-group.nl/ics/bics/14121010
replaces: http://data.ga-group.nl/ics/bics/2020/14121010
imported on: 2026-06-08T13:40:52.236Z
last refreshed on: 2026-06-08T13:41:38.450Z
source accessed on: 2024-06-05T14:42:36Z
source last accessed on: 2024-06-05T14:42:36Z
label: Assicuraz vita @it
label: Assurance-vie @fr
label: Lebensversicherung @de
label: Seguro de vida @pt
label: Seguros de vida @es
label: Страх. жизни @ru
label: 人壽保險 @zh-hant
label: 人寿保险 @zh
label: 生命保険 @ja
label: 생명보험 @ko
definition: This industry subgroup includes companies that directly underwrite life insurance policies, such as life, accidental death, disability, and annuities.
notation: 14121010
valid from: 2024-06-07

Commercial Auto Premiums
type: BicsLevel7Segment
type: Classifier
type: NamedIndividual
is level7 segment of: P&C Commercial Lines
is contemporary version of: http://data.ga-group.nl/ics/bics/14121011101010
is version of: http://data.ga-group.nl/ics/bics/14121011101010
replaces: http://data.ga-group.nl/ics/bics/2020/14121011101010
imported on: 2026-06-08T13:40:52.236Z
last refreshed on: 2026-06-08T13:41:38.450Z
source accessed on: 2024-06-05T14:42:36Z
source last accessed on: 2024-06-05T14:42:36Z
label: Beiträge - Geschäftswagen @de
label: Prêmios de auto comercial @pt
label: Premi auto commerciali @it
label: Primas auto comercial @es
label: Primes assur auto commerciale @fr
label: Коммерч. автомобили - премии @ru
label: 保険料-商用車 @ja
label: 商业汽车保险保费 @zh
label: 商業汽車險保費 @zh-hant
label: 상업용 자동차 보험료 @ko
definition: This segment includes premium revenue generated from commercial vehicle insurance.
notation: 14121011101010
valid from: 2024-06-07

Comml Prop & Multi-Peril Prem
type: BicsLevel7Segment
type: Classifier
type: NamedIndividual
is level7 segment of: P&C Commercial Lines
is contemporary version of: http://data.ga-group.nl/ics/bics/14121011101011
is version of: http://data.ga-group.nl/ics/bics/14121011101011
replaces: http://data.ga-group.nl/ics/bics/2020/14121011101011
imported on: 2026-06-08T13:40:52.236Z
last refreshed on: 2026-06-08T13:41:38.450Z
source accessed on: 2024-06-05T14:42:36Z
source last accessed on: 2024-06-05T14:42:36Z
label: Beiträge - Gew. Immobilien & Mehrgefahren @de
label: Prêm prop com e multi-riscos @pt
label: Prem prop comm e multiper @it
label: Primas propiedad com y multi peligro @es
label: Primes assur comm prop/multi-risque @fr
label: Ком. собств/Многориск. премии @ru
label: 保険料-商業不動産･企業総合 @ja
label: 商业房地产与多重保险保费 @zh
label: 商業產物及綜合險保費 @zh-hant
label: 상업용 부동산 & 다중위험 보험료 @ko
definition: This segment includes premium revenue generated from commercial property and commercial multi-peril insurance.
notation: 14121011101011
valid from: 2024-06-07

Financial Guarantee Premiums
type: BicsLevel7Segment
type: Classifier
type: NamedIndividual
is level7 segment of: P&C Commercial Lines
is contemporary version of: http://data.ga-group.nl/ics/bics/14121011101012
is version of: http://data.ga-group.nl/ics/bics/14121011101012
replaces: http://data.ga-group.nl/ics/bics/2020/14121011101012
imported on: 2026-06-08T13:40:52.236Z
last refreshed on: 2026-06-08T13:41:38.450Z
source accessed on: 2024-06-05T14:42:36Z
source last accessed on: 2024-06-05T14:42:36Z
label: Beiträge - Finanz. Garantie @de
label: Prêmios de garantia financeira @pt
label: Premi garanzia finanziaria @it
label: Primas de garantía financiera @es
label: Primes pour garantie financière @fr
label: Финансовые гарантии - премии @ru
label: 保険料-金融保証 @ja
label: 金融保證險保費 @zh-hant
label: 金融担保险保费 @zh
label: 金融担���险保费 @zh
label: 금융보증 보험료 @ko
definition: This segment includes premium revenue generated from financial guarantee insurance.
notation: 14121011101012
valid from: 2024-06-07

Liability Premiums
type: BicsLevel7Segment
type: Classifier
type: NamedIndividual
is level7 segment of: P&C Commercial Lines
is contemporary version of: http://data.ga-group.nl/ics/bics/14121011101013
is version of: http://data.ga-group.nl/ics/bics/14121011101013
replaces: http://data.ga-group.nl/ics/bics/2020/14121011101013
imported on: 2026-06-08T13:40:52.236Z
last refreshed on: 2026-06-08T13:41:38.450Z
source accessed on: 2024-06-05T14:42:36Z
source last accessed on: 2024-06-05T14:42:36Z
label: Beiträge - Verbindlichkeiten @de
label: Prêmios de passivo @pt
label: Premi responsabilità @it
label: Primas de responsabilidad @es
label: Primes pour responsabilité civile @fr
label: Премии - обязательства @ru
label: 保険料-責任保険 @ja
label: 責任險保費 @zh-hant
label: 责任保险保费 @zh
label: 책임보험 보험료 @ko
definition: This segment includes premium revenue generated from commercial liability insurance, such as fraud, general liability, medical malpractice, professional or product liability, environmental liability, director's and officer's liability, aviation, boiler and machinery, and ocean marine.
notation: 14121011101013
valid from: 2024-06-07

Surety & Fidelity Premiums
type: BicsLevel7Segment
type: Classifier
type: NamedIndividual
is level7 segment of: P&C Commercial Lines
is contemporary version of: http://data.ga-group.nl/ics/bics/14121011101014
is version of: http://data.ga-group.nl/ics/bics/14121011101014
replaces: http://data.ga-group.nl/ics/bics/2020/14121011101014
imported on: 2026-06-08T13:40:52.236Z
last refreshed on: 2026-06-08T13:41:38.450Z
source accessed on: 2024-06-05T14:42:36Z
source last accessed on: 2024-06-05T14:42:36Z
label: Beiträge - Kaution & Sicherheitsleistung @de
label: Prêmios de fidelidade e garantia @pt
label: Premi cauzione e fideiussione @it
label: Primas de garantía y fidelidad @es
label: Primes pour détournement et vol @fr
label: Гарантии и поручительства - премии @ru
label: 保证与忠诚保险保费 @zh
label: 保证与忠诚保险保�� @zh
label: 保険料-身元保証･信用 @ja
label: 確實保證及誠實險保費 @zh-hant
label: 신원 & 보증 보험료 @ko
definition: This segment includes premium revenue generated from surety and fidelity bond insurance.
notation: 14121011101014
valid from: 2024-06-07

Workers Compensation Premiums
type: BicsLevel7Segment
type: Classifier
type: NamedIndividual
is level7 segment of: P&C Commercial Lines
is contemporary version of: http://data.ga-group.nl/ics/bics/14121011101015
is version of: http://data.ga-group.nl/ics/bics/14121011101015
replaces: http://data.ga-group.nl/ics/bics/2020/14121011101015
imported on: 2026-06-08T13:40:52.236Z
last refreshed on: 2026-06-08T13:41:38.450Z
source accessed on: 2024-06-05T14:42:36Z
source last accessed on: 2024-06-05T14:42:36Z
label: Beiträge - Arbeitsunfallversicherung @de
label: Prêmios de indenização trabalhista @pt
label: Premi infortuni sul lavoro @it
label: Primas de compensación de trabajadores @es
label: Primes pour rémunération des employés @fr
label: Компенсации работникам - премии @ru
label: 保険料-労働者災害補償 @ja
label: 勞工賠償險保費 @zh-hant
label: 工人薪酬保险保费 @zh
label: 산재보험 보험료 @ko
definition: This segment includes premium revenue generated from workers' compensation insurance.
notation: 14121011101015
valid from: 2024-06-07

Other Commercial Premiums
type: BicsLevel7Segment
type: Classifier
type: NamedIndividual
is level7 segment of: P&C Commercial Lines
is contemporary version of: http://data.ga-group.nl/ics/bics/14121011101016
is version of: http://data.ga-group.nl/ics/bics/14121011101016
replaces: http://data.ga-group.nl/ics/bics/2020/14121011101016
imported on: 2026-06-08T13:40:52.236Z
last refreshed on: 2026-06-08T13:41:38.450Z
source accessed on: 2024-06-05T14:42:36Z
source last accessed on: 2024-06-05T14:42:36Z
label: Altri premi commerciali @it
label: Autres primes commerciales @fr
label: Beiträge - Sonstige gewerblich @de
label: Otras primas comerciales @es
label: Outros prêmios comerciais @pt
label: Прочие коммерческие премии @ru
label: 保険料-その他商業 @ja
label: 其他商业保险保费 @zh
label: 其他商業險保費 @zh-hant
label: 기타 상업용 보험료 @ko
definition: This segment includes premium revenue generated from other commercial lines of business, such as terrorism, unidentified specialty lines, and other casualty lines not elsewhere classified.
notation: 14121011101016
valid from: 2024-06-07

P&C Commercial Lines
type: BicsLevel6Segment
type: Classifier
type: NamedIndividual
is level6 segment of: P&C Insurance Premiums
is contemporary version of: http://data.ga-group.nl/ics/bics/141210111010
is version of: http://data.ga-group.nl/ics/bics/141210111010
replaces: http://data.ga-group.nl/ics/bics/2020/141210111010
imported on: 2026-06-08T13:40:52.236Z
last refreshed on: 2026-06-08T13:41:38.450Z
source accessed on: 2024-06-05T14:42:36Z
source last accessed on: 2024-06-05T14:42:36Z
label: Assur IARD commerciale @fr
label: Gewerbliche S&U-Versicherung @de
label: Líneas comerciales PyC @es
label: Linhas comerciais P&C @pt
label: P&C Linee commerciali @it
label: P&C 기업성보험 @ko
label: P&C商业保险 @zh
label: Коммерческое страхование (имущ/отв) @ru
label: 損保 企業保険 @ja
label: 產物意外商業保險 @zh-hant
definition: This segment includes premium revenue generated from commercial lines of insurance, such as workers' compensation, commercial auto, commercial multi-peril, surety and fidelity, liability, and other commercial lines of business.
notation: 141210111010
valid from: 2024-06-07

Homeowners Premiums
type: BicsLevel7Segment
type: Classifier
type: NamedIndividual
is level7 segment of: P&C Personal Lines
is contemporary version of: http://data.ga-group.nl/ics/bics/14121011101110
is version of: http://data.ga-group.nl/ics/bics/14121011101110
replaces: http://data.ga-group.nl/ics/bics/2020/14121011101110
imported on: 2026-06-08T13:40:52.236Z
last refreshed on: 2026-06-08T13:41:38.450Z
source accessed on: 2024-06-05T14:42:36Z
source last accessed on: 2024-06-05T14:42:36Z
label: Beiträge - Hauseigentümer @de
label: Prêmios de proprietários de casa @pt
label: Premi proprietari case @it
label: Primas domésticas @es
label: Primes pour habitation @fr
label: Домовладельцы - премии @ru
label: 业主保险保费 @zh
label: 保険料-住宅 @ja
label: 自有住宅險保費 @zh-hant
label: 주택보유자 보험료 @ko
definition: This segment includes premium revenue generated from coverage of residential dwellings and farms.
notation: 14121011101110
valid from: 2024-06-07

Personal Auto Premiums
type: BicsLevel7Segment
type: Classifier
type: NamedIndividual
is level7 segment of: P&C Personal Lines
is contemporary version of: http://data.ga-group.nl/ics/bics/14121011101111
is version of: http://data.ga-group.nl/ics/bics/14121011101111
replaces: http://data.ga-group.nl/ics/bics/2020/14121011101111
imported on: 2026-06-08T13:40:52.236Z
last refreshed on: 2026-06-08T13:41:38.450Z
source accessed on: 2024-06-05T14:42:36Z
source last accessed on: 2024-06-05T14:42:36Z
label: Beiträge - Privatwagen @de
label: Prêmios de autos pessoais @pt
label: Premi auto personali @it
label: Primas personales de auto @es
label: Primes pour voitures particulières @fr
label: Персональн. автомобили - премии @ru
label: 个人汽车保险保费 @zh
label: 保険料-個人向け自動車 @ja
label: 個人車險保費 @zh-hant
label: 개인자동차보험료 @ko
definition: This segment includes premium revenue generated from coverage of all auto physical damage claims and personal auto liability for both standard and non-standard drivers.
notation: 14121011101111
valid from: 2024-06-07

Other Personal Premiums
type: BicsLevel7Segment
type: Classifier
type: NamedIndividual
is level7 segment of: P&C Personal Lines
is contemporary version of: http://data.ga-group.nl/ics/bics/14121011101112
is version of: http://data.ga-group.nl/ics/bics/14121011101112
replaces: http://data.ga-group.nl/ics/bics/2020/14121011101112
imported on: 2026-06-08T13:40:52.236Z
last refreshed on: 2026-06-08T13:41:38.450Z
source accessed on: 2024-06-05T14:42:36Z
source last accessed on: 2024-06-05T14:42:36Z
label: Altri premi personali @it
label: Autres primes personnelles @fr
label: Otras primas personales @es
label: Outros prêmios pessoais @pt
label: Sonstige private Beiträge @de
label: Прочие персональные премии @ru
label: 保険料-その他個人 @ja
label: 其他个人保险保费 @zh
label: 其他個人險保費 @zh-hant
label: 기타개인보험료 @ko
definition: This segment includes premium revenue generated from other personal lines of business not elsewhere classified.
notation: 14121011101112
valid from: 2024-06-07

P&C Personal Lines
type: BicsLevel6Segment
type: Classifier
type: NamedIndividual
is level6 segment of: P&C Insurance Premiums
is contemporary version of: http://data.ga-group.nl/ics/bics/141210111011
is version of: http://data.ga-group.nl/ics/bics/141210111011
replaces: http://data.ga-group.nl/ics/bics/2020/141210111011
imported on: 2026-06-08T13:40:52.236Z
last refreshed on: 2026-06-08T13:41:38.450Z
source accessed on: 2024-06-05T14:42:36Z
source last accessed on: 2024-06-05T14:42:36Z
label: IARD pour particuliers @fr
label: Líneas personales PyC @es
label: Linhas pessoais P&C @pt
label: P&C Linee personali @it
label: P&C 가계성보험 @ko
label: P&C个人保险 @zh
label: Private S&U-Versicherung @de
label: Частное страхование (Имущ/отв) @ru
label: 損保 個人保険 @ja
label: 產物及意外個人保險 @zh-hant
definition: This segment includes premium revenue generated from personal lines of insurance, such as home and auto.
notation: 141210111011
valid from: 2024-06-07

P&C Insurance Premiums
type: BicsLevel5Segment
type: Classifier
type: NamedIndividual
is level5 segment of: P&C Insurance
is contemporary version of: http://data.ga-group.nl/ics/bics/1412101110
is version of: http://data.ga-group.nl/ics/bics/1412101110
replaces: http://data.ga-group.nl/ics/bics/2020/1412101110
imported on: 2026-06-08T13:40:52.236Z
last refreshed on: 2026-06-08T13:41:38.450Z
source accessed on: 2024-06-05T14:42:36Z
source last accessed on: 2024-06-05T14:42:36Z
label: P&C 보험 보험료 @ko
label: Prêmios de seguro P&C @pt
label: Premi assicurazione P&C @it
label: Primas de seguro PyC @es
label: Primes assur IARD @fr
label: S&U-Versicherungsbeiträge @de
label: Страх. собств. и ущ. - премии @ru
label: 保険料-損害保険 @ja
label: 產物意外險保費 @zh-hant
label: 财产与意外保险保费 @zh
definition: This segment includes premium revenue generated from underwriting property and casualty insurance policies. Includes automobile, property damage, casualty, theft, fire, malpractice, marine, workers' compensation, and homeowners insurance.
notation: 1412101110
valid from: 2024-06-07

Investment Income - P&C
type: BicsLevel6Segment
type: Classifier
type: NamedIndividual
is level6 segment of: P&C Insurance Non-Premium
is contemporary version of: http://data.ga-group.nl/ics/bics/141210111110
is version of: http://data.ga-group.nl/ics/bics/141210111110
replaces: http://data.ga-group.nl/ics/bics/2020/141210111110
imported on: 2026-06-08T13:40:52.236Z
last refreshed on: 2026-06-08T13:41:38.450Z
source accessed on: 2024-06-05T14:42:36Z
source last accessed on: 2024-06-05T14:42:36Z
label: Ingreso de inversión - P&C @es
label: Investitionsertrag - S&U @de
label: Produit financier - IARD @fr
label: Redd investimenti - P&C @it
label: Renda de investimento - P&C @pt
label: Инвестиц. доход-Собств./ущерб @ru
label: 投資損益-損害保険 @ja
label: 投資收入-產物意外險 @zh-hant
label: 投资收入- P&C @zh
label: 投���損益-損害保険 @ja
label: 투자수익-P&C @ko
definition: This segment includes investment income generated from direct property and casualty insurance.
notation: 141210111110
valid from: 2024-06-07

Realized Gains/Losses - P&C
type: BicsLevel6Segment
type: Classifier
type: NamedIndividual
is level6 segment of: P&C Insurance Non-Premium
is contemporary version of: http://data.ga-group.nl/ics/bics/141210111111
is version of: http://data.ga-group.nl/ics/bics/141210111111
replaces: http://data.ga-group.nl/ics/bics/2020/141210111111
imported on: 2026-06-08T13:40:52.236Z
last refreshed on: 2026-06-08T13:41:38.450Z
source accessed on: 2024-06-05T14:42:36Z
source last accessed on: 2024-06-05T14:42:36Z
label: Beneficios/pérdidas realizadas - P&C @es
label: Ganhos/Perdas - P&C @pt
label: P/P réalisés - IARD @fr
label: Profitti/perdite realizz - P&C @it
label: Realisierte Gewinne/Verluste - S&U @de
label: Реализов. прибыль/убытки-Собств./ущерб @ru
label: 実現損益-損害保険 @ja
label: 已实现损益-P&C @zh
label: 已實現損益-產物意外險 @zh-hant
label: 실현 이익/손실-P&C @ko
definition: This segment includes realized gains/losses generated from direct property and casualty insurance.
notation: 141210111111
valid from: 2024-06-07

Fees & Other Income - P&C
type: BicsLevel6Segment
type: Classifier
type: NamedIndividual
is level6 segment of: P&C Insurance Non-Premium
is contemporary version of: http://data.ga-group.nl/ics/bics/141210111112
is version of: http://data.ga-group.nl/ics/bics/141210111112
replaces: http://data.ga-group.nl/ics/bics/2020/141210111112
imported on: 2026-06-08T13:40:52.236Z
last refreshed on: 2026-06-08T13:41:38.450Z
source accessed on: 2024-06-05T14:42:36Z
source last accessed on: 2024-06-05T14:42:36Z
label: Frais et autres revenus - IARD @fr
label: Gebühren & sonstiger Ertrag - S&U @de
label: Tarifas y otro ingreso - P&C @es
label: Tasse e altro reddito - P&C @it
label: Taxas e outras rendas - P&C @pt
label: Сборы и др. доход (собств./ущерб) @ru
label: 手数料･その他収益-損害保険 @ja
label: 費用及其他收入-產物意外險 @zh-hant
label: 费用与其他收入- P&C @zh
label: 수수료 & 기타수익-P&C @ko
definition: This segment includes other income generated from direct property and casualty insurance.
notation: 141210111112
valid from: 2024-06-07

P&C Insurance Non-Premium
type: BicsLevel5Segment
type: Classifier
type: NamedIndividual
is level5 segment of: P&C Insurance
is contemporary version of: http://data.ga-group.nl/ics/bics/1412101111
is version of: http://data.ga-group.nl/ics/bics/1412101111
replaces: http://data.ga-group.nl/ics/bics/2020/1412101111
imported on: 2026-06-08T13:40:52.236Z
last refreshed on: 2026-06-08T13:41:38.450Z
source accessed on: 2024-06-05T14:42:36Z
source last accessed on: 2024-06-05T14:42:36Z
label: Não prêmio de seguro P&C @pt
label: No primas de seguro PyC @es
label: Non premi assicurazione P&C @it
label: P&C 보험 보험료외 @ko
label: Rev IARD h primes @fr
label: S&U-Versicherung - Nicht-Beiträge @de
label: Страх. собств. и ущ. - непрем. дхд @ru
label: 保険料外収入-損害保険 @ja
label: 產物意外險非保費收入 @zh-hant
label: 财产与意外保险非保费 @zh
definition: This segment includes total non-premium revenue generated from direct property and casualty insurance.
notation: 1412101111
valid from: 2024-06-07

P&C Insurance
type: BicsLevel4SubIndustry
type: Classifier
type: NamedIndividual
is sub industry of: Insurance
is contemporary version of: http://data.ga-group.nl/ics/bics/14121011
is version of: http://data.ga-group.nl/ics/bics/14121011
replaces: http://data.ga-group.nl/ics/bics/2020/14121011
imported on: 2026-06-08T13:40:52.236Z
last refreshed on: 2026-06-08T13:41:38.450Z
source accessed on: 2024-06-05T14:42:36Z
source last accessed on: 2024-06-05T14:42:36Z
label: Assicurazione P&C @it
label: Assur IARD @fr
label: P&C 보험 @ko
label: Reaseguro PyC @es
label: S&U-Versicherung @de
label: Seguro P&C @pt
label: Страхование @ru
label: 損害保険 @ja
label: 產物及意外保險 @zh-hant
label: 财产与意外保险 @zh
definition: This industry subgroup includes companies that directly underwrite property and casualty insurance policies, such as automobile, property damage, casualty, theft, fire, malpractice, marine, workers' compensation, and homeowners insurance.
notation: 14121011
valid from: 2024-06-07

Islamic Health Ins Premiums
type: BicsLevel6Segment
type: Classifier
type: NamedIndividual
is level6 segment of: Health Insurance - Islamic
is contemporary version of: http://data.ga-group.nl/ics/bics/141210121010
is version of: http://data.ga-group.nl/ics/bics/141210121010
replaces: http://data.ga-group.nl/ics/bics/2020/141210121010
imported on: 2026-06-08T13:40:52.236Z
last refreshed on: 2026-06-08T13:41:38.450Z
source accessed on: 2024-06-05T14:42:36Z
source last accessed on: 2024-06-05T14:42:36Z
label: Beiträge - Islamische KV @de
label: Prêmios de seg saúde islâmicos @pt
label: Premi assic medica islamica @it
label: Primas islámicas de seg de salud @es
label: Primes assur santé islamique @fr
label: Исламское мед. страх. - премии @ru
label: 伊斯兰健康保险保费 @zh
label: 伊斯蘭健康險保費 @zh-hant
label: 保険料-ｲｽﾗﾑ健康保険 @ja
label: 이슬람 건강보험 보험료 @ko
definition: This segment includes premium revenue generated from direct health insurance in compliance with Islamic law.
notation: 141210121010
valid from: 2024-06-07

Invst Inc - Islamic Health Ins
type: BicsLevel7Segment
type: Classifier
type: NamedIndividual
is level7 segment of: Islamic Health Ins Non-Premium
is contemporary version of: http://data.ga-group.nl/ics/bics/14121012101110
is version of: http://data.ga-group.nl/ics/bics/14121012101110
replaces: http://data.ga-group.nl/ics/bics/2020/14121012101110
imported on: 2026-06-08T13:40:52.236Z
last refreshed on: 2026-06-08T13:41:38.450Z
source accessed on: 2024-06-05T14:42:36Z
source last accessed on: 2024-06-05T14:42:36Z
label: Ingreso de inversión - seguro de vida islámico @es
label: Investitionsertrag - Islamische KV @de
label: Prod financ - Ass santé islamique @fr
label: Redd invest - Assic medica islamica @it
label: Renda de inv - Seg saúde islâmico @pt
label: Инвест. доход - ислам. мед. страхование @ru
label: Инвест. дохо�� - ислам. мед. страхование @ru
label: 投資収益-ｲｽﾗﾑ健康保険 @ja
label: 投資收入 - 伊斯蘭健康險 @zh-hant
label: 投资收入-伊斯兰健康保险 @zh
label: 투자수익 - 이슬람 건강보험 @ko
definition: This segment includes investment income generated from direct health insurance in compliance with Islamic law.
notation: 14121012101110
valid from: 2024-06-07

Realized G/L - Islamic Health
type: BicsLevel7Segment
type: Classifier
type: NamedIndividual
is level7 segment of: Islamic Health Ins Non-Premium
is contemporary version of: http://data.ga-group.nl/ics/bics/14121012101111
is version of: http://data.ga-group.nl/ics/bics/14121012101111
replaces: http://data.ga-group.nl/ics/bics/2020/14121012101111
imported on: 2026-06-08T13:40:52.236Z
last refreshed on: 2026-06-08T13:41:38.450Z
source accessed on: 2024-06-05T14:42:36Z
source last accessed on: 2024-06-05T14:42:36Z
label: G/P realizados - Saúde islâmico @pt
label: P/G realizados - sanidad islámico @es
label: P/P réalisés - Ass santé islamique @fr
label: P/P realizzati - Medica islamica @it
label: Realisierte G/V - Islamische KV @de
label: Реализ. П/У - исл. мед. страх. @ru
label: 実現損益-ｲｽﾗﾑ健康保険 @ja
label: 已实现损益-伊斯兰健康保险 @zh
label: 已實現損益 - 伊斯蘭健康險 @zh-hant
label: 실현손익 - 이슬람 건강 @ko
definition: This segment includes realized gains/losses generated from direct health insurance in compliance with Islamic law.
notation: 14121012101111
valid from: 2024-06-07

Other Income - Islamic Health
type: BicsLevel7Segment
type: Classifier
type: NamedIndividual
is level7 segment of: Islamic Health Ins Non-Premium
is contemporary version of: http://data.ga-group.nl/ics/bics/14121012101112
is version of: http://data.ga-group.nl/ics/bics/14121012101112
replaces: http://data.ga-group.nl/ics/bics/2020/14121012101112
imported on: 2026-06-08T13:40:52.236Z
last refreshed on: 2026-06-08T13:41:38.450Z
source accessed on: 2024-06-05T14:42:36Z
source last accessed on: 2024-06-05T14:42:36Z
label: Altro reddito - Medica islamica @it
label: Autres rev- Ass santé islamique @fr
label: Otro ingreso - sanidad islámica @es
label: Outra renda - Saúde islâmico @pt
label: Sonstiger Ertrag - Islamische KV @de
label: Прочий доход - ислам. мед. страх. @ru
label: 他収益-ｲｽﾗﾑ健康保険 @ja
label: 其他收入 - 伊斯蘭健康險 @zh-hant
label: 其他收入-伊斯兰健康保险 @zh
label: 기타수익 - 이슬람 건강 @ko
definition: This segment includes other income generated from direct health insurance in compliance with Islamic law.
notation: 14121012101112
valid from: 2024-06-07

Islamic Health Ins Non-Premium
type: BicsLevel6Segment
type: Classifier
type: NamedIndividual
is level6 segment of: Health Insurance - Islamic
is contemporary version of: http://data.ga-group.nl/ics/bics/141210121011
is version of: http://data.ga-group.nl/ics/bics/141210121011
replaces: http://data.ga-group.nl/ics/bics/2020/141210121011
imported on: 2026-06-08T13:40:52.236Z
last refreshed on: 2026-06-08T13:41:38.450Z
source accessed on: 2024-06-05T14:42:36Z
source last accessed on: 2024-06-05T14:42:36Z
label: Assic sanità islam non premi @it
label: KKV Islamisch, ohne Beiträge @de
label: Rev santé islamique h primes @fr
label: Seg méd islámico sin prima @es
label: Seg saúde islâmico não prêmio @pt
label: Исламск. страх. жизни - непрем. @ru
label: 伊斯兰健康保险非保费 @zh
label: 伊斯蘭健康保險-非保費 @zh-hant
label: 保険料外収入-ｲｽﾗﾑ健康保険 @ja
label: 이슬람 건강 보험 보험료외 @ko
definition: This segment includes total non-premium revenue generated from direct health insurance in compliance with Islamic law.
notation: 141210121011
valid from: 2024-06-07

Health Insurance - Islamic
type: BicsLevel5Segment
type: Classifier
type: NamedIndividual
is level5 segment of: Islamic Insurance
is contemporary version of: http://data.ga-group.nl/ics/bics/1412101210
is version of: http://data.ga-group.nl/ics/bics/1412101210
replaces: http://data.ga-group.nl/ics/bics/2020/1412101210
imported on: 2026-06-08T13:40:52.236Z
last refreshed on: 2026-06-08T13:41:38.450Z
source accessed on: 2024-06-05T14:42:36Z
source last accessed on: 2024-06-05T14:42:36Z
label: Assic med-Islamica @it
label: Assu santé islamique @fr
label: KV - Islamisch @de
label: Seg saúde - Islâmico @pt
label: Seguro médico - Islam @es
label: Страхование жизни (Исламские) @ru
label: 伊斯蘭健康保險 @zh-hant
label: 健康保险 - 伊斯兰 @zh
label: 건강보험업-이슬람 @ko
label: ｲｽﾗﾑ健康保険 @ja
definition: This segment includes companies that directly underwrite health insurance policies in compliance with Islamic law.
notation: 1412101210
valid from: 2024-06-07

Islamic Life Ins Premiums
type: BicsLevel6Segment
type: Classifier
type: NamedIndividual
is level6 segment of: Life Insurance - Islamic
is contemporary version of: http://data.ga-group.nl/ics/bics/141210121110
is version of: http://data.ga-group.nl/ics/bics/141210121110
replaces: http://data.ga-group.nl/ics/bics/2020/141210121110
imported on: 2026-06-08T13:40:52.236Z
last refreshed on: 2026-06-08T13:41:38.450Z
source accessed on: 2024-06-05T14:42:36Z
source last accessed on: 2024-06-05T14:42:36Z
label: Beiträge - Islamische LV @de
label: Prêmios de seg vida islâmicos @pt
label: Premi assic vita islamica @it
label: Primas islámicas de seg de vida @es
label: Primes assur vie islamique @fr
label: Исламское страх. жизни - премии @ru
label: 伊斯兰寿险保费 @zh
label: 伊斯蘭壽險保費 @zh-hant
label: 保険料-ｲｽﾗﾑ生命保険 @ja
label: 이슬람 생명보험 보험료 @ko
definition: This segment includes premium revenue generated from direct life insurance in compliance with Islamic law.
notation: 141210121110
valid from: 2024-06-07

Invst Income - Islamic Life Ins
type: BicsLevel7Segment
type: Classifier
type: NamedIndividual
is level7 segment of: Islamic Life Ins Non-Premium
is contemporary version of: http://data.ga-group.nl/ics/bics/14121012111110
is version of: http://data.ga-group.nl/ics/bics/14121012111110
replaces: http://data.ga-group.nl/ics/bics/2020/14121012111110
imported on: 2026-06-08T13:40:52.236Z
last refreshed on: 2026-06-08T13:41:38.450Z
source accessed on: 2024-06-05T14:42:36Z
source last accessed on: 2024-06-05T14:42:36Z
label: Ingreso - seguro de vida islámico @es
label: Investitionsertrag - Islamische LV @de
label: Prod financ - Assur-vie islamique @fr
label: Rec invest - Seg vida islâmico @pt
label: Reddito invst - Assic vita islamica @it
label: Инвестиц. доход - ислам. страх. жизни @ru
label: 投資収益-ｲｽﾗﾑ生命保険 @ja
label: 投資收入 - 伊斯蘭人壽保險 @zh-hant
label: 投资收入-伊斯兰人寿保险 @zh
label: 투자수익 - 이슬람 생명 보험 @ko
definition: This segment includes investment income generated from direct life insurance in compliance with Islamic law.
notation: 14121012111110
valid from: 2024-06-07

Realized G/L - Islamic Life Ins
type: BicsLevel7Segment
type: Classifier
type: NamedIndividual
is level7 segment of: Islamic Life Ins Non-Premium
is contemporary version of: http://data.ga-group.nl/ics/bics/14121012111111
is version of: http://data.ga-group.nl/ics/bics/14121012111111
replaces: http://data.ga-group.nl/ics/bics/2020/14121012111111
imported on: 2026-06-08T13:40:52.236Z
last refreshed on: 2026-06-08T13:41:38.450Z
source accessed on: 2024-06-05T14:42:36Z
source last accessed on: 2024-06-05T14:42:36Z
label: G/P realizados - Seg vida islâmico @pt
label: P/G realizados - seguro islámico de vida @es
label: P/P réalisés - Assur-vie islamique @fr
label: P/P realizzati - Assic vita islamica @it
label: Realisierte G/V - Islamische LV @de
label: Реализ. П/У - исл. страх. жизни @ru
label: 実現損益-ｲｽﾗﾑ生命保険 @ja
label: 已实现损益-伊斯兰人寿保险 @zh
label: 已實現損益 - 伊斯蘭人壽保險 @zh-hant
label: 已實現損益 - ���斯蘭人壽保險 @zh-hant
label: 실현손익 - 이슬람 생명 보험 @ko
definition: This segment includes realized gains/losses generated from direct life insurance in compliance with Islamic law.
notation: 14121012111111
valid from: 2024-06-07

Other Income - Islamic Life Ins
type: BicsLevel7Segment
type: Classifier
type: NamedIndividual
is level7 segment of: Islamic Life Ins Non-Premium
is contemporary version of: http://data.ga-group.nl/ics/bics/14121012111112
is version of: http://data.ga-group.nl/ics/bics/14121012111112
replaces: http://data.ga-group.nl/ics/bics/2020/14121012111112
imported on: 2026-06-08T13:40:52.236Z
last refreshed on: 2026-06-08T13:41:38.450Z
source accessed on: 2024-06-05T14:42:36Z
source last accessed on: 2024-06-05T14:42:36Z
label: Altro reddito - Assic vita islamica @it
label: Autres rev - Assur-vie islamique @fr
label: Otro ingreso - seguro de vida islámico @es
label: Outras receitas - Seg vida islâmico @pt
label: Sonstiger Ertrag - Islamische LV @de
label: Проч. доход - ислам. страх. жизни @ru
label: その他収益-ｲｽﾗﾑ生命保険 @ja
label: 其他收入 - 伊斯蘭人壽保險 @zh-hant
label: 其他收入-伊斯兰人寿保险 @zh
label: 기타수익 - 이슬람 생명 보험 @ko
definition: This segment includes other income generated from direct life insurance in compliance with Islamic law.
notation: 14121012111112
valid from: 2024-06-07

Islamic Life Ins Non-Premium
type: BicsLevel6Segment
type: Classifier
type: NamedIndividual
is level6 segment of: Life Insurance - Islamic
is contemporary version of: http://data.ga-group.nl/ics/bics/141210121111
is version of: http://data.ga-group.nl/ics/bics/141210121111
replaces: http://data.ga-group.nl/ics/bics/2020/141210121111
imported on: 2026-06-08T13:40:52.236Z
last refreshed on: 2026-06-08T13:41:38.450Z
source accessed on: 2024-06-05T14:42:36Z
source last accessed on: 2024-06-05T14:42:36Z
label: Assur vie islamique h primes @fr
label: Não prêmio seg vida islâmicos @pt
label: Nicht-Beiträge - Islamische LV @de
label: Non premi assic vita islamica @it
label: Seg de vida islámico sin prima @es
label: Исламское страх. жизни - непремиальн. @ru
label: 伊斯兰寿险非保费 @zh
label: 伊斯蘭壽險非保費收入 @zh-hant
label: 保険料外収入-ｲｽﾗﾑ生命保険 @ja
label: 이슬람 생명보험 보험료외 @ko
definition: This segment includes total non-premium revenue generated from direct life insurance in compliance with Islamic law.
notation: 141210121111
valid from: 2024-06-07

Life Insurance - Islamic
type: BicsLevel5Segment
type: Classifier
type: NamedIndividual
is level5 segment of: Islamic Insurance
is contemporary version of: http://data.ga-group.nl/ics/bics/1412101211
is version of: http://data.ga-group.nl/ics/bics/1412101211
replaces: http://data.ga-group.nl/ics/bics/2020/1412101211
imported on: 2026-06-08T13:40:52.236Z
last refreshed on: 2026-06-08T13:41:38.450Z
source accessed on: 2024-06-05T14:42:36Z
source last accessed on: 2024-06-05T14:42:36Z
label: Assicuraz vita - islamico @it
label: Assurance vie - Islamique @fr
label: Lebensversicherung - Islamisch @de
label: Seguro de vida - Islámico @es
label: Seguro de vida - islâmico @pt
label: Страхование жизни - Исламское @ru
label: 人壽保險 - 伊斯蘭 @zh-hant
label: 人寿保险- 伊斯兰 @zh
label: 생명 보험 - 이슬람 @ko
label: ｲｽﾗﾑ生命保険 @ja
definition: This segment includes companies that directly underwrite life insurance policies in compliance with Islamic law, including life, accidental death, disability, and annuities (pensions).
notation: 1412101211
valid from: 2024-06-07

Islamic P&C Ins Premiums
type: BicsLevel6Segment
type: Classifier
type: NamedIndividual
is level6 segment of: P&C Insurance - Islamic
is contemporary version of: http://data.ga-group.nl/ics/bics/141210121210
is version of: http://data.ga-group.nl/ics/bics/141210121210
replaces: http://data.ga-group.nl/ics/bics/2020/141210121210
imported on: 2026-06-08T13:40:52.236Z
last refreshed on: 2026-06-08T13:41:38.450Z
source accessed on: 2024-06-05T14:42:36Z
source last accessed on: 2024-06-05T14:42:36Z
label: Beiträge - Islamische S&U @de
label: Prêmios de seg P&C islâmicos @pt
label: Premi assic P&C islamica @it
label: Primas islámicas de seg daños @es
label: Primes assur IARD islamique @fr
label: Исламск. страхование СиУ - премии @ru
label: 伊斯兰财产与意外保险保费 @zh
label: 伊斯蘭產物意外險保費 @zh-hant
label: 保険料-ｲｽﾗﾑ損害保険 @ja
label: 이슬람 P&C 보험 보험료 @ko
definition: This segment includes premium revenue generated from direct property and casualty insurance in compliance with Islamic law.
notation: 141210121210
valid from: 2024-06-07

Invst Income - Islamic P&C Ins
type: BicsLevel7Segment
type: Classifier
type: NamedIndividual
is level7 segment of: Islamic P&C Ins Non-Premium
is contemporary version of: http://data.ga-group.nl/ics/bics/14121012121110
is version of: http://data.ga-group.nl/ics/bics/14121012121110
replaces: http://data.ga-group.nl/ics/bics/2020/14121012121110
imported on: 2026-06-08T13:40:52.236Z
last refreshed on: 2026-06-08T13:41:38.450Z
source accessed on: 2024-06-05T14:42:36Z
source last accessed on: 2024-06-05T14:42:36Z
label: Ingreso - seguro islámico de daños @es
label: Investitionsertrag - Islamische S&U-Versicherung @de
label: Prod financ - Assur IARD islamique @fr
label: Rec invest - Seg P&C islâmico @pt
label: Redd invest - Assic P&C islamica @it
label: Инвестиц. доход - ислам. страх. СиУ @ru
label: 投資収益-ｲｽﾗﾑ損害保険 @ja
label: 投資收入 - 伊斯蘭產物意外險 @zh-hant
label: 投资收入-伊斯兰财产与意外保险 @zh
label: 투자수익 - 이슬람 P&C 보험 @ko
definition: This segment includes investment income generated from direct property and casualty insurance in compliance with Islamic law.
notation: 14121012121110
valid from: 2024-06-07

Realized G/L - Islamic P&C Ins
type: BicsLevel7Segment
type: Classifier
type: NamedIndividual
is level7 segment of: Islamic P&C Ins Non-Premium
is contemporary version of: http://data.ga-group.nl/ics/bics/14121012121111
is version of: http://data.ga-group.nl/ics/bics/14121012121111
replaces: http://data.ga-group.nl/ics/bics/2020/14121012121111
imported on: 2026-06-08T13:40:52.236Z
last refreshed on: 2026-06-08T13:41:38.450Z
source accessed on: 2024-06-05T14:42:36Z
source last accessed on: 2024-06-05T14:42:36Z
label: G/P realizados - Seg P&C islâmico @pt
label: P/G realizados - seguro islámico de daños @es
label: P/P réalisés - Assur IARD islamique @fr
label: P/P realizzati - Assic P&C islamica @it
label: Realisierte G/V - Islamische S&U-Versicherung @de
label: Реализ. П/У - исл. страх. СиУ @ru
label: 実現損益-ｲｽﾗﾑ損害保険 @ja
label: 已实现损益-伊斯兰财产与意外保险 @zh
label: 已實現損益 - 伊斯蘭產物意外險 @zh-hant
label: 실현손익 - 이슬람 P&C 보험 @ko
definition: This segment includes realized gains/losses generated from direct property and casualty insurance in compliance with Islamic law.
notation: 14121012121111
valid from: 2024-06-07

Other Income - Islamic P&C Ins
type: BicsLevel7Segment
type: Classifier
type: NamedIndividual
is level7 segment of: Islamic P&C Ins Non-Premium
is contemporary version of: http://data.ga-group.nl/ics/bics/14121012121112
is version of: http://data.ga-group.nl/ics/bics/14121012121112
replaces: http://data.ga-group.nl/ics/bics/2020/14121012121112
imported on: 2026-06-08T13:40:52.236Z
last refreshed on: 2026-06-08T13:41:38.450Z
source accessed on: 2024-06-05T14:42:36Z
source last accessed on: 2024-06-05T14:42:36Z
label: Altro reddito - Assic P&C islamica @it
label: Autres rev- Assur IARD islamique @fr
label: Otro ingreso - seguro islámico de daños @es
label: Outras receitas - Seg P&C islâmico @pt
label: Sonstiger Ertrag - Islamische S&U-Versicherung @de
label: Пр. доход - ислам. страх. СиУ @ru
label: その他収益-ｲｽﾗﾑ損害保険 @ja
label: 其他收入 - 伊斯蘭產物意外險 @zh-hant
label: 其他收入-伊斯兰财产与意外保险 @zh
label: 기타수익 - 이슬람 P&C 보험 @ko
definition: This segment includes other income generated from direct property and casualty insurance in compliance with Islamic law.
notation: 14121012121112
valid from: 2024-06-07

Islamic P&C Ins Non-Premium
type: BicsLevel6Segment
type: Classifier
type: NamedIndividual
is level6 segment of: P&C Insurance - Islamic
is contemporary version of: http://data.ga-group.nl/ics/bics/141210121211
is version of: http://data.ga-group.nl/ics/bics/141210121211
replaces: http://data.ga-group.nl/ics/bics/2020/141210121211
imported on: 2026-06-08T13:40:52.236Z
last refreshed on: 2026-06-08T13:41:38.450Z
source accessed on: 2024-06-05T14:42:36Z
source last accessed on: 2024-06-05T14:42:36Z
label: Assur IARD islamique h primes @fr
label: Não prêmios de seg P&C islâmicos @pt
label: Nicht-Beiträge - Islamische S&U-Versicherung @de
label: Non premi assic P&C islamica @it
label: Seg de daños islámico sin prima @es
label: Исламск. страхование СиУ - непремиальн. @ru
label: 伊斯兰财产与意外保险非保费 @zh
label: 伊斯蘭產物意外險非保費收入 @zh-hant
label: 保険料外収入-ｲｽﾗﾑ損害保険 @ja
label: 이슬람 P&C 보험 보험료외 @ko
definition: This segment includes total non-premium revenue generated from direct property and casualty insurance in compliance with Islamic law.
notation: 141210121211
valid from: 2024-06-07

P&C Insurance - Islamic
type: BicsLevel5Segment
type: Classifier
type: NamedIndividual
is level5 segment of: Islamic Insurance
is contemporary version of: http://data.ga-group.nl/ics/bics/1412101212
is version of: http://data.ga-group.nl/ics/bics/1412101212
replaces: http://data.ga-group.nl/ics/bics/2020/1412101212
imported on: 2026-06-08T13:40:52.236Z
last refreshed on: 2026-06-08T13:41:38.450Z
source accessed on: 2024-06-05T14:42:36Z
source last accessed on: 2024-06-05T14:42:36Z
label: Assicurazione P&C - Islamica @it
label: Assur IARD - Islamique @fr
label: Islamische S&U-Versicherung @de
label: P&C 보험 - 이슬람 @ko
label: Seguro P&C - Islâmico @pt
label: Seguro de propiedad y daños - Islámico @es
label: Страхование СиУ - исламское @ru
label: 產物意外險 - 伊斯蘭 @zh-hant
label: 财产与意外保险-伊斯兰 @zh
label: ｲｽﾗﾑ損害保険 @ja
definition: This segment includes companies that directly underwrite property and casualty insurance policies in compliance with Islamic law. Includes automobile, property damage, casualty, theft, fire, malpractice, marine, workers' compensation, and homeowners insurance.
notation: 1412101212
valid from: 2024-06-07

Islamic Insurance
type: BicsLevel4SubIndustry
type: Classifier
type: NamedIndividual
is sub industry of: Insurance
is contemporary version of: http://data.ga-group.nl/ics/bics/14121012
is version of: http://data.ga-group.nl/ics/bics/14121012
replaces: http://data.ga-group.nl/ics/bics/2020/14121012
imported on: 2026-06-08T13:40:52.236Z
last refreshed on: 2026-06-08T13:41:38.450Z
source accessed on: 2024-06-05T14:42:36Z
source last accessed on: 2024-06-05T14:42:36Z
label: Assicurazione islamica @it
label: Assurance islamique @fr
label: Islamische Versicherung @de
label: Seguro islámico @es
label: Seguro islâmico @pt
label: Исламское страхование @ru
label: 伊斯兰保险 @zh
label: 伊斯蘭保險業 @zh-hant
label: 이슬람 보험 @ko
label: ｲｽﾗﾑ保険 @ja
definition: This industry subgroup includes companies that underwrite direct or indirect insurance products in compliance with Islamic law such as Takaful. Includes health and life insurance.
notation: 14121012
valid from: 2024-06-07

Life Reinsurance Premiums
type: BicsLevel6Segment
type: Classifier
type: NamedIndividual
is level6 segment of: Life Reinsurance
is contemporary version of: http://data.ga-group.nl/ics/bics/141210131010
is version of: http://data.ga-group.nl/ics/bics/141210131010
replaces: http://data.ga-group.nl/ics/bics/2020/141210131010
imported on: 2026-06-08T13:40:52.236Z
last refreshed on: 2026-06-08T13:41:38.450Z
source accessed on: 2024-06-05T14:42:36Z
source last accessed on: 2024-06-05T14:42:36Z
label: Beiträge - Lebensrückversicherung @de
label: Prêmios de resseguro de vida @pt
label: Premi riassicurazione vita @it
label: Primas de reaseguros de vida @es
label: Primes pour réassurance-vie @fr
label: Перестрахование жизни - премии @ru
label: 人壽再保險保費 @zh-hant
label: 人寿再保险保费 @zh
label: 保険料-生命再保険 @ja
label: 생명 재보험 보험료 @ko
definition: This segment includes premium revenue generated from life reinsurance insurance.
notation: 141210131010
valid from: 2024-06-07

Investment Income - Life Re
type: BicsLevel7Segment
type: Classifier
type: NamedIndividual
is level7 segment of: Life Reinsurance Non-Premium
is contemporary version of: http://data.ga-group.nl/ics/bics/14121013101110
is version of: http://data.ga-group.nl/ics/bics/14121013101110
replaces: http://data.ga-group.nl/ics/bics/2020/14121013101110
imported on: 2026-06-08T13:40:52.236Z
last refreshed on: 2026-06-08T13:41:38.450Z
source accessed on: 2024-06-05T14:42:36Z
source last accessed on: 2024-06-05T14:42:36Z
label: Ingreso de inversión - seg de vida @es
label: Investitionsertrag - LV Rück @de
label: Produit financier - Réassur-vie @fr
label: Reddito investimento - Riassic vita @it
label: Renda de investimento - Re vida @pt
label: Инвест. доход - перестр. жизни @ru
label: 投資収益-生命再保険 @ja
label: 投資收入 - 人壽再保險 @zh-hant
label: 投资收入-人寿再保险 @zh
label: 투자수익-생명재보험 @ko
definition: This segment includes investment-generated income from life reinsurance business.
notation: 14121013101110
valid from: 2024-06-07

Realized G/L - Life Reinsurance
type: BicsLevel7Segment
type: Classifier
type: NamedIndividual
is level7 segment of: Life Reinsurance Non-Premium
is contemporary version of: http://data.ga-group.nl/ics/bics/14121013101111
is version of: http://data.ga-group.nl/ics/bics/14121013101111
replaces: http://data.ga-group.nl/ics/bics/2020/14121013101111
imported on: 2026-06-08T13:40:52.236Z
last refreshed on: 2026-06-08T13:41:38.450Z
source accessed on: 2024-06-05T14:42:36Z
source last accessed on: 2024-06-05T14:42:36Z
label: G/P realizados - Resseguro de vida @pt
label: P/G realizados - reaseguro de vida @es
label: P/P réalisés - Réassur-vie @fr
label: P/P realizzati - Riassic vita @it
label: Realisierte G/V - LV Rück @de
label: Реализ. П/У - перестрах. жизни @ru
label: 実現損益-生命再保険 @ja
label: 已实现损益-人寿再保险 @zh
label: 已實現損益 - 人壽再保險 @zh-hant
label: 실현손익-생명재보험 @ko
definition: This segment includes realized gains/losses generated from life reinsurance business.
notation: 14121013101111
valid from: 2024-06-07

Other Income - Life Reinsurance
type: BicsLevel7Segment
type: Classifier
type: NamedIndividual
is level7 segment of: Life Reinsurance Non-Premium
is contemporary version of: http://data.ga-group.nl/ics/bics/14121013101112
is version of: http://data.ga-group.nl/ics/bics/14121013101112
replaces: http://data.ga-group.nl/ics/bics/2020/14121013101112
imported on: 2026-06-08T13:40:52.236Z
last refreshed on: 2026-06-08T13:41:38.450Z
source accessed on: 2024-06-05T14:42:36Z
source last accessed on: 2024-06-05T14:42:36Z
label: Altro reddito - Riassicurazione vita @it
label: Autres revenus - Réassurance-vie @fr
label: Otro ingreso - reaseguro de vida @es
label: Outras receitas - Resseguro de vida @pt
label: Sonstige Erträge - Lebensrückversicherung @de
label: Прочий доход - перестрах. жизни @ru
label: その他収益-生命再保険 @ja
label: 其他收入 - 人壽再保險 @zh-hant
label: 其他收入-人寿再保险 @zh
label: 기타수익 - 생명재보험 @ko
definition: This segment includes other income generated from life reinsurance business.
notation: 14121013101112
valid from: 2024-06-07

Life Reinsurance Non-Premium
type: BicsLevel6Segment
type: Classifier
type: NamedIndividual
is level6 segment of: Life Reinsurance
is contemporary version of: http://data.ga-group.nl/ics/bics/141210131011
is version of: http://data.ga-group.nl/ics/bics/141210131011
replaces: http://data.ga-group.nl/ics/bics/2020/141210131011
imported on: 2026-06-08T13:40:52.236Z
last refreshed on: 2026-06-08T13:41:38.450Z
source accessed on: 2024-06-05T14:42:36Z
source last accessed on: 2024-06-05T14:42:36Z
label: Lebensrückversicherung - Nicht-Beiträge @de
label: Não prêmio de resseguro de vida @pt
label: Non premi riassicurazione vita @it
label: Réassurance-vie h primes @fr
label: Reaseguros de vida sin prima @es
label: Перестр. жизни - непрем. дхд @ru
label: 人壽再保險非保費收入 @zh-hant
label: 人寿再保险非保费 @zh
label: 保険料外収入-生命再保険 @ja
label: 생명 재보험 보험료외 @ko
definition: This segment includes total non-premium revenue generated from life reinsurance.
notation: 141210131011
valid from: 2024-06-07

Life Reinsurance
type: BicsLevel5Segment
type: Classifier
type: NamedIndividual
is level5 segment of: Reinsurance
is contemporary version of: http://data.ga-group.nl/ics/bics/1412101310
is version of: http://data.ga-group.nl/ics/bics/1412101310
replaces: http://data.ga-group.nl/ics/bics/2020/1412101310
imported on: 2026-06-08T13:40:52.236Z
last refreshed on: 2026-06-08T13:41:38.450Z
source accessed on: 2024-06-05T14:42:36Z
source last accessed on: 2024-06-05T14:42:36Z
label: Comp réassurance vie @fr
label: Rückversicherung LV @de
label: Reaseguradoras vida @es
label: Resseguro de vida @pt
label: Riassicurazione vita @it
label: Перестрахование жизни @ru
label: 人壽再保險業者 @zh-hant
label: 人寿再保险承保人 @zh
label: 生命再保険 @ja
label: 생명 재보험업 @ko
definition: This segment includes companies that underwrite reinsurance for life insurance policies. Insurance types include life, accidental death, disability and annuities (pensions).
notation: 1412101310
valid from: 2024-06-07

Casualty Lines Premiums
type: BicsLevel7Segment
type: Classifier
type: NamedIndividual
is level7 segment of: P&C Reinsurance Premiums
is contemporary version of: http://data.ga-group.nl/ics/bics/14121013111010
is version of: http://data.ga-group.nl/ics/bics/14121013111010
replaces: http://data.ga-group.nl/ics/bics/2020/14121013111010
imported on: 2026-06-08T13:40:52.236Z
last refreshed on: 2026-06-08T13:41:38.450Z
source accessed on: 2024-06-05T14:42:36Z
source last accessed on: 2024-06-05T14:42:36Z
label: Beiträge - Unfallversicherungen @de
label: Prêmios de linhas de acidentes @pt
label: Premi linee sinistri @it
label: Primas de líneas de daños @es
label: Primes pour sinistres @fr
label: Линии ущерба - премии @ru
label: 保険料-災害保険 @ja
label: 意外险种保费 @zh
label: 意外險保費 @zh-hant
label: 상해보험 보험료 @ko
definition: This segment includes premium revenue generated from all casualty reinsurance, including specialty coverage and all other casualty lines, including all liability lines of business.
notation: 14121013111010
valid from: 2024-06-07

Property Lines Premiums
type: BicsLevel7Segment
type: Classifier
type: NamedIndividual
is level7 segment of: P&C Reinsurance Premiums
is contemporary version of: http://data.ga-group.nl/ics/bics/14121013111011
is version of: http://data.ga-group.nl/ics/bics/14121013111011
replaces: http://data.ga-group.nl/ics/bics/2020/14121013111011
imported on: 2026-06-08T13:40:52.236Z
last refreshed on: 2026-06-08T13:41:38.450Z
source accessed on: 2024-06-05T14:42:36Z
source last accessed on: 2024-06-05T14:42:36Z
label: Beiträge - Sachversicherungen @de
label: Prêmios de linhas de imóveis @pt
label: Premi linee proprietà @it
label: Primas de líneas de propiedad @es
label: Primes pour propriétés @fr
label: Границы землевладения - премии @ru
label: 保険料-不動産保険 @ja
label: 產險保費 @zh-hant
label: 财产险种保费 @zh
label: 손해보험 보험료 @ko
definition: This segment includes premium revenue generated from all property reinsurance such as catastrophe coverage.
notation: 14121013111011
valid from: 2024-06-07

P&C Reinsurance Premiums
type: BicsLevel6Segment
type: Classifier
type: NamedIndividual
is level6 segment of: P&C Reinsurance
is contemporary version of: http://data.ga-group.nl/ics/bics/141210131110
is version of: http://data.ga-group.nl/ics/bics/141210131110
replaces: http://data.ga-group.nl/ics/bics/2020/141210131110
imported on: 2026-06-08T13:40:52.236Z
last refreshed on: 2026-06-08T13:41:38.450Z
source accessed on: 2024-06-05T14:42:36Z
source last accessed on: 2024-06-05T14:42:36Z
label: Beiträge - S&U-Rückversicherung @de
label: P&C 재보험 보험료 @ko
label: Prêmios de resseguro P&C @pt
label: Premi riassicurazione P&C @it
label: Primas de reaseguro PyC @es
label: Primes réassurance IARD @fr
label: Перестрах. собств. и ущ. - премии @ru
label: 保険料-損害再保険 @ja
label: 產物意外再保險保費 @zh-hant
label: 财产与意外再保险保费 @zh
definition: This segment includes premium revenue generated from property and casualty reinsurance.
notation: 141210131110
valid from: 2024-06-07

Investment Income - P&C Re
type: BicsLevel7Segment
type: Classifier
type: NamedIndividual
is level7 segment of: P&C Reinsurance Non-Premium
is contemporary version of: http://data.ga-group.nl/ics/bics/14121013111110
is version of: http://data.ga-group.nl/ics/bics/14121013111110
replaces: http://data.ga-group.nl/ics/bics/2020/14121013111110
imported on: 2026-06-08T13:40:52.236Z
last refreshed on: 2026-06-08T13:41:38.450Z
source accessed on: 2024-06-05T14:42:36Z
source last accessed on: 2024-06-05T14:42:36Z
label: Ingreso de inversión - daños re @es
label: Investitionsertrag - S&U Rück @de
label: Produit financier - Réass IARD @fr
label: Receita de investimentos - Re P&C @pt
label: Reddito investimento - Riassic P&C @it
label: Инвест. доход - перестр. жизни @ru
label: 投資収益-損害再保険 @ja
label: 投資收入 - 產物意外再保險 @zh-hant
label: 投资收入-财产与意外再保险 @zh
label: 투자수익 - P&C 재보험 @ko
definition: This segment includes investment income generated from property and casualty reinsurance business.
notation: 14121013111110
valid from: 2024-06-07

Realized G/L - P&C Reinsurance
type: BicsLevel7Segment
type: Classifier
type: NamedIndividual
is level7 segment of: P&C Reinsurance Non-Premium
is contemporary version of: http://data.ga-group.nl/ics/bics/14121013111111
is version of: http://data.ga-group.nl/ics/bics/14121013111111
replaces: http://data.ga-group.nl/ics/bics/2020/14121013111111
imported on: 2026-06-08T13:40:52.236Z
last refreshed on: 2026-06-08T13:41:38.450Z
source accessed on: 2024-06-05T14:42:36Z
source last accessed on: 2024-06-05T14:42:36Z
label: G/P realizados - Resseguro P&C @pt
label: P/G realizados - reaseguro de daños @es
label: P/P réalisés - Réassurance IARD @fr
label: P/P realizzati - Riassicurazione P&C @it
label: Realisierte GuV - S&U Rück @de
label: Реализ. П/У - перестрах. СиУ @ru
label: 実現損益-損害再保険 @ja
label: 已实现损益-财产与意外再保险 @zh
label: 已實現損益 - 產物意外再保險 @zh-hant
label: 실현손익 - P&C 재보험 @ko
definition: This segment includes realized gains/losses generated from property and casualty reinsurance business.
notation: 14121013111111
valid from: 2024-06-07

Other Income - P&C Reinsurance
type: BicsLevel7Segment
type: Classifier
type: NamedIndividual
is level7 segment of: P&C Reinsurance Non-Premium
is contemporary version of: http://data.ga-group.nl/ics/bics/14121013111112
is version of: http://data.ga-group.nl/ics/bics/14121013111112
replaces: http://data.ga-group.nl/ics/bics/2020/14121013111112
imported on: 2026-06-08T13:40:52.236Z
last refreshed on: 2026-06-08T13:41:38.450Z
source accessed on: 2024-06-05T14:42:36Z
source last accessed on: 2024-06-05T14:42:36Z
label: Altro reddito - Riassic P&C @it
label: Autres rev - Réass IARD @fr
label: Otro ingreso - reaseguro de daños @es
label: Outras receitas - Resseguro P&C @pt
label: Sonstige Erträge - S&U-Rückversicherung @de
label: Прочий доход - перестр. СиУ @ru
label: その他収益-損害再保険 @ja
label: そ��他収益-損害再保険 @ja
label: 其他收入 - 產物意外再保險 @zh-hant
label: 其他收入-财产与意外再保险 @zh
label: 기타수익 - P&C 재보험 @ko
definition: This segment includes other income generated from property and casualty reinsurance business.
notation: 14121013111112
valid from: 2024-06-07

P&C Reinsurance Non-Premium
type: BicsLevel6Segment
type: Classifier
type: NamedIndividual
is level6 segment of: P&C Reinsurance
is contemporary version of: http://data.ga-group.nl/ics/bics/141210131111
is version of: http://data.ga-group.nl/ics/bics/141210131111
replaces: http://data.ga-group.nl/ics/bics/2020/141210131111
imported on: 2026-06-08T13:40:52.236Z
last refreshed on: 2026-06-08T13:41:38.450Z
source accessed on: 2024-06-05T14:42:36Z
source last accessed on: 2024-06-05T14:42:36Z
label: Não prêmio de resseguro P&C @pt
label: No primas de reaseguro PyC @es
label: Non premi riassicurazione P&C @it
label: P&C 재보험 보험료외 @ko
label: Réassurance IARD hors prime @fr
label: S&U-Rückversicherung - Nicht-Beiträge @de
label: Перестрах. собств. и ущ. - непрем. дхд @ru
label: 保険料外収入-損害再保険 @ja
label: 產物意外再保險非保費收入 @zh-hant
label: 财产与意外再保险非保费 @zh
definition: This segment includes total non-premium revenue generated from property and casualty reinsurance.
notation: 141210131111
valid from: 2024-06-07

P&C Reinsurance
type: BicsLevel5Segment
type: Classifier
type: NamedIndividual
is level5 segment of: Reinsurance
is contemporary version of: http://data.ga-group.nl/ics/bics/1412101311
is version of: http://data.ga-group.nl/ics/bics/1412101311
replaces: http://data.ga-group.nl/ics/bics/2020/1412101311
imported on: 2026-06-08T13:40:52.236Z
last refreshed on: 2026-06-08T13:41:38.450Z
source accessed on: 2024-06-05T14:42:36Z
source last accessed on: 2024-06-05T14:42:36Z
label: P&C Riassicurazione @it
label: P&C 재보험 @ko
label: P&C再保险 @zh
label: Réassurance IARD @fr
label: Reaseguro PyC @es
label: Resseguro P&C @pt
label: S&U-Rückversicherung @de
label: Перестрахование @ru
label: 損害再保険 @ja
label: 產物意外再保險 @zh-hant
definition: This segment includes companies that underwrite reinsurance for property and casualty insurance policies. Insurance types include automobile, property damage, casualty, theft, fire, malpractice, marine, workers' compensation and homeowners insurance.
notation: 1412101311
valid from: 2024-06-07

Reinsurance
type: BicsLevel4SubIndustry
type: Classifier
type: NamedIndividual
is sub industry of: Insurance
is contemporary version of: http://data.ga-group.nl/ics/bics/14121013
is version of: http://data.ga-group.nl/ics/bics/14121013
replaces: http://data.ga-group.nl/ics/bics/2020/14121013
imported on: 2026-06-08T13:40:52.236Z
last refreshed on: 2026-06-08T13:41:38.450Z
source accessed on: 2024-06-05T14:42:36Z
source last accessed on: 2024-06-05T14:42:36Z
label: Réassurance @fr
label: Rückversicherung @de
label: Reaseguro @es
label: Resseguro @pt
label: Riassicurazioni @it
label: Перестрахование @ru
label: 再保 @zh-hant
label: 再保险 @zh
label: 再保険 @ja
label: 재보험 @ko
definition: This industry subgroup includes companies that underwrite reinsurance for life, health and medical, property and casualty, title, and other insurance policies.
notation: 14121013
valid from: 2024-06-07

Insurance Brokers & Services
type: BicsLevel4SubIndustry
type: Classifier
type: NamedIndividual
is sub industry of: Insurance
is contemporary version of: http://data.ga-group.nl/ics/bics/14121014
is version of: http://data.ga-group.nl/ics/bics/14121014
replaces: http://data.ga-group.nl/ics/bics/2020/14121014
imported on: 2026-06-08T13:40:52.236Z
last refreshed on: 2026-06-08T13:41:38.450Z
source accessed on: 2024-06-05T14:42:36Z
source last accessed on: 2024-06-05T14:42:36Z
label: Broker e servizi assic @it
label: Courtiers et srvc en assurance @fr
label: Serviços e brokers de seguros @pt
label: Servicios y brokers de seguros @es
label: Versicherungsmakler & Dienste @de
label: Брокеры услуг страхования @ru
label: 保险经纪商与服务 @zh
label: 保険ﾌﾞﾛｰｶｰ･ｻｰﾋﾞｽ @ja
label: 保險經紀商及服務 @zh-hant
label: 보험 브로커 & 서비스 @ko
definition: This industry subgroup includes companies that act as insurance intermediaries to sell insurance policies and other insurance-related products like annuities.
notation: 14121014
valid from: 2024-06-07

Insurance
type: BicsLevel3Industry
type: Classifier
type: NamedIndividual
is industry of: Insurance
is contemporary version of: http://data.ga-group.nl/ics/bics/141210
is version of: http://data.ga-group.nl/ics/bics/141210
replaces: http://data.ga-group.nl/ics/bics/2020/141210
imported on: 2026-06-08T13:40:52.236Z
last refreshed on: 2026-06-08T13:41:38.450Z
source accessed on: 2024-06-05T14:42:36Z
source last accessed on: 2024-06-05T14:42:36Z
label: Assicurazione @it
label: Assurance @fr
label: Seguro @es
label: Versicherung @de
label: Страхование @ru
label: 保险 @zh
label: 保険 @ja
label: 保險 @zh-hant
label: 보험 @ko
definition: This industry includes companies that underwrite insurance products or companies that specialize in providing insurance related services.
notation: 141210
valid from: 2024-06-07

Insurance
type: BicsLevel2IndustryGroup
type: Classifier
type: NamedIndividual
is industry group of: Financials
is contemporary version of: http://data.ga-group.nl/ics/bics/1412
is version of: http://data.ga-group.nl/ics/bics/1412
replaces: http://data.ga-group.nl/ics/bics/2020/1412
imported on: 2026-06-08T13:40:52.236Z
last refreshed on: 2026-06-08T13:41:38.450Z
source accessed on: 2024-06-05T14:42:36Z
source last accessed on: 2024-06-05T14:42:36Z
label: Assicurazione @it
label: Assurance @fr
label: Seguro @es
label: Versicherung @de
label: Страхование @ru
label: 保险 @zh
label: 保険 @ja
label: 保險 @zh-hant
label: 보험 @ko
definition: This industry group includes companies providing insurance related products and services.
notation: 1412
valid from: 2024-06-07

Financials
type: BicsLevel1Sector
type: Classifier
type: NamedIndividual
is contemporary version of: http://data.ga-group.nl/ics/bics/14
is version of: http://data.ga-group.nl/ics/bics/14
replaces: http://data.ga-group.nl/ics/bics/2020/14
imported on: 2026-06-08T13:40:52.236Z
last refreshed on: 2026-06-08T13:41:38.450Z
source accessed on: 2024-06-05T14:42:36Z
source last accessed on: 2024-06-05T14:42:36Z
label: Financières @fr
label: Financiero @es
label: Finanziari @it
label: Finanzwesen @de
label: Serviços Financeiros @pt
label: Финансы @ru
label: 金融 @ja
label: 금융기관 @ko
definition: This sector includes companies that provide services or products which focus on the growth, storage, or transaction of money and assets.
notation: 14
valid from: 2024-06-07

Multi Asset Class Own & Develop
type: BicsLevel4SubIndustry
type: Classifier
type: NamedIndividual
is sub industry of: Real Estate Owners & Developers
is contemporary version of: http://data.ga-group.nl/ics/bics/15101010
is version of: http://data.ga-group.nl/ics/bics/15101010
replaces: http://data.ga-group.nl/ics/bics/2020/15101010
imported on: 2026-06-08T13:40:52.236Z
last refreshed on: 2026-06-08T13:41:38.450Z
source accessed on: 2024-06-05T14:42:36Z
source last accessed on: 2024-06-05T14:42:36Z
label: Multiassetklassen, Eigent. & Entw. @de
label: Prop e empr de classe de multi ativos @pt
label: Prop y constr varias clases de activo @es
label: Propr e imprenditori classe multi asset @it
label: Propriétaires/promoteurs - multi-actifs @fr
label: Владельцы и застр. неск. классов активов @ru
label: 多种资产类别业主与开发商 @zh
label: 多重資產類別不動產持有者及開發者 @zh-hant
label: 総合型不動産 @ja
label: 복합 자산군 소유자 & 개발자 @ko
definition: This industry subgroup includes non-REIT owners and developers of multiple property types.
notation: 15101010
valid from: 2024-06-07

Health Care Owners & Develop
type: BicsLevel4SubIndustry
type: Classifier
type: NamedIndividual
is sub industry of: Real Estate Owners & Developers
is contemporary version of: http://data.ga-group.nl/ics/bics/15101011
is version of: http://data.ga-group.nl/ics/bics/15101011
replaces: http://data.ga-group.nl/ics/bics/2020/15101011
imported on: 2026-06-08T13:40:52.236Z
last refreshed on: 2026-06-08T13:41:38.450Z
source accessed on: 2024-06-05T14:42:36Z
source last accessed on: 2024-06-05T14:42:36Z
label: Gesundheitswesen, Eigentümer & -erschließer @de
label: Propietarios y descubridores de salud @es
label: Propriétaires et promoteurs de soins de santé @fr
label: Proprietà sanitarie e imprenditori @it
label: Proprietários e empreendedores de saúde @pt
label: Владельцы и девелоперы объектов здравоохранения @ru
label: 医疗保健物业业主与开发商 @zh
label: 醫療保健擁有者及開發者 @zh-hant
label: 헬스케어 소유자 & 개발자 @ko
label: ﾍﾙｽｹｱ不動産 @ja
definition: This industry subgroup includes non-REIT owners and developers of health care properties.
notation: 15101011
valid from: 2024-06-07

Hotel Owners & Developers
type: BicsLevel4SubIndustry
type: Classifier
type: NamedIndividual
is sub industry of: Real Estate Owners & Developers
is contemporary version of: http://data.ga-group.nl/ics/bics/15101012
is version of: http://data.ga-group.nl/ics/bics/15101012
replaces: http://data.ga-group.nl/ics/bics/2020/15101012
imported on: 2026-06-08T13:40:52.236Z
last refreshed on: 2026-06-08T13:41:38.450Z
source accessed on: 2024-06-05T14:42:36Z
source last accessed on: 2024-06-05T14:42:36Z
label: Construtores e proprietários de hotéis @pt
label: Hoteleigentümer & -erschließer @de
label: Propietarios y constructoras de hoteles @es
label: Propriétaires et promoteurs d'hôtels @fr
label: Proprietà alberghi e imprendit @it
label: Владельцы и девелоперы гостиниц @ru
label: 酒店业主与开发商 @zh
label: 飯店持有者及開發者 @zh-hant
label: 호텔 소유자 & 개발자 @ko
label: ﾎﾃﾙ不動産 @ja
definition: This industry subgroup includes non-REIT owners and developers of hotel/lodging properties.
notation: 15101012
valid from: 2024-06-07

Apartment Owners & Develop
type: BicsLevel5Segment
type: Classifier
type: NamedIndividual
is level5 segment of: Residential Owners & Developers
is contemporary version of: http://data.ga-group.nl/ics/bics/1510101310
is version of: http://data.ga-group.nl/ics/bics/1510101310
replaces: http://data.ga-group.nl/ics/bics/2020/1510101310
imported on: 2026-06-08T13:40:52.236Z
last refreshed on: 2026-06-08T13:41:38.450Z
source accessed on: 2024-06-05T14:42:36Z
source last accessed on: 2024-06-05T14:42:36Z
label: Apartamento propio y des @es
label: Appartements, Eigent. & Entw. @de
label: Propriétaires/promoteurs - appart @fr
label: Proprietários e empreend de apartamento @pt
label: Proprietari e imprenditori appartamenti @it
label: Владельцы и застройщики квартир @ru
label: 公寓业主与开发商 @zh
label: 公寓持有者及開發者 @zh-hant
label: 共同住宅不動産 @ja
label: 아파트 소유자 & 개발자 @ko
definition: This segment includes non-REIT owners and developers of apartments that typically have 5+ units.
notation: 1510101310
valid from: 2024-06-07

Mfgd Housing Owners & Develop
type: BicsLevel5Segment
type: Classifier
type: NamedIndividual
is level5 segment of: Residential Owners & Developers
is contemporary version of: http://data.ga-group.nl/ics/bics/1510101311
is version of: http://data.ga-group.nl/ics/bics/1510101311
replaces: http://data.ga-group.nl/ics/bics/2020/1510101311
imported on: 2026-06-08T13:40:52.236Z
last refreshed on: 2026-06-08T13:41:38.450Z
source accessed on: 2024-06-05T14:42:36Z
source last accessed on: 2024-06-05T14:42:36Z
label: Fertighäuser, Eigent. & Entw. @de
label: Propr e imprenditori case fabbricate @it
label: Propriétaires/promoteurs - maisons pré-fab @fr
label: Proprietários e empreend casas fabr @pt
label: Viviendas fabricadas prop y des @es
label: Влад. и застр. сборных домов @ru
label: 組合住宅持有者及開發者 @zh-hant
label: 预制房业主与开发商 @zh
label: 조립주택 소유자 & 개발자 @ko
label: ﾌﾟﾚﾊﾌﾞ住宅不動産 @ja
definition: This segment includes non-REIT owners and developers of pad sites and mobile/manufactured homes. This also includes companies that operate resort communities where clients bring their own RVs and pay a fee to rent ground space/pad sites.
notation: 1510101311
valid from: 2024-06-07

Student Housing Own & Develop
type: BicsLevel5Segment
type: Classifier
type: NamedIndividual
is level5 segment of: Residential Owners & Developers
is contemporary version of: http://data.ga-group.nl/ics/bics/1510101312
is version of: http://data.ga-group.nl/ics/bics/1510101312
replaces: http://data.ga-group.nl/ics/bics/2020/1510101312
imported on: 2026-06-08T13:40:52.236Z
last refreshed on: 2026-06-08T13:41:38.450Z
source accessed on: 2024-06-05T14:42:36Z
source last accessed on: 2024-06-05T14:42:36Z
label: Propriétaires/promoteurs - logements pour étudiants @fr
label: Proprietários e empreend de casas para estudantes @pt
label: Proprietari e imprenditori case studente @it
label: Studentenwohnungen, Eigent. & Entw. @de
label: Viviendas de estudiantes propias y desarrolladas @es
label: Влад. и застр. жилья для студентов @ru
label: 学生住宅业主与开发商 @zh
label: 学生用住宅不動産 @ja
label: 學生住宅持有者及開發者 @zh-hant
label: 학생용 주택 소유자 & 개발자 @ko
definition: This segment includes non-REIT owners and developers of student housing. Such housing is any for-rent housing that is available to students only.
notation: 1510101312
valid from: 2024-06-07

Residential Owners & Developers
type: BicsLevel4SubIndustry
type: Classifier
type: NamedIndividual
is sub industry of: Real Estate Owners & Developers
is contemporary version of: http://data.ga-group.nl/ics/bics/15101013
is version of: http://data.ga-group.nl/ics/bics/15101013
replaces: http://data.ga-group.nl/ics/bics/2020/15101013
imported on: 2026-06-08T13:40:52.236Z
last refreshed on: 2026-06-08T13:41:38.450Z
source accessed on: 2024-06-05T14:42:36Z
source last accessed on: 2024-06-05T14:42:36Z
label: Empreendedores e proprietários residenciais @pt
label: Propietarios/constructoras residenciales @es
label: Proprietari e imprend residenz @it
label: Proprio/promoteurs résidences @fr
label: Wohneigentümer & Entwickler @de
label: Застр. промышл./жилых объектов @ru
label: Застр. промышл./жилых объект��в @ru
label: 住宅不動産 @ja
label: 住宅所有人及開發者 @zh-hant
label: 公寓业主与开发商 @zh
label: 주거 소유자 & 개발자 @ko
definition: This industry subgroup includes non-REIT owners and developers of residential housing facilities.
notation: 15101013
valid from: 2024-06-07

Bulk Warehouse Own & Develop
type: BicsLevel5Segment
type: Classifier
type: NamedIndividual
is level5 segment of: Industrial Owners & Developers
is contemporary version of: http://data.ga-group.nl/ics/bics/1510101410
is version of: http://data.ga-group.nl/ics/bics/1510101410
replaces: http://data.ga-group.nl/ics/bics/2020/1510101410
imported on: 2026-06-08T13:40:52.236Z
last refreshed on: 2026-06-08T13:41:38.450Z
source accessed on: 2024-06-05T14:42:36Z
source last accessed on: 2024-06-05T14:42:36Z
label: Almacén másico propia y des @es
label: Bulk-Lagerhallen, Eigent. & Entw. @de
label: Propr e imprenditori magazzini grandi @it
label: Propriétaires/promoteurs - entrepôts de vrac @fr
label: Proprietários e empreend de armazém a granel @pt
label: Владельцы и застройщики крупных складов @ru
label: 大型倉庫不動産 @ja
label: 散裝倉庫持有者及開發者 @zh-hant
label: 散货仓库业主与开发商 @zh
label: 散货仓库业��与开发商 @zh
label: 대량 창고 소유자 & 개발자 @ko
definition: This segment includes non-REIT owners and developers of high-ceiling industrial properties used for distribution, warehousing, and manufacturing.
notation: 1510101410
valid from: 2024-06-07

Flex Industrial Own & Develop
type: BicsLevel5Segment
type: Classifier
type: NamedIndividual
is level5 segment of: Industrial Owners & Developers
is contemporary version of: http://data.ga-group.nl/ics/bics/1510101411
is version of: http://data.ga-group.nl/ics/bics/1510101411
replaces: http://data.ga-group.nl/ics/bics/2020/1510101411
imported on: 2026-06-08T13:40:52.236Z
last refreshed on: 2026-06-08T13:41:38.450Z
source accessed on: 2024-06-05T14:42:36Z
source last accessed on: 2024-06-05T14:42:36Z
label: Flex Industrial prop y desarrollada @es
label: Flex-Industrie, Eigent. & Entw. @de
label: Propri e imprenditori industriale flex @it
label: Propriétaires/promoteurs - complexes ind adaptables @fr
label: Proprietários e empreend industrial flex @pt
label: Влад. и застр. объект. смеш. пром. @ru
label: 彈性工業不動產持有者及開發者 @zh-hant
label: 灵活产业业主与开发商 @zh
label: 전환 산업용 소유자 & 개발자 @ko
label: ｵﾌｨｽ兼倉庫不動産 @ja
definition: This segment includes non-REIT owners and developers of flex space, which can accommodate office, light manufacturing, R&D, and/or storage usage in the same unit.
notation: 1510101411
valid from: 2024-06-07

Temp Control Logist Own & Dev
type: BicsLevel5Segment
type: Classifier
type: NamedIndividual
is level5 segment of: Industrial Owners & Developers
is contemporary version of: http://data.ga-group.nl/ics/bics/1510101412
is version of: http://data.ga-group.nl/ics/bics/1510101412
replaces: http://data.ga-group.nl/ics/bics/2020/1510101412
imported on: 2026-06-08T13:40:52.236Z
last refreshed on: 2026-06-08T13:41:38.450Z
source accessed on: 2024-06-05T14:42:36Z
source last accessed on: 2024-06-05T14:42:36Z
label: Logística controlada p/ temp propio y des @es
label: Prop e empr de logística de controle temp @pt
label: Propr e imprenditori logist temp contr @it
label: Propriétaires/promoteurs log temp contrôlée @fr
label: Temperaturkontr. Logistik, Eigent. & Entw. @de
label: Владельцы и застр. терм. логистики @ru
label: 控温物流业主与开发商 @zh
label: 温度管理物流施設不動産 @ja
label: 溫控物流持有者及開發者 @zh-hant
label: 온도 제어 물류 소유자 & 개발자 @ko
definition: This segment includes non-REIT owners and developers of temperature-controlled industrial, warehouse, or distribution facilities. Such facilities are equipped to accommodate temperature adjustment, refrigeration and/or freezing needs.
notation: 1510101412
valid from: 2024-06-07

Industrial Owners & Developers
type: BicsLevel4SubIndustry
type: Classifier
type: NamedIndividual
is sub industry of: Real Estate Owners & Developers
is contemporary version of: http://data.ga-group.nl/ics/bics/15101014
is version of: http://data.ga-group.nl/ics/bics/15101014
replaces: http://data.ga-group.nl/ics/bics/2020/15101014
imported on: 2026-06-08T13:40:52.236Z
last refreshed on: 2026-06-08T13:41:38.450Z
source accessed on: 2024-06-05T14:42:36Z
source last accessed on: 2024-06-05T14:42:36Z
label: Industrie, Eigentümer & Entwickler @de
label: Propietarios y desarrolladores ind @es
label: Propriétaires et promoteurs industriels @fr
label: Proprietários e empreend industriais @pt
label: Proprietari e imprenditori industriali @it
label: Влад. и застр. промышл. объектов @ru
label: 工业业主与开发商 @zh
label: 工業不動產持有者及開發者 @zh-hant
label: 産業用不動産 @ja
label: 산업용 소유자 & 개발자 @ko
definition: This industry subgroup includes non-REIT owners and developers of industrial properties, such as warehouse, distribution, temperature-controlled logistics, and flex space.
notation: 15101014
valid from: 2024-06-07

CBD Office Own & Developers
type: BicsLevel5Segment
type: Classifier
type: NamedIndividual
is level5 segment of: Office Owners & Developers
is contemporary version of: http://data.ga-group.nl/ics/bics/1510101510
is version of: http://data.ga-group.nl/ics/bics/1510101510
replaces: http://data.ga-group.nl/ics/bics/2020/1510101510
imported on: 2026-06-08T13:40:52.236Z
last refreshed on: 2026-06-08T13:41:38.450Z
source accessed on: 2024-06-05T14:42:36Z
source last accessed on: 2024-06-05T14:42:36Z
label: CBD 사무실 소유자 & 개발자 @ko
label: CBD oficinas propia y constructoras @es
label: CBD-Büros, Eigent. & Entw. @de
label: CBD办公楼业主与开发商 @zh
label: CBDｵﾌｨｽ不動産 @ja
label: Propriétaires/promoteurs - quartier d'affaires @fr
label: Proprietários e empreend escritório CBD @pt
label: Proprietari e imprenditori uffici CBD @it
label: Владельцы и застр. офисов в CBD @ru
label: 中心商業區辦公室持有者及開發者 @zh-hant
definition: This segment includes non-REIT owners and developers of office buildings in central business districts (CBDs). Outside of the U.S., if the office is not identified as being in a CBD, the number of stories in the building will be used to determine whether it is CBD (5 or more stories) or suburban (less than 5 stories).
notation: 1510101510
valid from: 2024-06-07

Suburban Office Own & Develop
type: BicsLevel5Segment
type: Classifier
type: NamedIndividual
is level5 segment of: Office Owners & Developers
is contemporary version of: http://data.ga-group.nl/ics/bics/1510101511
is version of: http://data.ga-group.nl/ics/bics/1510101511
replaces: http://data.ga-group.nl/ics/bics/2020/1510101511
imported on: 2026-06-08T13:40:52.236Z
last refreshed on: 2026-06-08T13:41:38.450Z
source accessed on: 2024-06-05T14:42:36Z
source last accessed on: 2024-06-05T14:42:36Z
label: Oficinas afueras de la ciudad propias y desarrolladas @es
label: Propriétaires/promoteurs - bureaux en banlieue @fr
label: Proprietários e empreend escritórios urbanos @pt
label: Proprietari e imprenditori uffici sobborghi @it
label: Vorstadtbüros, Eigent. & Entw. @de
label: Владельцы и застр. офисов в пригороде @ru
label: 医疗办公楼业主与开发商 @zh
label: 近郊辦公室持有者及開發者 @zh-hant
label: 郊外ｵﾌｨｽ不動産 @ja
label: 교외 사무실 소유자 & 개발자 @ko
definition: This segment includes non-REIT owners and developers of office buildings in the suburbs. Outside of the U.S., if the office is not identified as being in a CBD, the number of stories in the building will be used to determine whether it is CBD (5 or more stories) or suburban (less than 5 stories).
notation: 1510101511
valid from: 2024-06-07

Office Owners & Developers
type: BicsLevel4SubIndustry
type: Classifier
type: NamedIndividual
is sub industry of: Real Estate Owners & Developers
is contemporary version of: http://data.ga-group.nl/ics/bics/15101015
is version of: http://data.ga-group.nl/ics/bics/15101015
replaces: http://data.ga-group.nl/ics/bics/2020/15101015
imported on: 2026-06-08T13:40:52.236Z
last refreshed on: 2026-06-08T13:41:38.450Z
source accessed on: 2024-06-05T14:42:36Z
source last accessed on: 2024-06-05T14:42:36Z
label: Büroeigentümer & -erschließer @de
label: Construtores e proprietários de escritórios @pt
label: Propietarios y constructoras de oficinas @es
label: Propriétaires et promoteurs de bureaux @fr
label: Proprietà uffici e imprenditori @it
label: Владельцы и девелоперы офисных объектов @ru
label: 办公楼业主与开发商 @zh
label: 办公���业主与开发商 @zh
label: 辦公室持有者及開發者 @zh-hant
label: 사무실 소유자 & 개발자 @ko
label: ｵﾌｨｽ不動産 @ja
definition: This industry subgroup includes non-REIT owners and developers of office buildings.
notation: 15101015
valid from: 2024-06-07

Regional Malls Own & Develop
type: BicsLevel5Segment
type: Classifier
type: NamedIndividual
is level5 segment of: Retail Owners & Developers
is contemporary version of: http://data.ga-group.nl/ics/bics/1510101610
is version of: http://data.ga-group.nl/ics/bics/1510101610
replaces: http://data.ga-group.nl/ics/bics/2020/1510101610
imported on: 2026-06-08T13:40:52.236Z
last refreshed on: 2026-06-08T13:41:38.450Z
source accessed on: 2024-06-05T14:42:36Z
source last accessed on: 2024-06-05T14:42:36Z
label: Propietarios y constructoras centros comerciales regionales @es
label: Propr e imprenditori centri comm reg @it
label: Propriétaires/promoteurs - centres comm régionaux @fr
label: Proprietários e empreend de shopping regional @pt
label: Regionale Einkaufszentrums, Eigent. & Entw. @de
label: Владельцы и застр. регион. торг. центров @ru
label: 地区购物商城业主与开发商 @zh
label: 地區購物中心持有者及開發者 @zh-hant
label: 地方ﾓｰﾙ不動産 @ja
label: 지역쇼핑몰 소유자 & 개발자 @ko
label: ��역쇼핑몰 소유자 & 개발자 @ko
definition: This segment includes non-REIT owners and developers of mall space. These malls, also known as shopping malls, typically have retail stores that are enclosed within a large, single building.
notation: 1510101610
valid from: 2024-06-07

Shopping Center Own & Develop
type: BicsLevel5Segment
type: Classifier
type: NamedIndividual
is level5 segment of: Retail Owners & Developers
is contemporary version of: http://data.ga-group.nl/ics/bics/1510101611
is version of: http://data.ga-group.nl/ics/bics/1510101611
replaces: http://data.ga-group.nl/ics/bics/2020/1510101611
imported on: 2026-06-08T13:40:52.236Z
last refreshed on: 2026-06-08T13:41:38.450Z
source accessed on: 2024-06-05T14:42:36Z
source last accessed on: 2024-06-05T14:42:36Z
label: Propietarios y constructoras centro comercial @es
label: Propriétaires/promoteurs - zones de mag @fr
label: Proprietários e empreend de shopping center @pt
label: Proprietari e imprenditori centri comm @it
label: Shoppingcenter, Eigent. & Entw. @de
label: Владельцы и застр. торговых центров @ru
label: 購物中心持有者及開發者 @zh-hant
label: 购物中心业主与开发商 @zh
label: 쇼핑센터 소유자 & 개발자 @ko
label: ｼｮｯﾋﾟﾝｸﾞｾﾝﾀｰ不動産 @ja
definition: This segment includes non-REIT owners and developers of shopping centers. These shopping centers typically encompass multiple stand-alone retail buildings within a self-contained lot.
notation: 1510101611
valid from: 2024-06-07

Single Tenant Own & Develop
type: BicsLevel5Segment
type: Classifier
type: NamedIndividual
is level5 segment of: Retail Owners & Developers
is contemporary version of: http://data.ga-group.nl/ics/bics/1510101612
is version of: http://data.ga-group.nl/ics/bics/1510101612
replaces: http://data.ga-group.nl/ics/bics/2020/1510101612
imported on: 2026-06-08T13:40:52.236Z
last refreshed on: 2026-06-08T13:41:38.450Z
source accessed on: 2024-06-05T14:42:36Z
source last accessed on: 2024-06-05T14:42:36Z
label: Einzelmieter, Eigent. & Entw. @de
label: Propia y desarrollada - un inquilino @es
label: Propriétaires/promoteurs - locataire unique @fr
label: Proprietários e empreend de único inquilino @pt
label: Proprietari e imprenditori locatario unico @it
label: Единол. аренд., владельцы и застр. @ru
label: 单一租户业主与开发商 @zh
label: 単一ﾃﾅﾝﾄ不動産 @ja
label: 單一租客不動產持有者及開發者 @zh-hant
label: 단일 입주자 소유자 & 개발자 @ko
definition: This segment includes non-REIT owners and developers of standalone retail buildings that serves a single retail tenant, such as gas station sites or stand-alone restaurant buildings.
notation: 1510101612
valid from: 2024-06-07

Retail Owners & Developers
type: BicsLevel4SubIndustry
type: Classifier
type: NamedIndividual
is sub industry of: Real Estate Owners & Developers
is contemporary version of: http://data.ga-group.nl/ics/bics/15101016
is version of: http://data.ga-group.nl/ics/bics/15101016
replaces: http://data.ga-group.nl/ics/bics/2020/15101016
imported on: 2026-06-08T13:40:52.236Z
last refreshed on: 2026-06-08T13:41:38.450Z
source accessed on: 2024-06-05T14:42:36Z
source last accessed on: 2024-06-05T14:42:36Z
label: Construtores e proprietários de varejo @pt
label: Einzelhandel, Eigentümer & -erschließer @de
label: Propietarios y constructoras al por menor @es
label: Propr al dettaglio e imprend @it
label: Propriétaires et promoteurs de distribution @fr
label: Владельцы и девелоперы розничных объектов @ru
label: 商業施設不動産 @ja
label: 零售地产业主与开发商 @zh
label: 零售持有者及開發者 @zh-hant
label: 소매 소유자 & 개발자 @ko
definition: This industry subgroup includes non-REIT owners and developers of retail real estate, such as outlet spaces, strip centers, shopping malls, and single-tenant entities.
notation: 15101016
valid from: 2024-06-07

Self-Storage Owners & Develop
type: BicsLevel4SubIndustry
type: Classifier
type: NamedIndividual
is sub industry of: Real Estate Owners & Developers
is contemporary version of: http://data.ga-group.nl/ics/bics/15101017
is version of: http://data.ga-group.nl/ics/bics/15101017
replaces: http://data.ga-group.nl/ics/bics/2020/15101017
imported on: 2026-06-08T13:40:52.236Z
last refreshed on: 2026-06-08T13:41:38.450Z
source accessed on: 2024-06-05T14:42:36Z
source last accessed on: 2024-06-05T14:42:36Z
label: Propietarios y constructoras de almacenamiento @es
label: Propriétaires et promoteurs - libre-service @fr
label: Proprietários e empreend armazenagem própria @pt
label: Proprietari e imprenditori Self-Storage @it
label: Selbstlager, Eigent. & Entw. @de
label: Владельцы и застр. камер хранения @ru
label: 自助仓库业主与开发商 @zh
label: 自助倉儲持有者及開發者 @zh-hant
label: 자가창고 소유자 & 개발자 @ko
label: ﾄﾗﾝｸﾙｰﾑ不動産 @ja
definition: This industry subgroup includes non-REIT owners and developers of self-storage units/properties.
notation: 15101017
valid from: 2024-06-07

Specialty Owners & Developers
type: BicsLevel4SubIndustry
type: Classifier
type: NamedIndividual
is sub industry of: Real Estate Owners & Developers
is contemporary version of: http://data.ga-group.nl/ics/bics/15101018
is version of: http://data.ga-group.nl/ics/bics/15101018
replaces: http://data.ga-group.nl/ics/bics/2020/15101018
imported on: 2026-06-08T13:40:52.236Z
last refreshed on: 2026-06-08T13:41:38.450Z
source accessed on: 2024-06-05T14:42:36Z
source last accessed on: 2024-06-05T14:42:36Z
label: Empreendedores e proprietários especializados @pt
label: Propietarios/constructoras especializadas @es
label: Proprietari e imprend specializ @it
label: Proprio/promoteurs spécialisés @fr
label: Spezielle Eigentümer & Entwickler @de
label: Спец. застр./владельцы @ru
label: 專門及其他持有人及開發者 @zh-hant
label: 特殊业主与开发商 @zh
label: 特殊施設不動産 @ja
label: 전문 소유자 & 개발자 @ko
definition: This industry subgroup includes non-REIT owners and developers of specialty and other properties not elsewhere classified.
notation: 15101018
valid from: 2024-06-07

Real Estate Owners & Developers
type: BicsLevel3Industry
type: Classifier
type: NamedIndividual
is industry of: Real Estate
is contemporary version of: http://data.ga-group.nl/ics/bics/151010
is version of: http://data.ga-group.nl/ics/bics/151010
replaces: http://data.ga-group.nl/ics/bics/2020/151010
imported on: 2026-06-08T13:40:52.236Z
last refreshed on: 2026-06-08T13:41:38.450Z
source accessed on: 2024-06-05T14:42:36Z
source last accessed on: 2024-06-05T14:42:36Z
label: Immobilien, Eigent. & Entw. @de
label: Propietarios/construct inmob @es
label: Propr e imprenditori immob @it
label: Propriétaires/promoteurs immob @fr
label: Proprietários/empreend imob @pt
label: Владельцы и застройщ. недвиж. @ru
label: 不動產持有者及開發者 @zh-hant
label: 不動産保有･開発 @ja
label: 房地产业主与开发商 @zh
label: 부동산 소유자 & 개발자 @ko
definition: This industry includes companies that own or develop real estate assets. Such companies derive rental income or sell real estate for asset appreciation and are not structured as real estate investment trusts (REITs).
notation: 151010
valid from: 2024-06-07

Multi Asset Class REIT
type: BicsLevel4SubIndustry
type: Classifier
type: NamedIndividual
is sub industry of: REIT
is contemporary version of: http://data.ga-group.nl/ics/bics/15101110
is version of: http://data.ga-group.nl/ics/bics/15101110
replaces: http://data.ga-group.nl/ics/bics/2020/15101110
imported on: 2026-06-08T13:40:52.236Z
last refreshed on: 2026-06-08T13:41:38.450Z
source accessed on: 2024-06-05T14:42:36Z
source last accessed on: 2024-06-05T14:42:36Z
label: Classe de multi-ativo REIT @pt
label: Multiassetklassen REIT @de
label: REIT actifs multiples @fr
label: REIT de multiclases de activos @es
label: REIT possess attivi multicl @it
label: Множеств. классы активов - REIT @ru
label: 多种资产类别 REIT @zh
label: 多重資產類別 REIT @zh-hant
label: 総合型REIT @ja
label: 복합자산 등급 리츠(REIT) @ko
definition: This industry subgroup includes real estate investment trusts (REITs) that own and develop multiple types of property.
notation: 15101110
valid from: 2024-06-07

Hospital REIT
type: BicsLevel5Segment
type: Classifier
type: NamedIndividual
is level5 segment of: Health Care REIT
is contemporary version of: http://data.ga-group.nl/ics/bics/1510111110
is version of: http://data.ga-group.nl/ics/bics/1510111110
replaces: http://data.ga-group.nl/ics/bics/2020/1510111110
imported on: 2026-06-08T13:40:52.236Z
last refreshed on: 2026-06-08T13:41:38.450Z
source accessed on: 2024-06-05T14:42:36Z
source last accessed on: 2024-06-05T14:42:36Z
label: Krankenhaus - REIT @de
label: REIT - Hôpitaux @fr
label: REIT Ospedali @it
label: Больницы - REIT @ru
label: 医院REIT @zh
label: 病院REIT @ja
label: 醫院REIT @zh-hant
label: 병원 리츠 @ko
definition: This segment includes real estate investment trusts (REITs) that own and develop hospitals.
notation: 1510111110
valid from: 2024-06-07

Medical Office REIT
type: BicsLevel5Segment
type: Classifier
type: NamedIndividual
is level5 segment of: Health Care REIT
is contemporary version of: http://data.ga-group.nl/ics/bics/1510111111
is version of: http://data.ga-group.nl/ics/bics/1510111111
replaces: http://data.ga-group.nl/ics/bics/2020/1510111111
imported on: 2026-06-08T13:40:52.236Z
last refreshed on: 2026-06-08T13:41:38.450Z
source accessed on: 2024-06-05T14:42:36Z
source last accessed on: 2024-06-05T14:42:36Z
label: Arztpraxen - REIT @de
label: Escritório médico REIT @pt
label: Oficina médica REIT @es
label: REIT - Cabinets médicaux @fr
label: REIT Uffici sanitari @it
label: Медицинские офисы - REIT @ru
label: 医疗办公楼REIT @zh
label: 診療所REIT @ja
label: 醫療辦公室REIT @zh-hant
label: 진료소 리츠 @ko
definition: This segment includes real estate investment trusts (REITs) that own and develop medical office buildings that primarily house medical practices and health care testing services.
notation: 1510111111
valid from: 2024-06-07

Senior Housing REIT
type: BicsLevel5Segment
type: Classifier
type: NamedIndividual
is level5 segment of: Health Care REIT
is contemporary version of: http://data.ga-group.nl/ics/bics/1510111112
is version of: http://data.ga-group.nl/ics/bics/1510111112
replaces: http://data.ga-group.nl/ics/bics/2020/1510111112
imported on: 2026-06-08T13:40:52.236Z
last refreshed on: 2026-06-08T13:41:38.450Z
source accessed on: 2024-06-05T14:42:36Z
source last accessed on: 2024-06-05T14:42:36Z
label: Casas para idosos REIT @pt
label: REIT - Logements pour personnes âgées @fr
label: REIT Case di riposo @it
label: Seniorenwohnanlagen - REIT @de
label: Viviendas de jubilados REIT @es
label: Жилье для людей пенс. возраста - REIT @ru
label: 老年公寓REIT @zh
label: 高齡住宅REIT @zh-hant
label: 高齢者用住宅REIT @ja
label: 고령자용 주택 리츠 @ko
definition: This segment includes real estate investment trusts (REITs) that own and develop senior housing, such as retirement living communities and assisted living facilities.
notation: 1510111112
valid from: 2024-06-07

Skilled Nursing REIT
type: BicsLevel5Segment
type: Classifier
type: NamedIndividual
is level5 segment of: Health Care REIT
is contemporary version of: http://data.ga-group.nl/ics/bics/1510111113
is version of: http://data.ga-group.nl/ics/bics/1510111113
replaces: http://data.ga-group.nl/ics/bics/2020/1510111113
imported on: 2026-06-08T13:40:52.236Z
last refreshed on: 2026-06-08T13:41:38.450Z
source accessed on: 2024-06-05T14:42:36Z
source last accessed on: 2024-06-05T14:42:36Z
label: Ausgebildete Krankenpflege - REIT @de
label: Enfermagem qualificada REIT @pt
label: Enfermería especializada REIT @es
label: REIT - Soins infirmiers professionnels @fr
label: REIT Assist infermieristica qualif @it
label: Высококвалиф. уход - REIT @ru
label: 專業護理照護REIT @zh-hant
label: 熟练护理REIT @zh
label: 看護施設REIT @ja
label: 전문 간호 리츠 @ko
definition: This segment includes real estate investment trusts (REITs) that own and develop nursing homes.
notation: 1510111113
valid from: 2024-06-07

Health Care REIT
type: BicsLevel4SubIndustry
type: Classifier
type: NamedIndividual
is sub industry of: REIT
is contemporary version of: http://data.ga-group.nl/ics/bics/15101111
is version of: http://data.ga-group.nl/ics/bics/15101111
replaces: http://data.ga-group.nl/ics/bics/2020/15101111
imported on: 2026-06-08T13:40:52.236Z
last refreshed on: 2026-06-08T13:41:38.450Z
source accessed on: 2024-06-05T14:42:36Z
source last accessed on: 2024-06-05T14:42:36Z
label: Gesundheitswesen REIT @de
label: REIT de salud @es
label: REIT sanità @it
label: REIT soins de santé @fr
label: REIT soins de sant�� @fr
label: Saúde REIT @pt
label: Здравоохранение - REIT @ru
label: 保健REIT @zh
label: 醫療保健REIT @zh-hant
label: 헬스케어 리츠(REIT) @ko
label: 헬스케어 ���츠(REIT) @ko
label: ﾍﾙｽｹｱREIT @ja
definition: This industry subgroup includes real estate investment trusts (REITs) that own and develop health care properties.
notation: 15101111
valid from: 2024-06-07

Hotel REIT
type: BicsLevel4SubIndustry
type: Classifier
type: NamedIndividual
is sub industry of: REIT
is contemporary version of: http://data.ga-group.nl/ics/bics/15101112
is version of: http://data.ga-group.nl/ics/bics/15101112
replaces: http://data.ga-group.nl/ics/bics/2020/15101112
imported on: 2026-06-08T13:40:52.236Z
last refreshed on: 2026-06-08T13:41:38.450Z
source accessed on: 2024-06-05T14:42:36Z
source last accessed on: 2024-06-05T14:42:36Z
label: Hotel - REIT @de
label: REIT Alberghi @it
label: REIT hôteliers @fr
label: Гостиницы - REIT @ru
label: 酒店REIT @zh
label: 飯店所有權REIT @zh-hant
label: 호텔 리츠 @ko
label: ﾎﾃﾙREIT @ja
definition: This industry subgroup includes real estate investment trusts (REITs) that own and develop hotel/resort properties.
notation: 15101112
valid from: 2024-06-07

Apartment REIT
type: BicsLevel5Segment
type: Classifier
type: NamedIndividual
is level5 segment of: REIT - résidences
is contemporary version of: http://data.ga-group.nl/ics/bics/1510111310
is version of: http://data.ga-group.nl/ics/bics/1510111310
replaces: http://data.ga-group.nl/ics/bics/2020/1510111310
imported on: 2026-06-08T13:40:52.236Z
last refreshed on: 2026-06-08T13:41:38.450Z
source accessed on: 2024-06-05T14:42:36Z
source last accessed on: 2024-06-05T14:42:36Z
label: Apartamento REIT @es
label: Appartments - REIT @de
label: REIT - Appartements @fr
label: REIT Appartamenti @it
label: Квартиры - REIT @ru
label: 公寓REIT @zh
label: 公���REIT @zh
label: 共同住宅REIT @ja
label: 아파트 리츠 @ko
definition: This segment includes real estate investment trusts (REITs) that own and develop apartments that typically have 5+ units.
notation: 1510111310
valid from: 2024-06-07

Single Family Housing REIT
type: BicsLevel5Segment
type: Classifier
type: NamedIndividual
is level5 segment of: REIT - résidences
is contemporary version of: http://data.ga-group.nl/ics/bics/1510111311
is version of: http://data.ga-group.nl/ics/bics/1510111311
replaces: http://data.ga-group.nl/ics/bics/2020/1510111311
imported on: 2026-06-08T13:40:52.236Z
last refreshed on: 2026-06-08T13:41:38.450Z
source accessed on: 2024-06-05T14:42:36Z
source last accessed on: 2024-06-05T14:42:36Z
label: Einfamilienhäuser - REIT @de
label: Moradia unifamiliar REIT @pt
label: REIT - Maisons individuelles @fr
label: REIT Case unifamiliari @it
label: Viviendas unifamiliares REIT @es
label: Дома на одну семью - REIT @ru
label: 一世帯住宅REIT @ja
label: 單戶住宅REIT @zh-hant
label: 独栋住宅REIT @zh
label: 단독주택 리츠 @ko
definition: This segment includes real estate investment trusts (REITs) that own and develop single family homes.
notation: 1510111311
valid from: 2024-06-07

Manufactured Housing REIT
type: BicsLevel5Segment
type: Classifier
type: NamedIndividual
is level5 segment of: REIT - résidences
is contemporary version of: http://data.ga-group.nl/ics/bics/1510111312
is version of: http://data.ga-group.nl/ics/bics/1510111312
replaces: http://data.ga-group.nl/ics/bics/2020/1510111312
imported on: 2026-06-08T13:40:52.236Z
last refreshed on: 2026-06-08T13:41:38.450Z
source accessed on: 2024-06-05T14:42:36Z
source last accessed on: 2024-06-05T14:42:36Z
label: Casas pré-fabricadas REIT @pt
label: Fertighäuser - REIT @de
label: REIT - Maisons pré-fabriquées @fr
label: REIT Case prefabbricate @it
label: Viviendas fabricadas REIT @es
label: Сборные дома - REIT @ru
label: 組合住宅REIT @zh-hant
label: 预制房REIT @zh
label: 조립주택 리츠 @ko
label: ﾌﾟﾚﾊﾌﾞ住宅REIT @ja
definition: This segment includes real estate investment trusts (REITs) that own and develop pad sites and mobile/manufactured homes. This also includes REITs that operate resort communities where clients bring their own RVs and pay a fee to rent ground space/pad sites.
notation: 1510111312
valid from: 2024-06-07

Student Housing REIT
type: BicsLevel5Segment
type: Classifier
type: NamedIndividual
is level5 segment of: REIT - résidences
is contemporary version of: http://data.ga-group.nl/ics/bics/1510111313
is version of: http://data.ga-group.nl/ics/bics/1510111313
replaces: http://data.ga-group.nl/ics/bics/2020/1510111313
imported on: 2026-06-08T13:40:52.236Z
last refreshed on: 2026-06-08T13:41:38.450Z
source accessed on: 2024-06-05T14:42:36Z
source last accessed on: 2024-06-05T14:42:36Z
label: Casas para estudantes REIT @pt
label: REIT - Logements pour étudiants @fr
label: REIT Case dello studente @it
label: Studentenwohnungen - REIT @de
label: Viviendas de estudiantes REIT @es
label: Студенческое жилье - REIT @ru
label: 学生住宅REIT @zh
label: 学生用住宅REIT @ja
label: 學生住宅REIT @zh-hant
label: 학생용 주택 리츠 @ko
definition: This segment includes real estate investment trusts (REITs) that own and develop student housing. Such housing is any for-rent housing that is available only to students.
notation: 1510111313
valid from: 2024-06-07

REIT - résidences
type: BicsLevel4SubIndustry
type: Classifier
type: NamedIndividual
is sub industry of: REIT
is contemporary version of: http://data.ga-group.nl/ics/bics/15101113
is version of: http://data.ga-group.nl/ics/bics/15101113
replaces: http://data.ga-group.nl/ics/bics/2020/15101113
imported on: 2026-06-08T13:40:52.236Z
last refreshed on: 2026-06-08T13:41:38.450Z
source accessed on: 2024-06-05T14:42:36Z
source last accessed on: 2024-06-05T14:42:36Z
label: REIT Residenziali @it
label: REIT residencial @es
label: REITs residencial @pt
label: Residential REIT
label: Жилищные REIT @ru
label: 住宅REIT @ja
label: 住宅不動產投資信託 @zh-hant
label: 주거용 리츠 @ko
definition: This industry subgroup includes real estate investment trusts (REITs) that own and develop residential housing facilities.
notation: 15101113
valid from: 2024-06-07

Bulk Warehouse REIT
type: BicsLevel5Segment
type: Classifier
type: NamedIndividual
is level5 segment of: Industrial REIT
is contemporary version of: http://data.ga-group.nl/ics/bics/1510111410
is version of: http://data.ga-group.nl/ics/bics/1510111410
replaces: http://data.ga-group.nl/ics/bics/2020/1510111410
imported on: 2026-06-08T13:40:52.236Z
last refreshed on: 2026-06-08T13:41:38.450Z
source accessed on: 2024-06-05T14:42:36Z
source last accessed on: 2024-06-05T14:42:36Z
label: Almacén másico REIT @es
label: Armazém a granel REIT @pt
label: Bulk-Lagerhallen - REIT @de
label: REIT - Entrepôt de vrac @fr
label: REIT Magazzini grandi @it
label: Крупные склады - REIT @ru
label: 散裝倉庫REIT @zh-hant
label: 散货仓库REIT @zh
label: 대량 창고 리츠 @ko
label: ﾊﾞﾙｸ倉庫REIT @ja
definition: This segment includes real estate investment trusts (REITs) that own and develop high-ceiling industrial properties used for distribution, warehousing, and manufacturing.
notation: 1510111410
valid from: 2024-06-07

Flex Industrial REIT
type: BicsLevel5Segment
type: Classifier
type: NamedIndividual
is level5 segment of: Industrial REIT
is contemporary version of: http://data.ga-group.nl/ics/bics/1510111411
is version of: http://data.ga-group.nl/ics/bics/1510111411
replaces: http://data.ga-group.nl/ics/bics/2020/1510111411
imported on: 2026-06-08T13:40:52.236Z
last refreshed on: 2026-06-08T13:41:38.450Z
source accessed on: 2024-06-05T14:42:36Z
source last accessed on: 2024-06-05T14:42:36Z
label: Flex industrial REIT @pt
label: Flex-Industrie - REIT @de
label: REIT - Complexes indus adaptables @fr
label: REIT Industriali flex @it
label: Смешанная промышл. - REIT @ru
label: Смешанная промыш��. - REIT @ru
label: 彈性工業REIT @zh-hant
label: 灵活产业REIT @zh
label: 전환 산업용 리츠 @ko
label: ｵﾌｨｽ兼倉庫REIT @ja
definition: This segment includes real estate investment trusts (REITS) that own and develop flex space, which can accomodate office, light manufacturing, R&D, and/or storage usage in the same unit.
notation: 1510111411
valid from: 2024-06-07

Temp Control Logistics REIT
type: BicsLevel5Segment
type: Classifier
type: NamedIndividual
is level5 segment of: Industrial REIT
is contemporary version of: http://data.ga-group.nl/ics/bics/1510111412
is version of: http://data.ga-group.nl/ics/bics/1510111412
replaces: http://data.ga-group.nl/ics/bics/2020/1510111412
imported on: 2026-06-08T13:40:52.236Z
last refreshed on: 2026-06-08T13:41:38.450Z
source accessed on: 2024-06-05T14:42:36Z
source last accessed on: 2024-06-05T14:42:36Z
label: Logística controlada p/ temp - REIT @es
label: Logística temp contrl REIT @pt
label: REIT - Logistique temp contrôlée @fr
label: REIT Logistica controllo temp @it
label: Temperaturkontroll. Logistik - REIT @de
label: Терморегулируемая логистика - REIT @ru
label: 控温物流REIT @zh
label: 温度管理物流施設REIT @ja
label: 溫控物流REIT @zh-hant
label: 온도 제어 물류 리츠 @ko
definition: This segment includes real estate investment trusts (REITS) that own and develop temperature-controlled industrial, warehouse or distribution facilities. Such facilities are equipped to accommodate temperature adjustment, refrigeration and/or freezing needs.
notation: 1510111412
valid from: 2024-06-07

Industrial REIT
type: BicsLevel4SubIndustry
type: Classifier
type: NamedIndividual
is sub industry of: REIT
is contemporary version of: http://data.ga-group.nl/ics/bics/15101114
is version of: http://data.ga-group.nl/ics/bics/15101114
replaces: http://data.ga-group.nl/ics/bics/2020/15101114
imported on: 2026-06-08T13:40:52.236Z
last refreshed on: 2026-06-08T13:41:38.450Z
source accessed on: 2024-06-05T14:42:36Z
source last accessed on: 2024-06-05T14:42:36Z
label: Industrie - REIT @de
label: REIT - Industriels @fr
label: REIT Industriali @it
label: промышл. - REIT @ru
label: 工业REIT @zh
label: 工業REIT @zh-hant
label: 産業用REIT @ja
label: 산업용 리츠 @ko
definition: This industry subgroup includes real estate investment trusts (REITs) that own and develop industrial properties, such as warehouses, distribution centers, flex spaces, and industrial parks.
notation: 15101114
valid from: 2024-06-07

CBD Office REIT
type: BicsLevel5Segment
type: Classifier
type: NamedIndividual
is level5 segment of: Office REIT
is contemporary version of: http://data.ga-group.nl/ics/bics/1510111510
is version of: http://data.ga-group.nl/ics/bics/1510111510
replaces: http://data.ga-group.nl/ics/bics/2020/1510111510
imported on: 2026-06-08T13:40:52.236Z
last refreshed on: 2026-06-08T13:41:38.450Z
source accessed on: 2024-06-05T14:42:36Z
source last accessed on: 2024-06-05T14:42:36Z
label: CBD Oficina REIT @es
label: CBD 사무실 리츠 @ko
label: CBD-Büros - REIT @de
label: CBD办公楼REIT @zh
label: CBDｵﾌｨｽREIT @ja
label: Escritório CBD REIT @pt
label: REIT - Bur quartier des affaires @fr
label: REIT Uffici CBD @it
label: Офис в деловом центре - REIT @ru
label: 中心商業區辦公室REIT @zh-hant
definition: This segment includes real estate investment trusts (REITs) that own and develop office buildings in central business districts (CBDs). Outside of the U.S., if the office is not identified as being in a CBD, the number of stories in the building will be used to determine whether it is CBD (5 or more stories) or suburban (less than 5 stories).
notation: 1510111510
valid from: 2024-06-07

Suburban Office REIT
type: BicsLevel5Segment
type: Classifier
type: NamedIndividual
is level5 segment of: Office REIT
is contemporary version of: http://data.ga-group.nl/ics/bics/1510111511
is version of: http://data.ga-group.nl/ics/bics/1510111511
replaces: http://data.ga-group.nl/ics/bics/2020/1510111511
imported on: 2026-06-08T13:40:52.236Z
last refreshed on: 2026-06-08T13:41:38.450Z
source accessed on: 2024-06-05T14:42:36Z
source last accessed on: 2024-06-05T14:42:36Z
label: Escritório suburbano REIT @pt
label: Oficina afueras de la ciudad REIT @es
label: REIT - Bureaux en banlieue @fr
label: REIT Uffici sobborghi @it
label: Vorstadtbüros - REIT @de
label: Пригородный офис - REIT @ru
label: 近郊辦公室REIT @zh-hant
label: 郊区办公楼REIT @zh
label: 郊外ｵﾌｨｽREIT @ja
label: 교외 사무실 리츠 @ko
definition: This segment includes real estate investment trusts (REITs) that own and develop office buildings in the suburbs. Outside of the U.S., if the office is not identified as being in a CBD, the number of stories in the building will be used to determine whether it is CBD (5 or more stories) or suburban (less than 5 stories).
notation: 1510111511
valid from: 2024-06-07

Office REIT
type: BicsLevel4SubIndustry
type: Classifier
type: NamedIndividual
is sub industry of: REIT
is contemporary version of: http://data.ga-group.nl/ics/bics/15101115
is version of: http://data.ga-group.nl/ics/bics/15101115
replaces: http://data.ga-group.nl/ics/bics/2020/15101115
imported on: 2026-06-08T13:40:52.236Z
last refreshed on: 2026-06-08T13:41:38.450Z
source accessed on: 2024-06-05T14:42:36Z
source last accessed on: 2024-06-05T14:42:36Z
label: Büro-REITs @de
label: Escritório REIT @pt
label: REIT Bureaux @fr
label: REIT de oficinas @es
label: REIT uffici @it
label: Офисные REITs @ru
label: О��исные REITs @ru
label: 办公楼REIT @zh
label: 辦公室不動產投資信託 @zh-hant
label: 사무실 리츠(REIT) @ko
label: ｵﾌｨｽREIT @ja
definition: This industry subgroup includes real estate investment trusts (REITs) that own and develop office buildings in either central business districts or the suburbs.
notation: 15101115
valid from: 2024-06-07

Regional Mall REIT
type: BicsLevel5Segment
type: Classifier
type: NamedIndividual
is level5 segment of: Retail REIT
is contemporary version of: http://data.ga-group.nl/ics/bics/1510111610
is version of: http://data.ga-group.nl/ics/bics/1510111610
replaces: http://data.ga-group.nl/ics/bics/2020/1510111610
imported on: 2026-06-08T13:40:52.236Z
last refreshed on: 2026-06-08T13:41:38.450Z
source accessed on: 2024-06-05T14:42:36Z
source last accessed on: 2024-06-05T14:42:36Z
label: Centro comerciais regionais REIT @pt
label: Centros comerciales REIT @es
label: REIT -Centres commerciaux régionaux @fr
label: REIT Centri commerciali regionali @it
label: Regionale Einkauszentren - REIT @de
label: Региональные торговые центры - REIT @ru
label: 地区购物商城REIT @zh
label: 地區購物中心REIT @zh-hant
label: 地方ﾓｰﾙREIT @ja
label: 지역쇼핑몰 리츠 @ko
definition: This segment includes real estate investment trusts (REITs) that own and develop mall spaces. These malls, also known as shopping malls, typically have retail stores that are enclosed within a large, single building.
notation: 1510111610
valid from: 2024-06-07

Shopping Center REIT
type: BicsLevel5Segment
type: Classifier
type: NamedIndividual
is level5 segment of: Retail REIT
is contemporary version of: http://data.ga-group.nl/ics/bics/1510111611
is version of: http://data.ga-group.nl/ics/bics/1510111611
replaces: http://data.ga-group.nl/ics/bics/2020/1510111611
imported on: 2026-06-08T13:40:52.236Z
last refreshed on: 2026-06-08T13:41:38.450Z
source accessed on: 2024-06-05T14:42:36Z
source last accessed on: 2024-06-05T14:42:36Z
label: Centro comercial REIT @es
label: REIT - Zones de magasins @fr
label: REIT Centri commerciali @it
label: Shopping Centers REIT @pt
label: Shoppingcenter - REIT @de
label: Торговые центры - REIT @ru
label: 購物中心REIT @zh-hant
label: 购物中心REIT @zh
label: 쇼핑센터 리츠 @ko
label: ｼｮｯﾋﾟﾝｸﾞｾﾝﾀｰREIT @ja
definition: This segment includes real estate investment trusts (REITs) that own and develop shopping centers. These shopping centers typically encompass multiple stand-alone retail buildings within a self-contained lot.
notation: 1510111611
valid from: 2024-06-07

Single Tenant REIT
type: BicsLevel5Segment
type: Classifier
type: NamedIndividual
is level5 segment of: Retail REIT
is contemporary version of: http://data.ga-group.nl/ics/bics/1510111612
is version of: http://data.ga-group.nl/ics/bics/1510111612
replaces: http://data.ga-group.nl/ics/bics/2020/1510111612
imported on: 2026-06-08T13:40:52.236Z
last refreshed on: 2026-06-08T13:41:38.450Z
source accessed on: 2024-06-05T14:42:36Z
source last accessed on: 2024-06-05T14:42:36Z
label: Einzelmieter - REIT @de
label: REIT - Locataire unique @fr
label: REIT Locatario unico @it
label: Un inquilino REIT @es
label: Único inquilino REIT @pt
label: Один съемщик - REIT @ru
label: 单一租户REIT @zh
label: 単一ﾃﾅﾝﾄREIT @ja
label: 單一租客REIT @zh-hant
label: 단일입주자 리츠 @ko
definition: This segment includes real estate investment trusts (REITs) that own and develop stand-alone retail buildings that serve single retail tenants, such as stand-alone gas stations or restaurants.
notation: 1510111612
valid from: 2024-06-07

Retail REIT
type: BicsLevel4SubIndustry
type: Classifier
type: NamedIndividual
is sub industry of: REIT
is contemporary version of: http://data.ga-group.nl/ics/bics/15101116
is version of: http://data.ga-group.nl/ics/bics/15101116
replaces: http://data.ga-group.nl/ics/bics/2020/15101116
imported on: 2026-06-08T13:40:52.236Z
last refreshed on: 2026-06-08T13:41:38.450Z
source accessed on: 2024-06-05T14:42:36Z
source last accessed on: 2024-06-05T14:42:36Z
label: Einzelhandel-REITs @de
label: REIT Distribution @fr
label: REIT al por menor @es
label: REIT negozi @it
label: Varejo REIT @pt
label: Розничные REIT @ru
label: 商業施設REIT @ja
label: 零售REIT @zh
label: 零售不動產投資信託 @zh-hant
label: 소매 리츠(REIT) @ko
definition: This segment includes real estate investment trusts (REITs) that own and develop retail real estate, such as outlet spaces, strip centers, malls, and single-tenant entities.
notation: 15101116
valid from: 2024-06-07

Self-storage REIT
type: BicsLevel4SubIndustry
type: Classifier
type: NamedIndividual
is sub industry of: REIT
is contemporary version of: http://data.ga-group.nl/ics/bics/15101117
is version of: http://data.ga-group.nl/ics/bics/15101117
replaces: http://data.ga-group.nl/ics/bics/2020/15101117
imported on: 2026-06-08T13:40:52.236Z
last refreshed on: 2026-06-08T13:41:38.450Z
source accessed on: 2024-06-05T14:42:36Z
source last accessed on: 2024-06-05T14:42:36Z
label: Auto armazenamento REIT @pt
label: Minilager REIT @de
label: REIT de almacenamiento propio @es
label: REIT entreposage libre-service @fr
label: REIT self-storage @it
label: Камеры хранения - REIT @ru
label: 自助仓库 REIT @zh
label: 自助倉儲 REIT @zh-hant
label: 자가창고 리츠(REIT) @ko
label: ﾄﾗﾝｸﾙｰﾑREIT @ja
definition: This industry subgroup includes real estate investment trusts (REITs) that own and develop self-storage units and facilities.
notation: 15101117
valid from: 2024-06-07

Timber REIT
type: BicsLevel4SubIndustry
type: Classifier
type: NamedIndividual
is sub industry of: REIT
is contemporary version of: http://data.ga-group.nl/ics/bics/15101118
is version of: http://data.ga-group.nl/ics/bics/15101118
replaces: http://data.ga-group.nl/ics/bics/2020/15101118
imported on: 2026-06-08T13:40:52.236Z
last refreshed on: 2026-06-08T13:41:38.450Z
source accessed on: 2024-06-05T14:42:36Z
source last accessed on: 2024-06-05T14:42:36Z
label: Madera REIT @es
label: REIT - Holz @de
label: REIT Bois oeuv @fr
label: REIT Legname @it
label: REIT Madeira @pt
label: Лесоматериал - REIT @ru
label: 木材REIT @ja
label: 목재 리츠 @ko
definition: This industry subgroup includes real estate investment trusts (REITs) that own and develop tracts of timberlands.
notation: 15101118
valid from: 2024-06-07

Data Center REIT
type: BicsLevel4SubIndustry
type: Classifier
type: NamedIndividual
is sub industry of: REIT
is contemporary version of: http://data.ga-group.nl/ics/bics/15101119
is version of: http://data.ga-group.nl/ics/bics/15101119
replaces: http://data.ga-group.nl/ics/bics/2020/15101119
imported on: 2026-06-08T13:40:52.236Z
last refreshed on: 2026-06-08T13:41:38.450Z
source accessed on: 2024-06-05T14:42:36Z
source last accessed on: 2024-06-05T14:42:36Z
label: Centro de datos REIT @es
label: REIT - Datencenter @de
label: REIT Centre données @fr
label: REIT Centri dati @it
label: REIT Centro de dados @pt
label: REIT центров данных @ru
label: 数据中心REIT @zh
label: 資料中心REIT @zh-hant
label: 데이터센터 리츠 @ko
label: ﾃﾞｰﾀｾﾝﾀｰREIT @ja
definition: This industry subgroup includes real estate investment trusts (REITs) that own and develop data centers.
notation: 15101119
valid from: 2024-06-07

Infrastructure REIT
type: BicsLevel4SubIndustry
type: Classifier
type: NamedIndividual
is sub industry of: REIT
is contemporary version of: http://data.ga-group.nl/ics/bics/15101120
is version of: http://data.ga-group.nl/ics/bics/15101120
replaces: http://data.ga-group.nl/ics/bics/2020/15101120
imported on: 2026-06-08T13:40:52.236Z
last refreshed on: 2026-06-08T13:41:38.450Z
source accessed on: 2024-06-05T14:42:36Z
source last accessed on: 2024-06-05T14:42:36Z
label: Infraestructura REIT @es
label: REIT - Infrastruktur @de
label: REIT Infraestrutura @pt
label: REIT Infrastructure @fr
label: REIT Infrastrutture @it
label: Инфраструктурные REIT @ru
label: 基础设施REIT @zh
label: 基礎設施REIT @zh-hant
label: 인프라스트럭처 리츠 @ko
label: ｲﾝﾌﾗREIT @ja
definition: This industry subgroup includes real estate investment trusts (REITs) that own and develop infrastructure assets for the communications, energy, transportation, and/or utility industries.
notation: 15101120
valid from: 2024-06-07

Gaming REIT
type: BicsLevel4SubIndustry
type: Classifier
type: NamedIndividual
is sub industry of: REIT
is contemporary version of: http://data.ga-group.nl/ics/bics/15101121
is version of: http://data.ga-group.nl/ics/bics/15101121
replaces: http://data.ga-group.nl/ics/bics/2020/15101121
imported on: 2026-06-08T13:40:52.236Z
last refreshed on: 2026-06-08T13:41:38.450Z
source accessed on: 2024-06-05T14:42:36Z
source last accessed on: 2024-06-05T14:42:36Z
label: Glücksspiel REIT @de
label: REIT Gioco d'azzardo @it
label: REIT Jeu @fr
label: REIT Jogos @pt
label: REIT de juegos @es
label: Игровой REIT @ru
label: 博奕REIT @zh-hant
label: 博彩REIT @zh
label: 게이밍REIT @ko
label: ｹﾞｰﾐﾝｸﾞREIT @ja
definition: This industry subgroup includes real estate investment trusts (REITs) that own and develop gaming related properties such as casinos, betting shops, racetracks, and casino hotels.
notation: 15101121
valid from: 2024-06-07

Specialty REIT
type: BicsLevel4SubIndustry
type: Classifier
type: NamedIndividual
is sub industry of: REIT
is contemporary version of: http://data.ga-group.nl/ics/bics/15101122
is version of: http://data.ga-group.nl/ics/bics/15101122
replaces: http://data.ga-group.nl/ics/bics/2020/15101122
imported on: 2026-06-08T13:40:52.236Z
last refreshed on: 2026-06-08T13:41:38.450Z
source accessed on: 2024-06-05T14:42:36Z
source last accessed on: 2024-06-05T14:42:36Z
label: Especialidade REIT @pt
label: REIT - spécialisés @fr
label: REIT especializado @es
label: REIT specializzati @it
label: Spezial-REIT @de
label: Специализ. REIT @ru
label: 特殊及其他REIT @zh-hant
label: 特殊施設REIT @ja
label: 特种REIT @zh
label: 전문 리츠 @ko
definition: This industry subgroup includes real estate investment trusts (REITs) that own and develop specialty and other properties not elsewhere classified.
notation: 15101122
valid from: 2024-06-07

REIT
type: BicsLevel3Industry
type: Classifier
type: NamedIndividual
is industry of: Real Estate
is contemporary version of: http://data.ga-group.nl/ics/bics/151011
is version of: http://data.ga-group.nl/ics/bics/151011
replaces: http://data.ga-group.nl/ics/bics/2020/151011
imported on: 2026-06-08T13:40:52.236Z
last refreshed on: 2026-06-08T13:41:38.450Z
source accessed on: 2024-06-05T14:42:36Z
source last accessed on: 2024-06-05T14:42:36Z
label: 不動產投資信託 @zh-hant
label: 리츠 @ko
definition: This industry includes companies that own or develop real estate assets and are structured as a real estate investment trusts (REITs). Companies with other similar structures that provide a tax benefit and have a defined distribution policy are also included. Excludes REITs which primarily invest in real estate loans (see Mortgage REIT).
notation: 151011
valid from: 2024-06-07

Commercial Property Mgmt
type: BicsLevel6Segment
type: Classifier
type: NamedIndividual
is level6 segment of: Property Management
is contemporary version of: http://data.ga-group.nl/ics/bics/151012101010
is version of: http://data.ga-group.nl/ics/bics/151012101010
replaces: http://data.ga-group.nl/ics/bics/2020/151012101010
imported on: 2026-06-08T13:40:52.236Z
last refreshed on: 2026-06-08T13:41:38.450Z
source accessed on: 2024-06-05T14:42:36Z
source last accessed on: 2024-06-05T14:42:36Z
label: Administração de propriedades comerciais @pt
label: Gestión de propiedad comercial @es
label: Gestion de propriétés commerciales @fr
label: Gestione proprietà commerciali @it
label: Immobilienverwaltung - gewerblich @de
label: Управление коммерческой недвижимостью @ru
label: 商业物业管理 @zh
label: 商業不動產管理 @zh-hant
label: 商業不動産管理 @ja
label: 상업용 부동산 관리 @ko
label: 상업용 부동산 ���리 @ko
definition: This segment includes companies that provide management services for commercial property. Includes all property types other than any type under Residential Owners & Developers (see Residential Property Mgmt) or senior housing facilities (see Senior Housing Operators).
notation: 151012101010
valid from: 2024-06-07

Residential Property Mgmt
type: BicsLevel6Segment
type: Classifier
type: NamedIndividual
is level6 segment of: Property Management
is contemporary version of: http://data.ga-group.nl/ics/bics/151012101011
is version of: http://data.ga-group.nl/ics/bics/151012101011
replaces: http://data.ga-group.nl/ics/bics/2020/151012101011
imported on: 2026-06-08T13:40:52.236Z
last refreshed on: 2026-06-08T13:41:38.450Z
source accessed on: 2024-06-05T14:42:36Z
source last accessed on: 2024-06-05T14:42:36Z
label: Administração de propriedades residenciais @pt
label: Gestión de propiedad residencial @es
label: Gestion de propriétés résidentielles @fr
label: Gestione proprietà residenziali @it
label: Immobilienverwaltung - Wohnungen @de
label: Управление жилой недвижимостью @ru
label: 住宅不動產管理 @zh-hant
label: 住宅不動産管理 @ja
label: 住宅物业管理 @zh
label: 주거용 부동산 관리 @ko
definition: This segment includes companies that provide management services for residential property.
notation: 151012101011
valid from: 2024-06-07

Senior Housing Operators
type: BicsLevel6Segment
type: Classifier
type: NamedIndividual
is level6 segment of: Property Management
is contemporary version of: http://data.ga-group.nl/ics/bics/151012101012
is version of: http://data.ga-group.nl/ics/bics/151012101012
replaces: http://data.ga-group.nl/ics/bics/2020/151012101012
imported on: 2026-06-08T13:40:52.236Z
last refreshed on: 2026-06-08T13:41:38.450Z
source accessed on: 2024-06-05T14:42:36Z
source last accessed on: 2024-06-05T14:42:36Z
label: Abitazioni anziani @it
label: Opérateurs logement pr personnes âgées @fr
label: Operadores de moradia para idosos @pt
label: Ops viviendas adultos mayores @es
label: Seniorenwohnungen - Inh. & Erschl. @de
label: Жилье для пенсионеров - Управляющие @ru
label: 老年公寓经营者 @zh
label: 高齡住宅業者 @zh-hant
label: 高齢者用住宅運営 @ja
label: 고령자용 주택 운영자 @ko
definition: This segment includes companies that manage and operate senior housing facilities. These companies provide outsourced management services on behalf of the property owners.
notation: 151012101012
valid from: 2024-06-07

Property Management
type: BicsLevel5Segment
type: Classifier
type: NamedIndividual
is level5 segment of: Real Estate Services
is contemporary version of: http://data.ga-group.nl/ics/bics/1510121010
is version of: http://data.ga-group.nl/ics/bics/1510121010
replaces: http://data.ga-group.nl/ics/bics/2020/1510121010
imported on: 2026-06-08T13:40:52.236Z
last refreshed on: 2026-06-08T13:41:38.450Z
source accessed on: 2024-06-05T14:42:36Z
source last accessed on: 2024-06-05T14:42:36Z
label: Administração de propriedades @pt
label: Gestión de propiedad @es
label: Gestion de propriétés @fr
label: Gestione proprietà @it
label: Immobilienverwaltung @de
label: Управление объектами недвижимости @ru
label: 不動產管理 @zh-hant
label: 不動産管理 @ja
label: 物业管理 @zh
label: 부동산 관리 @ko
definition: This segment includes companies that provide property management services, including building maintenance and security and bill payment services.
notation: 1510121010
valid from: 2024-06-07

Real Estate Brokerage - Lease
type: BicsLevel6Segment
type: Classifier
type: NamedIndividual
is level6 segment of: Real Estate Brokerage
is contemporary version of: http://data.ga-group.nl/ics/bics/151012101110
is version of: http://data.ga-group.nl/ics/bics/151012101110
replaces: http://data.ga-group.nl/ics/bics/2020/151012101110
imported on: 2026-06-08T13:40:52.236Z
last refreshed on: 2026-06-08T13:41:38.450Z
source accessed on: 2024-06-05T14:42:36Z
source last accessed on: 2024-06-05T14:42:36Z
label: Corretagem de imóveis - Lease @pt
label: Corretaje inmobiliario - arrendamiento @es
label: Courtage immob - locations @fr
label: Immobilienmaklerfirma - Lease @de
label: Intermediazioni immob - Leasing @it
label: Брокеры недвиж. - аренда @ru
label: 不動產經紀-租賃 @zh-hant
label: 不動産仲介-ﾘｰｽ @ja
label: 房地产经纪-租赁 @zh
label: 부동산 중개 - 리스 @ko
definition: This segment includes companies that provide brokerage services for real estate leasing between a lessee and the property owner for a fee.
notation: 151012101110
valid from: 2024-06-07

Real Estate Brokerage - Sales
type: BicsLevel6Segment
type: Classifier
type: NamedIndividual
is level6 segment of: Real Estate Brokerage
is contemporary version of: http://data.ga-group.nl/ics/bics/151012101111
is version of: http://data.ga-group.nl/ics/bics/151012101111
replaces: http://data.ga-group.nl/ics/bics/2020/151012101111
imported on: 2026-06-08T13:40:52.236Z
last refreshed on: 2026-06-08T13:41:38.450Z
source accessed on: 2024-06-05T14:42:36Z
source last accessed on: 2024-06-05T14:42:36Z
label: Corretagem de imóveis - Vendas @pt
label: Corretaje inmobiliario - ventas @es
label: Courtage immobilier - Ventes @fr
label: Immobilienmaklerfirma - Sales @de
label: Intermediazioni immobiliari - Vendita @it
label: Брок. услуги по операциям с недвиж. - продажи @ru
label: 不動產經紀-銷售 @zh-hant
label: 不動産仲介-販売 @ja
label: 房地产经纪-销售 @zh
label: 부동산 중개업-판매 @ko
definition: This segment includes companies that provide brokerage services for real estate sales between a buyer and a seller for a fee.
notation: 151012101111
valid from: 2024-06-07

Real Estate Brokerage
type: BicsLevel5Segment
type: Classifier
type: NamedIndividual
is level5 segment of: Real Estate Services
is contemporary version of: http://data.ga-group.nl/ics/bics/1510121011
is version of: http://data.ga-group.nl/ics/bics/1510121011
replaces: http://data.ga-group.nl/ics/bics/2020/1510121011
imported on: 2026-06-08T13:40:52.236Z
last refreshed on: 2026-06-08T13:41:38.450Z
source accessed on: 2024-06-05T14:42:36Z
source last accessed on: 2024-06-05T14:42:36Z
label: Corretagem imobiliária @pt
label: Corretaje de inmuebles @es
label: Courtage en immobilier @fr
label: Immobilien-Brokerage @de
label: Intermediazione immobiliare @it
label: Недвижимость - брокераж @ru
label: 不動產經紀 @zh-hant
label: 不動産仲介 @ja
label: 房地产经纪 @zh
label: 부동산 중개 @ko
definition: This segment includes companies that provide brokerage services between a lessee and the property owner for a fee. These companies may represent either side of a transaction and may provide marketing services. These companies do not own the underlying property.
notation: 1510121011
valid from: 2024-06-07

Real Estate Services
type: BicsLevel4SubIndustry
type: Classifier
type: NamedIndividual
is sub industry of: Real Estate Services
is contemporary version of: http://data.ga-group.nl/ics/bics/15101210
is version of: http://data.ga-group.nl/ics/bics/15101210
replaces: http://data.ga-group.nl/ics/bics/2020/15101210
imported on: 2026-06-08T13:40:52.236Z
last refreshed on: 2026-06-08T13:41:38.450Z
source accessed on: 2024-06-05T14:42:36Z
source last accessed on: 2024-06-05T14:42:36Z
label: Immobiliendienste @de
label: Serviços imobiliários @pt
label: Services immobiliers @fr
label: Servicios inmobiliarios @es
label: Servizi immobiliari @it
label: Недвижимость - Услуги @ru
label: 不動產服務 @zh-hant
label: 不動産ｻｰﾋﾞｽ @ja
label: 房地产服务 @zh
label: 부동산 서비스 @ko
definition: This industry subgroup includes companies that provide specialized services for real estate. Includes property and/or third-party asset management, brokerage, and information services for real estate owners.
notation: 15101210
valid from: 2024-06-07

Real Estate Services
type: BicsLevel3Industry
type: Classifier
type: NamedIndividual
is industry of: Real Estate
is contemporary version of: http://data.ga-group.nl/ics/bics/151012
is version of: http://data.ga-group.nl/ics/bics/151012
replaces: http://data.ga-group.nl/ics/bics/2020/151012
imported on: 2026-06-08T13:40:52.236Z
last refreshed on: 2026-06-08T13:41:38.450Z
source accessed on: 2024-06-05T14:42:36Z
source last accessed on: 2024-06-05T14:42:36Z
label: Immobiliendienste @de
label: Serviços imobiliários @pt
label: Services immobiliers @fr
label: Servicios inmobiliarios @es
label: Servizi immobiliari @it
label: Недвижимость - Услуги @ru
label: 不動產服務 @zh-hant
label: 不動産ｻｰﾋﾞｽ @ja
label: 房地产服务 @zh
label: 부동산 서비스 @ko
definition: This industry subgroup includes companies that provide specialized services for real estate. Includes property and/or third-party asset management, brokerage, and information services for real estate owners.
notation: 151012
valid from: 2024-06-07

Real Estate
type: BicsLevel2IndustryGroup
type: Classifier
type: NamedIndividual
is industry group of: Real Estate
is contemporary version of: http://data.ga-group.nl/ics/bics/1510
is version of: http://data.ga-group.nl/ics/bics/1510
replaces: http://data.ga-group.nl/ics/bics/2020/1510
imported on: 2026-06-08T13:40:52.236Z
last refreshed on: 2026-06-08T13:41:38.450Z
source accessed on: 2024-06-05T14:42:36Z
source last accessed on: 2024-06-05T14:42:36Z
label: Imóveis @pt
label: Immobili @it
label: Immobilien @de
label: Immobilier @fr
label: Inmobiliario @es
label: Недвижимость @ru
label: 不動產 @zh-hant
label: 不動産 @ja
label: 房地产 @zh
label: 부동산 @ko
definition: This industry group includes companies that own, develop, or provide specialized services for real estate assets.
notation: 1510
valid from: 2024-06-07

Real Estate
type: BicsLevel1Sector
type: Classifier
type: NamedIndividual
is contemporary version of: http://data.ga-group.nl/ics/bics/15
is version of: http://data.ga-group.nl/ics/bics/15
replaces: http://data.ga-group.nl/ics/bics/2020/15
imported on: 2026-06-08T13:40:52.236Z
last refreshed on: 2026-06-08T13:41:38.450Z
source accessed on: 2024-06-05T14:42:36Z
source last accessed on: 2024-06-05T14:42:36Z
label: Imóveis @pt
label: Immobili @it
label: Immobilien @de
label: Immobilier @fr
label: Inmobiliario @es
label: Недвижимость @ru
label: 不動產 @zh-hant
label: 不動産 @ja
label: 房地产 @zh
label: 부동산 @ko
definition: This sector includes companies that own, develop, or provide specialized services for real estate assets.
notation: 15
valid from: 2024-06-07

Large Pharma
type: BicsLevel4SubIndustry
type: Classifier
type: NamedIndividual
is sub industry of: Biotech & Pharma
is contemporary version of: http://data.ga-group.nl/ics/bics/16101010
is version of: http://data.ga-group.nl/ics/bics/16101010
replaces: http://data.ga-group.nl/ics/bics/2020/16101010
imported on: 2026-06-08T13:40:52.236Z
last refreshed on: 2026-06-08T13:41:38.450Z
source accessed on: 2024-06-05T14:42:36Z
source last accessed on: 2024-06-05T14:42:36Z
label: Farma grande @it
label: Farmacéuticas grandes @es
label: Grande pharma @fr
label: Grandes ind farmac @pt
label: Große Pharma @de
label: Крупные фармац. компании @ru
label: 大型制药 @zh
label: 大型製藥業 @zh-hant
label: 大手製薬 @ja
label: 대형 제약업체 @ko
definition: This industry subgroup includes large companies that are involved in all stages of the pharmaceutical industry from drug discovery to manufacturing and marketing.
notation: 16101010
valid from: 2024-06-07

Biotech
type: BicsLevel4SubIndustry
type: Classifier
type: NamedIndividual
is sub industry of: Biotech & Pharma
is contemporary version of: http://data.ga-group.nl/ics/bics/16101011
is version of: http://data.ga-group.nl/ics/bics/16101011
replaces: http://data.ga-group.nl/ics/bics/2020/16101011
imported on: 2026-06-08T13:40:52.236Z
last refreshed on: 2026-06-08T13:41:38.450Z
source accessed on: 2024-06-05T14:42:36Z
source last accessed on: 2024-06-05T14:42:36Z
label: Biotec @es
label: Biotechn. @de
label: Биотехнологии @ru
label: 生物科技 @zh
label: 생명공학 @ko
label: ﾊﾞｲｵﾃｸﾉﾛｼﾞｰ @ja
definition: This industry subgroup includes companies that specialize in discovering, developing, and patenting novel pharmaceuticals for high-value/high-risk frontier pharmaceutical targets, including immunology and oncology.
notation: 16101011
valid from: 2024-06-07

Specialty Pharma
type: BicsLevel5Segment
type: Classifier
type: NamedIndividual
is level5 segment of: Specialty & Generic Pharma
is contemporary version of: http://data.ga-group.nl/ics/bics/1610101210
is version of: http://data.ga-group.nl/ics/bics/1610101210
replaces: http://data.ga-group.nl/ics/bics/2020/1610101210
imported on: 2026-06-08T13:40:52.236Z
last refreshed on: 2026-06-08T13:41:38.450Z
source accessed on: 2024-06-05T14:42:36Z
source last accessed on: 2024-06-05T14:42:36Z
label: Fármacos especiales @es
label: Farma specializzata @it
label: Farmac especializ @pt
label: Prod pharma spécialisés @fr
label: Spezielle Pharma. @de
label: Специальная фармацевтика @ru
label: 特殊医薬品 @ja
label: 特殊药品 @zh
label: 特殊製藥 @zh-hant
label: 전문 제약업체 @ko
definition: This segment includes companies that specialize in developing, manufacturing and marketing pharmaceuticals. Includes veterinary medicine.
notation: 1610101210
valid from: 2024-06-07

Generic Pharma
type: BicsLevel5Segment
type: Classifier
type: NamedIndividual
is level5 segment of: Specialty & Generic Pharma
is contemporary version of: http://data.ga-group.nl/ics/bics/1610101211
is version of: http://data.ga-group.nl/ics/bics/1610101211
replaces: http://data.ga-group.nl/ics/bics/2020/1610101211
imported on: 2026-06-08T13:40:52.236Z
last refreshed on: 2026-06-08T13:41:38.450Z
source accessed on: 2024-06-05T14:42:36Z
source last accessed on: 2024-06-05T14:42:36Z
label: Fármaco genérico @es
label: Farma generici @it
label: Generische Pharma @de
label: Prod farmac genér @pt
label: Prod pharma génériques @fr
label: Типовые фармац. продукты @ru
label: 仿制药 @zh
label: 學名藥品 @zh-hant
label: 제네릭 제약업 @ko
label: ｼﾞｪﾈﾘｯｸ医薬品 @ja
definition: This segment includes companies that specialize in manufacturing generic pharmaceuticals and their active ingredients. These companies manufacture off-patent drugs, which require minimal or no R&D or marketing.
notation: 1610101211
valid from: 2024-06-07

Specialty & Generic Pharma
type: BicsLevel4SubIndustry
type: Classifier
type: NamedIndividual
is sub industry of: Biotech & Pharma
is contemporary version of: http://data.ga-group.nl/ics/bics/16101012
is version of: http://data.ga-group.nl/ics/bics/16101012
replaces: http://data.ga-group.nl/ics/bics/2020/16101012
imported on: 2026-06-08T13:40:52.236Z
last refreshed on: 2026-06-08T13:41:38.450Z
source accessed on: 2024-06-05T14:42:36Z
source last accessed on: 2024-06-05T14:42:36Z
label: Farma especializados e genéricos @pt
label: Farmaceutici specializzati e generici @it
label: Pharma - Spécialité/Génériques @fr
label: Prods farmacéuticos genéricos y especializados @es
label: Spezial- & generische Pharmaka @de
label: Спец. и типов. фарм. комп. @ru
label: 特殊･ｼﾞｪﾈﾘｯｸ医薬品 @ja
label: 特种药和仿制药 @zh
label: 製藥 @zh-hant
label: 전문 및 제네릭 제약 @ko
label: ���殊･ｼﾞｪﾈﾘｯｸ医薬品 @ja
definition: This industry subgroup includes companies that specialize in the manufacturing and marketing of pharmaceuticals.
notation: 16101012
valid from: 2024-06-07

Biotech & Pharma
type: BicsLevel3Industry
type: Classifier
type: NamedIndividual
is industry of: Health Care
is contemporary version of: http://data.ga-group.nl/ics/bics/161010
is version of: http://data.ga-group.nl/ics/bics/161010
replaces: http://data.ga-group.nl/ics/bics/2020/161010
imported on: 2026-06-08T13:40:52.236Z
last refreshed on: 2026-06-08T13:41:38.450Z
source accessed on: 2024-06-05T14:42:36Z
source last accessed on: 2024-06-05T14:42:36Z
label: Biotec y farmacéuticos @es
label: Biotech et pharma @fr
label: Biotech und Pharma @de
label: Biotecologia e farmácia @pt
label: Farmaci e biotech @it
label: Биотех. и фармацевт. @ru
label: 生技及製藥 @zh-hant
label: 生物科技和制药 @zh
label: 생명공학 및 제약 @ko
label: ﾊﾞｲｵﾃｸ･医薬品 @ja
definition: This industry includes companies that research, develop and manufacture pharmaceutical drugs used to cure or treat diseases.
notation: 161010
valid from: 2024-06-07

Hospitals
type: BicsLevel5Segment
type: Classifier
type: NamedIndividual
is level5 segment of: Health Care Facilities
is contemporary version of: http://data.ga-group.nl/ics/bics/1610111010
is version of: http://data.ga-group.nl/ics/bics/1610111010
replaces: http://data.ga-group.nl/ics/bics/2020/1610111010
imported on: 2026-06-08T13:40:52.236Z
last refreshed on: 2026-06-08T13:41:38.450Z
source accessed on: 2024-06-05T14:42:36Z
source last accessed on: 2024-06-05T14:42:36Z
label: Hôpitaux @fr
label: Hospitais @pt
label: Hospitales @es
label: Kliniken @de
label: Ospedali @it
label: Больницы @ru
label: 医院 @zh
label: 病院 @ja
label: 醫院 @zh-hant
label: 병원 @ko
definition: This segment includes medical facilities that provide short and long term medical and diagnostic testing and treatments.
notation: 1610111010
valid from: 2024-06-07

Continuing Care
type: BicsLevel6Segment
type: Classifier
type: NamedIndividual
is level6 segment of: Nursing & Residential Care
is contemporary version of: http://data.ga-group.nl/ics/bics/161011101110
is version of: http://data.ga-group.nl/ics/bics/161011101110
replaces: http://data.ga-group.nl/ics/bics/2020/161011101110
imported on: 2026-06-08T13:40:52.236Z
last refreshed on: 2026-06-08T13:41:38.450Z
source accessed on: 2024-06-05T14:42:36Z
source last accessed on: 2024-06-05T14:42:36Z
label: Cuidado intensivo @es
label: Cuidados intensivos @pt
label: Cura continua @it
label: Fortwährende Fürsorge @de
label: Soins pour personnes âgées @fr
label: Длительный уход @ru
label: 敬老医疗服务 @zh
label: 継続看護 @ja
label: 長期照護 @zh-hant
label: 지속적은퇴관리 @ko
definition: This segment includes companies that operate a type of a retirement community where the needs of aging care, from independent living to skilled nursing, are met in one place. Excludes in-home elderly care services (see Home Health Care Services).
notation: 161011101110
valid from: 2024-06-07

LTAC & Skilled Nursing
type: BicsLevel6Segment
type: Classifier
type: NamedIndividual
is level6 segment of: Nursing & Residential Care
is contemporary version of: http://data.ga-group.nl/ics/bics/161011101111
is version of: http://data.ga-group.nl/ics/bics/161011101111
replaces: http://data.ga-group.nl/ics/bics/2020/161011101111
imported on: 2026-06-08T13:40:52.236Z
last refreshed on: 2026-06-08T13:41:38.450Z
source accessed on: 2024-06-05T14:42:36Z
source last accessed on: 2024-06-05T14:42:36Z
label: LTAC e enfermagem especializada @pt
label: LTAC e serv inferm qualificati @it
label: LTAC und ausgebildete Krankenpflege @de
label: LTAC y enfermeras especializadas @es
label: LTAC与专业护理 @zh
label: Nursing spécialisé et LTAC @fr
label: Д/с интенс. терапия и высококвалиф. уход @ru
label: 長期急性期医療･看護施設 @ja
label: 長期急性醫療及技術性護理 @zh-hant
label: 장기 급성환자치료 및 전문 간호 @ko
definition: This segment includes companies that provide skilled nursing and long-term care services to patients. This is a place of residence for people who require constant nursing care and have significant challenges with activities of daily living.
notation: 161011101111
valid from: 2024-06-07

Nursing & Residential Care
type: BicsLevel5Segment
type: Classifier
type: NamedIndividual
is level5 segment of: Health Care Facilities
is contemporary version of: http://data.ga-group.nl/ics/bics/1610111011
is version of: http://data.ga-group.nl/ics/bics/1610111011
replaces: http://data.ga-group.nl/ics/bics/2020/1610111011
imported on: 2026-06-08T13:40:52.236Z
last refreshed on: 2026-06-08T13:41:38.450Z
source accessed on: 2024-06-05T14:42:36Z
source last accessed on: 2024-06-05T14:42:36Z
label: Case di cura residenziali @it
label: Cuidado de enfermeras y asilos @es
label: Cuidados enfermagem e residenciais @pt
label: Pflege- & Heimbetreuung @de
label: Soins infirmiers et résidentiels @fr
label: Медицинский уход и попечение @ru
label: 护理及家庭看护 @zh
label: 護理及居家看護 @zh-hant
label: 長期医療系施設･居住施設 @ja
label: 간호 & 거주 요양 @ko
definition: This segment includes companies that provide nursing and residential care facilities. Includes nursing care facilities, continuing care retirement communities, homes for the elderly and homes for the mentally handicapped.
notation: 1610111011
valid from: 2024-06-07

Psych & Substance Abuse Hosp
type: BicsLevel5Segment
type: Classifier
type: NamedIndividual
is level5 segment of: Health Care Facilities
is contemporary version of: http://data.ga-group.nl/ics/bics/1610111012
is version of: http://data.ga-group.nl/ics/bics/1610111012
replaces: http://data.ga-group.nl/ics/bics/2020/1610111012
imported on: 2026-06-08T13:40:52.236Z
last refreshed on: 2026-06-08T13:41:38.450Z
source accessed on: 2024-06-05T14:42:36Z
source last accessed on: 2024-06-05T14:42:36Z
label: Hôpit psychia/désintox @fr
label: Hosp psiq e clinícas de reabilitação @pt
label: Hospitales psiquiátricos y para la drogadicción @es
label: Osp psi e tossicodipendenza @it
label: Psych. Kliniken & Suchtzentren @de
label: Психиатр. и нарколог. больницы @ru
label: 精神病院与戒瘾院 @zh
label: 精神病院及勒戒醫院 @zh-hant
label: 精神科･薬物専門病院 @ja
label: 정신과 & 약물남용 병원 @ko
definition: This segment includes hospitals that provide psychiatric and substance abuse services to patients.
notation: 1610111012
valid from: 2024-06-07

Kidney Dialysis Centers
type: BicsLevel6Segment
type: Classifier
type: NamedIndividual
is level6 segment of: Specialty Facilities
is contemporary version of: http://data.ga-group.nl/ics/bics/161011101310
is version of: http://data.ga-group.nl/ics/bics/161011101310
replaces: http://data.ga-group.nl/ics/bics/2020/161011101310
imported on: 2026-06-08T13:40:52.236Z
last refreshed on: 2026-06-08T13:41:38.450Z
source accessed on: 2024-06-05T14:42:36Z
source last accessed on: 2024-06-05T14:42:36Z
label: Centre de dialyse rénale @fr
label: Centri per la dialisi @it
label: Centros de diálise @pt
label: Centros de diálisis @es
label: Dialysezentren @de
label: Центры диализного лечения почек @ru
label: 肾脏透析中心 @zh
label: 腎臓透析ｾﾝﾀｰ @ja
label: 腎透析中心 @zh-hant
label: 신장투석 센터 @ko
definition: This segment includes companies that provide outpatient kidney or renal dialysis services.
notation: 161011101310
valid from: 2024-06-07

Outpatient Care Centers
type: BicsLevel6Segment
type: Classifier
type: NamedIndividual
is level6 segment of: Specialty Facilities
is contemporary version of: http://data.ga-group.nl/ics/bics/161011101311
is version of: http://data.ga-group.nl/ics/bics/161011101311
replaces: http://data.ga-group.nl/ics/bics/2020/161011101311
imported on: 2026-06-08T13:40:52.236Z
last refreshed on: 2026-06-08T13:41:38.450Z
source accessed on: 2024-06-05T14:42:36Z
source last accessed on: 2024-06-05T14:42:36Z
label: Ambulante Pflegezentren @de
label: Centres de soins ambulatoires @fr
label: Centri ambulatori @it
label: Centros de cuidados ambulatoriais @pt
label: Centros de no hospitalizados @es
label: Центры амбулаторного лечения @ru
label: 外来患者診療施設 @ja
label: 門診醫療中心 @zh-hant
label: 门诊服务中心 @zh
label: 외래환자 진료센터 @ko
definition: This segment includes companies that provide general or specialized outpatient care services, such as pain therapy centers, sleep disorder centers, and biofeedback centers.
notation: 161011101311
valid from: 2024-06-07

Rehabilitation Centers
type: BicsLevel6Segment
type: Classifier
type: NamedIndividual
is level6 segment of: Specialty Facilities
is contemporary version of: http://data.ga-group.nl/ics/bics/161011101312
is version of: http://data.ga-group.nl/ics/bics/161011101312
replaces: http://data.ga-group.nl/ics/bics/2020/161011101312
imported on: 2026-06-08T13:40:52.236Z
last refreshed on: 2026-06-08T13:41:38.450Z
source accessed on: 2024-06-05T14:42:36Z
source last accessed on: 2024-06-05T14:42:36Z
label: Centres de réadaptation @fr
label: Centri riabilitazione @it
label: Centros de reabilitação @pt
label: Centros de rehabilitación @es
label: Reha-Kliniken @de
label: Реабилитационные центры @ru
label: 康复中心 @zh
label: 復健中心 @zh-hant
label: 재활센터 @ko
label: ﾘﾊﾋﾞﾘｾﾝﾀｰ @ja
definition: This segment includes companies that provide specialty mental and physical rehabilitation services.
notation: 161011101312
valid from: 2024-06-07

Surgical & Emergency Centers
type: BicsLevel6Segment
type: Classifier
type: NamedIndividual
is level6 segment of: Specialty Facilities
is contemporary version of: http://data.ga-group.nl/ics/bics/161011101313
is version of: http://data.ga-group.nl/ics/bics/161011101313
replaces: http://data.ga-group.nl/ics/bics/2020/161011101313
imported on: 2026-06-08T13:40:52.236Z
last refreshed on: 2026-06-08T13:41:38.450Z
source accessed on: 2024-06-05T14:42:36Z
source last accessed on: 2024-06-05T14:42:36Z
label: Centre urgence chirurgical mob @fr
label: Centros de emergência e cirúrgicos @pt
label: Centros quirúrgicos y de emerg @es
label: Chirurgie- & Notfallzentren @de
label: Pronto soccorso ambulatorio @it
label: Хирургич. и экстренная помощь @ru
label: 手术与急诊中心 @zh
label: 独立系救急外科病院 @ja
label: 獨立流動外科及急診中心 @zh-hant
label: 수술응급의료센터 @ko
definition: This segment includes companies that provide emergency care and surgery services on an outpatient basis.
notation: 161011101313
valid from: 2024-06-07

Specialty Facilities
type: BicsLevel5Segment
type: Classifier
type: NamedIndividual
is level5 segment of: Health Care Facilities
is contemporary version of: http://data.ga-group.nl/ics/bics/1610111013
is version of: http://data.ga-group.nl/ics/bics/1610111013
replaces: http://data.ga-group.nl/ics/bics/2020/1610111013
imported on: 2026-06-08T13:40:52.236Z
last refreshed on: 2026-06-08T13:41:38.450Z
source accessed on: 2024-06-05T14:42:36Z
source last accessed on: 2024-06-05T14:42:36Z
label: Aménagements spécialisés @fr
label: Instalações especializadas @pt
label: Instalaciones especializadas @es
label: Sonderfazilitäten @de
label: Strutture specialistiche @it
label: Специализированные помещения @ru
label: 专业设施 @zh
label: 專門設施 @zh-hant
label: 特殊施設 @ja
label: 전문시설 @ko
definition: This segment includes facilities that provide diagnostic and medical treatment to patients with a specific type of disease.
notation: 1610111013
valid from: 2024-06-07

Health Care Facilities
type: BicsLevel4SubIndustry
type: Classifier
type: NamedIndividual
is sub industry of: Health Care Facilities & Svcs
is contemporary version of: http://data.ga-group.nl/ics/bics/16101110
is version of: http://data.ga-group.nl/ics/bics/16101110
replaces: http://data.ga-group.nl/ics/bics/2020/16101110
imported on: 2026-06-08T13:40:52.236Z
last refreshed on: 2026-06-08T13:41:38.450Z
source accessed on: 2024-06-05T14:42:36Z
source last accessed on: 2024-06-05T14:42:36Z
label: GesundWesen: Einrichtungen @de
label: Infrastruct médicales @fr
label: Instal cuid saúde @pt
label: Instal sanidad @es
label: Strutture sanitarie @it
label: Медиц. учреждения @ru
label: 卫生保健设施 @zh
label: 醫療保健設施 @zh-hant
label: 헬스케어 시설 @ko
label: ﾍﾙｽｹｱ施設 @ja
definition: This industry subgroup includes health care facilities that provide general medical treatment and surgery, psychiatric and substance abuse treatment, nursing homes, and specialty services to patients with a variety of medical conditions.
notation: 16101110
valid from: 2024-06-07

Contract Research
type: BicsLevel5Segment
type: Classifier
type: NamedIndividual
is level5 segment of: Health Care Services
is contemporary version of: http://data.ga-group.nl/ics/bics/1610111110
is version of: http://data.ga-group.nl/ics/bics/1610111110
replaces: http://data.ga-group.nl/ics/bics/2020/1610111110
imported on: 2026-06-08T13:40:52.236Z
last refreshed on: 2026-06-08T13:41:38.450Z
source accessed on: 2024-06-05T14:42:36Z
source last accessed on: 2024-06-05T14:42:36Z
label: Contratto di ricerca @it
label: Estudios de contratos @es
label: Pesquisa por contrato @pt
label: Recherche sous contrat @fr
label: Vertragliche Research @de
label: Контрактные исследования @ru
label: 受託研究 @ja
label: 合同研究 @zh
label: 合約研究 @zh-hant
label: 위탁 리서치 @ko
definition: This segment includes service organizations that support the pharmaceutical and biotechnology industries by providing outsourced pharmaceutical research and manufacturing services.
notation: 1610111110
valid from: 2024-06-07

Clinical Labs
type: BicsLevel6Segment
type: Classifier
type: NamedIndividual
is level6 segment of: Health Care Testing Services
is contemporary version of: http://data.ga-group.nl/ics/bics/161011111110
is version of: http://data.ga-group.nl/ics/bics/161011111110
replaces: http://data.ga-group.nl/ics/bics/2020/161011111110
imported on: 2026-06-08T13:40:52.236Z
last refreshed on: 2026-06-08T13:41:38.450Z
source accessed on: 2024-06-05T14:42:36Z
source last accessed on: 2024-06-05T14:42:36Z
label: Klinische Labore @de
label: Laboratoires clinique @fr
label: Laboratori clinici @it
label: Laboratorios clínicos @es
label: Labs clínicos @pt
label: Клинические лаборатории @ru
label: 临床实验室 @zh
label: 臨床實驗室 @zh-hant
label: 臨床検査室 @ja
label: 임상 실험실 @ko
definition: This segment includes medical laboratories that provide analytical or diagnostic services to a medical professional or to the patient on referral from a health care practitioner.
notation: 161011111110
valid from: 2024-06-07

Radiology & Diagnostic Imaging
type: BicsLevel6Segment
type: Classifier
type: NamedIndividual
is level6 segment of: Health Care Testing Services
is contemporary version of: http://data.ga-group.nl/ics/bics/161011111111
is version of: http://data.ga-group.nl/ics/bics/161011111111
replaces: http://data.ga-group.nl/ics/bics/2020/161011111111
imported on: 2026-06-08T13:40:52.236Z
last refreshed on: 2026-06-08T13:41:38.450Z
source accessed on: 2024-06-05T14:42:36Z
source last accessed on: 2024-06-05T14:42:36Z
label: Radiología y placas de diagnóstico @es
label: Radiologia e diagnóstico por imagem @pt
label: Radiologia e diagnostica immagini @it
label: Radiologie & diagnostische Bildgebung @de
label: Radiologie et imagerie diagnostique @fr
label: Радиолог. и диагност. визуализация @ru
label: 放射与影像诊断 @zh
label: 放射科及診斷影像 @zh-hant
label: 放射線･画像診断 @ja
label: 방사선학 & 진단영상 @ko
definition: This segment includes companies that provide diagnostic imaging services that produce images of a patient on referral from a health care practitioner. Includes CAT scans, x-rays, mammograms, magnetic resonance imaging (MRIs), and ultrasound images.
notation: 161011111111
valid from: 2024-06-07

Health Care Testing Services
type: BicsLevel5Segment
type: Classifier
type: NamedIndividual
is level5 segment of: Health Care Services
is contemporary version of: http://data.ga-group.nl/ics/bics/1610111111
is version of: http://data.ga-group.nl/ics/bics/1610111111
replaces: http://data.ga-group.nl/ics/bics/2020/1610111111
imported on: 2026-06-08T13:40:52.236Z
last refreshed on: 2026-06-08T13:41:38.450Z
source accessed on: 2024-06-05T14:42:36Z
source last accessed on: 2024-06-05T14:42:36Z
label: Serviços de teste de saúde @pt
label: Services de tests médicaux @fr
label: Servicios de exámenes médicos @es
label: Servizi di test sanitari @it
label: Untersuchungsdienste im Gesundheitswesen @de
label: Услуги медицинского тестирования @ru
label: Услуги медиц��нского тестирования @ru
label: 医疗检测服务 @zh
label: 医疗��测服务 @zh
label: 醫療保健檢測服務 @zh-hant
label: 헬스케어 검진 서비스 @ko
label: ﾍﾙｽｹｱ試験ｻｰﾋﾞｽ @ja
definition: This segment includes companies that provide health care testing services, such as medical laboratories, diagnostic imaging centers, clinical trial services, and biotechnology research and development services.
notation: 1610111111
valid from: 2024-06-07

Ambulance Services
type: BicsLevel6Segment
type: Classifier
type: NamedIndividual
is level6 segment of: Outpatient Health Services
is contemporary version of: http://data.ga-group.nl/ics/bics/161011111210
is version of: http://data.ga-group.nl/ics/bics/161011111210
replaces: http://data.ga-group.nl/ics/bics/2020/161011111210
imported on: 2026-06-08T13:40:52.236Z
last refreshed on: 2026-06-08T13:41:38.450Z
source accessed on: 2024-06-05T14:42:36Z
source last accessed on: 2024-06-05T14:42:36Z
label: Ambulante Dienste @de
label: Serviços de ambulância @pt
label: Services d'ambulance @fr
label: Servicios de ambulancia @es
label: Servizi di ambulanza @it
label: Услуги скорой помощи @ru
label: 救急車ｻｰﾋﾞｽ @ja
label: 救护车服务 @zh
label: 救護車服務 @zh-hant
label: 구급차 서비스 @ko
definition: This segment includes companies that provide patient transportation services by ground or air with medical care.
notation: 161011111210
valid from: 2024-06-07

Home Health Care Services
type: BicsLevel6Segment
type: Classifier
type: NamedIndividual
is level6 segment of: Outpatient Health Services
is contemporary version of: http://data.ga-group.nl/ics/bics/161011111211
is version of: http://data.ga-group.nl/ics/bics/161011111211
replaces: http://data.ga-group.nl/ics/bics/2020/161011111211
imported on: 2026-06-08T13:40:52.236Z
last refreshed on: 2026-06-08T13:41:38.450Z
source accessed on: 2024-06-05T14:42:36Z
source last accessed on: 2024-06-05T14:42:36Z
label: Hauskrankenpflegedienste @de
label: Serviços de cuidados de saúde em casa @pt
label: Services soins de santé à domicile @fr
label: Servicios de sanidad a domicilio @es
label: Servizi sanitari domiciliari @it
label: Услуги медицинской помощи на дому @ru
label: 在宅介護ｻｰﾋﾞｽ @ja
label: 家庭保健服务 @zh
label: 家庭保健服務 @zh-hant
label: 가정 헬스케어 서비스 @ko
definition: This segment includes companies that provide skilled nursing services in the home. Includes visiting nurse and home nursing services.
notation: 161011111211
valid from: 2024-06-07

Outpatient Health Services
type: BicsLevel5Segment
type: Classifier
type: NamedIndividual
is level5 segment of: Health Care Services
is contemporary version of: http://data.ga-group.nl/ics/bics/1610111112
is version of: http://data.ga-group.nl/ics/bics/1610111112
replaces: http://data.ga-group.nl/ics/bics/2020/1610111112
imported on: 2026-06-08T13:40:52.236Z
last refreshed on: 2026-06-08T13:41:38.450Z
source accessed on: 2024-06-05T14:42:36Z
source last accessed on: 2024-06-05T14:42:36Z
label: Ambulante Dienste im Gesundheitswesen @de
label: Serviços saúde ambulatorial @pt
label: Services de santé ambulatoires @fr
label: Servicios de no hospitalizados @es
label: Servizi ambulatori @it
label: Амбулаторные медицинские услуги @ru
label: 外来患者診療ｻｰﾋﾞｽ @ja
label: 門診保健服務 @zh-hant
label: 门诊医疗服务 @zh
label: 외래환자 건강 서비스 @ko
definition: This segment includes companies that provide outpatient health care services. Such services are provided by various practitioners such as doctors and dentists, in outpatient health care facilities, and by outpatient home nursing services.
notation: 1610111112
valid from: 2024-06-07

Veterinary Services
type: BicsLevel5Segment
type: Classifier
type: NamedIndividual
is level5 segment of: Health Care Services
is contemporary version of: http://data.ga-group.nl/ics/bics/1610111113
is version of: http://data.ga-group.nl/ics/bics/1610111113
replaces: http://data.ga-group.nl/ics/bics/2020/1610111113
imported on: 2026-06-08T13:40:52.236Z
last refreshed on: 2026-06-08T13:41:38.450Z
source accessed on: 2024-06-05T14:42:36Z
source last accessed on: 2024-06-05T14:42:36Z
label: Serv veterinarios @es
label: Serviços veterinários @pt
label: Servizi veterinari @it
label: Srv vétérinaires @fr
label: Tierarzt @de
label: Ветеринарные услуги @ru
label: 兽医服务 @zh
label: 獣医ｻｰﾋﾞｽ @ja
label: 獸醫服務 @zh-hant
label: 수의 서비스 @ko
definition: This segment includes companies that provide veterinary services.
notation: 1610111113
valid from: 2024-06-07

Health Care Services
type: BicsLevel4SubIndustry
type: Classifier
type: NamedIndividual
is sub industry of: Health Care Facilities & Svcs
is contemporary version of: http://data.ga-group.nl/ics/bics/16101111
is version of: http://data.ga-group.nl/ics/bics/16101111
replaces: http://data.ga-group.nl/ics/bics/2020/16101111
imported on: 2026-06-08T13:40:52.236Z
last refreshed on: 2026-06-08T13:41:38.450Z
source accessed on: 2024-06-05T14:42:36Z
source last accessed on: 2024-06-05T14:42:36Z
label: GesundWesen: Dienste @de
label: Serv cuidad saúde @pt
label: Services de santé @fr
label: Servizi sanitari @it
label: Servs de sanidad @es
label: Услуги здравоохран. @ru
label: 医疗保健服务 @zh
label: 醫療保健服務 @zh-hant
label: 헬스케어 서비스 @ko
label: ﾍﾙｽｹｱｻｰﾋﾞｽ @ja
definition: This industry subgroup includes companies that provide standalone health care services or ancillary related health care services.
notation: 16101111
valid from: 2024-06-07

Medical Equip Distribution
type: BicsLevel6Segment
type: Classifier
type: NamedIndividual
is level6 segment of: Health Care Distribution
is contemporary version of: http://data.ga-group.nl/ics/bics/161011121010
is version of: http://data.ga-group.nl/ics/bics/161011121010
replaces: http://data.ga-group.nl/ics/bics/2020/161011121010
imported on: 2026-06-08T13:40:52.236Z
last refreshed on: 2026-06-08T13:41:38.450Z
source accessed on: 2024-06-05T14:42:36Z
source last accessed on: 2024-06-05T14:42:36Z
label: Distrib matériel médical @fr
label: Distribución de equipo médico @es
label: Distribuição equip médicos @pt
label: Distribuzione app mediche @it
label: Vertrieb med. Ausrüstung @de
label: Распростр. мед. оборуд. @ru
label: 医疗设备分销 @zh
label: 医療機器販売 @ja
label: 醫療設備經銷 @zh-hant
label: 의료기기 유통 @ko
definition: This segment includes companies that wholesale and distribute professional medical equipment, instruments, and supplies. Includes surgical appliances, hospital beds, dentist equipment, laboratory equipment, hospital furniture, and wheelchairs.
notation: 161011121010
valid from: 2024-06-07

Medical Supplies Distribution
type: BicsLevel6Segment
type: Classifier
type: NamedIndividual
is level6 segment of: Health Care Distribution
is contemporary version of: http://data.ga-group.nl/ics/bics/161011121011
is version of: http://data.ga-group.nl/ics/bics/161011121011
replaces: http://data.ga-group.nl/ics/bics/2020/161011121011
imported on: 2026-06-08T13:40:52.236Z
last refreshed on: 2026-06-08T13:41:38.450Z
source accessed on: 2024-06-05T14:42:36Z
source last accessed on: 2024-06-05T14:42:36Z
label: Distrib fournitures médicales @fr
label: Distribución de prov médicas @es
label: Distribuição de suprimentos médicos @pt
label: Distribuz forniture mediche @it
label: Vertrieb medizin. Produkte @de
label: Распред. мед. препаратов @ru
label: 医疗用品分销 @zh
label: 医療用品販売 @ja
label: 医療用��販売 @ja
label: 醫療器材經銷 @zh-hant
label: 의료용품 유통 @ko
definition: This segment includes companies that wholesale and distribute medical supplies to health care providers.
notation: 161011121011
valid from: 2024-06-07

Pharmaceutical Distribution
type: BicsLevel7Segment
type: Classifier
type: NamedIndividual
is level7 segment of: Pharma & Specialty Distribution
is contemporary version of: http://data.ga-group.nl/ics/bics/16101112101210
is version of: http://data.ga-group.nl/ics/bics/16101112101210
replaces: http://data.ga-group.nl/ics/bics/2020/16101112101210
imported on: 2026-06-08T13:40:52.236Z
last refreshed on: 2026-06-08T13:41:38.450Z
source accessed on: 2024-06-05T14:42:36Z
source last accessed on: 2024-06-05T14:42:36Z
label: Distribución farmacéutica @es
label: Distribuição de farmacêuticos @pt
label: Distribution pharma @fr
label: Distribuzione farmaci @it
label: Pharmazievertrieb @de
label: Распространение фармацев. товаров @ru
label: 制药配送 @zh
label: 医療品販売 @ja
label: 藥物經銷 @zh-hant
label: 제약 유통 @ko
definition: This segment includes companies that wholesale and distribute pharmaceutical drugs.
notation: 16101112101210
valid from: 2024-06-07

Specialty Distribution
type: BicsLevel7Segment
type: Classifier
type: NamedIndividual
is level7 segment of: Pharma & Specialty Distribution
is contemporary version of: http://data.ga-group.nl/ics/bics/16101112101211
is version of: http://data.ga-group.nl/ics/bics/16101112101211
replaces: http://data.ga-group.nl/ics/bics/2020/16101112101211
imported on: 2026-06-08T13:40:52.236Z
last refreshed on: 2026-06-08T13:41:38.450Z
source accessed on: 2024-06-05T14:42:36Z
source last accessed on: 2024-06-05T14:42:36Z
label: Distribución especializada @es
label: Distribuição de especialidade @pt
label: Distribution spécialisée @fr
label: Distribuzione speciale @it
label: Sondervertrieb @de
label: Распространение специализ. товаров @ru
label: 專門品經銷 @zh-hant
label: 特殊品販売 @ja
label: 特殊药品配送 @zh
label: 전문 유통 @ko
definition: This segment includes companies that wholesale and distribute biological and medical products, herbs, and botanical drugs.
notation: 16101112101211
valid from: 2024-06-07

Pharma & Specialty Distribution
type: BicsLevel6Segment
type: Classifier
type: NamedIndividual
is level6 segment of: Health Care Distribution
is contemporary version of: http://data.ga-group.nl/ics/bics/161011121012
is version of: http://data.ga-group.nl/ics/bics/161011121012
replaces: http://data.ga-group.nl/ics/bics/2020/161011121012
imported on: 2026-06-08T13:40:52.236Z
last refreshed on: 2026-06-08T13:41:38.450Z
source accessed on: 2024-06-05T14:42:36Z
source last accessed on: 2024-06-05T14:42:36Z
label: Distrib prod pharma/spécialisés @fr
label: Distribución de medicinas y especializada @es
label: Distribuição de produtos farmacêuticos e especializados @pt
label: Distribuzione speciale e farmaci @it
label: Vertrieb Pharma/Spezial @de
label: Распр. фармац./спец. товаров @ru
label: 制药与特殊药品分销 @zh
label: 医薬品･特殊医薬品販売 @ja
label: 製藥/專門品經銷 @zh-hant
label: 제약 및 전문 유통 @ko
definition: This segment includes companies that wholesale and distribute pharmaceutical drugs, biological and medical products, herbs, and botanical drugs.
notation: 161011121012
valid from: 2024-06-07

Health Care Distribution
type: BicsLevel5Segment
type: Classifier
type: NamedIndividual
is level5 segment of: Health Care Supply Chain
is contemporary version of: http://data.ga-group.nl/ics/bics/1610111210
is version of: http://data.ga-group.nl/ics/bics/1610111210
replaces: http://data.ga-group.nl/ics/bics/2020/1610111210
imported on: 2026-06-08T13:40:52.236Z
last refreshed on: 2026-06-08T13:41:38.450Z
source accessed on: 2024-06-05T14:42:36Z
source last accessed on: 2024-06-05T14:42:36Z
label: Distrib de cuidados com a saúde @pt
label: Distribución de sanidad @es
label: Distribution de soins de santé @fr
label: Distribuzione sanitaria @it
label: Vertrieb im Gesundheitswesen @de
label: Распространение товаров здравоохранения @ru
label: 保健分布 @zh
label: 醫療保健經銷 @zh-hant
label: 헬스케어 유통 @ko
label: ﾍﾙｽｹｱ用品販売 @ja
definition: This segment includes companies that wholesale and distribute health care products to providers, retail outlets, or end consumers.
notation: 1610111210
valid from: 2024-06-07

Pharmacy Benefits Mgmt (PBM)
type: BicsLevel5Segment
type: Classifier
type: NamedIndividual
is level5 segment of: Health Care Supply Chain
is contemporary version of: http://data.ga-group.nl/ics/bics/1610111211
is version of: http://data.ga-group.nl/ics/bics/1610111211
replaces: http://data.ga-group.nl/ics/bics/2020/1610111211
imported on: 2026-06-08T13:40:52.236Z
last refreshed on: 2026-06-08T13:41:38.450Z
source accessed on: 2024-06-05T14:42:36Z
source last accessed on: 2024-06-05T14:42:36Z
label: Gestão de Benefícios de Medicamentos (PBM) @pt
label: Gestión de beneficios de farmacia (PBM) @es
label: PBM @de
label: Страховка рецептов на лекарственные препараты @ru
label: 薬剤給付管理(PBM) @ja
definition: This segment includes companies that provide pharmacy benefit management (PBM) services. Includes prescription drug benefit programs, retail network pharmacy management, retail drug card programs, home delivery pharmacy services, benefit design consultation, drug utilization review, and claims processing.
notation: 1610111211
valid from: 2024-06-07

Health Care Supply Chain
type: BicsLevel4SubIndustry
type: Classifier
type: NamedIndividual
is sub industry of: Health Care Facilities & Svcs
is contemporary version of: http://data.ga-group.nl/ics/bics/16101112
is version of: http://data.ga-group.nl/ics/bics/16101112
replaces: http://data.ga-group.nl/ics/bics/2020/16101112
imported on: 2026-06-08T13:40:52.236Z
last refreshed on: 2026-06-08T13:41:38.450Z
source accessed on: 2024-06-05T14:42:36Z
source last accessed on: 2024-06-05T14:42:36Z
label: Cadeia fornec cuid à saúde @pt
label: Cadena sum sanidad @es
label: Chaîne logistique santé @fr
label: GesundWesen: Lieferkette @de
label: Sanità catena di fornitura @it
label: Система снабжения здравоохран. @ru
label: 医疗供应链 @zh
label: 醫療保健供應鏈 @zh-hant
label: 헬스케어 공급망 @ko
label: ﾍﾙｽｹｱｻﾌﾟﾗｲﾁｪｰﾝ @ja
definition: This industry subgroup includes companies that provide distribution channels for health care products.
notation: 16101112
valid from: 2024-06-07

Managed Care Comml Business
type: BicsLevel5Segment
type: Classifier
type: NamedIndividual
is level5 segment of: Managed Care
is contemporary version of: http://data.ga-group.nl/ics/bics/1610111310
is version of: http://data.ga-group.nl/ics/bics/1610111310
replaces: http://data.ga-group.nl/ics/bics/2020/1610111310
imported on: 2026-06-08T13:40:52.236Z
last refreshed on: 2026-06-08T13:41:38.450Z
source accessed on: 2024-06-05T14:42:36Z
source last accessed on: 2024-06-05T14:42:36Z
label: Imprese comm managed care @it
label: Managed-Care - gewerbl. Tätigk. @de
label: Negócio com de saúde gerenciada @pt
label: Negocio comercial de seguro médico gestionado @es
label: Soins intégrés - Entrep comm @fr
label: Предприним. в сфере управл. мед. обслуж. @ru
label: 管理医療-営利事業 @ja
label: 管理式医疗商业业务 @zh
label: 管理式醫療-商業業務 @zh-hant
label: 관리의료 상업용 사업 @ko
definition: This segment includes companies that provide managed health care services through a health maintenance organization (HMO) structure to commercial clients.
notation: 1610111310
valid from: 2024-06-07

Managed Care Disease Mgmt
type: BicsLevel5Segment
type: Classifier
type: NamedIndividual
is level5 segment of: Managed Care
is contemporary version of: http://data.ga-group.nl/ics/bics/1610111311
is version of: http://data.ga-group.nl/ics/bics/1610111311
replaces: http://data.ga-group.nl/ics/bics/2020/1610111311
imported on: 2026-06-08T13:40:52.236Z
last refreshed on: 2026-06-08T13:41:38.450Z
source accessed on: 2024-06-05T14:42:36Z
source last accessed on: 2024-06-05T14:42:36Z
label: Controle de enfermidades de saúde gerenciada @pt
label: Cure mediche gestione malattie @it
label: Managed-Care Krankheitsleitung @de
label: Seguro médico gestionado de enfermedades @es
label: Soins gérés Gestion des maladies @fr
label: Упр. мед. обслуж.-Управление болезнями @ru
label: 管理医療 疾病管理 @ja
label: 管理式医疗疾病管理 @zh
label: 管理式照護疾病管理 @zh-hant
label: 관리의료 질병관리 @ko
definition: This segment includes companies that provide disease management and wellness program services.
notation: 1610111311
valid from: 2024-06-07

Managed Care Medicaid (XIX)
type: BicsLevel6Segment
type: Classifier
type: NamedIndividual
is level6 segment of: Managed Care Govt Business
is contemporary version of: http://data.ga-group.nl/ics/bics/161011131210
is version of: http://data.ga-group.nl/ics/bics/161011131210
replaces: http://data.ga-group.nl/ics/bics/2020/161011131210
imported on: 2026-06-08T13:40:52.236Z
last refreshed on: 2026-06-08T13:41:38.450Z
source accessed on: 2024-06-05T14:42:36Z
source last accessed on: 2024-06-05T14:42:36Z
label: Cure mediche Medicaid (Title XIX) @it
label: Managed Care Medicaid (Title XIX) @de
label: Medicaid gestionado (Title XIX) @es
label: Saúde gerenciada Medicaid (Título XIX) @pt
label: Soins intégrés Medicaid (Titre XIX) @fr
label: Упр. мед. обслуживание - Medicare (XIX) @ru
label: 管理医療 ﾒﾃﾞｨｹｲﾄﾞ(XIX) @ja
label: 管理醫療聯邦醫療保險(XIX章) @zh-hant
label: 관리의료 메디케이드(타이틀 XIX) @ko
definition: This segment includes companies that provide managed health care services through a health maintenance organization (HMO) structure to participants in the Medicaid program.
notation: 161011131210
valid from: 2024-06-07

Managed Care Medicare
type: BicsLevel6Segment
type: Classifier
type: NamedIndividual
is level6 segment of: Managed Care Govt Business
is contemporary version of: http://data.ga-group.nl/ics/bics/161011131211
is version of: http://data.ga-group.nl/ics/bics/161011131211
replaces: http://data.ga-group.nl/ics/bics/2020/161011131211
imported on: 2026-06-08T13:40:52.236Z
last refreshed on: 2026-06-08T13:41:38.450Z
source accessed on: 2024-06-05T14:42:36Z
source last accessed on: 2024-06-05T14:42:36Z
label: Cure mediche Medicare @it
label: Managed-Care Medicare @de
label: Medicare @es
label: Saúde gerenciada Medicare @pt
label: Soins gérés Medicare @fr
label: Упр. мед. обслуж.-Medicare @ru
label: 管理医療 ﾒﾃﾞｨｹｱ @ja
label: 管理式医疗医疗保险 @zh
label: 管理式醫療聯邦醫療保險 @zh-hant
label: 관리의료 메디케어 @ko
definition: This segment includes companies that provide managed health care services through a health maintenance organization (HMO) structure to participants in all Medicare programs.
notation: 161011131211
valid from: 2024-06-07

Managed Care Govt Business
type: BicsLevel5Segment
type: Classifier
type: NamedIndividual
is level5 segment of: Managed Care
is contemporary version of: http://data.ga-group.nl/ics/bics/1610111312
is version of: http://data.ga-group.nl/ics/bics/1610111312
replaces: http://data.ga-group.nl/ics/bics/2020/1610111312
imported on: 2026-06-08T13:40:52.236Z
last refreshed on: 2026-06-08T13:41:38.450Z
source accessed on: 2024-06-05T14:42:36Z
source last accessed on: 2024-06-05T14:42:36Z
label: Cure mediche imprese governative @it
label: Managed Care Regierungsgeschäfte @de
label: Negócios do governo saúde gerenciada @pt
label: Paraestatal de sanidad gestionada @es
label: Soins intégrés Affaires gouvernementales @fr
label: Управляемое медицинское обслуживание - Гос. учреждения @ru
label: 管理医療-政府事業 @ja
label: 管理式医疗 政府事务 @zh
label: 管理式醫療-政府業務 @zh-hant
label: 관리의료 정부 사업 @ko
definition: This segment includes companies that provide managed health care services through a health maintenance organization (HMO) structure to participants of government programs.
notation: 1610111312
valid from: 2024-06-07

Managed Care
type: BicsLevel4SubIndustry
type: Classifier
type: NamedIndividual
is sub industry of: Health Care Facilities & Svcs
is contemporary version of: http://data.ga-group.nl/ics/bics/16101113
is version of: http://data.ga-group.nl/ics/bics/16101113
replaces: http://data.ga-group.nl/ics/bics/2020/16101113
imported on: 2026-06-08T13:40:52.236Z
last refreshed on: 2026-06-08T13:41:38.450Z
source accessed on: 2024-06-05T14:42:36Z
source last accessed on: 2024-06-05T14:42:36Z
label: Saúde gerenciada @pt
label: Sanidad gestionada @es
label: Soins intégrés @fr
label: Управл. медицина @ru
label: 管理医療 @ja
label: 管理式医疗 @zh
label: 管理式醫療 @zh-hant
label: 관리의료 @ko
definition: This industry subgroup includes companies that provide managed health care services through a health maintenance organization (HMO).
notation: 16101113
valid from: 2024-06-07

Health Care Facilities & Svcs
type: BicsLevel3Industry
type: Classifier
type: NamedIndividual
is industry of: Health Care
is contemporary version of: http://data.ga-group.nl/ics/bics/161011
is version of: http://data.ga-group.nl/ics/bics/161011
replaces: http://data.ga-group.nl/ics/bics/2020/161011
imported on: 2026-06-08T13:40:52.236Z
last refreshed on: 2026-06-08T13:41:38.450Z
source accessed on: 2024-06-05T14:42:36Z
source last accessed on: 2024-06-05T14:42:36Z
label: Gesundheitseinrichtungen & -dienste @de
label: Instalações e serv cuidados saúde @pt
label: Instalaciones y servicios de sanidad @es
label: Installations et serv soins de santé @fr
label: Serv e strutture sanitarie @it
label: Мед. учреждения/услуги @ru
label: 医疗保健设施与服务 @zh
label: 醫療保健設施/服務 @zh-hant
label: 헬스케어 시설 & 서비스 @ko
label: ﾍﾙｽｹｱ施設･ｻｰﾋﾞｽ @ja
definition: This industry includes companies that provide health care services. These services may be standalone or offered as part of operating a specialized facility.
notation: 161011
valid from: 2024-06-07

Ophthalmic Goods
type: BicsLevel5Segment
type: Classifier
type: NamedIndividual
is level5 segment of: Health Care Supplies
is contemporary version of: http://data.ga-group.nl/ics/bics/1610121010
is version of: http://data.ga-group.nl/ics/bics/1610121010
replaces: http://data.ga-group.nl/ics/bics/2020/1610121010
imported on: 2026-06-08T13:40:52.236Z
last refreshed on: 2026-06-08T13:41:38.450Z
source accessed on: 2024-06-05T14:42:36Z
source last accessed on: 2024-06-05T14:42:36Z
label: Articles ophtalmiques @fr
label: Articoli oftalmici @it
label: Bens oftálmicos @pt
label: Bienes oftálmicos @es
label: Ophthalmische Produkte @de
label: Офтальмологич. продукция @ru
label: 眼科用品 @ja
label: 眼科用產品 @zh-hant
label: 안과용품 @ko
definition: This segment includes companies that manufacture ophthalmic goods, such as eyeglasses, contact lenses, sunglasses, eyeglass frames, and protective eyewear.
notation: 1610121010
valid from: 2024-06-07

Surgical Appliances & Supplies
type: BicsLevel5Segment
type: Classifier
type: NamedIndividual
is level5 segment of: Health Care Supplies
is contemporary version of: http://data.ga-group.nl/ics/bics/1610121011
is version of: http://data.ga-group.nl/ics/bics/1610121011
replaces: http://data.ga-group.nl/ics/bics/2020/1610121011
imported on: 2026-06-08T13:40:52.236Z
last refreshed on: 2026-06-08T13:41:38.450Z
source accessed on: 2024-06-05T14:42:36Z
source last accessed on: 2024-06-05T14:42:36Z
label: Aparatos y provisiones de cirugía @es
label: Aparelhos e materiais cirúrgicos @pt
label: Chirurgische Geräte & Bedarf @de
label: Forniture e apparecchi chirurgici @it
label: Fournitures et appareils chirurgicaux @fr
label: Хирургическая аппаратура и расходные материалы @ru
label: 外科器械与用品 @zh
label: 外科用器具及用品 @zh-hant
label: 外科用機器･外科用品 @ja
label: 수술장비 & 수술용품 @ko
definition: This segment includes companies that manufacture medical supplies used or consumed in surgery, such as bandages, dressings, tape, sutures, and syringes.
notation: 1610121011
valid from: 2024-06-07

Health Care Supplies
type: BicsLevel4SubIndustry
type: Classifier
type: NamedIndividual
is sub industry of: Medical Equipment & Devices
is contemporary version of: http://data.ga-group.nl/ics/bics/16101210
is version of: http://data.ga-group.nl/ics/bics/16101210
replaces: http://data.ga-group.nl/ics/bics/2020/16101210
imported on: 2026-06-08T13:40:52.236Z
last refreshed on: 2026-06-08T13:41:38.450Z
source accessed on: 2024-06-05T14:42:36Z
source last accessed on: 2024-06-05T14:42:36Z
label: Fournitures médicales @fr
label: Gesundheitsbedarf @de
label: Provisiones sanidad @es
label: Provvigioni sanità @it
label: Supr cuidad saúde @pt
label: Медикаменты @ru
label: 保健用品 @zh
label: 醫療保健用品 @zh-hant
label: 건강관리 공급 @ko
label: ﾍﾙｽｹｱ用品 @ja
definition: This industry subgroup includes companies that manufacture surgical appliances, supplies, and ophthalmic goods, such as eyeglasses and contacts lenses.
notation: 16101210
valid from: 2024-06-07

Apparecchiature scienze vita
type: BicsLevel5Segment
type: Classifier
type: NamedIndividual
is level5 segment of: Life Science & Diagnostics
is contemporary version of: http://data.ga-group.nl/ics/bics/1610121110
is version of: http://data.ga-group.nl/ics/bics/1610121110
replaces: http://data.ga-group.nl/ics/bics/2020/1610121110
imported on: 2026-06-08T13:40:52.236Z
last refreshed on: 2026-06-08T13:41:38.450Z
source accessed on: 2024-06-05T14:42:36Z
source last accessed on: 2024-06-05T14:42:36Z
label: Equipamento de ciências da vida @pt
label: Equipo de biología @es
label: Life Science Equipment
label: Matériel pour sc. de la vie @fr
label: Медико-биолог. науки @ru
label: 分析用實驗設備 @zh-hant
label: 生命科学仪器 @zh
label: 生命科学機器 @ja
label: 생명 과학 설비 @ko
definition: This segment includes companies that manufacture analytical laboratory instruments used to analyze the chemical or physical composition of samples of materials.
notation: 1610121110
valid from: 2024-06-07

In Vitro Diagnostics
type: BicsLevel5Segment
type: Classifier
type: NamedIndividual
is level5 segment of: Life Science & Diagnostics
is contemporary version of: http://data.ga-group.nl/ics/bics/1610121111
is version of: http://data.ga-group.nl/ics/bics/1610121111
replaces: http://data.ga-group.nl/ics/bics/2020/1610121111
imported on: 2026-06-08T13:40:52.236Z
last refreshed on: 2026-06-08T13:41:38.450Z
source accessed on: 2024-06-05T14:42:36Z
source last accessed on: 2024-06-05T14:42:36Z
label: Diagnóstico in vitro @es
label: Diagnostica in vitro @it
label: Diagnostiques in vitro @fr
label: In-vitro-Diagnostik @de
label: Диагностика в лабораторных условиях @ru
label: 体外診断装置 @ja
label: 体外诊断 @zh
label: 體外診斷 @zh-hant
label: 체외 진료 @ko
definition: This segment includes companies that manufacture in-vitro (not internal) diagnostic substances. These substances are used for diagnostic tests that are performed in test tubes, petri dishes, and machines.
notation: 1610121111
valid from: 2024-06-07

Life Science & Diagnostics
type: BicsLevel4SubIndustry
type: Classifier
type: NamedIndividual
is sub industry of: Medical Equipment & Devices
is contemporary version of: http://data.ga-group.nl/ics/bics/16101211
is version of: http://data.ga-group.nl/ics/bics/16101211
replaces: http://data.ga-group.nl/ics/bics/2020/16101211
imported on: 2026-06-08T13:40:52.236Z
last refreshed on: 2026-06-08T13:41:38.450Z
source accessed on: 2024-06-05T14:42:36Z
source last accessed on: 2024-06-05T14:42:36Z
label: Biología y diagnóstico @es
label: Ciências da vida e diagnóstico @pt
label: Equipmt Sciences de la vie @fr
label: Life Science & Diagnostik @de
label: Scienze vita e diagnostica @it
label: Биолог. науки - оборуд-е @ru
label: 生命科学和诊断 @zh
label: 生命科学･診断 @ja
label: 生命科學設備 @zh-hant
label: 생명 과학 & 진단 @ko
definition: This industry subgroup includes companies that manufacture in-vitro (not internal) diagnostic substances for use in diagnostic tests and companies that manufacture analytical laboratory instruments.
notation: 16101211
valid from: 2024-06-07

Cardiac Rhythm Management
type: BicsLevel7Segment
type: Classifier
type: NamedIndividual
is level7 segment of: Electrophysiology Devices
is contemporary version of: http://data.ga-group.nl/ics/bics/16101212101010
is version of: http://data.ga-group.nl/ics/bics/16101212101010
replaces: http://data.ga-group.nl/ics/bics/2020/16101212101010
imported on: 2026-06-08T13:40:52.236Z
last refreshed on: 2026-06-08T13:41:38.450Z
source accessed on: 2024-06-05T14:42:36Z
source last accessed on: 2024-06-05T14:42:36Z
label: Contrôle du rythme cardiaque @fr
label: Gerenciamento de ritmo cardíaco @pt
label: Gestión de ritmo cardiaco @es
label: Gestione cardiologia @it
label: Herzrhythmus-Management @de
label: Система мер по управл. част. сердечных сокращений @ru
label: 心律動管理装置 @ja
label: 心律管理 @zh
label: 心律調節管理 @zh-hant
label: 심장박동관리 @ko
definition: This segment includes companies that manufacture cardiac rhythm management products. Includes implantable cardioverter-defibrillators (ICDs), pacemakers, cardiac resynchronization therapy devices (CRT-Ds and CRT-Ps) and implantable cardiac monitors.
notation: 16101212101010
valid from: 2024-06-07

Ventricular Assist Devices
type: BicsLevel7Segment
type: Classifier
type: NamedIndividual
is level7 segment of: Electrophysiology Devices
is contemporary version of: http://data.ga-group.nl/ics/bics/16101212101011
is version of: http://data.ga-group.nl/ics/bics/16101212101011
replaces: http://data.ga-group.nl/ics/bics/2020/16101212101011
imported on: 2026-06-08T13:40:52.236Z
last refreshed on: 2026-06-08T13:41:38.450Z
source accessed on: 2024-06-05T14:42:36Z
source last accessed on: 2024-06-05T14:42:36Z
label: Apparati assist ventricolare @it
label: Appareils de support ventriculaire @fr
label: Dispositivos auxiliar ventricular @pt
label: Dispositivos de asistencia ventricular @es
label: Ventrikulare Hilfsvorrichtungen @de
label: Вспоспомогательные желудочковые системы @ru
label: 心室補助装置 @ja
label: 心室輔助裝置 @zh-hant
label: 心室辅助装置 @zh
label: 심실보조장치 @ko
definition: This segment includes companies that manufacture ventricular assist devices (VADs).
notation: 16101212101011
valid from: 2024-06-07

Electrophysiology Devices
type: BicsLevel6Segment
type: Classifier
type: NamedIndividual
is level6 segment of: Cardiovascular Devices
is contemporary version of: http://data.ga-group.nl/ics/bics/161012121010
is version of: http://data.ga-group.nl/ics/bics/161012121010
replaces: http://data.ga-group.nl/ics/bics/2020/161012121010
imported on: 2026-06-08T13:40:52.236Z
last refreshed on: 2026-06-08T13:41:38.450Z
source accessed on: 2024-06-05T14:42:36Z
source last accessed on: 2024-06-05T14:42:36Z
label: Aparelhos para eletrofisiologia @pt
label: Appareils d'électrophysiologie @fr
label: Dispositivi elettrofisiologici @it
label: Dispositivos de electrofisiología @es
label: Elektrophysiologische Geräte @de
label: Электрофизиологич. устройства @ru
label: 电生理设备 @zh
label: 電気生理検査装置 @ja
label: 電生理學器材 @zh-hant
label: 전기생리학 기기 @ko
definition: This segment includes companies that manufacture electrophysiology devices, including heart pumps, blood pumps, replacement hearts, and catheters used to treat atrial fibrillation. Includes pacemakers, implantable cardioverter-defibrillators (ICDs), ventricle assist devices (VADs), defibrillators, ablation catheters, and any other cardiovascular device that uses an electrical impulse that is not a heart monitor.
notation: 161012121010
valid from: 2024-06-07

Interventional Cardiology
type: BicsLevel6Segment
type: Classifier
type: NamedIndividual
is level6 segment of: Cardiovascular Devices
is contemporary version of: http://data.ga-group.nl/ics/bics/161012121011
is version of: http://data.ga-group.nl/ics/bics/161012121011
replaces: http://data.ga-group.nl/ics/bics/2020/161012121011
imported on: 2026-06-08T13:40:52.236Z
last refreshed on: 2026-06-08T13:41:38.450Z
source accessed on: 2024-06-05T14:42:36Z
source last accessed on: 2024-06-05T14:42:36Z
label: Cardiologia interventiva @it
label: Cardiologie interventionnelle @fr
label: Cardología de intervención @es
label: Interventionelle Kardiologie @de
label: Хирургическая кардиология @ru
label: 介入心脏病学 @zh
label: 介入性心臓装置 @ja
label: 介入性心臟學 @zh-hant
label: 심혈관 중재시술 @ko
definition: This segment includes devices used in interventional cardiology procedures to repair heart damage and in peripheral vascular procedures to treat vascular and endovascular diseases. Includes coronary stents (drug-eluting and bare-metal), heart valves, coronary stent grafts, cardiac surgery devices, vascular closure devices, vascular plugs, IVUS catheters, atherectomy devices, and peripheral vascular and neurovascular stents and coils.
notation: 161012121011
valid from: 2024-06-07

Cardiovascular Devices
type: BicsLevel5Segment
type: Classifier
type: NamedIndividual
is level5 segment of: Medical Devices
is contemporary version of: http://data.ga-group.nl/ics/bics/1610121210
is version of: http://data.ga-group.nl/ics/bics/1610121210
replaces: http://data.ga-group.nl/ics/bics/2020/1610121210
imported on: 2026-06-08T13:40:52.236Z
last refreshed on: 2026-06-08T13:41:38.450Z
source accessed on: 2024-06-05T14:42:36Z
source last accessed on: 2024-06-05T14:42:36Z
label: Aparelhos cardiov @pt
label: Appareils cardiovasculaires @fr
label: Disp cardiov @es
label: Dispositivi cardiovascolari @it
label: Kardiovaskuläre Geräte @de
label: Кардиоваскулярное оборудование @ru
label: 心臓血管装置 @ja
label: 心血管器材 @zh-hant
label: 心血管设备 @zh
label: 심혈관 장치 @ko
definition: This segment includes companies that manufacture electromedical and interventional cardiovascular devices that use electrical impulses to stimulate action. Includes pacemakers, implantable cardioverter-defibrillators (ICDs), ventricle assist devices (VADs), defibrillators, drug-eluting stents, bare-metal stents, heart valves, coronary stent grafts, cardiac surgery products, and any other cardiovascular device that is not disposable and is not a heart monitor.
notation: 1610121210
valid from: 2024-06-07

Neuromodulation Devices
type: BicsLevel5Segment
type: Classifier
type: NamedIndividual
is level5 segment of: Medical Devices
is contemporary version of: http://data.ga-group.nl/ics/bics/1610121211
is version of: http://data.ga-group.nl/ics/bics/1610121211
replaces: http://data.ga-group.nl/ics/bics/2020/1610121211
imported on: 2026-06-08T13:40:52.236Z
last refreshed on: 2026-06-08T13:41:38.450Z
source accessed on: 2024-06-05T14:42:36Z
source last accessed on: 2024-06-05T14:42:36Z
label: Apar neuromodul @pt
label: Dispositifs de neuromodulation @fr
label: Dispositivi neuromodulatori @it
label: Neuromodulación @es
label: Neuromodulare Geräte @de
label: Устройства нейромодуляции @ru
label: 神経変調療法装置 @ja
label: 神經協調器材 @zh-hant
label: 神经调节设备 @zh
label: 신경조절 장치 @ko
definition: This segment includes companies that manufacture neuromodulation devices, including neurostimulation devices and implantable drug infusion systems.
notation: 1610121211
valid from: 2024-06-07

Dental Implants
type: BicsLevel7Segment
type: Classifier
type: NamedIndividual
is level7 segment of: Reconstructive Implants
is contemporary version of: http://data.ga-group.nl/ics/bics/16101212121010
is version of: http://data.ga-group.nl/ics/bics/16101212121010
replaces: http://data.ga-group.nl/ics/bics/2020/16101212121010
imported on: 2026-06-08T13:40:52.236Z
last refreshed on: 2026-06-08T13:41:38.450Z
source accessed on: 2024-06-05T14:42:36Z
source last accessed on: 2024-06-05T14:42:36Z
label: Implantes dentais @pt
label: Implantes dentales @es
label: Implants dentaires @fr
label: Protesi dentali @it
label: Zahnimplantate @de
label: Внутричелюстные зубные импланты @ru
label: 植牙 @zh-hant
label: 歯科ｲﾝﾌﾟﾗﾝﾄ @ja
label: 牙移植 @zh
label: 치아 임플란트 @ko
definition: This segment includes companies that manufacture reconstructive implants, such as screws and crowns, used to restore missing teeth or products used to remediate bone loss.
notation: 16101212121010
valid from: 2024-06-07

Hip Implants
type: BicsLevel7Segment
type: Classifier
type: NamedIndividual
is level7 segment of: Reconstructive Implants
is contemporary version of: http://data.ga-group.nl/ics/bics/16101212121011
is version of: http://data.ga-group.nl/ics/bics/16101212121011
replaces: http://data.ga-group.nl/ics/bics/2020/16101212121011
imported on: 2026-06-08T13:40:52.236Z
last refreshed on: 2026-06-08T13:41:38.450Z
source accessed on: 2024-06-05T14:42:36Z
source last accessed on: 2024-06-05T14:42:36Z
label: Hüftimplantate @de
label: Implantes de quadril @pt
label: Implantes de cadera @es
label: Protesi bacino @it
label: Prothèses de la hanche @fr
label: Импланты бедренного сустава @ru
label: 臀部ｲﾝﾌﾟﾗﾝﾄ @ja
label: 髋移植 @zh
label: 髖關節植入 @zh-hant
label: 인공고관절 @ko
definition: This segment includes companies that manufacture reconstructive implants used in partial or full arthroplasties or resurfacings that restore normal hip function and mobility.
notation: 16101212121011
valid from: 2024-06-07

Knee Implants
type: BicsLevel7Segment
type: Classifier
type: NamedIndividual
is level7 segment of: Reconstructive Implants
is contemporary version of: http://data.ga-group.nl/ics/bics/16101212121012
is version of: http://data.ga-group.nl/ics/bics/16101212121012
replaces: http://data.ga-group.nl/ics/bics/2020/16101212121012
imported on: 2026-06-08T13:40:52.236Z
last refreshed on: 2026-06-08T13:41:38.450Z
source accessed on: 2024-06-05T14:42:36Z
source last accessed on: 2024-06-05T14:42:36Z
label: Implantes de joelhos @pt
label: Implantes de rodilla @es
label: Knieimplantate @de
label: Protesi ginocchio @it
label: Prothèses du genou @fr
label: Импланты коленного сустава @ru
label: 人工膝関節ｲﾝﾌﾟﾗﾝﾄ @ja
label: 膝移植 @zh
label: 膝蓋移植 @zh-hant
label: 인공무릎관절 @ko
definition: This segment includes companies that manufacture reconstructive implants used in partial or full arthroplasties that restore normal knee function and mobility.
notation: 16101212121012
valid from: 2024-06-07

Reconstructive Implants
type: BicsLevel6Segment
type: Classifier
type: NamedIndividual
is level6 segment of: Orthopedic Devices
is contemporary version of: http://data.ga-group.nl/ics/bics/161012121210
is version of: http://data.ga-group.nl/ics/bics/161012121210
replaces: http://data.ga-group.nl/ics/bics/2020/161012121210
imported on: 2026-06-08T13:40:52.236Z
last refreshed on: 2026-06-08T13:41:38.450Z
source accessed on: 2024-06-05T14:42:36Z
source last accessed on: 2024-06-05T14:42:36Z
label: Implantes de reconstrucción @es
label: Implantes reconstrutivos @pt
label: Implants de reconstruction @fr
label: Protesi ricostruttive @it
label: Rekonstruktive Implantate @de
label: Реконструктивные импланты @ru
label: 再建ｲﾝﾌﾟﾗﾝﾄ @ja
label: 重建植入 @zh
label: 重建移植 @zh-hant
label: 재건 임플란트 @ko
definition: This segment includes companies that manufacture reconstructive implants and all other orthopedic devices unrelated to spinal disorders. Includes prosthetic joints (hips, knees and shoulders), bone cement, and dental devices.
notation: 161012121210
valid from: 2024-06-07

Spinal Devices
type: BicsLevel6Segment
type: Classifier
type: NamedIndividual
is level6 segment of: Orthopedic Devices
is contemporary version of: http://data.ga-group.nl/ics/bics/161012121211
is version of: http://data.ga-group.nl/ics/bics/161012121211
replaces: http://data.ga-group.nl/ics/bics/2020/161012121211
imported on: 2026-06-08T13:40:52.236Z
last refreshed on: 2026-06-08T13:41:38.450Z
source accessed on: 2024-06-05T14:42:36Z
source last accessed on: 2024-06-05T14:42:36Z
label: Aparelhos para coluna vertebral @pt
label: Appareils pour la colonne vertébrale @fr
label: Dispositivi vertrebrali @it
label: Dispositivos de columna @es
label: Spinalgeräte @de
label: Устройства для лечения заболеваний позвоночника @ru
label: 脊椎器材 @zh-hant
label: 脊椎设备 @zh
label: 脊髄装置 @ja
label: 척추 장치 @ko
definition: This segment includes companies that manufacture devices and their related biologics to treat spine-related disorders, such as back pain, degenerative disc disease, arthritis, spinal stenosis, and lumbar disc herniation.
notation: 161012121211
valid from: 2024-06-07

Orthopedic Devices
type: BicsLevel5Segment
type: Classifier
type: NamedIndividual
is level5 segment of: Medical Devices
is contemporary version of: http://data.ga-group.nl/ics/bics/1610121212
is version of: http://data.ga-group.nl/ics/bics/1610121212
replaces: http://data.ga-group.nl/ics/bics/2020/1610121212
imported on: 2026-06-08T13:40:52.236Z
last refreshed on: 2026-06-08T13:41:38.450Z
source accessed on: 2024-06-05T14:42:36Z
source last accessed on: 2024-06-05T14:42:36Z
label: Aparelhos ortopéd @pt
label: Appareils orthopédiques @fr
label: Dispositivi ortopedici @it
label: Orthopädische Geräte @de
label: Ortopédicos @es
label: Ортопедич. устройства @ru
label: 整形外科用機器 @ja
label: 骨科器材 @zh-hant
label: 骨科设备 @zh
label: 정형외과 장치 @ko
definition: This segment includes companies that produce reconstructive and spinal devices that are used to repair lost joint function (orthopedic devices), spinal conditions (spinal implants), and damaged bones and tissue (bone cement and fixation devices such as screws, pins, plates, etc.). Includes hip and knee implants, spinal plates and screws, orthobiologics, bone cement, and dental devices.
notation: 1610121212
valid from: 2024-06-07

Medical Devices
type: BicsLevel4SubIndustry
type: Classifier
type: NamedIndividual
is sub industry of: Medical Equipment & Devices
is contemporary version of: http://data.ga-group.nl/ics/bics/16101212
is version of: http://data.ga-group.nl/ics/bics/16101212
replaces: http://data.ga-group.nl/ics/bics/2020/16101212
imported on: 2026-06-08T13:40:52.236Z
last refreshed on: 2026-06-08T13:41:38.450Z
source accessed on: 2024-06-05T14:42:36Z
source last accessed on: 2024-06-05T14:42:36Z
label: Appareils médicaux @fr
label: Dispositivi medici @it
label: Dispositivos médicos @es
label: Medizinische Geräte @de
label: Медицинские устройства @ru
label: 医疗装置 @zh
label: 医療装置 @ja
label: 醫療裝置 @zh-hant
label: 의료 기기 @ko
definition: This industry subgroup includes companies that design and manufacture medical devices which are implanted within the human body.
notation: 16101212
valid from: 2024-06-07

Cosmetic Surgical Equipment
type: BicsLevel5Segment
type: Classifier
type: NamedIndividual
is level5 segment of: Medical Equipment
is contemporary version of: http://data.ga-group.nl/ics/bics/1610121310
is version of: http://data.ga-group.nl/ics/bics/1610121310
replaces: http://data.ga-group.nl/ics/bics/2020/1610121310
imported on: 2026-06-08T13:40:52.236Z
last refreshed on: 2026-06-08T13:41:38.450Z
source accessed on: 2024-06-05T14:42:36Z
source last accessed on: 2024-06-05T14:42:36Z
label: Equipagg chirurgia cosmetica @it
label: Equipamento cirúrgia plástica @pt
label: Equipements de chirurgie esthétique @fr
label: Equipo de cirugía plástica @es
label: Kosmetische Chirurgieausrüstung @de
label: Оборудование пластической хирургии @ru
label: 整形手術設備 @ja
label: 美容外科设备 @zh
label: 美容整形外科設備 @zh-hant
label: 성형수술 기기 @ko
definition: This segment includes companies that manufacture surgical equipment and supplies used in invasive and non-invasive cosmetic procedures.
notation: 1610121310
valid from: 2024-06-07

Dental Equipment
type: BicsLevel5Segment
type: Classifier
type: NamedIndividual
is level5 segment of: Medical Equipment
is contemporary version of: http://data.ga-group.nl/ics/bics/1610121311
is version of: http://data.ga-group.nl/ics/bics/1610121311
replaces: http://data.ga-group.nl/ics/bics/2020/1610121311
imported on: 2026-06-08T13:40:52.236Z
last refreshed on: 2026-06-08T13:41:38.450Z
source accessed on: 2024-06-05T14:42:36Z
source last accessed on: 2024-06-05T14:42:36Z
label: Apparecc dentali @it
label: Equipamento dentário @pt
label: Equipements dentaires @fr
label: Equipo dental @es
label: Zahnärztliche Ausrüstung @de
label: Стоматологическое оборудование @ru
label: 歯科設備 @ja
label: 牙科設備 @zh-hant
label: 牙科设备 @zh
label: 치과 장비 @ko
definition: This segment includes companies that manufacture dental equipment and supplies. Includes dental hand instruments, dental chairs, and dental lighting.
notation: 1610121311
valid from: 2024-06-07

Medication Monitor & Delivery
type: BicsLevel5Segment
type: Classifier
type: NamedIndividual
is level5 segment of: Medical Equipment
is contemporary version of: http://data.ga-group.nl/ics/bics/1610121312
is version of: http://data.ga-group.nl/ics/bics/1610121312
replaces: http://data.ga-group.nl/ics/bics/2020/1610121312
imported on: 2026-06-08T13:40:52.236Z
last refreshed on: 2026-06-08T13:41:38.450Z
source accessed on: 2024-06-05T14:42:36Z
source last accessed on: 2024-06-05T14:42:36Z
label: Administration et surveillance de médicaments @fr
label: Consegna e controllo farmaci @it
label: Medikamentierungsüberwachungs- & abgabegeräte @de
label: Monitor de medicamentos e entrega @pt
label: Monitoreo y entrega de medicamentos @es
label: Мониторинг и поставки медикаментов @ru
label: 医药监控与递送 @zh
label: 薬剤ﾓﾆﾀｰ･送達機器 @ja
label: 藥物管制與投藥 @zh-hant
label: 약물 모니터링 & 전달 @ko
definition: This segment includes companies that manufacture products used to deliver therapeutic dosages or monitor endocrine levels in the body.
notation: 1610121312
valid from: 2024-06-07

Imaging Equipment
type: BicsLevel6Segment
type: Classifier
type: NamedIndividual
is level6 segment of: Radiation Equipment
is contemporary version of: http://data.ga-group.nl/ics/bics/161012131310
is version of: http://data.ga-group.nl/ics/bics/161012131310
replaces: http://data.ga-group.nl/ics/bics/2020/161012131310
imported on: 2026-06-08T13:40:52.236Z
last refreshed on: 2026-06-08T13:41:38.450Z
source accessed on: 2024-06-05T14:42:36Z
source last accessed on: 2024-06-05T14:42:36Z
label: Bildverarbeitungsausrüstung @de
label: Diagnost immagini @it
label: Equipamento de imagem @pt
label: Equipements d'imagerie @fr
label: Equipo de imagen @es
label: Оборудование для создания изображений @ru
label: 影像設備 @zh-hant
label: 成像设备 @zh
label: 映像機器 @ja
label: 영상 장비 @ko
definition: This segment includes companies that manufacture equipment used in diagnostic imaging. Includes x-ray, computed tomography imaging, ultrasound, tomography, and magnetic resonance imaging equipment.
notation: 161012131310
valid from: 2024-06-07

Radiation Therapy
type: BicsLevel6Segment
type: Classifier
type: NamedIndividual
is level6 segment of: Radiation Equipment
is contemporary version of: http://data.ga-group.nl/ics/bics/161012131311
is version of: http://data.ga-group.nl/ics/bics/161012131311
replaces: http://data.ga-group.nl/ics/bics/2020/161012131311
imported on: 2026-06-08T13:40:52.236Z
last refreshed on: 2026-06-08T13:41:38.450Z
source accessed on: 2024-06-05T14:42:36Z
source last accessed on: 2024-06-05T14:42:36Z
label: Strahlentherapiegeräte @de
label: Terapia de radiação @pt
label: Terapia de radiación @es
label: Terapia radioattiva @it
label: Thérapie par radiation @fr
label: Лучевое лечение @ru
label: 放射性治療 @zh-hant
label: 放射線治療 @ja
label: 辐射疗法 @zh
label: 방사선 치료 @ko
definition: This segment includes companies that manufacture equipment used to deliver a dose of radiation to control malignant cells as part of cancer treatment.
notation: 161012131311
valid from: 2024-06-07

Radiation Equipment
type: BicsLevel5Segment
type: Classifier
type: NamedIndividual
is level5 segment of: Medical Equipment
is contemporary version of: http://data.ga-group.nl/ics/bics/1610121313
is version of: http://data.ga-group.nl/ics/bics/1610121313
replaces: http://data.ga-group.nl/ics/bics/2020/1610121313
imported on: 2026-06-08T13:40:52.236Z
last refreshed on: 2026-06-08T13:41:38.450Z
source accessed on: 2024-06-05T14:42:36Z
source last accessed on: 2024-06-05T14:42:36Z
label: Equipagg Radiazioni @it
label: Equipamento radiação @pt
label: Equipements de radiation @fr
label: Equipo de radiación @es
label: Radiationsgeräte @de
label: Радиационное оборудование @ru
label: 放射線設備 @ja
label: 放射設備 @zh-hant
label: 辐射设备 @zh
label: 방사선 장비 @ko
definition: This segment includes companies that manufacture irradiation apparatus equipment and related supplies. Includes x-ray equipment devices.
notation: 1610121313
valid from: 2024-06-07

Surgical & Medical Instruments
type: BicsLevel5Segment
type: Classifier
type: NamedIndividual
is level5 segment of: Medical Equipment
is contemporary version of: http://data.ga-group.nl/ics/bics/1610121314
is version of: http://data.ga-group.nl/ics/bics/1610121314
replaces: http://data.ga-group.nl/ics/bics/2020/1610121314
imported on: 2026-06-08T13:40:52.236Z
last refreshed on: 2026-06-08T13:41:38.450Z
source accessed on: 2024-06-05T14:42:36Z
source last accessed on: 2024-06-05T14:42:36Z
label: Chirurgische & medizinische Instrumente @de
label: Instrumentos de cirugía y médicos @es
label: Instrumentos médicos e cirúrgicos @pt
label: Instruments médicaux et chirurgicaux @fr
label: Strumenti medici e chirurgici @it
label: Хирургич. и мед. инструменты @ru
label: 外科及醫療器材 @zh-hant
label: 外科･医療用機器 @ja
label: 手术与医疗器械 @zh
label: 수술 & 의료기기 @ko
definition: This segment includes companies that manufacture any medical devices, instruments, or equipment used in surgery or recovery that is not elsewhere classified.
notation: 1610121314
valid from: 2024-06-07

Medical Equipment
type: BicsLevel4SubIndustry
type: Classifier
type: NamedIndividual
is sub industry of: Medical Equipment & Devices
is contemporary version of: http://data.ga-group.nl/ics/bics/16101213
is version of: http://data.ga-group.nl/ics/bics/16101213
replaces: http://data.ga-group.nl/ics/bics/2020/16101213
imported on: 2026-06-08T13:40:52.236Z
last refreshed on: 2026-06-08T13:41:38.450Z
source accessed on: 2024-06-05T14:42:36Z
source last accessed on: 2024-06-05T14:42:36Z
label: Equipagg medici @it
label: Equipamento médico @pt
label: Equipements médicaux @fr
label: Equipo médico @es
label: Medizinische Geräte @de
label: Мед. оборудование @ru
label: 医疗设备 @zh
label: 医療機器 @ja
label: 醫療設備 @zh-hant
label: 의료장비 @ko
definition: This industry subgroup includes companies that manufacture health care equipment. Includes equipment for cosmetic surgery, radiation therapy and imaging, medication monitoring and delivery, telemetry monitoring, and dentistry.
notation: 16101213
valid from: 2024-06-07

Medical Equipment & Devices
type: BicsLevel3Industry
type: Classifier
type: NamedIndividual
is industry of: Health Care
is contemporary version of: http://data.ga-group.nl/ics/bics/161012
is version of: http://data.ga-group.nl/ics/bics/161012
replaces: http://data.ga-group.nl/ics/bics/2020/161012
imported on: 2026-06-08T13:40:52.236Z
last refreshed on: 2026-06-08T13:41:38.450Z
source accessed on: 2024-06-05T14:42:36Z
source last accessed on: 2024-06-05T14:42:36Z
label: Aparelhos e equipamentos médicos @pt
label: Dispositivi e app mediche @it
label: Equipements et appareils médicaux @fr
label: Equipo y dispositivos médicos @es
label: Medizinische Ausrüstung & Geräte @de
label: Мед. оборуд./приборы @ru
label: 医疗设备与装置 @zh
label: 医療機器･装置 @ja
label: 醫療設備/裝置 @zh-hant
label: 의료 장비 & 기기 @ko
definition: This industry includes companies that manufacture health care products for medical treatments and diagnostics.
notation: 161012
valid from: 2024-06-07

Health Care
type: BicsLevel2IndustryGroup
type: Classifier
type: NamedIndividual
is industry group of: Health Care
is contemporary version of: http://data.ga-group.nl/ics/bics/1610
is version of: http://data.ga-group.nl/ics/bics/1610
replaces: http://data.ga-group.nl/ics/bics/2020/1610
imported on: 2026-06-08T13:40:52.236Z
last refreshed on: 2026-06-08T13:41:38.450Z
source accessed on: 2024-06-05T14:42:36Z
source last accessed on: 2024-06-05T14:42:36Z
label: Gesundheitswesen @de
label: Saúde @pt
label: Sanidad @es
label: Sanità @it
label: Santé @fr
label: Здравоохранение @ru
label: 医疗保健 @zh
label: 醫療保健 @zh-hant
label: 헬스케어 @ko
label: ﾍﾙｽｹｱ @ja
definition: This industry group includes companies providing medical services or creating medical products.
notation: 1610
valid from: 2024-06-07

Health Care
type: BicsLevel1Sector
type: Classifier
type: NamedIndividual
is contemporary version of: http://data.ga-group.nl/ics/bics/16
is version of: http://data.ga-group.nl/ics/bics/16
replaces: http://data.ga-group.nl/ics/bics/2020/16
imported on: 2026-06-08T13:40:52.236Z
last refreshed on: 2026-06-08T13:41:38.450Z
source accessed on: 2024-06-05T14:42:36Z
source last accessed on: 2024-06-05T14:42:36Z
label: Gesundheitswesen @de
label: Saúde @pt
label: Sanidad @es
label: Sanità @it
label: Santé @fr
label: Здравоохранение @ru
label: 医疗保健 @zh
label: 醫療保健 @zh-hant
label: 헬스케어 @ko
label: ﾍﾙｽｹｱ @ja
definition: This sector includes companies providing medical services or creating medical products.
notation: 16
valid from: 2024-06-07

Diversified Industrials
type: BicsLevel4SubIndustry
type: Classifier
type: NamedIndividual
is sub industry of: Diversified Industrials
is contemporary version of: http://data.ga-group.nl/ics/bics/17101010
is version of: http://data.ga-group.nl/ics/bics/17101010
replaces: http://data.ga-group.nl/ics/bics/2020/17101010
imported on: 2026-06-08T13:40:52.236Z
last refreshed on: 2026-06-08T13:41:38.450Z
source accessed on: 2024-06-05T14:42:36Z
source last accessed on: 2024-06-05T14:42:36Z
label: Diversifizierte Industriewerte @de
label: Industriais diversificados @pt
label: Industriales diversificados @es
label: Industriali diversificati @it
label: Industries diversifiées @fr
label: Многоотраслевые компании @ru
label: 多元化工业 @zh
label: 多元化工業 @zh-hant
label: 複合企業 @ja
label: 다각화산업 @ko
definition: This industry subgroup includes companies that manufacture various industrial products. Typically, these companies are large conglomerates that are diversified across multiple industries within the Industrials sector.
notation: 17101010
valid from: 2024-06-07

Diversified Industrials
type: BicsLevel3Industry
type: Classifier
type: NamedIndividual
is industry of: Industrial Products
is contemporary version of: http://data.ga-group.nl/ics/bics/171010
is version of: http://data.ga-group.nl/ics/bics/171010
replaces: http://data.ga-group.nl/ics/bics/2020/171010
imported on: 2026-06-08T13:40:52.236Z
last refreshed on: 2026-06-08T13:41:38.450Z
source accessed on: 2024-06-05T14:42:36Z
source last accessed on: 2024-06-05T14:42:36Z
label: Diversifizierte Industriewerte @de
label: Industriais diversificados @pt
label: Industriales diversificados @es
label: Industriali diversificati @it
label: Industries diversifiées @fr
label: Многоотраслевые компании @ru
label: 多元化工业 @zh
label: 多元化工業 @zh-hant
label: 複合企業 @ja
label: 다각화산업 @ko
definition: This industry includes companies that manufacture various industrial products. Typically, these companies are large conglomerates that are diversified across multiple industries within the Industrials sector.
notation: 171010
valid from: 2024-06-07

Aircraft
type: BicsLevel5Segment
type: Classifier
type: NamedIndividual
is level5 segment of: Aircraft & Parts
is contemporary version of: http://data.ga-group.nl/ics/bics/1710111010
is version of: http://data.ga-group.nl/ics/bics/1710111010
replaces: http://data.ga-group.nl/ics/bics/2020/1710111010
imported on: 2026-06-08T13:40:52.236Z
last refreshed on: 2026-06-08T13:41:38.450Z
source accessed on: 2024-06-05T14:42:36Z
source last accessed on: 2024-06-05T14:42:36Z
label: Aeromobili @it
label: Aeronave @pt
label: Aviones @es
label: Avions @fr
label: Flugzeuge @de
label: Воздуш. суда @ru
label: 航空機 @ja
label: 飛機 @zh-hant
label: 飞机 @zh
label: 항공기 @ko
definition: This segment includes companies that manufacture or assemble commercial aircraft and helicopters, including complete aircraft overhauls and rebuilding.
notation: 1710111010
valid from: 2024-06-07

Aircraft Engines & Eng Parts
type: BicsLevel6Segment
type: Classifier
type: NamedIndividual
is level6 segment of: Aircraft Parts
is contemporary version of: http://data.ga-group.nl/ics/bics/171011101110
is version of: http://data.ga-group.nl/ics/bics/171011101110
replaces: http://data.ga-group.nl/ics/bics/2020/171011101110
imported on: 2026-06-08T13:40:52.236Z
last refreshed on: 2026-06-08T13:41:38.450Z
source accessed on: 2024-06-05T14:42:36Z
source last accessed on: 2024-06-05T14:42:36Z
label: Flugzeugmotoren & Motorteile @de
label: Moteurs d'avions et leurs pièces @fr
label: Motores e peças de aeronaves @pt
label: Motores y piezas de aviones @es
label: Motori e parti aeromobili @it
label: Авиац. двигат. и детали @ru
label: 航空機用原動機･部品 @ja
label: 飛機引擎及引擎零件 @zh-hant
label: 飞机发动机及发动机零部件 @zh
label: 항공기 엔진 & 엔진부품 @ko
definition: This segment includes companies that manufacture aircraft engines and aircraft engine parts or provide major engine overhauls and rebuilding.
notation: 171011101110
valid from: 2024-06-07

Aircraft Structure & Equipment
type: BicsLevel6Segment
type: Classifier
type: NamedIndividual
is level6 segment of: Aircraft Parts
is contemporary version of: http://data.ga-group.nl/ics/bics/171011101111
is version of: http://data.ga-group.nl/ics/bics/171011101111
replaces: http://data.ga-group.nl/ics/bics/2020/171011101111
imported on: 2026-06-08T13:40:52.236Z
last refreshed on: 2026-06-08T13:41:38.450Z
source accessed on: 2024-06-05T14:42:36Z
source last accessed on: 2024-06-05T14:42:36Z
label: Equipo y estructura de aviones @es
label: Estrutura e equipamentos de aeronaves @pt
label: Flugzeugstruktur & -equipment @de
label: Structure/équipmt pour avions @fr
label: Struttura ed equip aeromobili @it
label: Конструкц. самолетов и з/части @ru
label: 航太結構及設備 @zh-hant
label: 航空機構造･機器 @ja
label: 飞机结构与设备 @zh
label: 항공기 구조물 & 장비 @ko
label: ��онструкц. самолетов и з/части @ru
definition: This segment includes companies that manufacture aircraft parts, such as wings, fuselage, airframes, tail assemblies, and sub-assemblies.
notation: 171011101111
valid from: 2024-06-07

Aircraft Electronics
type: BicsLevel6Segment
type: Classifier
type: NamedIndividual
is level6 segment of: Aircraft Parts
is contemporary version of: http://data.ga-group.nl/ics/bics/171011101112
is version of: http://data.ga-group.nl/ics/bics/171011101112
replaces: http://data.ga-group.nl/ics/bics/2020/171011101112
imported on: 2026-06-08T13:40:52.236Z
last refreshed on: 2026-06-08T13:41:38.450Z
source accessed on: 2024-06-05T14:42:36Z
source last accessed on: 2024-06-05T14:42:36Z
label: Electrónica de aviones @es
label: Electronique pour avions @fr
label: Eletrônicos de aeronaves @pt
label: Elettronica aeromobili @it
label: Flugzeugelektronik @de
label: Электроника самолетов @ru
label: 航空機用電子製品 @ja
label: 電子航太及防禦系統 @zh-hant
label: 飞机电子产品 @zh
label: 항공기 전자 @ko
definition: This segment includes companies that manufacture aerospace and defense electronics, radar systems, guidance systems, and navigation systems.
notation: 171011101112
valid from: 2024-06-07

Aircraft Parts
type: BicsLevel5Segment
type: Classifier
type: NamedIndividual
is level5 segment of: Aircraft & Parts
is contemporary version of: http://data.ga-group.nl/ics/bics/1710111011
is version of: http://data.ga-group.nl/ics/bics/1710111011
replaces: http://data.ga-group.nl/ics/bics/2020/1710111011
imported on: 2026-06-08T13:40:52.236Z
last refreshed on: 2026-06-08T13:41:38.450Z
source accessed on: 2024-06-05T14:42:36Z
source last accessed on: 2024-06-05T14:42:36Z
label: Flugzeugteile @de
label: Partes de aviones @es
label: Peças para aeronaves @pt
label: Pièces d'avions @fr
label: Ricambi aeromobili @it
label: Детали самолетов @ru
label: 航空機部品 @ja
label: 飛機零件 @zh-hant
label: 飞机零部件 @zh
label: 항공기 부품 @ko
definition: This segment includes companies that manufacture aircraft engines, aircraft engine parts, aircraft seats and seat frames, aircraft sub-assemblies (such as wings, fuselage, airframes, and tails), and aircraft electronics (such as radar or guidance systems).
notation: 1710111011
valid from: 2024-06-07

Aircraft & Parts
type: BicsLevel4SubIndustry
type: Classifier
type: NamedIndividual
is sub industry of: Aerospace & Defense
is contemporary version of: http://data.ga-group.nl/ics/bics/17101110
is version of: http://data.ga-group.nl/ics/bics/17101110
replaces: http://data.ga-group.nl/ics/bics/2020/17101110
imported on: 2026-06-08T13:40:52.236Z
last refreshed on: 2026-06-08T13:41:38.450Z
source accessed on: 2024-06-05T14:42:36Z
source last accessed on: 2024-06-05T14:42:36Z
label: Aeromobili e ricambi @it
label: Aviões e peças @pt
label: Aviones y partes @es
label: Avions et pièces @fr
label: Flugzeugteile @de
label: Воздуш. суда и детали @ru
label: 航空機･部品 @ja
label: 飛機及零件 @zh-hant
label: 飞机与零部件 @zh
label: 항공기 & 부품 @ko
definition: This industry subgroup includes companies that manufacture commercial aircrafts and their parts. Excludes aircrafts and parts used for military purposes (See Military Aircraft).
notation: 17101110
valid from: 2024-06-07

Military Aircraft
type: BicsLevel5Segment
type: Classifier
type: NamedIndividual
is level5 segment of: Defense
is contemporary version of: http://data.ga-group.nl/ics/bics/1710111110
is version of: http://data.ga-group.nl/ics/bics/1710111110
replaces: http://data.ga-group.nl/ics/bics/2020/1710111110
imported on: 2026-06-08T13:40:52.236Z
last refreshed on: 2026-06-08T13:41:38.450Z
source accessed on: 2024-06-05T14:42:36Z
source last accessed on: 2024-06-05T14:42:36Z
label: Aeromobili militari @it
label: Aeronaves militares @pt
label: Avión militar @es
label: Avions militaires @fr
label: Militärflugzeuge @de
label: Ввоенно-воздушн. суда @ru
label: 军用飞机 @zh
label: 軍用機 @ja
label: 軍用飛機 @zh-hant
label: 군용항공기 @ko
definition: This segment includes companies that manufacture or assemble military aircraft and helicopters, including complete aircraft overhauls and rebuilding.
notation: 1710111110
valid from: 2024-06-07

Military Armored Veh & Tanks
type: BicsLevel5Segment
type: Classifier
type: NamedIndividual
is level5 segment of: Defense
is contemporary version of: http://data.ga-group.nl/ics/bics/1710111111
is version of: http://data.ga-group.nl/ics/bics/1710111111
replaces: http://data.ga-group.nl/ics/bics/2020/1710111111
imported on: 2026-06-08T13:40:52.236Z
last refreshed on: 2026-06-08T13:41:38.450Z
source accessed on: 2024-06-05T14:42:36Z
source last accessed on: 2024-06-05T14:42:36Z
label: Chars d'assaut et véhicules militaires blindés @fr
label: Gepanzerte Militärfahrzeuge & Panzer @de
label: Tanques y vehículos militar blindados @es
label: Veíc e tanques militares blindados @pt
label: Veicoli mil blindati e carri armati @it
label: Военные бронир. автомоб./танки @ru
label: 军用装甲车与坦克 @zh
label: 軍用裝甲車輛及坦克 @zh-hant
label: 軍装甲車･重装甲戦車 @ja
label: 군용장갑차 & 탱크 @ko
definition: This segment includes companies that manufacture military armored vehicles, tanks, self-propelled vehicles, and tank components.
notation: 1710111111
valid from: 2024-06-07

Missile & Space Vehicles
type: BicsLevel5Segment
type: Classifier
type: NamedIndividual
is level5 segment of: Defense
is contemporary version of: http://data.ga-group.nl/ics/bics/1710111112
is version of: http://data.ga-group.nl/ics/bics/1710111112
replaces: http://data.ga-group.nl/ics/bics/2020/1710111112
imported on: 2026-06-08T13:40:52.236Z
last refreshed on: 2026-06-08T13:41:38.450Z
source accessed on: 2024-06-05T14:42:36Z
source last accessed on: 2024-06-05T14:42:36Z
label: Misiles y vehículos aeroespaciales @es
label: Missiles et véhicules spatiaux @fr
label: Missili e veicoli spaziali @it
label: Raketen & Raumfahrzeuge @de
label: Veículos espaciais e mísseis @pt
label: Ракеты и космич. корабли @ru
label: 导弹与航天器 @zh
label: 導彈及太空器 @zh-hant
label: 미사일 & 우주선 @ko
label: ﾐｻｲﾙ･宇宙船 @ja
definition: This segment includes companies that manufacture guided missiles and space vehicles and/or their engines and/or their parts and components.
notation: 1710111112
valid from: 2024-06-07

Munitions & Accessories
type: BicsLevel5Segment
type: Classifier
type: NamedIndividual
is level5 segment of: Defense
is contemporary version of: http://data.ga-group.nl/ics/bics/1710111113
is version of: http://data.ga-group.nl/ics/bics/1710111113
replaces: http://data.ga-group.nl/ics/bics/2020/1710111113
imported on: 2026-06-08T13:40:52.236Z
last refreshed on: 2026-06-08T13:41:38.450Z
source accessed on: 2024-06-05T14:42:36Z
source last accessed on: 2024-06-05T14:42:36Z
label: Munições e acessórios @pt
label: Municiones y accesorios @es
label: Munition & Zubehör @de
label: Munitions et accessoires @fr
label: Munizioni e accessori @it
label: Боеприпасы и аксессуары @ru
label: 军火弹药和配件 @zh
label: 軍火彈藥及小型武器製造 @zh-hant
label: 軍需品･付属品 @ja
label: 군수품 & 액세서리 @ko
definition: This segment includes companies that manufacture munitions, ordnances, and small arms.
notation: 1710111113
valid from: 2024-06-07

Naval Ships
type: BicsLevel5Segment
type: Classifier
type: NamedIndividual
is level5 segment of: Defense
is contemporary version of: http://data.ga-group.nl/ics/bics/1710111114
is version of: http://data.ga-group.nl/ics/bics/1710111114
replaces: http://data.ga-group.nl/ics/bics/2020/1710111114
imported on: 2026-06-08T13:40:52.236Z
last refreshed on: 2026-06-08T13:41:38.450Z
source accessed on: 2024-06-05T14:42:36Z
source last accessed on: 2024-06-05T14:42:36Z
label: Barcos navales @es
label: Construção de navios @pt
label: Construction navale @fr
label: Kriegsschiffe @de
label: Navi @it
label: Военные корабли @ru
label: 军舰制造 @zh
label: 軍艦營造 @zh-hant
label: 軍艦造船 @ja
label: 해군함 선박조선 @ko
label: ��艦造船 @ja
definition: This segment includes companies that manufacture naval ships, boats, and submarines.
notation: 1710111114
valid from: 2024-06-07

Electronics & Mission Systems
type: BicsLevel5Segment
type: Classifier
type: NamedIndividual
is level5 segment of: Defense
is contemporary version of: http://data.ga-group.nl/ics/bics/1710111115
is version of: http://data.ga-group.nl/ics/bics/1710111115
replaces: http://data.ga-group.nl/ics/bics/2020/1710111115
imported on: 2026-06-08T13:40:52.236Z
last refreshed on: 2026-06-08T13:41:38.450Z
source accessed on: 2024-06-05T14:42:36Z
source last accessed on: 2024-06-05T14:42:36Z
label: Elektronik- & Missionssysteme @de
label: Eletrônicos e sistemas de missão @pt
label: Sistemas de misión y electrónicos @es
label: Sistemi elettronica e missione @it
label: Systèmes électroniques/de mission @fr
label: Электроника и спец. системы @ru
label: 电子与任务系统 @zh
label: 電子及作戰任務系統 @zh-hant
label: 電子･ﾐｯｼｮﾝｼｽﾃﾑ @ja
label: 전자 및 미션시스템 @ko
definition: This segment includes companies that manufacture finished electronic systems utilized in defense applications. Includes command center communication systems, military vehicle navigation systems, and reconnaissance equipment.
notation: 1710111115
valid from: 2024-06-07

Defense
type: BicsLevel4SubIndustry
type: Classifier
type: NamedIndividual
is sub industry of: Aerospace & Defense
is contemporary version of: http://data.ga-group.nl/ics/bics/17101111
is version of: http://data.ga-group.nl/ics/bics/17101111
replaces: http://data.ga-group.nl/ics/bics/2020/17101111
imported on: 2026-06-08T13:40:52.236Z
last refreshed on: 2026-06-08T13:41:38.450Z
source accessed on: 2024-06-05T14:42:36Z
source last accessed on: 2024-06-05T14:42:36Z
label: Défense @fr
label: Defensa @es
label: Defesa @pt
label: Difesa @it
label: Verteidigung @de
label: Оборона @ru
label: 国防 @zh
label: 國防 @zh-hant
label: 防衛 @ja
label: 방위 @ko
definition: This industry subgroup includes companies that manufacture parts, supplies, and equipment for military applications.
notation: 17101111
valid from: 2024-06-07

Aerospace & Defense
type: BicsLevel3Industry
type: Classifier
type: NamedIndividual
is industry of: Industrial Products
is contemporary version of: http://data.ga-group.nl/ics/bics/171011
is version of: http://data.ga-group.nl/ics/bics/171011
replaces: http://data.ga-group.nl/ics/bics/2020/171011
imported on: 2026-06-08T13:40:52.236Z
last refreshed on: 2026-06-08T13:41:38.450Z
source accessed on: 2024-06-05T14:42:36Z
source last accessed on: 2024-06-05T14:42:36Z
label: Aérospatiale et défense @fr
label: Aeroespacial y militar @es
label: Aerospazio e difesa @it
label: Defesa e aeroespacial @pt
label: Raumfahrt & Verteidigung @de
label: Аэрокосм. и оборона @ru
label: 航空宇宙･防衛 @ja
label: 航空與國防 @zh-hant
label: 航空航天及国防 @zh
label: 항공우주 & 방위 @ko
definition: This industry includes companies that manufacture aerospace and defense products.
notation: 171011
valid from: 2024-06-07

Elevator & Moving Stairway
type: BicsLevel5Segment
type: Classifier
type: NamedIndividual
is level5 segment of: Comml & Res Bldg Equip & Sys
is contemporary version of: http://data.ga-group.nl/ics/bics/1710121010
is version of: http://data.ga-group.nl/ics/bics/1710121010
replaces: http://data.ga-group.nl/ics/bics/2020/1710121010
imported on: 2026-06-08T13:40:52.236Z
last refreshed on: 2026-06-08T13:41:38.450Z
source accessed on: 2024-06-05T14:42:36Z
source last accessed on: 2024-06-05T14:42:36Z
label: Acensores, escaleras eléctric @es
label: Ascenseurs et escaliers mécaniques @fr
label: Ascensori e scale mobili @it
label: Elevador e escada rolante @pt
label: Fahrstühle & Rolltreppen @de
label: Лифты и эскалаторы @ru
label: 电梯与移动楼梯 @zh
label: 電梯及手扶梯 @zh-hant
label: 엘리베이터 & 이동식계단 @ko
label: ｴﾚﾍﾞｰﾀｰ･ｴｽｶﾚｰﾀｰ @ja
definition: This segment includes companies that manufacture equipment that moves materials or passengers from one floor to another floor. Such equipment includes automobile lifts, passenger elevators, and escalators.
notation: 1710121010
valid from: 2024-06-07

A/C Heating & Fridge Equip
type: BicsLevel6Segment
type: Classifier
type: NamedIndividual
is level6 segment of: HVAC Building Products
is contemporary version of: http://data.ga-group.nl/ics/bics/171012101110
is version of: http://data.ga-group.nl/ics/bics/171012101110
replaces: http://data.ga-group.nl/ics/bics/2020/171012101110
imported on: 2026-06-08T13:40:52.236Z
last refreshed on: 2026-06-08T13:41:38.450Z
source accessed on: 2024-06-05T14:42:36Z
source last accessed on: 2024-06-05T14:42:36Z
label: A/C 난방 & 냉장고 장비 @ko
label: App A/C riscaldamento e frigo @it
label: Equip para aquecimento de ar condicionado e refrigeração @pt
label: Equipo de calefacción A/C y la refrigerador @es
label: HVAC et appareils de réfrig @fr
label: Temperaturkontrollgeräte @de
label: Холодильное и отопительное оборуд. @ru
label: 冷暖氣及冷凍設備 @zh-hant
label: 空調･冷暖房･冷凍設備 @ja
label: 空调、供暖与制冷设备 @zh
definition: This segment includes companies that manufacture air conditioning and warm air furnace equipment, as well as commercial and industrial walk-in refrigeration and freezer equipment.
notation: 171012101110
valid from: 2024-06-07

Water Heating Equipment
type: BicsLevel6Segment
type: Classifier
type: NamedIndividual
is level6 segment of: HVAC Building Products
is contemporary version of: http://data.ga-group.nl/ics/bics/171012101111
is version of: http://data.ga-group.nl/ics/bics/171012101111
replaces: http://data.ga-group.nl/ics/bics/2020/171012101111
imported on: 2026-06-08T13:40:52.236Z
last refreshed on: 2026-06-08T13:41:38.450Z
source accessed on: 2024-06-05T14:42:36Z
source last accessed on: 2024-06-05T14:42:36Z
label: App riscaldamento idrico @it
label: Equipamentos de aquecimento de água @pt
label: Equipements de chauffe-eau @fr
label: Equipo de calentamiento de agua @es
label: Warmwasserbereitungsgeräte @de
label: Оборуд. для нагрева воды @ru
label: 暖氣設備 @zh-hant
label: 水暖设备 @zh
label: 温水器 @ja
label: 온수난방장치 @ko
definition: This segment includes companies that manufacture water heaters and boilers.
notation: 171012101111
valid from: 2024-06-07

Industrial Fans & Blowers
type: BicsLevel6Segment
type: Classifier
type: NamedIndividual
is level6 segment of: HVAC Building Products
is contemporary version of: http://data.ga-group.nl/ics/bics/171012101112
is version of: http://data.ga-group.nl/ics/bics/171012101112
replaces: http://data.ga-group.nl/ics/bics/2020/171012101112
imported on: 2026-06-08T13:40:52.236Z
last refreshed on: 2026-06-08T13:41:38.450Z
source accessed on: 2024-06-05T14:42:36Z
source last accessed on: 2024-06-05T14:42:36Z
label: Abanicos y ventiladores industriales @es
label: Industrielle Ventilatoren & Gebläse @de
label: Ventiladores industriais e ventiladores @pt
label: Ventilateurs et souffleurs industriels @fr
label: Ventilatori e aspiratori industriali @it
label: Промышл. и коммерч. вентиляторы @ru
label: 工业风扇与鼓风机 @zh
label: 工业风扇与��风机 @zh
label: 工商業用風扇及風箱 @zh-hant
label: 産業用換気扇･送風機 @ja
label: 산업용 선풍기 & 송풍기 @ko
label: 산업용 ���풍기 & 송풍기 @ko
definition: This segment includes companies that manufacture attic fans, blowers, and industrial and commercial fans, such as exhaust and ventilating fans.
notation: 171012101112
valid from: 2024-06-07

HVAC Building Products
type: BicsLevel5Segment
type: Classifier
type: NamedIndividual
is level5 segment of: Comml & Res Bldg Equip & Sys
is contemporary version of: http://data.ga-group.nl/ics/bics/1710121011
is version of: http://data.ga-group.nl/ics/bics/1710121011
replaces: http://data.ga-group.nl/ics/bics/2020/1710121011
imported on: 2026-06-08T13:40:52.236Z
last refreshed on: 2026-06-08T13:41:38.450Z
source accessed on: 2024-06-05T14:42:36Z
source last accessed on: 2024-06-05T14:42:36Z
label: HVAC 건축자재 @ko
label: Heiz- & Klimatisierungsprodukte @de
label: Prodotti costruzione HVAC @it
label: Productos de edificación, calefacción y aire acondicionado @es
label: Produits de construction HVAC @fr
label: Produtos para construção HVAC @pt
label: Товары для обогрева, кондиционир. @ru
label: 冷暖房空調設備 @ja
label: 暖通空调建筑产品 @zh
label: 通風/冷暖氣建築物產品 @zh-hant
definition: This segment includes companies that manufacture affixed ventilation, heating, air conditioning, and commercial and industrial walk-in refrigeration and freezer equipment. Excludes portable or consumer HVAC equipment (see Heating & Cooling Appliances).
notation: 1710121011
valid from: 2024-06-07

Commercial Light Fixtures
type: BicsLevel6Segment
type: Classifier
type: NamedIndividual
is level6 segment of: Lighting Fixtures
is contemporary version of: http://data.ga-group.nl/ics/bics/171012101210
is version of: http://data.ga-group.nl/ics/bics/171012101210
replaces: http://data.ga-group.nl/ics/bics/2020/171012101210
imported on: 2026-06-08T13:40:52.236Z
last refreshed on: 2026-06-08T13:41:38.450Z
source accessed on: 2024-06-05T14:42:36Z
source last accessed on: 2024-06-05T14:42:36Z
label: Appareils d'éclairage commerciaux @fr
label: Gewerbliche Beleuchtungskörper @de
label: Impianti elettrici commerciali @it
label: Instalaciones comerciales de iluminación @es
label: Luminárias comerciais @pt
label: Коммерческие светильники @ru
label: 商業用照明器具 @ja
label: 商用照明灯具 @zh
label: 商用照明燈具 @zh-hant
label: 商用照明��具 @zh
label: 상업용 조명장치 @ko
definition: This segment includes companies that manufacture electric lamp bulbs, lighting fixtures, and parts for commercial markets.
notation: 171012101210
valid from: 2024-06-07

Residential Light Fixtures
type: BicsLevel6Segment
type: Classifier
type: NamedIndividual
is level6 segment of: Lighting Fixtures
is contemporary version of: http://data.ga-group.nl/ics/bics/171012101211
is version of: http://data.ga-group.nl/ics/bics/171012101211
replaces: http://data.ga-group.nl/ics/bics/2020/171012101211
imported on: 2026-06-08T13:40:52.236Z
last refreshed on: 2026-06-08T13:41:38.450Z
source accessed on: 2024-06-05T14:42:36Z
source last accessed on: 2024-06-05T14:42:36Z
label: Appareils d'éclairage résidentiels @fr
label: Beleuchtungskörper für Wohnzwecke @de
label: Impianti elettrici residenziali @it
label: Instalaciones residenciales de iluminación @es
label: Luminárias residenciais @pt
label: Бытовые светильники @ru
label: 住宅照明灯具 @zh
label: 住宅用照明器具 @ja
label: 家用照明燈具 @zh-hant
label: 주거용 조명장치 @ko
definition: This segment includes companies that manufacture electric lamp bulbs, lighting fixtures, and parts for residential markets.
notation: 171012101211
valid from: 2024-06-07

Lighting Fixtures
type: BicsLevel5Segment
type: Classifier
type: NamedIndividual
is level5 segment of: Comml & Res Bldg Equip & Sys
is contemporary version of: http://data.ga-group.nl/ics/bics/1710121012
is version of: http://data.ga-group.nl/ics/bics/1710121012
replaces: http://data.ga-group.nl/ics/bics/2020/1710121012
imported on: 2026-06-08T13:40:52.236Z
last refreshed on: 2026-06-08T13:41:38.450Z
source accessed on: 2024-06-05T14:42:36Z
source last accessed on: 2024-06-05T14:42:36Z
label: Appareils d'éclairage @fr
label: Beleuchtungskörper @de
label: Impianti d'illuminazione @it
label: Instalaciones de iluminación @es
label: Luminárias @pt
label: Осветительные приборы @ru
label: 照明器具 @ja
label: 照明灯具 @zh
label: 照明燈具 @zh-hant
label: 조명장치 @ko
definition: This segment includes companies that manufacture electric lamp bulbs, lighting fixtures, and parts.
notation: 1710121012
valid from: 2024-06-07

Fire Detection Devices
type: BicsLevel6Segment
type: Classifier
type: NamedIndividual
is level6 segment of: Security Devices
is contemporary version of: http://data.ga-group.nl/ics/bics/171012101310
is version of: http://data.ga-group.nl/ics/bics/171012101310
replaces: http://data.ga-group.nl/ics/bics/2020/171012101310
imported on: 2026-06-08T13:40:52.236Z
last refreshed on: 2026-06-08T13:41:38.450Z
source accessed on: 2024-06-05T14:42:36Z
source last accessed on: 2024-06-05T14:42:36Z
label: Brandmelder @de
label: Dispositifs de détection d'incendie @fr
label: Dispositivi antincendio @it
label: Dispositivos de detectores de incendio @es
label: Equipamentos de detecção de incêndio @pt
label: Системы пожарообнаружения @ru
label: 火災偵測裝置 @zh-hant
label: 火災探知機 @ja
label: 火灾探测装置 @zh
label: 화재 감지 기기 제조업 @ko
definition: This segment includes companies that manufacture fire detection systems, such as smoke detectors.
notation: 171012101310
valid from: 2024-06-07

Security Systems
type: BicsLevel6Segment
type: Classifier
type: NamedIndividual
is level6 segment of: Security Devices
is contemporary version of: http://data.ga-group.nl/ics/bics/171012101311
is version of: http://data.ga-group.nl/ics/bics/171012101311
replaces: http://data.ga-group.nl/ics/bics/2020/171012101311
imported on: 2026-06-08T13:40:52.236Z
last refreshed on: 2026-06-08T13:41:38.450Z
source accessed on: 2024-06-05T14:42:36Z
source last accessed on: 2024-06-05T14:42:36Z
label: Sicherheitssysteme @de
label: Sistemas de segurança @pt
label: Sistemas de seguridad @es
label: Sistemi sicurezza @it
label: Systèmes de sécurité @fr
label: Системы безопасности @ru
label: 安全系統 @zh-hant
label: 安全系统 @zh
label: 보안 시스템 제조업 @ko
label: ｾｷｭﾘﾃｨ･ｼｽﾃﾑ @ja
definition: This segment includes companies that manufacture security systems designed to detect intruders or burglars. Such systems include motion detectors, or devices that recognize and respond to the opening of a door or window. They also include after-market car alarm systems.
notation: 171012101311
valid from: 2024-06-07

Security Devices
type: BicsLevel5Segment
type: Classifier
type: NamedIndividual
is level5 segment of: Comml & Res Bldg Equip & Sys
is contemporary version of: http://data.ga-group.nl/ics/bics/1710121013
is version of: http://data.ga-group.nl/ics/bics/1710121013
replaces: http://data.ga-group.nl/ics/bics/2020/1710121013
imported on: 2026-06-08T13:40:52.236Z
last refreshed on: 2026-06-08T13:41:38.450Z
source accessed on: 2024-06-05T14:42:36Z
source last accessed on: 2024-06-05T14:42:36Z
label: Dispositifs de sécurité @fr
label: Dispositivi sicurezza @it
label: Dispositivos de segurança @pt
label: Dispositivos de seguridad @es
label: Sicherheitsgeräte @de
label: Приборы безопасности @ru
label: 安全装置 @zh
label: 安全裝置 @zh-hant
label: 防犯装置 @ja
label: 보안장치 제조업 @ko
definition: This segment includes companies that manufacture security devices, such as motion sensors and fire detectors.
notation: 1710121013
valid from: 2024-06-07

Electric Vehicle Supply Equip
type: BicsLevel5Segment
type: Classifier
type: NamedIndividual
is level5 segment of: Comml & Res Bldg Equip & Sys
is contemporary version of: http://data.ga-group.nl/ics/bics/1710121014
is version of: http://data.ga-group.nl/ics/bics/1710121014
imported on: 2026-06-08T13:40:52.236Z
last refreshed on: 2026-06-08T13:41:38.450Z
source accessed on: 2024-06-05T14:42:36Z
source last accessed on: 2024-06-05T14:42:36Z
label: Attrez per la fornitura di veicoli elettrici @it
label: EVSE @de
label: Equipamentos para abastecimento de veículos elétricos @pt
label: Equipo de suministro para vehículos eléctricos @es
label: Matériel approv pr véhicules électriques @fr
label: Оборудование для энергоснабжения электромобилей @ru
label: 电动汽车供电设备 @zh
label: 電動車供應設備 @zh-hant
label: 電気自動車用供給機器 @ja
label: 전기차 공급장비 @ko
definition: This segment includes companies that manufacture equipment used to supply electricity to electric vehicles.
notation: 1710121014
valid from: 2024-06-07

Comml & Res Bldg Equip & Sys
type: BicsLevel4SubIndustry
type: Classifier
type: NamedIndividual
is sub industry of: Electrical Equipment
is contemporary version of: http://data.ga-group.nl/ics/bics/17101210
is version of: http://data.ga-group.nl/ics/bics/17101210
replaces: http://data.ga-group.nl/ics/bics/2020/17101210
imported on: 2026-06-08T13:40:52.236Z
last refreshed on: 2026-06-08T13:41:38.450Z
source accessed on: 2024-06-05T14:42:36Z
source last accessed on: 2024-06-05T14:42:36Z
label: Eq y sist const com y res @es
label: Equip e sist constr res e com @pt
label: Gewerbl. & Private Gebäudeausrüstung & -systeme @de
label: Sis e app edifici comm e resid @it
label: Syst/éq constr commerc/résid @fr
label: Оборуд. и системы для зданий @ru
label: Оборуд. и системы ��ля зданий @ru
label: 商业与住宅建筑设备与系统 @zh
label: 商業住宅建築設備及系統 @zh-hant
label: 商業ﾋﾞﾙ･ﾏﾝｼｮﾝ用設備･ｼｽﾃﾑ @ja
label: 상업 & 주거용 건물 장비 & 시스템 @ko
definition: This industry subgroup includes companies that manufacture non-structural commercial and residential building equipment, such as HVAC systems, elevators, and security devices.
notation: 17101210
valid from: 2024-06-07

Electric Power Generators
type: BicsLevel6Segment
type: Classifier
type: NamedIndividual
is level6 segment of: Power Generation Equipment
is contemporary version of: http://data.ga-group.nl/ics/bics/171012111010
is version of: http://data.ga-group.nl/ics/bics/171012111010
replaces: http://data.ga-group.nl/ics/bics/2020/171012111010
imported on: 2026-06-08T13:40:52.236Z
last refreshed on: 2026-06-08T13:41:38.450Z
source accessed on: 2024-06-05T14:42:36Z
source last accessed on: 2024-06-05T14:42:36Z
label: Elektrische Stromgeneratoren @de
label: Generatori energia elettrica @it
label: Geradores de energia elétrica @pt
label: Groupes électrogènes @fr
label: Plantas eléctricas @es
label: Генераторы электроэнергии @ru
label: 电力发电机 @zh
label: 発電機 @ja
label: 電力發電機 @zh-hant
label: 전력 발전기 @ko
definition: This segment includes companies that manufacture electricity generators that utilize fossil fuels for power. Excludes electricity generators made for exclusive use with renewable energy sources. Includes stationary and portable generators.
notation: 171012111010
valid from: 2024-06-07

Nuclear Power Gen Equip & Sys
type: BicsLevel6Segment
type: Classifier
type: NamedIndividual
is level6 segment of: Power Generation Equipment
is contemporary version of: http://data.ga-group.nl/ics/bics/171012111011
is version of: http://data.ga-group.nl/ics/bics/171012111011
replaces: http://data.ga-group.nl/ics/bics/2020/171012111011
imported on: 2026-06-08T13:40:52.236Z
last refreshed on: 2026-06-08T13:41:38.450Z
source accessed on: 2024-06-05T14:42:36Z
source last accessed on: 2024-06-05T14:42:36Z
label: Ausstattung & Systeme für Kernkraftgewinnung @de
label: Equip e sist equip ger energia nuclear @pt
label: Equipo y sistemas de generación elec nuclear @es
label: Sis e app gen energia nucleare @it
label: Syst/équip gén d'électricité nucléaire @fr
label: Выработка атомн. энергии, оборуд. и системы @ru
label: 原子力発電設備･ｼｽﾃﾑ @ja
label: 核能发电设备与系统 @zh
label: 核能發電設備及系統 @zh-hant
label: 원자력 발전 장비 & 시스템 @ko
definition: This segment includes companies that produce nuclear power generation equipment and systems.
notation: 171012111011
valid from: 2024-06-07

Power Boiler & Heat Exchangers
type: BicsLevel6Segment
type: Classifier
type: NamedIndividual
is level6 segment of: Power Generation Equipment
is contemporary version of: http://data.ga-group.nl/ics/bics/171012111012
is version of: http://data.ga-group.nl/ics/bics/171012111012
replaces: http://data.ga-group.nl/ics/bics/2020/171012111012
imported on: 2026-06-08T13:40:52.236Z
last refreshed on: 2026-06-08T13:41:38.450Z
source accessed on: 2024-06-05T14:42:36Z
source last accessed on: 2024-06-05T14:42:36Z
label: Caldaie e scambiatori di calore @it
label: Caldeira elétrica e permutador de calor @pt
label: Calderas industriales @es
label: Chaudières et échangeurs de chaleur @fr
label: Dampferzeuger & Wärmeaustauscher @de
label: Энергет. котлы и радиаторы @ru
label: 動力鍋爐及熱傳導器 @zh-hant
label: 発電ﾎﾞｲﾗｰ･熱交換器 @ja
label: 锅炉与热交换器 @zh
label: 동력용 보일러 및 열교환기 @ko
definition: This segment includes companies that manufacture equipment used for the production and/or dissemination of steam for the purpose of building heating or electricity generation. Excludes companies that make steam generators (see Turbine Generators).
notation: 171012111012
valid from: 2024-06-07

Turbine Generators
type: BicsLevel6Segment
type: Classifier
type: NamedIndividual
is level6 segment of: Power Generation Equipment
is contemporary version of: http://data.ga-group.nl/ics/bics/171012111013
is version of: http://data.ga-group.nl/ics/bics/171012111013
replaces: http://data.ga-group.nl/ics/bics/2020/171012111013
imported on: 2026-06-08T13:40:52.236Z
last refreshed on: 2026-06-08T13:41:38.450Z
source accessed on: 2024-06-05T14:42:36Z
source last accessed on: 2024-06-05T14:42:36Z
label: Générateurs à turbines @fr
label: Generadores de turbina @es
label: Generatori turbine @it
label: Geradores de turbina @pt
label: Turbinengeneratoren @de
label: Турбогенераторы @ru
label: 渦輪發電機 @zh-hant
label: 风机发电机 @zh
label: 风机发���机 @zh
label: 터빈 발전기 @ko
label: ﾀｰﾋﾞﾝ発電機 @ja
definition: This segment includes companies that manufacture turbines and turbine generator sets. Includes steam turbines and gas turbines. Excludes turbines used in renewable energy applications.
notation: 171012111013
valid from: 2024-06-07

Power Gen Equip Parts & Svcs
type: BicsLevel6Segment
type: Classifier
type: NamedIndividual
is level6 segment of: Power Generation Equipment
is contemporary version of: http://data.ga-group.nl/ics/bics/171012111014
is version of: http://data.ga-group.nl/ics/bics/171012111014
replaces: http://data.ga-group.nl/ics/bics/2020/171012111014
imported on: 2026-06-08T13:40:52.236Z
last refreshed on: 2026-06-08T13:41:38.450Z
source accessed on: 2024-06-05T14:42:36Z
source last accessed on: 2024-06-05T14:42:36Z
label: Partes de equipo de generación eléctrica y servicios @es
label: Pièces/serv équip prod d'électricité @fr
label: Serv e parti app gen energia @it
label: Serv e peças equipamento de ger energia @pt
label: Stromerzeugungsausrüstung, -teile & -dienste @de
label: Оборуд. д/выраб. электроэн., запчасти @ru
label: 发电设备零部件与服务 @zh
label: 発電機器部品･ｻｰﾋﾞｽ @ja
label: 發電設備零件及服務 @zh-hant
label: 전력 발전 장비 부품 & 서비스 @ko
definition: This segment includes companies that provide parts and aftermarket services for power generation equipment. Includes maintenance services and manufacturing of spare parts and aftermarket consumables.
notation: 171012111014
valid from: 2024-06-07

Power Generation Equipment
type: BicsLevel5Segment
type: Classifier
type: NamedIndividual
is level5 segment of: Electrical Power Equipment
is contemporary version of: http://data.ga-group.nl/ics/bics/1710121110
is version of: http://data.ga-group.nl/ics/bics/1710121110
replaces: http://data.ga-group.nl/ics/bics/2020/1710121110
imported on: 2026-06-08T13:40:52.236Z
last refreshed on: 2026-06-08T13:41:38.450Z
source accessed on: 2024-06-05T14:42:36Z
source last accessed on: 2024-06-05T14:42:36Z
label: App gen energia @it
label: Eq gener elec @es
label: Equip ger energia @pt
label: Equipements de génération d'électricité @fr
label: Stromerzeugungsgeräte @de
label: Оборуд. для пр-ва электрич. @ru
label: 发电设备 @zh
label: 発電設備 @ja
label: 發電設備 @zh-hant
label: 전력발전기기 @ko
definition: This segment includes companies that manufacture equipment used in both primary and secondary power generation.
notation: 1710121110
valid from: 2024-06-07

Power Automation Equipment
type: BicsLevel6Segment
type: Classifier
type: NamedIndividual
is level6 segment of: Power Trans & Distr Equip
is contemporary version of: http://data.ga-group.nl/ics/bics/171012111110
is version of: http://data.ga-group.nl/ics/bics/171012111110
replaces: http://data.ga-group.nl/ics/bics/2020/171012111110
imported on: 2026-06-08T13:40:52.236Z
last refreshed on: 2026-06-08T13:41:38.450Z
source accessed on: 2024-06-05T14:42:36Z
source last accessed on: 2024-06-05T14:42:36Z
label: Apparecchiature generazione energia @it
label: Equipamento de automação de energia @pt
label: Equipements d'automatisation d'électricité @fr
label: Equipo automáticos eléctricos @es
label: Stromautomatisierungsausrüstung @de
label: Оборуд. д/электропередачи @ru
label: 电力自动化设备 @zh
label: 電力自動化機器 @ja
label: 電力自動化設備 @zh-hant
label: 전력 자동화 장비 @ko
definition: This segment includes companies that manufacture power automation equipment or systems utilized in power generation facilities or their networks.
notation: 171012111110
valid from: 2024-06-07

Switchgear, Transformer & Other
type: BicsLevel6Segment
type: Classifier
type: NamedIndividual
is level6 segment of: Power Trans & Distr Equip
is contemporary version of: http://data.ga-group.nl/ics/bics/171012111111
is version of: http://data.ga-group.nl/ics/bics/171012111111
replaces: http://data.ga-group.nl/ics/bics/2020/171012111111
imported on: 2026-06-08T13:40:52.236Z
last refreshed on: 2026-06-08T13:41:38.450Z
source accessed on: 2024-06-05T14:42:36Z
source last accessed on: 2024-06-05T14:42:36Z
label: Aparamenta, transformadores y otros @es
label: App. comm., transfo et autres @fr
label: Comutadores, transformador e outros @pt
label: Interruttori, trasformatori, altro @it
label: Schaltanlagen, Transformatoren & Sonstiges @de
label: Распред. аппаратура, трансформ. и др @ru
label: 开关设备、变压器及其他 @zh
label: 輸電及配電零組件 @zh-hant
label: 開閉装置･変圧器･その他 @ja
label: 개폐기, 변압기 & 기타 @ko
definition: This segment includes companies that manufacture electrical equipment primarily used within utility transmission and distribution networks such as transformers, and switchgear apparatus.
notation: 171012111111
valid from: 2024-06-07

Electric Power Grid Parts & Svcs
type: BicsLevel6Segment
type: Classifier
type: NamedIndividual
is level6 segment of: Power Trans & Distr Equip
is contemporary version of: http://data.ga-group.nl/ics/bics/171012111112
is version of: http://data.ga-group.nl/ics/bics/171012111112
replaces: http://data.ga-group.nl/ics/bics/2020/171012111112
imported on: 2026-06-08T13:40:52.236Z
last refreshed on: 2026-06-08T13:41:38.450Z
source accessed on: 2024-06-05T14:42:36Z
source last accessed on: 2024-06-05T14:42:36Z
label: Elektrische Stromnetzteile & -dienste @de
label: Pièces pour réseaux électriques et services @fr
label: Serv e parti rete energia elettrica @it
label: Serv e peças grau energia elétrica @pt
label: Servicios y partes red eléctricas @es
label: Электросеть, обслуж./запчасти @ru
label: 电网零部件与服务 @zh
label: 電力ｸﾞﾘｯﾄﾞ部品･ｻｰﾋﾞｽ @ja
label: 電網零件及服務 @zh-hant
label: 전기 전력 그리드 부품 & 서비스 @ko
definition: This segment includes companies that provide parts and aftermarket services for power transmission, distribution and automation equipment. Includes maintenance services and manufacturing of spare parts and aftermarket consumables.
notation: 171012111112
valid from: 2024-06-07

Power Trans & Distr Equip
type: BicsLevel5Segment
type: Classifier
type: NamedIndividual
is level5 segment of: Electrical Power Equipment
is contemporary version of: http://data.ga-group.nl/ics/bics/1710121111
is version of: http://data.ga-group.nl/ics/bics/1710121111
replaces: http://data.ga-group.nl/ics/bics/2020/1710121111
imported on: 2026-06-08T13:40:52.236Z
last refreshed on: 2026-06-08T13:41:38.450Z
source accessed on: 2024-06-05T14:42:36Z
source last accessed on: 2024-06-05T14:42:36Z
label: App distrib e trasp energia @it
label: Equip trans e dist de energia @pt
label: Equip trans et distrib d'électricité @fr
label: Equipo de transporte eléctrico y distribución @es
label: Stromübertragungs & -verteilungsausrüstung @de
label: Оборуд. д/электропер., распред. @ru
label: 电力输送与配送设备 @zh
label: 輸配電設備 @zh-hant
label: 送電･配電設備 @ja
label: 전력 송전 & 배전 장비 @ko
definition: This segment includes companies that manufacture equipment utilized in the transmission and distribution of power. This equipment is primarily used in electricity infrastructure.
notation: 1710121111
valid from: 2024-06-07

Electrical Power Equipment
type: BicsLevel4SubIndustry
type: Classifier
type: NamedIndividual
is sub industry of: Electrical Equipment
is contemporary version of: http://data.ga-group.nl/ics/bics/17101211
is version of: http://data.ga-group.nl/ics/bics/17101211
replaces: http://data.ga-group.nl/ics/bics/2020/17101211
imported on: 2026-06-08T13:40:52.236Z
last refreshed on: 2026-06-08T13:41:38.450Z
source accessed on: 2024-06-05T14:42:36Z
source last accessed on: 2024-06-05T14:42:36Z
label: App energia elettrica @it
label: Elektrische Stromgeräte @de
label: Equipamento de energia elétrica @pt
label: Equipements pour électricité @fr
label: Equipo de energía eléctrica @es
label: Силовое электрооборудование @ru
label: 电力设备 @zh
label: 電力設備 @ja
label: 전력 기기 @ko
definition: This industry subgroup includes companies that manufacture equipment used in the generation and distribution of electricity.
notation: 17101211
valid from: 2024-06-07

Manufacturing Auto Controls
type: BicsLevel5Segment
type: Classifier
type: NamedIndividual
is level5 segment of: Industrial Automation Controls
is contemporary version of: http://data.ga-group.nl/ics/bics/1710121210
is version of: http://data.ga-group.nl/ics/bics/1710121210
replaces: http://data.ga-group.nl/ics/bics/2020/1710121210
imported on: 2026-06-08T13:40:52.236Z
last refreshed on: 2026-06-08T13:41:38.450Z
source accessed on: 2024-06-05T14:42:36Z
source last accessed on: 2024-06-05T14:42:36Z
label: Automatisierungskontrolle @de
label: Contrôles d'automatisation manufacturière @fr
label: Controles de fabricación automatizada @es
label: Fabricação de controles auto @pt
label: Produzione controlli auto @it
label: Средства автоматизации производства @ru
label: 制造自动化控制 @zh
label: 製造業自動控制 @zh-hant
label: 製造自動化制御 @ja
label: 자동화 관리 @ko
definition: This segment includes companies that manufacture systems and devices used to automate, monitor, and optimize manufacturing. Excludes automation controls directly involved in manufacturing of goods (see Factory Automation Equipment).
notation: 1710121210
valid from: 2024-06-07

Process Automation Controls
type: BicsLevel5Segment
type: Classifier
type: NamedIndividual
is level5 segment of: Industrial Automation Controls
is contemporary version of: http://data.ga-group.nl/ics/bics/1710121211
is version of: http://data.ga-group.nl/ics/bics/1710121211
replaces: http://data.ga-group.nl/ics/bics/2020/1710121211
imported on: 2026-06-08T13:40:52.236Z
last refreshed on: 2026-06-08T13:41:38.450Z
source accessed on: 2024-06-05T14:42:36Z
source last accessed on: 2024-06-05T14:42:36Z
label: Contrôles d'automatisation de processus @fr
label: Control de proceso automatizado @es
label: Elaboraz contrl autom @it
label: Processo controle de automação @pt
label: Prozessautomatisierungskontrollen @de
label: Автоматизация процесса @ru
label: 加工业自动控制 @zh
label: 工程自動化制御 @ja
label: 製程自動控制 @zh-hant
label: 공정 자동화 관리 @ko
definition: This segment includes companies that manufacture systems and devices used to automate, monitor, and optimize non-manufacturing industrial processes. These processes include oil and gas, chemical, mining and other non-manufacturing processes.
notation: 1710121211
valid from: 2024-06-07

Industrial Automation Controls
type: BicsLevel4SubIndustry
type: Classifier
type: NamedIndividual
is sub industry of: Electrical Equipment
is contemporary version of: http://data.ga-group.nl/ics/bics/17101212
is version of: http://data.ga-group.nl/ics/bics/17101212
replaces: http://data.ga-group.nl/ics/bics/2020/17101212
imported on: 2026-06-08T13:40:52.236Z
last refreshed on: 2026-06-08T13:41:38.450Z
source accessed on: 2024-06-05T14:42:36Z
source last accessed on: 2024-06-05T14:42:36Z
label: Contrôles d'automatis indust @fr
label: Control automatizado industrial @es
label: Controles de automação industrial @pt
label: Controlli automatizzazione industriale @it
label: Industrielle Automatisierungskontrollen @de
label: Средства автоматизации пром. производства @ru
label: 工业自动化控制 @zh
label: 工業自動控制 @zh-hant
label: 産業自動化制御 @ja
label: 산업 자동화 관리 @ko
label: 산�� 자동화 관리 @ko
definition: This industry subgroup includes companies that manufacture systems and devices used to automate, monitor, and optimize various processes such as controllers, sensors, switches, and software.
notation: 17101212
valid from: 2024-06-07

Elec Measuring Instruments
type: BicsLevel5Segment
type: Classifier
type: NamedIndividual
is level5 segment of: Measurement Instruments
is contemporary version of: http://data.ga-group.nl/ics/bics/1710121310
is version of: http://data.ga-group.nl/ics/bics/1710121310
replaces: http://data.ga-group.nl/ics/bics/2020/1710121310
imported on: 2026-06-08T13:40:52.236Z
last refreshed on: 2026-06-08T13:41:38.450Z
source accessed on: 2024-06-05T14:42:36Z
source last accessed on: 2024-06-05T14:42:36Z
label: Elektrische Messinstrumente @de
label: Instrumentos de medição elétrica @pt
label: Instrumentos eléctricos de medición @es
label: Instruments de mesure élec @fr
label: Strumenti misurazione elett @it
label: Счетчики измерения электрич. @ru
label: 电动测量仪器 @zh
label: 電機檢測儀器 @zh-hant
label: 電気計測器 @ja
label: 전기계측기 @ko
definition: This segment includes companies that manufacture instruments used to measure and test the characteristics of electricity and electrical systems. Such instruments include circuit and continuity testers, voltmeters, and watt meters.
notation: 1710121310
valid from: 2024-06-07

Fluid Meter & Counting Devices
type: BicsLevel5Segment
type: Classifier
type: NamedIndividual
is level5 segment of: Measurement Instruments
is contemporary version of: http://data.ga-group.nl/ics/bics/1710121311
is version of: http://data.ga-group.nl/ics/bics/1710121311
replaces: http://data.ga-group.nl/ics/bics/2020/1710121311
imported on: 2026-06-08T13:40:52.236Z
last refreshed on: 2026-06-08T13:41:38.450Z
source accessed on: 2024-06-05T14:42:36Z
source last accessed on: 2024-06-05T14:42:36Z
label: Compteurs pour fluides/dispositifs de comptage @fr
label: Contatori fluidi e dispositivi conteggio @it
label: Dispositivos de medição de pressão e contagem @pt
label: Dispositivos de medida líquidos @es
label: Flüssigkeitsmesser & Zählgeräte @de
label: Измер. приборы и счетч. для жидкостей @ru
label: Измер. прибор�� и счетч. для жидкостей @ru
label: 流量表与计量装置 @zh
label: 流量計･計量装置 @ja
label: 液體儀表及計數儀器 @zh-hant
label: 유량계&계량장치 @ko
label: 유량계&���량장치 @ko
definition: This segment includes companies that manufacture devices used to count and register variables, such as gas and water consumption.
notation: 1710121311
valid from: 2024-06-07

Measuring & Control Devices
type: BicsLevel5Segment
type: Classifier
type: NamedIndividual
is level5 segment of: Measurement Instruments
is contemporary version of: http://data.ga-group.nl/ics/bics/1710121312
is version of: http://data.ga-group.nl/ics/bics/1710121312
replaces: http://data.ga-group.nl/ics/bics/2020/1710121312
imported on: 2026-06-08T13:40:52.236Z
last refreshed on: 2026-06-08T13:41:38.450Z
source accessed on: 2024-06-05T14:42:36Z
source last accessed on: 2024-06-05T14:42:36Z
label: Appareils de mesure et contrôle @fr
label: Dispositivi controllo e misurazione @it
label: Dispositivos de medição e controle @pt
label: Dispositivos de medida y control @es
label: Mess- & Kontrollgeräte @de
label: Измер. и регулирующ. устройства @ru
label: 测量与控制装置 @zh
label: 測定･制御装置 @ja
label: 量測及控制設備 @zh-hant
label: 계측&제어장치 @ko
definition: This segment includes companies that manufacture instruments and related devices for measuring, displaying, indicating, recording, transmitting, and controlling industrial process variables.
notation: 1710121312
valid from: 2024-06-07

Measurement Instruments
type: BicsLevel4SubIndustry
type: Classifier
type: NamedIndividual
is sub industry of: Electrical Equipment
is contemporary version of: http://data.ga-group.nl/ics/bics/17101213
is version of: http://data.ga-group.nl/ics/bics/17101213
replaces: http://data.ga-group.nl/ics/bics/2020/17101213
imported on: 2026-06-08T13:40:52.236Z
last refreshed on: 2026-06-08T13:41:38.450Z
source accessed on: 2024-06-05T14:42:36Z
source last accessed on: 2024-06-05T14:42:36Z
label: Inst de medição @pt
label: Instrum medida @es
label: Instruments de mesure @fr
label: Messinstrumente @de
label: Strum misurazione @it
label: Измерит. инструменты @ru
label: 测量仪 @zh
label: 測定器 @ja
label: 測量儀 @zh-hant
label: 측량도구 @ko
definition: This industry subgroup includes companies that design or manufacture devices used to test, measure, and analyze processes and environmental conditions.
notation: 17101213
valid from: 2024-06-07

Electronic Coil
type: BicsLevel5Segment
type: Classifier
type: NamedIndividual
is level5 segment of: Electrical Components
is contemporary version of: http://data.ga-group.nl/ics/bics/1710121410
is version of: http://data.ga-group.nl/ics/bics/1710121410
replaces: http://data.ga-group.nl/ics/bics/2020/1710121410
imported on: 2026-06-08T13:40:52.236Z
last refreshed on: 2026-06-08T13:41:38.450Z
source accessed on: 2024-06-05T14:42:36Z
source last accessed on: 2024-06-05T14:42:36Z
label: Bobina eletrônica @pt
label: Bobinas electrónicas @es
label: Bobine elettroniche @it
label: Elektronische Spulen @de
label: Serpentins électroniques @fr
label: Электронные катушки @ru
label: 电子线圈 @zh
label: 電子線圈 @zh-hant
label: 電子ｺｲﾙ @ja
label: 전자코일제조업 @ko
definition: This segment includes companies that manufacture electronic inductors, such as coils and transformers. Excludes electronic coils for power transmission or distribution (see Power Trans & Distr Components).
notation: 1710121410
valid from: 2024-06-07

Electronic Connectors
type: BicsLevel5Segment
type: Classifier
type: NamedIndividual
is level5 segment of: Electrical Components
is contemporary version of: http://data.ga-group.nl/ics/bics/1710121411
is version of: http://data.ga-group.nl/ics/bics/1710121411
replaces: http://data.ga-group.nl/ics/bics/2020/1710121411
imported on: 2026-06-08T13:40:52.236Z
last refreshed on: 2026-06-08T13:41:38.450Z
source accessed on: 2024-06-05T14:42:36Z
source last accessed on: 2024-06-05T14:42:36Z
label: Conectores electrónicos @es
label: Conectores eletrônicos @pt
label: Connecteurs électroniques @fr
label: Connettori elettronici @it
label: Elektronische Anschlussteile @de
label: Электронные коннекторы @ru
label: 电子连接器 @zh
label: 電子連接器 @zh-hant
label: 電子ｺﾈｸﾀｰ @ja
label: 전자접속기제조업 @ko
definition: This segment includes companies that manufacture electronic connectors.
notation: 1710121411
valid from: 2024-06-07

Industrial Electronics Equip
type: BicsLevel5Segment
type: Classifier
type: NamedIndividual
is level5 segment of: Electrical Components
is contemporary version of: http://data.ga-group.nl/ics/bics/1710121412
is version of: http://data.ga-group.nl/ics/bics/1710121412
replaces: http://data.ga-group.nl/ics/bics/2020/1710121412
imported on: 2026-06-08T13:40:52.236Z
last refreshed on: 2026-06-08T13:41:38.450Z
source accessed on: 2024-06-05T14:42:36Z
source last accessed on: 2024-06-05T14:42:36Z
label: Cap investiti elettr p/indus @it
label: Equipamento industrial eletrônico @pt
label: Equipo electrónico industrial @es
label: Industrieelektronikgeräte @de
label: Matériel électronique industriel @fr
label: Промышл. электроника - оборудование @ru
label: 工业电子资本设备 @zh
label: 工業電子設備 @zh-hant
label: 産業用電子機器 @ja
label: 산업전자설비 @ko
definition: This segment includes companies that manufacture electronics equipment and components used in industrial applications, as opposed to technological or communication applications. For these latter applications, see the categories under Technology Hardware.
notation: 1710121412
valid from: 2024-06-07

Wire & Cable
type: BicsLevel5Segment
type: Classifier
type: NamedIndividual
is level5 segment of: Electrical Components
is contemporary version of: http://data.ga-group.nl/ics/bics/1710121413
is version of: http://data.ga-group.nl/ics/bics/1710121413
replaces: http://data.ga-group.nl/ics/bics/2020/1710121413
imported on: 2026-06-08T13:40:52.236Z
last refreshed on: 2026-06-08T13:41:38.450Z
source accessed on: 2024-06-05T14:42:36Z
source last accessed on: 2024-06-05T14:42:36Z
label: Alambre y cableado @es
label: Draht und Kabel @de
label: Fiação e cabo @pt
label: Fili e cavi @it
label: Fils et câbles @fr
label: Проводы и кабели @ru
label: 电线和电缆 @zh
label: 電線及電纜 @zh-hant
label: 전선 및 케이블 @ko
label: ﾜｲﾔ･ｹｰﾌﾞﾙ @ja
definition: This segment includes companies that manufacture current-carrying wiring and cable. Excludes fiber optic cables utilized for telecommunication (see Fiber Optic Equipment).
notation: 1710121413
valid from: 2024-06-07

Electrical Components
type: BicsLevel4SubIndustry
type: Classifier
type: NamedIndividual
is sub industry of: Electrical Equipment
is contemporary version of: http://data.ga-group.nl/ics/bics/17101214
is version of: http://data.ga-group.nl/ics/bics/17101214
replaces: http://data.ga-group.nl/ics/bics/2020/17101214
imported on: 2026-06-08T13:40:52.236Z
last refreshed on: 2026-06-08T13:41:38.450Z
source accessed on: 2024-06-05T14:42:36Z
source last accessed on: 2024-06-05T14:42:36Z
label: Comp elétricos @pt
label: Componenti elettriche @it
label: Composants électriques @fr
label: Comps eléctricos @es
label: Elektrische Komponenten @de
label: Электрические детали @ru
label: 电器元件 @zh
label: 電機零件 @zh-hant
label: 電気部品 @ja
label: 전기부품 @ko
definition: This industry subgroup includes companies that manufacture electrical components used for electrical equipment. Includes coils, electrical motors, wires, and cables. Excludes electrical components used for technology hardware (see Electronics Component).
notation: 17101214
valid from: 2024-06-07

Electrical Equipment
type: BicsLevel3Industry
type: Classifier
type: NamedIndividual
is industry of: Industrial Products
is contemporary version of: http://data.ga-group.nl/ics/bics/171012
is version of: http://data.ga-group.nl/ics/bics/171012
replaces: http://data.ga-group.nl/ics/bics/2020/171012
imported on: 2026-06-08T13:40:52.236Z
last refreshed on: 2026-06-08T13:41:38.450Z
source accessed on: 2024-06-05T14:42:36Z
source last accessed on: 2024-06-05T14:42:36Z
label: Apparecchiature elettriche @it
label: Elektrische Geräte @de
label: Equipo eléctrico @es
label: Equiptos Elétricos @pt
label: Matériel électrique @fr
label: Электрооборудование @ru
label: 电气设备 @zh
label: 電機設備 @zh-hant
label: 電気機器 @ja
label: 전기장비 @ko
definition: This industry includes companies that manufacture electric powered equipment used in industrial applications other than manufacturing. Includes equipment installed in buildings and equipment used in the electricity grid.
notation: 171012
valid from: 2024-06-07

Farm Tractors & Field Machinery
type: BicsLevel6Segment
type: Classifier
type: NamedIndividual
is level6 segment of: Farm Machinery & Equipment
is contemporary version of: http://data.ga-group.nl/ics/bics/171013101010
is version of: http://data.ga-group.nl/ics/bics/171013101010
replaces: http://data.ga-group.nl/ics/bics/2020/171013101010
imported on: 2026-06-08T13:40:52.236Z
last refreshed on: 2026-06-08T13:41:38.450Z
source accessed on: 2024-06-05T14:42:36Z
source last accessed on: 2024-06-05T14:42:36Z
label: Ackerschlepper & Feldmaschinen @de
label: Tracteurs/machines agricoles @fr
label: Tractores y maquinaria agrícola @es
label: Tratores agrícolas e maquinário de campo @pt
label: Trattori e macchinari agricoli @it
label: С/х тракторы и машины @ru
label: 农用拖拉机与田间作业机械 @zh
label: 農業曳引車及農具機 @zh-hant
label: 農業曳引車及農��機 @zh-hant
label: 農業ﾄﾗｸﾀｰ･耕作機械 @ja
label: 농업용 트랙터 & 농경지용 기계 @ko
definition: This segment includes companies that manufacture utility tractors, small and large row crop tractors, self-propelled combines, and hay equipment.
notation: 171013101010
valid from: 2024-06-07

Implement & Irrigation Equip
type: BicsLevel6Segment
type: Classifier
type: NamedIndividual
is level6 segment of: Farm Machinery & Equipment
is contemporary version of: http://data.ga-group.nl/ics/bics/171013101011
is version of: http://data.ga-group.nl/ics/bics/171013101011
replaces: http://data.ga-group.nl/ics/bics/2020/171013101011
imported on: 2026-06-08T13:40:52.236Z
last refreshed on: 2026-06-08T13:41:38.450Z
source accessed on: 2024-06-05T14:42:36Z
source last accessed on: 2024-06-05T14:42:36Z
label: Attuazione e equipagg irrigazione @it
label: Equipamento de irrigação e implemento @pt
label: Equipo de aplicación e irrigación @es
label: Implementierungs- & Irrigationsausrüstung @de
label: Outils et équipements d'irrigation @fr
label: Ирригационное оборудование @ru
label: 实施与灌溉设备 @zh
label: 用具･灌漑設備 @ja
label: 農具及灌溉設備 @zh-hant
label: 기구 & 관개 장비 @ko
definition: This segment includes companies that manufacture accessories attached to tractors to perform duties such as tilling, planting, clearing, etc. Such accessories can be pulled or pushed depending on application and type.
notation: 171013101011
valid from: 2024-06-07

Farm Machinery & Equipment
type: BicsLevel5Segment
type: Classifier
type: NamedIndividual
is level5 segment of: Agricultural Machinery
is contemporary version of: http://data.ga-group.nl/ics/bics/1710131010
is version of: http://data.ga-group.nl/ics/bics/1710131010
replaces: http://data.ga-group.nl/ics/bics/2020/1710131010
imported on: 2026-06-08T13:40:52.236Z
last refreshed on: 2026-06-08T13:41:38.450Z
source accessed on: 2024-06-05T14:42:36Z
source last accessed on: 2024-06-05T14:42:36Z
label: Farmmaschinen & -zubehör @de
label: Macchinari e attrezzature agricole @it
label: Machines et équipements agricoles @fr
label: Maquinário e equipamentos agrícolas @pt
label: Maquinaria y equipo agrícola @es
label: Сельскохозяйственная техника и оборуд. @ru
label: 农用机械与设备 @zh
label: 農業機械設備 @zh-hant
label: 農業機械･農機具 @ja
label: 농기계&장비 @ko
definition: This segment includes companies that manufacture farm tractors and other farm equipment.
notation: 1710131010
valid from: 2024-06-07

Home Lawn & Garden Equipment
type: BicsLevel5Segment
type: Classifier
type: NamedIndividual
is level5 segment of: Agricultural Machinery
is contemporary version of: http://data.ga-group.nl/ics/bics/1710131011
is version of: http://data.ga-group.nl/ics/bics/1710131011
replaces: http://data.ga-group.nl/ics/bics/2020/1710131011
imported on: 2026-06-08T13:40:52.236Z
last refreshed on: 2026-06-08T13:41:38.450Z
source accessed on: 2024-06-05T14:42:36Z
source last accessed on: 2024-06-05T14:42:36Z
label: Attrezzi prato e giardino @it
label: Equipamentos de jardinagem doméstica @pt
label: Equipements pelouse et jardinage @fr
label: Equipo de césped y jardinería de vivienda @es
label: Rasenmäher & Gartengeräte @de
label: Оборуд. для дома, газона и сада @ru
label: 住宅用芝刈り機･園芸機器 @ja
label: 園藝用設備 @zh-hant
label: 家用草坪与园艺设备 @zh
label: 잔디 & 정원장비 @ko
definition: This segment includes companies that manufacture equipment used for non-commercial home and landscaping applications. Includes tractors or lawn mowers (under 40 hp), leaf blowers, hedge trimmers, and snow blowers.
notation: 1710131011
valid from: 2024-06-07

Agricultural Mach Parts & Svcs
type: BicsLevel5Segment
type: Classifier
type: NamedIndividual
is level5 segment of: Agricultural Machinery
is contemporary version of: http://data.ga-group.nl/ics/bics/1710131012
is version of: http://data.ga-group.nl/ics/bics/1710131012
replaces: http://data.ga-group.nl/ics/bics/2020/1710131012
imported on: 2026-06-08T13:40:52.236Z
last refreshed on: 2026-06-08T13:41:38.450Z
source accessed on: 2024-06-05T14:42:36Z
source last accessed on: 2024-06-05T14:42:36Z
label: Landwirtschaftsmaschinenteile & Dienste @de
label: Peças e serv maq agrícolas @pt
label: Pièces/serv machines agricoles @fr
label: Serv e parti macc agricoli @it
label: Servicios y partes de maquinaria agrícola @es
label: Обслуж. с/х техники и запчастей @ru
label: 农用机械零部件与服务 @zh
label: 農業機械部品･ｻｰﾋﾞｽ @ja
label: 農業機械零件及服務 @zh-hant
label: 農業機械零件��服務 @zh-hant
label: 농기계 부품 & 서비스 @ko
definition: This segment includes companies that provide parts and aftermarket services for farm machinery and equipment. Includes maintenance services, as well as manufacturing of spare parts and aftermarket consumables.
notation: 1710131012
valid from: 2024-06-07

Agricultural Machinery
type: BicsLevel4SubIndustry
type: Classifier
type: NamedIndividual
is sub industry of: Machinery
is contemporary version of: http://data.ga-group.nl/ics/bics/17101310
is version of: http://data.ga-group.nl/ics/bics/17101310
replaces: http://data.ga-group.nl/ics/bics/2020/17101310
imported on: 2026-06-08T13:40:52.236Z
last refreshed on: 2026-06-08T13:41:38.450Z
source accessed on: 2024-06-05T14:42:36Z
source last accessed on: 2024-06-05T14:42:36Z
label: Landwirtschaftsmaschinen @de
label: Macchinari agricoli @it
label: Machines agricoles @fr
label: Maq agricultura @pt
label: Maquinaria agr @es
label: Сельхозтехника @ru
label: 农用机械 @zh
label: 農業機械 @ja
label: 농기계류 @ko
definition: This industry subgroup includes companies that manufacture agricultural machinery parts, farm machinery and equipment, and home lawn and garden equipment.
notation: 17101310
valid from: 2024-06-07

Construction Machinery
type: BicsLevel5Segment
type: Classifier
type: NamedIndividual
is level5 segment of: Construction & Mining Machinery
is contemporary version of: http://data.ga-group.nl/ics/bics/1710131110
is version of: http://data.ga-group.nl/ics/bics/1710131110
replaces: http://data.ga-group.nl/ics/bics/2020/1710131110
imported on: 2026-06-08T13:40:52.236Z
last refreshed on: 2026-06-08T13:41:38.450Z
source accessed on: 2024-06-05T14:42:36Z
source last accessed on: 2024-06-05T14:42:36Z
label: Baumaschinen @de
label: Macchinari costruzione @it
label: Machines pour la construction @fr
label: Maquinário para construção @pt
label: Maquinaria de construcción @es
label: Строительная техника @ru
label: 建筑机械 @zh
label: 建設機械 @ja
label: 營建業機械 @zh-hant
label: 건설 기계 @ko
definition: This segment includes companies that manufacture construction equipment. Such equipment includes crawler tractors, hydraulic excavators, wheel loaders, rigid and articulated haulers, rubber-tracked loaders, skid steer loaders, loader backhoes, mini excavators, pavers, compactors, motor graders, and cranes.
notation: 1710131110
valid from: 2024-06-07

Mining Material Handling Equip
type: BicsLevel6Segment
type: Classifier
type: NamedIndividual
is level6 segment of: Mining Machinery & Equipment
is contemporary version of: http://data.ga-group.nl/ics/bics/171013111110
is version of: http://data.ga-group.nl/ics/bics/171013111110
replaces: http://data.ga-group.nl/ics/bics/2020/171013111110
imported on: 2026-06-08T13:40:52.236Z
last refreshed on: 2026-06-08T13:41:38.450Z
source accessed on: 2024-06-05T14:42:36Z
source last accessed on: 2024-06-05T14:42:36Z
label: App trattamento mat minerario @it
label: Bergbaumaterialtransportausrüstung @de
label: Equip de manutention de matériel minier @fr
label: Equip manuseio mat mineração @pt
label: Equipo de manejo de materiales mineros @es
label: Погруз.-разгруз. оборуд. для добыв. пром. @ru
label: 礦業物料處理設備製造 @zh-hant
label: 采矿材料处理设备 @zh
label: 鉱業材料運搬機器 @ja
label: 광업 자재 운반 장비 @ko
definition: This segment includes companies that manufacture material handling equipment for the mining, aggregates, and construction industries.
notation: 171013111110
valid from: 2024-06-07

Surface Mining Machinery
type: BicsLevel6Segment
type: Classifier
type: NamedIndividual
is level6 segment of: Mining Machinery & Equipment
is contemporary version of: http://data.ga-group.nl/ics/bics/171013111111
is version of: http://data.ga-group.nl/ics/bics/171013111111
replaces: http://data.ga-group.nl/ics/bics/2020/171013111111
imported on: 2026-06-08T13:40:52.236Z
last refreshed on: 2026-06-08T13:41:38.450Z
source accessed on: 2024-06-05T14:42:36Z
source last accessed on: 2024-06-05T14:42:36Z
label: Macchinari estrazione in superficie @it
label: Machines mines à ciel ouvert @fr
label: Maquinário para mineração da superfície @pt
label: Minería superficial @es
label: Tagebaumaschinen @de
label: Оборуд. для наземной добычи @ru
label: 露天採掘機械 @ja
label: 露天采矿机械 @zh
label: 露天開採機械製造 @zh-hant
label: 露天開���機械製造 @zh-hant
label: 노천탄광용기계 @ko
definition: This segment includes companies that manufacture surface mining machinery. Such machinery includes electric mining shovels, blasthole drills, draglines, and mining trucks.
notation: 171013111111
valid from: 2024-06-07

Underground Mining Machinery
type: BicsLevel6Segment
type: Classifier
type: NamedIndividual
is level6 segment of: Mining Machinery & Equipment
is contemporary version of: http://data.ga-group.nl/ics/bics/171013111112
is version of: http://data.ga-group.nl/ics/bics/171013111112
replaces: http://data.ga-group.nl/ics/bics/2020/171013111112
imported on: 2026-06-08T13:40:52.236Z
last refreshed on: 2026-06-08T13:41:38.450Z
source accessed on: 2024-06-05T14:42:36Z
source last accessed on: 2024-06-05T14:42:36Z
label: Macchinari estrazione sotterranea @it
label: Machines mines souterraine @fr
label: Maquinário para mineração subterrânea @pt
label: Maquinaria de minería subterránea @es
label: Untertagebaumaschinen @de
label: Оборуд. для подземной добычи @ru
label: 地下採掘機械 @ja
label: 地下采矿机械 @zh
label: 地底採礦機械製造 @zh-hant
label: 지하탄광용기계 @ko
definition: This segment includes companies that manufacture underground mining machinery. Such machinery includes draglines, longwall shearers, stage loaders, roof supports, face conveyors, continuous haulage systems, batch haulage vehicles, shovels and excavators, and mining trucks.
notation: 171013111112
valid from: 2024-06-07

Mining Machinery & Equipment
type: BicsLevel5Segment
type: Classifier
type: NamedIndividual
is level5 segment of: Construction & Mining Machinery
is contemporary version of: http://data.ga-group.nl/ics/bics/1710131111
is version of: http://data.ga-group.nl/ics/bics/1710131111
replaces: http://data.ga-group.nl/ics/bics/2020/1710131111
imported on: 2026-06-08T13:40:52.236Z
last refreshed on: 2026-06-08T13:41:38.450Z
source accessed on: 2024-06-05T14:42:36Z
source last accessed on: 2024-06-05T14:42:36Z
label: Bergbaumaschinen & -ausrüstung @de
label: Macchinari e attrezzature minerari @it
label: Machines et équipements mines @fr
label: Maquinário para mineração e equipamentos @pt
label: Maquinaria y equipo de minería @es
label: Горнодоб. техника и оборуд. @ru
label: 礦業機械設備 @zh-hant
label: 采矿机械与设备 @zh
label: 鉱業機械･器具 @ja
label: 채굴기계&장비 @ko
definition: This segment includes companies that manufacture elevators and conveyors for outdoor use, boring and cutting machinery, mortar mixers, and earth movers.
notation: 1710131111
valid from: 2024-06-07

Const & Mining Mach Parts & Svcs
type: BicsLevel5Segment
type: Classifier
type: NamedIndividual
is level5 segment of: Construction & Mining Machinery
is contemporary version of: http://data.ga-group.nl/ics/bics/1710131112
is version of: http://data.ga-group.nl/ics/bics/1710131112
replaces: http://data.ga-group.nl/ics/bics/2020/1710131112
imported on: 2026-06-08T13:40:52.236Z
last refreshed on: 2026-06-08T13:41:38.450Z
source accessed on: 2024-06-05T14:42:36Z
source last accessed on: 2024-06-05T14:42:36Z
label: Bau- & Bergbaumaschinenteile & Dienste @de
label: Peças e serv construção e mineração @pt
label: Pièces/serv mach construction/mines @fr
label: Serv e parti macc costruz e minerario @it
label: Servicios y partes construcción y minería @es
label: Обслуж. и произв. запч. для горнодоб. @ru
label: 建筑与采矿机械零部件与服务 @zh
label: 建設･鉱業機械部品･ｻｰﾋﾞｽ @ja
label: 營建及礦業售後服務及零件 @zh-hant
label: 건설 & 광업 기계 부품 & 서비스 @ko
definition: This segment includes companies that provide parts and aftermarket services for construction and mining machinery. Includes maintenance services, as well as manufacturing of spare parts and aftermarket consumables.
notation: 1710131112
valid from: 2024-06-07

Construction & Mining Machinery
type: BicsLevel4SubIndustry
type: Classifier
type: NamedIndividual
is sub industry of: Machinery
is contemporary version of: http://data.ga-group.nl/ics/bics/17101311
is version of: http://data.ga-group.nl/ics/bics/17101311
replaces: http://data.ga-group.nl/ics/bics/2020/17101311
imported on: 2026-06-08T13:40:52.236Z
last refreshed on: 2026-06-08T13:41:38.450Z
source accessed on: 2024-06-05T14:42:36Z
source last accessed on: 2024-06-05T14:42:36Z
label: Bau- & Bergbaumaschinen @de
label: Macchinari costruz e minerari @it
label: Machines construction/mines @fr
label: Maq construção e mineração @pt
label: Maq de construcción y minería @es
label: Строительные машины @ru
label: 建筑与采矿机械 @zh
label: 建設･鉱業用機械 @ja
label: 營建及礦業機械 @zh-hant
label: 건설 & 광업기계 @ko
definition: This industry subgroup includes companies that manufacture construction and mining machinery and parts. Products include earthmoving equipment, rubber tracked loaders, compact equipment, paving machinery, and cranes.
notation: 17101311
valid from: 2024-06-07

Industrial Engines
type: BicsLevel5Segment
type: Classifier
type: NamedIndividual
is level5 segment of: Engine & Transmission
is contemporary version of: http://data.ga-group.nl/ics/bics/1710131210
is version of: http://data.ga-group.nl/ics/bics/1710131210
replaces: http://data.ga-group.nl/ics/bics/2020/1710131210
imported on: 2026-06-08T13:40:52.236Z
last refreshed on: 2026-06-08T13:41:38.450Z
source accessed on: 2024-06-05T14:42:36Z
source last accessed on: 2024-06-05T14:42:36Z
label: Industriemotoren @de
label: Moteurs industriels @fr
label: Motores industriais @pt
label: Motores industriales @es
label: Motori industriali @it
label: Промышл. двигатели @ru
label: 工业发动机 @zh
label: 工業引擎 @zh-hant
label: 工業用ｴﾝｼﾞﾝ @ja
label: 산업용 엔진 @ko
definition: This segment includes companies that manufacture combustion piston engines for use in industrial engines, such as steam, hydraulic, wind and gas turbines. They may also manufacture engines for marine craft and rail trains. Excludes airplane, vehicle or motorcycle engines.
notation: 1710131210
valid from: 2024-06-07

Power Transmission & Gear
type: BicsLevel5Segment
type: Classifier
type: NamedIndividual
is level5 segment of: Engine & Transmission
is contemporary version of: http://data.ga-group.nl/ics/bics/1710131211
is version of: http://data.ga-group.nl/ics/bics/1710131211
replaces: http://data.ga-group.nl/ics/bics/2020/1710131211
imported on: 2026-06-08T13:40:52.236Z
last refreshed on: 2026-06-08T13:41:38.450Z
source accessed on: 2024-06-05T14:42:36Z
source last accessed on: 2024-06-05T14:42:36Z
label: Engrenages et transmission mécanique @fr
label: Equp de engr e transmissão de energia @pt
label: Ingranaggi e trazione elettrica @it
label: Kraftübertragung & Getriebe @de
label: Transmisión eléctrica @es
label: Зубч. передачи и аппаратура @ru
label: 动力传输与齿轮 @zh
label: 動力伝導装置･歯車 @ja
label: 機械動力傳動設備 @zh-hant
label: 전동장치 & 기어 @ko
definition: This segment includes companies that manufacture transmissions and related components.
notation: 1710131211
valid from: 2024-06-07

Gear
type: BicsLevel5Segment
type: Classifier
type: NamedIndividual
is level5 segment of: Engine & Transmission
is contemporary version of: http://data.ga-group.nl/ics/bics/1710131212
is version of: http://data.ga-group.nl/ics/bics/1710131212
replaces: http://data.ga-group.nl/ics/bics/2020/1710131212
imported on: 2026-06-08T13:40:52.236Z
last refreshed on: 2026-06-08T13:41:38.450Z
source accessed on: 2024-06-05T14:42:36Z
source last accessed on: 2024-06-05T14:42:36Z
label: Commutatori @it
label: Engranaje @es
label: Engrenages @fr
label: Fab equip @pt
label: Getriebe @de
label: З/части промышл. приводов @ru
label: 歯車 @ja
label: 齒輪 @zh-hant
label: 齿轮 @zh
label: 산업용 동력전달장치 부품 제조 @ko
definition: This segment includes companies that manufacture gears used in drivetrain components for various applications.
notation: 1710131212
valid from: 2024-06-07

Engine & Transmission
type: BicsLevel4SubIndustry
type: Classifier
type: NamedIndividual
is sub industry of: Machinery
is contemporary version of: http://data.ga-group.nl/ics/bics/17101312
is version of: http://data.ga-group.nl/ics/bics/17101312
replaces: http://data.ga-group.nl/ics/bics/2020/17101312
imported on: 2026-06-08T13:40:52.236Z
last refreshed on: 2026-06-08T13:41:38.450Z
source accessed on: 2024-06-05T14:42:36Z
source last accessed on: 2024-06-05T14:42:36Z
label: Moteurs et transmissions @fr
label: Motor e trans @pt
label: Motore e trasmissione @it
label: Motoren & Getriebe @de
label: Motores y transm @es
label: Моторы и оборуд. для электроэн. @ru
label: 引擎与变速箱 @zh
label: 引擎及傳動設備 @zh-hant
label: 엔진&전동장치 @ko
label: ｴﾝｼﾞﾝ･ﾄﾗﾝｽﾐｯｼｮﾝ @ja
label: ｴﾝｼﾞﾝ･ﾄﾗﾝｽﾐ���ｼｮﾝ @ja
definition: This industry subgroup includes companies that manufacture mechanical power equipment, transmission shafts, cranks, camshafts, crankshafts, gears, gearboxes, couplings, and fully assembled internal combustion engines.
notation: 17101312
valid from: 2024-06-07

Ind Process Automation Mach
type: BicsLevel5Segment
type: Classifier
type: NamedIndividual
is level5 segment of: Factory Automation Equipment
is contemporary version of: http://data.ga-group.nl/ics/bics/1710131310
is version of: http://data.ga-group.nl/ics/bics/1710131310
replaces: http://data.ga-group.nl/ics/bics/2020/1710131310
imported on: 2026-06-08T13:40:52.236Z
last refreshed on: 2026-06-08T13:41:38.450Z
source accessed on: 2024-06-05T14:42:36Z
source last accessed on: 2024-06-05T14:42:36Z
label: Ind. Prozessautomatisierungsmasch. @de
label: Macc automazione processo ind @it
label: Machine automatisation process ind @fr
label: Maq de automação de processo ind @pt
label: Maq de automatización de proceso ind @es
label: Оборуд. для автомат. пром. процессов @ru
label: 工业流程自动化机械 @zh
label: 工業流程自動化機器 @zh-hant
label: 産業工程自動化制御機械 @ja
label: 산업용프로세스 자동화기계 @ko
definition: This segment includes companies that manufacture industrial process automation machinery. Such machinery includes systems designed to monitor and respond to industrial variables in the production process.
notation: 1710131310
valid from: 2024-06-07

Industrial Robot
type: BicsLevel5Segment
type: Classifier
type: NamedIndividual
is level5 segment of: Factory Automation Equipment
is contemporary version of: http://data.ga-group.nl/ics/bics/1710131311
is version of: http://data.ga-group.nl/ics/bics/1710131311
replaces: http://data.ga-group.nl/ics/bics/2020/1710131311
imported on: 2026-06-08T13:40:52.236Z
last refreshed on: 2026-06-08T13:41:38.450Z
source accessed on: 2024-06-05T14:42:36Z
source last accessed on: 2024-06-05T14:42:36Z
label: Industrieroboter @de
label: Robôs industriais @pt
label: Robot industrial @es
label: Robot industriali @it
label: Robots industriels @fr
label: Промышл. роботы @ru
label: 工业机器人 @zh
label: 工業機器人 @zh-hant
label: 産業用ﾛﾎﾞｯﾄ @ja
label: 산업용로봇제조업 @ko
definition: This segment includes companies that manufacture industrial robots, such as robots used to manufacture vehicles and computers.
notation: 1710131311
valid from: 2024-06-07

Relay & Industrial Control
type: BicsLevel5Segment
type: Classifier
type: NamedIndividual
is level5 segment of: Factory Automation Equipment
is contemporary version of: http://data.ga-group.nl/ics/bics/1710131312
is version of: http://data.ga-group.nl/ics/bics/1710131312
replaces: http://data.ga-group.nl/ics/bics/2020/1710131312
imported on: 2026-06-08T13:40:52.236Z
last refreshed on: 2026-06-08T13:41:38.450Z
source accessed on: 2024-06-05T14:42:36Z
source last accessed on: 2024-06-05T14:42:36Z
label: Relè e controllo Industriale @it
label: Relais und Regeltechnik @de
label: Relais/contrôles industriels @fr
label: Relevo y control industrial @es
label: Retransmissão e controle industrial @pt
label: Реле и средства управления @ru
label: Реле и средства управлен��я @ru
label: 繼電器及工業控制器 @zh-hant
label: 继电器与工业控制 @zh
label: 릴레이&산업용제어장치 @ko
label: ﾘﾚｰ･産業用制御装置 @ja
definition: This segment includes companies that manufacture relay and industrial control machinery. Includes electromagnetic brakes and clutches, armature relays, crane and hoist controls, and solenoid switches.
notation: 1710131312
valid from: 2024-06-07

Factory Automation Parts & Svcs
type: BicsLevel5Segment
type: Classifier
type: NamedIndividual
is level5 segment of: Factory Automation Equipment
is contemporary version of: http://data.ga-group.nl/ics/bics/1710131313
is version of: http://data.ga-group.nl/ics/bics/1710131313
replaces: http://data.ga-group.nl/ics/bics/2020/1710131313
imported on: 2026-06-08T13:40:52.236Z
last refreshed on: 2026-06-08T13:41:38.450Z
source accessed on: 2024-06-05T14:42:36Z
source last accessed on: 2024-06-05T14:42:36Z
label: Fabrikautomatisierungsteile & Dienste @de
label: Partes y servicios de automatización de fábricas @es
label: Pièces/serv automat d'usines @fr
label: Serv e parti automazione fabbrica @it
label: Serv e peças automação factory @pt
label: Запч. и обслуж. для пром. автоматики @ru
label: 工厂自动化零部件与服务 @zh
label: 工場自動化部品･ｻｰﾋﾞｽ @ja
label: 工廠自動化零件及服務 @zh-hant
label: 공장자동화 부품 & 서비스 @ko
definition: This segment includes companies that provide parts and aftermarket services for factory automation equipment. Includes maintenance services, as well as manufacturing of spare parts and aftermarket consumables.
notation: 1710131313
valid from: 2024-06-07

Factory Automation Equipment
type: BicsLevel4SubIndustry
type: Classifier
type: NamedIndividual
is sub industry of: Machinery
is contemporary version of: http://data.ga-group.nl/ics/bics/17101313
is version of: http://data.ga-group.nl/ics/bics/17101313
replaces: http://data.ga-group.nl/ics/bics/2020/17101313
imported on: 2026-06-08T13:40:52.236Z
last refreshed on: 2026-06-08T13:41:38.450Z
source accessed on: 2024-06-05T14:42:36Z
source last accessed on: 2024-06-05T14:42:36Z
label: Equipamento de automação de factory @pt
label: Equipements d'automatisation d'usines @fr
label: Equipo de automatización de fábricas @es
label: Fabrikautomatisierungsausrüstung @de
label: Macchinari automatizzazione fabbrica @it
label: Оборуд. для автомат. произв. @ru
label: 工厂自动化设备 @zh
label: 工場自動化機器 @ja
label: 工廠自動化設備 @zh-hant
label: 공장 자동화 장비 @ko
definition: This industry subgroup includes companies that manufacture equipment used in manufacturing facilities. Such equipment includes robots, linear actuation devices, automated production equipment, assembly machinery, automated welding machines, and sorters.
notation: 17101313
valid from: 2024-06-07

Air & Gas Compressor
type: BicsLevel5Segment
type: Classifier
type: NamedIndividual
is level5 segment of: Flow Control Equipment
is contemporary version of: http://data.ga-group.nl/ics/bics/1710131410
is version of: http://data.ga-group.nl/ics/bics/1710131410
replaces: http://data.ga-group.nl/ics/bics/2020/1710131410
imported on: 2026-06-08T13:40:52.236Z
last refreshed on: 2026-06-08T13:41:38.450Z
source accessed on: 2024-06-05T14:42:36Z
source last accessed on: 2024-06-05T14:42:36Z
label: Compresor de aire y gas @es
label: Compresseurs à air/gaz @fr
label: Compressor de ar e gás @pt
label: Compressori aria e gas @it
label: Luftdruck- & Gaskompressoren @de
label: Воздушные и газовые компрес. @ru
label: 空气与气体压缩机 @zh
label: 空気･ｶﾞｽ圧縮機 @ja
label: 空氣壓縮機 @zh-hant
label: 공기 및 가스압축기 @ko
definition: This segment includes companies that manufacture equipment that increases the pressure of air or gas through a pipe.
notation: 1710131410
valid from: 2024-06-07

Fluid Power Cylinder & Actuator
type: BicsLevel5Segment
type: Classifier
type: NamedIndividual
is level5 segment of: Flow Control Equipment
is contemporary version of: http://data.ga-group.nl/ics/bics/1710131411
is version of: http://data.ga-group.nl/ics/bics/1710131411
replaces: http://data.ga-group.nl/ics/bics/2020/1710131411
imported on: 2026-06-08T13:40:52.236Z
last refreshed on: 2026-06-08T13:41:38.450Z
source accessed on: 2024-06-05T14:42:36Z
source last accessed on: 2024-06-05T14:42:36Z
label: Attuatori e cilindri a fluido @it
label: Cilindro de transmissão hidráulica e atuador @pt
label: Cilindro y brazos acc eléctr fluidos @es
label: Cylindres/actionneurs hydrauliques @fr
label: Fluidzylinder & -aktuatoren @de
label: Гидроцил. и приводы @ru
label: 流体ｼﾘﾝﾀﾞｰ･作動装置 @ja
label: 液压缸和传动装置 @zh
label: 液壓氣動瓶及促動器 @zh-hant
label: 유체동력실린더&작동기 @ko
definition: This segment includes companies that manufacture cylinders and actuators that are used to convert fluid power to linear or rotary mechanical power.
notation: 1710131411
valid from: 2024-06-07

Fluid Power Pump & Motor
type: BicsLevel5Segment
type: Classifier
type: NamedIndividual
is level5 segment of: Flow Control Equipment
is contemporary version of: http://data.ga-group.nl/ics/bics/1710131412
is version of: http://data.ga-group.nl/ics/bics/1710131412
replaces: http://data.ga-group.nl/ics/bics/2020/1710131412
imported on: 2026-06-08T13:40:52.236Z
last refreshed on: 2026-06-08T13:41:38.450Z
source accessed on: 2024-06-05T14:42:36Z
source last accessed on: 2024-06-05T14:42:36Z
label: Bomba de transmissão hidráulica e motor @pt
label: Bombas y motores eléctricas de fluidos @es
label: Fluidpumpen und -motoren @de
label: Moteurs/pompes hydrauliques @fr
label: Pompe e motori idraulici @it
label: Гидравл. насосы и моторы @ru
label: Гидрав��. насосы и моторы @ru
label: 流体動力ﾎﾟﾝﾌﾟ･ﾓｰﾀｰ @ja
label: 液压泵与马达 @zh
label: 液壓氣動幫浦及馬達 @zh-hant
label: 유체동력펌프&모터 @ko
definition: This segment includes companies that manufacture pumps and motors that convert mechanical power to fluid power, for example in hydraulic lifts.
notation: 1710131412
valid from: 2024-06-07

Fluid Power Valve
type: BicsLevel5Segment
type: Classifier
type: NamedIndividual
is level5 segment of: Flow Control Equipment
is contemporary version of: http://data.ga-group.nl/ics/bics/1710131413
is version of: http://data.ga-group.nl/ics/bics/1710131413
replaces: http://data.ga-group.nl/ics/bics/2020/1710131413
imported on: 2026-06-08T13:40:52.236Z
last refreshed on: 2026-06-08T13:41:38.450Z
source accessed on: 2024-06-05T14:42:36Z
source last accessed on: 2024-06-05T14:42:36Z
label: Fluidventile @de
label: Soupapes hydrauliques @fr
label: Válvula de transmissão hidráulica @pt
label: Válvulas eléctricas de fluidos @es
label: Valvole fluidi @it
label: Гидравл. клапаны и шланг. арматура @ru
label: 流体動力ﾊﾞﾙﾌﾞ @ja
label: 流體傳動活閥 @zh-hant
label: 液压阀 @zh
label: 유체동력밸브 @ko
definition: This segment includes companies that manufacture valves that regulate the passage of fluids through the use of hydraulics or thermostatic controls.
notation: 1710131413
valid from: 2024-06-07

Industrial Valve
type: BicsLevel5Segment
type: Classifier
type: NamedIndividual
is level5 segment of: Flow Control Equipment
is contemporary version of: http://data.ga-group.nl/ics/bics/1710131414
is version of: http://data.ga-group.nl/ics/bics/1710131414
replaces: http://data.ga-group.nl/ics/bics/2020/1710131414
imported on: 2026-06-08T13:40:52.236Z
last refreshed on: 2026-06-08T13:41:38.450Z
source accessed on: 2024-06-05T14:42:36Z
source last accessed on: 2024-06-05T14:42:36Z
label: Industriearmaturen @de
label: Soupapes industrielles @fr
label: Válvula industrial @pt
label: Válvulas indus @es
label: Valvole industriali @it
label: Промышл. клапаны @ru
label: 工业阀门 @zh
label: 工業用金屬活閥 @zh-hant
label: 工業用ﾊﾞﾙﾌﾞ @ja
label: 산업용밸브 제조업 @ko
definition: This segment includes companies that manufacture valves that regulate the passage of fluids in industrial applications.
notation: 1710131414
valid from: 2024-06-07

Measuring & Dispensing Pump
type: BicsLevel5Segment
type: Classifier
type: NamedIndividual
is level5 segment of: Flow Control Equipment
is contemporary version of: http://data.ga-group.nl/ics/bics/1710131415
is version of: http://data.ga-group.nl/ics/bics/1710131415
replaces: http://data.ga-group.nl/ics/bics/2020/1710131415
imported on: 2026-06-08T13:40:52.236Z
last refreshed on: 2026-06-08T13:41:38.450Z
source accessed on: 2024-06-05T14:42:36Z
source last accessed on: 2024-06-05T14:42:36Z
label: Bomba de medição e distribuição @pt
label: Bombas de medición y suministro @es
label: Maß- & Verteilungspumpen @de
label: Misurazione e pompe erogazione @it
label: Pompes distribution/mesure @fr
label: Измерит. и раздат. насосы @ru
label: 計量ﾎﾟﾝﾌﾟ･調剤ﾎﾟﾝﾌﾟ @ja
label: 计量与分配泵 @zh
label: 量測及分配用幫浦 @zh-hant
label: 계량 및 디스펜서 펌프 @ko
definition: This segment includes companies that manufacture pumps used for measuring and dispensing fluids, for example in chemical plants.
notation: 1710131415
valid from: 2024-06-07

Pump & Pumping Equipment
type: BicsLevel5Segment
type: Classifier
type: NamedIndividual
is level5 segment of: Flow Control Equipment
is contemporary version of: http://data.ga-group.nl/ics/bics/1710131416
is version of: http://data.ga-group.nl/ics/bics/1710131416
replaces: http://data.ga-group.nl/ics/bics/2020/1710131416
imported on: 2026-06-08T13:40:52.236Z
last refreshed on: 2026-06-08T13:41:38.450Z
source accessed on: 2024-06-05T14:42:36Z
source last accessed on: 2024-06-05T14:42:36Z
label: Bomba e equipamento para bombas @pt
label: Bombas y su equipo @es
label: Pompe e attrezzature pompaggio @it
label: Pompes et équipements de pompage @fr
label: Pumpen & Pumpausrüstung @de
label: Насосы и оборуд. @ru
label: 幫浦及抽唧設備 @zh-hant
label: 泵与泵送设备 @zh
label: 펌프 및 펌프작용 장비 @ko
label: ﾎﾟﾝﾌﾟ･ﾎﾟﾝﾌﾟ装置 @ja
label: ��与泵送设备 @zh
definition: This segment includes companies that manufacture equipment used to move fluids over distances, for example in oil or utility pipelines.
notation: 1710131416
valid from: 2024-06-07

Flow Control Equip Parts & Svcs
type: BicsLevel5Segment
type: Classifier
type: NamedIndividual
is level5 segment of: Flow Control Equipment
is contemporary version of: http://data.ga-group.nl/ics/bics/1710131417
is version of: http://data.ga-group.nl/ics/bics/1710131417
replaces: http://data.ga-group.nl/ics/bics/2020/1710131417
imported on: 2026-06-08T13:40:52.236Z
last refreshed on: 2026-06-08T13:41:38.450Z
source accessed on: 2024-06-05T14:42:36Z
source last accessed on: 2024-06-05T14:42:36Z
label: Flusskontrollausrüstungsteile & Dienste @de
label: Partes de equipo de control de flujo y servicios @es
label: Pces/srvc équip contrôle débit @fr
label: Peças e serv controle de fluxo @pt
label: Serv e comp app controllo flusso @it
label: З/части и услуги управления @ru
label: 流量控制設備零件及服務 @zh-hant
label: 流量控制设备零部件与服务 @zh
label: 유량 제어, 부품 & 서비스 @ko
label: ﾌﾛｰ制御機器部品･ｻｰﾋﾞｽ @ja
definition: This segment includes companies that provide parts and aftermarket services for flow control equipment. Includes maintenance services, as well as manufacturing of spare parts and aftermarket consumables.
notation: 1710131417
valid from: 2024-06-07

Flow Control Equipment
type: BicsLevel4SubIndustry
type: Classifier
type: NamedIndividual
is sub industry of: Machinery
is contemporary version of: http://data.ga-group.nl/ics/bics/17101314
is version of: http://data.ga-group.nl/ics/bics/17101314
replaces: http://data.ga-group.nl/ics/bics/2020/17101314
imported on: 2026-06-08T13:40:52.236Z
last refreshed on: 2026-06-08T13:41:38.450Z
source accessed on: 2024-06-05T14:42:36Z
source last accessed on: 2024-06-05T14:42:36Z
label: App controllo flusso @it
label: Eq control de flujo @es
label: Equip controle flx @pt
label: Equip de contrôle de débit @fr
label: Flusskontrollgeräte @de
label: Регуляторы расхода @ru
label: 流量控制設備 @zh-hant
label: 流量控制设备 @zh
label: 유량제어장비 @ko
label: ﾌﾛｰ制御機器 @ja
definition: This industry subgroup includes companies that manufacture equipment used in hydraulic, as well as fluid, gas and liquid, handling equipment such as control valves, pressure regulators, and pneumatic electronic instrumentation.
notation: 17101314
valid from: 2024-06-07

Automatic Vending Machinery
type: BicsLevel6Segment
type: Classifier
type: NamedIndividual
is level6 segment of: Comml & Service Ind Machinery
is contemporary version of: http://data.ga-group.nl/ics/bics/171013151010
is version of: http://data.ga-group.nl/ics/bics/171013151010
replaces: http://data.ga-group.nl/ics/bics/2020/171013151010
imported on: 2026-06-08T13:40:52.236Z
last refreshed on: 2026-06-08T13:41:38.450Z
source accessed on: 2024-06-05T14:42:36Z
source last accessed on: 2024-06-05T14:42:36Z
label: Distributeurs automatiques @fr
label: Distributori automatici @it
label: Máquina automática de venda @pt
label: Maquinaria dispenso automático @es
label: Verkaufsautomaten @de
label: Торговые автоматы @ru
label: 自动贩卖机械 @zh
label: 自動販売機 @ja
label: 自動販賣機 @zh-hant
label: 자판기 @ko
definition: This segment includes companies that manufacture automated vending machines or coin-operated mechanisms for machines.
notation: 171013151010
valid from: 2024-06-07

Commercial Laundry Machinery
type: BicsLevel6Segment
type: Classifier
type: NamedIndividual
is level6 segment of: Comml & Service Ind Machinery
is contemporary version of: http://data.ga-group.nl/ics/bics/171013151011
is version of: http://data.ga-group.nl/ics/bics/171013151011
replaces: http://data.ga-group.nl/ics/bics/2020/171013151011
imported on: 2026-06-08T13:40:52.236Z
last refreshed on: 2026-06-08T13:41:38.450Z
source accessed on: 2024-06-05T14:42:36Z
source last accessed on: 2024-06-05T14:42:36Z
label: Gewerbl. Waschmaschinen @de
label: Máquinas para lavanderia comercial @pt
label: Macchine lavanderia commerciale @it
label: Machines à laver commerciales @fr
label: Maquinaria comercial de lavandería @es
label: Техника для коммерч. прачечных @ru
label: 商业洗涤机械 @zh
label: 商用洗衣機 @zh-hant
label: 業務用洗濯機 @ja
label: 상업용세탁기 @ko
definition: This segment includes companies that manufacture commercial laundry and dry-cleaning equipment and pressing machines. Exclude laundry machines for home use (see Household Appliance).
notation: 171013151011
valid from: 2024-06-07

Comml & Service Ind Machinery
type: BicsLevel5Segment
type: Classifier
type: NamedIndividual
is level5 segment of: Other Machinery & Equipment
is contemporary version of: http://data.ga-group.nl/ics/bics/1710131510
is version of: http://data.ga-group.nl/ics/bics/1710131510
replaces: http://data.ga-group.nl/ics/bics/2020/1710131510
imported on: 2026-06-08T13:40:52.236Z
last refreshed on: 2026-06-08T13:41:38.450Z
source accessed on: 2024-06-05T14:42:36Z
source last accessed on: 2024-06-05T14:42:36Z
label: Gewerbe- & Serviceindustriemaschinen @de
label: Máquinas ind de serviço comercial @pt
label: Macc comm e ind serv @it
label: Machine pour commerce/services @fr
label: Maquinaria ind comercial y servicio @es
label: Оборуд. для коммерч. и обсл. отраслей @ru
label: 商业与服务业机械 @zh
label: 商業服務業機械 @zh-hant
label: 商業･ｻｰﾋﾞｽ用産業機械 @ja
label: 상업&서비스산업기계 @ko
definition: This segment includes companies that manufacture machinery used in the commercial and service industries. Includes automatic vending machines and commercial laundry machines.
notation: 1710131510
valid from: 2024-06-07

Food Product Machinery
type: BicsLevel5Segment
type: Classifier
type: NamedIndividual
is level5 segment of: Other Machinery & Equipment
is contemporary version of: http://data.ga-group.nl/ics/bics/1710131511
is version of: http://data.ga-group.nl/ics/bics/1710131511
replaces: http://data.ga-group.nl/ics/bics/2020/1710131511
imported on: 2026-06-08T13:40:52.236Z
last refreshed on: 2026-06-08T13:41:38.450Z
source accessed on: 2024-06-05T14:42:36Z
source last accessed on: 2024-06-05T14:42:36Z
label: Lebensmittelproduktionsmaschinen @de
label: Macchinari prodotti alimentari @it
label: Machines pour l'industrie alimentaire @fr
label: Maquinário para produtos alimentícios @pt
label: Maquinaria para alimentos @es
label: Техника для пищевой промышл. @ru
label: 食品机械 @zh
label: 食品機械 @zh-hant
label: 食品製造用機械 @ja
label: 식료품 기계 @ko
definition: This segment includes companies that manufacture machinery used to produce foods and beverages.
notation: 1710131511
valid from: 2024-06-07

Paper Industry Machinery
type: BicsLevel5Segment
type: Classifier
type: NamedIndividual
is level5 segment of: Other Machinery & Equipment
is contemporary version of: http://data.ga-group.nl/ics/bics/1710131512
is version of: http://data.ga-group.nl/ics/bics/1710131512
replaces: http://data.ga-group.nl/ics/bics/2020/1710131512
imported on: 2026-06-08T13:40:52.236Z
last refreshed on: 2026-06-08T13:41:38.450Z
source accessed on: 2024-06-05T14:42:36Z
source last accessed on: 2024-06-05T14:42:36Z
label: Macchinari industria della carta @it
label: Machines pour l'industrie du papier @fr
label: Maq para la industria de papel @es
label: Maquinário para indústria de papel @pt
label: Papierindustriemaschinen @de
label: Техника для бумажной промышл. @ru
label: 紙業機械 @zh-hant
label: 纸业机械 @zh
label: 製紙機械 @ja
label: 제지산업용기계 @ko
definition: This segment includes companies that manufacture machinery for making paper pulp, paper, and paperboard.
notation: 1710131512
valid from: 2024-06-07

Plastics & Rubber Machinery
type: BicsLevel5Segment
type: Classifier
type: NamedIndividual
is level5 segment of: Other Machinery & Equipment
is contemporary version of: http://data.ga-group.nl/ics/bics/1710131513
is version of: http://data.ga-group.nl/ics/bics/1710131513
replaces: http://data.ga-group.nl/ics/bics/2020/1710131513
imported on: 2026-06-08T13:40:52.236Z
last refreshed on: 2026-06-08T13:41:38.450Z
source accessed on: 2024-06-05T14:42:36Z
source last accessed on: 2024-06-05T14:42:36Z
label: Macchinari plastica e gomma @it
label: Machines plastique/caoutchouc @fr
label: Maquinário p/plástico e borracha @pt
label: Maquinaria de caucho y plástico @es
label: Plastik- & Gummimaschinen @de
label: Оборуд. для пласт. и резиновой промышл. @ru
label: 塑料与橡胶机械 @zh
label: 塑膠業及橡膠業機械 @zh-hant
label: 플라스틱&고무기계 @ko
label: ﾌﾟﾗｽﾁｯｸ･ｺﾞﾑ用機械 @ja
definition: This segment includes companies that manufacture extruders, molders, and pneumatic tire-making or retreading machines for specific types of plastic or rubber products.
notation: 1710131513
valid from: 2024-06-07

Printing Machinery & Equip
type: BicsLevel5Segment
type: Classifier
type: NamedIndividual
is level5 segment of: Other Machinery & Equipment
is contemporary version of: http://data.ga-group.nl/ics/bics/1710131514
is version of: http://data.ga-group.nl/ics/bics/1710131514
replaces: http://data.ga-group.nl/ics/bics/2020/1710131514
imported on: 2026-06-08T13:40:52.236Z
last refreshed on: 2026-06-08T13:41:38.450Z
source accessed on: 2024-06-05T14:42:36Z
source last accessed on: 2024-06-05T14:42:36Z
label: Druckmaschinen & -ausrüstung @de
label: Macchinari ed equip stampa @it
label: Machines/équipements imprimerie @fr
label: Maquinário de impressão e equip @pt
label: Maquinaria y equipo de impresión @es
label: Печатная техника и оборуд. @ru
label: Печатная техни��а и оборуд. @ru
label: 印刷机械与设备 @zh
label: 印刷機械設備 @zh-hant
label: 印刷機･機器 @ja
label: 인쇄기계&장비 @ko
definition: This segment includes companies that manufacture printing and bookbinding machinery. Includes bookbinding, collating, lithographic, offset printing, and typesetting machinery.
notation: 1710131514
valid from: 2024-06-07

Sawmill & Woodworking Mach
type: BicsLevel5Segment
type: Classifier
type: NamedIndividual
is level5 segment of: Other Machinery & Equipment
is contemporary version of: http://data.ga-group.nl/ics/bics/1710131515
is version of: http://data.ga-group.nl/ics/bics/1710131515
replaces: http://data.ga-group.nl/ics/bics/2020/1710131515
imported on: 2026-06-08T13:40:52.236Z
last refreshed on: 2026-06-08T13:41:38.450Z
source accessed on: 2024-06-05T14:42:36Z
source last accessed on: 2024-06-05T14:42:36Z
label: Macc segheria e falegnameria @it
label: Machine scieries/travail du bois @fr
label: Maq aserraderos y carpintería @es
label: Maquinário para serraria e marcenaria @pt
label: Sägewerk- & Holzbearbeitungsmaschinen @de
label: Лесопильн. и деревообр. станки @ru
label: 木廠及木工機械 @zh-hant
label: 製材･木材加工機械 @ja
label: 锯木厂与木工机械 @zh
label: 제재소&목공기계 @ko
definition: This segment includes companies that manufacture sawmills and woodworking machinery, such as band saws, drill presses, and bench and table saws.
notation: 1710131515
valid from: 2024-06-07

Textile Machinery
type: BicsLevel5Segment
type: Classifier
type: NamedIndividual
is level5 segment of: Other Machinery & Equipment
is contemporary version of: http://data.ga-group.nl/ics/bics/1710131516
is version of: http://data.ga-group.nl/ics/bics/1710131516
replaces: http://data.ga-group.nl/ics/bics/2020/1710131516
imported on: 2026-06-08T13:40:52.236Z
last refreshed on: 2026-06-08T13:41:38.450Z
source accessed on: 2024-06-05T14:42:36Z
source last accessed on: 2024-06-05T14:42:36Z
label: Macchine tessili @it
label: Machines pour le textile @fr
label: Maquinário têxtil @pt
label: Maquinaria textil @es
label: Textilindustriemaschinen @de
label: Ткацкие станки @ru
label: 紡織業機械 @zh-hant
label: 繊維機械 @ja
label: 纺织机械 @zh
label: 직조기계 제조업 @ko
definition: This segment includes companies that manufacture machines for producing, extruding, drawing, and texturing fibers, materials, or yarn. Includes cotton gins, bale breakers, garnetters, cotton spreaders, wool scourers, combs, spinning machines, reelers, warpers, and looms.
notation: 1710131516
valid from: 2024-06-07

Hand Tools
type: BicsLevel6Segment
type: Classifier
type: NamedIndividual
is level6 segment of: Tools
is contemporary version of: http://data.ga-group.nl/ics/bics/171013151710
is version of: http://data.ga-group.nl/ics/bics/171013151710
replaces: http://data.ga-group.nl/ics/bics/2020/171013151710
imported on: 2026-06-08T13:40:52.236Z
last refreshed on: 2026-06-08T13:41:38.450Z
source accessed on: 2024-06-05T14:42:36Z
source last accessed on: 2024-06-05T14:42:36Z
label: Attrezzi @it
label: Ferramentas portáteis @pt
label: Handwerkzeuge @de
label: Herramientas manuales @es
label: Outils à main @fr
label: Ручные инструменты @ru
label: 手动工具 @zh
label: 手動工具 @ja
label: 手工工具 @zh-hant
label: 핸드공구 @ko
definition: This segment includes companies that manufacture non-powered hand and edge tools. Includes hammers, screwdrivers, axes, garden tools, pliers, and ratchets.
notation: 171013151710
valid from: 2024-06-07

Power Tools
type: BicsLevel6Segment
type: Classifier
type: NamedIndividual
is level6 segment of: Tools
is contemporary version of: http://data.ga-group.nl/ics/bics/171013151711
is version of: http://data.ga-group.nl/ics/bics/171013151711
replaces: http://data.ga-group.nl/ics/bics/2020/171013151711
imported on: 2026-06-08T13:40:52.236Z
last refreshed on: 2026-06-08T13:41:38.450Z
source accessed on: 2024-06-05T14:42:36Z
source last accessed on: 2024-06-05T14:42:36Z
label: Elektrowerkzeuge @de
label: Ferramentas elétricas @pt
label: Herramientas eléctricas @es
label: Outils électriques @fr
label: Utens elettr @it
label: Инструменты с электрическим приводом @ru
label: 動力工具 @zh-hant
label: 电动工具 @zh
label: 電動工具 @ja
label: 전력공구 @ko
definition: This segment includes companies that manufacture power-driven hand tools. Includes circular saws, chain saws, nail guns, planers, paint spray guns, riveting guns, routers, drills, and sanders.
notation: 171013151711
valid from: 2024-06-07

Tool Accessories
type: BicsLevel6Segment
type: Classifier
type: NamedIndividual
is level6 segment of: Tools
is contemporary version of: http://data.ga-group.nl/ics/bics/171013151712
is version of: http://data.ga-group.nl/ics/bics/171013151712
replaces: http://data.ga-group.nl/ics/bics/2020/171013151712
imported on: 2026-06-08T13:40:52.236Z
last refreshed on: 2026-06-08T13:41:38.450Z
source accessed on: 2024-06-05T14:42:36Z
source last accessed on: 2024-06-05T14:42:36Z
label: Accesorios de herramientas @es
label: Accessoires pour outils @fr
label: Acessórios para ferramentas @pt
label: Utensili @it
label: Werkzeugzubehör @de
label: Аксессуары для инструментов @ru
label: Аксессуары для инструме��тов @ru
label: 工具配件 @zh
label: 工具ｱｸｾｻﾘｰ @ja
label: 부속공구 @ko
definition: This segment includes companies that manufacture accessories or consumable supplies used for tools. Includes saw blades, sanding belts, tool attachments, tool storage equipment, and tool mounts.
notation: 171013151712
valid from: 2024-06-07

Tools
type: BicsLevel5Segment
type: Classifier
type: NamedIndividual
is level5 segment of: Other Machinery & Equipment
is contemporary version of: http://data.ga-group.nl/ics/bics/1710131517
is version of: http://data.ga-group.nl/ics/bics/1710131517
replaces: http://data.ga-group.nl/ics/bics/2020/1710131517
imported on: 2026-06-08T13:40:52.236Z
last refreshed on: 2026-06-08T13:41:38.450Z
source accessed on: 2024-06-05T14:42:36Z
source last accessed on: 2024-06-05T14:42:36Z
label: Attrezzi @it
label: Ferramentas @pt
label: Herramientas @es
label: Outils @fr
label: Werkzeuge @de
label: Инструментарий @ru
label: 工具 @ja
label: 공구 @ko
definition: This segment includes companies that manufacture hand tools. Includes powered and non-powered hand tools and saws, as well as saw blades.
notation: 1710131517
valid from: 2024-06-07

Ind Process Furnace & Oven
type: BicsLevel6Segment
type: Classifier
type: NamedIndividual
is level6 segment of: General Purpose Machinery
is contemporary version of: http://data.ga-group.nl/ics/bics/171013151810
is version of: http://data.ga-group.nl/ics/bics/171013151810
replaces: http://data.ga-group.nl/ics/bics/2020/171013151810
imported on: 2026-06-08T13:40:52.236Z
last refreshed on: 2026-06-08T13:41:38.450Z
source accessed on: 2024-06-05T14:42:36Z
source last accessed on: 2024-06-05T14:42:36Z
label: Calderas y hornos industriales @es
label: Fornaci/forni industriali @it
label: Fornalha de processamento indust e forno @pt
label: Fournaises/fours procédés ind @fr
label: Industriefeuerungsanlagen & -öfen @de
label: Промышл. вагранки и печи @ru
label: Промышл. вагранки и п��чи @ru
label: 工业用化工炉和烤箱 @zh
label: 工業用加工鍋爐 @zh-hant
label: 工業用溶解炉･ｵｰﾌﾞﾝ @ja
label: 산업용처리 고로 @ko
definition: This segment includes companies that manufacture industrial-process furnaces and ovens. Includes metal melting furnaces, garbage incinerators, paint baking and drying ovens, tile and ceramic kilns, and distillation ovens.
notation: 171013151810
valid from: 2024-06-07

Motor & Generator
type: BicsLevel6Segment
type: Classifier
type: NamedIndividual
is level6 segment of: General Purpose Machinery
is contemporary version of: http://data.ga-group.nl/ics/bics/171013151811
is version of: http://data.ga-group.nl/ics/bics/171013151811
replaces: http://data.ga-group.nl/ics/bics/2020/171013151811
imported on: 2026-06-08T13:40:52.236Z
last refreshed on: 2026-06-08T13:41:38.450Z
source accessed on: 2024-06-05T14:42:36Z
source last accessed on: 2024-06-05T14:42:36Z
label: Générateurs/moteurs @fr
label: Generatori e motori @it
label: Motor e gerador @pt
label: Motor y generador @es
label: Motoren & Generatoren @de
label: Моторы и генераторы @ru
label: 電動機及發電機 @zh-hant
label: 马达与发电机 @zh
label: 모터&발전기제조업 @ko
label: ﾓｰﾀｰ･発電機 @ja
definition: This segment includes companies that manufacture general purpose industrial motors and generators. Typically, these are semi-finished products that will be used as components for various industrial machinery products. Excludes finished generator equipment (see Power Generation Equipment) and hydraulic equipment (see Fluid Power Pump & Motor).
notation: 171013151811
valid from: 2024-06-07

Scale & Balance
type: BicsLevel6Segment
type: Classifier
type: NamedIndividual
is level6 segment of: General Purpose Machinery
is contemporary version of: http://data.ga-group.nl/ics/bics/171013151812
is version of: http://data.ga-group.nl/ics/bics/171013151812
replaces: http://data.ga-group.nl/ics/bics/2020/171013151812
imported on: 2026-06-08T13:40:52.236Z
last refreshed on: 2026-06-08T13:41:38.450Z
source accessed on: 2024-06-05T14:42:36Z
source last accessed on: 2024-06-05T14:42:36Z
label: Balanças @pt
label: Balances @fr
label: Bilance @it
label: Escala/balanza @es
label: Skalierungs- & Balancegeräte @de
label: Весы @ru
label: 天秤･はかり @ja
label: 秤重用具 @zh-hant
label: 称重用具 @zh
label: 저울&천칭 제조업 @ko
definition: This segment includes companies that manufacture commercial scales and balances. Includes industrial scales, motor truck scales, post office-type scales, and retail scales.
notation: 171013151812
valid from: 2024-06-07

General Purpose Machinery
type: BicsLevel5Segment
type: Classifier
type: NamedIndividual
is level5 segment of: Other Machinery & Equipment
is contemporary version of: http://data.ga-group.nl/ics/bics/1710131518
is version of: http://data.ga-group.nl/ics/bics/1710131518
replaces: http://data.ga-group.nl/ics/bics/2020/1710131518
imported on: 2026-06-08T13:40:52.236Z
last refreshed on: 2026-06-08T13:41:38.450Z
source accessed on: 2024-06-05T14:42:36Z
source last accessed on: 2024-06-05T14:42:36Z
label: Macchinari uso generale @it
label: Machines à usage général @fr
label: Maquinários para usos gerais @pt
label: Maquinaria en general @es
label: Mehrzweckmaschinen @de
label: Техника общего назначения @ru
label: 一般機械 @ja
label: 一般用途机械 @zh
label: 通用機械 @zh-hant
label: 일반용 기계 @ko
definition: This segment includes companies that manufacture general purpose machinery that is not elsewhere classified.
notation: 1710131518
valid from: 2024-06-07

Packaging Machinery
type: BicsLevel5Segment
type: Classifier
type: NamedIndividual
is level5 segment of: Other Machinery & Equipment
is contemporary version of: http://data.ga-group.nl/ics/bics/1710131519
is version of: http://data.ga-group.nl/ics/bics/1710131519
replaces: http://data.ga-group.nl/ics/bics/2020/1710131519
imported on: 2026-06-08T13:40:52.236Z
last refreshed on: 2026-06-08T13:41:38.450Z
source accessed on: 2024-06-05T14:42:36Z
source last accessed on: 2024-06-05T14:42:36Z
label: Macchinari per confezioni @it
label: Machines pour l'emballage @fr
label: Maq para embalagem @pt
label: Maquinaria de empaque @es
label: Verpackungsmaschinenherstellung @de
label: Упаковочное оборуд. @ru
label: 包装机械 @zh
label: 包裝機械 @zh-hant
label: 梱包機械 @ja
label: 포장기계 제조업 @ko
definition: This segment includes companies that manufacture packaging machinery, such as canning and bottling machinery, bottle washers, bag opening, filling and closing machines, food packaging machinery, and labeling and wrapping machinery.
notation: 1710131519
valid from: 2024-06-07

Recycling Equipment & Machinery
type: BicsLevel5Segment
type: Classifier
type: NamedIndividual
is level5 segment of: Other Machinery & Equipment
is contemporary version of: http://data.ga-group.nl/ics/bics/1710131520
is version of: http://data.ga-group.nl/ics/bics/1710131520
replaces: http://data.ga-group.nl/ics/bics/2020/1710131520
imported on: 2026-06-08T13:40:52.236Z
last refreshed on: 2026-06-08T13:41:38.450Z
source accessed on: 2024-06-05T14:42:36Z
source last accessed on: 2024-06-05T14:42:36Z
label: App e macchinari riciclaggio @it
label: Equipo y maquinaria para reciclaje @es
label: Máquinas e equipamentos de reciclagem @pt
label: Machines/équipt de recyclage @fr
label: Recycling-Equipment & Maschinen @de
label: Оборуд. по утилизации @ru
label: 再生材料處理設備及機器 @zh-hant
label: 回收设备与机械 @zh
label: 재활용 장비 & 기계 @ko
label: ﾘｻｲｸﾙ機器･機械 @ja
definition: This segment includes companies that manufacture equipment and machinery for handling and processing recycled materials. These instruments are used in the removal, conveying, sorting, shredding, reduction, destruction, compacting, and baling of recyclable products in the paper, metal, plastic, textile, clothing, or curbside collection industries.
notation: 1710131520
valid from: 2024-06-07

Other Machinery Parts & Svcs
type: BicsLevel5Segment
type: Classifier
type: NamedIndividual
is level5 segment of: Other Machinery & Equipment
is contemporary version of: http://data.ga-group.nl/ics/bics/1710131521
is version of: http://data.ga-group.nl/ics/bics/1710131521
replaces: http://data.ga-group.nl/ics/bics/2020/1710131521
imported on: 2026-06-08T13:40:52.236Z
last refreshed on: 2026-06-08T13:41:38.450Z
source accessed on: 2024-06-05T14:42:36Z
source last accessed on: 2024-06-05T14:42:36Z
label: Autres pièces/srvc machines @fr
label: Otras partes y serv de maquinaria @es
label: Peças e serv - outro maquinário @pt
label: Serv e comp altri macchinari @it
label: Sonst. Maschinenteile & Dienste @de
label: Прочие з/части для оборуд./услуги @ru
label: Прочи�� з/части для оборуд./услуги @ru
label: その他機械部品･ｻｰﾋﾞｽ @ja
label: 其他机械零部件与服务 @zh
label: 工業機械零件及服務 @zh-hant
label: 기타 기계 부품 & 서비스 @ko
definition: This segment includes companies that provide parts and aftermarket services for other machinery. Includes maintenance services, as well as manufacturing of spare parts and aftermarket consumables.
notation: 1710131521
valid from: 2024-06-07

Other Machinery & Equipment
type: BicsLevel4SubIndustry
type: Classifier
type: NamedIndividual
is sub industry of: Machinery
is contemporary version of: http://data.ga-group.nl/ics/bics/17101315
is version of: http://data.ga-group.nl/ics/bics/17101315
replaces: http://data.ga-group.nl/ics/bics/2020/17101315
imported on: 2026-06-08T13:40:52.236Z
last refreshed on: 2026-06-08T13:41:38.450Z
source accessed on: 2024-06-05T14:42:36Z
source last accessed on: 2024-06-05T14:42:36Z
label: Altri macchinari, attrezzature @it
label: Autres machines et équipement @fr
label: Otra maquinaria y equipo @es
label: Outros maquinários e equipamentos @pt
label: Sonstige Maschinen & Equipment @de
label: Др. машины и оборудование @ru
label: その他機械･設備 @ja
label: 其他机械与设备 @zh
label: 工業機械 @zh-hant
label: 기타 기계 & 장비 @ko
definition: This industry subgroup includes companies that manufacture industrial machinery not elsewhere classified.
notation: 17101315
valid from: 2024-06-07

Conveyor & Conveying Equip
type: BicsLevel5Segment
type: Classifier
type: NamedIndividual
is level5 segment of: Material Handling Machinery
is contemporary version of: http://data.ga-group.nl/ics/bics/1710131610
is version of: http://data.ga-group.nl/ics/bics/1710131610
replaces: http://data.ga-group.nl/ics/bics/2020/1710131610
imported on: 2026-06-08T13:40:52.236Z
last refreshed on: 2026-06-08T13:41:38.450Z
source accessed on: 2024-06-05T14:42:36Z
source last accessed on: 2024-06-05T14:42:36Z
label: Convoyeurs/équip de convoyeurs @fr
label: Equipo p/levantar y trasladar @es
label: Förderbänder &Förderbänderausrüstung @de
label: Transportadora e equip transportadora @pt
label: Trasporto e app trasporto @it
label: Конвейеры и подъемно-транспортн. оборуд. @ru
label: 传送带与传送设备 @zh
label: 傳送帶及運送設備 @zh-hant
label: 운반장치 및 운반용장비 @ko
label: ｺﾝﾍﾞﾔｰ･関連機械 @ja
definition: This segment includes companies that manufacture equipment that moves materials from one location to another. Includes belt conveyors, chain conveyors, overhead conveyors, bucket conveyors, and various other conveyors.
notation: 1710131610
valid from: 2024-06-07

Industrial Trucks & Stackers
type: BicsLevel5Segment
type: Classifier
type: NamedIndividual
is level5 segment of: Material Handling Machinery
is contemporary version of: http://data.ga-group.nl/ics/bics/1710131611
is version of: http://data.ga-group.nl/ics/bics/1710131611
replaces: http://data.ga-group.nl/ics/bics/2020/1710131611
imported on: 2026-06-08T13:40:52.236Z
last refreshed on: 2026-06-08T13:41:38.450Z
source accessed on: 2024-06-05T14:42:36Z
source last accessed on: 2024-06-05T14:42:36Z
label: Camion e trattori industriali @it
label: Camiones y apiladoras industriales @es
label: Fab de caminhões e empilhadores industriais @pt
label: Gerbeurs (empileurs)/camions indus @fr
label: Herst. v. industriellen LKWs & Staplern @de
label: Произв. грузовых автомоб./самоукладчиков @ru
label: 工业卡车与堆垛机 @zh
label: 工業用卡車及推高機 @zh-hant
label: 工業用卡車及推高�� @zh-hant
label: 産業用ﾄﾗｯｸ･ｽﾀｯｶｰ @ja
label: 산업용 트럭&축척기 제조 @ko
definition: This segment includes companies that manufacture equipment used to lift and move materials, such as forklifts and pallet stackers, loaders, and unloaders.
notation: 1710131611
valid from: 2024-06-07

Overhead Crane
type: BicsLevel5Segment
type: Classifier
type: NamedIndividual
is level5 segment of: Material Handling Machinery
is contemporary version of: http://data.ga-group.nl/ics/bics/1710131612
is version of: http://data.ga-group.nl/ics/bics/1710131612
replaces: http://data.ga-group.nl/ics/bics/2020/1710131612
imported on: 2026-06-08T13:40:52.236Z
last refreshed on: 2026-06-08T13:41:38.450Z
source accessed on: 2024-06-05T14:42:36Z
source last accessed on: 2024-06-05T14:42:36Z
label: Fabricación de grúas @es
label: Gru mobili @it
label: Hängekräne @de
label: Pontes rolantes @pt
label: Ponts roulants @fr
label: Мостовые краны @ru
label: 天井走行ｸﾚｰﾝ @ja
label: 橋式吊車零件及服務 @zh-hant
label: 高架起重机 @zh
label: 천정크레인 제조업 @ko
definition: This segment includes companies that manufacture equipment that runs along a horizontal beam to move items from one place to another. Includes hoists and monorail systems. Excludes mobile or construction cranes (see Construction Machinery).
notation: 1710131612
valid from: 2024-06-07

Material Handling Machinery
type: BicsLevel4SubIndustry
type: Classifier
type: NamedIndividual
is sub industry of: Machinery
is contemporary version of: http://data.ga-group.nl/ics/bics/17101316
is version of: http://data.ga-group.nl/ics/bics/17101316
replaces: http://data.ga-group.nl/ics/bics/2020/17101316
imported on: 2026-06-08T13:40:52.236Z
last refreshed on: 2026-06-08T13:41:38.450Z
source accessed on: 2024-06-05T14:42:36Z
source last accessed on: 2024-06-05T14:42:36Z
label: Macchinari tratt materiali @it
label: Machine manutention de matériel @fr
label: Maq manejo de materiales @es
label: Maq manuseio de material @pt
label: Materialtransportmaschinen @de
label: Оборуд. для перемещ. матер. @ru
label: 原材料处理机械 @zh
label: 原物料處理機械 @zh-hant
label: 資材運搬機械 @ja
label: 화물운반기계 @ko
definition: This industry subgroup includes companies that manufacture equipment involved in movement, storage and control of products in the manufacturing and distribution of goods. Includes lift trucks, storage and handling equipment, and conveyor systems.
notation: 17101316
valid from: 2024-06-07

Cutting & Machine Tool Acc
type: BicsLevel5Segment
type: Classifier
type: NamedIndividual
is level5 segment of: Metalworking Machinery
is contemporary version of: http://data.ga-group.nl/ics/bics/1710131710
is version of: http://data.ga-group.nl/ics/bics/1710131710
replaces: http://data.ga-group.nl/ics/bics/2020/1710131710
imported on: 2026-06-08T13:40:52.236Z
last refreshed on: 2026-06-08T13:41:38.450Z
source accessed on: 2024-06-05T14:42:36Z
source last accessed on: 2024-06-05T14:42:36Z
label: Cnt ferramenta de máquina e de corte @pt
label: Herr maq, tipos corte metálico @es
label: Machines-outils et acc de découpage @fr
label: Schneidewerkzeuge & -zubehör @de
label: Utensili taglio e macchina acc @it
label: Арматура для резальных машин и станков @ru
label: 切削工具及工具機配件 @zh-hant
label: 切削機器･付属品 @ja
label: 切割与机床配件 @zh
label: 절단도구&공작기계장비 @ko
definition: This segment includes companies that manufacture tool holders and cutting, drilling, and boring accessories.
notation: 1710131710
valid from: 2024-06-07

Industrial Mold
type: BicsLevel5Segment
type: Classifier
type: NamedIndividual
is level5 segment of: Metalworking Machinery
is contemporary version of: http://data.ga-group.nl/ics/bics/1710131711
is version of: http://data.ga-group.nl/ics/bics/1710131711
replaces: http://data.ga-group.nl/ics/bics/2020/1710131711
imported on: 2026-06-08T13:40:52.236Z
last refreshed on: 2026-06-08T13:41:38.450Z
source accessed on: 2024-06-05T14:42:36Z
source last accessed on: 2024-06-05T14:42:36Z
label: Industriegussformen @de
label: Moldes industriais @pt
label: Molduras indus @es
label: Moules industriels @fr
label: Stampi industriali @it
label: Промышл. шаблоны @ru
label: 工业模具 @zh
label: 工業鑄模 @zh-hant
label: 金型 @ja
label: 산업용주형제조업 @ko
definition: This segment includes companies that manufacture metal molds and die castings.
notation: 1710131711
valid from: 2024-06-07

Machine Tool (Metal Cutting)
type: BicsLevel5Segment
type: Classifier
type: NamedIndividual
is level5 segment of: Metalworking Machinery
is contemporary version of: http://data.ga-group.nl/ics/bics/1710131712
is version of: http://data.ga-group.nl/ics/bics/1710131712
replaces: http://data.ga-group.nl/ics/bics/2020/1710131712
imported on: 2026-06-08T13:40:52.236Z
last refreshed on: 2026-06-08T13:41:38.450Z
source accessed on: 2024-06-05T14:42:36Z
source last accessed on: 2024-06-05T14:42:36Z
label: (Metallschneidendes) Maschinenwerkzeug @de
label: Ferramenta de máquina (corte de metal) @pt
label: Herramientas de maquinaria (corte de metal) @es
label: Macchine utensili (taglio metalli) @it
label: Machines-outils (découpage des métaux) @fr
label: Станки (металлорежущих) @ru
label: 工作機械(金属切削) @ja
label: 工具機(金屬切削) @zh-hant
label: 机床(金属切割) @zh
label: 공작기계(금속절단 ) @ko
definition: This segment includes companies that manufacture equipment used to make industrial equipment, such as machines to cut, bore, and drill metal materials.
notation: 1710131712
valid from: 2024-06-07

Machine Tool (Metal Forming)
type: BicsLevel5Segment
type: Classifier
type: NamedIndividual
is level5 segment of: Metalworking Machinery
is contemporary version of: http://data.ga-group.nl/ics/bics/1710131713
is version of: http://data.ga-group.nl/ics/bics/1710131713
replaces: http://data.ga-group.nl/ics/bics/2020/1710131713
imported on: 2026-06-08T13:40:52.236Z
last refreshed on: 2026-06-08T13:41:38.450Z
source accessed on: 2024-06-05T14:42:36Z
source last accessed on: 2024-06-05T14:42:36Z
label: (Metallformendes) Maschinenwerkzeug @de
label: Ferramenta de máquina (metalúrgica) @pt
label: Herramientas de maquinaria (formación metal) @es
label: Macchine utensili formatura metalli @it
label: Machines-outils (façonnage des métaux) @fr
label: Станки (для формовки металла) @ru
label: 工作機械(金属成形) @ja
label: 工具機(金屬成型銑削) @zh-hant
label: 机床(金属成型) @zh
label: 공작기계(금속가공) @ko
definition: This segment includes companies that manufacture machine tools that form metal by milling, planing, pressing, or grinding metal into the desired shape.
notation: 1710131713
valid from: 2024-06-07

Rolling Mill Mach & Equipment
type: BicsLevel5Segment
type: Classifier
type: NamedIndividual
is level5 segment of: Metalworking Machinery
is contemporary version of: http://data.ga-group.nl/ics/bics/1710131714
is version of: http://data.ga-group.nl/ics/bics/1710131714
replaces: http://data.ga-group.nl/ics/bics/2020/1710131714
imported on: 2026-06-08T13:40:52.236Z
last refreshed on: 2026-06-08T13:41:38.450Z
source accessed on: 2024-06-05T14:42:36Z
source last accessed on: 2024-06-05T14:42:36Z
label: App e macchine laminatoi @it
label: Equipements et mach de laminoirs @fr
label: Maq e equipamento de laminador @pt
label: Maquinaria y equipo laminador @es
label: Walzwerkmaschinen & -ausrüstung @de
label: Прокатне станки и оборуд. @ru
label: 圧延機器 @ja
label: 輾壓廠機械設備 @zh-hant
label: 轧制机械与设备 @zh
label: 압연기계 및 장비 @ko
definition: This segment includes companies that manufacture equipment used to cut, form, stamp and bend metal with a pair of rolls. Includes bar mill machinery, cold and hot rolling machinery, and galvanizing machinery.
notation: 1710131714
valid from: 2024-06-07

Sheet Metal Processing Mach
type: BicsLevel5Segment
type: Classifier
type: NamedIndividual
is level5 segment of: Metalworking Machinery
is contemporary version of: http://data.ga-group.nl/ics/bics/1710131715
is version of: http://data.ga-group.nl/ics/bics/1710131715
replaces: http://data.ga-group.nl/ics/bics/2020/1710131715
imported on: 2026-06-08T13:40:52.236Z
last refreshed on: 2026-06-08T13:41:38.450Z
source accessed on: 2024-06-05T14:42:36Z
source last accessed on: 2024-06-05T14:42:36Z
label: Blechmetallverarbeitungsmaschinen @de
label: Máq processam chapas metal @pt
label: Macch trattamento lamine metallo @it
label: Machines transform tôle @fr
label: Maq procesar chapa metálica @es
label: Станок д/обработки листов. металла @ru
label: 板金加工機床 @zh-hant
label: 板金加工機械 @ja
label: 金属薄片加工机 @zh
label: 판금속 가공기계 @ko
definition: This segment includes companies that manufacture sheet metal processing machines used to cut holes in, weld, and bend metal sheets.
notation: 1710131715
valid from: 2024-06-07

Special Die & Tool Fixture
type: BicsLevel5Segment
type: Classifier
type: NamedIndividual
is level5 segment of: Metalworking Machinery
is contemporary version of: http://data.ga-group.nl/ics/bics/1710131716
is version of: http://data.ga-group.nl/ics/bics/1710131716
replaces: http://data.ga-group.nl/ics/bics/2020/1710131716
imported on: 2026-06-08T13:40:52.236Z
last refreshed on: 2026-06-08T13:41:38.450Z
source accessed on: 2024-06-05T14:42:36Z
source last accessed on: 2024-06-05T14:42:36Z
label: Flete de tintas y herramientas @es
label: Moldes especiais e luminárias de ferramenta @pt
label: Moules/pièces fixes pour outils @fr
label: Spezialgüsse & Werkzeuge @de
label: Stampi e attrezzi speciali @it
label: Специальные пробойники и инструменты @ru
label: 特殊模切工具設備 @zh-hant
label: 特殊ﾀﾞｲｽ･治具･付属品 @ja
label: 特种模具及工具、夹具 @zh
label: 특수 다이&도구 고정물 @ko
definition: This segment includes companies that manufacture specialty tools and fixtures, such as dies and jigs.
notation: 1710131716
valid from: 2024-06-07

Stamping Press Machinery
type: BicsLevel5Segment
type: Classifier
type: NamedIndividual
is level5 segment of: Metalworking Machinery
is contemporary version of: http://data.ga-group.nl/ics/bics/1710131717
is version of: http://data.ga-group.nl/ics/bics/1710131717
replaces: http://data.ga-group.nl/ics/bics/2020/1710131717
imported on: 2026-06-08T13:40:52.236Z
last refreshed on: 2026-06-08T13:41:38.450Z
source accessed on: 2024-06-05T14:42:36Z
source last accessed on: 2024-06-05T14:42:36Z
label: Macchine stampaggio @it
label: Machines pour presses à estamper @fr
label: Maquinário press estampa @pt
label: Maquina de prensa estampado @es
label: Stanzmaschinen @de
label: Штамповочные прессы @ru
label: 冲压机械 @zh
label: 沖床機 @zh-hant
label: 금형 압축기 @ko
label: ｽﾀﾝﾋﾟﾝｸﾞﾌﾟﾚｽ機械 @ja
definition: This segment includes companies that manufacture stamping presses to shape or cut metal.
notation: 1710131717
valid from: 2024-06-07

Welding & Solder Equipment
type: BicsLevel5Segment
type: Classifier
type: NamedIndividual
is level5 segment of: Metalworking Machinery
is contemporary version of: http://data.ga-group.nl/ics/bics/1710131718
is version of: http://data.ga-group.nl/ics/bics/1710131718
replaces: http://data.ga-group.nl/ics/bics/2020/1710131718
imported on: 2026-06-08T13:40:52.236Z
last refreshed on: 2026-06-08T13:41:38.450Z
source accessed on: 2024-06-05T14:42:36Z
source last accessed on: 2024-06-05T14:42:36Z
label: App saldatura e brasatura @it
label: Equipamento de caldamento e soldagem @pt
label: Equipements de soudage/brasage @fr
label: Equipo de soldadura y metales @es
label: Schweiss- & Lötausrüstung @de
label: Сварочное и паяльное оборуд. @ru
label: 定位焊接与软焊接设备 @zh
label: 溶接･はんだ機器 @ja
label: 焊接設備 @zh-hant
label: 용접 및 납땜 장비 @ko
definition: This segment includes companies that manufacture equipment used to join metal materials together. Includes arc welding, gas welding, spot welding, and other types of welding and soldering equipment.
notation: 1710131718
valid from: 2024-06-07

Metalworking Machinery
type: BicsLevel4SubIndustry
type: Classifier
type: NamedIndividual
is sub industry of: Machinery
is contemporary version of: http://data.ga-group.nl/ics/bics/17101317
is version of: http://data.ga-group.nl/ics/bics/17101317
replaces: http://data.ga-group.nl/ics/bics/2020/17101317
imported on: 2026-06-08T13:40:52.236Z
last refreshed on: 2026-06-08T13:41:38.450Z
source accessed on: 2024-06-05T14:42:36Z
source last accessed on: 2024-06-05T14:42:36Z
label: Macchinari lavorazione metallo @it
label: Machines travail des métaux @fr
label: Maquinário siderúrgico @pt
label: Maquinaria para el tratamiento de metales @es
label: Metallverarbeitungsmaschinen @de
label: Техника для обработки металлов @ru
label: 金属加工机械设备 @zh
label: 金属加工機械 @ja
label: 金屬加工用機械 @zh-hant
label: 금속공작기계 @ko
label: 금속공작���계 @ko
definition: This industry subgroup includes companies that manufacture machinery used to mechanically transform metal by casting, forming, cutting, and joining.
notation: 17101317
valid from: 2024-06-07

Air Purification Equipment
type: BicsLevel5Segment
type: Classifier
type: NamedIndividual
is level5 segment of: Pollution Control Equipment
is contemporary version of: http://data.ga-group.nl/ics/bics/1710131810
is version of: http://data.ga-group.nl/ics/bics/1710131810
replaces: http://data.ga-group.nl/ics/bics/2020/1710131810
imported on: 2026-06-08T13:40:52.236Z
last refreshed on: 2026-06-08T13:41:38.450Z
source accessed on: 2024-06-05T14:42:36Z
source last accessed on: 2024-06-05T14:42:36Z
label: Apparecchiature purificazione aria @it
label: Equipamentos para purificação do ar @pt
label: Equipement de purification de l'air @fr
label: Equipo de purificación de aire @es
label: Luftreinhaltungsausrüstung @de
label: Оборуд. для очистки воздуха @ru
label: 空气净化设备 @zh
label: 空気清浄機器 @ja
label: 空氣濾淨設備 @zh-hant
label: 공기정화장비 @ko
definition: This segment includes companies that manufacture air purification equipment products used to reduce air pollution by removing contaminates before they are released into the atmosphere. Includes flue gas emission reduction equipment, scrubbers, cyclones, electrostatic precipitators, mist collectors, incinerators, catalytic reactors, biofilters, and activated carbon products used for air purification. Excludes companies that manufacture membrane-based filters (see Filtration Prods - Air & Liquids).
notation: 1710131810
valid from: 2024-06-07

Filtration Prods - Air & Liquids
type: BicsLevel5Segment
type: Classifier
type: NamedIndividual
is level5 segment of: Pollution Control Equipment
is contemporary version of: http://data.ga-group.nl/ics/bics/1710131811
is version of: http://data.ga-group.nl/ics/bics/1710131811
replaces: http://data.ga-group.nl/ics/bics/2020/1710131811
imported on: 2026-06-08T13:40:52.236Z
last refreshed on: 2026-06-08T13:41:38.450Z
source accessed on: 2024-06-05T14:42:36Z
source last accessed on: 2024-06-05T14:42:36Z
label: Filterprodukte - Luft & Flüssigkeiten @de
label: Prod filtragem - Ar e líquidos @pt
label: Prod filtraggio - Aria e liquidi @it
label: Prod filtration - Air/liquides @fr
label: Productos de filtración de aire y líquidos @es
label: Фильтры для очистки воздуха и жидк. @ru
label: ろ過製品-空気･液体 @ja
label: 过滤产品-气体与液体 @zh
label: 過濾產品-氣體/液體 @zh-hant
label: 필터제품-공기&유동체 @ko
definition: This segment includes companies that manufacture membrane-based filters for air and/or water purification. Also includes manufacturers of liquid separation equipment.
notation: 1710131811
valid from: 2024-06-07

Water Purification Equipment
type: BicsLevel5Segment
type: Classifier
type: NamedIndividual
is level5 segment of: Pollution Control Equipment
is contemporary version of: http://data.ga-group.nl/ics/bics/1710131812
is version of: http://data.ga-group.nl/ics/bics/1710131812
replaces: http://data.ga-group.nl/ics/bics/2020/1710131812
imported on: 2026-06-08T13:40:52.236Z
last refreshed on: 2026-06-08T13:41:38.450Z
source accessed on: 2024-06-05T14:42:36Z
source last accessed on: 2024-06-05T14:42:36Z
label: Apparecchiature depurazione idrica @it
label: Equipamento para purificação da água @pt
label: Equipements purification de l'eau @fr
label: Equipo de purificación de agua @es
label: Wasserreinhaltungsausrüstung @de
label: Оборуд. для очистки воды @ru
label: 水净化设备 @zh
label: 水濾淨設備製造 @zh-hant
label: 浄水機器 @ja
label: 수질정화장비 @ko
definition: This segment includes companies that manufacture water purification equipment. Includes water treatment systems equipment, water purification chemicals, biofilters, and activated carbon products used for water purification. Excludes companies that manufacture membrane-based filters (see Filtration Prods - Air & Liquids).
notation: 1710131812
valid from: 2024-06-07

Pollution Control Equipment
type: BicsLevel4SubIndustry
type: Classifier
type: NamedIndividual
is sub industry of: Machinery
is contemporary version of: http://data.ga-group.nl/ics/bics/17101318
is version of: http://data.ga-group.nl/ics/bics/17101318
replaces: http://data.ga-group.nl/ics/bics/2020/17101318
imported on: 2026-06-08T13:40:52.236Z
last refreshed on: 2026-06-08T13:41:38.450Z
source accessed on: 2024-06-05T14:42:36Z
source last accessed on: 2024-06-05T14:42:36Z
label: App controllo inquinamento @it
label: Eq control contam @es
label: Equip controle à poluição @pt
label: Equipements anti-pollution @fr
label: Umweltschutzausrüstung @de
label: Оборуд. контроля за загрязн. @ru
label: 汚染制御機器 @ja
label: 污染控制設備 @zh-hant
label: 污染控制设备 @zh
label: 오염 정화장치 @ko
definition: This industry subgroup includes companies that manufacture pollution control equipment. Includes air and water purification equipment, air and liquid filtration equipment, and filters.
notation: 17101318
valid from: 2024-06-07

Machinery
type: BicsLevel3Industry
type: Classifier
type: NamedIndividual
is industry of: Industrial Products
is contemporary version of: http://data.ga-group.nl/ics/bics/171013
is version of: http://data.ga-group.nl/ics/bics/171013
replaces: http://data.ga-group.nl/ics/bics/2020/171013
imported on: 2026-06-08T13:40:52.236Z
last refreshed on: 2026-06-08T13:41:38.450Z
source accessed on: 2024-06-05T14:42:36Z
source last accessed on: 2024-06-05T14:42:36Z
label: Macchinari @it
label: Machines @fr
label: Maquinário @pt
label: Maquinaria @es
label: Maschinen @de
label: Машинное оборудование @ru
label: 机械 @zh
label: 機械 @ja
label: 기계류 @ko
definition: This industry includes companies that manufacture machinery for use in a variety of applications.
notation: 171013
valid from: 2024-06-07

Commercial Veh Mfg - Electric
type: BicsLevel6Segment
type: Classifier
type: NamedIndividual
is level6 segment of: Commercial Vehicles Mfg
is contemporary version of: http://data.ga-group.nl/ics/bics/171014101010
is version of: http://data.ga-group.nl/ics/bics/171014101010
replaces: http://data.ga-group.nl/ics/bics/2020/171014101010
imported on: 2026-06-08T13:40:52.236Z
last refreshed on: 2026-06-08T13:41:38.450Z
source accessed on: 2024-06-05T14:42:36Z
source last accessed on: 2024-06-05T14:42:36Z
label: Fab de veh comerciales - eléctricos @es
label: Fab véh commercial - électricité @fr
label: Fab veíc comerciais - eletricidade @pt
label: Herstellung Nutzfahrzeuge - Elektrisch @de
label: Prod veicoli commerciali - Elettrici @it
label: Пр-во коммерческого транспорта - на электричестве @ru
label: Пр-во коммерческого транспорт�� - на электричестве @ru
label: 商業用自動車製造-電気 @ja
label: 商用車製造-電力 @zh-hant
label: 商用车辆制造-电动 @zh
label: 상업용 차량 제조 - 전기 @ko
definition: This segment includes companies that manufacture electric, on-highway commercial vehicles, such as medium and heavy trucks.
notation: 171014101010
valid from: 2024-06-07

Commercial Veh Mfg - Fossil Fuels
type: BicsLevel6Segment
type: Classifier
type: NamedIndividual
is level6 segment of: Commercial Vehicles Mfg
is contemporary version of: http://data.ga-group.nl/ics/bics/171014101011
is version of: http://data.ga-group.nl/ics/bics/171014101011
replaces: http://data.ga-group.nl/ics/bics/2020/171014101011
imported on: 2026-06-08T13:40:52.236Z
last refreshed on: 2026-06-08T13:41:38.450Z
source accessed on: 2024-06-05T14:42:36Z
source last accessed on: 2024-06-05T14:42:36Z
label: Fab de veh comerciales - combustibles fósiles @es
label: Fab véh commercial - combustibles fossiles @fr
label: Fab veíc comerciais - combustíveis fósseis @pt
label: Herstellung Nutzfahrzeuge - Fossile Brennstoffe @de
label: Prod veicoli commerciali - Combustibili fossili @it
label: Пр-во коммерческого транспорта - ископаемое топливо @ru
label: 商業用自動車製造-化石燃料 @ja
label: 商用車製造-化石燃料 @zh-hant
label: 商用车辆制造-化石燃料 @zh
label: 상업용 차량 제조 - 화석 연료 @ko
definition: This segment includes companies that manufacture fossil fuel, on-highway commercial vehicles, such as medium and heavy trucks.
notation: 171014101011
valid from: 2024-06-07

Commercial Vehicles Mfg
type: BicsLevel5Segment
type: Classifier
type: NamedIndividual
is level5 segment of: Commercial Vehicles
is contemporary version of: http://data.ga-group.nl/ics/bics/1710141010
is version of: http://data.ga-group.nl/ics/bics/1710141010
replaces: http://data.ga-group.nl/ics/bics/2020/1710141010
imported on: 2026-06-08T13:40:52.236Z
last refreshed on: 2026-06-08T13:41:38.450Z
source accessed on: 2024-06-05T14:42:36Z
source last accessed on: 2024-06-05T14:42:36Z
label: Fab véhicules commerciaux @fr
label: Fabr de veículos comerciais @pt
label: Fabricación de vehículos comerciales @es
label: Nutzfahrzeugeherst. @de
label: Prod veicoli commerciali @it
label: Коммерч. транспорт @ru
label: 商業用自動車 @ja
label: 商用車 @zh-hant
label: 商用车制造 @zh
label: 상용 자동차 제조업 @ko
definition: This segment includes companies that manufacture on-highway commercial vehicles. This typically includes class 5 through class 8 commercial vehicles. Excludes vehicles for retail consumers (see Automobiles).
notation: 1710141010
valid from: 2024-06-07

Commercial Vehicle Parts & Svcs
type: BicsLevel5Segment
type: Classifier
type: NamedIndividual
is level5 segment of: Commercial Vehicles
is contemporary version of: http://data.ga-group.nl/ics/bics/1710141011
is version of: http://data.ga-group.nl/ics/bics/1710141011
replaces: http://data.ga-group.nl/ics/bics/2020/1710141011
imported on: 2026-06-08T13:40:52.236Z
last refreshed on: 2026-06-08T13:41:38.450Z
source accessed on: 2024-06-05T14:42:36Z
source last accessed on: 2024-06-05T14:42:36Z
label: Nutzfahrzeugteile & Dienste @de
label: Peças e serv - veículos comerciais @pt
label: Pièces/srvc véhicules comm @fr
label: Serv e comp veicoli commerciali @it
label: Serv y partes vehículos comerciales @es
label: Коммерч. трансп. ср-ва/услуги @ru
label: 商用車輛零件及服務 @zh-hant
label: 商用車部品･ｻｰﾋﾞｽ @ja
label: 商用车辆零部件与服务 @zh
label: 상업용 차량 부품 & 서비스 @ko
definition: This segment includes companies the manufacture other parts and components for on-highway commercial vehicles. Includes brake systems, transmission, suspension, doors, steering, wheels and tires, and interior parts and accessories.
notation: 1710141011
valid from: 2024-06-07

Truck Trailers
type: BicsLevel5Segment
type: Classifier
type: NamedIndividual
is level5 segment of: Commercial Vehicles
is contemporary version of: http://data.ga-group.nl/ics/bics/1710141012
is version of: http://data.ga-group.nl/ics/bics/1710141012
replaces: http://data.ga-group.nl/ics/bics/2020/1710141012
imported on: 2026-06-08T13:40:52.236Z
last refreshed on: 2026-06-08T13:41:38.450Z
source accessed on: 2024-06-05T14:42:36Z
source last accessed on: 2024-06-05T14:42:36Z
label: Caminhão de reboque @pt
label: Lkw-Anhänger @de
label: Remolques para camiones @es
label: Remorques de camions @fr
label: Rimorchi autocarri @it
label: Прицепы для грузовых автомобилей @ru
label: 卡車拖車 @zh-hant
label: 卡车拖车 @zh
label: 트럭트레일러제조업 @ko
label: ﾄﾗｯｸﾄﾚｰﾗｰ @ja
definition: This segment includes companies that manufacture trailers for on-highway commercial vehicles.
notation: 1710141012
valid from: 2024-06-07

Commercial Vehicles
type: BicsLevel4SubIndustry
type: Classifier
type: NamedIndividual
is sub industry of: Transportation Equipment
is contemporary version of: http://data.ga-group.nl/ics/bics/17101410
is version of: http://data.ga-group.nl/ics/bics/17101410
replaces: http://data.ga-group.nl/ics/bics/2020/17101410
imported on: 2026-06-08T13:40:52.236Z
last refreshed on: 2026-06-08T13:41:38.450Z
source accessed on: 2024-06-05T14:42:36Z
source last accessed on: 2024-06-05T14:42:36Z
label: Nutzfahrzeuge @de
label: Véhicules commerciaux @fr
label: Veíc comerciais @pt
label: Vehículos com @es
label: Veicoli commerciali @it
label: Коммерч. транспорт @ru
label: 商业车辆 @zh
label: 商業用自動車 @ja
label: 商用車 @zh-hant
label: 상업용 자동차 @ko
definition: This industry subgroup includes companies that manufacture on-highway commercial vehicles, trailers, engines, and parts, including tire retreading.
notation: 17101410
valid from: 2024-06-07

Diesel Locomotives
type: BicsLevel6Segment
type: Classifier
type: NamedIndividual
is level6 segment of: Locomotives
is contemporary version of: http://data.ga-group.nl/ics/bics/171014111010
is version of: http://data.ga-group.nl/ics/bics/171014111010
replaces: http://data.ga-group.nl/ics/bics/2020/171014111010
imported on: 2026-06-08T13:40:52.236Z
last refreshed on: 2026-06-08T13:41:38.450Z
source accessed on: 2024-06-05T14:42:36Z
source last accessed on: 2024-06-05T14:42:36Z
label: Diesellokomotiven @de
label: Locomotivas a diesel @pt
label: Locomotive diesel @it
label: Locomotives diesel @fr
label: Locomotoras de diésel @es
label: Дизел. локомотивы @ru
label: 内燃机车 @zh
label: 柴油機車 @zh-hant
label: 디젤기관차 @ko
label: ﾃﾞｨｰｾﾞﾙ機関車 @ja
definition: This segment includes companies that manufacture diesel locomotives for the transport of both freight and passengers.
notation: 171014111010
valid from: 2024-06-07

Electric Locomotives
type: BicsLevel6Segment
type: Classifier
type: NamedIndividual
is level6 segment of: Locomotives
is contemporary version of: http://data.ga-group.nl/ics/bics/171014111011
is version of: http://data.ga-group.nl/ics/bics/171014111011
replaces: http://data.ga-group.nl/ics/bics/2020/171014111011
imported on: 2026-06-08T13:40:52.236Z
last refreshed on: 2026-06-08T13:41:38.450Z
source accessed on: 2024-06-05T14:42:36Z
source last accessed on: 2024-06-05T14:42:36Z
label: Elektrische Lokomotiven @de
label: Locomotivas elétricas @pt
label: Locomotive elettriche @it
label: Locomotives électriques @fr
label: Locomotoras eléctricas @es
label: Элект. локомотивы @ru
label: 电力机车 @zh
label: 電力機車 @zh-hant
label: 電気機関車 @ja
label: 전기기관차 @ko
definition: This segment includes companies that manufacture electric locomotives for the transport of both freight and passengers.
notation: 171014111011
valid from: 2024-06-07

Locomotives
type: BicsLevel5Segment
type: Classifier
type: NamedIndividual
is level5 segment of: Railroad Rolling Stock
is contemporary version of: http://data.ga-group.nl/ics/bics/1710141110
is version of: http://data.ga-group.nl/ics/bics/1710141110
replaces: http://data.ga-group.nl/ics/bics/2020/1710141110
imported on: 2026-06-08T13:40:52.236Z
last refreshed on: 2026-06-08T13:41:38.450Z
source accessed on: 2024-06-05T14:42:36Z
source last accessed on: 2024-06-05T14:42:36Z
label: Locomotivas @pt
label: Locomotive @it
label: Locomotoras @es
label: Lokomotiven @de
label: Локомотивы @ru
label: 列車機車 @zh-hant
label: 机车 @zh
label: 機関車 @ja
label: 기관차 @ko
definition: This segment includes all types of rail-rolling stock locomotives for both suburban and trans-urban railway networks.
notation: 1710141110
valid from: 2024-06-07

Rail Freight Cars
type: BicsLevel6Segment
type: Classifier
type: NamedIndividual
is level6 segment of: Rolling Stock - Railcars
is contemporary version of: http://data.ga-group.nl/ics/bics/171014111110
is version of: http://data.ga-group.nl/ics/bics/171014111110
replaces: http://data.ga-group.nl/ics/bics/2020/171014111110
imported on: 2026-06-08T13:40:52.236Z
last refreshed on: 2026-06-08T13:41:38.450Z
source accessed on: 2024-06-05T14:42:36Z
source last accessed on: 2024-06-05T14:42:36Z
label: Carros ferroviarios flete @es
label: Güterwagen @de
label: Vagões de frete @pt
label: Vagoni carico @it
label: Wagons de fret @fr
label: Грузовые вагоны @ru
label: 鉄道貨物車両 @ja
label: 鐵路貨車 @zh-hant
label: 铁路货车 @zh
label: 철도 화물차 @ko
definition: This segment includes companies that manufacture commercial freight railroad rolling stock.
notation: 171014111110
valid from: 2024-06-07

Rail Passenger Cars
type: BicsLevel6Segment
type: Classifier
type: NamedIndividual
is level6 segment of: Rolling Stock - Railcars
is contemporary version of: http://data.ga-group.nl/ics/bics/171014111111
is version of: http://data.ga-group.nl/ics/bics/171014111111
replaces: http://data.ga-group.nl/ics/bics/2020/171014111111
imported on: 2026-06-08T13:40:52.236Z
last refreshed on: 2026-06-08T13:41:38.450Z
source accessed on: 2024-06-05T14:42:36Z
source last accessed on: 2024-06-05T14:42:36Z
label: Carros ferroviarios pasaj @es
label: Personenwagen @de
label: Vagões de passageiro @pt
label: Vagoni passeggeri @it
label: Wagons de passagers @fr
label: Пассажирские вагоны @ru
label: 鉄道旅客車両 @ja
label: 鐵路客車 @zh-hant
label: 铁路客车 @zh
label: 철도 여객차 @ko
definition: This segment includes companies that manufacture passenger railroad cars for both suburban and intercity transport.
notation: 171014111111
valid from: 2024-06-07

Rolling Stock - Railcars
type: BicsLevel5Segment
type: Classifier
type: NamedIndividual
is level5 segment of: Railroad Rolling Stock
is contemporary version of: http://data.ga-group.nl/ics/bics/1710141111
is version of: http://data.ga-group.nl/ics/bics/1710141111
replaces: http://data.ga-group.nl/ics/bics/2020/1710141111
imported on: 2026-06-08T13:40:52.236Z
last refreshed on: 2026-06-08T13:41:38.450Z
source accessed on: 2024-06-05T14:42:36Z
source last accessed on: 2024-06-05T14:42:36Z
label: Mat circ - Vagões de trem @pt
label: Matériel roulant - Wagons @fr
label: Material rodante - automotores @es
label: Materiale rotabile - Vagoni @it
label: Wagen- & Lokomotivenbestand - Triebwagen @de
label: Подвижн. составы-Вагоны @ru
label: 机车车辆-有轨车 @zh
label: 軌道車輛-車廂 @zh-hant
label: 鉄道車両-車両 @ja
label: 철도차량-기관차 @ko
label: 철���차량-기관차 @ko
definition: This segment includes all types of rail-rolling stock for both suburban and trans-urban railway networks in both commercial and passenger transportation spaces.
notation: 1710141111
valid from: 2024-06-07

Rolling Stock Components & Sys
type: BicsLevel5Segment
type: Classifier
type: NamedIndividual
is level5 segment of: Railroad Rolling Stock
is contemporary version of: http://data.ga-group.nl/ics/bics/1710141112
is version of: http://data.ga-group.nl/ics/bics/1710141112
replaces: http://data.ga-group.nl/ics/bics/2020/1710141112
imported on: 2026-06-08T13:40:52.236Z
last refreshed on: 2026-06-08T13:41:38.450Z
source accessed on: 2024-06-05T14:42:36Z
source last accessed on: 2024-06-05T14:42:36Z
label: Compon e sistemas material circulante @pt
label: Componentes y sistemas de material rodante @es
label: Sis e componenti materiale rotabile @it
label: Systèmes et composants de matériel roulant @fr
label: Wagen- & Lokomotivenbestand - Komp. & Syst. @de
label: Компон. и системы подвижн. составов @ru
label: 机车车辆零部件与系统 @zh
label: 軌道車輛部件及系統 @zh-hant
label: 鉄道車両用部品･ｼｽﾃﾑ @ja
label: 鉄��車両用部品･ｼｽﾃﾑ @ja
label: 철도차량 부품 & 시스템 @ko
definition: This segment includes companies that manufacture rolling stock components and systems. This may include electronic systems and mechanical components.
notation: 1710141112
valid from: 2024-06-07

Rail Track Components & Sys
type: BicsLevel5Segment
type: Classifier
type: NamedIndividual
is level5 segment of: Railroad Rolling Stock
is contemporary version of: http://data.ga-group.nl/ics/bics/1710141113
is version of: http://data.ga-group.nl/ics/bics/1710141113
replaces: http://data.ga-group.nl/ics/bics/2020/1710141113
imported on: 2026-06-08T13:40:52.236Z
last refreshed on: 2026-06-08T13:41:38.450Z
source accessed on: 2024-06-05T14:42:36Z
source last accessed on: 2024-06-05T14:42:36Z
label: Compon e sistemas material circulante @pt
label: Componentes y sistemas ferroviarios @es
label: Eisenbahnschienenkomponenten & -systeme @de
label: Sistemi e componenti ferroviari @it
label: Syst et composants de voies ferrées @fr
label: Компоненты и системы ж/д путей @ru
label: 線路部品･ｼｽﾃﾑ @ja
label: 軌道部件及系統 @zh-hant
label: 轨道组件与系统 @zh
label: 철도 트랙 부품 & 시스템 @ko
definition: This segment includes companies that manufacture parts and systems for railway infrastructure networks, including switching systems and fasteners.
notation: 1710141113
valid from: 2024-06-07

Railroad Rolling Stock
type: BicsLevel4SubIndustry
type: Classifier
type: NamedIndividual
is sub industry of: Transportation Equipment
is contemporary version of: http://data.ga-group.nl/ics/bics/17101411
is version of: http://data.ga-group.nl/ics/bics/17101411
replaces: http://data.ga-group.nl/ics/bics/2020/17101411
imported on: 2026-06-08T13:40:52.236Z
last refreshed on: 2026-06-08T13:41:38.450Z
source accessed on: 2024-06-05T14:42:36Z
source last accessed on: 2024-06-05T14:42:36Z
label: Equipo ferroviario @es
label: Matériel ferroviaire roulant @fr
label: Material circulante ferroviário @pt
label: Sistemi trasporto ferroviario @it
label: Wagen- & Lokomotivenbestand @de
label: Ж/д подвижные составы @ru
label: 軌道車輛及車廂 @zh-hant
label: 鉄道車両 @ja
label: 铁路机车车辆 @zh
label: 철도 차량 @ko
definition: This industry subgroup includes companies that manufacture locomotives, transit passenger service cars, freight cars, railroads, and rail equipment parts.
notation: 17101411
valid from: 2024-06-07

Shipbuilding & Repair
type: BicsLevel5Segment
type: Classifier
type: NamedIndividual
is level5 segment of: Shipbuilding
is contemporary version of: http://data.ga-group.nl/ics/bics/1710141210
is version of: http://data.ga-group.nl/ics/bics/1710141210
replaces: http://data.ga-group.nl/ics/bics/2020/1710141210
imported on: 2026-06-08T13:40:52.236Z
last refreshed on: 2026-06-08T13:41:38.450Z
source accessed on: 2024-06-05T14:42:36Z
source last accessed on: 2024-06-05T14:42:36Z
label: Construcción naval y reparación @es
label: Construction navale et réparation @fr
label: Costruzione e riparazione navale @it
label: Fabr de navios e reparos @pt
label: Schiffsbau & -reparatur @de
label: Строительство и ремонт судов @ru
label: 造船与维修 @zh
label: 造船及維修 @zh-hant
label: 造船･船舶修理 @ja
label: 조선 & 수리 @ko
definition: This segment includes companies that manufacture and repair ships for commercial use.
notation: 1710141210
valid from: 2024-06-07

Marine Parts & Services
type: BicsLevel5Segment
type: Classifier
type: NamedIndividual
is level5 segment of: Shipbuilding
is contemporary version of: http://data.ga-group.nl/ics/bics/1710141211
is version of: http://data.ga-group.nl/ics/bics/1710141211
replaces: http://data.ga-group.nl/ics/bics/2020/1710141211
imported on: 2026-06-08T13:40:52.236Z
last refreshed on: 2026-06-08T13:41:38.450Z
source accessed on: 2024-06-05T14:42:36Z
source last accessed on: 2024-06-05T14:42:36Z
label: Partes y servicios marinos @es
label: Peças e serviços marítimos @pt
label: Pièces/serv industrie navale @fr
label: Porti e servizi marittimi @it
label: Schiffsteile & Dienste @de
label: Запчасти и облуж. кораблей @ru
label: 海洋部品･ｻｰﾋﾞｽ @ja
label: 海運售後市場零件/服務 @zh-hant
label: 船舶零部件与服务 @zh
label: 해양 부품 & 서비스 @ko
definition: This segment includes companies that provide parts and aftermarket services for ships. Includes maintenance services, as well as manufacturing of spare parts and aftermarket consumables.
notation: 1710141211
valid from: 2024-06-07

Shipbuilding
type: BicsLevel4SubIndustry
type: Classifier
type: NamedIndividual
is sub industry of: Transportation Equipment
is contemporary version of: http://data.ga-group.nl/ics/bics/17101412
is version of: http://data.ga-group.nl/ics/bics/17101412
replaces: http://data.ga-group.nl/ics/bics/2020/17101412
imported on: 2026-06-08T13:40:52.236Z
last refreshed on: 2026-06-08T13:41:38.450Z
source accessed on: 2024-06-05T14:42:36Z
source last accessed on: 2024-06-05T14:42:36Z
label: Construcción naval @es
label: Construction navale @fr
label: Costruzione navale @it
label: Fabricação de navios @pt
label: Schiffsbau @de
label: Строительство судов @ru
label: 造船 @ja
label: 조선 @ko
definition: This industry subgroup includes companies that manufacture ships and boats for commercial use, such as bulk carriers, container ships, cruise ships, ferries, and oil tankers. Excludes yachts and recreational boats (see Recreational Vehicles).
notation: 17101412
valid from: 2024-06-07

Transportation Equipment
type: BicsLevel3Industry
type: Classifier
type: NamedIndividual
is industry of: Industrial Products
is contemporary version of: http://data.ga-group.nl/ics/bics/171014
is version of: http://data.ga-group.nl/ics/bics/171014
replaces: http://data.ga-group.nl/ics/bics/2020/171014
imported on: 2026-06-08T13:40:52.236Z
last refreshed on: 2026-06-08T13:41:38.450Z
source accessed on: 2024-06-05T14:42:36Z
source last accessed on: 2024-06-05T14:42:36Z
label: Attrezzature da trasporto @it
label: Equipamentos de transportes @pt
label: Equipo de transporte @es
label: Matériel de transport @fr
label: Transportausrüstung @de
label: Транспортное оборудование @ru
label: 交通运输设备 @zh
label: 輸送用機器 @ja
label: 運輸設備 @zh-hant
label: 운송 장비 @ko
definition: This industry includes companies that manufacture equipment and vehicles used for commercial transportation across land and water.
notation: 171014
valid from: 2024-06-07

Ball & Roller Bearing
type: BicsLevel6Segment
type: Classifier
type: NamedIndividual
is level6 segment of: Hardware
is contemporary version of: http://data.ga-group.nl/ics/bics/171015101010
is version of: http://data.ga-group.nl/ics/bics/171015101010
replaces: http://data.ga-group.nl/ics/bics/2020/171015101010
imported on: 2026-06-08T13:40:52.236Z
last refreshed on: 2026-06-08T13:41:38.450Z
source accessed on: 2024-06-05T14:42:36Z
source last accessed on: 2024-06-05T14:42:36Z
label: Cojinete de municiones @es
label: Cuscinetti a sfera e a rulli @it
label: Kugel- & Rolllager @de
label: Rolamentos de esferas e de cilindros @pt
label: Roulements à billes/rouleaux @fr
label: Шариковые и роликовые подшипники @ru
label: 滚珠轴承 @zh
label: 球狀物及滾子軸承 @zh-hant
label: 볼/롤러베어링 @ko
label: ﾎﾞｰﾙﾍﾞｱﾘﾝｸﾞ @ja
definition: This segment includes companies that manufacture rolling-element bearings designed to reduce rotational friction.
notation: 171015101010
valid from: 2024-06-07

Bolts & Washers
type: BicsLevel6Segment
type: Classifier
type: NamedIndividual
is level6 segment of: Hardware
is contemporary version of: http://data.ga-group.nl/ics/bics/171015101011
is version of: http://data.ga-group.nl/ics/bics/171015101011
replaces: http://data.ga-group.nl/ics/bics/2020/171015101011
imported on: 2026-06-08T13:40:52.236Z
last refreshed on: 2026-06-08T13:41:38.450Z
source accessed on: 2024-06-05T14:42:36Z
source last accessed on: 2024-06-05T14:42:36Z
label: Arandelas y pernos @es
label: Bolzen & Unterlegscheiben @de
label: Bulloni e dadi @it
label: Ecrous et rondelles @fr
label: Parafusos e arruelas @pt
label: Болты и шайбы @ru
label: 螺栓与垫圈 @zh
label: 螺釘墊圈 @zh-hant
label: 볼트 & 워셔 @ko
label: ﾎﾞﾙﾄ･座金 @ja
definition: This segment includes companies that manufacture fastening hardware, such as bolts, nuts, screws, rivets, and washers.
notation: 171015101011
valid from: 2024-06-07

Fabricated Pipe & Pipe Fitting
type: BicsLevel6Segment
type: Classifier
type: NamedIndividual
is level6 segment of: Hardware
is contemporary version of: http://data.ga-group.nl/ics/bics/171015101012
is version of: http://data.ga-group.nl/ics/bics/171015101012
replaces: http://data.ga-group.nl/ics/bics/2020/171015101012
imported on: 2026-06-08T13:40:52.236Z
last refreshed on: 2026-06-08T13:41:38.450Z
source accessed on: 2024-06-05T14:42:36Z
source last accessed on: 2024-06-05T14:42:36Z
label: Tubería y conexiones @es
label: Tubi e guarnizioni fabbricati @it
label: Tubos fabricados e acessórios para tubos @pt
label: Tuyaux/raccords @fr
label: Verarbeitete Rohre & Rohrverbindungen @de
label: Готовые трубы и крепежные детали @ru
label: 導管製品 @zh-hant
label: 管道与管件 @zh
label: 金属製ﾊﾟｲﾌﾟ･付属品 @ja
label: 조립 파이프 및 파이프 장치 @ko
definition: This segment includes companies that manufacture pipes and various fittings for pipes and tubes made of metals other than iron or steel.
notation: 171015101012
valid from: 2024-06-07

Metal Valve
type: BicsLevel6Segment
type: Classifier
type: NamedIndividual
is level6 segment of: Hardware
is contemporary version of: http://data.ga-group.nl/ics/bics/171015101013
is version of: http://data.ga-group.nl/ics/bics/171015101013
replaces: http://data.ga-group.nl/ics/bics/2020/171015101013
imported on: 2026-06-08T13:40:52.236Z
last refreshed on: 2026-06-08T13:41:38.450Z
source accessed on: 2024-06-05T14:42:36Z
source last accessed on: 2024-06-05T14:42:36Z
label: Metallarmaturen @de
label: Soupapes en métal @fr
label: Válvula de metal @pt
label: Válvulas metálic @es
label: Valvole metallo @it
label: Металлическая арматура @ru
label: 金属阀门 @zh
label: 金属ﾊﾞﾙﾌﾞ @ja
label: 金屬活閥 @zh-hant
label: 금속 밸브 제조업 @ko
label: 금속 밸�� 제조업 @ko
definition: This segment includes companies that manufacture metal valves used to regulate the passage of fluids.
notation: 171015101013
valid from: 2024-06-07

Hardware
type: BicsLevel5Segment
type: Classifier
type: NamedIndividual
is level5 segment of: Fabricated Metal & Hardware
is contemporary version of: http://data.ga-group.nl/ics/bics/1710151010
is version of: http://data.ga-group.nl/ics/bics/1710151010
replaces: http://data.ga-group.nl/ics/bics/2020/1710151010
imported on: 2026-06-08T13:40:52.236Z
last refreshed on: 2026-06-08T13:41:38.450Z
source accessed on: 2024-06-05T14:42:36Z
source last accessed on: 2024-06-05T14:42:36Z
label: Eisenwaren @de
label: Matériel @fr
label: Скобяные изделия @ru
label: 五金 @zh
label: 하드웨어 @ko
label: ﾊｰﾄﾞｳｴｱ @ja
label: ���金 @zh
definition: This segment includes companies that manufacture generic, semi-finished metal products with broad applications.
notation: 1710151010
valid from: 2024-06-07

Custom Roll Forming
type: BicsLevel7Segment
type: Classifier
type: NamedIndividual
is level7 segment of: Forging & Stamping
is contemporary version of: http://data.ga-group.nl/ics/bics/17101510111010
is version of: http://data.ga-group.nl/ics/bics/17101510111010
replaces: http://data.ga-group.nl/ics/bics/2020/17101510111010
imported on: 2026-06-08T13:40:52.236Z
last refreshed on: 2026-06-08T13:41:38.450Z
source accessed on: 2024-06-05T14:42:36Z
source last accessed on: 2024-06-05T14:42:36Z
label: Formação de rolagem personalizada @pt
label: Frantumaz su ordinaz @it
label: Metales forjados @es
label: Profilage de produit @fr
label: Walzprofilieren @de
label: Специализир. роликовое профилирование @ru
label: 定制辊轧成型 @zh
label: 客製壓延成型 @zh-hant
label: 맞춤형압연성형업 @ko
label: ｶｽﾀﾑ圧延成型 @ja
definition: This segment includes companies that use roll forming to create either a long strand of metal or metal pieces in large quantities.
notation: 17101510111010
valid from: 2024-06-07

Iron & Steel Forging
type: BicsLevel7Segment
type: Classifier
type: NamedIndividual
is level7 segment of: Forging & Stamping
is contemporary version of: http://data.ga-group.nl/ics/bics/17101510111011
is version of: http://data.ga-group.nl/ics/bics/17101510111011
replaces: http://data.ga-group.nl/ics/bics/2020/17101510111011
imported on: 2026-06-08T13:40:52.236Z
last refreshed on: 2026-06-08T13:41:38.450Z
source accessed on: 2024-06-05T14:42:36Z
source last accessed on: 2024-06-05T14:42:36Z
label: Eisen-&Stahlschmiede @de
label: Ferro e aço forjados @pt
label: Forgeage fer/acier @fr
label: Fucinaz ferro acciai @it
label: Fund hierro y acero @es
label: Ковка железа и стали @ru
label: 鉄･鉄鋼鍛造 @ja
label: 鋼鐵鍛造 @zh-hant
label: 钢铁锻造 @zh
label: 철강단조업 @ko
definition: This segment includes companies that hot, warm, and cold forge both iron and steel.
notation: 17101510111011
valid from: 2024-06-07

Metal Stamping
type: BicsLevel7Segment
type: Classifier
type: NamedIndividual
is level7 segment of: Forging & Stamping
is contemporary version of: http://data.ga-group.nl/ics/bics/17101510111012
is version of: http://data.ga-group.nl/ics/bics/17101510111012
replaces: http://data.ga-group.nl/ics/bics/2020/17101510111012
imported on: 2026-06-08T13:40:52.236Z
last refreshed on: 2026-06-08T13:41:38.450Z
source accessed on: 2024-06-05T14:42:36Z
source last accessed on: 2024-06-05T14:42:36Z
label: Estampa de metais @pt
label: Estampage de métaux @fr
label: Frantumaz metallo @it
label: Metales troquelados @es
label: Metallstanzen @de
label: Чеканка металла @ru
label: 金属模印 @zh
label: 金属ﾌﾟﾚｽ @ja
label: 金屬沖壓製造 @zh-hant
label: 공공시스템 건설업 @ko
definition: This segment includes companies that form or punch sheet metal into desired shapes using a pressing tool.
notation: 17101510111012
valid from: 2024-06-07

Powder Metallurgy Parts
type: BicsLevel7Segment
type: Classifier
type: NamedIndividual
is level7 segment of: Forging & Stamping
is contemporary version of: http://data.ga-group.nl/ics/bics/17101510111013
is version of: http://data.ga-group.nl/ics/bics/17101510111013
replaces: http://data.ga-group.nl/ics/bics/2020/17101510111013
imported on: 2026-06-08T13:40:52.236Z
last refreshed on: 2026-06-08T13:41:38.450Z
source accessed on: 2024-06-05T14:42:36Z
source last accessed on: 2024-06-05T14:42:36Z
label: Partes metalúrgicas en polvo @es
label: Parti metallurgici in polvere @it
label: Peças de metalurgia dos pó @pt
label: Pièces pour la métallurgie des poudres @fr
label: Pulvermetallurgieteile @de
label: Детали порошковой металлургии @ru
label: 粉末冶金部品 @ja
label: 粉末冶金零件 @zh-hant
label: 粉末冶金零部件 @zh
label: 분말야금 부품 @ko
definition: This segment includes companies involved in powder metallurgy, in which the primary metal is divided into minute particles and passed through a die to form a cohesive structure.
notation: 17101510111013
valid from: 2024-06-07

Forging & Stamping
type: BicsLevel6Segment
type: Classifier
type: NamedIndividual
is level6 segment of: Fabricated Metal
is contemporary version of: http://data.ga-group.nl/ics/bics/171015101110
is version of: http://data.ga-group.nl/ics/bics/171015101110
replaces: http://data.ga-group.nl/ics/bics/2020/171015101110
imported on: 2026-06-08T13:40:52.236Z
last refreshed on: 2026-06-08T13:41:38.450Z
source accessed on: 2024-06-05T14:42:36Z
source last accessed on: 2024-06-05T14:42:36Z
label: Falsificação e estampa @pt
label: Forgeage, estampage @fr
label: Forjado y estampado @es
label: Fucinaz e frantumaz @it
label: Schmieden & Stanzen @de
label: Ковка и штамповка @ru
label: 金属鋳造･ﾌﾟﾚｽ @ja
label: 鍛造及沖壓 @zh-hant
label: 锻造与冲压 @zh
label: 단조 & 압형 @ko
definition: This segment includes companies that shape or reinforce metal by applying heat, pressure, and mechanical force.
notation: 171015101110
valid from: 2024-06-07

Industrial Pattern
type: BicsLevel6Segment
type: Classifier
type: NamedIndividual
is level6 segment of: Fabricated Metal
is contemporary version of: http://data.ga-group.nl/ics/bics/171015101111
is version of: http://data.ga-group.nl/ics/bics/171015101111
replaces: http://data.ga-group.nl/ics/bics/2020/171015101111
imported on: 2026-06-08T13:40:52.236Z
last refreshed on: 2026-06-08T13:41:38.450Z
source accessed on: 2024-06-05T14:42:36Z
source last accessed on: 2024-06-05T14:42:36Z
label: Gabarits industriels @fr
label: Industriemuster @de
label: Modelli industriali @it
label: Padrão industrial @pt
label: Patrones indus @es
label: Промышленные образцы @ru
label: 工业制版生产 @zh
label: 工業樣板 @zh-hant
label: 工業用金型 @ja
label: 산업용패턴제조업 @ko
definition: This segment includes companies that manufacture foundry cores and patterns used to mold various shapes in either iron or steel mills.
notation: 171015101111
valid from: 2024-06-07

Industrial Tanks & Storage
type: BicsLevel6Segment
type: Classifier
type: NamedIndividual
is level6 segment of: Fabricated Metal
is contemporary version of: http://data.ga-group.nl/ics/bics/171015101112
is version of: http://data.ga-group.nl/ics/bics/171015101112
replaces: http://data.ga-group.nl/ics/bics/2020/171015101112
imported on: 2026-06-08T13:40:52.236Z
last refreshed on: 2026-06-08T13:41:38.450Z
source accessed on: 2024-06-05T14:42:36Z
source last accessed on: 2024-06-05T14:42:36Z
label: Armaz e tanques industriais @pt
label: Industrietanks & Speicher @de
label: Réservoirs industriels/stockage @fr
label: Serbatoi ind e stoccaggio @it
label: Tanques, almacenaje ind @es
label: Индустриальные резервуары для хранения @ru
label: 工业槽罐与仓储 @zh
label: 工業用ﾀﾝｸ･貯蔵庫 @ja
label: 工業貯槽及儲存 @zh-hant
label: 산업용 탱크 & 저장 @ko
definition: This segment includes companies that manufacture metal tanks, vessels, and other containers.
notation: 171015101112
valid from: 2024-06-07

Machine Shops
type: BicsLevel6Segment
type: Classifier
type: NamedIndividual
is level6 segment of: Fabricated Metal
is contemporary version of: http://data.ga-group.nl/ics/bics/171015101113
is version of: http://data.ga-group.nl/ics/bics/171015101113
replaces: http://data.ga-group.nl/ics/bics/2020/171015101113
imported on: 2026-06-08T13:40:52.236Z
last refreshed on: 2026-06-08T13:41:38.450Z
source accessed on: 2024-06-05T14:42:36Z
source last accessed on: 2024-06-05T14:42:36Z
label: Ateliers d'usinage @fr
label: Lojas de máquinas @pt
label: Officine @it
label: Tiendas maquinaria @es
label: Werkstätten @de
label: Машиностроительные заводы @ru
label: 机械加工车间 @zh
label: 機械工場 @ja
label: 機械廠 @zh-hant
label: 기계공장 제조업 @ko
definition: This segment includes companies that provide a diverse offering of metalworking processes for custom manufacturing services.
notation: 171015101113
valid from: 2024-06-07

Electroplating
type: BicsLevel7Segment
type: Classifier
type: NamedIndividual
is level7 segment of: Metal Coat & Treating
is contemporary version of: http://data.ga-group.nl/ics/bics/17101510111410
is version of: http://data.ga-group.nl/ics/bics/17101510111410
replaces: http://data.ga-group.nl/ics/bics/2020/17101510111410
imported on: 2026-06-08T13:40:52.236Z
last refreshed on: 2026-06-08T13:41:38.450Z
source accessed on: 2024-06-05T14:42:36Z
source last accessed on: 2024-06-05T14:42:36Z
label: Electrogalvanisation @fr
label: Electroplatinado @es
label: Galvanoplastia @pt
label: Galvanoplastica @it
label: Galvanotechnik @de
label: Гальванопластика @ru
label: 电镀 @zh
label: 電気めっき･研磨･陽極酸化 @ja
label: 電鍍 @zh-hant
label: 전기도금 @ko
definition: This segment includes companies that electroplate products. Electroplating is designed to increase a product's resistance to abrasion and corrosion.
notation: 17101510111410
valid from: 2024-06-07

Metal Coat & Engraving Svcs
type: BicsLevel7Segment
type: Classifier
type: NamedIndividual
is level7 segment of: Metal Coat & Treating
is contemporary version of: http://data.ga-group.nl/ics/bics/17101510111411
is version of: http://data.ga-group.nl/ics/bics/17101510111411
replaces: http://data.ga-group.nl/ics/bics/2020/17101510111411
imported on: 2026-06-08T13:40:52.236Z
last refreshed on: 2026-06-08T13:41:38.450Z
source accessed on: 2024-06-05T14:42:36Z
source last accessed on: 2024-06-05T14:42:36Z
label: Metallbeschichtungs- & Gravurdienste @de
label: Recubrimiento y grabado de metal @es
label: Serv gravure/revêtement métallique @fr
label: Serv revestimento de metal e gravura @pt
label: Serv rivestimento metallo e incisione @it
label: Металлизация и гравировка @ru
label: 金属涂层与雕刻服务 @zh
label: 金属表面処理･彫金ｻｰﾋﾞｽ @ja
label: 金屬塗料及雕刻服務 @zh-hant
label: 금속코팅&판화 서비스 @ko
definition: This segment includes companies that coat metals to improve the strength and heat resistance of the products.
notation: 17101510111411
valid from: 2024-06-07

Metal Heat Treating
type: BicsLevel7Segment
type: Classifier
type: NamedIndividual
is level7 segment of: Metal Coat & Treating
is contemporary version of: http://data.ga-group.nl/ics/bics/17101510111412
is version of: http://data.ga-group.nl/ics/bics/17101510111412
replaces: http://data.ga-group.nl/ics/bics/2020/17101510111412
imported on: 2026-06-08T13:40:52.236Z
last refreshed on: 2026-06-08T13:41:38.450Z
source accessed on: 2024-06-05T14:42:36Z
source last accessed on: 2024-06-05T14:42:36Z
label: Traitmt therm. métal @fr
label: Tratam calor de met @es
label: Tratamento térmico de metais @pt
label: Tratt metallo caldo @it
label: Vergüten von Metall @de
label: Термообработка металлов @ru
label: 金属热处理 @zh
label: 金属熱処理 @ja
label: 金屬熱處理 @zh-hant
label: 금속열처리제조업 @ko
label: ���속열처리제조업 @ko
definition: This segment includes companies that heat and cool metals in a controlled manner in order to alter its physical properties.
notation: 17101510111412
valid from: 2024-06-07

Metal Coat & Treating
type: BicsLevel6Segment
type: Classifier
type: NamedIndividual
is level6 segment of: Fabricated Metal
is contemporary version of: http://data.ga-group.nl/ics/bics/171015101114
is version of: http://data.ga-group.nl/ics/bics/171015101114
replaces: http://data.ga-group.nl/ics/bics/2020/171015101114
imported on: 2026-06-08T13:40:52.236Z
last refreshed on: 2026-06-08T13:41:38.450Z
source accessed on: 2024-06-05T14:42:36Z
source last accessed on: 2024-06-05T14:42:36Z
label: Cubrimiento y tratamiento de metales @es
label: Metal Coat e tratamento @pt
label: Metallbeschichtung & -behandlung @de
label: Revêtement métallique et traitement @fr
label: Rivest metall e tratt @it
label: Покрытие и обработка металлов @ru
label: 金属涂层与处理 @zh
label: 金属表面処理･熱処理 @ja
label: 金屬塗層及處理 @zh-hant
label: 금속 코팅 & 처리 @ko
definition: This segment includes companies that coat and treat metal, typically as a finishing process.
notation: 171015101114
valid from: 2024-06-07

Prefabricated Metal
type: BicsLevel7Segment
type: Classifier
type: NamedIndividual
is level7 segment of: Sheet Metal
is contemporary version of: http://data.ga-group.nl/ics/bics/17101510111510
is version of: http://data.ga-group.nl/ics/bics/17101510111510
replaces: http://data.ga-group.nl/ics/bics/2020/17101510111510
imported on: 2026-06-08T13:40:52.236Z
last refreshed on: 2026-06-08T13:41:38.450Z
source accessed on: 2024-06-05T14:42:36Z
source last accessed on: 2024-06-05T14:42:36Z
label: Métal pré-fabriqué @fr
label: Metal pré-fab @pt
label: Metal prefabricado @es
label: Prefab metal @it
label: Vorverarbeitete Metalle @de
label: Металлические заготовки @ru
label: 預鑄金屬 @zh-hant
label: 预制金属 @zh
label: 사전조립 금속 @ko
label: ﾌﾟﾚﾊﾌﾞ金属 @ja
definition: This segment includes companies that manufacture prefabricated metal buildings, panels, and sections.
notation: 17101510111510
valid from: 2024-06-07

Sheet Metal Work
type: BicsLevel7Segment
type: Classifier
type: NamedIndividual
is level7 segment of: Sheet Metal
is contemporary version of: http://data.ga-group.nl/ics/bics/17101510111511
is version of: http://data.ga-group.nl/ics/bics/17101510111511
replaces: http://data.ga-group.nl/ics/bics/2020/17101510111511
imported on: 2026-06-08T13:40:52.236Z
last refreshed on: 2026-06-08T13:41:38.450Z
source accessed on: 2024-06-05T14:42:36Z
source last accessed on: 2024-06-05T14:42:36Z
label: Assentador de chapa metálica @pt
label: Blechmetallarbeiten @de
label: Hojas metálicas @es
label: Lavorazione lamiera @it
label: Ouvrages en tôle @fr
label: Изделия из жести @ru
label: 板金加工 @ja
label: 钣金加工 @zh
label: 판금속가공제조업 @ko
definition: This segment includes companies that manufacture metal concrete forms, such as flues, ducts, studs, gutters, stairs, gates, and ladders.
notation: 17101510111511
valid from: 2024-06-07

Sheet Metal
type: BicsLevel6Segment
type: Classifier
type: NamedIndividual
is level6 segment of: Fabricated Metal
is contemporary version of: http://data.ga-group.nl/ics/bics/171015101115
is version of: http://data.ga-group.nl/ics/bics/171015101115
replaces: http://data.ga-group.nl/ics/bics/2020/171015101115
imported on: 2026-06-08T13:40:52.236Z
last refreshed on: 2026-06-08T13:41:38.450Z
source accessed on: 2024-06-05T14:42:36Z
source last accessed on: 2024-06-05T14:42:36Z
label: Blechmetalle @de
label: Hojas metálicas @es
label: Lamiera @it
label: Placas de metal @pt
label: Tôle @fr
label: Металлолисты @ru
label: 板金 @zh-hant
label: 板金製品 @ja
label: 钣金 @zh
label: 판금속 제조업 @ko
definition: This segment includes companies that manufacture prefabricated metal buildings, panels, sections, and sheet metal.
notation: 171015101115
valid from: 2024-06-07

Fabricated Structural Metal
type: BicsLevel7Segment
type: Classifier
type: NamedIndividual
is level7 segment of: Structural Metal & Plate Work
is contemporary version of: http://data.ga-group.nl/ics/bics/17101510111610
is version of: http://data.ga-group.nl/ics/bics/17101510111610
replaces: http://data.ga-group.nl/ics/bics/2020/17101510111610
imported on: 2026-06-08T13:40:52.236Z
last refreshed on: 2026-06-08T13:41:38.450Z
source accessed on: 2024-06-05T14:42:36Z
source last accessed on: 2024-06-05T14:42:36Z
label: Elements de structures en métal @fr
label: Metais fabricados estruturados @pt
label: Metal estructural fabricado @es
label: Metalli strutturali fabbricati @it
label: Verarbeitende strukturierte Metalle @de
label: Готов. конструкц. металл @ru
label: 建築用金属製品 @ja
label: 結構金屬製品 @zh-hant
label: 金属结构件 @zh
label: 조립구조 금속 @ko
definition: This segment includes companies that manufacture products made of large metal plates used for infrastructure construction, including highway supports and floodgates.
notation: 17101510111610
valid from: 2024-06-07

Plate Work
type: BicsLevel7Segment
type: Classifier
type: NamedIndividual
is level7 segment of: Structural Metal & Plate Work
is contemporary version of: http://data.ga-group.nl/ics/bics/17101510111611
is version of: http://data.ga-group.nl/ics/bics/17101510111611
replaces: http://data.ga-group.nl/ics/bics/2020/17101510111611
imported on: 2026-06-08T13:40:52.236Z
last refreshed on: 2026-06-08T13:41:38.450Z
source accessed on: 2024-06-05T14:42:36Z
source last accessed on: 2024-06-05T14:42:36Z
label: Assentador de placa @pt
label: Fabricación platos @es
label: Plattenwaren @de
label: Prodotti lamiera @it
label: Tôles fortes @fr
label: Изделия из метал. плит @ru
label: 板材加工 @zh
label: 金属ﾌﾟﾚｰﾄ製品 @ja
label: 金屬板加工 @zh-hant
label: 판금가공 제조업 @ko
definition: This segment includes companies that manufacture products made of large metal plates that are not used in the construction of architectural structures.
notation: 17101510111611
valid from: 2024-06-07

Structural Metal & Plate Work
type: BicsLevel6Segment
type: Classifier
type: NamedIndividual
is level6 segment of: Fabricated Metal
is contemporary version of: http://data.ga-group.nl/ics/bics/171015101116
is version of: http://data.ga-group.nl/ics/bics/171015101116
replaces: http://data.ga-group.nl/ics/bics/2020/171015101116
imported on: 2026-06-08T13:40:52.236Z
last refreshed on: 2026-06-08T13:41:38.450Z
source accessed on: 2024-06-05T14:42:36Z
source last accessed on: 2024-06-05T14:42:36Z
label: Lamiera e metalli strutturali @it
label: Metais estruturados e assentador de placa @pt
label: Strukturierte Metall- & Plattenarbeiten @de
label: Tôles fortes et métal de structure @fr
label: Trabajos de placas y metal estructural @es
label: Структурн. метал. изделия и пластины @ru
label: 構造金属･板金製品 @ja
label: 結構金屬及金屬板 @zh-hant
label: 结构金属与板材加工 @zh
label: 철골&철판작업 @ko
definition: This segment includes companies that manufacture products made of large metal plates.
notation: 171015101116
valid from: 2024-06-07

Spring (Heavy Gauge)
type: BicsLevel7Segment
type: Classifier
type: NamedIndividual
is level7 segment of: Wire Products
is contemporary version of: http://data.ga-group.nl/ics/bics/17101510111710
is version of: http://data.ga-group.nl/ics/bics/17101510111710
replaces: http://data.ga-group.nl/ics/bics/2020/17101510111710
imported on: 2026-06-08T13:40:52.236Z
last refreshed on: 2026-06-08T13:41:38.450Z
source accessed on: 2024-06-05T14:42:36Z
source last accessed on: 2024-06-05T14:42:36Z
label: Molas (calibre pesado) @pt
label: Molle (pesanti) @it
label: Resortes (calibre grueso) @es
label: Ressorts (en métal épais) @fr
label: Springfedererzeugnisse (Heavy Gauge) @de
label: Крупногабар. пружины @ru
label: 弹簧(大型量规) @zh
label: 重型彈簧 @zh-hant
label: 스프링 (중량) 제조업 @ko
label: ﾊﾞﾈ(重厚) @ja
definition: This segment includes companies that manufacture high-gauge springs.
notation: 17101510111710
valid from: 2024-06-07

Spring (Light Gauge)
type: BicsLevel7Segment
type: Classifier
type: NamedIndividual
is level7 segment of: Wire Products
is contemporary version of: http://data.ga-group.nl/ics/bics/17101510111711
is version of: http://data.ga-group.nl/ics/bics/17101510111711
replaces: http://data.ga-group.nl/ics/bics/2020/17101510111711
imported on: 2026-06-08T13:40:52.236Z
last refreshed on: 2026-06-08T13:41:38.450Z
source accessed on: 2024-06-05T14:42:36Z
source last accessed on: 2024-06-05T14:42:36Z
label: Molas (calibre leve) @pt
label: Molle (leggere) @it
label: Resortes (calibre ligero) @es
label: Ressorts (en métal fin) @fr
label: Springfedererzeugnisse (Light Gauge) @de
label: Малогабаритные пружины @ru
label: 弹簧(小型量规) @zh
label: 輕型彈簧 @zh-hant
label: 스프링 (경량) 제조업 @ko
label: ﾊﾞﾈ(薄金) @ja
definition: This segment includes companies that manufacture low-gauge springs.
notation: 17101510111711
valid from: 2024-06-07

Wire Products
type: BicsLevel6Segment
type: Classifier
type: NamedIndividual
is level6 segment of: Fabricated Metal
is contemporary version of: http://data.ga-group.nl/ics/bics/171015101117
is version of: http://data.ga-group.nl/ics/bics/171015101117
replaces: http://data.ga-group.nl/ics/bics/2020/171015101117
imported on: 2026-06-08T13:40:52.236Z
last refreshed on: 2026-06-08T13:41:38.450Z
source accessed on: 2024-06-05T14:42:36Z
source last accessed on: 2024-06-05T14:42:36Z
label: Drahtprodukte @de
label: Prodotti di filo @it
label: Productos de alambre @es
label: Produits de tréfilage @fr
label: Produtos de fio @pt
label: Метизы @ru
label: 線材產品 @zh-hant
label: 线材 @zh
label: 와이어 제품 @ko
label: ﾜｲﾔ製品 @ja
definition: This segment includes companies that manufacture springs and wires. Typically, these products are made by passing drawn metal through progressively smaller dies or holes in draw plates.
notation: 171015101117
valid from: 2024-06-07

Fabricated Metal
type: BicsLevel5Segment
type: Classifier
type: NamedIndividual
is level5 segment of: Fabricated Metal & Hardware
is contemporary version of: http://data.ga-group.nl/ics/bics/1710151011
is version of: http://data.ga-group.nl/ics/bics/1710151011
replaces: http://data.ga-group.nl/ics/bics/2020/1710151011
imported on: 2026-06-08T13:40:52.236Z
last refreshed on: 2026-06-08T13:41:38.450Z
source accessed on: 2024-06-05T14:42:36Z
source last accessed on: 2024-06-05T14:42:36Z
label: Métaux ouvrés @fr
label: Metal fabricado @pt
label: Metales fabricados @es
label: Metalli fabbricati @it
label: Verarbeitete Metalle @de
label: Металлоизделия @ru
label: 金属制品 @zh
label: 金属製品 @ja
label: 金屬製品 @zh-hant
label: 조립금속 @ko
definition: This segment includes companies that specialize in metalworking processes and use their specializations to manufacture semi-finished materials or metal products. Also includes companies that specialize in manufacturing custom metal products.
notation: 1710151011
valid from: 2024-06-07

Fabricated Metal & Hardware
type: BicsLevel4SubIndustry
type: Classifier
type: NamedIndividual
is sub industry of: Industrial Intermediate Prod
is contemporary version of: http://data.ga-group.nl/ics/bics/17101510
is version of: http://data.ga-group.nl/ics/bics/17101510
replaces: http://data.ga-group.nl/ics/bics/2020/17101510
imported on: 2026-06-08T13:40:52.236Z
last refreshed on: 2026-06-08T13:41:38.450Z
source accessed on: 2024-06-05T14:42:36Z
source last accessed on: 2024-06-05T14:42:36Z
label: Metais fabricados e hardware @pt
label: Metal fabricado y productos de ferretería @es
label: Metallo fabbricato e ferramenta @it
label: Quincaill/métaux transformés @fr
label: Verarbeitetes Metall & Metallwaren @de
label: Металлоконструкции и скобяные изделия @ru
label: 金属制品和五金 @zh
label: 金属製品･金物 @ja
label: 金屬製品及五金 @zh-hant
label: 조립금속&철물 @ko
definition: This industry subgroup includes companies that manufacture semi-finished metal products. These companies typically specialize in a specific type of metalworking manufacturing process or a specific type of metal product.
notation: 17101510
valid from: 2024-06-07

Plastic Products
type: BicsLevel5Segment
type: Classifier
type: NamedIndividual
is level5 segment of: Rubber & Plastic
is contemporary version of: http://data.ga-group.nl/ics/bics/1710151110
is version of: http://data.ga-group.nl/ics/bics/1710151110
replaces: http://data.ga-group.nl/ics/bics/2020/1710151110
imported on: 2026-06-08T13:40:52.236Z
last refreshed on: 2026-06-08T13:41:38.450Z
source accessed on: 2024-06-05T14:42:36Z
source last accessed on: 2024-06-05T14:42:36Z
label: Plastikprodukte @de
label: Prodotti in plastica @it
label: Productos plásticos @es
label: Produits en plastique @fr
label: Produtos plásticos @pt
label: Товары из пластмассы @ru
label: 塑料制品 @zh
label: 塑膠產品 @zh-hant
label: 플라스틱 제품 제조업 @ko
label: ﾌﾟﾗｽﾁｯｸ製品 @ja
definition: This segment includes companies that specialize in plastic manufacturing processes. Typically, these companies produce intermediate goods with industrial applications.
notation: 1710151110
valid from: 2024-06-07

Mechanical Rubber Products
type: BicsLevel6Segment
type: Classifier
type: NamedIndividual
is level6 segment of: Rubber Products
is contemporary version of: http://data.ga-group.nl/ics/bics/171015111110
is version of: http://data.ga-group.nl/ics/bics/171015111110
replaces: http://data.ga-group.nl/ics/bics/2020/171015111110
imported on: 2026-06-08T13:40:52.236Z
last refreshed on: 2026-06-08T13:41:38.450Z
source accessed on: 2024-06-05T14:42:36Z
source last accessed on: 2024-06-05T14:42:36Z
label: Mechanische Gummiprodukte @de
label: Prod. de caoutchouc industriel @fr
label: Prodotti meccanici in gomma @it
label: Productos mecánicos de goma @es
label: Produtos mecânicos de borracha @pt
label: Резинотехнические изделия @ru
label: 工業用ｺﾞﾑ製品 @ja
label: 机械橡胶制品 @zh
label: 機械用橡膠製品 @zh-hant
label: 산업용 고무제품 @ko
label: 산업용 고무제�� @ko
definition: This segment includes companies that manufacture rubber goods for mechanical applications. Includes O-rings, gaskets, seals, and rubber bushings.
notation: 171015111110
valid from: 2024-06-07

Non-Mechanical Rubber Products
type: BicsLevel6Segment
type: Classifier
type: NamedIndividual
is level6 segment of: Rubber Products
is contemporary version of: http://data.ga-group.nl/ics/bics/171015111111
is version of: http://data.ga-group.nl/ics/bics/171015111111
replaces: http://data.ga-group.nl/ics/bics/2020/171015111111
imported on: 2026-06-08T13:40:52.236Z
last refreshed on: 2026-06-08T13:41:38.450Z
source accessed on: 2024-06-05T14:42:36Z
source last accessed on: 2024-06-05T14:42:36Z
label: Nicht mechanische Gummiprodukte @de
label: Prodotti non meccanici gomma @it
label: Productos no mecánicos de goma @es
label: Produits caoutchouc non indus @fr
label: Produtos de borracha não mecânicos @pt
label: Немиханич. резиновые изделия @ru
label: 非工業用ｺﾞﾑ製品 @ja
label: 非机械橡胶制品 @zh
label: 非機械用橡膠產品 @zh-hant
label: 비산업용 고무 제품 @ko
definition: This segment includes companies that manufacture rubber goods for non-mechanical applications.
notation: 171015111111
valid from: 2024-06-07

Rubber Products
type: BicsLevel5Segment
type: Classifier
type: NamedIndividual
is level5 segment of: Rubber & Plastic
is contemporary version of: http://data.ga-group.nl/ics/bics/1710151111
is version of: http://data.ga-group.nl/ics/bics/1710151111
replaces: http://data.ga-group.nl/ics/bics/2020/1710151111
imported on: 2026-06-08T13:40:52.236Z
last refreshed on: 2026-06-08T13:41:38.450Z
source accessed on: 2024-06-05T14:42:36Z
source last accessed on: 2024-06-05T14:42:36Z
label: Derivados da borracha @pt
label: Gummiprodukte @de
label: Prod gomma @it
label: Productos de goma @es
label: Produits en caoutchouc @fr
label: Продукция из резины @ru
label: 其他橡胶制品生产 @zh
label: 橡膠製品 @zh-hant
label: 고무 제품 @ko
label: ｺﾞﾑ製品 @ja
definition: This segment includes companies that specialize in manufacturing rubber products.
notation: 1710151111
valid from: 2024-06-07

Rubber & Plastic
type: BicsLevel4SubIndustry
type: Classifier
type: NamedIndividual
is sub industry of: Industrial Intermediate Prod
is contemporary version of: http://data.ga-group.nl/ics/bics/17101511
is version of: http://data.ga-group.nl/ics/bics/17101511
replaces: http://data.ga-group.nl/ics/bics/2020/17101511
imported on: 2026-06-08T13:40:52.236Z
last refreshed on: 2026-06-08T13:41:38.450Z
source accessed on: 2024-06-05T14:42:36Z
source last accessed on: 2024-06-05T14:42:36Z
label: Caoutchouc et plastique @fr
label: Goma y plástico @es
label: Gummi & Kunststoff @de
label: Plástico e borracha @pt
label: Plastica e gomma @it
label: Резина и пластмасса @ru
label: 橡胶与塑料 @zh
label: 橡膠及塑膠 @zh-hant
label: 고무 & 플라스틱 제조업 @ko
label: ｺﾞﾑ･ﾌﾟﾗｽﾁｯｸ @ja
definition: This industry subgroup includes companies that manufacture rubber and plastic products. Includes laminated plastics, polystyrene foam, plastic film, and rubber products used in mechanical product manufacturing, such as gasket and absorption parts.
notation: 17101511
valid from: 2024-06-07

Industrial Intermediate Prod
type: BicsLevel3Industry
type: Classifier
type: NamedIndividual
is industry of: Industrial Products
is contemporary version of: http://data.ga-group.nl/ics/bics/171015
is version of: http://data.ga-group.nl/ics/bics/171015
replaces: http://data.ga-group.nl/ics/bics/2020/171015
imported on: 2026-06-08T13:40:52.236Z
last refreshed on: 2026-06-08T13:41:38.450Z
source accessed on: 2024-06-05T14:42:36Z
source last accessed on: 2024-06-05T14:42:36Z
label: Industrielle Zwischenprodukte @de
label: Prod indus intermédiaires @fr
label: Prod industrial intermediário @pt
label: Prod industriales intermedios @es
label: Prod intermedi industriali @it
label: Промышл. промежут. продукты @ru
label: 工业中间产品 @zh
label: 工業中間製品 @ja
label: 工��中间产品 @zh
label: 製造品 @zh-hant
label: 산업용 중간재 생산 @ko
definition: This industry includes companies that process metal, plastic, or rubber into semi-finished products. Typically, these products have a broad application and are used as inputs for other manufacturers.
notation: 171015
valid from: 2024-06-07

Industrial Products
type: BicsLevel2IndustryGroup
type: Classifier
type: NamedIndividual
is industry group of: Industrials
is contemporary version of: http://data.ga-group.nl/ics/bics/1710
is version of: http://data.ga-group.nl/ics/bics/1710
replaces: http://data.ga-group.nl/ics/bics/2020/1710
imported on: 2026-06-08T13:40:52.236Z
last refreshed on: 2026-06-08T13:41:38.450Z
source accessed on: 2024-06-05T14:42:36Z
source last accessed on: 2024-06-05T14:42:36Z
label: Industrieprodukte @de
label: Prodotti industriali @it
label: Productos industriales @es
label: Produits industriels @fr
label: Produtos industriais @pt
label: Промышленная продукция @ru
label: 工业产品 @zh
label: 工業產品 @zh-hant
label: 工業製品 @ja
label: 工業��品 @zh-hant
label: 산업제품 @ko
definition: This industry group includes companies that manufacture industrial products.
notation: 1710
valid from: 2024-06-07

Const/Mining Mach/Equip Whslrs
type: BicsLevel6Segment
type: Classifier
type: NamedIndividual
is level6 segment of: Industrial Machinery Whslrs
is contemporary version of: http://data.ga-group.nl/ics/bics/171110101010
is version of: http://data.ga-group.nl/ics/bics/171110101010
replaces: http://data.ga-group.nl/ics/bics/2020/171110101010
imported on: 2026-06-08T13:40:52.236Z
last refreshed on: 2026-06-08T13:41:38.450Z
source accessed on: 2024-06-05T14:42:36Z
source last accessed on: 2024-06-05T14:42:36Z
label: Atacad de construção/maq de mineração/equip @pt
label: Bau-/Bergbaumasch./Ausrüst. GH @de
label: Gross mach/équip constr/mines @fr
label: Grossisti app/costruz/estraz @it
label: Mayoristas equipo/maq de extracc/const @es
label: Опт. торг. - оборуд. для стр-ва/добычи @ru
label: 建筑/采矿机械/设备批发商 @zh
label: 建設･鉱業用機械器具卸売 @ja
label: 營建/礦業機械/設備經銷商 @zh-hant
label: 건설/광업 기계/장비 도매 @ko
definition: This segment includes companies that wholesale and distribute specialized machinery, equipment, and parts used in construction, mining, and logging activities.
notation: 171110101010
valid from: 2024-06-07

Farm/Garden Mach/Equip Whslrs
type: BicsLevel6Segment
type: Classifier
type: NamedIndividual
is level6 segment of: Industrial Machinery Whslrs
is contemporary version of: http://data.ga-group.nl/ics/bics/171110101011
is version of: http://data.ga-group.nl/ics/bics/171110101011
replaces: http://data.ga-group.nl/ics/bics/2020/171110101011
imported on: 2026-06-08T13:40:52.236Z
last refreshed on: 2026-06-08T13:41:38.450Z
source accessed on: 2024-06-05T14:42:36Z
source last accessed on: 2024-06-05T14:42:36Z
label: Atacad de maq agrícolas/jardim/equip @pt
label: Gross mach/équip ferme/jardin @fr
label: Grossisti app/mac agr/giardino @it
label: Land-/Gartenmasch./Ausrüst. GH @de
label: Mayoristas equipo/maq de jardinería/agric @es
label: Опт. торг. - оборуд. для с/х @ru
label: 农业/园艺机械/设备批发商 @zh
label: 農業及園藝機械/設備經銷商 @zh-hant
label: 農業･ｶﾞｰﾃﾞﾆﾝｸﾞ用機械器具卸売 @ja
label: 농업/정원 기계/장비 도매 @ko
definition: This segment includes companies that wholesale and distribute specialized machinery, equipment and parts used in farming activities. Includes tractors, harvesters, and irrigation equipment.
notation: 171110101011
valid from: 2024-06-07

Industrial Mach & Equip Whslrs
type: BicsLevel6Segment
type: Classifier
type: NamedIndividual
is level6 segment of: Industrial Machinery Whslrs
is contemporary version of: http://data.ga-group.nl/ics/bics/171110101012
is version of: http://data.ga-group.nl/ics/bics/171110101012
replaces: http://data.ga-group.nl/ics/bics/2020/171110101012
imported on: 2026-06-08T13:40:52.236Z
last refreshed on: 2026-06-08T13:41:38.450Z
source accessed on: 2024-06-05T14:42:36Z
source last accessed on: 2024-06-05T14:42:36Z
label: Atacad de maq e equip industriais @pt
label: Gross machines/équip indus @fr
label: Grossisti app/macch industr @it
label: Industriemasch. & Ausrüst. GH @de
label: Mayoristas de equip y maq ind @es
label: Опт. торг. - промышл. оборуд./маш. @ru
label: 工业机械与设备批发商 @zh
label: 工業機械/設備經銷商 @zh-hant
label: 産業機械器具卸売 @ja
label: 산업용 기계 & 장비 도매 @ko
definition: This segment includes companies that wholesale and distribute stationary machinery and equipment.
notation: 171110101012
valid from: 2024-06-07

Transport Equip & Sply Whslrs
type: BicsLevel6Segment
type: Classifier
type: NamedIndividual
is level6 segment of: Industrial Machinery Whslrs
is contemporary version of: http://data.ga-group.nl/ics/bics/171110101013
is version of: http://data.ga-group.nl/ics/bics/171110101013
replaces: http://data.ga-group.nl/ics/bics/2020/171110101013
imported on: 2026-06-08T13:40:52.236Z
last refreshed on: 2026-06-08T13:41:38.450Z
source accessed on: 2024-06-05T14:42:36Z
source last accessed on: 2024-06-05T14:42:36Z
label: Atacad de equip e supr de transporte @pt
label: Gross équip/fournit transport @fr
label: Grossisti forn e app trasporto @it
label: Mayoristas equipo y prov transporte @es
label: Transporteinr. & Zubeh. Großhdl. @de
label: Опт. торг. - трансп. оборуд. @ru
label: 交通运输设备与物资批发商 @zh
label: 交通运输设备与物资批发��� @zh
label: 輸送機器･付属品卸売 @ja
label: 運輸設備/用品經銷商 @zh-hant
label: 운송 장비 & 용품 도매 @ko
definition: This segment includes companies that wholesale and distribute on-highway commercial vehicles and parts.
notation: 171110101013
valid from: 2024-06-07

Industrial Machinery Whslrs
type: BicsLevel5Segment
type: Classifier
type: NamedIndividual
is level5 segment of: Industrial Wholesale & Rental
is contemporary version of: http://data.ga-group.nl/ics/bics/1711101010
is version of: http://data.ga-group.nl/ics/bics/1711101010
replaces: http://data.ga-group.nl/ics/bics/2020/1711101010
imported on: 2026-06-08T13:40:52.236Z
last refreshed on: 2026-06-08T13:41:38.450Z
source accessed on: 2024-06-05T14:42:36Z
source last accessed on: 2024-06-05T14:42:36Z
label: Atacad de maquinário industrial @pt
label: Grossistes machines indus @fr
label: Grossisti macch industriali @it
label: Industriemaschinen Großhdl. @de
label: Mayoristas de maq industrial @es
label: Промышл. техника - опт. торговля @ru
label: 工业机械批发商 @zh
label: 工業機械經銷商 @zh-hant
label: 産業機械卸売 @ja
label: 산업용 기계 도매 @ko
definition: This segment includes companies that wholesale and distribute industrial machinery and parts.
notation: 1711101010
valid from: 2024-06-07

HVAC Equip & Supplies Whslrs
type: BicsLevel6Segment
type: Classifier
type: NamedIndividual
is level6 segment of: Industrial Equip & Sply Whslrs
is contemporary version of: http://data.ga-group.nl/ics/bics/171110101110
is version of: http://data.ga-group.nl/ics/bics/171110101110
replaces: http://data.ga-group.nl/ics/bics/2020/171110101110
imported on: 2026-06-08T13:40:52.236Z
last refreshed on: 2026-06-08T13:41:38.450Z
source accessed on: 2024-06-05T14:42:36Z
source last accessed on: 2024-06-05T14:42:36Z
label: Atacad equip e supr HVAC @pt
label: Gross fournit/app clim/chauff @fr
label: Grossisti app e forn HVAC @it
label: HLK-Geräte & Zubehör GH @de
label: HVAC 장비 & 용품 도매 @ko
label: Mayoristas equipo y prov HVAC @es
label: Опт. торговля - системы ОКВД @ru
label: 冷暖房空調設備･備品卸売 @ja
label: 暖氣/空調設備/用品經銷商 @zh-hant
label: 暖通空调设备与用品批发商 @zh
definition: This segment includes companies that wholesale and distribute heating, ventilation, and air conditioning products.
notation: 171110101110
valid from: 2024-06-07

Electrical Supplies Whslrs
type: BicsLevel6Segment
type: Classifier
type: NamedIndividual
is level6 segment of: Industrial Equip & Sply Whslrs
is contemporary version of: http://data.ga-group.nl/ics/bics/171110101111
is version of: http://data.ga-group.nl/ics/bics/171110101111
replaces: http://data.ga-group.nl/ics/bics/2020/171110101111
imported on: 2026-06-08T13:40:52.236Z
last refreshed on: 2026-06-08T13:41:38.450Z
source accessed on: 2024-06-05T14:42:36Z
source last accessed on: 2024-06-05T14:42:36Z
label: Atacad de suprimentos elétricos @pt
label: Elektrisches Zubehör Großhdl. @de
label: Gross fournitures électriques @fr
label: Grossisti forniture elettriche @it
label: Mayoristas prov eléctricas @es
label: Опт. торговля - электр. оборудование @ru
label: 电气器材批发商 @zh
label: 電機用品批發商 @zh-hant
label: 電気機器卸売 @ja
label: 전기 용품 도매 @ko
definition: This segment includes companies that wholesale and distribute electrical supplies for commercial use.
notation: 171110101111
valid from: 2024-06-07

Janitorial Supplies Whslrs
type: BicsLevel6Segment
type: Classifier
type: NamedIndividual
is level6 segment of: Industrial Equip & Sply Whslrs
is contemporary version of: http://data.ga-group.nl/ics/bics/171110101112
is version of: http://data.ga-group.nl/ics/bics/171110101112
replaces: http://data.ga-group.nl/ics/bics/2020/171110101112
imported on: 2026-06-08T13:40:52.236Z
last refreshed on: 2026-06-08T13:41:38.450Z
source accessed on: 2024-06-05T14:42:36Z
source last accessed on: 2024-06-05T14:42:36Z
label: Atacad de suprimentos de limpeza @pt
label: Gross fournitures sanitaires @fr
label: Grossisti forniture pulizia @it
label: Hausmeisterbedarf Großhdl. @de
label: Mayoristas prov limpieza @es
label: Опт. торговля - уборочн. инвентарь @ru
label: 保洁用品批发商 @zh
label: 清掃用品卸売 @ja
label: 清潔/衛生用品經銷商 @zh-hant
label: 환경미화 용품 도매 @ko
definition: This segment includes companies that wholesale and distribute janitorial and sanitary supplies for commercial use.
notation: 171110101112
valid from: 2024-06-07

Plumbing Supplies Whslrs
type: BicsLevel6Segment
type: Classifier
type: NamedIndividual
is level6 segment of: Industrial Equip & Sply Whslrs
is contemporary version of: http://data.ga-group.nl/ics/bics/171110101113
is version of: http://data.ga-group.nl/ics/bics/171110101113
replaces: http://data.ga-group.nl/ics/bics/2020/171110101113
imported on: 2026-06-08T13:40:52.236Z
last refreshed on: 2026-06-08T13:41:38.450Z
source accessed on: 2024-06-05T14:42:36Z
source last accessed on: 2024-06-05T14:42:36Z
label: Atacad de suprimentos de encanamento @pt
label: Gross fournitures de plomberie @fr
label: Grossisti forniture idrauliche @it
label: Klempnerbedarf Großhdl. @de
label: Mayoristas prov fontanería @es
label: Опт. торговля - водопровод @ru
label: 管道用品批发商 @zh
label: 配管/相關用品經銷商 @zh-hant
label: 配管製品卸売 @ja
label: 배관 용품 도매 @ko
definition: This segment includes companies that wholesale and distribute plumbing supplies for commercial use.
notation: 171110101113
valid from: 2024-06-07

Industrial Equip & Sply Whslrs
type: BicsLevel5Segment
type: Classifier
type: NamedIndividual
is level5 segment of: Industrial Wholesale & Rental
is contemporary version of: http://data.ga-group.nl/ics/bics/1711101011
is version of: http://data.ga-group.nl/ics/bics/1711101011
replaces: http://data.ga-group.nl/ics/bics/2020/1711101011
imported on: 2026-06-08T13:40:52.236Z
last refreshed on: 2026-06-08T13:41:38.450Z
source accessed on: 2024-06-05T14:42:36Z
source last accessed on: 2024-06-05T14:42:36Z
label: Atacad de equip e supri industriais @pt
label: Gross équip/fournitures indus @fr
label: Grossisti forn e app industriali @it
label: Ind.-Ausrüst. & Zubeh. Großhdl. @de
label: Mayoristas equipo y prov industriales @es
label: Опт. торг. - промышл. оборуд. @ru
label: 工业设备与物资批发商 @zh
label: 工業設備/用品經銷商 @zh-hant
label: 産業機器卸売 @ja
label: 산업용 장비 & 용품 도매 @ko
definition: This segment includes companies that wholesale and distribute supplies and equipment.
notation: 1711101011
valid from: 2024-06-07

Commercial Veh Rental - Electric
type: BicsLevel7Segment
type: Classifier
type: NamedIndividual
is level7 segment of: Commercial Vehicle Rental Svcs
is contemporary version of: http://data.ga-group.nl/ics/bics/17111010121010
is version of: http://data.ga-group.nl/ics/bics/17111010121010
replaces: http://data.ga-group.nl/ics/bics/2020/17111010121010
imported on: 2026-06-08T13:40:52.236Z
last refreshed on: 2026-06-08T13:41:38.450Z
source accessed on: 2024-06-05T14:42:36Z
source last accessed on: 2024-06-05T14:42:36Z
label: Alquiler de veh comerciales - eléctricos @es
label: Aluguel veíc comerciais - eletricidade @pt
label: Location de véh commerciaux - électricité @fr
label: Noleggio veicoli commerciali - Elettrici @it
label: Vermietung Nutzfahrzeuge - Elektrisch @de
label: Услуги по аренде коммерч. транспорта - на электричестве @ru
label: 商用車出租-電力 @zh-hant
label: 商用車ﾚﾝﾀﾙ-電気 @ja
label: 商用车辆出租-电动 @zh
label: 상업용 차량 임대 - 전기 @ko
definition: This segment includes companies that rent electric, on-highway commercial vehicles.
notation: 17111010121010
valid from: 2024-06-07

Commercial Veh Rental - Fossil Fuels
type: BicsLevel7Segment
type: Classifier
type: NamedIndividual
is level7 segment of: Commercial Vehicle Rental Svcs
is contemporary version of: http://data.ga-group.nl/ics/bics/17111010121011
is version of: http://data.ga-group.nl/ics/bics/17111010121011
replaces: http://data.ga-group.nl/ics/bics/2020/17111010121011
imported on: 2026-06-08T13:40:52.236Z
last refreshed on: 2026-06-08T13:41:38.450Z
source accessed on: 2024-06-05T14:42:36Z
source last accessed on: 2024-06-05T14:42:36Z
label: Alquiler de veh comerciales - combustibles fósiles @es
label: Aluguel veíc comerciais - combustíveis fósseis @pt
label: Location de véh commerciaux - combustibles fossiles @fr
label: Noleggio veicoli commerciali - Combustibili fossili @it
label: Vermietung Nutzfahrzeuge - Fossile Brennstoffe @de
label: Услуги по аренде коммерч. транспорта - ископаемое топливо @ru
label: 商用車出租-化石燃料 @zh-hant
label: 商用車ﾚﾝﾀﾙ-化石燃料 @ja
label: 商用车辆出租-化石燃料 @zh
label: 상업용 차량 임대 - 화석 연료 @ko
definition: This segment includes companies that rent fossil fuel, on-highway commercial vehicles.
notation: 17111010121011
valid from: 2024-06-07

Commercial Vehicle Rental Svcs
type: BicsLevel6Segment
type: Classifier
type: NamedIndividual
is level6 segment of: Industrial Rental Services
is contemporary version of: http://data.ga-group.nl/ics/bics/171110101210
is version of: http://data.ga-group.nl/ics/bics/171110101210
replaces: http://data.ga-group.nl/ics/bics/2020/171110101210
imported on: 2026-06-08T13:40:52.236Z
last refreshed on: 2026-06-08T13:41:38.450Z
source accessed on: 2024-06-05T14:42:36Z
source last accessed on: 2024-06-05T14:42:36Z
label: Serv aluguel veículos comerciais @pt
label: Serv location véhicules commerciaux @fr
label: Serv noleggio veicoli commerciali @it
label: Servicios de arrendamiento de vehículos comerciales @es
label: Vermietung von gewerblichen Fahrzeugen @de
label: Прокат коммерч. грузовых автомобилей @ru
label: 商用車出租服務 @zh-hant
label: 商用車ﾚﾝﾀﾙｻｰﾋﾞｽ @ja
label: 商用车辆租赁服务 @zh
label: 상업용 자동차 임대업 @ko
definition: This segment includes companies that rent on-highway commercial vehicles, such as tractor-trailers, busses, motor coaches, and commercial vans. Excludes light trucks (see Light Trucks).
notation: 171110101210
valid from: 2024-06-07

General Equip Rental Svcs
type: BicsLevel6Segment
type: Classifier
type: NamedIndividual
is level6 segment of: Industrial Rental Services
is contemporary version of: http://data.ga-group.nl/ics/bics/171110101211
is version of: http://data.ga-group.nl/ics/bics/171110101211
replaces: http://data.ga-group.nl/ics/bics/2020/171110101211
imported on: 2026-06-08T13:40:52.236Z
last refreshed on: 2026-06-08T13:41:38.450Z
source accessed on: 2024-06-05T14:42:36Z
source last accessed on: 2024-06-05T14:42:36Z
label: Alquiler de equipo en general @es
label: Serv aluguel equip em geral @pt
label: Serv location équip général @fr
label: Serv noleggio app generali @it
label: Vermietungsdienste für allgemeines Zubehör @de
label: Услуги аренды оборуд. @ru
label: 一般機器ﾚﾝﾀﾙｻｰﾋﾞｽ @ja
label: 一般設備出租服務 @zh-hant
label: 普通设备租赁服务 @zh
label: 일반장비 임대업 @ko
definition: This segment includes companies that rent generic equipment with broad applications across industries. Includes ladders, fencing, tools, and portable toilets.
notation: 171110101211
valid from: 2024-06-07

Industrial Equip Rent Svcs
type: BicsLevel6Segment
type: Classifier
type: NamedIndividual
is level6 segment of: Industrial Rental Services
is contemporary version of: http://data.ga-group.nl/ics/bics/171110101212
is version of: http://data.ga-group.nl/ics/bics/171110101212
replaces: http://data.ga-group.nl/ics/bics/2020/171110101212
imported on: 2026-06-08T13:40:52.236Z
last refreshed on: 2026-06-08T13:41:38.450Z
source accessed on: 2024-06-05T14:42:36Z
source last accessed on: 2024-06-05T14:42:36Z
label: Serv alug equip industrial @pt
label: Serv location équip indus @fr
label: Serv noleggio app industriali @it
label: Servicios de alquiler de equipo industrial @es
label: Vermietungsdienste für industrielles Zubehör @de
label: Аренда промышл. оборуд. @ru
label: 工业设备租赁服务 @zh
label: 工業設備出租服務 @zh-hant
label: 産業機器ﾚﾝﾀﾙｻｰﾋﾞｽ @ja
label: 산업장비 임대업 @ko
definition: This segment includes companies that rent or lease electrical equipment or other industrial products not elsewhere classified. Includes HVAC equipment and power generators.
notation: 171110101212
valid from: 2024-06-07

Machinery Rental Services
type: BicsLevel6Segment
type: Classifier
type: NamedIndividual
is level6 segment of: Industrial Rental Services
is contemporary version of: http://data.ga-group.nl/ics/bics/171110101213
is version of: http://data.ga-group.nl/ics/bics/171110101213
replaces: http://data.ga-group.nl/ics/bics/2020/171110101213
imported on: 2026-06-08T13:40:52.236Z
last refreshed on: 2026-06-08T13:41:38.450Z
source accessed on: 2024-06-05T14:42:36Z
source last accessed on: 2024-06-05T14:42:36Z
label: Alquiler de maquinaria @es
label: Serviços de aluguel de máquinas @pt
label: Services de location de machinerie @fr
label: Servizi noleggio macchin @it
label: Vermietungsdienste für Maschinen @de
label: Аренда машинного оборудования @ru
label: 机械租赁服务 @zh
label: 機器･設備ﾚﾝﾀﾙｻｰﾋﾞｽ @ja
label: 機械出租服務 @zh-hant
label: 기계 임대 서비스 @ko
definition: This segment includes companies that rent or lease heavy machinery, such as those used in mining, construction, and material handling.
notation: 171110101213
valid from: 2024-06-07

Industrial Rental Services
type: BicsLevel5Segment
type: Classifier
type: NamedIndividual
is level5 segment of: Industrial Wholesale & Rental
is contemporary version of: http://data.ga-group.nl/ics/bics/1711101012
is version of: http://data.ga-group.nl/ics/bics/1711101012
replaces: http://data.ga-group.nl/ics/bics/2020/1711101012
imported on: 2026-06-08T13:40:52.236Z
last refreshed on: 2026-06-08T13:41:38.450Z
source accessed on: 2024-06-05T14:42:36Z
source last accessed on: 2024-06-05T14:42:36Z
label: Industrielle Vermietungsdienste @de
label: Serviços de aluguel industrial @pt
label: Servicios de alquiler industrial @es
label: Servizi locazione industriale @it
label: Srvc location équip industriel @fr
label: Услуги пром. аренды @ru
label: 商用設備出租服務 @zh-hant
label: 工业租赁服务 @zh
label: 産業製品ﾚﾝﾀﾙｻｰﾋﾞｽ @ja
label: 산업용 임대업 @ko
definition: This segment includes companies that rent equipment, machinery, or vehicles for industrial or commercial use.
notation: 1711101012
valid from: 2024-06-07

Industrial Wholesale & Rental
type: BicsLevel4SubIndustry
type: Classifier
type: NamedIndividual
is sub industry of: Industrial Support Services
is contemporary version of: http://data.ga-group.nl/ics/bics/17111010
is version of: http://data.ga-group.nl/ics/bics/17111010
replaces: http://data.ga-group.nl/ics/bics/2020/17111010
imported on: 2026-06-08T13:40:52.236Z
last refreshed on: 2026-06-08T13:41:38.450Z
source accessed on: 2024-06-05T14:42:36Z
source last accessed on: 2024-06-05T14:42:36Z
label: Alquiler y vta mayorista industrial @es
label: Atacado e aluguel industrial @pt
label: Grossisti e noleggio industr @it
label: Ind. Vertrieb & Vermietung @de
label: Vte gros/location mat indus @fr
label: Промышл. опт. торговля и аренда @ru
label: 工业批发与租赁 @zh
label: 工業經銷及出租 @zh-hant
label: 産業機械器具卸売･ﾚﾝﾀﾙ @ja
label: 산업용 도매 & 임대 @ko
definition: This industry subgroup includes companies that wholesale-distribute or rent any type of machinery, equipment, or supplies for industrial use.
notation: 17111010
valid from: 2024-06-07

Elec Precision Equip Maint
type: BicsLevel5Segment
type: Classifier
type: NamedIndividual
is level5 segment of: Industrial Maintenance Svcs
is contemporary version of: http://data.ga-group.nl/ics/bics/1711101110
is version of: http://data.ga-group.nl/ics/bics/1711101110
replaces: http://data.ga-group.nl/ics/bics/2020/1711101110
imported on: 2026-06-08T13:40:52.236Z
last refreshed on: 2026-06-08T13:41:38.450Z
source accessed on: 2024-06-05T14:42:36Z
source last accessed on: 2024-06-05T14:42:36Z
label: Mant eq electrónico precisión @es
label: Manutenção de equip de precisão eletrônica @pt
label: Manutenzione app elettroniche @it
label: Réparat équipt élect précision @fr
label: Wartung elektr. Präzisionsanl. @de
label: Ремонт электр. и точного оборудования @ru
label: 电子和精密设备修理和维护 @zh
label: 電器及精密設備維修保養 @zh-hant
label: 電子･精密機器修理･保守 @ja
label: 전자정밀기기수리 @ko
definition: This segment includes establishments that repair and maintain electronic and precision equipment.
notation: 1711101110
valid from: 2024-06-07

Industrial Mach Equip Repair
type: BicsLevel5Segment
type: Classifier
type: NamedIndividual
is level5 segment of: Industrial Maintenance Svcs
is contemporary version of: http://data.ga-group.nl/ics/bics/1711101111
is version of: http://data.ga-group.nl/ics/bics/1711101111
replaces: http://data.ga-group.nl/ics/bics/2020/1711101111
imported on: 2026-06-08T13:40:52.236Z
last refreshed on: 2026-06-08T13:41:38.450Z
source accessed on: 2024-06-05T14:42:36Z
source last accessed on: 2024-06-05T14:42:36Z
label: Réparation machine industrie @fr
label: Repar maq y equipo industrial @es
label: Reparatur Industriemaschinen @de
label: Reparos de equip de maquinário industrial @pt
label: Riparazione macchine indus @it
label: Ремонт промышл. оборуд. @ru
label: 商工業用機器修理･保守 @ja
label: 工业机械设备修理 @zh
label: 工業機械維修保養 @zh-hant
label: 산업기계수리 @ko
definition: This segment includes companies that repair and maintain industrial machinery and equipment.
notation: 1711101111
valid from: 2024-06-07

Energy Facilities & Ntwrk Maint
type: BicsLevel5Segment
type: Classifier
type: NamedIndividual
is level5 segment of: Industrial Maintenance Svcs
is contemporary version of: http://data.ga-group.nl/ics/bics/1711101112
is version of: http://data.ga-group.nl/ics/bics/1711101112
replaces: http://data.ga-group.nl/ics/bics/2020/1711101112
imported on: 2026-06-08T13:40:52.236Z
last refreshed on: 2026-06-08T13:41:38.450Z
source accessed on: 2024-06-05T14:42:36Z
source last accessed on: 2024-06-05T14:42:36Z
label: Energiedienste @de
label: Impianti energia e manutenzione rete @it
label: Instalações elétriacs e manut rede @pt
label: Maint réseau/install énergie @fr
label: Mantenimiento de instalaciones y redes de energía @es
label: Энергетич. службы и облуж. сетей @ru
label: 能源設備及網路保養 @zh-hant
label: 能源设施与网络维护 @zh
label: 에너지 시설 & 네트워크 관리 @ko
label: ｴﾈﾙｷﾞｰ施設･ﾈｯﾄﾜｰｸ保守 @ja
definition: This segment includes companies that provide maintenance and repair services for electric utility networks, power generation facilities, pipelines and refineries.
notation: 1711101112
valid from: 2024-06-07

Industrial Maintenance Svcs
type: BicsLevel4SubIndustry
type: Classifier
type: NamedIndividual
is sub industry of: Industrial Support Services
is contemporary version of: http://data.ga-group.nl/ics/bics/17111011
is version of: http://data.ga-group.nl/ics/bics/17111011
replaces: http://data.ga-group.nl/ics/bics/2020/17111011
imported on: 2026-06-08T13:40:52.236Z
last refreshed on: 2026-06-08T13:41:38.450Z
source accessed on: 2024-06-05T14:42:36Z
source last accessed on: 2024-06-05T14:42:36Z
label: Reparatur & Wartung @de
label: Serv de manutenção industrial @pt
label: Serv manutenzione industriale @it
label: Svcs maintenance industrielle @fr
label: Svcs mantenimiento industrial @es
label: Услуги по ремонту промышл. оборуд. @ru
label: 工业维护服务 @zh
label: 工業保養服務 @zh-hant
label: 産業機器保守ｻｰﾋﾞｽ @ja
label: 산업 유지보수업 @ko
definition: This industry subgroup includes companies that provide maintenance and repair services for industrial machinery, equipment, and facilities.
notation: 17111011
valid from: 2024-06-07

Industrial Support Services
type: BicsLevel3Industry
type: Classifier
type: NamedIndividual
is industry of: Industrial Services
is contemporary version of: http://data.ga-group.nl/ics/bics/171110
is version of: http://data.ga-group.nl/ics/bics/171110
replaces: http://data.ga-group.nl/ics/bics/2020/171110
imported on: 2026-06-08T13:40:52.236Z
last refreshed on: 2026-06-08T13:41:38.450Z
source accessed on: 2024-06-05T14:42:36Z
source last accessed on: 2024-06-05T14:42:36Z
label: Industrielle Supportdienste @de
label: Serviços de suporte industrial @pt
label: Servicios de apoyo industrial @es
label: Servizi supporto industriali @it
label: Srvc de soutien à industrie @fr
label: Поддержка промышл-ти @ru
label: 工业支持服务 @zh
label: 工業服務 @zh-hant
label: 産業支援ｻｰﾋﾞｽ @ja
label: 산업 서비스 @ko
definition: This industry includes companies that provide services primarily to industrial users or are wholesalers of industrial products.
notation: 171110
valid from: 2024-06-07

Facility Repair & Maintenance
type: BicsLevel5Segment
type: Classifier
type: NamedIndividual
is level5 segment of: Building Maintenance Services
is contemporary version of: http://data.ga-group.nl/ics/bics/1711111010
is version of: http://data.ga-group.nl/ics/bics/1711111010
replaces: http://data.ga-group.nl/ics/bics/2020/1711111010
imported on: 2026-06-08T13:40:52.236Z
last refreshed on: 2026-06-08T13:41:38.450Z
source accessed on: 2024-06-05T14:42:36Z
source last accessed on: 2024-06-05T14:42:36Z
label: Réparation et maintenance d'installations @fr
label: Reparación y mant de instalación @es
label: Reparatur & Instandhaltung von Einrichtungen @de
label: Reparo e manutenção instalação @pt
label: Reparo e manutenç��o instalação @pt
label: Riparazioni manutenzione impianti @it
label: Ремонт и техническое обслуживание @ru
label: 施設修理･保守 @ja
label: 設施維修及保養 @zh-hant
label: 设施修理和维护 @zh
label: 시설 관리 & 수리업 @ko
definition: This segment includes companies that provide building repair and maintenance services. Typically, these services are offered in an outsourcing model for property owners. These services include minor building repairs, painting, light fixture replacements and general handyman services. These companies may also hire and manage subcontractors, such as plumbers, electricians and HVAC specialists for more specialized services.
notation: 1711111010
valid from: 2024-06-07

Janitorial Services
type: BicsLevel5Segment
type: Classifier
type: NamedIndividual
is level5 segment of: Building Maintenance Services
is contemporary version of: http://data.ga-group.nl/ics/bics/1711111011
is version of: http://data.ga-group.nl/ics/bics/1711111011
replaces: http://data.ga-group.nl/ics/bics/2020/1711111011
imported on: 2026-06-08T13:40:52.236Z
last refreshed on: 2026-06-08T13:41:38.450Z
source accessed on: 2024-06-05T14:42:36Z
source last accessed on: 2024-06-05T14:42:36Z
label: Hausmeisterdienste @de
label: Serv de limpeza @pt
label: Serv limpieza inmob @es
label: Servizi di pulizia @it
label: Srv conciergerie @fr
label: Услуги по уборке @ru
label: 保洁服务 @zh
label: 清掃ｻｰﾋﾞｽ @ja
label: 清潔服務 @zh-hant
label: 수위 서비스 @ko
definition: This segment includes companies that clean building interiors and/or exteriors. Also includes companies that clean transportation equipment and facilities.
notation: 1711111011
valid from: 2024-06-07

Landscaping Services
type: BicsLevel5Segment
type: Classifier
type: NamedIndividual
is level5 segment of: Building Maintenance Services
is contemporary version of: http://data.ga-group.nl/ics/bics/1711111012
is version of: http://data.ga-group.nl/ics/bics/1711111012
replaces: http://data.ga-group.nl/ics/bics/2020/1711111012
imported on: 2026-06-08T13:40:52.236Z
last refreshed on: 2026-06-08T13:41:38.450Z
source accessed on: 2024-06-05T14:42:36Z
source last accessed on: 2024-06-05T14:42:36Z
label: Landschaftsbaudienste @de
label: Serviços de jardinagem @pt
label: Services d'aménagement paysager @fr
label: Servicios de jardinería @es
label: Servizi di giardinaggio @it
label: Ландшафтные услуги @ru
label: 景觀服務 @zh-hant
label: 景观服务 @zh
label: 造園ｻｰﾋﾞｽ @ja
label: 조경 서비스 @ko
definition: This segment includes companies that perform planting, care, and maintenance for lawns and flower beds for both commercial and residential properties. Excludes companies that specialize in landscaping projects requiring significant engineering expertise (see Engineering Services).
notation: 1711111012
valid from: 2024-06-07

Pest Control Services
type: BicsLevel5Segment
type: Classifier
type: NamedIndividual
is level5 segment of: Building Maintenance Services
is contemporary version of: http://data.ga-group.nl/ics/bics/1711111013
is version of: http://data.ga-group.nl/ics/bics/1711111013
replaces: http://data.ga-group.nl/ics/bics/2020/1711111013
imported on: 2026-06-08T13:40:52.236Z
last refreshed on: 2026-06-08T13:41:38.450Z
source accessed on: 2024-06-05T14:42:36Z
source last accessed on: 2024-06-05T14:42:36Z
label: Schädlingsbekämpfung @de
label: Serv controle de pragas @pt
label: Serv de fumigación @es
label: Services désinf/extermination @fr
label: Servizi disinfestazione @it
label: Услуги по борьбе с вредителями @ru
label: 害虫駆除ｻｰﾋﾞｽ @ja
label: 病蟲防治服務 @zh-hant
label: 虫害控制服务 @zh
label: 방제 서비스 @ko
definition: This segment includes companies that provide pest elimination, prevention, or deterrence services. Excludes pest control services for agricultural purposes (see Support Services - Crop Prod).
notation: 1711111013
valid from: 2024-06-07

Building Maintenance Services
type: BicsLevel4SubIndustry
type: Classifier
type: NamedIndividual
is sub industry of: Commercial Support Services
is contemporary version of: http://data.ga-group.nl/ics/bics/17111110
is version of: http://data.ga-group.nl/ics/bics/17111110
replaces: http://data.ga-group.nl/ics/bics/2020/17111110
imported on: 2026-06-08T13:40:52.236Z
last refreshed on: 2026-06-08T13:41:38.450Z
source accessed on: 2024-06-05T14:42:36Z
source last accessed on: 2024-06-05T14:42:36Z
label: Instandhaltung von Gebäuden @de
label: Serv de manutenção prédios @pt
label: Servicios mant edificios @es
label: Servizi manutenzione edifici @it
label: Srvc maintenance d'immeubles @fr
label: Услуги по уборке зданий @ru
label: 建筑维护保养服务 @zh
label: 建築維護保養服務 @zh-hant
label: 建築維護保養服��� @zh-hant
label: 건물 유지보수 서비스 @ko
label: ﾋﾞﾙ管理ｻｰﾋﾞｽ @ja
definition: This industry subgroup includes companies that provide services to assist in a facility's day-to-day functions. Such services include basic building repairs, painting, janitorial services, landscape maintenance, and pest control.
notation: 17111110
valid from: 2024-06-07

Caterers
type: BicsLevel5Segment
type: Classifier
type: NamedIndividual
is level5 segment of: Food Services
is contemporary version of: http://data.ga-group.nl/ics/bics/1711111110
is version of: http://data.ga-group.nl/ics/bics/1711111110
replaces: http://data.ga-group.nl/ics/bics/2020/1711111110
imported on: 2026-06-08T13:40:52.236Z
last refreshed on: 2026-06-08T13:41:38.450Z
source accessed on: 2024-06-05T14:42:36Z
source last accessed on: 2024-06-05T14:42:36Z
label: Caterer @de
label: Fornecedores de alimento @pt
label: Hostelería @es
label: Org banchetti @it
label: Traiteurs @fr
label: Фирмы, обслуживающие торжества @ru
label: 仕出し @ja
label: 办宴会者 @zh
label: 外燴服務 @zh-hant
label: 출장요리사 @ko
definition: This segment includes companies that offer single-event food services.
notation: 1711111110
valid from: 2024-06-07

Food Service Contractors
type: BicsLevel5Segment
type: Classifier
type: NamedIndividual
is level5 segment of: Food Services
is contemporary version of: http://data.ga-group.nl/ics/bics/1711111111
is version of: http://data.ga-group.nl/ics/bics/1711111111
replaces: http://data.ga-group.nl/ics/bics/2020/1711111111
imported on: 2026-06-08T13:40:52.236Z
last refreshed on: 2026-06-08T13:41:38.450Z
source accessed on: 2024-06-05T14:42:36Z
source last accessed on: 2024-06-05T14:42:36Z
label: Appaltatori ristorazione @it
label: Empreiteiros de serviços de alimentação @pt
label: Entrepreneurs en restauration @fr
label: Servicios de comedor @es
label: Unternehmer im Lebensmitteldienst @de
label: Подрядчики общественного питания @ru
label: 合約供餐服務 @zh-hant
label: 食品服务承包商 @zh
label: 食品ｻｰﾋﾞｽ請負 @ja
label: 식품 서비스 계약업체 @ko
definition: This segment includes companies that provide food services to institutional, governmental, commercial, or industrial clients, usually on a contractual basis.
notation: 1711111111
valid from: 2024-06-07

Food Services
type: BicsLevel4SubIndustry
type: Classifier
type: NamedIndividual
is sub industry of: Commercial Support Services
is contemporary version of: http://data.ga-group.nl/ics/bics/17111111
is version of: http://data.ga-group.nl/ics/bics/17111111
replaces: http://data.ga-group.nl/ics/bics/2020/17111111
imported on: 2026-06-08T13:40:52.236Z
last refreshed on: 2026-06-08T13:41:38.450Z
source accessed on: 2024-06-05T14:42:36Z
source last accessed on: 2024-06-05T14:42:36Z
label: Serv de alimentos @pt
label: Service alim @fr
label: Servicios alimentos @es
label: Servizi alimentari @it
label: Verpflegung @de
label: Предост. продов-я @ru
label: 食品服务 @zh
label: 食品服務 @zh-hant
label: 食品ｻｰﾋﾞｽ @ja
label: 식품 서비스 @ko
definition: This industry subgroup includes companies that provide catering for a single event or long-term food services for a specified period of time via contract. They may cater single events at different locations or continually operate concessions at sports or similar facilities. The food may be served or offered cafeteria style.
notation: 17111111
valid from: 2024-06-07

Newspaper, Book & Mag Printing
type: BicsLevel5Segment
type: Classifier
type: NamedIndividual
is level5 segment of: Printing Services
is contemporary version of: http://data.ga-group.nl/ics/bics/1711111210
is version of: http://data.ga-group.nl/ics/bics/1711111210
replaces: http://data.ga-group.nl/ics/bics/2020/1711111210
imported on: 2026-06-08T13:40:52.236Z
last refreshed on: 2026-06-08T13:41:38.450Z
source accessed on: 2024-06-05T14:42:36Z
source last accessed on: 2024-06-05T14:42:36Z
label: Impresión periódicos, libros y revistas @es
label: Impress journaux, livres et magazines @fr
label: Impressão de jornais, livros e revistas @pt
label: Stampa libri, riviste e giornali @it
label: Zeitungen, Bücher & Magazine @de
label: Печать газет, книг, журн. @ru
label: 报纸、书籍及杂志印刷 @zh
label: 新聞･書籍･雑誌印刷 @ja
label: 書報雜誌印刷 @zh-hant
label: 신문, 서적 & 잡지 인쇄 @ko
definition: This segment includes companies that provide newspaper, book, and magazine printing and binding services.
notation: 1711111210
valid from: 2024-06-07

Printing Support
type: BicsLevel5Segment
type: Classifier
type: NamedIndividual
is level5 segment of: Printing Services
is contemporary version of: http://data.ga-group.nl/ics/bics/1711111211
is version of: http://data.ga-group.nl/ics/bics/1711111211
replaces: http://data.ga-group.nl/ics/bics/2020/1711111211
imported on: 2026-06-08T13:40:52.236Z
last refreshed on: 2026-06-08T13:41:38.450Z
source accessed on: 2024-06-05T14:42:36Z
source last accessed on: 2024-06-05T14:42:36Z
label: Assistenza stampa @it
label: Druck-Support @de
label: Soporte de impresión @es
label: Suporte à impressão @pt
label: Support pour imprimerie @fr
label: Поддержка печатной деятельность @ru
label: 印刷支持服务 @zh
label: 印刷支援服務 @zh-hant
label: 印刷支援ｻｰﾋﾞｽ @ja
label: 인쇄 지원 @ko
definition: This segment includes companies that provide printing support services.
notation: 1711111211
valid from: 2024-06-07

Printing Services
type: BicsLevel4SubIndustry
type: Classifier
type: NamedIndividual
is sub industry of: Commercial Support Services
is contemporary version of: http://data.ga-group.nl/ics/bics/17111112
is version of: http://data.ga-group.nl/ics/bics/17111112
replaces: http://data.ga-group.nl/ics/bics/2020/17111112
imported on: 2026-06-08T13:40:52.236Z
last refreshed on: 2026-06-08T13:41:38.450Z
source accessed on: 2024-06-05T14:42:36Z
source last accessed on: 2024-06-05T14:42:36Z
label: Druckerdienste @de
label: Serv de impressão @pt
label: Serv impresión @es
label: Servizi di stampa @it
label: Srv imprimerie @fr
label: Полиграф. услуги @ru
label: 印刷服务 @zh
label: 印刷服務 @zh-hant
label: 印刷ｻｰﾋﾞｽ @ja
label: 인쇄 서비스 @ko
definition: This industry subgroup includes companies that provide a variety of copying, document preparation, and support services for printing activities.
notation: 17111112
valid from: 2024-06-07

Investigation Services
type: BicsLevel5Segment
type: Classifier
type: NamedIndividual
is level5 segment of: Security Services
is contemporary version of: http://data.ga-group.nl/ics/bics/1711111310
is version of: http://data.ga-group.nl/ics/bics/1711111310
replaces: http://data.ga-group.nl/ics/bics/2020/1711111310
imported on: 2026-06-08T13:40:52.236Z
last refreshed on: 2026-06-08T13:41:38.450Z
source accessed on: 2024-06-05T14:42:36Z
source last accessed on: 2024-06-05T14:42:36Z
label: Ermittlungsdienste @de
label: Serv de investigação @pt
label: Serv investigación @es
label: Serv investigazione @it
label: Services d'enquêtes @fr
label: Следственные услуги @ru
label: 捜査ｻｰﾋﾞｽ @ja
label: 調查服務 @zh-hant
label: 调查服务 @zh
label: 수사 서비스 @ko
definition: This segment includes companies that provide investigation and detective services.
notation: 1711111310
valid from: 2024-06-07

Security Guards Services
type: BicsLevel5Segment
type: Classifier
type: NamedIndividual
is level5 segment of: Security Services
is contemporary version of: http://data.ga-group.nl/ics/bics/1711111311
is version of: http://data.ga-group.nl/ics/bics/1711111311
replaces: http://data.ga-group.nl/ics/bics/2020/1711111311
imported on: 2026-06-08T13:40:52.236Z
last refreshed on: 2026-06-08T13:41:38.450Z
source accessed on: 2024-06-05T14:42:36Z
source last accessed on: 2024-06-05T14:42:36Z
label: Serv guardias de seguridad @es
label: Serviços de guardas de segurança @pt
label: Services gardiens de sécurité @fr
label: Servizi guardie sicurezza @it
label: Sicherheitsbediensteter, Dienste @de
label: Охранники и караульная служба @ru
label: 保全服務 @zh-hant
label: 保安服务 @zh
label: 警備ｻｰﾋﾞｽ @ja
label: 보안경비 서비스 @ko
definition: This segment includes companies that provide guard and patrol services.
notation: 1711111311
valid from: 2024-06-07

Security System Services
type: BicsLevel5Segment
type: Classifier
type: NamedIndividual
is level5 segment of: Security Services
is contemporary version of: http://data.ga-group.nl/ics/bics/1711111312
is version of: http://data.ga-group.nl/ics/bics/1711111312
replaces: http://data.ga-group.nl/ics/bics/2020/1711111312
imported on: 2026-06-08T13:40:52.236Z
last refreshed on: 2026-06-08T13:41:38.450Z
source accessed on: 2024-06-05T14:42:36Z
source last accessed on: 2024-06-05T14:42:36Z
label: Serv de sistemas segurança @pt
label: Serv sistemas de seguridad @es
label: Services systèmes de sécurité @fr
label: Servizi sistema sicurezza @it
label: Sicherheitssystemdienste @de
label: Услуги в области систем безопасности @ru
label: 保全系統服務 @zh-hant
label: 保安系统服务 @zh
label: 警備ｼｽﾃﾑｻｰﾋﾞｽ @ja
label: 보안 시스템 서비스 @ko
definition: This segment includes companies that install, maintain, and operate security systems. Typically, these companies provide comprehensive security monitoring and alerting services for commercial and household clients.
notation: 1711111312
valid from: 2024-06-07

Correctional Facilities
type: BicsLevel5Segment
type: Classifier
type: NamedIndividual
is level5 segment of: Security Services
is contemporary version of: http://data.ga-group.nl/ics/bics/1711111313
is version of: http://data.ga-group.nl/ics/bics/1711111313
replaces: http://data.ga-group.nl/ics/bics/2020/1711111313
imported on: 2026-06-08T13:40:52.236Z
last refreshed on: 2026-06-08T13:41:38.450Z
source accessed on: 2024-06-05T14:42:36Z
source last accessed on: 2024-06-05T14:42:36Z
label: Instalaciones correccionales @es
label: Justizvollzugsanstalten @de
label: Maisons de correction @fr
label: Penitenciárias @pt
label: Strutture penali @it
label: Исправительные учреждения @ru
label: 惩戒设施 @zh
label: 懲戒設施 @zh-hant
label: 矯正施設 @ja
label: 교정시설 @ko
definition: This segment includes companies that own and/or operate correctional facilities, such as prisons or jails.
notation: 1711111313
valid from: 2024-06-07

Security Services
type: BicsLevel4SubIndustry
type: Classifier
type: NamedIndividual
is sub industry of: Commercial Support Services
is contemporary version of: http://data.ga-group.nl/ics/bics/17111113
is version of: http://data.ga-group.nl/ics/bics/17111113
replaces: http://data.ga-group.nl/ics/bics/2020/17111113
imported on: 2026-06-08T13:40:52.236Z
last refreshed on: 2026-06-08T13:41:38.450Z
source accessed on: 2024-06-05T14:42:36Z
source last accessed on: 2024-06-05T14:42:36Z
label: Serv de segurança @pt
label: Serv seguridad @es
label: Services de sécurité @fr
label: Servizi di sicurezza @it
label: Sicherheitsdienste @de
label: Услуги по охране @ru
label: 保全服務 @zh-hant
label: 保安服务 @zh
label: 保安���务 @zh
label: 警備ｻｰﾋﾞｽ @ja
label: 보안 서비스 @ko
definition: This industry subgroup includes companies that provide security services including guard/patrol services, armored car transportation, bodyguards, polygraph testing, security system operation, and fingerprinting services.
notation: 17111113
valid from: 2024-06-07

Auction Houses & Art Dealers
type: BicsLevel5Segment
type: Classifier
type: NamedIndividual
is level5 segment of: Other Commercial Support Svcs
is contemporary version of: http://data.ga-group.nl/ics/bics/1711111410
is version of: http://data.ga-group.nl/ics/bics/1711111410
replaces: http://data.ga-group.nl/ics/bics/2020/1711111410
imported on: 2026-06-08T13:40:52.236Z
last refreshed on: 2026-06-08T13:41:38.450Z
source accessed on: 2024-06-05T14:42:36Z
source last accessed on: 2024-06-05T14:42:36Z
label: Auktionshaus/Kunsthändler @de
label: Casa de leilão/Dealers arte @pt
label: Case d'asta/Mercanti d'arte @it
label: Salles ventes/March. d'art @fr
label: Subastadora/Dealers de arte @es
label: Аукционные дома/Арт-дилеры @ru
label: Аукционные дома/Ар��-дилеры @ru
label: 拍卖行/艺术经纪人 @zh
label: 拍賣市場/藝術品交易商 @zh-hant
label: 경매회사/아트 딜러 @ko
label: ｵｰｸｼｮﾝﾊｳｽ･美術品ﾃﾞｨｰﾗｰ @ja
definition: This segment includes companies that operate auction houses and commercial art galleries owned by art dealers. Excludes online auction marketplaces (see Electronic Auctions).
notation: 1711111410
valid from: 2024-06-07

Convention & Trade Show Org
type: BicsLevel5Segment
type: Classifier
type: NamedIndividual
is level5 segment of: Other Commercial Support Svcs
is contemporary version of: http://data.ga-group.nl/ics/bics/1711111411
is version of: http://data.ga-group.nl/ics/bics/1711111411
replaces: http://data.ga-group.nl/ics/bics/2020/1711111411
imported on: 2026-06-08T13:40:52.236Z
last refreshed on: 2026-06-08T13:41:38.450Z
source accessed on: 2024-06-05T14:42:36Z
source last accessed on: 2024-06-05T14:42:36Z
label: Convenc y ferias com e industr @es
label: Kongress- & Messeorganisatoren @de
label: Org congrès/salons @fr
label: Org de convenções e feiras @pt
label: Org fiere comm e convegni @it
label: Организ. собраний и выставок @ru
label: 会议与展会组织者 @zh
label: 會議及商展組織 @zh-hant
label: 컨벤션 & 무역쇼 조직기구 @ko
label: ｺﾝﾍﾞﾝｼｮﾝ･見本市企画運営 @ja
definition: This segment includes companies that organize, promote, and manage events for business trade shows, conventions, and conferences.
notation: 1711111411
valid from: 2024-06-07

Geophysical Survey & Map Svcs
type: BicsLevel5Segment
type: Classifier
type: NamedIndividual
is level5 segment of: Other Commercial Support Svcs
is contemporary version of: http://data.ga-group.nl/ics/bics/1711111412
is version of: http://data.ga-group.nl/ics/bics/1711111412
replaces: http://data.ga-group.nl/ics/bics/2020/1711111412
imported on: 2026-06-08T13:40:52.236Z
last refreshed on: 2026-06-08T13:41:38.450Z
source accessed on: 2024-06-05T14:42:36Z
source last accessed on: 2024-06-05T14:42:36Z
label: Geophysikalische Studien @de
label: Serv arpentage et carto géophysique @fr
label: Serv de pesquisa geofísica e mapa @pt
label: Serv geofísicos encuestas, mapas @es
label: Serv mappa e rilevamenti geofisici @it
label: Геофизич. услуги, разведка @ru
label: 地球物理测绘服务 @zh
label: 地球物理調査･地図作成ｻｰﾋﾞｽ @ja
label: 地質調查及地圖服務 @zh-hant
label: 地質調查及��圖服務 @zh-hant
label: 지구물리학 조사 & 지도 서비스 @ko
definition: This segment includes companies that gather, interpret, and map geophysical data.
notation: 1711111412
valid from: 2024-06-07

Interior Design
type: BicsLevel5Segment
type: Classifier
type: NamedIndividual
is level5 segment of: Other Commercial Support Svcs
is contemporary version of: http://data.ga-group.nl/ics/bics/1711111413
is version of: http://data.ga-group.nl/ics/bics/1711111413
replaces: http://data.ga-group.nl/ics/bics/2020/1711111413
imported on: 2026-06-08T13:40:52.236Z
last refreshed on: 2026-06-08T13:41:38.450Z
source accessed on: 2024-06-05T14:42:36Z
source last accessed on: 2024-06-05T14:42:36Z
label: Architettura interni @it
label: Design d'intérieur @fr
label: Design de interiores @pt
label: Diseño interior @es
label: Innenarchitektur @de
label: Дизайн интерьера @ru
label: 内装設計ｻｰﾋﾞｽ @ja
label: 室內設計 @zh-hant
label: 室内设计服务 @zh
label: 인테리어 디자인 @ko
definition: This segment includes companies that create and develop design based on specifications that optimize the appearance, branding, and efficiency of interior space through the use of textiles, furniture, color selections, and surface finishes.
notation: 1711111413
valid from: 2024-06-07

Parking Lots & Garages
type: BicsLevel5Segment
type: Classifier
type: NamedIndividual
is level5 segment of: Other Commercial Support Svcs
is contemporary version of: http://data.ga-group.nl/ics/bics/1711111414
is version of: http://data.ga-group.nl/ics/bics/1711111414
replaces: http://data.ga-group.nl/ics/bics/2020/1711111414
imported on: 2026-06-08T13:40:52.236Z
last refreshed on: 2026-06-08T13:41:38.450Z
source accessed on: 2024-06-05T14:42:36Z
source last accessed on: 2024-06-05T14:42:36Z
label: Estacionamentos e garagens @pt
label: Lotes de estacionamiento y garajes @es
label: Parcheggi e garage @it
label: Parkplätze und Garagen @de
label: Stationnements et garages @fr
label: Гаражи и стоянки автомашин @ru
label: 停車場及車庫 @zh-hant
label: 停车场和车库 @zh
label: 駐車場･ｶﾞﾚｰｼﾞ @ja
label: 주차장 및 주차건물 @ko
definition: This segment includes companies that provide parking lot facility management services. These companies provide outsourced parking lot operations for property owners.
notation: 1711111414
valid from: 2024-06-07

Testing Laboratories
type: BicsLevel5Segment
type: Classifier
type: NamedIndividual
is level5 segment of: Other Commercial Support Svcs
is contemporary version of: http://data.ga-group.nl/ics/bics/1711111415
is version of: http://data.ga-group.nl/ics/bics/1711111415
replaces: http://data.ga-group.nl/ics/bics/2020/1711111415
imported on: 2026-06-08T13:40:52.236Z
last refreshed on: 2026-06-08T13:41:38.450Z
source accessed on: 2024-06-05T14:42:36Z
source last accessed on: 2024-06-05T14:42:36Z
label: Laboratórios de teste @pt
label: Laboratoires d'essai @fr
label: Laboratori verifica @it
label: Laboratorios pruebas @es
label: Testlaboratorien @de
label: Испытательные лаборатории @ru
label: 检测实验室 @zh
label: 測試實驗室 @zh-hant
label: 試験所 @ja
label: 시험 연구업 @ko
definition: This segment includes companies that perform physical, chemical, and other analytical testing services, such as acoustics or vibration testing, biological testing, calibration testing, electrical and electronic testing, mechanical testing, nondestructive testing, or thermal testing. The testing may occur in a laboratory or on-site.
notation: 1711111415
valid from: 2024-06-07

Uniform Rental
type: BicsLevel5Segment
type: Classifier
type: NamedIndividual
is level5 segment of: Other Commercial Support Svcs
is contemporary version of: http://data.ga-group.nl/ics/bics/1711111416
is version of: http://data.ga-group.nl/ics/bics/1711111416
replaces: http://data.ga-group.nl/ics/bics/2020/1711111416
imported on: 2026-06-08T13:40:52.236Z
last refreshed on: 2026-06-08T13:41:38.450Z
source accessed on: 2024-06-05T14:42:36Z
source last accessed on: 2024-06-05T14:42:36Z
label: Alquiler de uniformes @es
label: Aluguel de uniformes @pt
label: Location d'uniformes @fr
label: Noleggio uniformi @it
label: Uniformvermietung @de
label: Равномерная аренда @ru
label: 专业制服租赁 @zh
label: 制服出租 @zh-hant
label: 業務用制服ﾚﾝﾀﾙ @ja
label: 유니폼 대여 @ko
definition: This segment includes companies that rent uniforms.
notation: 1711111416
valid from: 2024-06-07

Other Commercial Support Svcs
type: BicsLevel4SubIndustry
type: Classifier
type: NamedIndividual
is sub industry of: Commercial Support Services
is contemporary version of: http://data.ga-group.nl/ics/bics/17111114
is version of: http://data.ga-group.nl/ics/bics/17111114
replaces: http://data.ga-group.nl/ics/bics/2020/17111114
imported on: 2026-06-08T13:40:52.236Z
last refreshed on: 2026-06-08T13:41:38.450Z
source accessed on: 2024-06-05T14:42:36Z
source last accessed on: 2024-06-05T14:42:36Z
label: Altri serv supporto comm @it
label: Autres srvc soutien commerce @fr
label: Otros serv de apoyo comercial @es
label: Outros serv suporte comercial @pt
label: Sonst. kommerz. Supportdienste @de
label: Прочие услуги коммерч. поддержки @ru
label: その他商業支援ｻｰﾋﾞｽ @ja
label: 其他商业支持服务 @zh
label: 其他商業服務 @zh-hant
label: 기타 상업 지원 서비스 @ko
definition: This industry subgroup includes companies that provide commercial services not elsewhere classified.
notation: 17111114
valid from: 2024-06-07

Hazardous Waste Collection
type: BicsLevel6Segment
type: Classifier
type: NamedIndividual
is level6 segment of: Hazardous Waste Collect & Treat
is contemporary version of: http://data.ga-group.nl/ics/bics/171111151010
is version of: http://data.ga-group.nl/ics/bics/171111151010
replaces: http://data.ga-group.nl/ics/bics/2020/171111151010
imported on: 2026-06-08T13:40:52.236Z
last refreshed on: 2026-06-08T13:41:38.450Z
source accessed on: 2024-06-05T14:42:36Z
source last accessed on: 2024-06-05T14:42:36Z
label: Coleta de resíduos perigosos @pt
label: Giftmüllsammlung @de
label: Manejo desechos pel @es
label: Racc rif pericolosi @it
label: Ramas déchet danger @fr
label: Опасные отходы - сбор @ru
label: 危害性廢物收集 @zh-hant
label: 有害废物收集 @zh
label: 有害廃棄物回収 @ja
label: 지정폐기물수집 @ko
definition: This segment includes companies that provide hazardous waste collection services. Includes the collection and hauling of radioactive waste, medical waste, and oil and other hydrocarbons.
notation: 171111151010
valid from: 2024-06-07

Hazardous Waste Treat & Disp
type: BicsLevel6Segment
type: Classifier
type: NamedIndividual
is level6 segment of: Hazardous Waste Collect & Treat
is contemporary version of: http://data.ga-group.nl/ics/bics/171111151011
is version of: http://data.ga-group.nl/ics/bics/171111151011
replaces: http://data.ga-group.nl/ics/bics/2020/171111151011
imported on: 2026-06-08T13:40:52.236Z
last refreshed on: 2026-06-08T13:41:38.450Z
source accessed on: 2024-06-05T14:42:36Z
source last accessed on: 2024-06-05T14:42:36Z
label: Disp e tratt rifuti pericolosi @it
label: Giftabfallbearbeitung & -entsorgung @de
label: Tra de resíduos per e eliminação @pt
label: Trait/élim déchets dangereux @fr
label: Tratamiento y despojo des pelig @es
label: Перераб. и очистка опасных отходов @ru
label: 有害废物处理与处置 @zh
label: 有害廃棄物処理･処分 @ja
label: 有害廢棄物處理/處置 @zh-hant
label: 有害廢棄物處理/處�� @zh-hant
label: 폐기물처리업 @ko
definition: This segment includes companies that provide hazardous waste treatment and disposal services.
notation: 171111151011
valid from: 2024-06-07

Hazardous Waste Collect & Treat
type: BicsLevel5Segment
type: Classifier
type: NamedIndividual
is level5 segment of: Waste Management
is contemporary version of: http://data.ga-group.nl/ics/bics/1711111510
is version of: http://data.ga-group.nl/ics/bics/1711111510
replaces: http://data.ga-group.nl/ics/bics/2020/1711111510
imported on: 2026-06-08T13:40:52.236Z
last refreshed on: 2026-06-08T13:41:38.450Z
source accessed on: 2024-06-05T14:42:36Z
source last accessed on: 2024-06-05T14:42:36Z
label: Coleta e trat de resíduos perigosos @pt
label: Collecte/traitement déchets dangereux @fr
label: Giftabfallsammlung & -bearbeitung @de
label: Raccolta e tratt rifiuti pericolosi @it
label: Tratado y recogimiento de desechos peligrosos @es
label: Сбор и перераб. опасных отходов @ru
label: 有害废物收集与处理 @zh
label: 有害廃棄物回収･処理 @ja
label: 有害廢棄物收集/處理 @zh-hant
label: 위험 폐기물수집&취급 @ko
definition: This segment includes companies that provide hazardous waste collection and treatment services. It also includes companies that provide oil and hydrocarbon collection and recycling.
notation: 1711111510
valid from: 2024-06-07

Bio-Waste Collection & Treatment
type: BicsLevel6Segment
type: Classifier
type: NamedIndividual
is level6 segment of: Recyclable Materials
is contemporary version of: http://data.ga-group.nl/ics/bics/171111151110
is version of: http://data.ga-group.nl/ics/bics/171111151110
replaces: http://data.ga-group.nl/ics/bics/2020/171111151110
imported on: 2026-06-08T13:40:52.236Z
last refreshed on: 2026-06-08T13:41:38.450Z
source accessed on: 2024-06-05T14:42:36Z
source last accessed on: 2024-06-05T14:42:36Z
label: Coleta e tratamento de resíduos biológicos @pt
label: Raccolta e trattamento rifiuti biologici @it
label: Ramassage et traitement de déchets biodégradables @fr
label: Recolección y tratamiento de residuos biológicos @es
label: Sammlung & Behandlung von Bioabfällen @de
label: Сбор и обработка био-отходов @ru
label: 生物廢棄物收集及處理 @zh-hant
label: 生物质废物收集与处理 @zh
label: 유기성 폐기물 수집 & 처리 @ko
label: ﾊﾞｲｵ廃棄物回収・処理 @ja
definition: This segment includes companies involved in the production of gas, digestate, or chemicals by collecting or treating bio-waste through anaerobic digestion.
notation: 171111151110
valid from: 2024-06-07

Landfill Gas Capture
type: BicsLevel6Segment
type: Classifier
type: NamedIndividual
is level6 segment of: Recyclable Materials
is contemporary version of: http://data.ga-group.nl/ics/bics/171111151111
is version of: http://data.ga-group.nl/ics/bics/171111151111
replaces: http://data.ga-group.nl/ics/bics/2020/171111151111
imported on: 2026-06-08T13:40:52.236Z
last refreshed on: 2026-06-08T13:41:38.450Z
source accessed on: 2024-06-05T14:42:36Z
source last accessed on: 2024-06-05T14:42:36Z
label: Captura de gás de aterro sanitário @pt
label: Captura de gas de vertedero @es
label: Capture de gaz de décharge @fr
label: Cattura gas da discarica @it
label: Fassung von Deponiegas @de
label: Сбор свалочного газа @ru
label: 垃圾填埋气收集 @zh
label: 埋立ｶﾞｽ回収 @ja
label: 掩埋沼氣捕集 @zh-hant
label: 매립가스 포집 @ko
definition: This segment includes companies that produce gas through the capture of gas from landfills.
notation: 171111151111
valid from: 2024-06-07

Recyclable Materials
type: BicsLevel5Segment
type: Classifier
type: NamedIndividual
is level5 segment of: Waste Management
is contemporary version of: http://data.ga-group.nl/ics/bics/1711111511
is version of: http://data.ga-group.nl/ics/bics/1711111511
replaces: http://data.ga-group.nl/ics/bics/2020/1711111511
imported on: 2026-06-08T13:40:52.236Z
last refreshed on: 2026-06-08T13:41:38.450Z
source accessed on: 2024-06-05T14:42:36Z
source last accessed on: 2024-06-05T14:42:36Z
label: Matériaux recyclables @fr
label: Materiais recicláveis @pt
label: Materiales reciclables @es
label: Materiali riciclabili @it
label: Recycelbare Materialien @de
label: Вторсырье @ru
label: 再生資源物 @ja
label: 可循环材料 @zh
label: 回收材料 @zh-hant
label: 재활용 원료 @ko
definition: This segment includes companies that wholesale waste and scrap materials for recycling. Includes activities such as collecting, sorting, separating, and stripping used goods for reusable parts.
notation: 1711111511
valid from: 2024-06-07

Recycling Facilities
type: BicsLevel6Segment
type: Classifier
type: NamedIndividual
is level6 segment of: Solid Waste Collection & Treat
is contemporary version of: http://data.ga-group.nl/ics/bics/171111151210
is version of: http://data.ga-group.nl/ics/bics/171111151210
replaces: http://data.ga-group.nl/ics/bics/2020/171111151210
imported on: 2026-06-08T13:40:52.236Z
last refreshed on: 2026-06-08T13:41:38.450Z
source accessed on: 2024-06-05T14:42:36Z
source last accessed on: 2024-06-05T14:42:36Z
label: Imp recupero mat @it
label: Instalações de reciclagem @pt
label: Instalac reciclaje @es
label: Installa. recyclage @fr
label: Recyclinganlagen @de
label: Утилизация @ru
label: 材料再生施設 @ja
label: 材料再生设施 @zh
label: 資源回收單位 @zh-hant
label: 재활용 시설업 @ko
definition: This segment includes companies that operate facilities that recycle and/or recover materials. Includes collecting, sorting and/or separating recyclable materials, such as plastics, rubber, glass, and metals.
notation: 171111151210
valid from: 2024-06-07

Remediation Services
type: BicsLevel6Segment
type: Classifier
type: NamedIndividual
is level6 segment of: Solid Waste Collection & Treat
is contemporary version of: http://data.ga-group.nl/ics/bics/171111151211
is version of: http://data.ga-group.nl/ics/bics/171111151211
replaces: http://data.ga-group.nl/ics/bics/2020/171111151211
imported on: 2026-06-08T13:40:52.236Z
last refreshed on: 2026-06-08T13:41:38.450Z
source accessed on: 2024-06-05T14:42:36Z
source last accessed on: 2024-06-05T14:42:36Z
label: Sanierungsdienstl. @de
label: Serv de reparação @pt
label: Serv remediación @es
label: Servizi remediation @it
label: Srv d'assainissement @fr
label: Рекультивация @ru
label: 回收服务 @zh
label: 浄化ｻｰﾋﾞｽ @ja
label: 環境淨化服務 @zh-hant
label: 환경정화서비스업 @ko
definition: This segment includes companies that provide remediation services. Such services include asbestos abatement, lead paint removal, oil spill cleanup, soil remediation and mine reclamation services.
notation: 171111151211
valid from: 2024-06-07

Solid Waste Collection
type: BicsLevel6Segment
type: Classifier
type: NamedIndividual
is level6 segment of: Solid Waste Collection & Treat
is contemporary version of: http://data.ga-group.nl/ics/bics/171111151212
is version of: http://data.ga-group.nl/ics/bics/171111151212
replaces: http://data.ga-group.nl/ics/bics/2020/171111151212
imported on: 2026-06-08T13:40:52.236Z
last refreshed on: 2026-06-08T13:41:38.450Z
source accessed on: 2024-06-05T14:42:36Z
source last accessed on: 2024-06-05T14:42:36Z
label: Colecc desecho sól @es
label: Coleta de resíduos sólidos @pt
label: Hausmüllsammlung @de
label: Racc rifiuti solidi @it
label: Ramassage déchet sol @fr
label: Твердые коммунально-бытовые отходы - сбор @ru
label: 固体废物收集 @zh
label: 固定廃棄物回収 @ja
label: 固態廢物收集 @zh-hant
label: 고형폐기물 수집업 @ko
definition: This segment includes companies that provide solid waste collection services. Includes pickup and hauling of garbage or recyclable materials from the point of collection to landfills, transfer facilities, or recycling facilities.
notation: 171111151212
valid from: 2024-06-07

Solid Waste Incinerators
type: BicsLevel6Segment
type: Classifier
type: NamedIndividual
is level6 segment of: Solid Waste Collection & Treat
is contemporary version of: http://data.ga-group.nl/ics/bics/171111151213
is version of: http://data.ga-group.nl/ics/bics/171111151213
replaces: http://data.ga-group.nl/ics/bics/2020/171111151213
imported on: 2026-06-08T13:40:52.236Z
last refreshed on: 2026-06-08T13:41:38.450Z
source accessed on: 2024-06-05T14:42:36Z
source last accessed on: 2024-06-05T14:42:36Z
label: Inceneritori di rifiuti solidi @it
label: Incinération déchets solides @fr
label: Incineradores de resíduos sólidos @pt
label: Müllverbrennung, fest @de
label: Vertedero de desechos sólidos @es
label: Твердые отходы - печь для сжигания @ru
label: 固体废物废弃物焚烧 @zh
label: 固形廃棄物焼却 @ja
label: 固態廢物焚燒及焚毀 @zh-hant
label: 고형폐기물연소기 @ko
definition: This segment includes companies that operate solid waste combustors and incinerators.
notation: 171111151213
valid from: 2024-06-07

Solid Waste Landfill
type: BicsLevel6Segment
type: Classifier
type: NamedIndividual
is level6 segment of: Solid Waste Collection & Treat
is contemporary version of: http://data.ga-group.nl/ics/bics/171111151214
is version of: http://data.ga-group.nl/ics/bics/171111151214
replaces: http://data.ga-group.nl/ics/bics/2020/171111151214
imported on: 2026-06-08T13:40:52.236Z
last refreshed on: 2026-06-08T13:41:38.450Z
source accessed on: 2024-06-05T14:42:36Z
source last accessed on: 2024-06-05T14:42:36Z
label: Abfalldeponie, fest @de
label: Aterro sanitário para resíduos sólidos @pt
label: Enfouisst déchet sol @fr
label: Sotterram rif solidi @it
label: Vertederos desechos @es
label: Твердые отходы - место хранение @ru
label: 固体废物填埋 @zh
label: 固形廃棄物埋立 @ja
label: 固態廢物掩埋 @zh-hant
label: 고형폐기물 매립지 @ko
definition: This segment includes companies that operate solid waste landfill facilities for the disposal of solid waste.
notation: 171111151214
valid from: 2024-06-07

Solid Waste Transfer
type: BicsLevel6Segment
type: Classifier
type: NamedIndividual
is level6 segment of: Solid Waste Collection & Treat
is contemporary version of: http://data.ga-group.nl/ics/bics/171111151215
is version of: http://data.ga-group.nl/ics/bics/171111151215
replaces: http://data.ga-group.nl/ics/bics/2020/171111151215
imported on: 2026-06-08T13:40:52.236Z
last refreshed on: 2026-06-08T13:41:38.450Z
source accessed on: 2024-06-05T14:42:36Z
source last accessed on: 2024-06-05T14:42:36Z
label: Abfalltransfer, fest @de
label: Transferência de resíduos sólidos @pt
label: Transferenc desechos @es
label: Transfert déchet sol @fr
label: Trasf rifiuti solidi @it
label: Твердые отходы - перемещение @ru
label: 固体废物转运设施 @zh
label: 固形廃棄物輸送施設 @ja
label: 固體廢物轉運設施 @zh-hant
label: 고형폐기물이동시설 @ko
definition: This segment includes companies that operate solid waste transfer facilities. Such facilities consolidate and compact the solid waste and then transport it to disposal sites by rail or truck.
notation: 171111151215
valid from: 2024-06-07

Solid Waste Collection & Treat
type: BicsLevel5Segment
type: Classifier
type: NamedIndividual
is level5 segment of: Waste Management
is contemporary version of: http://data.ga-group.nl/ics/bics/1711111512
is version of: http://data.ga-group.nl/ics/bics/1711111512
replaces: http://data.ga-group.nl/ics/bics/2020/1711111512
imported on: 2026-06-08T13:40:52.236Z
last refreshed on: 2026-06-08T13:41:38.450Z
source accessed on: 2024-06-05T14:42:36Z
source last accessed on: 2024-06-05T14:42:36Z
label: Coleta e trat de res sólidos @pt
label: Collecte/traitement déchets solides @fr
label: Festabfallsammlung & -bearbeitung @de
label: Raccolta e tratt rifiuti solidi @it
label: Tratamiento de recolección de desechos sólidos @es
label: Твердые отходы - сбор и переработка @ru
label: 固体废物收集与处理 @zh
label: 固定廃棄物回収･処理 @ja
label: 固態廢棄物收集/處理 @zh-hant
label: 고형폐기물수집&취급 @ko
definition: This segment includes companies that provide solid waste collection and treatment services, such as the collection, treatment, and disposal of solid waste and recyclable materials.
notation: 1711111512
valid from: 2024-06-07

Waste Management
type: BicsLevel4SubIndustry
type: Classifier
type: NamedIndividual
is sub industry of: Commercial Support Services
is contemporary version of: http://data.ga-group.nl/ics/bics/17111115
is version of: http://data.ga-group.nl/ics/bics/17111115
replaces: http://data.ga-group.nl/ics/bics/2020/17111115
imported on: 2026-06-08T13:40:52.236Z
last refreshed on: 2026-06-08T13:41:38.450Z
source accessed on: 2024-06-05T14:42:36Z
source last accessed on: 2024-06-05T14:42:36Z
label: Abfallwirtschaft @de
label: Gestão de resíduos @pt
label: Gestion des déchets @fr
label: Gestione dei rifiuti @it
label: Manejo de desechos @es
label: Переработка отходов @ru
label: 废物管理 @zh
label: 廃棄物管理 @ja
label: 廢物管理 @zh-hant
label: 폐기물 관리 @ko
definition: This industry subgroup includes companies that collect, store, dispose, recycle, or treat various forms of waste. Includes organic and hazardous waste materials, landfills, incineration, and treatment plants.
notation: 17111115
valid from: 2024-06-07

Law Firms
type: BicsLevel6Segment
type: Classifier
type: NamedIndividual
is level6 segment of: Legal Services
is contemporary version of: http://data.ga-group.nl/ics/bics/171111161010
is version of: http://data.ga-group.nl/ics/bics/171111161010
replaces: http://data.ga-group.nl/ics/bics/2020/171111161010
imported on: 2026-06-08T13:40:52.236Z
last refreshed on: 2026-06-08T13:41:38.450Z
source accessed on: 2024-06-05T14:42:36Z
source last accessed on: 2024-06-05T14:42:36Z
label: Anwaltskanzleien @de
label: Bufetes de abogados @es
label: Cabinets juridiques @fr
label: Escritórios de advocacia @pt
label: Studi legali @it
label: Юридические фирмы @ru
label: 律师事务所 @zh
label: 律師事務所 @zh-hant
label: 法律事務所 @ja
label: 법률회사 @ko
definition: This segment includes offices of legal practitioners. Includes attorneys' offices, barristers' offices, criminal law offices, law firms, and solicitors' offices.
notation: 171111161010
valid from: 2024-06-07

Patent, Notary & Paralegal Svcs
type: BicsLevel6Segment
type: Classifier
type: NamedIndividual
is level6 segment of: Legal Services
is contemporary version of: http://data.ga-group.nl/ics/bics/171111161011
is version of: http://data.ga-group.nl/ics/bics/171111161011
replaces: http://data.ga-group.nl/ics/bics/2020/171111161011
imported on: 2026-06-08T13:40:52.236Z
last refreshed on: 2026-06-08T13:41:38.450Z
source accessed on: 2024-06-05T14:42:36Z
source last accessed on: 2024-06-05T14:42:36Z
label: Patent- & Notariatsdienste @de
label: Patentes, notarios y serv jur @es
label: Ser brevets/notaires/paralégaux @fr
label: Serv brevetto, notarili e paralegali @it
label: Serv patente, notário e paralegais @pt
label: Услуги нотариуса, юриста и лицензир. @ru
label: 专利、公证及法律助理服务 @zh
label: 專利、公證及法務助理服務 @zh-hant
label: 特許･公証･ﾊﾟﾗﾘｰｶﾞﾙ･ｻｰﾋﾞｽ @ja
label: 특허, 공증 & 법무서비스 @ko
definition: This segment includes companies that provide notary services, public services, paralegal services, patent agent services, and process-serving services.
notation: 171111161011
valid from: 2024-06-07

Lobbying Firms
type: BicsLevel6Segment
type: Classifier
type: NamedIndividual
is level6 segment of: Legal Services
is contemporary version of: http://data.ga-group.nl/ics/bics/171111161012
is version of: http://data.ga-group.nl/ics/bics/171111161012
replaces: http://data.ga-group.nl/ics/bics/2020/171111161012
imported on: 2026-06-08T13:40:52.236Z
last refreshed on: 2026-06-08T13:41:38.450Z
source accessed on: 2024-06-05T14:42:36Z
source last accessed on: 2024-06-05T14:42:36Z
label: Empresas de cabildeo @es
label: Empresas de lobbying @pt
label: Lobby-Firmen @de
label: Sociétés de lobbying @fr
label: Società lobby @it
label: Лоббистск. фирмы @ru
label: 游说公司 @zh
label: 遊說公司 @zh-hant
label: 로비기업 @ko
label: 로���기업 @ko
label: ﾛﾋﾞｲﾝｸﾞ企業 @ja
definition: This segment includes companies that advocate for the passage or defeat of legislation, regulations, government appointees, and budget allocations on the international, national, regional, state, and municipal levels. This includes organizations describing themselves as government affairs and government consulting firms.
notation: 171111161012
valid from: 2024-06-07

Legal Services
type: BicsLevel5Segment
type: Classifier
type: NamedIndividual
is level5 segment of: Professional Services
is contemporary version of: http://data.ga-group.nl/ics/bics/1711111610
is version of: http://data.ga-group.nl/ics/bics/1711111610
replaces: http://data.ga-group.nl/ics/bics/2020/1711111610
imported on: 2026-06-08T13:40:52.236Z
last refreshed on: 2026-06-08T13:41:38.450Z
source accessed on: 2024-06-05T14:42:36Z
source last accessed on: 2024-06-05T14:42:36Z
label: Rechtsdienst @de
label: Serviços jurídicos @pt
label: Services juridiques @fr
label: Servicios jurídicos @es
label: Servizi legali @it
label: Юридические услуги @ru
label: 法務ｻｰﾋﾞｽ @ja
label: 法律服务 @zh
label: 法律服務 @zh-hant
label: 법률 서비스 @ko
definition: This segment includes groups or organizations of lawyers who provide expertise in a range of specific areas of law, such as criminal, family, estate, patent, real estate, or tax law.
notation: 1711111610
valid from: 2024-06-07

Employment Agencies
type: BicsLevel6Segment
type: Classifier
type: NamedIndividual
is level6 segment of: Mgmt & Admin Consulting Svcs
is contemporary version of: http://data.ga-group.nl/ics/bics/171111161110
is version of: http://data.ga-group.nl/ics/bics/171111161110
replaces: http://data.ga-group.nl/ics/bics/2020/171111161110
imported on: 2026-06-08T13:40:52.236Z
last refreshed on: 2026-06-08T13:41:38.450Z
source accessed on: 2024-06-05T14:42:36Z
source last accessed on: 2024-06-05T14:42:36Z
label: Agências de empregos @pt
label: Agences de placement @fr
label: Agencias de empleo @es
label: Agenzie collocamento @it
label: Stellenvermittlungen @de
label: Кадровые агентства @ru
label: 就業仲介服務 @zh-hant
label: 职业介绍服务机构 @zh
label: 職業紹介所 @ja
label: 취업알선기관 @ko
definition: This segment includes companies that serve as intermediaries between companies looking to hire and potential job candidates.
notation: 171111161110
valid from: 2024-06-07

Executive Search
type: BicsLevel6Segment
type: Classifier
type: NamedIndividual
is level6 segment of: Mgmt & Admin Consulting Svcs
is contemporary version of: http://data.ga-group.nl/ics/bics/171111161111
is version of: http://data.ga-group.nl/ics/bics/171111161111
replaces: http://data.ga-group.nl/ics/bics/2020/171111161111
imported on: 2026-06-08T13:40:52.236Z
last refreshed on: 2026-06-08T13:41:38.450Z
source accessed on: 2024-06-05T14:42:36Z
source last accessed on: 2024-06-05T14:42:36Z
label: Agencias ejecutivos @es
label: Busca executiva @pt
label: Recherche de cadres @fr
label: Ricerca dirigenti @it
label: Suche: Führungskraft @de
label: Услуги подбора персонала @ru
label: 管理层检索 @zh
label: 管理職人材あっせん @ja
label: 高階主管仲介服務 @zh-hant
label: 경영진 구인서비스 @ko
definition: This segment includes companies that provide executive search, recruitment and/or placement services for clients with specific executive or senior management needs.
notation: 171111161111
valid from: 2024-06-07

General Management Consulting
type: BicsLevel6Segment
type: Classifier
type: NamedIndividual
is level6 segment of: Mgmt & Admin Consulting Svcs
is contemporary version of: http://data.ga-group.nl/ics/bics/171111161112
is version of: http://data.ga-group.nl/ics/bics/171111161112
replaces: http://data.ga-group.nl/ics/bics/2020/171111161112
imported on: 2026-06-08T13:40:52.236Z
last refreshed on: 2026-06-08T13:41:38.450Z
source accessed on: 2024-06-05T14:42:36Z
source last accessed on: 2024-06-05T14:42:36Z
label: Allgemeines Consulting @de
label: Asesoría de admin general @es
label: Conseils généraux en gestion @fr
label: Consultoria de gestão geral @pt
label: Servizi consulenza aziendale @it
label: Управленческое консультирование @ru
label: 一般管理顧問 @zh-hant
label: 経営管理ｺﾝｻﾙﾃｨﾝｸﾞｻｰﾋﾞｽ @ja
label: 行政管理与一般咨询 @zh
label: 일반 경영컨설팅 @ko
definition: This segment includes companies that provide operating advice and assistance to businesses and other organizations on administrative management issues, such as financial planning and budgeting, records management, office planning, strategic and organizational planning, site selection, new business startup, and business process improvement.
notation: 171111161112
valid from: 2024-06-07

Talent Management Services
type: BicsLevel6Segment
type: Classifier
type: NamedIndividual
is level6 segment of: Mgmt & Admin Consulting Svcs
is contemporary version of: http://data.ga-group.nl/ics/bics/171111161113
is version of: http://data.ga-group.nl/ics/bics/171111161113
replaces: http://data.ga-group.nl/ics/bics/2020/171111161113
imported on: 2026-06-08T13:40:52.236Z
last refreshed on: 2026-06-08T13:41:38.450Z
source accessed on: 2024-06-05T14:42:36Z
source last accessed on: 2024-06-05T14:42:36Z
label: Mitarbeiterentwicklung @de
label: Serv de gestión de talento @es
label: Serviços gerenc talento @pt
label: Services gestion des aptitudes @fr
label: Servizi gestione talento @it
label: Услуги по управлению развитием сотрудников @ru
label: 人才管理服务 @zh
label: 人才管理服務 @zh-hant
label: 人材管理ｻｰﾋﾞｽ @ja
label: 인재 관리 서비스 @ko
definition: This segment includes companies that provide promotional agency services. These companies enter into contractual agreements with their clients and aid in the career development of their clients, most often through the procurement of job placements. Typically, these companies specialize in specific fields such as modelling, music and sports, and are also known as talent agencies.
notation: 171111161113
valid from: 2024-06-07

Temporary Help
type: BicsLevel6Segment
type: Classifier
type: NamedIndividual
is level6 segment of: Mgmt & Admin Consulting Svcs
is contemporary version of: http://data.ga-group.nl/ics/bics/171111161114
is version of: http://data.ga-group.nl/ics/bics/171111161114
replaces: http://data.ga-group.nl/ics/bics/2020/171111161114
imported on: 2026-06-08T13:40:52.236Z
last refreshed on: 2026-06-08T13:41:38.450Z
source accessed on: 2024-06-05T14:42:36Z
source last accessed on: 2024-06-05T14:42:36Z
label: Agencias empleo temp @es
label: Ajuda temporária @pt
label: Personale temporario @it
label: Personnel suppléant @fr
label: Zeitpersonal @de
label: Временное трудоустройство @ru
label: 临时工派遣服务 @zh
label: 人材派遣ｻｰﾋﾞｽ @ja
label: 臨時派遣服務 @zh-hant
label: 임시 지원 서비스 @ko
definition: This segment includes companies that provide workers to clients' businesses for limited periods of time to supplement the client's existing work force.
notation: 171111161114
valid from: 2024-06-07

Mgmt & Admin Consulting Svcs
type: BicsLevel5Segment
type: Classifier
type: NamedIndividual
is level5 segment of: Professional Services
is contemporary version of: http://data.ga-group.nl/ics/bics/1711111611
is version of: http://data.ga-group.nl/ics/bics/1711111611
replaces: http://data.ga-group.nl/ics/bics/2020/1711111611
imported on: 2026-06-08T13:40:52.236Z
last refreshed on: 2026-06-08T13:41:38.450Z
source accessed on: 2024-06-05T14:42:36Z
source last accessed on: 2024-06-05T14:42:36Z
label: Beratungsdienste @de
label: Serv conseils en gestion et admin @fr
label: Serv consulenza gestione e ammin @it
label: Serv consultoría administrativa @es
label: Serv consultoria admin e gerenc @pt
label: Консультац. услуги по вопросам управл. @ru
label: 管理与行政顾问服务 @zh
label: 管理及行政顧問服務 @zh-hant
label: 経営･管理ｺﾝｻﾙﾃｨﾝｸﾞｻｰﾋﾞｽ @ja
label: 경영 & 관리 컨설팅 @ko
definition: This segment includes organizations that provide advice and assistance to businesses and other organizations on management issues, such as organizational planning, financial planning and budgeting, marketing, human resources, business process outsourcing, and other third-party services.
notation: 1711111611
valid from: 2024-06-07

Accounting Services
type: BicsLevel6Segment
type: Classifier
type: NamedIndividual
is level6 segment of: Other Professional Services
is contemporary version of: http://data.ga-group.nl/ics/bics/171111161210
is version of: http://data.ga-group.nl/ics/bics/171111161210
replaces: http://data.ga-group.nl/ics/bics/2020/171111161210
imported on: 2026-06-08T13:40:52.236Z
last refreshed on: 2026-06-08T13:41:38.450Z
source accessed on: 2024-06-05T14:42:36Z
source last accessed on: 2024-06-05T14:42:36Z
label: Buchführungsdienste @de
label: Serv contábeis @pt
label: Services comptables @fr
label: Servicios contables @es
label: Servizi contabilità @it
label: Услуги бухгалтерского учета @ru
label: 会計ｻｰﾋﾞｽ @ja
label: 会计服务 @zh
label: 會計服務 @zh-hant
label: 회계 서비스 @ko
definition: This segment includes companies that audit the accounting records of public and private organizations.
notation: 171111161210
valid from: 2024-06-07

Tax Preparation Services
type: BicsLevel6Segment
type: Classifier
type: NamedIndividual
is level6 segment of: Other Professional Services
is contemporary version of: http://data.ga-group.nl/ics/bics/171111161211
is version of: http://data.ga-group.nl/ics/bics/171111161211
replaces: http://data.ga-group.nl/ics/bics/2020/171111161211
imported on: 2026-06-08T13:40:52.236Z
last refreshed on: 2026-06-08T13:41:38.450Z
source accessed on: 2024-06-05T14:42:36Z
source last accessed on: 2024-06-05T14:42:36Z
label: Prépa décla revenus @fr
label: Prep dichiaraz redd @it
label: Prep imposto @pt
label: Serv prep impuestos @es
label: Steuerdienste @de
label: Подготовка налогов Услуги @ru
label: 報稅服務 @zh-hant
label: 报税服务 @zh
label: 税務ｻｰﾋﾞｽ @ja
label: 세무관련 서비스업 @ko
definition: This segment includes companies that provide tax return, payroll, and bookkeeping services.
notation: 171111161211
valid from: 2024-06-07

Other Professional Services
type: BicsLevel5Segment
type: Classifier
type: NamedIndividual
is level5 segment of: Professional Services
is contemporary version of: http://data.ga-group.nl/ics/bics/1711111612
is version of: http://data.ga-group.nl/ics/bics/1711111612
replaces: http://data.ga-group.nl/ics/bics/2020/1711111612
imported on: 2026-06-08T13:40:52.236Z
last refreshed on: 2026-06-08T13:41:38.450Z
source accessed on: 2024-06-05T14:42:36Z
source last accessed on: 2024-06-05T14:42:36Z
label: Altri serv profess @it
label: Autres srv profess @fr
label: Otros serv profes @es
label: Out serv prof @pt
label: Sonst. prof. Dienste @de
label: Другие проф. услуги @ru
label: その他専門ｻｰﾋﾞｽ @ja
label: 其他专业服务 @zh
label: 其他專業服務 @zh-hant
label: 기타 전문 서비스 @ko
definition: This segment includes organizations that provide professional services not elsewhere classified.
notation: 1711111612
valid from: 2024-06-07

Professional Services
type: BicsLevel4SubIndustry
type: Classifier
type: NamedIndividual
is sub industry of: Commercial Support Services
is contemporary version of: http://data.ga-group.nl/ics/bics/17111116
is version of: http://data.ga-group.nl/ics/bics/17111116
replaces: http://data.ga-group.nl/ics/bics/2020/17111116
imported on: 2026-06-08T13:40:52.236Z
last refreshed on: 2026-06-08T13:41:38.450Z
source accessed on: 2024-06-05T14:42:36Z
source last accessed on: 2024-06-05T14:42:36Z
label: Prof. Dienste @de
label: Serv profesionales @es
label: Serv professionali @it
label: Serviços prof @pt
label: Services profession. @fr
label: Профессион. услуги @ru
label: 专业服务 @zh
label: 専門職ｻｰﾋﾞｽ @ja
label: 専門��ｻｰﾋﾞｽ @ja
label: 專業服務 @zh-hant
label: 전문 서비스 @ko
definition: This industry subgroup includes companies that provide advice and services based on specialized knowledge, training, education, or licensing in fields such as law, lobbying, employment, or accounting.
notation: 17111116
valid from: 2024-06-07

Commercial Support Services
type: BicsLevel3Industry
type: Classifier
type: NamedIndividual
is industry of: Industrial Services
is contemporary version of: http://data.ga-group.nl/ics/bics/171111
is version of: http://data.ga-group.nl/ics/bics/171111
replaces: http://data.ga-group.nl/ics/bics/2020/171111
imported on: 2026-06-08T13:40:52.236Z
last refreshed on: 2026-06-08T13:41:38.450Z
source accessed on: 2024-06-05T14:42:36Z
source last accessed on: 2024-06-05T14:42:36Z
label: Kommerzielle Supportdienste @de
label: Serviços de suporte comercial @pt
label: Servicios de apoyo comercial @es
label: Servizi di supporto comm @it
label: Srvc de soutien au commerce @fr
label: Услуги коммерч. поддержки @ru
label: 商业支持服务 @zh
label: 商業支援ｻｰﾋﾞｽ @ja
label: 商業服務 @zh-hant
label: 상업 지원 서비스 @ko
definition: This industry includes companies that provide support services primarily for commercial users.
notation: 171111
valid from: 2024-06-07

Charter Airline - Full Svc
type: BicsLevel6Segment
type: Classifier
type: NamedIndividual
is level6 segment of: Full Service Airline
is contemporary version of: http://data.ga-group.nl/ics/bics/171112101010
is version of: http://data.ga-group.nl/ics/bics/171112101010
replaces: http://data.ga-group.nl/ics/bics/2020/171112101010
imported on: 2026-06-08T13:40:52.236Z
last refreshed on: 2026-06-08T13:41:38.450Z
source accessed on: 2024-06-05T14:42:36Z
source last accessed on: 2024-06-05T14:42:36Z
label: Alquiler de aerolínea - serv completo @es
label: Charter - Full-Service @de
label: Cies aériennes charters - Serv complet @fr
label: Companhia aérea fretada - Serv completo @pt
label: Linea aerea charter - Serv compl @it
label: Врчк от чартер. перевозок - авиалинии с полным обслуж. @ru
label: 包机航线-全方位服务 @zh
label: 包机航线-全方位服�� @zh
label: 包機航線-全方位 @zh-hant
label: 전세기 항공사 - 풀서비스 @ko
label: ﾁｬｰﾀｰ機旅客航空収益-ﾌﾙｻｰﾋﾞｽ @ja
label: ﾁｬｰﾀｰ機旅客航空収益-ﾌﾙｻ���ﾋﾞｽ @ja
definition: This segment includes full-service carrier revenue generated from chartered airline operations. Charter flights are usually nonscheduled and carry mainly tourists or military personnel as passengers.
notation: 171112101010
valid from: 2024-06-07

Mainline Airline - Full Svc
type: BicsLevel6Segment
type: Classifier
type: NamedIndividual
is level6 segment of: Full Service Airline
is contemporary version of: http://data.ga-group.nl/ics/bics/171112101011
is version of: http://data.ga-group.nl/ics/bics/171112101011
replaces: http://data.ga-group.nl/ics/bics/2020/171112101011
imported on: 2026-06-08T13:40:52.236Z
last refreshed on: 2026-06-08T13:41:38.450Z
source accessed on: 2024-06-05T14:42:36Z
source last accessed on: 2024-06-05T14:42:36Z
label: Aerolínea principal - serv completo @es
label: Companhia aérea principal - Serv completo @pt
label: Hauptlinie, Fluggesellschaft - Full-Service @de
label: Lignes aériennes principales - Serv compl @fr
label: Linea aerea principale - Serv compl @it
label: Врчк основных авиалиний - авиалинии с полным обслуж. @ru
label: 主线航线-全方位服务 @zh
label: 主要航線-全方位 @zh-hant
label: 主要路線旅客航空収益-ﾌﾙｻｰﾋﾞｽ @ja
label: 정기노선 항공사 - 풀서비스 @ko
definition: This segment includes full-service carrier revenue generated from mainline passenger air operations. Services are conducted with long-haul aircrafts to domestic and international destinations.
notation: 171112101011
valid from: 2024-06-07

Regional Airline - Full Svc
type: BicsLevel6Segment
type: Classifier
type: NamedIndividual
is level6 segment of: Full Service Airline
is contemporary version of: http://data.ga-group.nl/ics/bics/171112101012
is version of: http://data.ga-group.nl/ics/bics/171112101012
replaces: http://data.ga-group.nl/ics/bics/2020/171112101012
imported on: 2026-06-08T13:40:52.236Z
last refreshed on: 2026-06-08T13:41:38.450Z
source accessed on: 2024-06-05T14:42:36Z
source last accessed on: 2024-06-05T14:42:36Z
label: Aerolínea regional - serv completo @es
label: Lignes aériennes régionales - Serv compl @fr
label: Linea aerea regionale - Serv compl @it
label: Rec de companhia aérea regional, serviço completo @pt
label: Regional, Fluggesellschaft - Full-Service @de
label: Регион. авиалинии - авиалинии с полным обслуж. @ru
label: 地区航线-全方位服务 @zh
label: 地區性航線-全方位 @zh-hant
label: 地方路線旅客航空収益-ﾌﾙｻｰﾋﾞｽ @ja
label: 지역 항공사 - 풀서비스 @ko
definition: This segment includes full-service carrier revenue generated from regional operations, such as contract carriers and/or regional subsidiaries.
notation: 171112101012
valid from: 2024-06-07

Other Airline Rev - Full Svc
type: BicsLevel6Segment
type: Classifier
type: NamedIndividual
is level6 segment of: Full Service Airline
is contemporary version of: http://data.ga-group.nl/ics/bics/171112101013
is version of: http://data.ga-group.nl/ics/bics/171112101013
replaces: http://data.ga-group.nl/ics/bics/2020/171112101013
imported on: 2026-06-08T13:40:52.236Z
last refreshed on: 2026-06-08T13:41:38.450Z
source accessed on: 2024-06-05T14:42:36Z
source last accessed on: 2024-06-05T14:42:36Z
label: Altri ric linea aerea - Serv compl @it
label: Autres rev cies aériennes - Serv compl @fr
label: Otro ing aerolínea - serv comp @es
label: Outras rec cias aéreas - Serv completo @pt
label: Sonst. Fluggesell.-Erlös - Full-Service @de
label: Пр. врчк авиакомпании с полным обслуж. @ru
label: その他旅客航空収益-ﾌﾙｻｰﾋﾞｽ @ja
label: 其他客运收入-全方位服务 @zh
label: 其他航線營收-全方位 @zh-hant
label: 기타 항공사 수익 - 풀서비스 @ko
definition: This segment includes full-service carrier revenue generated from ancillary passenger activities and/or onboard product sales, such as booking fees, baggage fees, frequent flyer programs, and leasing income as well as the sale of onboard food, goods, telecommunications services, and gaming proceeds.
notation: 171112101013
valid from: 2024-06-07

Full Service Airline
type: BicsLevel5Segment
type: Classifier
type: NamedIndividual
is level5 segment of: Airlines
is contemporary version of: http://data.ga-group.nl/ics/bics/1711121010
is version of: http://data.ga-group.nl/ics/bics/1711121010
replaces: http://data.ga-group.nl/ics/bics/2020/1711121010
imported on: 2026-06-08T13:40:52.236Z
last refreshed on: 2026-06-08T13:41:38.450Z
source accessed on: 2024-06-05T14:42:36Z
source last accessed on: 2024-06-05T14:42:36Z
label: Aerolínea servicio completo @es
label: Compagnies aériennes service complet @fr
label: Companhia aérea de serviço completo @pt
label: Full-Service-Fluggesellschaft @de
label: Linea aerea pieno servizio @it
label: Авиакомпании с полным обслуживанием @ru
label: 全方位服务航空公司 @zh
label: 全方位航空 @zh-hant
label: 풀서비스 항공사 @ko
label: ﾌﾙｻｰﾋﾞｽ旅客航空 @ja
definition: This segment includes companies that provide traditional full-service hub-and-spoke scheduled passenger flights.
notation: 1711121010
valid from: 2024-06-07

Chartered Airline - LCC
type: BicsLevel6Segment
type: Classifier
type: NamedIndividual
is level6 segment of: Low Cost Airline
is contemporary version of: http://data.ga-group.nl/ics/bics/171112101110
is version of: http://data.ga-group.nl/ics/bics/171112101110
replaces: http://data.ga-group.nl/ics/bics/2020/171112101110
imported on: 2026-06-08T13:40:52.236Z
last refreshed on: 2026-06-08T13:41:38.450Z
source accessed on: 2024-06-05T14:42:36Z
source last accessed on: 2024-06-05T14:42:36Z
label: Alquiler de aerolínea - LCC @es
label: Companhia aérea fretada - Bx cst @pt
label: Gecharterte Fluggesellschaft - LCC @de
label: Lignes aériennes charters - Bas px @fr
label: Linea aerea charter - LCC @it
label: Чартерные авиалинии - LCC @ru
label: 包机航线-廉航 @zh
label: 包機航線-廉價 @zh-hant
label: 전세기 항공사 - LCC @ko
label: ﾁｬｰﾀｰ機旅客航空収益-格安 @ja
definition: This segment includes low-cost carrier revenue generated from charted airline operations.
notation: 171112101110
valid from: 2024-06-07

Mainline Airline - LCC
type: BicsLevel6Segment
type: Classifier
type: NamedIndividual
is level6 segment of: Low Cost Airline
is contemporary version of: http://data.ga-group.nl/ics/bics/171112101111
is version of: http://data.ga-group.nl/ics/bics/171112101111
replaces: http://data.ga-group.nl/ics/bics/2020/171112101111
imported on: 2026-06-08T13:40:52.236Z
last refreshed on: 2026-06-08T13:41:38.450Z
source accessed on: 2024-06-05T14:42:36Z
source last accessed on: 2024-06-05T14:42:36Z
label: Aerolínea principal - LCC @es
label: Cies aériennes Réseau principal- Bas px @fr
label: Companhia aérea de linha principal - Bx cst @pt
label: Hauptlinie, Fluggesellschaft - LCC @de
label: Linea aerea principale - LCC @it
label: Основные авиалинии - LCC @ru
label: 主线航线-廉航 @zh
label: 主要航線-廉價 @zh-hant
label: 主要路線旅客航空収益-格安 @ja
label: 정기노선 항공사 - LCC @ko
label: ��要航線-廉價 @zh-hant
definition: This segment includes low-cost carrier revenue generated from mainline airline operations.
notation: 171112101111
valid from: 2024-06-07

Regional Airline - LCC
type: BicsLevel6Segment
type: Classifier
type: NamedIndividual
is level6 segment of: Low Cost Airline
is contemporary version of: http://data.ga-group.nl/ics/bics/171112101112
is version of: http://data.ga-group.nl/ics/bics/171112101112
replaces: http://data.ga-group.nl/ics/bics/2020/171112101112
imported on: 2026-06-08T13:40:52.236Z
last refreshed on: 2026-06-08T13:41:38.450Z
source accessed on: 2024-06-05T14:42:36Z
source last accessed on: 2024-06-05T14:42:36Z
label: Aerolínea regional - LCC @es
label: Compagnies aériennes régionales - Bas px @fr
label: Companhia aérea regional - Bx cst @pt
label: Linea aerea regionale - LCC @it
label: Regional, Fluggesellschaft - LCC @de
label: Регион. авиалинии - LCC - @ru
label: 地区航线-廉航 @zh
label: 地區性航線-廉價 @zh-hant
label: 地方路線旅客航空収益-格安 @ja
label: 지역 항공사 - LCC @ko
definition: This segment includes low-cost carrier revenue generated from regional operations, such as contract carriers and/or regional subsidiaries.
notation: 171112101112
valid from: 2024-06-07

Other Airline Rev - LCC
type: BicsLevel6Segment
type: Classifier
type: NamedIndividual
is level6 segment of: Low Cost Airline
is contemporary version of: http://data.ga-group.nl/ics/bics/171112101113
is version of: http://data.ga-group.nl/ics/bics/171112101113
replaces: http://data.ga-group.nl/ics/bics/2020/171112101113
imported on: 2026-06-08T13:40:52.236Z
last refreshed on: 2026-06-08T13:41:38.450Z
source accessed on: 2024-06-05T14:42:36Z
source last accessed on: 2024-06-05T14:42:36Z
label: Altri ricavi linea aerea - LCC @it
label: Autres rev cies aériennes - Bas px @fr
label: Otro ing aerolínea - LCC @es
label: Outras rec cias aéreas - Bx cust @pt
label: Sonst. Fluggesell.-Erlös - LCC @de
label: Пр. врчк авиакомп. - LCC @ru
label: その他旅客航空収益-格安 @ja
label: 其他客运收入-廉航 @zh
label: 其他航線營收-廉價 @zh-hant
label: 기타 항공사 수익 - LCC @ko
definition: This segment includes low-cost carrier revenue generated from ancillary passenger activities and/or onboard product sales, such as booking fees, baggage fees, frequent flyer programs, and leasing income as well as the sale of onboard food, goods, telecommunications services, and gaming proceeds.
notation: 171112101113
valid from: 2024-06-07

Low Cost Airline
type: BicsLevel5Segment
type: Classifier
type: NamedIndividual
is level5 segment of: Airlines
is contemporary version of: http://data.ga-group.nl/ics/bics/1711121011
is version of: http://data.ga-group.nl/ics/bics/1711121011
replaces: http://data.ga-group.nl/ics/bics/2020/1711121011
imported on: 2026-06-08T13:40:52.236Z
last refreshed on: 2026-06-08T13:41:38.450Z
source accessed on: 2024-06-05T14:42:36Z
source last accessed on: 2024-06-05T14:42:36Z
label: Aerolíneas de bajo coste @es
label: Billigflieger @de
label: Compagnies aériennes à bas prix @fr
label: Companhia aérea baixo custo @pt
label: Linea aerea low cost @it
label: Лоукостеры @ru
label: 低成本航空公司 @zh
label: 廉價航空 @zh-hant
label: 格安旅客航空 @ja
label: 저가 항공사 @ko
definition: This segment includes airlines that operate under a low-cost business model. Such a model may include providing low ticket prices, a single passenger class, and limited services.
notation: 1711121011
valid from: 2024-06-07

Chartered Airline - Regional
type: BicsLevel6Segment
type: Classifier
type: NamedIndividual
is level6 segment of: Regional Airline
is contemporary version of: http://data.ga-group.nl/ics/bics/171112101210
is version of: http://data.ga-group.nl/ics/bics/171112101210
replaces: http://data.ga-group.nl/ics/bics/2020/171112101210
imported on: 2026-06-08T13:40:52.236Z
last refreshed on: 2026-06-08T13:41:38.450Z
source accessed on: 2024-06-05T14:42:36Z
source last accessed on: 2024-06-05T14:42:36Z
label: Alquiler de aerolínea - regional @es
label: Companhia aérea fretada - Regional @pt
label: Gecharterte Fluggesellschaft - Regional @de
label: Lignes aériennes charters - Régional @fr
label: Linea aerea charter - Regionale @it
label: Чартерные авиалинии - регион. @ru
label: 包机航线-地区 @zh
label: 包機航線-地區性 @zh-hant
label: 包機航線-地���性 @zh-hant
label: 전세기 항공사 - 지역 @ko
label: ﾁｬｰﾀｰ機旅客航空収益-地方 @ja
definition: This segment includes regional carrier revenue generated from airline charter operations.
notation: 171112101210
valid from: 2024-06-07

Mainline Airline - Regional
type: BicsLevel6Segment
type: Classifier
type: NamedIndividual
is level6 segment of: Regional Airline
is contemporary version of: http://data.ga-group.nl/ics/bics/171112101211
is version of: http://data.ga-group.nl/ics/bics/171112101211
replaces: http://data.ga-group.nl/ics/bics/2020/171112101211
imported on: 2026-06-08T13:40:52.236Z
last refreshed on: 2026-06-08T13:41:38.450Z
source accessed on: 2024-06-05T14:42:36Z
source last accessed on: 2024-06-05T14:42:36Z
label: Aerolínea principal - regional @es
label: Cies aériennes Réseau principal - Régional @fr
label: Companhia aérea de linha principal - Regional @pt
label: Hauptlinie, Fluggesellschaft - Regional @de
label: Linea aerea principale - Regionale @it
label: Основные авиалинии - регион. @ru
label: 主线航线-地区 @zh
label: 主要航線-地區性 @zh-hant
label: 主要路線旅客航空収益-地方 @ja
label: 정기노선 항공사 - 지역 @ko
definition: This segment includes regional carrier revenue generated from mainline airline operations.
notation: 171112101211
valid from: 2024-06-07

Regional Airline - Regional
type: BicsLevel6Segment
type: Classifier
type: NamedIndividual
is level6 segment of: Regional Airline
is contemporary version of: http://data.ga-group.nl/ics/bics/171112101212
is version of: http://data.ga-group.nl/ics/bics/171112101212
replaces: http://data.ga-group.nl/ics/bics/2020/171112101212
imported on: 2026-06-08T13:40:52.236Z
last refreshed on: 2026-06-08T13:41:38.450Z
source accessed on: 2024-06-05T14:42:36Z
source last accessed on: 2024-06-05T14:42:36Z
label: Aerolínea regional - regional @es
label: Companhia aérea regional - Regional @pt
label: Lignes aériennes régionales - Régionales @fr
label: Linea aerea regionale - Regionale @it
label: Regional, Fluggesellschaft - Regional @de
label: Региональные авиалинии - регион. @ru
label: 地区航线-地区 @zh
label: 地區性航線-地區性 @zh-hant
label: 地方路線旅客航空収益-地方 @ja
label: 지역 항공사 - 지역 @ko
definition: This segment includes regional carrier revenue generated from regional operations, such as contract carriers and/or regional subsidiaries.
notation: 171112101212
valid from: 2024-06-07

Other Airline Rev - Regional
type: BicsLevel6Segment
type: Classifier
type: NamedIndividual
is level6 segment of: Regional Airline
is contemporary version of: http://data.ga-group.nl/ics/bics/171112101213
is version of: http://data.ga-group.nl/ics/bics/171112101213
replaces: http://data.ga-group.nl/ics/bics/2020/171112101213
imported on: 2026-06-08T13:40:52.236Z
last refreshed on: 2026-06-08T13:41:38.450Z
source accessed on: 2024-06-05T14:42:36Z
source last accessed on: 2024-06-05T14:42:36Z
label: Altri ric linea aerea - Regionale @it
label: Autres rev cies aériennes - Régional @fr
label: Otro ing aerolínea - regional @es
label: Outras rec cias aéreas - Regional @pt
label: Sonst. Fluggesell.-Erlös - Regional @de
label: Пр. врчк авиакомп. - регион. @ru
label: Пр. врчк авиакомп. - ре��ион. @ru
label: その他旅客航空収益-地方 @ja
label: 其他客运收入-地区 @zh
label: 其他航線營收-地區 @zh-hant
label: 기타 항공사 수익 - 지역 @ko
definition: This segment includes regional carrier revenue generated from ancillary passenger activities and/or onboard product sales, such as booking fees, baggage fees, frequent flyer programs, and leasing income as well as the sale of onboard food, goods, telecommunications services and gaming proceeds.
notation: 171112101213
valid from: 2024-06-07

Regional Airline
type: BicsLevel5Segment
type: Classifier
type: NamedIndividual
is level5 segment of: Airlines
is contemporary version of: http://data.ga-group.nl/ics/bics/1711121012
is version of: http://data.ga-group.nl/ics/bics/1711121012
replaces: http://data.ga-group.nl/ics/bics/2020/1711121012
imported on: 2026-06-08T13:40:52.236Z
last refreshed on: 2026-06-08T13:41:38.450Z
source accessed on: 2024-06-05T14:42:36Z
source last accessed on: 2024-06-05T14:42:36Z
label: Aerolínea regional @es
label: Compagnie aérienne régionale @fr
label: Companhia aérea regional @pt
label: Linee aeree reg @it
label: Regionale Fluggesellschaft @de
label: Региональные авиалинии @ru
label: 地区航线 @zh
label: 地區性航線 @zh-hant
label: 地方路線旅客航空 @ja
label: 지역 항공사 @ko
definition: This segment includes companies that provide airline service for small cities. Regional carriers are also used to support larger full-service carriers.
notation: 1711121012
valid from: 2024-06-07

Airlines
type: BicsLevel4SubIndustry
type: Classifier
type: NamedIndividual
is sub industry of: Transportation & Logistics
is contemporary version of: http://data.ga-group.nl/ics/bics/17111210
is version of: http://data.ga-group.nl/ics/bics/17111210
replaces: http://data.ga-group.nl/ics/bics/2020/17111210
imported on: 2026-06-08T13:40:52.236Z
last refreshed on: 2026-06-08T13:41:38.450Z
source accessed on: 2024-06-05T14:42:36Z
source last accessed on: 2024-06-05T14:42:36Z
label: Empresas aéreas @pt
label: Fluglinien @de
label: Líneas aéreas @es
label: Lignes aériennes @fr
label: Linee aeree @it
label: Авиалинии @ru
label: 旅客航空 @ja
label: 航空 @zh-hant
label: 航空公司 @zh
label: 항공사 @ko
definition: This industry subgroup includes companies that provide air transportation services, such as air freight and air commuter carriers.
notation: 17111210
valid from: 2024-06-07

Air Freight
type: BicsLevel4SubIndustry
type: Classifier
type: NamedIndividual
is sub industry of: Transportation & Logistics
is contemporary version of: http://data.ga-group.nl/ics/bics/17111211
is version of: http://data.ga-group.nl/ics/bics/17111211
replaces: http://data.ga-group.nl/ics/bics/2020/17111211
imported on: 2026-06-08T13:40:52.236Z
last refreshed on: 2026-06-08T13:41:38.450Z
source accessed on: 2024-06-05T14:42:36Z
source last accessed on: 2024-06-05T14:42:36Z
label: Carga aérea @pt
label: Flete aéreo @es
label: Frachttransport zu Luft @de
label: Transport aérien @fr
label: Trasporto aereo @it
label: Грузовые авиаперевозки @ru
label: 空运 @zh
label: 空運運輸 @zh-hant
label: 航空貨物輸送 @ja
label: 항공 화물 @ko
definition: This industry subgroup includes companies that provide air freight transportation services, including shipping freight or mail on passenger airlines or dedicated air freight cargo planes.
notation: 17111211
valid from: 2024-06-07

Express Courier Services
type: BicsLevel5Segment
type: Classifier
type: NamedIndividual
is level5 segment of: Courier Services
is contemporary version of: http://data.ga-group.nl/ics/bics/1711121210
is version of: http://data.ga-group.nl/ics/bics/1711121210
replaces: http://data.ga-group.nl/ics/bics/2020/1711121210
imported on: 2026-06-08T13:40:52.236Z
last refreshed on: 2026-06-08T13:41:38.450Z
source accessed on: 2024-06-05T14:42:36Z
source last accessed on: 2024-06-05T14:42:36Z
label: Express-Kurier @de
label: Mensajería express @es
label: Serv de correio expresso @pt
label: Serv post espressi @it
label: Srv courrier express @fr
label: Услуги экспресс-курьера @ru
label: 宅急便ｻｰﾋﾞｽ @ja
label: 快递服务 @zh
label: 快遞服務 @zh-hant
label: 급행 택배 서비스 @ko
definition: This segment includes companies that provide express delivery courier services by ground or air transportation, and typically within one to three days.
notation: 1711121210
valid from: 2024-06-07

Ground Courier Services
type: BicsLevel5Segment
type: Classifier
type: NamedIndividual
is level5 segment of: Courier Services
is contemporary version of: http://data.ga-group.nl/ics/bics/1711121211
is version of: http://data.ga-group.nl/ics/bics/1711121211
replaces: http://data.ga-group.nl/ics/bics/2020/1711121211
imported on: 2026-06-08T13:40:52.236Z
last refreshed on: 2026-06-08T13:41:38.450Z
source accessed on: 2024-06-05T14:42:36Z
source last accessed on: 2024-06-05T14:42:36Z
label: Corriere via terra @it
label: Kurierdienst zu Land @de
label: Mensajería terrestre @es
label: Serv de correio via terra @pt
label: Srv courrier terre @fr
label: Услуги курьера наземной почты @ru
label: 地面快递服务 @zh
label: 宅配便ｻｰﾋﾞｽ @ja
label: 陸地快遞服務 @zh-hant
label: 육상 택배 서비스 @ko
definition: This segment includes companies that provide delivery courier services by ground transport
notation: 1711121211
valid from: 2024-06-07

Mail Services
type: BicsLevel5Segment
type: Classifier
type: NamedIndividual
is level5 segment of: Courier Services
is contemporary version of: http://data.ga-group.nl/ics/bics/1711121212
is version of: http://data.ga-group.nl/ics/bics/1711121212
replaces: http://data.ga-group.nl/ics/bics/2020/1711121212
imported on: 2026-06-08T13:40:52.236Z
last refreshed on: 2026-06-08T13:41:38.450Z
source accessed on: 2024-06-05T14:42:36Z
source last accessed on: 2024-06-05T14:42:36Z
label: Postdienst @de
label: Serviços postais @pt
label: Services postaux @fr
label: Servicios de correo @es
label: Servizi postali @it
label: Почтовые услуги @ru
label: 邮件服务 @zh
label: 郵便ｻｰﾋﾞｽ @ja
label: 郵政服務 @zh-hant
label: 우편업 @ko
definition: This segment includes companies that provide postal services, including the pickup and delivery of mail and the operation of national post offices.
notation: 1711121212
valid from: 2024-06-07

Courier Services
type: BicsLevel4SubIndustry
type: Classifier
type: NamedIndividual
is sub industry of: Transportation & Logistics
is contemporary version of: http://data.ga-group.nl/ics/bics/17111212
is version of: http://data.ga-group.nl/ics/bics/17111212
replaces: http://data.ga-group.nl/ics/bics/2020/17111212
imported on: 2026-06-08T13:40:52.236Z
last refreshed on: 2026-06-08T13:41:38.450Z
source accessed on: 2024-06-05T14:42:36Z
source last accessed on: 2024-06-05T14:42:36Z
label: Express- & Kurierdienste @de
label: Serviços de correios @pt
label: Services de courrier @fr
label: Servicios de mensajería @es
label: Servizi corriere @it
label: Курьерская доставка @ru
label: 宅配ｻｰﾋﾞｽ @ja
label: 快遞服務 @zh-hant
label: 递送服务 @zh
label: 택배 서비스 @ko
definition: This industry subgroup includes companies that provide courier delivery services. Such services include pickup and delivery of letters, small packages, and documents. Delivery services can be done by air or ground transportation.
notation: 17111212
valid from: 2024-06-07

Coastal Freight Shipping
type: BicsLevel5Segment
type: Classifier
type: NamedIndividual
is level5 segment of: Marine Shipping
is contemporary version of: http://data.ga-group.nl/ics/bics/1711121310
is version of: http://data.ga-group.nl/ics/bics/1711121310
replaces: http://data.ga-group.nl/ics/bics/2020/1711121310
imported on: 2026-06-08T13:40:52.236Z
last refreshed on: 2026-06-08T13:41:38.450Z
source accessed on: 2024-06-05T14:42:36Z
source last accessed on: 2024-06-05T14:42:36Z
label: Embarque de carga costeiro @pt
label: Envíos de flete de costa @es
label: Frachtlogistik in der Küstenschifffahrt @de
label: Transport de fret côtier @fr
label: Trasporto merci costiero @it
label: Прибрежные перевозки @ru
label: 沿海貨物輸送 @ja
label: 沿海貨運 @zh-hant
label: 沿海货运 @zh
label: 연안 화물 운송 @ko
definition: This segment includes companies that transport freight overseas, tow barges, and rent vessels for freight transport.
notation: 1711121310
valid from: 2024-06-07

Container Shipping
type: BicsLevel5Segment
type: Classifier
type: NamedIndividual
is level5 segment of: Marine Shipping
is contemporary version of: http://data.ga-group.nl/ics/bics/1711121311
is version of: http://data.ga-group.nl/ics/bics/1711121311
replaces: http://data.ga-group.nl/ics/bics/2020/1711121311
imported on: 2026-06-08T13:40:52.236Z
last refreshed on: 2026-06-08T13:41:38.450Z
source accessed on: 2024-06-05T14:42:36Z
source last accessed on: 2024-06-05T14:42:36Z
label: Containerverschiffg @de
label: Embarque de contêiner @pt
label: Envío por contenedor @es
label: Fret en conteneur @fr
label: Trasporto container @it
label: Контейнерные перевозки @ru
label: 貨櫃航運 @zh-hant
label: 集装箱货运 @zh
label: 컨테이너 운송 @ko
label: ｺﾝﾃﾅ輸送 @ja
definition: This segment includes companies that provide marine transportation of freight by container ship. These ships transport standardized containers holding a wide range of consumer and industrial products.
notation: 1711121311
valid from: 2024-06-07

Dry Bulk Shipping
type: BicsLevel5Segment
type: Classifier
type: NamedIndividual
is level5 segment of: Marine Shipping
is contemporary version of: http://data.ga-group.nl/ics/bics/1711121312
is version of: http://data.ga-group.nl/ics/bics/1711121312
replaces: http://data.ga-group.nl/ics/bics/2020/1711121312
imported on: 2026-06-08T13:40:52.236Z
last refreshed on: 2026-06-08T13:41:38.450Z
source accessed on: 2024-06-05T14:42:36Z
source last accessed on: 2024-06-05T14:42:36Z
label: Envío de carga seca @es
label: Fret maritime vrac @fr
label: Schüttguttransport @de
label: Sped carico secco @it
label: Transporte de carga a granel @pt
label: Морские перевозки сухих грузов @ru
label: 干货运输 @zh
label: 散裝乾貨航運 @zh-hant
label: 건화물 벌크 운송 @ko
label: ﾄﾞﾗｲﾊﾞﾙｸ船輸送 @ja
definition: This segment includes companies that provide marine transportation of dry bulk commodity products. Typically, the ships used are bulk carriers that are designed to transport large amounts of dry, unpackaged cargo.
notation: 1711121312
valid from: 2024-06-07

Inland Water Shipping
type: BicsLevel5Segment
type: Classifier
type: NamedIndividual
is level5 segment of: Marine Shipping
is contemporary version of: http://data.ga-group.nl/ics/bics/1711121313
is version of: http://data.ga-group.nl/ics/bics/1711121313
replaces: http://data.ga-group.nl/ics/bics/2020/1711121313
imported on: 2026-06-08T13:40:52.236Z
last refreshed on: 2026-06-08T13:41:38.450Z
source accessed on: 2024-06-05T14:42:36Z
source last accessed on: 2024-06-05T14:42:36Z
label: Binnengewässertransport @de
label: Embarque de navegação interior @pt
label: Envíos en aguas interiores @es
label: Fret en eaux intérieures @fr
label: Trasporto acque interne @it
label: Рыболовство во внутр. водах @ru
label: 內陸水運 @zh-hant
label: 内水面輸送 @ja
label: 内陆水运 @zh
label: 내륙 수상 운송 @ko
definition: This segment includes companies that transport freight on rivers, canals, and lakes on vessels not suitable for ocean transport.
notation: 1711121313
valid from: 2024-06-07

Roll-On Roll-Off Shipping
type: BicsLevel5Segment
type: Classifier
type: NamedIndividual
is level5 segment of: Marine Shipping
is contemporary version of: http://data.ga-group.nl/ics/bics/1711121314
is version of: http://data.ga-group.nl/ics/bics/1711121314
replaces: http://data.ga-group.nl/ics/bics/2020/1711121314
imported on: 2026-06-08T13:40:52.236Z
last refreshed on: 2026-06-08T13:41:38.450Z
source accessed on: 2024-06-05T14:42:36Z
source last accessed on: 2024-06-05T14:42:36Z
label: Envío RO-RO @es
label: RO-RO Envio @pt
label: RO-RO貨運 @zh-hant
label: RO-RO선 수송 @ko
label: RoRo-Transport @de
label: Transport RO-RO @fr
label: Trasp mar RO-RO @it
label: Накатная транспортировка @ru
label: 滚装运输 @zh
label: 車両海上輸送 @ja
definition: This segment includes companies that provide marine transportation of automobiles and other vehicles. Ships are referred to as RO-ROs (roll-on/roll-off).
notation: 1711121314
valid from: 2024-06-07

Chemical Tanker Shipping
type: BicsLevel6Segment
type: Classifier
type: NamedIndividual
is level6 segment of: Tanker Shipping
is contemporary version of: http://data.ga-group.nl/ics/bics/171112131510
is version of: http://data.ga-group.nl/ics/bics/171112131510
replaces: http://data.ga-group.nl/ics/bics/2020/171112131510
imported on: 2026-06-08T13:40:52.236Z
last refreshed on: 2026-06-08T13:41:38.450Z
source accessed on: 2024-06-05T14:42:36Z
source last accessed on: 2024-06-05T14:42:36Z
label: Chemikalientankertransport @de
label: Embarque de tanque de produtos químicos @pt
label: Envíos en cisternas químicas @es
label: Transport par tanker chim @fr
label: Trasporto navi carico prod chim @it
label: Хим. танкерные грузопер. @ru
label: 化学品货轮运输 @zh
label: 化學品油輪運輸 @zh-hant
label: 화학 탱커 운송 @ko
label: ｹﾐｶﾙﾀﾝｶｰ輸送 @ja
definition: This segment includes companies that provide marine transportation of chemicals using chemical tanker carriers.
notation: 171112131510
valid from: 2024-06-07

LPG & LNG Tanker Shipping
type: BicsLevel6Segment
type: Classifier
type: NamedIndividual
is level6 segment of: Tanker Shipping
is contemporary version of: http://data.ga-group.nl/ics/bics/171112131511
is version of: http://data.ga-group.nl/ics/bics/171112131511
replaces: http://data.ga-group.nl/ics/bics/2020/171112131511
imported on: 2026-06-08T13:40:52.236Z
last refreshed on: 2026-06-08T13:41:38.450Z
source accessed on: 2024-06-05T14:42:36Z
source last accessed on: 2024-06-05T14:42:36Z
label: Embarque de tanques de GPL e GNL @pt
label: Envíos de cisternas de GLP y GNL @es
label: LPG & LNG-Tankertransport @de
label: LPG 및 LNG 탱커 운송 @ko
label: LPG与LNG货轮运输 @zh
label: LPG･LNGﾀﾝｶｰ輸送 @ja
label: Transport GPL/GNL par tanker @fr
label: Trasp navi cisterna GNL e GPL @it
label: Танкерные перевозки СНГ и СПГ @ru
label: 液化石油氣/天然氣油輪運輸 @zh-hant
definition: This segment includes companies that provide marine transportation of liquefied petroleum gas (LPG) and liquefied natural gas (LNG) via LPG/LNG carriers.
notation: 171112131511
valid from: 2024-06-07

Oil Tanker Shipping
type: BicsLevel6Segment
type: Classifier
type: NamedIndividual
is level6 segment of: Tanker Shipping
is contemporary version of: http://data.ga-group.nl/ics/bics/171112131512
is version of: http://data.ga-group.nl/ics/bics/171112131512
replaces: http://data.ga-group.nl/ics/bics/2020/171112131512
imported on: 2026-06-08T13:40:52.236Z
last refreshed on: 2026-06-08T13:41:38.450Z
source accessed on: 2024-06-05T14:42:36Z
source last accessed on: 2024-06-05T14:42:36Z
label: Embarque de petroleiros @pt
label: Envíos en cisternas petroleras @es
label: Transport par tanker pétro @fr
label: Trasporto navi cisterna petr @it
label: Öltankertransport @de
label: Нефтяные танк. грузопер. @ru
label: 油輪運輸 @zh-hant
label: 油轮运输 @zh
label: 石油ﾀﾝｶｰ輸送 @ja
label: 유조선 운송 @ko
definition: This segment includes companies that provide marine transportation of oil and refined petroleum products via oil and product tankers.
notation: 171112131512
valid from: 2024-06-07

Tanker Shipping
type: BicsLevel5Segment
type: Classifier
type: NamedIndividual
is level5 segment of: Marine Shipping
is contemporary version of: http://data.ga-group.nl/ics/bics/1711121315
is version of: http://data.ga-group.nl/ics/bics/1711121315
replaces: http://data.ga-group.nl/ics/bics/2020/1711121315
imported on: 2026-06-08T13:40:52.236Z
last refreshed on: 2026-06-08T13:41:38.450Z
source accessed on: 2024-06-05T14:42:36Z
source last accessed on: 2024-06-05T14:42:36Z
label: Embarque de petroleiros @pt
label: Envíos en cisternas @es
label: Tankertransport @de
label: Transport par tanker @fr
label: Trasporto navi cisterna @it
label: Танкерные перевозки @ru
label: 油輪 @zh-hant
label: 货轮运输 @zh
label: 탱커 운송 @ko
label: ﾀﾝｶｰ輸送 @ja
definition: This segment includes companies that provide marine transportation of liquids or gases in bulk.
notation: 1711121315
valid from: 2024-06-07

Marine Shipping
type: BicsLevel4SubIndustry
type: Classifier
type: NamedIndividual
is sub industry of: Transportation & Logistics
is contemporary version of: http://data.ga-group.nl/ics/bics/17111213
is version of: http://data.ga-group.nl/ics/bics/17111213
replaces: http://data.ga-group.nl/ics/bics/2020/17111213
imported on: 2026-06-08T13:40:52.236Z
last refreshed on: 2026-06-08T13:41:38.450Z
source accessed on: 2024-06-05T14:42:36Z
source last accessed on: 2024-06-05T14:42:36Z
label: Embarque marítimo @pt
label: Envío marítimo @es
label: Marinetransport @de
label: Transport maritime @fr
label: Trasporto marittimo @it
label: Морские грузоперевозки @ru
label: 海运 @zh
label: 海運服務 @zh-hant
label: 海運ｻｰﾋﾞｽ @ja
label: 해운운송 @ko
definition: This industry subgroup includes companies that provide marine transportation services, including freight transportation and oil tankers.
notation: 17111213
valid from: 2024-06-07

Intermodal Freight - Rail
type: BicsLevel5Segment
type: Classifier
type: NamedIndividual
is level5 segment of: Rail Freight
is contemporary version of: http://data.ga-group.nl/ics/bics/1711121410
is version of: http://data.ga-group.nl/ics/bics/1711121410
replaces: http://data.ga-group.nl/ics/bics/2020/1711121410
imported on: 2026-06-08T13:40:52.236Z
last refreshed on: 2026-06-08T13:41:38.450Z
source accessed on: 2024-06-05T14:42:36Z
source last accessed on: 2024-06-05T14:42:36Z
label: Carga intermodal - Ferroviário @pt
label: Flete intermodal - ferroviario @es
label: Frachterlös komb. @de
label: Fret intermodal - Rail @fr
label: Trasporto intermodale - Ferrovie @it
label: Интермодальные перевозки-жел. дорога @ru
label: 多式联运-铁路 @zh
label: 綜合貨運-鐵路 @zh-hant
label: 複合一貫輸送-鉄道 @ja
label: 複合一貫輸送-���道 @ja
label: 협동일관수송화물 - 철도 @ko
definition: This segment includes companies that transport products by rail using intermodal containers and trailers.
notation: 1711121410
valid from: 2024-06-07

Agriculture Rail - Electric
type: BicsLevel7Segment
type: Classifier
type: NamedIndividual
is level7 segment of: Agriculture Freight - Rail
is contemporary version of: http://data.ga-group.nl/ics/bics/17111214111010
is version of: http://data.ga-group.nl/ics/bics/17111214111010
replaces: http://data.ga-group.nl/ics/bics/2020/17111214111010
imported on: 2026-06-08T13:40:52.236Z
last refreshed on: 2026-06-08T13:41:38.450Z
source accessed on: 2024-06-05T14:42:36Z
source last accessed on: 2024-06-05T14:42:36Z
label: Ferroviario agrícola - eléctrico @es
label: Landwirtschaft Bahn - Elektrisch @de
label: Transport ferroviaire agriculture - électricité @fr
label: Transporte ferroviário produtos agrícolas- eletricidade @pt
label: Trasporto ferroviario agricolo - Elettrico @it
label: Сельскохозяйственная железная дорога - электрич. @ru
label: 农产品铁路-电动 @zh
label: 農業鐵路-電力 @zh-hant
label: 農産物･肥料鉄道輸送-電気 @ja
label: 농업 철도 - 전기 @ko
label: ��業鐵路-電力 @zh-hant
definition: This segment includes companies that transport agricultural products via electric rail cars.
notation: 17111214111010
valid from: 2024-06-07

Agriculture Rail - Fossil Fuels
type: BicsLevel7Segment
type: Classifier
type: NamedIndividual
is level7 segment of: Agriculture Freight - Rail
is contemporary version of: http://data.ga-group.nl/ics/bics/17111214111011
is version of: http://data.ga-group.nl/ics/bics/17111214111011
replaces: http://data.ga-group.nl/ics/bics/2020/17111214111011
imported on: 2026-06-08T13:40:52.236Z
last refreshed on: 2026-06-08T13:41:38.450Z
source accessed on: 2024-06-05T14:42:36Z
source last accessed on: 2024-06-05T14:42:36Z
label: Ferroviario agrícola - combustibles fósiles @es
label: Landwirtschaft Bahn - Fossile Brennstoffe @de
label: Transport ferroviaire agriculture - combustibles fossiles @fr
label: Transporte ferroviário produtos agrícolas - combustíveis fósseis @pt
label: Trasporto ferroviario agricolo - Combustibili fossili @it
label: Сельскохозяйственная железная дорога - ископаемое топливо @ru
label: 农产品铁路-化石燃料 @zh
label: 農業鐵路-化石燃料 @zh-hant
label: 農産物･肥料鉄道輸送-化石燃料 @ja
label: 농업 철도 - 화석 연료 @ko
definition: This segment includes companies that transport agricultural products via fossil fuel rail cars.
notation: 17111214111011
valid from: 2024-06-07

Agriculture Freight - Rail
type: BicsLevel6Segment
type: Classifier
type: NamedIndividual
is level6 segment of: Total Commodity - Rail
is contemporary version of: http://data.ga-group.nl/ics/bics/171112141110
is version of: http://data.ga-group.nl/ics/bics/171112141110
replaces: http://data.ga-group.nl/ics/bics/2020/171112141110
imported on: 2026-06-08T13:40:52.236Z
last refreshed on: 2026-06-08T13:41:38.450Z
source accessed on: 2024-06-05T14:42:36Z
source last accessed on: 2024-06-05T14:42:36Z
label: Carga prod agrícolas - Ferroviário @pt
label: Flete agrícola - ferroviaria @es
label: Frachterlös: LaWi - Bahn @de
label: Fret agricole - Rail @fr
label: Trasporto agricolo - Ferrovie @it
label: Перевозка сельскохоз. товаров-жел. дорога @ru
label: 农产品货运-铁路 @zh
label: 農業貨運-鐵路 @zh-hant
label: 農産物･肥料貨物輸送-鉄道 @ja
label: 농업 화물 -철도 @ko
definition: This segment includes companies that transport agricultural products by rail. Includes corn, wheat, soybeans, and food and beverage products.
notation: 171112141110
valid from: 2024-06-07

Auto Rail - Electric
type: BicsLevel7Segment
type: Classifier
type: NamedIndividual
is level7 segment of: Auto Freight - Rail
is contemporary version of: http://data.ga-group.nl/ics/bics/17111214111110
is version of: http://data.ga-group.nl/ics/bics/17111214111110
replaces: http://data.ga-group.nl/ics/bics/2020/17111214111110
imported on: 2026-06-08T13:40:52.236Z
last refreshed on: 2026-06-08T13:41:38.450Z
source accessed on: 2024-06-05T14:42:36Z
source last accessed on: 2024-06-05T14:42:36Z
label: Autos Bahn - Elektrisch @de
label: Ferroviario de autos - eléctrico @es
label: Transport ferroviaire automobile - électricité @fr
label: Transporte ferroviário automóveis - eletricidade @pt
label: Trasporto ferroviario auto - Elettrico @it
label: Ж/д перевозки автомобилей - на электричестве @ru
label: 汽車鐵路-電力 @zh-hant
label: 汽车铁路-电动 @zh
label: 自動車鉄道輸送-電気 @ja
label: 자동차 철도 - 전기 @ko
definition: This segment includes companies that transport automotive products via electric rail cars.
notation: 17111214111110
valid from: 2024-06-07

Auto Rail - Fossil Fuels
type: BicsLevel7Segment
type: Classifier
type: NamedIndividual
is level7 segment of: Auto Freight - Rail
is contemporary version of: http://data.ga-group.nl/ics/bics/17111214111111
is version of: http://data.ga-group.nl/ics/bics/17111214111111
replaces: http://data.ga-group.nl/ics/bics/2020/17111214111111
imported on: 2026-06-08T13:40:52.236Z
last refreshed on: 2026-06-08T13:41:38.450Z
source accessed on: 2024-06-05T14:42:36Z
source last accessed on: 2024-06-05T14:42:36Z
label: Autos Bahn - Fossile Brennstoffe @de
label: Ferroviario de autos - combustibles fósiles @es
label: Transport ferroviaire automobile - combustibles fossiles @fr
label: Transporte ferroviário automóveis - combustíveis fósseis @pt
label: Trasporto ferroviario auto - Combustibili fossili @it
label: Ж/д перевозки автомобилей - ископаемое топливо @ru
label: 汽車鐵路-化石燃料 @zh-hant
label: 汽车铁路-化石燃料 @zh
label: 自動車鉄道輸送-化石燃料 @ja
label: 자동차 철도 - 화석 연료 @ko
definition: This segment includes companies that transport automotive products via fossil fuel rail cars.
notation: 17111214111111
valid from: 2024-06-07

Auto Freight - Rail
type: BicsLevel6Segment
type: Classifier
type: NamedIndividual
is level6 segment of: Total Commodity - Rail
is contemporary version of: http://data.ga-group.nl/ics/bics/171112141111
is version of: http://data.ga-group.nl/ics/bics/171112141111
replaces: http://data.ga-group.nl/ics/bics/2020/171112141111
imported on: 2026-06-08T13:40:52.236Z
last refreshed on: 2026-06-08T13:41:38.450Z
source accessed on: 2024-06-05T14:42:36Z
source last accessed on: 2024-06-05T14:42:36Z
label: Carga de auto - Ferroviário @pt
label: Flete de auto - ferrocarril @es
label: Frachterlös Autos @de
label: Fret automobile - Rail @fr
label: Trasporto automobili - Ferrovie @it
label: Перевозка автомобилей-жел. дорога @ru
label: 汽車貨運-鐵路 @zh-hant
label: 汽车货运-铁路 @zh
label: 汽车货运-铁�� @zh
label: 自動車輸送-鉄道 @ja
label: 자동차 화물 - 철도 @ko
definition: This segment includes companies that transport automotive products by rail. Includes finished vehicles and automotive parts.
notation: 171112141111
valid from: 2024-06-07

Chemical Rail - Electric
type: BicsLevel7Segment
type: Classifier
type: NamedIndividual
is level7 segment of: Chemical Freight - Rail
is contemporary version of: http://data.ga-group.nl/ics/bics/17111214111210
is version of: http://data.ga-group.nl/ics/bics/17111214111210
replaces: http://data.ga-group.nl/ics/bics/2020/17111214111210
imported on: 2026-06-08T13:40:52.236Z
last refreshed on: 2026-06-08T13:41:38.450Z
source accessed on: 2024-06-05T14:42:36Z
source last accessed on: 2024-06-05T14:42:36Z
label: Chemikalien Bahn - Elektrisch @de
label: Ferroviario de productos químicos - eléctrico @es
label: Transport ferroviaire de produits chimiques - électricité @fr
label: Transporte ferroviário produtos químicos - eletricidade @pt
label: Trasporto prodotti chimici - Elettrico @it
label: Ж/д перевозки хим. веществ - на электричестве @ru
label: 化学品鉄道輸送-電気 @ja
label: 化学品铁路-电动 @zh
label: 化學品鐵路-電力 @zh-hant
label: 화학 철도 - 전기 @ko
definition: This segment includes companies that transport chemical products via electric rail cars.
notation: 17111214111210
valid from: 2024-06-07

Chemical Rail - Fossil Fuels
type: BicsLevel7Segment
type: Classifier
type: NamedIndividual
is level7 segment of: Chemical Freight - Rail
is contemporary version of: http://data.ga-group.nl/ics/bics/17111214111211
is version of: http://data.ga-group.nl/ics/bics/17111214111211
replaces: http://data.ga-group.nl/ics/bics/2020/17111214111211
imported on: 2026-06-08T13:40:52.236Z
last refreshed on: 2026-06-08T13:41:38.450Z
source accessed on: 2024-06-05T14:42:36Z
source last accessed on: 2024-06-05T14:42:36Z
label: Chemikalien Bahn - Fossile Brennstoffe @de
label: Ferroviario de productos químicos - combustibles fósiles @es
label: Transport ferroviaire de produits chimiques - combustibles fossiles @fr
label: Transporte ferroviário produtos químicos - combustíveis fósseis @pt
label: Trasporto prodotti chimici - Combustibili fossili @it
label: Ж/д перевозки хим. веществ - ископаемое топливо @ru
label: 化学品鉄道輸送-化石燃料 @ja
label: 化学品铁路-化石燃料 @zh
label: 化學品鐵路-化石燃料 @zh-hant
label: 화학 철도 - 화석 연료 @ko
definition: This segment includes companies that transport chemical products via fossil fuel rail cars.
notation: 17111214111211
valid from: 2024-06-07

Chemical Freight - Rail
type: BicsLevel6Segment
type: Classifier
type: NamedIndividual
is level6 segment of: Total Commodity - Rail
is contemporary version of: http://data.ga-group.nl/ics/bics/171112141112
is version of: http://data.ga-group.nl/ics/bics/171112141112
replaces: http://data.ga-group.nl/ics/bics/2020/171112141112
imported on: 2026-06-08T13:40:52.236Z
last refreshed on: 2026-06-08T13:41:38.450Z
source accessed on: 2024-06-05T14:42:36Z
source last accessed on: 2024-06-05T14:42:36Z
label: Carga prod químicos - Ferroviário @pt
label: Flete de sustancias químicas - ferrocarril @es
label: Frachterlös Chemie @de
label: Fret de produits chimiques - Rail @fr
label: Trasporto prod chimici - Ferrovie @it
label: Перевозка химикатов-жел. дорога @ru
label: 化学品货运-铁路 @zh
label: 化学品輸送-鉄道 @ja
label: 化學品貨運-鐵路 @zh-hant
label: 화학 화물 - 철도 @ko
definition: This segment includes companies that transport chemical products by rail.
notation: 171112141112
valid from: 2024-06-07

Coal Rail - Electric
type: BicsLevel7Segment
type: Classifier
type: NamedIndividual
is level7 segment of: Coal Freight - Rail
is contemporary version of: http://data.ga-group.nl/ics/bics/17111214111310
is version of: http://data.ga-group.nl/ics/bics/17111214111310
replaces: http://data.ga-group.nl/ics/bics/2020/17111214111310
imported on: 2026-06-08T13:40:52.236Z
last refreshed on: 2026-06-08T13:41:38.450Z
source accessed on: 2024-06-05T14:42:36Z
source last accessed on: 2024-06-05T14:42:36Z
label: Ferroviario de carbón - eléctrico @es
label: Kohle Bahn - Elektrisch @de
label: Transport ferroviaire de charbon - électricité @fr
label: Transporte ferroviário carvão - eletricidade @pt
label: Trasporto ferroviario di carbone - Elettrico @it
label: Ж/д перевозки угля - на электричестве @ru
label: 煤炭铁路-电动 @zh
label: 煤鐵路-電力 @zh-hant
label: 石炭鉄道輸送-電気 @ja
label: 石炭鉄道輸送-��気 @ja
label: 석탄 철도 - 전기 @ko
definition: This segment includes companies that transport coal and coke via electric rail cars.
notation: 17111214111310
valid from: 2024-06-07

Coal Rail - Fossil Fuels
type: BicsLevel7Segment
type: Classifier
type: NamedIndividual
is level7 segment of: Coal Freight - Rail
is contemporary version of: http://data.ga-group.nl/ics/bics/17111214111311
is version of: http://data.ga-group.nl/ics/bics/17111214111311
replaces: http://data.ga-group.nl/ics/bics/2020/17111214111311
imported on: 2026-06-08T13:40:52.236Z
last refreshed on: 2026-06-08T13:41:38.450Z
source accessed on: 2024-06-05T14:42:36Z
source last accessed on: 2024-06-05T14:42:36Z
label: Ferroviario de carbón - combustibles fósiles @es
label: Kohle Bahn - Fossile Brennstoffe @de
label: Transport ferroviaire de charbon - combustibles fossiles @fr
label: Transporte ferroviário carvão - combustíveis fósseis @pt
label: Trasporto ferroviario di carbone - Combustibili fossili @it
label: Ж/д перевозки угля - ископаемое топливо @ru
label: 煤炭铁路-化石燃料 @zh
label: 煤鐵路-化石燃料 @zh-hant
label: 石炭鉄道輸送-化石燃料 @ja
label: 석탄 철도 - 화석 연료 @ko
definition: This segment includes companies that transport coal and coke via fossil fuel rail cars.
notation: 17111214111311
valid from: 2024-06-07

Coal Freight - Rail
type: BicsLevel6Segment
type: Classifier
type: NamedIndividual
is level6 segment of: Total Commodity - Rail
is contemporary version of: http://data.ga-group.nl/ics/bics/171112141113
is version of: http://data.ga-group.nl/ics/bics/171112141113
replaces: http://data.ga-group.nl/ics/bics/2020/171112141113
imported on: 2026-06-08T13:40:52.236Z
last refreshed on: 2026-06-08T13:41:38.450Z
source accessed on: 2024-06-05T14:42:36Z
source last accessed on: 2024-06-05T14:42:36Z
label: Carga de carvão - Ferroviário @pt
label: Flete de carbón - ferrocarril @es
label: Frachterlös Kohle @de
label: Fret charbon - Rail @fr
label: Trasporto carbone - Ferrovie @it
label: Перевозка угля-жел. дорога @ru
label: 煤炭货运-铁路 @zh
label: 煤貨運-鐵路 @zh-hant
label: 石炭輸送-鉄道 @ja
label: 석탄 화물 - 철도 @ko
definition: This segment includes companies that transport coal and coke by rail.
notation: 171112141113
valid from: 2024-06-07

Consumer Prods Rail - Electric
type: BicsLevel7Segment
type: Classifier
type: NamedIndividual
is level7 segment of: Consumer Prods Freight - Rail
is contemporary version of: http://data.ga-group.nl/ics/bics/17111214111410
is version of: http://data.ga-group.nl/ics/bics/17111214111410
replaces: http://data.ga-group.nl/ics/bics/2020/17111214111410
imported on: 2026-06-08T13:40:52.236Z
last refreshed on: 2026-06-08T13:41:38.450Z
source accessed on: 2024-06-05T14:42:36Z
source last accessed on: 2024-06-05T14:42:36Z
label: Ferroviario de prods de consumo - eléctricos @es
label: Transport ferroviaire de prod de consommation - électricité @fr
label: Transporte ferroviário produtos de consumo - eletricidade @pt
label: Trasporto ferroviario prodotti di consumo - Elettrico @it
label: Verbraucherprod. Bahn - Elektrisch @de
label: Ж/д перевозки потребительских товаров - на электричестве @ru
label: 消費產品鐵路-電力 @zh-hant
label: 消費者製品鉄道輸送-電気 @ja
label: 消費���品鐵路-電力 @zh-hant
label: 消费品铁路-电动 @zh
label: 소비자제품 철도 - 전기 @ko
definition: This segment includes companies that transport consumer products via electric rail cars.
notation: 17111214111410
valid from: 2024-06-07

Consumer Prods Rail - Fossil Fuels
type: BicsLevel7Segment
type: Classifier
type: NamedIndividual
is level7 segment of: Consumer Prods Freight - Rail
is contemporary version of: http://data.ga-group.nl/ics/bics/17111214111411
is version of: http://data.ga-group.nl/ics/bics/17111214111411
replaces: http://data.ga-group.nl/ics/bics/2020/17111214111411
imported on: 2026-06-08T13:40:52.236Z
last refreshed on: 2026-06-08T13:41:38.450Z
source accessed on: 2024-06-05T14:42:36Z
source last accessed on: 2024-06-05T14:42:36Z
label: Ferroviario de prods de consumo - combustibles fósiles @es
label: Transport ferroviaire de prod de consommation - combustibles fossiles @fr
label: Transporte ferroviário produtos de consumo - combustíveis fósseis @pt
label: Trasporto ferroviario prodotti di consumo - Combustibili fossili @it
label: Verbraucherprod. Bahn - Fossile Brennstoffe @de
label: Ж/д перевозки потребительских товаров - ископаемое топливо @ru
label: 消費產品鐵路-化石燃料 @zh-hant
label: 消費者製品鉄道輸送-化石燃料 @ja
label: 消费品铁路-化石燃料 @zh
label: 소비자제품 철도 - 화석 연료 @ko
definition: This segment includes companies that transport consumer products via fossil fuel rail cars.
notation: 17111214111411
valid from: 2024-06-07

Consumer Prods Freight - Rail
type: BicsLevel6Segment
type: Classifier
type: NamedIndividual
is level6 segment of: Total Commodity - Rail
is contemporary version of: http://data.ga-group.nl/ics/bics/171112141114
is version of: http://data.ga-group.nl/ics/bics/171112141114
replaces: http://data.ga-group.nl/ics/bics/2020/171112141114
imported on: 2026-06-08T13:40:52.236Z
last refreshed on: 2026-06-08T13:41:38.450Z
source accessed on: 2024-06-05T14:42:36Z
source last accessed on: 2024-06-05T14:42:36Z
label: Carga prod consumo - Ferroviário @pt
label: Flete productos de consumidor - ferroviaria @es
label: Frachterlös: Verbr.prod.- Bahn @de
label: Fred prod conso - Rail @fr
label: Trasporto prod consumo - Ferrovie @it
label: Перевозка потребит. товаров-жел. дорога @ru
label: 消費者產品貨運-鐵路 @zh-hant
label: 消費者製品貨物輸送-鉄道 @ja
label: 消费品货运-铁路 @zh
label: 소비자제품 화물-철도 @ko
definition: This segment includes companies that transport consumer products by rail.
notation: 171112141114
valid from: 2024-06-07

Forest Prods Rail - Electric
type: BicsLevel7Segment
type: Classifier
type: NamedIndividual
is level7 segment of: Forest Products Freight - Rail
is contemporary version of: http://data.ga-group.nl/ics/bics/17111214111510
is version of: http://data.ga-group.nl/ics/bics/17111214111510
replaces: http://data.ga-group.nl/ics/bics/2020/17111214111510
imported on: 2026-06-08T13:40:52.236Z
last refreshed on: 2026-06-08T13:41:38.450Z
source accessed on: 2024-06-05T14:42:36Z
source last accessed on: 2024-06-05T14:42:36Z
label: Ferroviario de prods forestales - eléctricos @es
label: Forsterz. Bahn - Elektrisch @de
label: Transport ferroviaire de prod forestiers - électricité @fr
label: Transporte ferroviário produtos florestais - eletricidade @pt
label: Trasporto ferroviario prod forestali - Elettrico @it
label: Ж/д перевозки лесных товаров - на электричестве @ru
label: 林业产品铁路-电动 @zh
label: 林業產品鐵路-電力 @zh-hant
label: 林産物製品鉄道輸送-電気 @ja
label: 임산품 철도 - 전기 @ko
definition: This segment includes companies that transport forest and paper products via electric rail cars.
notation: 17111214111510
valid from: 2024-06-07

Forest Prods Rail - Fossil Fuels
type: BicsLevel7Segment
type: Classifier
type: NamedIndividual
is level7 segment of: Forest Products Freight - Rail
is contemporary version of: http://data.ga-group.nl/ics/bics/17111214111511
is version of: http://data.ga-group.nl/ics/bics/17111214111511
replaces: http://data.ga-group.nl/ics/bics/2020/17111214111511
imported on: 2026-06-08T13:40:52.236Z
last refreshed on: 2026-06-08T13:41:38.450Z
source accessed on: 2024-06-05T14:42:36Z
source last accessed on: 2024-06-05T14:42:36Z
label: Ferroviario de prods forestales - combustibles fósiles @es
label: Forsterz. Bahn - Fossile Brennstoffe @de
label: Transport ferroviaire de prod forestiers - combustibles fossiles @fr
label: Transporte ferroviário produtos de florestais - combustíveis fósseis @pt
label: Trasporto ferroviario prod forestali - Combustibili fossili @it
label: Ж/д перевозки лесных товаров - ископаемое топливо @ru
label: 林业产品铁路-化石燃料 @zh
label: 林業產品鐵路-化石燃料 @zh-hant
label: 林産物製品鉄道輸送-化石燃料 @ja
label: 임산품 철도 - 화석 연료 @ko
definition: This segment includes companies that transport forest and paper products via fossil fuel rail cars.
notation: 17111214111511
valid from: 2024-06-07

Forest Products Freight - Rail
type: BicsLevel6Segment
type: Classifier
type: NamedIndividual
is level6 segment of: Total Commodity - Rail
is contemporary version of: http://data.ga-group.nl/ics/bics/171112141115
is version of: http://data.ga-group.nl/ics/bics/171112141115
replaces: http://data.ga-group.nl/ics/bics/2020/171112141115
imported on: 2026-06-08T13:40:52.236Z
last refreshed on: 2026-06-08T13:41:38.450Z
source accessed on: 2024-06-05T14:42:36Z
source last accessed on: 2024-06-05T14:42:36Z
label: Carga prod florestais - Ferroviário @pt
label: Flete de productos forestales - ferroviaria @es
label: Frachterlös: Waldprod. - Bahn @de
label: Fret produits forestiers - Rail @fr
label: Trasporto prod selvicoltura - Ferrovie @it
label: Перевозка лесопр.-жел. дорога @ru
label: 林业产品货运-铁路 @zh
label: 林木產品貨運-鐵路 @zh-hant
label: 林産物貨物輸送-鉄道 @ja
label: 임산물 화물-철도 @ko
definition: This segment includes companies that transport forest and paper products by rail.
notation: 171112141115
valid from: 2024-06-07

Industrial Prods Rail - Electric
type: BicsLevel7Segment
type: Classifier
type: NamedIndividual
is level7 segment of: Industrial Prods Freight - Rail
is contemporary version of: http://data.ga-group.nl/ics/bics/17111214111610
is version of: http://data.ga-group.nl/ics/bics/17111214111610
replaces: http://data.ga-group.nl/ics/bics/2020/17111214111610
imported on: 2026-06-08T13:40:52.236Z
last refreshed on: 2026-06-08T13:41:38.450Z
source accessed on: 2024-06-05T14:42:36Z
source last accessed on: 2024-06-05T14:42:36Z
label: Ferroviario de prods industriales - eléctricos @es
label: Industrieprod. Bahn - Elektrisch @de
label: Transport ferroviaire de prod industriels - électricité @fr
label: Transporte ferroviário produtos industriais - eletricidade @pt
label: Trasporto ferroviario prod industriali - Elettrico @it
label: Ж/д перевозки промышл. товаров - на электричестве @ru
label: 工业产品铁路-电动 @zh
label: 工業產品鐵路-電力 @zh-hant
label: 工業製品鉄道輸送-電気 @ja
label: 산업제품 철도- 전기 @ko
definition: This segment includes companies that transport industrial products via electric rail cars.
notation: 17111214111610
valid from: 2024-06-07

Industrial Prods Rail - Fossil Fuels
type: BicsLevel7Segment
type: Classifier
type: NamedIndividual
is level7 segment of: Industrial Prods Freight - Rail
is contemporary version of: http://data.ga-group.nl/ics/bics/17111214111611
is version of: http://data.ga-group.nl/ics/bics/17111214111611
replaces: http://data.ga-group.nl/ics/bics/2020/17111214111611
imported on: 2026-06-08T13:40:52.236Z
last refreshed on: 2026-06-08T13:41:38.450Z
source accessed on: 2024-06-05T14:42:36Z
source last accessed on: 2024-06-05T14:42:36Z
label: Ferroviario de prods industriales - combustibles fósiles @es
label: Industrieprod. Bahn - Fossile Brennstoffe @de
label: Transport ferroviaire de prod industriels - combustibles fossiles @fr
label: Transporte ferroviário produtos industriais combustíveis fósseis @pt
label: Trasporto ferroviario prod industriali - Combustibili fossili @it
label: Ж/д перевозки промышленных товаров - ископаемое топливо @ru
label: 工业产品铁路-化石燃料 @zh
label: 工業產品鐵路-化石燃料 @zh-hant
label: 工業製品鉄道輸送-化石燃料 @ja
label: 산업제품 철도 - 화석 연료 @ko
definition: This segment includes companies that transport industrial products via fossil fuel rail cars.
notation: 17111214111611
valid from: 2024-06-07

Industrial Prods Freight - Rail
type: BicsLevel6Segment
type: Classifier
type: NamedIndividual
is level6 segment of: Total Commodity - Rail
is contemporary version of: http://data.ga-group.nl/ics/bics/171112141116
is version of: http://data.ga-group.nl/ics/bics/171112141116
replaces: http://data.ga-group.nl/ics/bics/2020/171112141116
imported on: 2026-06-08T13:40:52.236Z
last refreshed on: 2026-06-08T13:41:38.450Z
source accessed on: 2024-06-05T14:42:36Z
source last accessed on: 2024-06-05T14:42:36Z
label: Carga prod industriais - Ferroviário @pt
label: Flete de productos industriales - ferroviaria @es
label: Frachterlös: Ind.prod. - Bahn @de
label: Fret produits industriels - Rail @fr
label: Trasporto prod industriali - Ferrovie @it
label: Перевозка промышл. товаров-жел. дорога @ru
label: 工业产品货运-铁路 @zh
label: 工業產品貨運-鐵路 @zh-hant
label: 工業製品貨物輸送-鉄道 @ja
label: 산업제품 화물-철도 @ko
label: 산업제품 ��물-철도 @ko
definition: This segment includes companies that transport industrial products by rail.
notation: 171112141116
valid from: 2024-06-07

Metal Rail - Electric
type: BicsLevel7Segment
type: Classifier
type: NamedIndividual
is level7 segment of: Metallic Ores & Metals - Rail
is contemporary version of: http://data.ga-group.nl/ics/bics/17111214111710
is version of: http://data.ga-group.nl/ics/bics/17111214111710
replaces: http://data.ga-group.nl/ics/bics/2020/17111214111710
imported on: 2026-06-08T13:40:52.236Z
last refreshed on: 2026-06-08T13:41:38.450Z
source accessed on: 2024-06-05T14:42:36Z
source last accessed on: 2024-06-05T14:42:36Z
label: Ferroviario metales - eléctrico @es
label: Metall Bahn - Elektrisch @de
label: Transport ferroviaire de minerais métalliques - électricité @fr
label: Transporte ferroviário metal - eletricidade @pt
label: Trasporto ferroviario di metalli - Elettrico @it
label: Ж/д перевозки металлов - на электрич. @ru
label: Ж/д перевозки металлов - на электр��ч. @ru
label: 金属鉄道輸送-電気 @ja
label: 金属铁路-电动 @zh
label: 金屬鐵路-電力 @zh-hant
label: 금속 철도 - 전기 @ko
definition: This segment includes companies that transport metal products via electric rail cars.
notation: 17111214111710
valid from: 2024-06-07

Metal Rail - Fossil Fuels
type: BicsLevel7Segment
type: Classifier
type: NamedIndividual
is level7 segment of: Metallic Ores & Metals - Rail
is contemporary version of: http://data.ga-group.nl/ics/bics/17111214111711
is version of: http://data.ga-group.nl/ics/bics/17111214111711
replaces: http://data.ga-group.nl/ics/bics/2020/17111214111711
imported on: 2026-06-08T13:40:52.236Z
last refreshed on: 2026-06-08T13:41:38.450Z
source accessed on: 2024-06-05T14:42:36Z
source last accessed on: 2024-06-05T14:42:36Z
label: Ferroviario metales - combustibles fósiles @es
label: Metall Bahn - Fossile Brennstoffe @de
label: Transport ferroviaire de minerais métalliques - combustibles fossiles @fr
label: Transporte ferroviário metal - combustíveis fósseis @pt
label: Trasporto ferroviario di metalli - Combustibili fossili @it
label: Ж/д перевозки металлов - ископаемое топливо @ru
label: 金属鉄道輸送-化石燃料 @ja
label: 金属铁路-化石燃料 @zh
label: 金屬鐵路-化石燃料 @zh-hant
label: 금속 철도 - 화석 연료 @ko
definition: This segment includes companies that transport metal products via fossil fuel rail cars.
notation: 17111214111711
valid from: 2024-06-07

Metallic Ores & Metals - Rail
type: BicsLevel6Segment
type: Classifier
type: NamedIndividual
is level6 segment of: Total Commodity - Rail
is contemporary version of: http://data.ga-group.nl/ics/bics/171112141117
is version of: http://data.ga-group.nl/ics/bics/171112141117
replaces: http://data.ga-group.nl/ics/bics/2020/171112141117
imported on: 2026-06-08T13:40:52.236Z
last refreshed on: 2026-06-08T13:41:38.450Z
source accessed on: 2024-06-05T14:42:36Z
source last accessed on: 2024-06-05T14:42:36Z
label: Metallerze und Metalle @de
label: Minérios metálicos e metais - Ferroviário @pt
label: Minerais métalliques et métaux - Rail @fr
label: Minerales y metales-ferrov @es
label: Minerali di ferro e metalli - Ferrovie @it
label: Метал. руды и металлы-жел. дорога @ru
label: 金属矿石与金属-铁路 @zh
label: 金属鉱石･金属輸送-鉄道 @ja
label: 金屬礦及金屬-鐵路 @zh-hant
label: 금속원광 & 금속-철도 @ko
definition: This segment includes companies that transport metal products by rail. Includes steel, copper, minerals, and other metal products.
notation: 171112141117
valid from: 2024-06-07

Non-Metal Rail - Electric
type: BicsLevel7Segment
type: Classifier
type: NamedIndividual
is level7 segment of: Non-Metal Minerals - Rail
is contemporary version of: http://data.ga-group.nl/ics/bics/17111214111810
is version of: http://data.ga-group.nl/ics/bics/17111214111810
replaces: http://data.ga-group.nl/ics/bics/2020/17111214111810
imported on: 2026-06-08T13:40:52.236Z
last refreshed on: 2026-06-08T13:41:38.450Z
source accessed on: 2024-06-05T14:42:36Z
source last accessed on: 2024-06-05T14:42:36Z
label: Ferroviario no metales - eléctrico @es
label: Nichtmetall Bahn - Elektrisch @de
label: Transport ferroviaire de minerais non métalliques - électricité @fr
label: Transporte ferroviário excl metal - eletricidade @pt
label: Trasporto ferroviario non metalli- Elettrica @it
label: Ж/д перевозки неметал. минералов - электрич @ru
label: 非金属鉄道輸送-電気 @ja
label: 非金属铁路-电动 @zh
label: 非金屬鐵路-電力 @zh-hant
label: 비금속 철도 - 전기 @ko
definition: This segment includes companies that transport non-metallic minerals and products via electric rail cars.
notation: 17111214111810
valid from: 2024-06-07

Non-Metal Rail - Fossil Fuels
type: BicsLevel7Segment
type: Classifier
type: NamedIndividual
is level7 segment of: Non-Metal Minerals - Rail
is contemporary version of: http://data.ga-group.nl/ics/bics/17111214111811
is version of: http://data.ga-group.nl/ics/bics/17111214111811
replaces: http://data.ga-group.nl/ics/bics/2020/17111214111811
imported on: 2026-06-08T13:40:52.236Z
last refreshed on: 2026-06-08T13:41:38.450Z
source accessed on: 2024-06-05T14:42:36Z
source last accessed on: 2024-06-05T14:42:36Z
label: Ferroviario no metales - combustibles fósiles @es
label: Nichtmetall Bahn - Fossile Brennstoffe @de
label: Transport ferroviaire de minerais non métalliques - combustibles fossiles @fr
label: Transporte ferroviário excl metal - combustíveis fósseis @pt
label: Trasporto ferroviario non metalli - Combustibili fossili @it
label: Ж/д перевозки неметал. минералов - топливо @ru
label: 非金属鉄道輸送-化石燃料 @ja
label: 非金属铁路-化石燃料 @zh
label: 非金屬鐵路-化石燃料 @zh-hant
label: 비금속 철도 - 화석 연료 @ko
definition: This segment includes companies that transport non-metallic minerals and products via fossil fuel rail cars.
notation: 17111214111811
valid from: 2024-06-07

Non-Metal Minerals - Rail
type: BicsLevel6Segment
type: Classifier
type: NamedIndividual
is level6 segment of: Total Commodity - Rail
is contemporary version of: http://data.ga-group.nl/ics/bics/171112141118
is version of: http://data.ga-group.nl/ics/bics/171112141118
replaces: http://data.ga-group.nl/ics/bics/2020/171112141118
imported on: 2026-06-08T13:40:52.236Z
last refreshed on: 2026-06-08T13:41:38.450Z
source accessed on: 2024-06-05T14:42:36Z
source last accessed on: 2024-06-05T14:42:36Z
label: Minéraux non métalliques - Rail @fr
label: Minerais não metálicos - Ferroviário @pt
label: Minerales no metálicos-ferrocarril @es
label: Minerali non di ferro - Ferrovie @it
label: Nichtmetallische Mineralien & Produkte @de
label: Неметал. минералы и продукция-жел. дорога @ru
label: 非金属矿物-铁路 @zh
label: 非金屬礦物-鐵路 @zh-hant
label: 非鉄鉱物･製品輸送-鉄道 @ja
label: 비금속 광물-철도 @ko
definition: This segment includes companies that transport non-metallic minerals and products by rail. Includes crushed stone, sand, gravel, clay, glass, cement, and limestone.
notation: 171112141118
valid from: 2024-06-07

Total Commodity - Rail
type: BicsLevel5Segment
type: Classifier
type: NamedIndividual
is level5 segment of: Rail Freight
is contemporary version of: http://data.ga-group.nl/ics/bics/1711121411
is version of: http://data.ga-group.nl/ics/bics/1711121411
replaces: http://data.ga-group.nl/ics/bics/2020/1711121411
imported on: 2026-06-08T13:40:52.236Z
last refreshed on: 2026-06-08T13:41:38.450Z
source accessed on: 2024-06-05T14:42:36Z
source last accessed on: 2024-06-05T14:42:36Z
label: Commodity totali - Ferrovie @it
label: Ges. Rohstofflinien @de
label: Total de commodities - Ferroviário @pt
label: Total de materias primas - ferrocarril @es
label: Toutes les matières premières - Voies ferrées @fr
label: Всего сырьевые товары-жел. дорога @ru
label: 商品总计-铁路 @zh
label: 商品輸送合計-鉄道 @ja
label: 總商品-鐵路 @zh-hant
label: 총 상품 - 철도 @ko
definition: This segment includes companies that transport commodities by rail. Includes agricultural and fertilizer products, automotive products, chemical products, coal and coke, consumer products, forest products, industrial products, metallic ores and metal products, and non-metallic minerals.
notation: 1711121411
valid from: 2024-06-07

Rail Freight
type: BicsLevel4SubIndustry
type: Classifier
type: NamedIndividual
is sub industry of: Transportation & Logistics
is contemporary version of: http://data.ga-group.nl/ics/bics/17111214
is version of: http://data.ga-group.nl/ics/bics/17111214
replaces: http://data.ga-group.nl/ics/bics/2020/17111214
imported on: 2026-06-08T13:40:52.236Z
last refreshed on: 2026-06-08T13:41:38.450Z
source accessed on: 2024-06-05T14:42:36Z
source last accessed on: 2024-06-05T14:42:36Z
label: Bahnfrachttransport @de
label: Flete ferroviario @es
label: Fret ferroviaire @fr
label: Transp frete férrea @pt
label: Trasporto ferroviario @it
label: Железнодорожные перевозки @ru
label: 鉄道貨物輸送 @ja
label: 鐵路貨運 @zh-hant
label: 铁路货运 @zh
label: 철도 화물운송 @ko
definition: This industry subgroup includes companies that provide railroad freight transportation services. Such services are provided over a long distance within a rail network. This does not include rail passenger transportation (see Transit Services).
notation: 17111214
valid from: 2024-06-07

LTL Freight - Electric
type: BicsLevel7Segment
type: Classifier
type: NamedIndividual
is level7 segment of: Less Than Truckload Freight
is contemporary version of: http://data.ga-group.nl/ics/bics/17111215101010
is version of: http://data.ga-group.nl/ics/bics/17111215101010
replaces: http://data.ga-group.nl/ics/bics/2020/17111215101010
imported on: 2026-06-08T13:40:52.236Z
last refreshed on: 2026-06-08T13:41:38.450Z
source accessed on: 2024-06-05T14:42:36Z
source last accessed on: 2024-06-05T14:42:36Z
label: Cargo LTL - Elettrico @it
label: Flete LTL - eléctrico @es
label: Fret LTL - électricité @fr
label: Frete de LTL - eletricidade @pt
label: LTL 화물 - 전기 @ko
label: LTL-Fracht - Elektrisch @de
label: Малотоннажные перевозки - на электрич. @ru
label: 小口ﾄﾗｯｸ貨物輸送-電気 @ja
label: 零担货运-电力 @zh
label: 零擔貨運-電力 @zh-hant
definition: This segment includes companies that provide less-than-truckload trucking services via electric commercial vehicles.
notation: 17111215101010
valid from: 2024-06-07

LTL Freight - Fossil Fuels
type: BicsLevel7Segment
type: Classifier
type: NamedIndividual
is level7 segment of: Less Than Truckload Freight
is contemporary version of: http://data.ga-group.nl/ics/bics/17111215101011
is version of: http://data.ga-group.nl/ics/bics/17111215101011
replaces: http://data.ga-group.nl/ics/bics/2020/17111215101011
imported on: 2026-06-08T13:40:52.236Z
last refreshed on: 2026-06-08T13:41:38.450Z
source accessed on: 2024-06-05T14:42:36Z
source last accessed on: 2024-06-05T14:42:36Z
label: Cargo LTL -Combustibili fossili @it
label: Flete LTL - combustibles fósiles @es
label: Fret LTL - combustibles fossiles @fr
label: Frete de LTL - combustíveis fósseis @pt
label: LTL 화물 - 화석 연료 @ko
label: LTL-Fracht - Fossile Brennstoffe @de
label: Малотоннажные перевозки - ископаемое топливо @ru
label: Малотоннажные пер��возки - ископаемое топливо @ru
label: 小口ﾄﾗｯｸ貨物輸送-化石燃料 @ja
label: 零担货运-化石燃料 @zh
label: 零擔貨運-化石燃料 @zh-hant
definition: This segment includes companies that provide less-than-truckload trucking services via fossil fuel commercial vehicles.
notation: 17111215101011
valid from: 2024-06-07

Less Than Truckload Freight
type: BicsLevel6Segment
type: Classifier
type: NamedIndividual
is level6 segment of: Asset-Based LTL
is contemporary version of: http://data.ga-group.nl/ics/bics/171112151010
is version of: http://data.ga-group.nl/ics/bics/171112151010
replaces: http://data.ga-group.nl/ics/bics/2020/171112151010
imported on: 2026-06-08T13:40:52.236Z
last refreshed on: 2026-06-08T13:41:38.450Z
source accessed on: 2024-06-05T14:42:36Z
source last accessed on: 2024-06-05T14:42:36Z
label: Autotrasporto carico non pieno @it
label: Carga LTL @pt
label: Fletamiento menor que el de camión @es
label: Fracht - Geringer als Lkw-Ladung @de
label: Fret chargement partiel @fr
label: Малотоннажные грузоперевозки @ru
label: 零担货运 @zh
label: 零擔貨運運輸 @zh-hant
label: 차급미만 화물 @ko
label: ﾄﾗｯｸ輸送(混載) @ja
label: ﾄﾗｯｸ輸送(���載) @ja
definition: This segment includes companies that generate freight revenue from less-than-truckload trucking services.
notation: 171112151010
valid from: 2024-06-07

LTL Fuel Surcharge
type: BicsLevel6Segment
type: Classifier
type: NamedIndividual
is level6 segment of: Asset-Based LTL
is contemporary version of: http://data.ga-group.nl/ics/bics/171112151011
is version of: http://data.ga-group.nl/ics/bics/171112151011
replaces: http://data.ga-group.nl/ics/bics/2020/171112151011
imported on: 2026-06-08T13:40:52.236Z
last refreshed on: 2026-06-08T13:41:38.450Z
source accessed on: 2024-06-05T14:42:36Z
source last accessed on: 2024-06-05T14:42:36Z
label: LTL 연료과잉 @ko
label: LTL-Benzinaufpreis @de
label: LTL燃料附加費 @zh-hant
label: LTL燃料附加费 @zh
label: Sobretaxa de combustível LTL @pt
label: Sovraccarico carb carico non pieno @it
label: Subtarifa de carburante LTL @es
label: Surcharge de carbur chargt partiel @fr
label: Топливная надбавка (LTL) @ru
label: 小口ﾄﾗｯｸ輸送燃料ｻｰﾁｬｰｼﾞ @ja
definition: This segment includes companies that generate fuel surcharge revenue from less-than-truckload (LTL) trucking services.
notation: 171112151011
valid from: 2024-06-07

Asset-Based LTL
type: BicsLevel5Segment
type: Classifier
type: NamedIndividual
is level5 segment of: Trucking
is contemporary version of: http://data.ga-group.nl/ics/bics/1711121510
is version of: http://data.ga-group.nl/ics/bics/1711121510
replaces: http://data.ga-group.nl/ics/bics/2020/1711121510
imported on: 2026-06-08T13:40:52.236Z
last refreshed on: 2026-06-08T13:41:38.450Z
source accessed on: 2024-06-05T14:42:36Z
source last accessed on: 2024-06-05T14:42:36Z
label: Asset-basiert kleiner als Lkw-Ladung @de
label: LTL com base em ativo @pt
label: LTL por activo @es
label: LTL su base attivi @it
label: Moins que charg compl, sur actif @fr
label: Малотон. грузопер. СМБ @ru
label: 資產基礎-零擔貨運 @zh-hant
label: 资产基础零担货运 @zh
label: 자산형 LTL @ko
label: ｱｾｯﾄﾍﾞｰｽ型ﾄﾗｯｸ輸送(混載) @ja
definition: This segment includes companies that provide less-than-truckload (LTL) trucking services. LTL carriers typically pick up multiple shipments from multiple customers on a single truck and then route that freight for delivery through service centers where the freight may be transferred to other trucks with similar destinations.
notation: 1711121510
valid from: 2024-06-07

Truckload Freight - Electric
type: BicsLevel7Segment
type: Classifier
type: NamedIndividual
is level7 segment of: Truckload Freight
is contemporary version of: http://data.ga-group.nl/ics/bics/17111215111010
is version of: http://data.ga-group.nl/ics/bics/17111215111010
replaces: http://data.ga-group.nl/ics/bics/2020/17111215111010
imported on: 2026-06-08T13:40:52.236Z
last refreshed on: 2026-06-08T13:41:38.450Z
source accessed on: 2024-06-05T14:42:36Z
source last accessed on: 2024-06-05T14:42:36Z
label: Autotrasporto a carico pieno - Elettrico @it
label: Flete de carga de un camión - eléctrico @es
label: Fret à chargement complet - électricité @fr
label: Frete de caminhão - eletricidade @pt
label: Lkw-Ladung - Elektrisch @de
label: Грузовые перевозки - на электричестве @ru
label: 整車貨運運輸-電力 @zh-hant
label: 整车货运-电动 @zh
label: 트럭적재 화물 - 전기 @ko
label: ﾄﾗｯｸ貨物輸送-電気 @ja
definition: This segment includes companies that provide truckload trucking services via electric commercial vehicles.
notation: 17111215111010
valid from: 2024-06-07

Truckload Freight - Fossil Fuels
type: BicsLevel7Segment
type: Classifier
type: NamedIndividual
is level7 segment of: Truckload Freight
is contemporary version of: http://data.ga-group.nl/ics/bics/17111215111011
is version of: http://data.ga-group.nl/ics/bics/17111215111011
replaces: http://data.ga-group.nl/ics/bics/2020/17111215111011
imported on: 2026-06-08T13:40:52.236Z
last refreshed on: 2026-06-08T13:41:38.450Z
source accessed on: 2024-06-05T14:42:36Z
source last accessed on: 2024-06-05T14:42:36Z
label: Autotrasporto a carico pieno - A combustibili fossili @it
label: Flete de carga de camión - combustibles fósiles @es
label: Fret à chargement complet - combustibles fossiles @fr
label: Frete de caminhão - combustíveis fósseis @pt
label: Lkw-Ladung - Fossile Brennstoffe @de
label: Грузовые перевозки - ископаемое топливо @ru
label: Гр��зовые перевозки - ископаемое топливо @ru
label: 整車貨運運輸-化石燃料 @zh-hant
label: 整车货运-化石燃料 @zh
label: 트럭적재 화물 - 화석 연료 @ko
label: ﾄﾗｯｸ貨物輸送-化石燃料 @ja
definition: This segment includes companies that provide truckload trucking services via fossil fuel commercial vehicles.
notation: 17111215111011
valid from: 2024-06-07

Truckload Freight
type: BicsLevel6Segment
type: Classifier
type: NamedIndividual
is level6 segment of: Asset-Based Truckload
is contemporary version of: http://data.ga-group.nl/ics/bics/171112151110
is version of: http://data.ga-group.nl/ics/bics/171112151110
replaces: http://data.ga-group.nl/ics/bics/2020/171112151110
imported on: 2026-06-08T13:40:52.236Z
last refreshed on: 2026-06-08T13:41:38.450Z
source accessed on: 2024-06-05T14:42:36Z
source last accessed on: 2024-06-05T14:42:36Z
label: Autotrasporto carico pieno @it
label: Carga de caminhão @pt
label: Flete de carga de un camión @es
label: Fracht - Lkw-Ladung @de
label: Fret chargement complet @fr
label: Транзитная норма - груз @ru
label: 整車貨運運輸 @zh-hant
label: 整车货运 @zh
label: 트럭적재 화물 @ko
label: ﾄﾗｯｸ貨物輸送 @ja
definition: This segment includes companies that generate revenue from truckload trucking services.
notation: 171112151110
valid from: 2024-06-07

Truckload Fuel
type: BicsLevel6Segment
type: Classifier
type: NamedIndividual
is level6 segment of: Asset-Based Truckload
is contemporary version of: http://data.ga-group.nl/ics/bics/171112151111
is version of: http://data.ga-group.nl/ics/bics/171112151111
replaces: http://data.ga-group.nl/ics/bics/2020/171112151111
imported on: 2026-06-08T13:40:52.236Z
last refreshed on: 2026-06-08T13:41:38.450Z
source accessed on: 2024-06-05T14:42:36Z
source last accessed on: 2024-06-05T14:42:36Z
label: Benzin - Lkw-Ladung @de
label: Carburant chargement complet @fr
label: Carburante carico pieno @it
label: Carburante de carga de un camión @es
label: Combustível da carga de caminhão @pt
label: Транзитная норма - топливо @ru
label: 整車貨運燃料 @zh-hant
label: 整车燃料 @zh
label: 트럭적재 연료 @ko
label: ﾄﾗｯｸ貨物輸送燃料ｻｰﾁｬｰｼﾞ @ja
definition: This segment includes companies that generate fuel surcharge revenue from truckload trucking services.
notation: 171112151111
valid from: 2024-06-07

Asset-Based Truckload
type: BicsLevel5Segment
type: Classifier
type: NamedIndividual
is level5 segment of: Trucking
is contemporary version of: http://data.ga-group.nl/ics/bics/1711121511
is version of: http://data.ga-group.nl/ics/bics/1711121511
replaces: http://data.ga-group.nl/ics/bics/2020/1711121511
imported on: 2026-06-08T13:40:52.236Z
last refreshed on: 2026-06-08T13:41:38.450Z
source accessed on: 2024-06-05T14:42:36Z
source last accessed on: 2024-06-05T14:42:36Z
label: Anlagengestützte Lkw-Ladung @de
label: Attivi-Autotrasporto @it
label: Caminhões com base no ativo @pt
label: Carga de camión por activo @es
label: Chargement complet basé sur actif @fr
label: Перевозки 'Asset-Based' @ru
label: 資產基礎-整車貨運 @zh-hant
label: 资产基础整车货运 @zh
label: 자산형 트럭적재 @ko
label: ｱｾｯﾄﾍﾞｰｽ型ﾄﾗｯｸ貨物輸送 @ja
definition: This segment includes companies that provide truckload trucking services, including delivery of products from only one shipper to the consignee.
notation: 1711121511
valid from: 2024-06-07

Moving Services
type: BicsLevel5Segment
type: Classifier
type: NamedIndividual
is level5 segment of: Trucking
is contemporary version of: http://data.ga-group.nl/ics/bics/1711121512
is version of: http://data.ga-group.nl/ics/bics/1711121512
replaces: http://data.ga-group.nl/ics/bics/2020/1711121512
imported on: 2026-06-08T13:40:52.236Z
last refreshed on: 2026-06-08T13:41:38.450Z
source accessed on: 2024-06-05T14:42:36Z
source last accessed on: 2024-06-05T14:42:36Z
label: Mudanzas @es
label: Serv de mudança @pt
label: Service déménagement @fr
label: Servizi di trasloco @it
label: Umzugsdienste @de
label: Услуги по переезду @ru
label: 引越ｻｰﾋﾞｽ @ja
label: 搬家服务 @zh
label: 運輸服務 @zh-hant
label: 이사업 서비스 @ko
definition: This segment includes companies that provide moving services, such as moving household and office furniture and equipment.
notation: 1711121512
valid from: 2024-06-07

Specialized Freight Trucking Svcs
type: BicsLevel5Segment
type: Classifier
type: NamedIndividual
is level5 segment of: Trucking
is contemporary version of: http://data.ga-group.nl/ics/bics/1711121513
is version of: http://data.ga-group.nl/ics/bics/1711121513
replaces: http://data.ga-group.nl/ics/bics/2020/1711121513
imported on: 2026-06-08T13:40:52.236Z
last refreshed on: 2026-06-08T13:41:38.450Z
source accessed on: 2024-06-05T14:42:36Z
source last accessed on: 2024-06-05T14:42:36Z
label: LKW-Spezialfrachtdienste @de
label: Serv autotrasporto carico specializzato @it
label: Serv caminhão de carga especializada @pt
label: Serv transp spéc fret @fr
label: Servicio especializado de flete de camión @es
label: Специализированные автоперевозки @ru
label: 特殊貨物卡車服務 @zh-hant
label: 特殊貨物ﾄﾗｯｸ輸送ｻｰﾋﾞｽ @ja
label: 特殊货物卡车服务 @zh
label: 전문화물트럭운송업 @ko
definition: This segment includes companies that provide specialized freight trucking services, such as transporting bulk commodities and automobiles, as well as dedicated trucking services.
notation: 1711121513
valid from: 2024-06-07

Trucking
type: BicsLevel4SubIndustry
type: Classifier
type: NamedIndividual
is sub industry of: Transportation & Logistics
is contemporary version of: http://data.ga-group.nl/ics/bics/17111215
is version of: http://data.ga-group.nl/ics/bics/17111215
replaces: http://data.ga-group.nl/ics/bics/2020/17111215
imported on: 2026-06-08T13:40:52.236Z
last refreshed on: 2026-06-08T13:41:38.450Z
source accessed on: 2024-06-05T14:42:36Z
source last accessed on: 2024-06-05T14:42:36Z
label: Camiones @es
label: Transport routier @fr
label: Transportdienste @de
label: Transporte rodoviário @pt
label: Trasporto autocarri @it
label: Грузоперевозки @ru
label: 卡車運輸 @zh-hant
label: 卡车 @zh
label: 트럭운송 @ko
label: ﾄﾗｯｸ輸送 @ja
definition: This industry subgroup includes companies that provide trucking services. Includes truckload freight, less-than-truckload freight delivery services, and specialized freight trucking services.
notation: 17111215
valid from: 2024-06-07

Intercity Rail - Electric
type: BicsLevel7Segment
type: Classifier
type: NamedIndividual
is level7 segment of: Intercity Passenger Rail
is contemporary version of: http://data.ga-group.nl/ics/bics/17111216101010
is version of: http://data.ga-group.nl/ics/bics/17111216101010
replaces: http://data.ga-group.nl/ics/bics/2020/17111216101010
imported on: 2026-06-08T13:40:52.236Z
last refreshed on: 2026-06-08T13:41:38.450Z
source accessed on: 2024-06-05T14:42:36Z
source last accessed on: 2024-06-05T14:42:36Z
label: Ferrovia interurbana - Elettrica @it
label: Ferroviario urbano - eléctrico @es
label: Intercity-Verkehr - Elektrisch @de
label: Transport ferroviaire interurbain - électricité @fr
label: Trem interurbano - eletricidade @pt
label: Междугородние поезда - на электричестве @ru
label: 城市間鐵路-電力 @zh-hant
label: 城际铁路-电动 @zh
label: 都市間鉄道-電気 @ja
label: 도시간 철도 - 전기 @ko
definition: This segment includes companies that provide intercity passenger rail services via electric rail cars.
notation: 17111216101010
valid from: 2024-06-07

Intercity Rail - Fossil Fuels
type: BicsLevel7Segment
type: Classifier
type: NamedIndividual
is level7 segment of: Intercity Passenger Rail
is contemporary version of: http://data.ga-group.nl/ics/bics/17111216101011
is version of: http://data.ga-group.nl/ics/bics/17111216101011
replaces: http://data.ga-group.nl/ics/bics/2020/17111216101011
imported on: 2026-06-08T13:40:52.236Z
last refreshed on: 2026-06-08T13:41:38.450Z
source accessed on: 2024-06-05T14:42:36Z
source last accessed on: 2024-06-05T14:42:36Z
label: Ferrovia interurbana - Combustibili fossili @it
label: Ferroviario urbano - combustibles fósiles @es
label: Intercity-Verkehr - Fossile Brennstoffe @de
label: Transport ferroviaire interurbain - combustibles fossiles @fr
label: Trem interurbano - combustíveis fósseis @pt
label: Междугородние поезда - ископаемое топливо @ru
label: 城市間鐵路-化石燃料 @zh-hant
label: 城际铁路-化石燃料 @zh
label: 都市間鉄道-化石燃料 @ja
label: 도시간 철도 - 화석 연료 @ko
definition: This segment includes companies that provide intercity passenger rail services via fossil fuel rail cars.
notation: 17111216101011
valid from: 2024-06-07

Intercity Passenger Rail
type: BicsLevel6Segment
type: Classifier
type: NamedIndividual
is level6 segment of: Passenger Rail
is contemporary version of: http://data.ga-group.nl/ics/bics/171112161010
is version of: http://data.ga-group.nl/ics/bics/171112161010
replaces: http://data.ga-group.nl/ics/bics/2020/171112161010
imported on: 2026-06-08T13:40:52.236Z
last refreshed on: 2026-06-08T13:41:38.450Z
source accessed on: 2024-06-05T14:42:36Z
source last accessed on: 2024-06-05T14:42:36Z
label: Ferrocarril de pasajeros urbano @es
label: Ferrovie interurbane passegg @it
label: Intercity-Personenschienenverkehr @de
label: Srvc ferrov passagers interurb @fr
label: Trem interurbano de passageiros @pt
label: Междугор. ж/д перевозки @ru
label: 城市間客運鐵路 @zh-hant
label: 城市间铁路客运 @zh
label: 都市間旅客鉄道 @ja
label: 도시간 여객 철도 @ko
definition: This segment includes companies that provide long distance passenger rail services.
notation: 171112161010
valid from: 2024-06-07

Commuter Rail - Electric
type: BicsLevel7Segment
type: Classifier
type: NamedIndividual
is level7 segment of: Commuter Rail
is contemporary version of: http://data.ga-group.nl/ics/bics/17111216101110
is version of: http://data.ga-group.nl/ics/bics/17111216101110
replaces: http://data.ga-group.nl/ics/bics/2020/17111216101110
imported on: 2026-06-08T13:40:52.236Z
last refreshed on: 2026-06-08T13:41:38.450Z
source accessed on: 2024-06-05T14:42:36Z
source last accessed on: 2024-06-05T14:42:36Z
label: Ferrovia pendolari - Elettrica @it
label: Nahverkehr - Elektrisch @de
label: Train de banlieue - électricité @fr
label: Transporte por ferrocarril - eléctrico @es
label: Trem metropolitano - eletricidade @pt
label: Пригородные поезда - на электричестве @ru
label: 通勤用鉄道-電気 @ja
label: 通勤鐵路-電力 @zh-hant
label: 通勤铁路-电动 @zh
label: 통근 철도 - 전기 @ko
definition: This segment includes companies that provide commuter rail services via electric rail cars.
notation: 17111216101110
valid from: 2024-06-07

Commuter Rail - Fossil Fuels
type: BicsLevel7Segment
type: Classifier
type: NamedIndividual
is level7 segment of: Commuter Rail
is contemporary version of: http://data.ga-group.nl/ics/bics/17111216101111
is version of: http://data.ga-group.nl/ics/bics/17111216101111
replaces: http://data.ga-group.nl/ics/bics/2020/17111216101111
imported on: 2026-06-08T13:40:52.236Z
last refreshed on: 2026-06-08T13:41:38.450Z
source accessed on: 2024-06-05T14:42:36Z
source last accessed on: 2024-06-05T14:42:36Z
label: Ferrovia pendolari - Combustibili fossili @it
label: Nahverkehr - Fossile Brennstoffe @de
label: Train de banlieue - combustibles fossiles @fr
label: Transporte por ferrocarril - combustibles fósiles @es
label: Trem metropolitano - combustíveis fósseis @pt
label: Пригородные поезда - ископаемое топливо @ru
label: 通勤用鉄道-化石燃料 @ja
label: 通勤鐵路-化石燃料 @zh-hant
label: 通勤铁路-化石燃料 @zh
label: 통근 철도 - 화석 연료 @ko
definition: This segment includes companies that provide commuter rail services via fossil fuel rail cars.
notation: 17111216101111
valid from: 2024-06-07

Commuter Rail
type: BicsLevel6Segment
type: Classifier
type: NamedIndividual
is level6 segment of: Passenger Rail
is contemporary version of: http://data.ga-group.nl/ics/bics/171112161011
is version of: http://data.ga-group.nl/ics/bics/171112161011
replaces: http://data.ga-group.nl/ics/bics/2020/171112161011
imported on: 2026-06-08T13:40:52.236Z
last refreshed on: 2026-06-08T13:41:38.450Z
source accessed on: 2024-06-05T14:42:36Z
source last accessed on: 2024-06-05T14:42:36Z
label: Ferrovie pendolari @it
label: Nahverkehr @de
label: Transport commun ferroviaire @fr
label: Transporte por ferrocarril @es
label: Trem metropolitano @pt
label: Пригородные ж/д перевозки @ru
label: 通勤用鉄道 @ja
label: 通勤鐵路交通系統 @zh-hant
label: 通勤铁路 @zh
label: 통근 철도 @ko
definition: This segment includes companies that provide local and suburban commuter passenger rail services, within a metropolitan area and adjacent suburban areas. Includes local rail services, subways, trolley, and trams.
notation: 171112161011
valid from: 2024-06-07

Passenger Rail
type: BicsLevel5Segment
type: Classifier
type: NamedIndividual
is level5 segment of: Transit Services
is contemporary version of: http://data.ga-group.nl/ics/bics/1711121610
is version of: http://data.ga-group.nl/ics/bics/1711121610
replaces: http://data.ga-group.nl/ics/bics/2020/1711121610
imported on: 2026-06-08T13:40:52.236Z
last refreshed on: 2026-06-08T13:41:38.450Z
source accessed on: 2024-06-05T14:42:36Z
source last accessed on: 2024-06-05T14:42:36Z
label: Ferrocarril de pasajeros @es
label: Ferrovie passeggeri @it
label: Personenschienenverkehr @de
label: Srvc ferroviaires passagers @fr
label: Trem de passageiros @pt
label: Пассажирский ж/д транспорт @ru
label: 旅客鉄道 @ja
label: 鐵路服務 @zh-hant
label: 铁路客运 @zh
label: 여객 철도 @ko
definition: This segment includes companies that provide railway-based passenger transportation services.
notation: 1711121610
valid from: 2024-06-07

Interurban & Rural Bus - Electric
type: BicsLevel7Segment
type: Classifier
type: NamedIndividual
is level7 segment of: Interurban & Rural Bus Transp
is contemporary version of: http://data.ga-group.nl/ics/bics/17111216111010
is version of: http://data.ga-group.nl/ics/bics/17111216111010
replaces: http://data.ga-group.nl/ics/bics/2020/17111216111010
imported on: 2026-06-08T13:40:52.236Z
last refreshed on: 2026-06-08T13:41:38.450Z
source accessed on: 2024-06-05T14:42:36Z
source last accessed on: 2024-06-05T14:42:36Z
label: Autobus interurbain et rural - électricité @fr
label: Autobus interurbani e rurali - Elettrici @it
label: Autobuses interurbanos y rurales - eléctricos @es
label: Ônibus interurbano e rural - eletricidade @pt
label: Überlands- & ländl. Bus - Elektrisch @de
label: Междугород. и сельское автобус. сообщение - на электр. @ru
label: 城乡公交-电动 @zh
label: 城鄉間巴士-電力 @zh-hant
label: 都市間･地方ﾊﾞｽ-電気 @ja
label: 시외 & 지방버스 - 전기 @ko
label: ���鄉間巴士-電力 @zh-hant
definition: This segment includes companies that provide interurban and rural bus transportation services via electric buses.
notation: 17111216111010
valid from: 2024-06-07

Interurban & Rural Bus - Fossil Fuels
type: BicsLevel7Segment
type: Classifier
type: NamedIndividual
is level7 segment of: Interurban & Rural Bus Transp
is contemporary version of: http://data.ga-group.nl/ics/bics/17111216111011
is version of: http://data.ga-group.nl/ics/bics/17111216111011
replaces: http://data.ga-group.nl/ics/bics/2020/17111216111011
imported on: 2026-06-08T13:40:52.236Z
last refreshed on: 2026-06-08T13:41:38.450Z
source accessed on: 2024-06-05T14:42:36Z
source last accessed on: 2024-06-05T14:42:36Z
label: Autobus interurbain et rural - combustibles fossiles @fr
label: Autobus interurbani e rurali - Combustibili fossili @it
label: Autobuses interurbanos y rurales - combustibles fósiles @es
label: Ônibus interurbano e rural - combustíveis fósseis @pt
label: Überlands- & ländl. Bus - Fossile Brennstoffe @de
label: Междугород.и сельское автобус. сообщение - ископ. топливо @ru
label: 城乡公交-化石燃料 @zh
label: 城鄉間巴士-化石燃料 @zh-hant
label: 都市間･地方ﾊﾞｽ-化石燃料 @ja
label: 시외 & 지방버스 - 화석 연료 @ko
definition: This segment includes companies that provide interurban and rural bus transportation services via fossil fuel buses.
notation: 17111216111011
valid from: 2024-06-07

Interurban & Rural Bus Transp
type: BicsLevel6Segment
type: Classifier
type: NamedIndividual
is level6 segment of: Bus Transportation
is contemporary version of: http://data.ga-group.nl/ics/bics/171112161110
is version of: http://data.ga-group.nl/ics/bics/171112161110
replaces: http://data.ga-group.nl/ics/bics/2020/171112161110
imported on: 2026-06-08T13:40:52.236Z
last refreshed on: 2026-06-08T13:41:38.450Z
source accessed on: 2024-06-05T14:42:36Z
source last accessed on: 2024-06-05T14:42:36Z
label: Bustranport, überland & ländl. @de
label: Transp ônibus interurbano e rural @pt
label: Transp rural/interurbain par bus @fr
label: Transp urbana y rural de bus @es
label: Trasp autobus interurbani e rurali @it
label: Междугород. и сельские автобус. перевозки @ru
label: 城乡间公汽运输 @zh
label: 都市間即城鄉巴士運輸 @zh-hant
label: 都市間･地方ﾊﾞｽ輸送 @ja
label: 시외 & 지방 버스 운송업 @ko
definition: This segment includes companies that provide bus passenger services outside a single metropolitan area. Such services are provided between cities or in rural areas.
notation: 171112161110
valid from: 2024-06-07

Local Bus Services - Electric
type: BicsLevel7Segment
type: Classifier
type: NamedIndividual
is level7 segment of: Local Bus Services
is contemporary version of: http://data.ga-group.nl/ics/bics/17111216111110
is version of: http://data.ga-group.nl/ics/bics/17111216111110
replaces: http://data.ga-group.nl/ics/bics/2020/17111216111110
imported on: 2026-06-08T13:40:52.236Z
last refreshed on: 2026-06-08T13:41:38.450Z
source accessed on: 2024-06-05T14:42:36Z
source last accessed on: 2024-06-05T14:42:36Z
label: Lokale Busdienste - Elektrisch @de
label: Serviços locais de ônibus - eletricidade @pt
label: Services de bus locaux - électricité @fr
label: Servicios de autobuses locales - eléctricos @es
label: Servizi autobus locali - Elettrici @it
label: Пригородное автобусное сообщение - на электричестве @ru
label: Пригородное автобусное сообщение - на электричест��е @ru
label: 地方ﾊﾞｽ旅客輸送-電気 @ja
label: 本地大巴服务-电动 @zh
label: 短途公車服務-電力 @zh-hant
label: 시내버스 서비스 - 전기 @ko
definition: This segment includes companies that provide local bus services via electric buses.
notation: 17111216111110
valid from: 2024-06-07

Local Bus Services - Fossil Fuels
type: BicsLevel7Segment
type: Classifier
type: NamedIndividual
is level7 segment of: Local Bus Services
is contemporary version of: http://data.ga-group.nl/ics/bics/17111216111111
is version of: http://data.ga-group.nl/ics/bics/17111216111111
replaces: http://data.ga-group.nl/ics/bics/2020/17111216111111
imported on: 2026-06-08T13:40:52.236Z
last refreshed on: 2026-06-08T13:41:38.450Z
source accessed on: 2024-06-05T14:42:36Z
source last accessed on: 2024-06-05T14:42:36Z
label: Lokale Busdienste - Fossile Brennstoffe @de
label: Serviços locais de ônibus - combustíveis fósseis @pt
label: Services d'autobus locaux - combustibles fossiles @fr
label: Servicios de autobuses locales - combustibles fósiles @es
label: Servizi autobus locali - Combustibili fossili @it
label: Пригородное автобусное сообщение - ископаемое топливо @ru
label: Пригородное автобусное сообще��ие - ископаемое топливо @ru
label: 地方ﾊﾞｽ旅客輸送-化石燃料 @ja
label: 本地大巴服务-化石燃料 @zh
label: 短途公車服務-化石燃料 @zh-hant
label: 시내버스 서비스 - 화석 연료 @ko
definition: This segment includes companies that provide local bus services via fossil fuel buses.
notation: 17111216111111
valid from: 2024-06-07

Local Bus Services
type: BicsLevel6Segment
type: Classifier
type: NamedIndividual
is level6 segment of: Bus Transportation
is contemporary version of: http://data.ga-group.nl/ics/bics/171112161111
is version of: http://data.ga-group.nl/ics/bics/171112161111
replaces: http://data.ga-group.nl/ics/bics/2020/171112161111
imported on: 2026-06-08T13:40:52.236Z
last refreshed on: 2026-06-08T13:41:38.450Z
source accessed on: 2024-06-05T14:42:36Z
source last accessed on: 2024-06-05T14:42:36Z
label: Lokale Busdienste @de
label: Serv autobus locali @it
label: Serv de ônibus local @pt
label: Serv local autobuses @es
label: Service bus local @fr
label: Местные автобусные перевозки @ru
label: 地方ﾊﾞｽ旅客輸送 @ja
label: 通勤与短途汽车服务 @zh
label: 通勤及短途公車服務 @zh-hant
label: 시내버스서비스 @ko
definition: This segment includes companies that provide local and suburban bus passenger services within metropolitan areas and adjacent suburban areas.
notation: 171112161111
valid from: 2024-06-07

Bus Transportation
type: BicsLevel5Segment
type: Classifier
type: NamedIndividual
is level5 segment of: Transit Services
is contemporary version of: http://data.ga-group.nl/ics/bics/1711121611
is version of: http://data.ga-group.nl/ics/bics/1711121611
replaces: http://data.ga-group.nl/ics/bics/2020/1711121611
imported on: 2026-06-08T13:40:52.236Z
last refreshed on: 2026-06-08T13:41:38.450Z
source accessed on: 2024-06-05T14:42:36Z
source last accessed on: 2024-06-05T14:42:36Z
label: Busverkehr @de
label: Transport en bus @fr
label: Transporte de ônibus @pt
label: Transporte por autobús @es
label: Trasporto autobus @it
label: Автобусные перевозки @ru
label: 公交运输 @zh
label: 巴士運輸服務 @zh-hant
label: 버스 운송 @ko
label: ﾊﾞｽ輸送 @ja
definition: This segment includes companies that provide bus passenger transit services. Such services can operate within metropolitan and suburban areas or between cities and urban areas.
notation: 1711121611
valid from: 2024-06-07

Taxi Services - Electric
type: BicsLevel6Segment
type: Classifier
type: NamedIndividual
is level6 segment of: Taxi Services
is contemporary version of: http://data.ga-group.nl/ics/bics/171112161210
is version of: http://data.ga-group.nl/ics/bics/171112161210
replaces: http://data.ga-group.nl/ics/bics/2020/171112161210
imported on: 2026-06-08T13:40:52.236Z
last refreshed on: 2026-06-08T13:41:38.450Z
source accessed on: 2024-06-05T14:42:36Z
source last accessed on: 2024-06-05T14:42:36Z
label: Serviços de táxi - eletricidade @pt
label: Services de taxi - électricité @fr
label: Servicios de taxi - eléctricos @es
label: Servizi taxi - Elettrici @it
label: Taxidienste - Elektrisch @de
label: Службы такси - на электричестве @ru
label: 出租车服务-电动 @zh
label: 計程車服務-電力 @zh-hant
label: 택시 서비스 - 전기 @ko
label: ﾀｸｼｰｻｰﾋﾞｽ-電気 @ja
definition: This segment includes companies that provide taxi services via electric vehicles
notation: 171112161210
valid from: 2024-06-07

Taxi Services - Fossil Fuels
type: BicsLevel6Segment
type: Classifier
type: NamedIndividual
is level6 segment of: Taxi Services
is contemporary version of: http://data.ga-group.nl/ics/bics/171112161211
is version of: http://data.ga-group.nl/ics/bics/171112161211
replaces: http://data.ga-group.nl/ics/bics/2020/171112161211
imported on: 2026-06-08T13:40:52.236Z
last refreshed on: 2026-06-08T13:41:38.450Z
source accessed on: 2024-06-05T14:42:36Z
source last accessed on: 2024-06-05T14:42:36Z
label: Serviços de táxi - combustíveis fósseis @pt
label: Services de taxi - combustibles fossiles @fr
label: Servicios de taxi - combustibles fósiles @es
label: Servizi taxi - Combustibili fossili @it
label: Taxidienste - Fossile Brennstoffe @de
label: Службы такси - ископаемое топливо @ru
label: 出租车服务-化石燃料 @zh
label: 計程車服務-化石燃料 @zh-hant
label: 택시 서비스 - 화석 연료 @ko
label: 택시 서비스 - 화��� 연료 @ko
label: ﾀｸｼｰｻｰﾋﾞｽ-化石燃料 @ja
definition: This segment includes companies that provide taxi services via fossil fuel vehicles
notation: 171112161211
valid from: 2024-06-07

Taxi Services
type: BicsLevel5Segment
type: Classifier
type: NamedIndividual
is level5 segment of: Transit Services
is contemporary version of: http://data.ga-group.nl/ics/bics/1711121612
is version of: http://data.ga-group.nl/ics/bics/1711121612
replaces: http://data.ga-group.nl/ics/bics/2020/1711121612
imported on: 2026-06-08T13:40:52.236Z
last refreshed on: 2026-06-08T13:41:38.450Z
source accessed on: 2024-06-05T14:42:36Z
source last accessed on: 2024-06-05T14:42:36Z
label: Serviço de táxi @pt
label: Services de taxi @fr
label: Servicios de taxis @es
label: Servizi taxi @it
label: Taxiservice @de
label: Услуги такси @ru
label: 出租车服务 @zh
label: 出租车��务 @zh
label: 計程車服務 @zh-hant
label: 택시 서비스 @ko
label: ﾀｸｼｰｻｰﾋﾞｽ @ja
definition: This segment includes companies that provide taxi services via automobile or van.
notation: 1711121612
valid from: 2024-06-07

Ferry Services - Electric
type: BicsLevel6Segment
type: Classifier
type: NamedIndividual
is level6 segment of: Ferry Services
is contemporary version of: http://data.ga-group.nl/ics/bics/171112161310
is version of: http://data.ga-group.nl/ics/bics/171112161310
replaces: http://data.ga-group.nl/ics/bics/2020/171112161310
imported on: 2026-06-08T13:40:52.236Z
last refreshed on: 2026-06-08T13:41:38.450Z
source accessed on: 2024-06-05T14:42:36Z
source last accessed on: 2024-06-05T14:42:36Z
label: Fährdienste - Elektrisch @de
label: Serviços de balsa - eletricidade @pt
label: Services de ferry - électricité @fr
label: Servicios de ferry - eléctricos @es
label: Servizi traghetto - Elettrici @it
label: Паромные услуги - на электричестве @ru
label: 渡輪服務-電力 @zh-hant
label: 渡轮服务-电动 @zh
label: 페리 서비스 - 전기 @ko
label: ﾌｪﾘｰｻｰﾋﾞｽ-電気 @ja
definition: This segment includes companies that provide ferry services via electric vessels.
notation: 171112161310
valid from: 2024-06-07

Ferry Services - Fossil Fuels
type: BicsLevel6Segment
type: Classifier
type: NamedIndividual
is level6 segment of: Ferry Services
is contemporary version of: http://data.ga-group.nl/ics/bics/171112161311
is version of: http://data.ga-group.nl/ics/bics/171112161311
replaces: http://data.ga-group.nl/ics/bics/2020/171112161311
imported on: 2026-06-08T13:40:52.236Z
last refreshed on: 2026-06-08T13:41:38.450Z
source accessed on: 2024-06-05T14:42:36Z
source last accessed on: 2024-06-05T14:42:36Z
label: Fährdienste - Fossile Brennstoffe @de
label: Serviços de balsa - combustíveis fósseis @pt
label: Services de ferry - combustibles fossiles @fr
label: Servicios de ferry - combustibles fósiles @es
label: Servizi traghetti - Combustibili fossili @it
label: Паромные перевозки - ископаемое топливо @ru
label: 渡輪服務-化石燃料 @zh-hant
label: 渡轮服务-化石燃料 @zh
label: 페리 서비스 - 화석 연료 @ko
label: ﾌｪﾘｰｻｰﾋﾞｽ-化石燃料 @ja
definition: This segment includes companies that provide ferry services via fossil fuel vessels.
notation: 171112161311
valid from: 2024-06-07

Ferry Services
type: BicsLevel5Segment
type: Classifier
type: NamedIndividual
is level5 segment of: Transit Services
is contemporary version of: http://data.ga-group.nl/ics/bics/1711121613
is version of: http://data.ga-group.nl/ics/bics/1711121613
replaces: http://data.ga-group.nl/ics/bics/2020/1711121613
imported on: 2026-06-08T13:40:52.236Z
last refreshed on: 2026-06-08T13:41:38.450Z
source accessed on: 2024-06-05T14:42:36Z
source last accessed on: 2024-06-05T14:42:36Z
label: Fährdienste @de
label: Serv ferry @pt
label: Serv transbordador @es
label: Services de ferry @fr
label: Servizi traghetto @it
label: Паромные перевозки @ru
label: 渡輪服務 @zh-hant
label: 渡轮服务 @zh
label: 여객선 서비스 @ko
label: ﾌｪﾘｰｻｰﾋﾞｽ @ja
definition: This segment includes companies that transport passengers on ferries and other inland waters vessels that are not suited for ocean transport.
notation: 1711121613
valid from: 2024-06-07

Helicopter Services
type: BicsLevel5Segment
type: Classifier
type: NamedIndividual
is level5 segment of: Transit Services
is contemporary version of: http://data.ga-group.nl/ics/bics/1711121614
is version of: http://data.ga-group.nl/ics/bics/1711121614
replaces: http://data.ga-group.nl/ics/bics/2020/1711121614
imported on: 2026-06-08T13:40:52.236Z
last refreshed on: 2026-06-08T13:41:38.450Z
source accessed on: 2024-06-05T14:42:36Z
source last accessed on: 2024-06-05T14:42:36Z
label: Helikopterservices @de
label: Serviços de helicóptero @pt
label: Services d'hélicoptères @fr
label: Servicios de helicóptero @es
label: Servizi elicottero @it
label: Вертолетные услуги @ru
label: 直升机服务 @zh
label: 直升機服務 @zh-hant
label: 헬리콥터 서비스 @ko
label: ﾍﾘｺﾌﾟﾀｰｻｰﾋﾞｽ @ja
definition: This segment includes companies that provide helicopter passenger services, such as commuter helicopter service. Excludes transportation of oil workers to oil platforms (see Oil & Gas Services).
notation: 1711121614
valid from: 2024-06-07

Transit Services
type: BicsLevel4SubIndustry
type: Classifier
type: NamedIndividual
is sub industry of: Transportation & Logistics
is contemporary version of: http://data.ga-group.nl/ics/bics/17111216
is version of: http://data.ga-group.nl/ics/bics/17111216
replaces: http://data.ga-group.nl/ics/bics/2020/17111216
imported on: 2026-06-08T13:40:52.236Z
last refreshed on: 2026-06-08T13:41:38.450Z
source accessed on: 2024-06-05T14:42:36Z
source last accessed on: 2024-06-05T14:42:36Z
label: Serviços de trânsito @pt
label: Servicios de tránsito @es
label: Servizi transito @it
label: Srvc de transit @fr
label: Transitleistungen @de
label: Перевозки @ru
label: 中转服务 @zh
label: 接駁服務 @zh-hant
label: 輸送ｻｰﾋﾞｽ @ja
label: 교통 서비스 @ko
definition: This industry subgroup includes companies that operate forms of passenger transportation services not elsewhere classified. Includes taxis, ferries, helicopters and other novelty forms of transportation such as limos, rickshaws, and horse carriages.
notation: 17111216
valid from: 2024-06-07

Air Freight Brokerage
type: BicsLevel6Segment
type: Classifier
type: NamedIndividual
is level6 segment of: Logistics Brokerage
is contemporary version of: http://data.ga-group.nl/ics/bics/171112171010
is version of: http://data.ga-group.nl/ics/bics/171112171010
replaces: http://data.ga-group.nl/ics/bics/2020/171112171010
imported on: 2026-06-08T13:40:52.236Z
last refreshed on: 2026-06-08T13:41:38.450Z
source accessed on: 2024-06-05T14:42:36Z
source last accessed on: 2024-06-05T14:42:36Z
label: Brokeraggio trasporto aereo @it
label: Corretagem frete aéreo @pt
label: Corretaje de flete aéreo @es
label: Courtage fret aérien @fr
label: Luftfracht-Brokerage @de
label: Брокерские услуги воздушных перевозок @ru
label: 空运经纪 @zh
label: 空運經紀 @zh-hant
label: 航空貨物輸送仲介 @ja
label: 항공 화물 중개인 @ko
definition: This segment includes companies that provide air freight brokerage services.
notation: 171112171010
valid from: 2024-06-07

Intermodal Brokerage
type: BicsLevel6Segment
type: Classifier
type: NamedIndividual
is level6 segment of: Logistics Brokerage
is contemporary version of: http://data.ga-group.nl/ics/bics/171112171011
is version of: http://data.ga-group.nl/ics/bics/171112171011
replaces: http://data.ga-group.nl/ics/bics/2020/171112171011
imported on: 2026-06-08T13:40:52.236Z
last refreshed on: 2026-06-08T13:41:38.450Z
source accessed on: 2024-06-05T14:42:36Z
source last accessed on: 2024-06-05T14:42:36Z
label: Brokeraggio intermodale @it
label: Corretagem intemodal @pt
label: Corretaje intermodal @es
label: Courtage intermodal @fr
label: Kombinierte Brokerage @de
label: Брокерские услуги межтранспортных перевозок @ru
label: 多式联运经纪 @zh
label: 綜合貨運經紀 @zh-hant
label: 複合一貫輸送仲介 @ja
label: 복합운송 중개인 @ko
definition: This segment includes companies that provide intermodal brokerage services.
notation: 171112171011
valid from: 2024-06-07

Ocean Brokerage
type: BicsLevel6Segment
type: Classifier
type: NamedIndividual
is level6 segment of: Logistics Brokerage
is contemporary version of: http://data.ga-group.nl/ics/bics/171112171012
is version of: http://data.ga-group.nl/ics/bics/171112171012
replaces: http://data.ga-group.nl/ics/bics/2020/171112171012
imported on: 2026-06-08T13:40:52.236Z
last refreshed on: 2026-06-08T13:41:38.450Z
source accessed on: 2024-06-05T14:42:36Z
source last accessed on: 2024-06-05T14:42:36Z
label: Brokeraggio oceano @it
label: Corretagem oceano @pt
label: Corretaje de oceáno @es
label: Courtage océan @fr
label: See-Brokerage @de
label: Брокерские услуги океанских перевозок @ru
label: 海上輸送仲介 @ja
label: 海洋经纪 @zh
label: 海運經紀 @zh-hant
label: 해상 중개인 @ko
definition: This segment includes companies that provide ocean brokerage services.
notation: 171112171012
valid from: 2024-06-07

Truck Brokerage
type: BicsLevel6Segment
type: Classifier
type: NamedIndividual
is level6 segment of: Logistics Brokerage
is contemporary version of: http://data.ga-group.nl/ics/bics/171112171013
is version of: http://data.ga-group.nl/ics/bics/171112171013
replaces: http://data.ga-group.nl/ics/bics/2020/171112171013
imported on: 2026-06-08T13:40:52.236Z
last refreshed on: 2026-06-08T13:41:38.450Z
source accessed on: 2024-06-05T14:42:36Z
source last accessed on: 2024-06-05T14:42:36Z
label: Brokeraggio camion @it
label: Corretagem de caminhões @pt
label: Corretaje de camiones @es
label: Courtage en camionnage @fr
label: Makler für Fuhrunternehmen @de
label: Брокерские услуги грузовиков @ru
label: 卡車貨運經紀 @zh-hant
label: 卡车运输经纪 @zh
label: 트럭 중개인 @ko
label: ﾄﾗｯｸ仲介 @ja
definition: This segment includes companies that provide truckload and less-than-truckload brokerage services.
notation: 171112171013
valid from: 2024-06-07

Logistics Brokerage
type: BicsLevel5Segment
type: Classifier
type: NamedIndividual
is level5 segment of: Logistics Services
is contemporary version of: http://data.ga-group.nl/ics/bics/1711121710
is version of: http://data.ga-group.nl/ics/bics/1711121710
replaces: http://data.ga-group.nl/ics/bics/2020/1711121710
imported on: 2026-06-08T13:40:52.236Z
last refreshed on: 2026-06-08T13:41:38.450Z
source accessed on: 2024-06-05T14:42:36Z
source last accessed on: 2024-06-05T14:42:36Z
label: Corretagem de logística @pt
label: Corretaje de logística @es
label: Courtage en logistique @fr
label: Intermediazione logistica @it
label: Logistik-Brokerage @de
label: Логистика, брокерск. дело @ru
label: Логистика, бро��ерск. дело @ru
label: 物流仲介ｻｰﾋﾞｽ @ja
label: 物流经纪 @zh
label: 經紀 @zh-hant
label: 물류 중개인 @ko
definition: This segment includes companies that provide transportation brokerage services, such as air freight, intermodal, ocean, and other brokerage services.
notation: 1711121710
valid from: 2024-06-07

Freight Forwarding Services
type: BicsLevel5Segment
type: Classifier
type: NamedIndividual
is level5 segment of: Logistics Services
is contemporary version of: http://data.ga-group.nl/ics/bics/1711121711
is version of: http://data.ga-group.nl/ics/bics/1711121711
replaces: http://data.ga-group.nl/ics/bics/2020/1711121711
imported on: 2026-06-08T13:40:52.236Z
last refreshed on: 2026-06-08T13:41:38.450Z
source accessed on: 2024-06-05T14:42:36Z
source last accessed on: 2024-06-05T14:42:36Z
label: Frachtspeditionsdienste @de
label: Services d'acheminement du fret @fr
label: Servicios de reenvío de flete @es
label: Servizi di trasporto @it
label: Seviços transitários @pt
label: Транспортно-экспедиторские услуги @ru
label: 貨物ﾌｫﾜｰﾃｨﾝｸﾞｻｰﾋﾞｽ @ja
label: 貨物ﾌｫﾜｰﾃｨ���ｸﾞｻｰﾋﾞｽ @ja
label: 貨運轉運服務 @zh-hant
label: 货运代理服务 @zh
label: 수취인지불 운송 서비스 @ko
definition: This segment includes companies that provide freight forwarding services. These companies do not move the products themselves, but arrange the shipment by contracting with carriers.
notation: 1711121711
valid from: 2024-06-07

Intermodal Services
type: BicsLevel5Segment
type: Classifier
type: NamedIndividual
is level5 segment of: Logistics Services
is contemporary version of: http://data.ga-group.nl/ics/bics/1711121712
is version of: http://data.ga-group.nl/ics/bics/1711121712
replaces: http://data.ga-group.nl/ics/bics/2020/1711121712
imported on: 2026-06-08T13:40:52.236Z
last refreshed on: 2026-06-08T13:41:38.450Z
source accessed on: 2024-06-05T14:42:36Z
source last accessed on: 2024-06-05T14:42:36Z
label: Kombinierte Dienste @de
label: Serviços intermodal @pt
label: Service intermodaux @fr
label: Servicios intermodales @es
label: Servizi intermodali @it
label: Межтранспортные услуги @ru
label: 綜合貨運服務 @zh-hant
label: 联运服务 @zh
label: 複合一貫ｻｰﾋﾞｽ @ja
label: 복합운송 서비스 @ko
label: ��合一貫ｻｰﾋﾞｽ @ja
definition: This segment includes companies that provide intermodal services. These services involve transporting freight through intermodal containers with the use of various forms of transportation. The company may transport the goods themselves or contract with carriers.
notation: 1711121712
valid from: 2024-06-07

Storage & Warehousing Services
type: BicsLevel5Segment
type: Classifier
type: NamedIndividual
is level5 segment of: Logistics Services
is contemporary version of: http://data.ga-group.nl/ics/bics/1711121713
is version of: http://data.ga-group.nl/ics/bics/1711121713
replaces: http://data.ga-group.nl/ics/bics/2020/1711121713
imported on: 2026-06-08T13:40:52.236Z
last refreshed on: 2026-06-08T13:41:38.450Z
source accessed on: 2024-06-05T14:42:36Z
source last accessed on: 2024-06-05T14:42:36Z
label: Lagerungs- & Lagerhallendienste @de
label: Serviços de armazenagem e depósito @pt
label: Services d'entreposage et stockage @fr
label: Servicios de almacenamiento y bodega @es
label: Servizi scorte e immagazzinaggio @it
label: Услуги хранения и складирования @ru
label: 仓储服务 @zh
label: 倉儲服務 @zh-hant
label: 倉庫･保管ｻｰﾋﾞｽ @ja
label: 보관 및 창고업 @ko
definition: This segment includes companies that provide storage and warehousing services.
notation: 1711121713
valid from: 2024-06-07

Logistics Services
type: BicsLevel4SubIndustry
type: Classifier
type: NamedIndividual
is sub industry of: Transportation & Logistics
is contemporary version of: http://data.ga-group.nl/ics/bics/17111217
is version of: http://data.ga-group.nl/ics/bics/17111217
replaces: http://data.ga-group.nl/ics/bics/2020/17111217
imported on: 2026-06-08T13:40:52.236Z
last refreshed on: 2026-06-08T13:41:38.450Z
source accessed on: 2024-06-05T14:42:36Z
source last accessed on: 2024-06-05T14:42:36Z
label: Logistikdienstleistungen @de
label: Serviços de logística @pt
label: Services de logistique @fr
label: Servicios de logística @es
label: Servizi logistici @it
label: Логистика @ru
label: 物流服务 @zh
label: 物流服務 @zh-hant
label: 物流ｻｰﾋﾞｽ @ja
label: 물류 서비스 @ko
definition: This industry subgroup includes companies that provide asset light trucking, transportation brokerage, intermodal, freight forwarding, and logistic services.
notation: 17111217
valid from: 2024-06-07

Airport Operators
type: BicsLevel6Segment
type: Classifier
type: NamedIndividual
is level6 segment of: Transportation Infra Operators
is contemporary version of: http://data.ga-group.nl/ics/bics/171112181010
is version of: http://data.ga-group.nl/ics/bics/171112181010
replaces: http://data.ga-group.nl/ics/bics/2020/171112181010
imported on: 2026-06-08T13:40:52.236Z
last refreshed on: 2026-06-08T13:41:38.450Z
source accessed on: 2024-06-05T14:42:36Z
source last accessed on: 2024-06-05T14:42:36Z
label: Flughafenbetreiber @de
label: Opérateurs d'aéroport @fr
label: Operadores de aeropuertos @es
label: Operatori aeroportuali @it
label: 机场运营商 @zh
label: 機場營運商 @zh-hant
label: 空港運営 @ja
label: 공항운영업 @ko
definition: This segment includes companies that operate airports. Includes the maintenance of airport facilities and runways, baggage handling services, cargo handling, and hangar rental.
notation: 171112181010
valid from: 2024-06-07

Port & Harbor Operators
type: BicsLevel6Segment
type: Classifier
type: NamedIndividual
is level6 segment of: Transportation Infra Operators
is contemporary version of: http://data.ga-group.nl/ics/bics/171112181011
is version of: http://data.ga-group.nl/ics/bics/171112181011
replaces: http://data.ga-group.nl/ics/bics/2020/171112181011
imported on: 2026-06-08T13:40:52.236Z
last refreshed on: 2026-06-08T13:41:38.450Z
source accessed on: 2024-06-05T14:42:36Z
source last accessed on: 2024-06-05T14:42:36Z
label: Hafenbetreiber @de
label: Opérateurs portuaires @fr
label: Operadores de porto e ancoradouro @pt
label: Operadores de puertos @es
label: Operatori portuali @it
label: Портовые операторы @ru
label: 港口运营 @zh
label: 港埠營運 @zh-hant
label: 港湾運営 @ja
label: 항만 운영업체 @ko
definition: This segment includes companies that operate ports and harbors. Includes port facility operation, marine cargo handling, harbor and lighthouse operation, and canal operation.
notation: 171112181011
valid from: 2024-06-07

Hway/Brdg/Tunnel Operators
type: BicsLevel6Segment
type: Classifier
type: NamedIndividual
is level6 segment of: Transportation Infra Operators
is contemporary version of: http://data.ga-group.nl/ics/bics/171112181012
is version of: http://data.ga-group.nl/ics/bics/171112181012
replaces: http://data.ga-group.nl/ics/bics/2020/171112181012
imported on: 2026-06-08T13:40:52.236Z
last refreshed on: 2026-06-08T13:41:38.450Z
source accessed on: 2024-06-05T14:42:36Z
source last accessed on: 2024-06-05T14:42:36Z
label: Opérateurs autor./pont/tunnel @fr
label: Operadores de estradas/pontes/túneis @pt
label: Operadores de vías/edificios/túneles @es
label: Operatori autostrad/ponte/gall @it
label: Schnllstr.-/Brücken-/Tunnelbetr. @de
label: Операторы дорог/туннелей/мостов @ru
label: Операт��ры дорог/туннелей/мостов @ru
label: 有料道路･橋･ﾄﾝﾈﾙ運営 @ja
label: 高速公路/桥梁/隧道运营商 @zh
label: 高速公路/橋樑/隧道營運商 @zh-hant
label: 고속도로/교량/터널 운영업체 @ko
definition: This segment includes companies that operate toll highways, bridges and tunnels. Includes toll collection and maintenance support of roadways and related structures.
notation: 171112181012
valid from: 2024-06-07

Transportation Infra Operators
type: BicsLevel5Segment
type: Classifier
type: NamedIndividual
is level5 segment of: Transport Operations & Services
is contemporary version of: http://data.ga-group.nl/ics/bics/1711121810
is version of: http://data.ga-group.nl/ics/bics/1711121810
replaces: http://data.ga-group.nl/ics/bics/2020/1711121810
imported on: 2026-06-08T13:40:52.236Z
last refreshed on: 2026-06-08T13:41:38.450Z
source accessed on: 2024-06-05T14:42:36Z
source last accessed on: 2024-06-05T14:42:36Z
label: Opérateurs d'infra. de transp. @fr
label: Operadores de infra transporte @es
label: Operadores de transporte infra @pt
label: Operatori infra trasporto @it
label: Transportinfrastr.-Betreiber @de
label: Операторы трансп. инфрастр. @ru
label: 交通运输基础设施运营商 @zh
label: 交通運輸基礎建設營運商 @zh-hant
label: 輸送ｲﾝﾌﾗ運用 @ja
label: 운송 사회기반시설 운영업체 @ko
definition: This segment includes companies that operate infrastructure used for truck, rail, air, and marine transportation.
notation: 1711121810
valid from: 2024-06-07

Air Transp Support Services
type: BicsLevel6Segment
type: Classifier
type: NamedIndividual
is level6 segment of: Transport Support Services
is contemporary version of: http://data.ga-group.nl/ics/bics/171112181110
is version of: http://data.ga-group.nl/ics/bics/171112181110
replaces: http://data.ga-group.nl/ics/bics/2020/171112181110
imported on: 2026-06-08T13:40:52.236Z
last refreshed on: 2026-06-08T13:41:38.450Z
source accessed on: 2024-06-05T14:42:36Z
source last accessed on: 2024-06-05T14:42:36Z
label: Apoyo transp aéreo @es
label: Appui trans aérien @fr
label: Lufttransportbetr. @de
label: Serv de apoio trans aéreo @pt
label: Servizi trasp aereo @it
label: Воздушный транспорт @ru
label: 空运支援服务 @zh
label: 空運支援服務 @zh-hant
label: 航空輸送支援ｻｰﾋﾞｽ @ja
label: 항공운송지원서비스 @ko
definition: This segment includes companies that provide air transportation support services, including airport operations and aircraft maintenance and fueling.
notation: 171112181110
valid from: 2024-06-07

Marine Support Services
type: BicsLevel6Segment
type: Classifier
type: NamedIndividual
is level6 segment of: Transport Support Services
is contemporary version of: http://data.ga-group.nl/ics/bics/171112181111
is version of: http://data.ga-group.nl/ics/bics/171112181111
replaces: http://data.ga-group.nl/ics/bics/2020/171112181111
imported on: 2026-06-08T13:40:52.236Z
last refreshed on: 2026-06-08T13:41:38.450Z
source accessed on: 2024-06-05T14:42:36Z
source last accessed on: 2024-06-05T14:42:36Z
label: Maritime Hilfsdienste @de
label: Serviços de apoio marítimo @pt
label: Services de soutien maritime @fr
label: Servicios de apoyo de marinas @es
label: Servizi supporto marittimo @it
label: Морская вспомогат. деятельность @ru
label: 海上輸送支援ｻｰﾋﾞｽ @ja
label: 海运支持服务 @zh
label: 海運支援服務 @zh-hant
label: 해운 지원 활동 @ko
definition: This segment includes companies that provide marine support services. Includes operation of port facilities, cargo handling, dry-dock services, and navigational services.
notation: 171112181111
valid from: 2024-06-07

Rail Support Services
type: BicsLevel6Segment
type: Classifier
type: NamedIndividual
is level6 segment of: Transport Support Services
is contemporary version of: http://data.ga-group.nl/ics/bics/171112181112
is version of: http://data.ga-group.nl/ics/bics/171112181112
replaces: http://data.ga-group.nl/ics/bics/2020/171112181112
imported on: 2026-06-08T13:40:52.236Z
last refreshed on: 2026-06-08T13:41:38.450Z
source accessed on: 2024-06-05T14:42:36Z
source last accessed on: 2024-06-05T14:42:36Z
label: Bahnsupportdienste @de
label: Serviços de suporte ferroviário @pt
label: Servicios de apoyo ferroviario @es
label: Servizi supporto ferroviario @it
label: Srvc soutien transp ferrov @fr
label: Услуги по поддержки ж/д @ru
label: 運輸支援-鐵路運輸 @zh-hant
label: 鉄道支援ｻｰﾋﾞｽ @ja
label: 铁路支持服务 @zh
label: 철도 지원 서비스 @ko
definition: This segment includes companies that provide railroad support activities. Includes rail terminal operation, loading and unloading services, and locomotive and rail car repair.
notation: 171112181112
valid from: 2024-06-07

Trucking Support Services
type: BicsLevel6Segment
type: Classifier
type: NamedIndividual
is level6 segment of: Transport Support Services
is contemporary version of: http://data.ga-group.nl/ics/bics/171112181113
is version of: http://data.ga-group.nl/ics/bics/171112181113
replaces: http://data.ga-group.nl/ics/bics/2020/171112181113
imported on: 2026-06-08T13:40:52.236Z
last refreshed on: 2026-06-08T13:41:38.450Z
source accessed on: 2024-06-05T14:42:36Z
source last accessed on: 2024-06-05T14:42:36Z
label: Fuhrunternehmen, Support-Services @de
label: Serviços de suporte ao transporte rodoviário @pt
label: Services de soutien au camionnage @fr
label: Servicios de soporte de camiones @es
label: Servizi supporto camion @it
label: Вспомог. услуги перевозки на грузовых автомобилях @ru
label: 卡車運輸支援服務 @zh-hant
label: 卡车运输支持服务 @zh
label: 트럭운송 지원 서비스 @ko
label: ﾄﾗｯｸ輸送ｻｰﾋﾞｽ @ja
definition: This segment includes companies that provide trucking support services, such as equipment maintenance, rentals, and tank washing.
notation: 171112181113
valid from: 2024-06-07

Transport Support Services
type: BicsLevel5Segment
type: Classifier
type: NamedIndividual
is level5 segment of: Transport Operations & Services
is contemporary version of: http://data.ga-group.nl/ics/bics/1711121811
is version of: http://data.ga-group.nl/ics/bics/1711121811
replaces: http://data.ga-group.nl/ics/bics/2020/1711121811
imported on: 2026-06-08T13:40:52.236Z
last refreshed on: 2026-06-08T13:41:38.450Z
source accessed on: 2024-06-05T14:42:36Z
source last accessed on: 2024-06-05T14:42:36Z
label: Appui au transport @fr
label: Serv apoio transp @pt
label: Serv apoyo transp @es
label: Servizio trasporto @it
label: Transportbetreuung @de
label: Транспортировка @ru
label: 輸送支援ｻｰﾋﾞｽ @ja
label: 运输支援服务 @zh
label: 運輸支援服務 @zh-hant
label: 운송지원업 @ko
definition: This segment includes companies that provide services to assist in the day-to-day functions of transportation service providers.
notation: 1711121811
valid from: 2024-06-07

Transport Operations & Services
type: BicsLevel4SubIndustry
type: Classifier
type: NamedIndividual
is sub industry of: Transportation & Logistics
is contemporary version of: http://data.ga-group.nl/ics/bics/17111218
is version of: http://data.ga-group.nl/ics/bics/17111218
replaces: http://data.ga-group.nl/ics/bics/2020/17111218
imported on: 2026-06-08T13:40:52.236Z
last refreshed on: 2026-06-08T13:41:38.450Z
source accessed on: 2024-06-05T14:42:36Z
source last accessed on: 2024-06-05T14:42:36Z
label: Opérations/srvc de transport @fr
label: Operações e serviços de transporte @pt
label: Operazioni e servizi trasporto @it
label: Ops y servicios de transporte @es
label: Transportbetriebe & - dienstleistungen @de
label: Трансп. операц. и услуги @ru
label: 輸送事業･ｻｰﾋﾞｽ @ja
label: 运输管理与服务 @zh
label: 運輸營運及服務 @zh-hant
label: 운송 운영 & 서비스 @ko
definition: This industry subgroup includes companies that support transportation by operating infrastructure or directly providing support services.
notation: 17111218
valid from: 2024-06-07

Transportation & Logistics
type: BicsLevel3Industry
type: Classifier
type: NamedIndividual
is industry of: Industrial Services
is contemporary version of: http://data.ga-group.nl/ics/bics/171112
is version of: http://data.ga-group.nl/ics/bics/171112
replaces: http://data.ga-group.nl/ics/bics/2020/171112
imported on: 2026-06-08T13:40:52.236Z
last refreshed on: 2026-06-08T13:41:38.450Z
source accessed on: 2024-06-05T14:42:36Z
source last accessed on: 2024-06-05T14:42:36Z
label: Transport et Logistique @fr
label: Transporte y logística @es
label: Transportes e logística @pt
label: Transportwesen & Logistik @de
label: Trasporti e logistica @it
label: Транспортировка и логистика @ru
label: 輸送･流通 @ja
label: 运输与物流 @zh
label: 運輸及物流 @zh-hant
label: 운송 & 물류 @ko
definition: This industry includes companies that provide freight transportation and related logistic services. Includes air freight, railroad, trucking and marine shipping services, logistics services, and postal and courier delivery services.
notation: 171112
valid from: 2024-06-07

Architectural Services
type: BicsLevel5Segment
type: Classifier
type: NamedIndividual
is level5 segment of: Engineering Services
is contemporary version of: http://data.ga-group.nl/ics/bics/1711131010
is version of: http://data.ga-group.nl/ics/bics/1711131010
replaces: http://data.ga-group.nl/ics/bics/2020/1711131010
imported on: 2026-06-08T13:40:52.236Z
last refreshed on: 2026-06-08T13:41:38.450Z
source accessed on: 2024-06-05T14:42:36Z
source last accessed on: 2024-06-05T14:42:36Z
label: Architektur @de
label: Serv architettura @it
label: Serv arquitectura @es
label: Serv de arquitetura @pt
label: Service architecture @fr
label: Архитектура @ru
label: 建筑服务 @zh
label: 建築服務 @zh-hant
label: 建築ｻｰﾋﾞｽ @ja
label: 건축 서비스업 @ko
definition: This segment includes companies that provide architectural design services for residential, commercial, and industrial buildings.
notation: 1711131010
valid from: 2024-06-07

Construction Engineering Svcs
type: BicsLevel5Segment
type: Classifier
type: NamedIndividual
is level5 segment of: Engineering Services
is contemporary version of: http://data.ga-group.nl/ics/bics/1711131011
is version of: http://data.ga-group.nl/ics/bics/1711131011
replaces: http://data.ga-group.nl/ics/bics/2020/1711131011
imported on: 2026-06-08T13:40:52.236Z
last refreshed on: 2026-06-08T13:41:38.450Z
source accessed on: 2024-06-05T14:42:36Z
source last accessed on: 2024-06-05T14:42:36Z
label: Bau-/Ingenieurleistungen @de
label: Serizi ingegneria edile @it
label: Serv ingeniería de construcción @es
label: Serviços de engenharia civil @pt
label: Services de génie civil @fr
label: Строительство/инженерия @ru
label: 土木建設工学ｻｰﾋﾞｽ @ja
label: 建筑工程服务 @zh
label: 營建工程服務 @zh-hant
label: 건설 엔지니어링 서비스 @ko
definition: This segment includes companies that provide civil engineering services for infrastructure or buildings.
notation: 1711131011
valid from: 2024-06-07

Ind & Traffic Engineering Svcs
type: BicsLevel5Segment
type: Classifier
type: NamedIndividual
is level5 segment of: Engineering Services
is contemporary version of: http://data.ga-group.nl/ics/bics/1711131012
is version of: http://data.ga-group.nl/ics/bics/1711131012
replaces: http://data.ga-group.nl/ics/bics/2020/1711131012
imported on: 2026-06-08T13:40:52.236Z
last refreshed on: 2026-06-08T13:41:38.450Z
source accessed on: 2024-06-05T14:42:36Z
source last accessed on: 2024-06-05T14:42:36Z
label: Ind.- & Verkehrsingenieursdienste @de
label: Serv de ingeniería ind y tráfico @es
label: Serv engenharia ind e tráfego @pt
label: Serv génie ind/trafic @fr
label: Serv ingegneria traffico e ind @it
label: Промышленный и дорожный инжиниринг @ru
label: 工业与交通工程服务 @zh
label: 工業及交通工程服務 @zh-hant
label: 工業及交通���程服務 @zh-hant
label: 工業･交通工学ｻｰﾋﾞｽ @ja
label: 산업&교통공학서비스 @ko
definition: This segment includes companies that provide industrial engineering services by designing systems aimed to make human processes more efficient., such as traffic management systems.
notation: 1711131012
valid from: 2024-06-07

Environmental Engineering Svcs
type: BicsLevel5Segment
type: Classifier
type: NamedIndividual
is level5 segment of: Engineering Services
is contemporary version of: http://data.ga-group.nl/ics/bics/1711131013
is version of: http://data.ga-group.nl/ics/bics/1711131013
replaces: http://data.ga-group.nl/ics/bics/2020/1711131013
imported on: 2026-06-08T13:40:52.236Z
last refreshed on: 2026-06-08T13:41:38.450Z
source accessed on: 2024-06-05T14:42:36Z
source last accessed on: 2024-06-05T14:42:36Z
label: Conseils/ingénierie environn @fr
label: Serv engenharia ambiental @pt
label: Serv ingeniería ambiental @es
label: Svz ingegneria ambientale @it
label: UT-Ingenieurleistungen @de
label: Услуги по экологическому инжинирингу @ru
label: Услуги по экологичес��ому инжинирингу @ru
label: 环境工程服务 @zh
label: 環境工学ｻｰﾋﾞｽ @ja
label: 環境工程服務 @zh-hant
label: 환경 엔지니어링 서비스 @ko
definition: This segment includes companies that provide environmental engineering and consulting services.
notation: 1711131013
valid from: 2024-06-07

Engineering Services
type: BicsLevel4SubIndustry
type: Classifier
type: NamedIndividual
is sub industry of: Engineering & Construction
is contemporary version of: http://data.ga-group.nl/ics/bics/17111310
is version of: http://data.ga-group.nl/ics/bics/17111310
replaces: http://data.ga-group.nl/ics/bics/2020/17111310
imported on: 2026-06-08T13:40:52.236Z
last refreshed on: 2026-06-08T13:41:38.450Z
source accessed on: 2024-06-05T14:42:36Z
source last accessed on: 2024-06-05T14:42:36Z
label: Ingenieurwesen @de
label: Serv de engenharia @pt
label: Serv ingeniería @es
label: Services de génie @fr
label: Servizi ingegneria @it
label: Инженерия @ru
label: 工程服务 @zh
label: 工程服務 @zh-hant
label: 엔지니어링서비스업 @ko
label: ｴﾝｼﾞﾆｱﾘﾝｸﾞｻｰﾋﾞｽ @ja
definition: This industry subgroup includes companies that provide engineering services, such as design, development, and feasibility study services, but do not actually execute the project.
notation: 17111310
valid from: 2024-06-07

Cable Line Construction
type: BicsLevel6Segment
type: Classifier
type: NamedIndividual
is level6 segment of: Communication Infra Const
is contemporary version of: http://data.ga-group.nl/ics/bics/171113111010
is version of: http://data.ga-group.nl/ics/bics/171113111010
replaces: http://data.ga-group.nl/ics/bics/2020/171113111010
imported on: 2026-06-08T13:40:52.236Z
last refreshed on: 2026-06-08T13:41:38.450Z
source accessed on: 2024-06-05T14:42:36Z
source last accessed on: 2024-06-05T14:42:36Z
label: Construção linha cabo @pt
label: Construcción línea cable @es
label: Construction de câble @fr
label: Costruzione linee cavo @it
label: Kabelleitungsbau @de
label: Проведение кабеля @ru
label: 电缆线路施工 @zh
label: 電纜工程 @zh-hant
label: 케이블선 건설 @ko
label: ｹｰﾌﾞﾙ線敷設 @ja
definition: This segment includes companies that lay cable and build utility lines used in the telecommunications and utility industries.
notation: 171113111010
valid from: 2024-06-07

Comm & Transmission Const
type: BicsLevel6Segment
type: Classifier
type: NamedIndividual
is level6 segment of: Communication Infra Const
is contemporary version of: http://data.ga-group.nl/ics/bics/171113111011
is version of: http://data.ga-group.nl/ics/bics/171113111011
replaces: http://data.ga-group.nl/ics/bics/2020/171113111011
imported on: 2026-06-08T13:40:52.236Z
last refreshed on: 2026-06-08T13:41:38.450Z
source accessed on: 2024-06-05T14:42:36Z
source last accessed on: 2024-06-05T14:42:36Z
label: Const comunicación y trasmición @es
label: Constr com e transmissão @pt
label: Constr comm/transmission @fr
label: Costruz comm e trasmissione @it
label: Komm.- & Stromübertr.-Infrastrukturbau @de
label: Проведение линий связи и передач @ru
label: 通信基地局建設 @ja
label: 通訊及傳輸塔工程 @zh-hant
label: 通讯与传输建设 @zh
label: 통신 & 전송 건설 @ko
definition: This segment includes companies that build communications and transmission infrastructure, such as cellular phone towers, satellite receiving stations and radio signal transmission towers. Also includes companies that own, operate and rent equipment space on cellular phone towers.
notation: 171113111011
valid from: 2024-06-07

Network Construction
type: BicsLevel6Segment
type: Classifier
type: NamedIndividual
is level6 segment of: Communication Infra Const
is contemporary version of: http://data.ga-group.nl/ics/bics/171113111012
is version of: http://data.ga-group.nl/ics/bics/171113111012
replaces: http://data.ga-group.nl/ics/bics/2020/171113111012
imported on: 2026-06-08T13:40:52.236Z
last refreshed on: 2026-06-08T13:41:38.450Z
source accessed on: 2024-06-05T14:42:36Z
source last accessed on: 2024-06-05T14:42:36Z
label: Construção de rede @pt
label: Construcción de red @es
label: Construction de réseaux @fr
label: Costruzione rete @it
label: Netzwerkbau @de
label: Проводка сетей @ru
label: 網路建構 @zh-hant
label: 网络建设 @zh
label: 네트워크 구축 @ko
label: ﾈｯﾄﾜｰｸ構築 @ja
definition: This segment includes companies that offer specialty network design and construction services to wireless and wireline telecom carriers.
notation: 171113111012
valid from: 2024-06-07

Communication Infra Const
type: BicsLevel5Segment
type: Classifier
type: NamedIndividual
is level5 segment of: Infrastructure Construction
is contemporary version of: http://data.ga-group.nl/ics/bics/1711131110
is version of: http://data.ga-group.nl/ics/bics/1711131110
replaces: http://data.ga-group.nl/ics/bics/2020/1711131110
imported on: 2026-06-08T13:40:52.236Z
last refreshed on: 2026-06-08T13:41:38.450Z
source accessed on: 2024-06-05T14:42:36Z
source last accessed on: 2024-06-05T14:42:36Z
label: Const de infra comunicação @pt
label: Const infra comunicación @es
label: Constr infra communication @fr
label: Costruz infrastrutture comunicazione @it
label: Komm.-Infrastrukturbau @de
label: Строительство коммуник. инфрастр. @ru
label: 通信ｲﾝﾌﾗ建設 @ja
label: 通訊基礎建設營造 @zh-hant
label: 通讯基础设施建设 @zh
label: 커뮤니케이션 기간시설 건설업 @ko
label: 커뮤니케이션 기간시설 건설�� @ko
definition: This segment includes companies that build infrastructure used by the communications industry.
notation: 1711131110
valid from: 2024-06-07

Power Plant Construction
type: BicsLevel6Segment
type: Classifier
type: NamedIndividual
is level6 segment of: Energy Infra Construction
is contemporary version of: http://data.ga-group.nl/ics/bics/171113111110
is version of: http://data.ga-group.nl/ics/bics/171113111110
replaces: http://data.ga-group.nl/ics/bics/2020/171113111110
imported on: 2026-06-08T13:40:52.236Z
last refreshed on: 2026-06-08T13:41:38.450Z
source accessed on: 2024-06-05T14:42:36Z
source last accessed on: 2024-06-05T14:42:36Z
label: Construção usina elétrica @pt
label: Construcción de planta de electricidad @es
label: Construction usines électriques @fr
label: Costruzione centrali elettriche @it
label: Kraftwerkbau @de
label: Строительство электростанций @ru
label: 发电厂建设 @zh
label: 発電所建設 @ja
label: 電廠營建 @zh-hant
label: 발전소 건설 @ko
definition: This segment includes companies that construct electricity generation facilities that do not use renewable energy sources or nuclear energy for power (see Development & Construction or Nuclear Power Construction).
notation: 171113111110
valid from: 2024-06-07

Nuclear Power Construction
type: BicsLevel6Segment
type: Classifier
type: NamedIndividual
is level6 segment of: Energy Infra Construction
is contemporary version of: http://data.ga-group.nl/ics/bics/171113111111
is version of: http://data.ga-group.nl/ics/bics/171113111111
replaces: http://data.ga-group.nl/ics/bics/2020/171113111111
imported on: 2026-06-08T13:40:52.236Z
last refreshed on: 2026-06-08T13:41:38.450Z
source accessed on: 2024-06-05T14:42:36Z
source last accessed on: 2024-06-05T14:42:36Z
label: Const cent nucléaire @fr
label: Constr de energia nuclear @pt
label: Costruz cen nucleari @it
label: Kernkraftwerkbau @de
label: Plantas nucleares @es
label: Строительство атомных электростанций @ru
label: 原子力発電所建設 @ja
label: 核电厂工程 @zh
label: 核能電廠工程 @zh-hant
label: 원자력발전소 건설 @ko
definition: This segment includes companies that build nuclear power generation facilities.
notation: 171113111111
valid from: 2024-06-07

Oil & Gas Infra Construction
type: BicsLevel6Segment
type: Classifier
type: NamedIndividual
is level6 segment of: Energy Infra Construction
is contemporary version of: http://data.ga-group.nl/ics/bics/171113111112
is version of: http://data.ga-group.nl/ics/bics/171113111112
replaces: http://data.ga-group.nl/ics/bics/2020/171113111112
imported on: 2026-06-08T13:40:52.236Z
last refreshed on: 2026-06-08T13:41:38.450Z
source accessed on: 2024-06-05T14:42:36Z
source last accessed on: 2024-06-05T14:42:36Z
label: Construção de infra de petróleo e gás @pt
label: Construcción de infr de petróleo y gas @es
label: Construction infra pétrole/gaz @fr
label: Costruzione infra petrolio e gas @it
label: Öl- & Gasinfrastrukturbau @de
label: Нефть/газ - инфрастр. стр-во @ru
label: 石油与天然气基础设施建设 @zh
label: 石油及天然氣基礎建設營造 @zh-hant
label: 石油･ｶﾞｽｲﾝﾌﾗ建設 @ja
label: 석유&가스관 건설업 @ko
definition: This segment includes companies that build oil and gas sector infrastructure, such as refineries, pumping stations, and petrochemical plants.
notation: 171113111112
valid from: 2024-06-07

Energy Infra Construction
type: BicsLevel5Segment
type: Classifier
type: NamedIndividual
is level5 segment of: Infrastructure Construction
is contemporary version of: http://data.ga-group.nl/ics/bics/1711131111
is version of: http://data.ga-group.nl/ics/bics/1711131111
replaces: http://data.ga-group.nl/ics/bics/2020/1711131111
imported on: 2026-06-08T13:40:52.236Z
last refreshed on: 2026-06-08T13:41:38.450Z
source accessed on: 2024-06-05T14:42:36Z
source last accessed on: 2024-06-05T14:42:36Z
label: Construção infra energia @pt
label: Construcción de infraestructura de energía @es
label: Construction infra énergie @fr
label: Costruzione infra energia @it
label: Energieinfrastrukturbau @de
label: Строительство энергетической инфраструктуры @ru
label: 能源基础设施建设 @zh
label: 能源基礎建設營造 @zh-hant
label: 에너지 기간시설 건설업 @ko
label: ｴﾈﾙｷﾞｰｲﾝﾌﾗ建設 @ja
definition: This segment includes companies that build power plants, as well as oil and gas pipelines.
notation: 1711131111
valid from: 2024-06-07

Airport & Highway Const
type: BicsLevel6Segment
type: Classifier
type: NamedIndividual
is level6 segment of: Transportation Infra Const
is contemporary version of: http://data.ga-group.nl/ics/bics/171113111210
is version of: http://data.ga-group.nl/ics/bics/171113111210
replaces: http://data.ga-group.nl/ics/bics/2020/171113111210
imported on: 2026-06-08T13:40:52.236Z
last refreshed on: 2026-06-08T13:41:38.450Z
source accessed on: 2024-06-05T14:42:36Z
source last accessed on: 2024-06-05T14:42:36Z
label: Bau von Flughäfen & Bundesstraßen @de
label: Construção de rodovias e aeroportos @pt
label: Construcción de aeropuertos y carreteras @es
label: Construction d'aéroports et autoroutes @fr
label: Costruzione di autostrade e aeroporti @it
label: Строительство аэропортов и автострад @ru
label: 机场和高速公路建造 @zh
label: 機場及高速公路營造 @zh-hant
label: 空港･高速道路建設 @ja
label: 공항 & 고속도로 건설 @ko
definition: This segment includes companies that build highway and airport infrastructure, including highways, streets, bridges and tunnels, airports, and runways.
notation: 171113111210
valid from: 2024-06-07

Maritime Construction
type: BicsLevel6Segment
type: Classifier
type: NamedIndividual
is level6 segment of: Transportation Infra Const
is contemporary version of: http://data.ga-group.nl/ics/bics/171113111211
is version of: http://data.ga-group.nl/ics/bics/171113111211
replaces: http://data.ga-group.nl/ics/bics/2020/171113111211
imported on: 2026-06-08T13:40:52.236Z
last refreshed on: 2026-06-08T13:41:38.450Z
source accessed on: 2024-06-05T14:42:36Z
source last accessed on: 2024-06-05T14:42:36Z
label: Constr marítima @pt
label: Construcc marítima @es
label: Construct maritime @fr
label: Costruz marittima @it
label: Seebau @de
label: Морское строительство @ru
label: 海上工事 @ja
label: 海洋工程 @zh
label: 海運工程 @zh-hant
label: 해상건설 @ko
definition: This segment includes companies that build maritime infrastructure, such as port facilities and canals.
notation: 171113111211
valid from: 2024-06-07

Railway & Subway Construction
type: BicsLevel6Segment
type: Classifier
type: NamedIndividual
is level6 segment of: Transportation Infra Const
is contemporary version of: http://data.ga-group.nl/ics/bics/171113111212
is version of: http://data.ga-group.nl/ics/bics/171113111212
replaces: http://data.ga-group.nl/ics/bics/2020/171113111212
imported on: 2026-06-08T13:40:52.236Z
last refreshed on: 2026-06-08T13:41:38.450Z
source accessed on: 2024-06-05T14:42:36Z
source last accessed on: 2024-06-05T14:42:36Z
label: Const ch de fer et métro @fr
label: Constr de ferrocarriles y subterráneos @es
label: Construção de ferrovias e metrô @pt
label: Costruzione ferrovie e metro @it
label: Eisen- & U-Bahnbau @de
label: Строит-во метро и ж/д @ru
label: 鉄道･地下鉄建設 @ja
label: 鐵路/隧道/地鐵工程 @zh-hant
label: 铁路和地铁工程 @zh
label: 철도 및 지하철 건설 @ko
definition: This segment includes companies that build train and subway infrastructure, including railway lines, railway roadbeds, subways, and tunnels.
notation: 171113111212
valid from: 2024-06-07

Transportation Infra Const
type: BicsLevel5Segment
type: Classifier
type: NamedIndividual
is level5 segment of: Infrastructure Construction
is contemporary version of: http://data.ga-group.nl/ics/bics/1711131112
is version of: http://data.ga-group.nl/ics/bics/1711131112
replaces: http://data.ga-group.nl/ics/bics/2020/1711131112
imported on: 2026-06-08T13:40:52.236Z
last refreshed on: 2026-06-08T13:41:38.450Z
source accessed on: 2024-06-05T14:42:36Z
source last accessed on: 2024-06-05T14:42:36Z
label: Const infra de transporte @es
label: Constr infra transport @fr
label: Constr infra transportes @pt
label: Costruc infra trasporto @it
label: Transportinfrastrukturbau @de
label: Строительство транспортной инфраструктуры @ru
label: 交通运输基础设施建设 @zh
label: 交通運輸基礎建設營造 @zh-hant
label: 交通ｲﾝﾌﾗ建設 @ja
label: 교통기간시설건설업 @ko
definition: This segment includes companies that build transportation infrastructure, such as highways, railways, and ports.
notation: 1711131112
valid from: 2024-06-07

Electric Utility Line Const
type: BicsLevel6Segment
type: Classifier
type: NamedIndividual
is level6 segment of: Utility Line Construction
is contemporary version of: http://data.ga-group.nl/ics/bics/171113111310
is version of: http://data.ga-group.nl/ics/bics/171113111310
replaces: http://data.ga-group.nl/ics/bics/2020/171113111310
imported on: 2026-06-08T13:40:52.236Z
last refreshed on: 2026-06-08T13:41:38.450Z
source accessed on: 2024-06-05T14:42:36Z
source last accessed on: 2024-06-05T14:42:36Z
label: Bau der elektrischen Versorgungslinie @de
label: Construção de linha de serviços públicos de energia @pt
label: Construcción de línea eléctrica @es
label: Construction de conduites électriques @fr
label: Costruzione linee elettriche @it
label: Нефте-газовые услуги @ru
label: 电力公司管线建设 @zh
label: 配電網敷設 @ja
label: 電力公用事業管線建造 @zh-hant
label: 전기 유틸리티 라인 건설 @ko
definition: This segment includes companies that construct the distribution lines for electricity as well as the structures integral for long-distance power lines.
notation: 171113111310
valid from: 2024-06-07

Gas Utility Line Construction
type: BicsLevel6Segment
type: Classifier
type: NamedIndividual
is level6 segment of: Utility Line Construction
is contemporary version of: http://data.ga-group.nl/ics/bics/171113111311
is version of: http://data.ga-group.nl/ics/bics/171113111311
replaces: http://data.ga-group.nl/ics/bics/2020/171113111311
imported on: 2026-06-08T13:40:52.236Z
last refreshed on: 2026-06-08T13:41:38.450Z
source accessed on: 2024-06-05T14:42:36Z
source last accessed on: 2024-06-05T14:42:36Z
label: Construção de linha de abastecimento de gás @pt
label: Construcción de línea de gas @es
label: Construction de conduites de gaz @fr
label: Costruzione linee gas @it
label: Erdgasversorgungsleitungsbau @de
label: Строительство газовых магистралей @ru
label: 天然氣公用事業管線建造 @zh-hant
label: 燃气公司管线建设 @zh
label: 配ｶﾞｽ網敷設 @ja
label: 가스 유틸리티 라인 건설 @ko
definition: This segment includes companies that build natural gas transmission and distribution infrastructure. Such activities do not include the manufacture of equipment or the continued operation of infrastructure subsequent to its construction.
notation: 171113111311
valid from: 2024-06-07

Water Utility Line Construction
type: BicsLevel6Segment
type: Classifier
type: NamedIndividual
is level6 segment of: Utility Line Construction
is contemporary version of: http://data.ga-group.nl/ics/bics/171113111312
is version of: http://data.ga-group.nl/ics/bics/171113111312
replaces: http://data.ga-group.nl/ics/bics/2020/171113111312
imported on: 2026-06-08T13:40:52.236Z
last refreshed on: 2026-06-08T13:41:38.450Z
source accessed on: 2024-06-05T14:42:36Z
source last accessed on: 2024-06-05T14:42:36Z
label: Construção de linha de abastecimento de água @pt
label: Construcción de línea de agua @es
label: Construction de conduites d'eau @fr
label: Costruzione acquedotti @it
label: Wasserversorgungsleitungsbau @de
label: Строительство коммун. водоснабжения @ru
label: 供水公司管线建设 @zh
label: 水利公用事業管線建造 @zh-hant
label: 配水管敷設 @ja
label: 수도 유틸리티 라인 건설 @ko
definition: This segment includes companies that build water treatment and distribution infrastructure. Such activities do not include the manufacture of equipment or the continued operation of infrastructure subsequent to its construction.
notation: 171113111312
valid from: 2024-06-07

Utility Line Construction
type: BicsLevel5Segment
type: Classifier
type: NamedIndividual
is level5 segment of: Infrastructure Construction
is contemporary version of: http://data.ga-group.nl/ics/bics/1711131113
is version of: http://data.ga-group.nl/ics/bics/1711131113
replaces: http://data.ga-group.nl/ics/bics/2020/1711131113
imported on: 2026-06-08T13:40:52.236Z
last refreshed on: 2026-06-08T13:41:38.450Z
source accessed on: 2024-06-05T14:42:36Z
source last accessed on: 2024-06-05T14:42:36Z
label: Construção de linha de abastecimento @pt
label: Construcción de línea de servicios públicos @es
label: Construction de conduites @fr
label: Costruzione linee elettriche @it
label: Versorgungsleitungsbau @de
label: Строительство подземных коммуникаций @ru
label: 公用事業管線建造 @zh-hant
label: 公用设施管线建设 @zh
label: 公益事業ｲﾝﾌﾗ建設 @ja
label: 유틸리티 라인 건설 @ko
definition: This segment includes companies that build utility network infrastructure.
notation: 1711131113
valid from: 2024-06-07

Infrastructure Construction
type: BicsLevel4SubIndustry
type: Classifier
type: NamedIndividual
is sub industry of: Engineering & Construction
is contemporary version of: http://data.ga-group.nl/ics/bics/17111311
is version of: http://data.ga-group.nl/ics/bics/17111311
replaces: http://data.ga-group.nl/ics/bics/2020/17111311
imported on: 2026-06-08T13:40:52.236Z
last refreshed on: 2026-06-08T13:41:38.450Z
source accessed on: 2024-06-05T14:42:36Z
source last accessed on: 2024-06-05T14:42:36Z
label: Construção infraestrutura @pt
label: Construcción de infraestructura @es
label: Construction d'infrastructures @fr
label: Costruzione infrastruttura @it
label: Infrastrukturbau @de
label: Строительство инфраструктуры @ru
label: 基础设施建设 @zh
label: 基礎建設營造 @zh-hant
label: 기간시설 건설업 @ko
label: ｲﾝﾌﾗ建設 @ja
definition: This industry subgroup includes companies that construct structures, or fixed networks primarily for communications, energy, transportation, or utility purposes.
notation: 17111311
valid from: 2024-06-07

Commercial Building Const
type: BicsLevel5Segment
type: Classifier
type: NamedIndividual
is level5 segment of: Building Construction
is contemporary version of: http://data.ga-group.nl/ics/bics/1711131210
is version of: http://data.ga-group.nl/ics/bics/1711131210
replaces: http://data.ga-group.nl/ics/bics/2020/1711131210
imported on: 2026-06-08T13:40:52.236Z
last refreshed on: 2026-06-08T13:41:38.450Z
source accessed on: 2024-06-05T14:42:36Z
source last accessed on: 2024-06-05T14:42:36Z
label: Construção de prédio comercial @pt
label: Construction d'immeubles commerciaux @fr
label: Costruzioni commerciali @it
label: Edificación no comercial @es
label: Errichtung von gewerblichen Gebäuden @de
label: Строительство коммерческих зданий @ru
label: 商业建筑工程 @zh
label: 商業建築工程 @zh-hant
label: 商業用建物建設 @ja
label: 상업용 건물 건설업 @ko
definition: This segment includes companies that construct commercial buildings, such as malls and shopping centers.
notation: 1711131210
valid from: 2024-06-07

Residential Building Const
type: BicsLevel5Segment
type: Classifier
type: NamedIndividual
is level5 segment of: Building Construction
is contemporary version of: http://data.ga-group.nl/ics/bics/1711131211
is version of: http://data.ga-group.nl/ics/bics/1711131211
replaces: http://data.ga-group.nl/ics/bics/2020/1711131211
imported on: 2026-06-08T13:40:52.236Z
last refreshed on: 2026-06-08T13:41:38.450Z
source accessed on: 2024-06-05T14:42:36Z
source last accessed on: 2024-06-05T14:42:36Z
label: Const d'immeuble résid @fr
label: Const residencial @es
label: Constr edif residenciais @pt
label: Costruzione edifici residenziali @it
label: Wohnbau @de
label: Жилое стр-во @ru
label: 住宅楼房建造 @zh
label: 住宅營建 @zh-hant
label: 住宅ﾋﾞﾙ建設 @ja
label: 주거용 건물 건설 @ko
definition: This segment includes companies that construct multi-story condominiums or apartment buildings.
notation: 1711131211
valid from: 2024-06-07

Industrial Buildings Const
type: BicsLevel5Segment
type: Classifier
type: NamedIndividual
is level5 segment of: Building Construction
is contemporary version of: http://data.ga-group.nl/ics/bics/1711131212
is version of: http://data.ga-group.nl/ics/bics/1711131212
replaces: http://data.ga-group.nl/ics/bics/2020/1711131212
imported on: 2026-06-08T13:40:52.236Z
last refreshed on: 2026-06-08T13:41:38.450Z
source accessed on: 2024-06-05T14:42:36Z
source last accessed on: 2024-06-05T14:42:36Z
label: Bâtiments industriels @fr
label: Const edificios industriales @es
label: Const prédios industriais @pt
label: Costruz edifici industriali @it
label: Industriegebäudebau @de
label: Промышленные здания - строительство @ru
label: 工业建筑建设 @zh
label: 工業建築工程 @zh-hant
label: 産業用建築建設 @ja
label: 산업용건물건설업 @ko
definition: This segment includes companies that construct industrial buildings, such as warehouses and industrial parks.
notation: 1711131212
valid from: 2024-06-07

Institutional Buildings Const
type: BicsLevel5Segment
type: Classifier
type: NamedIndividual
is level5 segment of: Building Construction
is contemporary version of: http://data.ga-group.nl/ics/bics/1711131213
is version of: http://data.ga-group.nl/ics/bics/1711131213
replaces: http://data.ga-group.nl/ics/bics/2020/1711131213
imported on: 2026-06-08T13:40:52.236Z
last refreshed on: 2026-06-08T13:41:38.450Z
source accessed on: 2024-06-05T14:42:36Z
source last accessed on: 2024-06-05T14:42:36Z
label: Bâtiments institutionnels @fr
label: Const de edificios institucionales @es
label: Const prédios institucionais @pt
label: Costruz edifici istituzionali @it
label: Institutioneller Gebäudebau @de
label: Строительство учреждений @ru
label: 公共機関建物建設 @ja
label: 机构建筑建设 @zh
label: 機構建築工程 @zh-hant
label: 기관 건물 건설 @ko
definition: This segment includes companies that construct institutional buildings, such as government and religious buildings.
notation: 1711131213
valid from: 2024-06-07

Building Construction
type: BicsLevel4SubIndustry
type: Classifier
type: NamedIndividual
is sub industry of: Engineering & Construction
is contemporary version of: http://data.ga-group.nl/ics/bics/17111312
is version of: http://data.ga-group.nl/ics/bics/17111312
replaces: http://data.ga-group.nl/ics/bics/2020/17111312
imported on: 2026-06-08T13:40:52.236Z
last refreshed on: 2026-06-08T13:41:38.450Z
source accessed on: 2024-06-05T14:42:36Z
source last accessed on: 2024-06-05T14:42:36Z
label: Construção de edificações @pt
label: Construc de bâtiments @fr
label: Construcción de edificios @es
label: Costruzione edile @it
label: Gebäudebau @de
label: Строительство зданий @ru
label: 建物建設 @ja
label: 楼房建造 @zh
label: 非住宅建築營建 @zh-hant
label: 건물 건축 @ko
definition: This industry subgroup includes companies that construct buildings. Typically, these buildings are large, multi-storied, composed of steel or concrete, and are for commercial or industrial use.
notation: 17111312
valid from: 2024-06-07

Engineering & Construction
type: BicsLevel3Industry
type: Classifier
type: NamedIndividual
is industry of: Industrial Services
is contemporary version of: http://data.ga-group.nl/ics/bics/171113
is version of: http://data.ga-group.nl/ics/bics/171113
replaces: http://data.ga-group.nl/ics/bics/2020/171113
imported on: 2026-06-08T13:40:52.236Z
last refreshed on: 2026-06-08T13:41:38.450Z
source accessed on: 2024-06-05T14:42:36Z
source last accessed on: 2024-06-05T14:42:36Z
label: Engenharia e construção @pt
label: Ingénierie et construction @fr
label: Ingegneria e costruzione @it
label: Ingeniería y construcción @es
label: Technik & Bau @de
label: Проект./строительство @ru
label: 工程与建筑 @zh
label: 營建及工程服務 @zh-hant
label: 엔지니어링 & 건설 @ko
label: ｴﾝｼﾞﾆｱﾘﾝｸﾞ･土木建設 @ja
definition: This industry includes companies involved in the construction and engineering fields.
notation: 171113
valid from: 2024-06-07

Industrial Services
type: BicsLevel2IndustryGroup
type: Classifier
type: NamedIndividual
is industry group of: Industrials
is contemporary version of: http://data.ga-group.nl/ics/bics/1711
is version of: http://data.ga-group.nl/ics/bics/1711
replaces: http://data.ga-group.nl/ics/bics/2020/1711
imported on: 2026-06-08T13:40:52.236Z
last refreshed on: 2026-06-08T13:41:38.450Z
source accessed on: 2024-06-05T14:42:36Z
source last accessed on: 2024-06-05T14:42:36Z
label: Industrielle Dienstleistungen @de
label: Serviços industriais @pt
label: Services industriels @fr
label: Servicios industriales @es
label: Servizi industriali @it
label: Произ.-тех. услуги @ru
label: 工业服务 @zh
label: 工業服務 @zh-hant
label: 産業ｻｰﾋﾞｽ @ja
label: 산업서비스 @ko
definition: This industry group includes companies that provide services to industrial or commercial consumers.
notation: 1711
valid from: 2024-06-07

Industrials
type: BicsLevel1Sector
type: Classifier
type: NamedIndividual
is contemporary version of: http://data.ga-group.nl/ics/bics/17
is version of: http://data.ga-group.nl/ics/bics/17
replaces: http://data.ga-group.nl/ics/bics/2020/17
imported on: 2026-06-08T13:40:52.236Z
last refreshed on: 2026-06-08T13:41:38.450Z
source accessed on: 2024-06-05T14:42:36Z
source last accessed on: 2024-06-05T14:42:36Z
label: Industriais @pt
label: Industriales @es
label: Industriali @it
label: Industrie @de
label: Промышл. @ru
label: 工业 @zh
label: 工業 @ja
label: 공산업 @ko
definition: This sector includes companies that manufacture, distribute, and provide industrial products and services.
notation: 17
valid from: 2024-06-07

Fungicides
type: BicsLevel6Segment
type: Classifier
type: NamedIndividual
is level6 segment of: Crop Chemicals
is contemporary version of: http://data.ga-group.nl/ics/bics/181010101010
is version of: http://data.ga-group.nl/ics/bics/181010101010
replaces: http://data.ga-group.nl/ics/bics/2020/181010101010
imported on: 2026-06-08T13:40:52.236Z
last refreshed on: 2026-06-08T13:41:38.450Z
source accessed on: 2024-06-05T14:42:36Z
source last accessed on: 2024-06-05T14:42:36Z
label: Fongicides @fr
label: Funghicidi @it
label: Fungicidas @es
label: Fungizide @de
label: Фунгициды @ru
label: 杀菌剂 @zh
label: 殺菌剤 @ja
label: 殺菌劑 @zh-hant
label: 살진균제 @ko
definition: This segment includes companies that manufacture chemicals that kill or inhibit growth of fungi or fungal spores.
notation: 181010101010
valid from: 2024-06-07

Herbicides
type: BicsLevel6Segment
type: Classifier
type: NamedIndividual
is level6 segment of: Crop Chemicals
is contemporary version of: http://data.ga-group.nl/ics/bics/181010101011
is version of: http://data.ga-group.nl/ics/bics/181010101011
replaces: http://data.ga-group.nl/ics/bics/2020/181010101011
imported on: 2026-06-08T13:40:52.236Z
last refreshed on: 2026-06-08T13:41:38.450Z
source accessed on: 2024-06-05T14:42:36Z
source last accessed on: 2024-06-05T14:42:36Z
label: Erbicidi @it
label: Herbicidas @es
label: Herbizide @de
label: Гербициды @ru
label: 除草剂 @zh
label: 除草剤 @ja
label: 除草劑 @zh-hant
label: 제초제 @ko
definition: This segment includes companies that manufacture chemicals that kill or inhibit growth of unwanted plants.
notation: 181010101011
valid from: 2024-06-07

Insecticides
type: BicsLevel6Segment
type: Classifier
type: NamedIndividual
is level6 segment of: Crop Chemicals
is contemporary version of: http://data.ga-group.nl/ics/bics/181010101012
is version of: http://data.ga-group.nl/ics/bics/181010101012
replaces: http://data.ga-group.nl/ics/bics/2020/181010101012
imported on: 2026-06-08T13:40:52.236Z
last refreshed on: 2026-06-08T13:41:38.450Z
source accessed on: 2024-06-05T14:42:36Z
source last accessed on: 2024-06-05T14:42:36Z
label: Insecticidas @es
label: Insektizide @de
label: Inseticidas @pt
label: Insetticidi @it
label: Инсектициды @ru
label: 杀虫剂 @zh
label: 殺虫剤 @ja
label: 殺蟲劑 @zh-hant
label: 殺���劑 @zh-hant
label: 살충제 @ko
definition: This segment includes companies that manufacture chemicals that kill or deter insects.
notation: 181010101012
valid from: 2024-06-07

Crop Chemicals
type: BicsLevel5Segment
type: Classifier
type: NamedIndividual
is level5 segment of: Agricultural Chemicals
is contemporary version of: http://data.ga-group.nl/ics/bics/1810101010
is version of: http://data.ga-group.nl/ics/bics/1810101010
replaces: http://data.ga-group.nl/ics/bics/2020/1810101010
imported on: 2026-06-08T13:40:52.236Z
last refreshed on: 2026-06-08T13:41:38.450Z
source accessed on: 2024-06-05T14:42:36Z
source last accessed on: 2024-06-05T14:42:36Z
label: Coltivazione chimici @it
label: Nutzpflanzenchemikalien @de
label: Prod químicos p/safra @pt
label: Produits chimiques récoltes @fr
label: Químicos de cosechas @es
label: Пестициды @ru
label: 作物保护化学品 @zh
label: 作物化學品 @zh-hant
label: 農薬 @ja
label: 작물 화학제품 @ko
definition: This segment includes companies that manufacture chemicals that kill or deter various pests or threats to crops.
notation: 1810101010
valid from: 2024-06-07

Fertilizer Blending & Distr
type: BicsLevel6Segment
type: Classifier
type: NamedIndividual
is level6 segment of: Fertilizers
is contemporary version of: http://data.ga-group.nl/ics/bics/181010101110
is version of: http://data.ga-group.nl/ics/bics/181010101110
replaces: http://data.ga-group.nl/ics/bics/2020/181010101110
imported on: 2026-06-08T13:40:52.236Z
last refreshed on: 2026-06-08T13:41:38.450Z
source accessed on: 2024-06-05T14:42:36Z
source last accessed on: 2024-06-05T14:42:36Z
label: Düngermittelmischung & -vertrieb @de
label: Distr e mistura fertilizantes @pt
label: Distrib e miscela fertilizzanti @it
label: Mélange/distrib d'engrais @fr
label: Mezclado y distribución de fertilizantes @es
label: Смешивание и распр. удобрений @ru
label: 肥料混合物分销 @zh
label: 肥料混拌/經銷 @zh-hant
label: 肥料配合･販売 @ja
label: 비료 배합 & 유통 @ko
definition: This segment includes companies that blend and source fertilizer materials from suppliers. Excludes companies that manufacture the underlying fertilizer materials.
notation: 181010101110
valid from: 2024-06-07

Nitrogenous Fertilizers
type: BicsLevel6Segment
type: Classifier
type: NamedIndividual
is level6 segment of: Fertilizers
is contemporary version of: http://data.ga-group.nl/ics/bics/181010101111
is version of: http://data.ga-group.nl/ics/bics/181010101111
replaces: http://data.ga-group.nl/ics/bics/2020/181010101111
imported on: 2026-06-08T13:40:52.236Z
last refreshed on: 2026-06-08T13:41:38.450Z
source accessed on: 2024-06-05T14:42:36Z
source last accessed on: 2024-06-05T14:42:36Z
label: Engrais azotés @fr
label: Fertilizantes nitrogenados @es
label: Fertilizzante azotato @it
label: Stickstoffdüngemittel @de
label: Азотные удобрения @ru
label: 氮肥 @zh
label: 窒素質肥料 @ja
label: 질소화학비료 @ko
definition: This segment includes companies that manufacture fertilizers used as a source of nitrogen nutrition for plants. Includes ammonia fertilizers, nitrate fertilizers, and amide fertilizers.
notation: 181010101111
valid from: 2024-06-07

Phosphate Fertilizers
type: BicsLevel6Segment
type: Classifier
type: NamedIndividual
is level6 segment of: Fertilizers
is contemporary version of: http://data.ga-group.nl/ics/bics/181010101112
is version of: http://data.ga-group.nl/ics/bics/181010101112
replaces: http://data.ga-group.nl/ics/bics/2020/181010101112
imported on: 2026-06-08T13:40:52.236Z
last refreshed on: 2026-06-08T13:41:38.450Z
source accessed on: 2024-06-05T14:42:36Z
source last accessed on: 2024-06-05T14:42:36Z
label: Engrais phosphatés @fr
label: Fertilizantes de fosfato @es
label: Fertilizantes fosfato @pt
label: Fertilizzanti fosfati @it
label: Phosphatdüngemittel @de
label: Фосфорные удобрения @ru
label: 磷肥 @zh
label: 磷酸肥料 @zh-hant
label: 인산염 비료 @ko
label: ﾘﾝ酸肥料 @ja
definition: This segment includes companies that manufacture fertilizers based on rock phosphate. Includes monoammonium phosphate (MAP), diammonium phosphate (DAP), and ammonium polyphosphate (APP).
notation: 181010101112
valid from: 2024-06-07

Potassium Fertilizers
type: BicsLevel6Segment
type: Classifier
type: NamedIndividual
is level6 segment of: Fertilizers
is contemporary version of: http://data.ga-group.nl/ics/bics/181010101113
is version of: http://data.ga-group.nl/ics/bics/181010101113
replaces: http://data.ga-group.nl/ics/bics/2020/181010101113
imported on: 2026-06-08T13:40:52.236Z
last refreshed on: 2026-06-08T13:41:38.450Z
source accessed on: 2024-06-05T14:42:36Z
source last accessed on: 2024-06-05T14:42:36Z
label: Engrais potassiques @fr
label: Fertilizantes de potasio @es
label: Fertilizantes potássio @pt
label: Fertilizzanti potassio @it
label: Kaliumdüngemittel @de
label: Калиевые удобрения @ru
label: 鉀肥 @zh-hant
label: 钾肥 @zh
label: 칼륨 비료 @ko
label: ｶﾘ肥料 @ja
definition: This segment includes companies that manufacture fertilizers based on potassium. Includes potassium chloride, potassium sulphate, and monopotassium phosphate.
notation: 181010101113
valid from: 2024-06-07

Fertilizers
type: BicsLevel5Segment
type: Classifier
type: NamedIndividual
is level5 segment of: Agricultural Chemicals
is contemporary version of: http://data.ga-group.nl/ics/bics/1810101011
is version of: http://data.ga-group.nl/ics/bics/1810101011
replaces: http://data.ga-group.nl/ics/bics/2020/1810101011
imported on: 2026-06-08T13:40:52.236Z
last refreshed on: 2026-06-08T13:41:38.450Z
source accessed on: 2024-06-05T14:42:36Z
source last accessed on: 2024-06-05T14:42:36Z
label: Düngemittel @de
label: Engrais @fr
label: Fertilizantes @es
label: Fertilizzanti @it
label: Удобрения @ru
label: 肥料 @ja
label: 비료 @ko
definition: This segment includes companies that manufacture chemicals that supply nutrients to plants.
notation: 1810101011
valid from: 2024-06-07

Seeds & Agriculture Biotech
type: BicsLevel5Segment
type: Classifier
type: NamedIndividual
is level5 segment of: Agricultural Chemicals
is contemporary version of: http://data.ga-group.nl/ics/bics/1810101012
is version of: http://data.ga-group.nl/ics/bics/1810101012
replaces: http://data.ga-group.nl/ics/bics/2020/1810101012
imported on: 2026-06-08T13:40:52.236Z
last refreshed on: 2026-06-08T13:41:38.450Z
source accessed on: 2024-06-05T14:42:36Z
source last accessed on: 2024-06-05T14:42:36Z
label: Biotech graines et agriculture @fr
label: Biotecnología de semillas y agrícola @es
label: Saatgut und Agrarbiotechnologie @de
label: Sementes e biotecnologia agrícola @pt
label: Semi e agricoltura biotech @it
label: Семена и с/хоз. биотехнологии @ru
label: 种子与农业生物科技 @zh
label: 種子及農業生物科技 @zh-hant
label: 農業ﾊﾞｲｵﾃｯｸ製品 @ja
label: 종자 및 농업 생명공학 @ko
definition: This segment includes companies that research and develop patented seed and agricultural products. Revenue is primarily realized through patents and may include integrated manufacturing or licensing of patents. Includes genetic engineering of seeds and crops.
notation: 1810101012
valid from: 2024-06-07

Agricultural Chemicals
type: BicsLevel4SubIndustry
type: Classifier
type: NamedIndividual
is sub industry of: Chemicals
is contemporary version of: http://data.ga-group.nl/ics/bics/18101010
is version of: http://data.ga-group.nl/ics/bics/18101010
replaces: http://data.ga-group.nl/ics/bics/2020/18101010
imported on: 2026-06-08T13:40:52.236Z
last refreshed on: 2026-06-08T13:41:38.450Z
source accessed on: 2024-06-05T14:42:36Z
source last accessed on: 2024-06-05T14:42:36Z
label: LaWi-Chemikalien @de
label: Prod chim agricoles @fr
label: Prod chimici agricoli @it
label: Prod quím agríc @pt
label: Químicos agrícolas @es
label: Qu��micos agrícolas @es
label: С/х химикаты @ru
label: 农用化学品 @zh
label: 農業化学品 @ja
label: 農業化學品 @zh-hant
label: 농업용 화학제품 @ko
definition: This industry subgroup includes companies that manufacture chemicals used in agricultural operations.
notation: 18101010
valid from: 2024-06-07

Alkalis & Chlorine
type: BicsLevel6Segment
type: Classifier
type: NamedIndividual
is level6 segment of: Inorganic Base Chemicals
is contemporary version of: http://data.ga-group.nl/ics/bics/181010111010
is version of: http://data.ga-group.nl/ics/bics/181010111010
replaces: http://data.ga-group.nl/ics/bics/2020/181010111010
imported on: 2026-06-08T13:40:52.236Z
last refreshed on: 2026-06-08T13:41:38.450Z
source accessed on: 2024-06-05T14:42:36Z
source last accessed on: 2024-06-05T14:42:36Z
label: Alcali e cloro @it
label: Alcalis et chlore @fr
label: Alkali & Chlor @de
label: Álcalis e cloro @pt
label: álcalies y cloro @es
label: Щелочи и хлор @ru
label: 烧碱制造 @zh
label: 鹼性物及氯化物 @zh-hant
label: 알칼리&염기제품 @ko
label: ｱﾙｶﾘ･塩素 @ja
definition: This segment includes companies that manufacture chemicals derived from chloralkali chemical processes. Includes alkalis, chlorine, and caustic soda.
notation: 181010111010
valid from: 2024-06-07

Bulk Acids
type: BicsLevel6Segment
type: Classifier
type: NamedIndividual
is level6 segment of: Inorganic Base Chemicals
is contemporary version of: http://data.ga-group.nl/ics/bics/181010111011
is version of: http://data.ga-group.nl/ics/bics/181010111011
replaces: http://data.ga-group.nl/ics/bics/2020/181010111011
imported on: 2026-06-08T13:40:52.236Z
last refreshed on: 2026-06-08T13:41:38.450Z
source accessed on: 2024-06-05T14:42:36Z
source last accessed on: 2024-06-05T14:42:36Z
label: Acides en masse @fr
label: Acidi all'ingrosso @it
label: Säure in Bulk @de
label: Ácidos másicos @es
label: Ácidos volume @pt
label: Кислоты оптом @ru
label: 散装酸 @zh
label: 散裝酸 @zh-hant
label: 벌크산 @ko
label: ﾊﾞﾙｸ酸 @ja
definition: This segment includes companies that manufacture inorganic acids. Includes mineral acid, hydrochloric acid, nitric acid, phosphoric acid, sulfuric acid, boric acid, hydrofluoric acid, and perchloric acid.
notation: 181010111011
valid from: 2024-06-07

Hydrogen
type: BicsLevel7Segment
type: Classifier
type: NamedIndividual
is level7 segment of: Industrial Gas
is contemporary version of: http://data.ga-group.nl/ics/bics/18101011101210
is version of: http://data.ga-group.nl/ics/bics/18101011101210
replaces: http://data.ga-group.nl/ics/bics/2020/18101011101210
imported on: 2026-06-08T13:40:52.236Z
last refreshed on: 2026-06-08T13:41:38.450Z
source accessed on: 2024-06-05T14:42:36Z
source last accessed on: 2024-06-05T14:42:36Z
label: Hidrógeno @es
label: Hidrogênio @pt
label: Hydrogène @fr
label: Idrogeno @it
label: Wasserstoff @de
label: Водород @ru
label: 氢气 @zh
label: 氫氣 @zh-hant
label: 水素 @ja
label: 수소 @ko
definition: This segment includes companies that manufacture hydrogen gas.
notation: 18101011101210
valid from: 2024-06-07

Ammonia
type: BicsLevel7Segment
type: Classifier
type: NamedIndividual
is level7 segment of: Industrial Gas
is contemporary version of: http://data.ga-group.nl/ics/bics/18101011101211
is version of: http://data.ga-group.nl/ics/bics/18101011101211
replaces: http://data.ga-group.nl/ics/bics/2020/18101011101211
imported on: 2026-06-08T13:40:52.236Z
last refreshed on: 2026-06-08T13:41:38.450Z
source accessed on: 2024-06-05T14:42:36Z
source last accessed on: 2024-06-05T14:42:36Z
label: Amônia @pt
label: Ammoniac @fr
label: Ammoniaca @it
label: Ammoniak @de
label: Amoníaco @es
label: Аммиак @ru
label: 氨 @zh
label: 암모니아 @ko
label: ｱﾝﾓﾆｱ @ja
definition: This segment includes companies that manufacture ammonia gas.
notation: 18101011101211
valid from: 2024-06-07

Industrial Gas
type: BicsLevel6Segment
type: Classifier
type: NamedIndividual
is level6 segment of: Inorganic Base Chemicals
is contemporary version of: http://data.ga-group.nl/ics/bics/181010111012
is version of: http://data.ga-group.nl/ics/bics/181010111012
replaces: http://data.ga-group.nl/ics/bics/2020/181010111012
imported on: 2026-06-08T13:40:52.236Z
last refreshed on: 2026-06-08T13:41:38.450Z
source accessed on: 2024-06-05T14:42:36Z
source last accessed on: 2024-06-05T14:42:36Z
label: Gás industrial @pt
label: Gas industrial @es
label: Gaz industriels @fr
label: Industriegase @de
label: Prod gas industriale @it
label: Промышленный газ @ru
label: 工业气体生产 @zh
label: 工業用氣體 @zh-hant
label: 工業用ｶﾞｽ @ja
label: 산업용가스 @ko
definition: This segment includes companies that manufacture industrial organic and inorganic gases in liquid, solid and compressed forms. These gases include basic elemental gases as well as compound gases. Includes carbon dioxide, dry ice, helium, neon, nitrogen and oxygen.
notation: 181010111012
valid from: 2024-06-07

Inorganic Base Chemicals
type: BicsLevel5Segment
type: Classifier
type: NamedIndividual
is level5 segment of: Basic & Diversified Chemicals
is contemporary version of: http://data.ga-group.nl/ics/bics/1810101110
is version of: http://data.ga-group.nl/ics/bics/1810101110
replaces: http://data.ga-group.nl/ics/bics/2020/1810101110
imported on: 2026-06-08T13:40:52.236Z
last refreshed on: 2026-06-08T13:41:38.450Z
source accessed on: 2024-06-05T14:42:36Z
source last accessed on: 2024-06-05T14:42:36Z
label: Anorganische Basischemikalien @de
label: Prod chimici inorganici di base @it
label: Prod chimiques base inorganiques @fr
label: Prod químicos base inorgânica @pt
label: Químicos de base inorgánica @es
label: Химические продукты с неорганическим основанием @ru
label: 无机化工基地 @zh
label: 無機化学品 @ja
label: 無機化學品 @zh-hant
label: 무기질베이스 화학제품 @ko
definition: This segment includes companies that manufacture non-carbon-based chemicals in high volumes.
notation: 1810101110
valid from: 2024-06-07

Alcohols
type: BicsLevel6Segment
type: Classifier
type: NamedIndividual
is level6 segment of: Organic Chem & Intermediates
is contemporary version of: http://data.ga-group.nl/ics/bics/181010111110
is version of: http://data.ga-group.nl/ics/bics/181010111110
replaces: http://data.ga-group.nl/ics/bics/2020/181010111110
imported on: 2026-06-08T13:40:52.236Z
last refreshed on: 2026-06-08T13:41:38.450Z
source accessed on: 2024-06-05T14:42:36Z
source last accessed on: 2024-06-05T14:42:36Z
label: Alcoholes @es
label: Alcool @it
label: Alcools @fr
label: Alkohol @de
label: Álcoois @pt
label: Спирты @ru
label: 酒精 @zh-hant
label: 醇 @zh
label: 알코올 @ko
label: ｱﾙｺｰﾙ @ja
definition: This segment includes companies that manufacture industrial alcohols. Includes methanol, petroleum ethanol, and butanol.
notation: 181010111110
valid from: 2024-06-07

Aromatics
type: BicsLevel6Segment
type: Classifier
type: NamedIndividual
is level6 segment of: Organic Chem & Intermediates
is contemporary version of: http://data.ga-group.nl/ics/bics/181010111111
is version of: http://data.ga-group.nl/ics/bics/181010111111
replaces: http://data.ga-group.nl/ics/bics/2020/181010111111
imported on: 2026-06-08T13:40:52.236Z
last refreshed on: 2026-06-08T13:41:38.450Z
source accessed on: 2024-06-05T14:42:36Z
source last accessed on: 2024-06-05T14:42:36Z
label: Aromáticos @es
label: Aromaten @de
label: Aromatici @it
label: Aromatiques @fr
label: Ароматические соединения @ru
label: 芳烃 @zh
label: 芳香族化合物 @ja
label: 芳香烴 @zh-hant
label: 방향제 @ko
definition: This segment includes companies that manufacture aromatic compounds. Includes benzene, toluene, and xylene.
notation: 181010111111
valid from: 2024-06-07

Intermediates
type: BicsLevel6Segment
type: Classifier
type: NamedIndividual
is level6 segment of: Organic Chem & Intermediates
is contemporary version of: http://data.ga-group.nl/ics/bics/181010111112
is version of: http://data.ga-group.nl/ics/bics/181010111112
replaces: http://data.ga-group.nl/ics/bics/2020/181010111112
imported on: 2026-06-08T13:40:52.236Z
last refreshed on: 2026-06-08T13:41:38.450Z
source accessed on: 2024-06-05T14:42:36Z
source last accessed on: 2024-06-05T14:42:36Z
label: Intermédiaires @fr
label: Intermedi @it
label: Intermediários @pt
label: Intermedios @es
label: Zwischenprodukte @de
label: Промежуточные продукты @ru
label: 中間品 @zh-hant
label: 中间体 @zh
label: 媒介物 @ja
label: 중간재 @ko
definition: This segment includes companies that manufacture intermediates. Intermediates are a type of petrochemical produced from stream cracker plants. These are chemicals typically derived from aromatics and olefins. Includes toluene, diisocyanate, vinyl acetate, styrene, ethylene, dichloride, and propylene oxide.
notation: 181010111112
valid from: 2024-06-07

Olefins
type: BicsLevel6Segment
type: Classifier
type: NamedIndividual
is level6 segment of: Organic Chem & Intermediates
is contemporary version of: http://data.ga-group.nl/ics/bics/181010111113
is version of: http://data.ga-group.nl/ics/bics/181010111113
replaces: http://data.ga-group.nl/ics/bics/2020/181010111113
imported on: 2026-06-08T13:40:52.236Z
last refreshed on: 2026-06-08T13:41:38.450Z
source accessed on: 2024-06-05T14:42:36Z
source last accessed on: 2024-06-05T14:42:36Z
label: Alcènes @fr
label: Olefinas @es
label: Olefine @de
label: Olefini @it
label: Олефины @ru
label: 烯烃 @zh
label: 烯烴 @zh-hant
label: 올레핀 @ko
label: ｵﾚﾌｨﾝ @ja
definition: This segment includes companies that manufacture olefins. Olefins are a type of petrochemical. Includes ethylene, propylene and butadiene.
notation: 181010111113
valid from: 2024-06-07

Carbon Black
type: BicsLevel7Segment
type: Classifier
type: NamedIndividual
is level7 segment of: Other Organic Base Chemicals
is contemporary version of: http://data.ga-group.nl/ics/bics/18101011111410
is version of: http://data.ga-group.nl/ics/bics/18101011111410
replaces: http://data.ga-group.nl/ics/bics/2020/18101011111410
imported on: 2026-06-08T13:40:52.236Z
last refreshed on: 2026-06-08T13:41:38.450Z
source accessed on: 2024-06-05T14:42:36Z
source last accessed on: 2024-06-05T14:42:36Z
label: Carbone nero @it
label: Carbono negro @es
label: Fuligem @pt
label: Noir de carbone @fr
label: Rußschwarz @de
label: Сажа @ru
label: 碳粉制造 @zh
label: 碳黑製品 @zh-hant
label: 카본블랙 제조업 @ko
label: ｶｰﾎﾞﾝﾌﾞﾗｯｸ @ja
definition: This segment includes companies that manufacture carbon black as well as bone black and lamp black. These are typically charred or soot by-products.
notation: 18101011111410
valid from: 2024-06-07

Cyclic Crude & Intermed
type: BicsLevel7Segment
type: Classifier
type: NamedIndividual
is level7 segment of: Other Organic Base Chemicals
is contemporary version of: http://data.ga-group.nl/ics/bics/18101011111411
is version of: http://data.ga-group.nl/ics/bics/18101011111411
replaces: http://data.ga-group.nl/ics/bics/2020/18101011111411
imported on: 2026-06-08T13:40:52.236Z
last refreshed on: 2026-06-08T13:41:38.450Z
source accessed on: 2024-06-05T14:42:36Z
source last accessed on: 2024-06-05T14:42:36Z
label: Bruto cíclico e intermediário @pt
label: Crudo cíclico e intermedio @es
label: Greggio e intermed ciclici @it
label: Pétrole cycliques bruts/interméd @fr
label: Zykl. Roh- & Zwischenprodukte @de
label: Циклич. углевод. и полуфабрик. @ru
label: 原型/中型環狀化學品 @zh-hant
label: 环状原料与中间产品 @zh
label: 環式中間物 @ja
label: 순환원유&중간재 @ko
definition: This segment includes companies that distill coal tars and/or manufacture cyclic derivative products from refined petroleum or natural gas. Includes FCC tar, coal tar, and ethylene cracking tar. Excludes asphalt by-products (See Asphalt).
notation: 18101011111411
valid from: 2024-06-07

Gum & Wood
type: BicsLevel7Segment
type: Classifier
type: NamedIndividual
is level7 segment of: Other Organic Base Chemicals
is contemporary version of: http://data.ga-group.nl/ics/bics/18101011111412
is version of: http://data.ga-group.nl/ics/bics/18101011111412
replaces: http://data.ga-group.nl/ics/bics/2020/18101011111412
imported on: 2026-06-08T13:40:52.236Z
last refreshed on: 2026-06-08T13:41:38.450Z
source accessed on: 2024-06-05T14:42:36Z
source last accessed on: 2024-06-05T14:42:36Z
label: Goma e madeira @pt
label: Goma y madera @es
label: Gomma e legno @it
label: Gummi & Holz @de
label: Résines/bois @fr
label: Смолы и древесина @ru
label: 天然樹脂木材化学品 @ja
label: 树脂及林产化学品制造 @zh
label: 樹膠及樹木 @zh-hant
label: 수지&목재 @ko
definition: This segment includes companies that distill plant gums or wood into products. Includes turpentine, rosin, natural tanning materials, and charcoal.
notation: 18101011111412
valid from: 2024-06-07

Other Organic Base Chemicals
type: BicsLevel6Segment
type: Classifier
type: NamedIndividual
is level6 segment of: Organic Chem & Intermediates
is contemporary version of: http://data.ga-group.nl/ics/bics/181010111114
is version of: http://data.ga-group.nl/ics/bics/181010111114
replaces: http://data.ga-group.nl/ics/bics/2020/181010111114
imported on: 2026-06-08T13:40:52.236Z
last refreshed on: 2026-06-08T13:41:38.450Z
source accessed on: 2024-06-05T14:42:36Z
source last accessed on: 2024-06-05T14:42:36Z
label: Autres prod chim organiques de base @fr
label: Otros químicos de base orgánicos @es
label: Outros químicos de base orgânica @pt
label: Prod chimici organici-Altro @it
label: Sonstige organische Basischemikalien @de
label: Другие органические химикаты @ru
label: その他有機化学品 @ja
label: 其他有机化学基础材料 @zh
label: 其他有機化學品 @zh-hant
label: 기타 유기 기초화학제품 @ko
definition: This segment includes companies that manufacture organic chemicals not classified elsewhere.
notation: 181010111114
valid from: 2024-06-07

Organic Chem & Intermediates
type: BicsLevel5Segment
type: Classifier
type: NamedIndividual
is level5 segment of: Basic & Diversified Chemicals
is contemporary version of: http://data.ga-group.nl/ics/bics/1810101111
is version of: http://data.ga-group.nl/ics/bics/1810101111
replaces: http://data.ga-group.nl/ics/bics/2020/1810101111
imported on: 2026-06-08T13:40:52.236Z
last refreshed on: 2026-06-08T13:41:38.450Z
source accessed on: 2024-06-05T14:42:36Z
source last accessed on: 2024-06-05T14:42:36Z
label: Organische Chem. & Zwischenprodukte @de
label: Prod chim base/intermédiaires @fr
label: Prod chimici intermedi e organici @it
label: Prod químicos base orgânica e intermed @pt
label: Químicos e intermediarios orgánicos @es
label: Хим. продукты с орган. основ. и промеж. продукты @ru
label: 有机化学品与中间体 @zh
label: 有機化学品･中間製品 @ja
label: 有機化學品及中間品 @zh-hant
label: 유기 화학제품 & 중간체 @ko
definition: This segment includes companies that manufacture carbon-based chemicals in high volumes. Most of these chemicals are derived from organic sources such as petroleum (petrochemicals).
notation: 1810101111
valid from: 2024-06-07

Cellulosic Organic Fiber
type: BicsLevel7Segment
type: Classifier
type: NamedIndividual
is level7 segment of: Artificial Fibers & Filaments
is contemporary version of: http://data.ga-group.nl/ics/bics/18101011121010
is version of: http://data.ga-group.nl/ics/bics/18101011121010
replaces: http://data.ga-group.nl/ics/bics/2020/18101011121010
imported on: 2026-06-08T13:40:52.236Z
last refreshed on: 2026-06-08T13:41:38.450Z
source accessed on: 2024-06-05T14:42:36Z
source last accessed on: 2024-06-05T14:42:36Z
label: Fibra orgánica celulósica @es
label: Fibra orgânica de celulose @pt
label: Fibre cellulosiche @it
label: Fibres organiques cellulosiques @fr
label: Zellulosehaltige organische Fasern @de
label: Целлюлозное органическое волокно @ru
label: 有機纖維素纖維 @zh-hant
label: 纤维质有机纤维 @zh
label: 섬유소 유기 섬유 @ko
label: ｾﾙﾛｰｽ系有機繊維 @ja
definition: This segment includes companies that manufacture fibers from organic sources. Includes cigarette tow, viscose fibers, yarn, and acetate fibers. Excludes fibers that are produced naturally in nature, such as fibers from cotton or wool (See Fiber, Yarn & Thread Mfg).
notation: 18101011121010
valid from: 2024-06-07

Non-Cellulosic Organic Fiber
type: BicsLevel7Segment
type: Classifier
type: NamedIndividual
is level7 segment of: Artificial Fibers & Filaments
is contemporary version of: http://data.ga-group.nl/ics/bics/18101011121011
is version of: http://data.ga-group.nl/ics/bics/18101011121011
replaces: http://data.ga-group.nl/ics/bics/2020/18101011121011
imported on: 2026-06-08T13:40:52.236Z
last refreshed on: 2026-06-08T13:41:38.450Z
source accessed on: 2024-06-05T14:42:36Z
source last accessed on: 2024-06-05T14:42:36Z
label: Fibra orgánica no celulósica @es
label: Fibras orgânicas não celulósicas @pt
label: Fibre non cellulosiche @it
label: Fibres organiques non cellulosiques @fr
label: Nichtzellulosehaltige organische Fasern @de
label: Нецеллюлозное органическое волокно @ru
label: 有機非纖維素纖維 @zh-hant
label: 非纤维质有机纤维 @zh
label: 非ｾﾙﾛｰｽ系有機繊維 @ja
label: 비섬유소 유기 섬유 @ko
definition: This segment includes companies that manufacture fibers from inorganic sources. Includes vinyl, nylon, polyester and carbon.
notation: 18101011121011
valid from: 2024-06-07

Artificial Fibers & Filaments
type: BicsLevel6Segment
type: Classifier
type: NamedIndividual
is level6 segment of: Organic Resins, Fibers & Rubber
is contemporary version of: http://data.ga-group.nl/ics/bics/181010111210
is version of: http://data.ga-group.nl/ics/bics/181010111210
replaces: http://data.ga-group.nl/ics/bics/2020/181010111210
imported on: 2026-06-08T13:40:52.236Z
last refreshed on: 2026-06-08T13:41:38.450Z
source accessed on: 2024-06-05T14:42:36Z
source last accessed on: 2024-06-05T14:42:36Z
label: Fibras e filamentos artificiais @pt
label: Fibras y filamentos artificiales @es
label: Fibre, fili artificiali @it
label: Fibres/filaments artificiels @fr
label: Textilfasern & Filamente @de
label: Искусственное волокно и нити @ru
label: 人工･合成繊維･ﾌｨﾗﾒﾝﾄ @ja
label: 人造纖維及長纖 @zh-hant
label: 人造纤维及长丝 @zh
label: 인조섬유 & 필라멘트 @ko
definition: This segment includes companies that manufacture standardized fibers. Typically, these fibers are used for further processing in textiles or composites.
notation: 181010111210
valid from: 2024-06-07

Organic Resins
type: BicsLevel6Segment
type: Classifier
type: NamedIndividual
is level6 segment of: Organic Resins, Fibers & Rubber
is contemporary version of: http://data.ga-group.nl/ics/bics/181010111211
is version of: http://data.ga-group.nl/ics/bics/181010111211
replaces: http://data.ga-group.nl/ics/bics/2020/181010111211
imported on: 2026-06-08T13:40:52.236Z
last refreshed on: 2026-06-08T13:41:38.450Z
source accessed on: 2024-06-05T14:42:36Z
source last accessed on: 2024-06-05T14:42:36Z
label: Organische Harze @de
label: Résines organiques @fr
label: Resinas orgánicas @es
label: Resinas orgân @pt
label: Resine organiche @it
label: Органическая смола @ru
label: 有机树脂 @zh
label: 有機樹脂 @ja
label: 유기 수지 @ko
definition: This segment includes companies that manufacture organic resins. These resins are most commonly used in the production of plastics. Includes allyl, amino, cellulose, cresol, polystyrene, polyethylene and polypropylene.
notation: 181010111211
valid from: 2024-06-07

Synthetic Rubber
type: BicsLevel6Segment
type: Classifier
type: NamedIndividual
is level6 segment of: Organic Resins, Fibers & Rubber
is contemporary version of: http://data.ga-group.nl/ics/bics/181010111212
is version of: http://data.ga-group.nl/ics/bics/181010111212
replaces: http://data.ga-group.nl/ics/bics/2020/181010111212
imported on: 2026-06-08T13:40:52.236Z
last refreshed on: 2026-06-08T13:41:38.450Z
source accessed on: 2024-06-05T14:42:36Z
source last accessed on: 2024-06-05T14:42:36Z
label: Borracha sintética @pt
label: Caoutchouc synthétique @fr
label: Goma sintética @es
label: Gomma sintetica @it
label: Kunstkautschuk @de
label: Синтетический каучук @ru
label: 合成橡胶制造 @zh
label: 合成橡膠 @zh-hant
label: 合成ｺﾞﾑ @ja
label: 합성고무 @ko
definition: This segment includes companies that manufacture synthetic rubber. Includes elastomers, polyethylene rubber, urethane rubber, N-type rubber, S-type rubber and vulcanized oils.
notation: 181010111212
valid from: 2024-06-07

Organic Resins, Fibers & Rubber
type: BicsLevel5Segment
type: Classifier
type: NamedIndividual
is level5 segment of: Basic & Diversified Chemicals
is contemporary version of: http://data.ga-group.nl/ics/bics/1810101112
is version of: http://data.ga-group.nl/ics/bics/1810101112
replaces: http://data.ga-group.nl/ics/bics/2020/1810101112
imported on: 2026-06-08T13:40:52.236Z
last refreshed on: 2026-06-08T13:41:38.450Z
source accessed on: 2024-06-05T14:42:36Z
source last accessed on: 2024-06-05T14:42:36Z
label: Organische Harze, Fasern, & Gummi @de
label: Résines organiques/fibres/caoutchouc @fr
label: Resinas orgân, fibras, borracha @pt
label: Resinas, fibras y hule orgánicos @es
label: Resine organiche, fibre e gomma @it
label: Органич. смолы, волокна, каучук и произв. @ru
label: 有机树脂、纤维及橡胶 @zh
label: 有機樹脂/纖維/橡膠 @zh-hant
label: 有機樹脂･繊維･ｺﾞﾑ･派生物 @ja
label: 유기수지, 섬유 & 고무 @ko
definition: This segment includes companies that manufacture fibers and chemicals used in various forms of plastics or rubbers.
notation: 1810101112
valid from: 2024-06-07

Basic & Diversified Chemicals
type: BicsLevel4SubIndustry
type: Classifier
type: NamedIndividual
is sub industry of: Chemicals
is contemporary version of: http://data.ga-group.nl/ics/bics/18101011
is version of: http://data.ga-group.nl/ics/bics/18101011
replaces: http://data.ga-group.nl/ics/bics/2020/18101011
imported on: 2026-06-08T13:40:52.236Z
last refreshed on: 2026-06-08T13:41:38.450Z
source accessed on: 2024-06-05T14:42:36Z
source last accessed on: 2024-06-05T14:42:36Z
label: Basische & diversifizierte Chemikalien @de
label: Chimici di base e diversificati @it
label: Prod chim base/diversifiés @fr
label: Prod quím básic e divers @pt
label: Prod quim bás/div @es
label: Осн. и многоотр. хим. продукты @ru
label: 基本及多元化學品 @zh-hant
label: 基本及多种化学制品 @zh
label: 基本及多种化学��品 @zh
label: 基礎･総合化学品 @ja
label: 기초 및 다각화된 화학제품 @ko
definition: This industry subgroup includes companies that manufacture basic component chemicals or intermediates in high volumes. These companies typically produce commodity chemicals.
notation: 18101011
valid from: 2024-06-07

Adhesives & Sealants
type: BicsLevel5Segment
type: Classifier
type: NamedIndividual
is level5 segment of: Specialty Chemicals
is contemporary version of: http://data.ga-group.nl/ics/bics/1810101210
is version of: http://data.ga-group.nl/ics/bics/1810101210
replaces: http://data.ga-group.nl/ics/bics/2020/1810101210
imported on: 2026-06-08T13:40:52.236Z
last refreshed on: 2026-06-08T13:41:38.450Z
source accessed on: 2024-06-05T14:42:36Z
source last accessed on: 2024-06-05T14:42:36Z
label: Adesivi e collanti @it
label: Adesivos e selantes @pt
label: Adhesivos y selladores @es
label: Colles et mastics @fr
label: Klebstoffe & Versieglungsmaterial @de
label: Клеящие вещества и герметики @ru
label: 接着剤･ｼｰﾘﾝｸﾞ剤 @ja
label: 胶粘剂和密封剂 @zh
label: 黏著劑及密封劑 @zh-hant
label: 접착제 & 방수제 @ko
definition: This segment includes companies that manufacture chemicals with the purpose of binding or sealing. Includes adhesives, glues and caulks.
notation: 1810101210
valid from: 2024-06-07

Advanced Ceramics
type: BicsLevel6Segment
type: Classifier
type: NamedIndividual
is level6 segment of: Advanced Materials
is contemporary version of: http://data.ga-group.nl/ics/bics/181010121110
is version of: http://data.ga-group.nl/ics/bics/181010121110
replaces: http://data.ga-group.nl/ics/bics/2020/181010121110
imported on: 2026-06-08T13:40:52.236Z
last refreshed on: 2026-06-08T13:41:38.450Z
source accessed on: 2024-06-05T14:42:36Z
source last accessed on: 2024-06-05T14:42:36Z
label: Céramiques avancées @fr
label: Cerâmicas avançadas @pt
label: Ceramica avanzata @it
label: Moderne Keramik @de
label: Prod avanz cerámica @es
label: Изделия из высококачеств. керамики @ru
label: 先端ｾﾗﾐｯｸ製品 @ja
label: 高級陶瓷品 @zh-hant
label: 高级陶瓷品 @zh
label: 첨단세라믹 제품 @ko
label: 첨단세라�� 제품 @ko
definition: This segment includes companies that manufacture ceramic products that are designed to be highly impact or heat resistant. Includes ceramic armor and insulation.
notation: 181010121110
valid from: 2024-06-07

Carbon Fiber
type: BicsLevel6Segment
type: Classifier
type: NamedIndividual
is level6 segment of: Advanced Materials
is contemporary version of: http://data.ga-group.nl/ics/bics/181010121111
is version of: http://data.ga-group.nl/ics/bics/181010121111
replaces: http://data.ga-group.nl/ics/bics/2020/181010121111
imported on: 2026-06-08T13:40:52.236Z
last refreshed on: 2026-06-08T13:41:38.450Z
source accessed on: 2024-06-05T14:42:36Z
source last accessed on: 2024-06-05T14:42:36Z
label: Fibra de carbón @es
label: Fibra de carbono @pt
label: Fibre carbonio @it
label: Fibres de carbone @fr
label: Kohlefasern @de
label: Углеродное волокно @ru
label: 炭素繊維 @ja
label: 碳纖維 @zh-hant
label: 碳纤维 @zh
label: 탄소 섬유 @ko
label: 탄소 섬��� @ko
definition: This segment includes companies that manufacture carbon fiber. Carbon fiber is a specific type of composite composed of polymer resins and carbon fibers.
notation: 181010121111
valid from: 2024-06-07

Composite
type: BicsLevel6Segment
type: Classifier
type: NamedIndividual
is level6 segment of: Advanced Materials
is contemporary version of: http://data.ga-group.nl/ics/bics/181010121112
is version of: http://data.ga-group.nl/ics/bics/181010121112
replaces: http://data.ga-group.nl/ics/bics/2020/181010121112
imported on: 2026-06-08T13:40:52.236Z
last refreshed on: 2026-06-08T13:41:38.450Z
source accessed on: 2024-06-05T14:42:36Z
source last accessed on: 2024-06-05T14:42:36Z
label: Composites
label: Composti @it
label: Compostos @pt
label: Композитные материалы @ru
label: 合成物 @zh-hant
label: 复合材料 @zh
label: 総合製造 @ja
label: 복합소재 제조업 @ko
definition: This segment includes companies that manufacture materials based on blended components not classified elsewhere.
notation: 181010121112
valid from: 2024-06-07

Engineering Plastics
type: BicsLevel6Segment
type: Classifier
type: NamedIndividual
is level6 segment of: Advanced Materials
is contemporary version of: http://data.ga-group.nl/ics/bics/181010121113
is version of: http://data.ga-group.nl/ics/bics/181010121113
replaces: http://data.ga-group.nl/ics/bics/2020/181010121113
imported on: 2026-06-08T13:40:52.236Z
last refreshed on: 2026-06-08T13:41:38.450Z
source accessed on: 2024-06-05T14:42:36Z
source last accessed on: 2024-06-05T14:42:36Z
label: Ingegneria plastiche @it
label: Plásticos de ingeniería @es
label: Plásticos engenharia @pt
label: Plastiques d'ingénierie @fr
label: Technisierter Kunststoff @de
label: Конструкционные полимеры @ru
label: 工程塑料 @zh
label: 工程塑膠 @zh-hant
label: 엔지니어링 플라스틱 @ko
label: ｴﾝｼﾞﾆｱﾘﾝｸﾞﾌﾟﾗｽﾁｯｸ @ja
definition: This segment includes companies that manufacture plastic materials with greater mechanical or thermal properties than commodity plastics. These materials are often used to replace metals, due to their lighter weight.
notation: 181010121113
valid from: 2024-06-07

Graphite Products
type: BicsLevel6Segment
type: Classifier
type: NamedIndividual
is level6 segment of: Advanced Materials
is contemporary version of: http://data.ga-group.nl/ics/bics/181010121114
is version of: http://data.ga-group.nl/ics/bics/181010121114
replaces: http://data.ga-group.nl/ics/bics/2020/181010121114
imported on: 2026-06-08T13:40:52.236Z
last refreshed on: 2026-06-08T13:41:38.450Z
source accessed on: 2024-06-05T14:42:36Z
source last accessed on: 2024-06-05T14:42:36Z
label: Graphitprodukte @de
label: Prodotti in grafite @it
label: Productos de grafito @es
label: Produits en graphite @fr
label: Produtos de grafite @pt
label: Товары из графита @ru
label: 石墨产品 @zh
label: 石墨產品 @zh-hant
label: 黒鉛製品 @ja
label: 흑연제품 @ko
definition: This segment includes companies that manufacture graphite products. Includes electrodes and pencil graphite.
notation: 181010121114
valid from: 2024-06-07

Nanotechnology
type: BicsLevel6Segment
type: Classifier
type: NamedIndividual
is level6 segment of: Advanced Materials
is contemporary version of: http://data.ga-group.nl/ics/bics/181010121115
is version of: http://data.ga-group.nl/ics/bics/181010121115
replaces: http://data.ga-group.nl/ics/bics/2020/181010121115
imported on: 2026-06-08T13:40:52.236Z
last refreshed on: 2026-06-08T13:41:38.450Z
source accessed on: 2024-06-05T14:42:36Z
source last accessed on: 2024-06-05T14:42:36Z
label: Nanotechnologie @de
label: Nanotecnología @es
label: Nanotecnologia @it
label: Нанотехнологии @ru
label: 奈米科技 @zh-hant
label: 纳米技术和纳米材料 @zh
label: 나노기술 @ko
label: ﾅﾉﾃｸﾉﾛｼﾞｰ @ja
definition: This segment includes companies that manufacture extremely small materials sometimes used to improve the characteristics of another material. Includes nanomaterials. Excludes nanotechnology used for medical purposes.
notation: 181010121115
valid from: 2024-06-07

Special Coated Metals
type: BicsLevel6Segment
type: Classifier
type: NamedIndividual
is level6 segment of: Advanced Materials
is contemporary version of: http://data.ga-group.nl/ics/bics/181010121116
is version of: http://data.ga-group.nl/ics/bics/181010121116
replaces: http://data.ga-group.nl/ics/bics/2020/181010121116
imported on: 2026-06-08T13:40:52.236Z
last refreshed on: 2026-06-08T13:41:38.450Z
source accessed on: 2024-06-05T14:42:36Z
source last accessed on: 2024-06-05T14:42:36Z
label: Métaux spéciaux revêtus @fr
label: Metais de revestimento especial @pt
label: Metales cubiertos especiales @es
label: Metalli rivest speciali @it
label: Spezifische beschichtete Metalle @de
label: Металлы со специальным покрытием @ru
label: 特殊塗装金属 @ja
label: 特殊鍍膜金屬 @zh-hant
label: 特殊镀膜金属 @zh
label: 특수 코팅 금속 @ko
definition: This segment includes companies that manufacture metals that have been bonded or coated to deter abrasion or corrosion, or to improve heat resistance.
notation: 181010121116
valid from: 2024-06-07

Advanced Materials
type: BicsLevel5Segment
type: Classifier
type: NamedIndividual
is level5 segment of: Specialty Chemicals
is contemporary version of: http://data.ga-group.nl/ics/bics/1810101211
is version of: http://data.ga-group.nl/ics/bics/1810101211
replaces: http://data.ga-group.nl/ics/bics/2020/1810101211
imported on: 2026-06-08T13:40:52.236Z
last refreshed on: 2026-06-08T13:41:38.450Z
source accessed on: 2024-06-05T14:42:36Z
source last accessed on: 2024-06-05T14:42:36Z
label: Matériaux avancés @fr
label: Materiais avançados @pt
label: Materiales avanzados @es
label: Materiali avanzati @it
label: Moderne Materialien @de
label: Современные материалы @ru
label: 先端材料 @ja
label: 先進材料 @zh-hant
label: 高级材料 @zh
label: 첨단재료 @ko
definition: This segment includes companies that manufacture advanced materials, materials that are engineered for novel properties and superior performance.
notation: 1810101211
valid from: 2024-06-07

Catalysts
type: BicsLevel5Segment
type: Classifier
type: NamedIndividual
is level5 segment of: Specialty Chemicals
is contemporary version of: http://data.ga-group.nl/ics/bics/1810101212
is version of: http://data.ga-group.nl/ics/bics/1810101212
replaces: http://data.ga-group.nl/ics/bics/2020/1810101212
imported on: 2026-06-08T13:40:52.236Z
last refreshed on: 2026-06-08T13:41:38.450Z
source accessed on: 2024-06-05T14:42:36Z
source last accessed on: 2024-06-05T14:42:36Z
label: Catalisadores @pt
label: Catalizadores @es
label: Catalizzatori @it
label: Catalyseurs @fr
label: Katalysatoren @de
label: Катализаторы @ru
label: 催化剂 @zh
label: 催化劑 @zh-hant
label: 触媒素材 @ja
label: 촉매제 @ko
definition: This segment includes companies that manufacture inorganic or organic catalysts commonly used for refinery processes, automotive emissions control, and other feedstock and chemicals processing.
notation: 1810101212
valid from: 2024-06-07

Consumer Retail Chemicals
type: BicsLevel5Segment
type: Classifier
type: NamedIndividual
is level5 segment of: Specialty Chemicals
is contemporary version of: http://data.ga-group.nl/ics/bics/1810101213
is version of: http://data.ga-group.nl/ics/bics/1810101213
replaces: http://data.ga-group.nl/ics/bics/2020/1810101213
imported on: 2026-06-08T13:40:52.236Z
last refreshed on: 2026-06-08T13:41:38.450Z
source accessed on: 2024-06-05T14:42:36Z
source last accessed on: 2024-06-05T14:42:36Z
label: Chimici al consumo @it
label: Menudeo de químicos @es
label: Prod quím p/consumidor varejo @pt
label: Produits chimiques vendus au détail @fr
label: Verbraucherchemikalien @de
label: Потребительские розничные хим. продукты @ru
label: 消費者用化学品 @ja
label: 消費零售化學品 @zh-hant
label: 消费零售-化学品 @zh
label: 소비자 소매 화학제품 @ko
definition: This segment includes companies that manufacture chemicals for retail consumer applications not elsewhere classified.
notation: 1810101213
valid from: 2024-06-07

Electronic Chemicals
type: BicsLevel5Segment
type: Classifier
type: NamedIndividual
is level5 segment of: Specialty Chemicals
is contemporary version of: http://data.ga-group.nl/ics/bics/1810101214
is version of: http://data.ga-group.nl/ics/bics/1810101214
replaces: http://data.ga-group.nl/ics/bics/2020/1810101214
imported on: 2026-06-08T13:40:52.236Z
last refreshed on: 2026-06-08T13:41:38.450Z
source accessed on: 2024-06-05T14:42:36Z
source last accessed on: 2024-06-05T14:42:36Z
label: Chimici elettronici @it
label: Elektronische Chemikalien @de
label: Prod chim pour électronique @fr
label: Prod químicos eletr @pt
label: Químicos electrónicos @es
label: Электронные химикаты @ru
label: 电子化学品 @zh
label: 電子化学品 @ja
label: 電子化學品 @zh-hant
label: 전자 화학제품 @ko
definition: This segment includes companies that manufacture specialty chemicals primarily used by the electronics industry. These chemicals are often used in the production of integrated circuits, displays, and other electronic components. Excludes chemicals used as a feedstock for semiconductors (see Assembly Materials & Solutions).
notation: 1810101214
valid from: 2024-06-07

Explosives
type: BicsLevel5Segment
type: Classifier
type: NamedIndividual
is level5 segment of: Specialty Chemicals
is contemporary version of: http://data.ga-group.nl/ics/bics/1810101215
is version of: http://data.ga-group.nl/ics/bics/1810101215
replaces: http://data.ga-group.nl/ics/bics/2020/1810101215
imported on: 2026-06-08T13:40:52.236Z
last refreshed on: 2026-06-08T13:41:38.450Z
source accessed on: 2024-06-05T14:42:36Z
source last accessed on: 2024-06-05T14:42:36Z
label: Esplosivi @it
label: Explosifs @fr
label: Explosivos @es
label: Sprengstoff @de
label: Взрывчатые вещества @ru
label: 火薬類 @ja
label: 炸药制造 @zh
label: 炸藥 @zh-hant
label: 폭발물 @ko
definition: This segment includes companies that manufacture explosives. Includes gunpowder, TNT, and dynamite.
notation: 1810101215
valid from: 2024-06-07

Fine Chemicals
type: BicsLevel5Segment
type: Classifier
type: NamedIndividual
is level5 segment of: Specialty Chemicals
is contemporary version of: http://data.ga-group.nl/ics/bics/1810101216
is version of: http://data.ga-group.nl/ics/bics/1810101216
replaces: http://data.ga-group.nl/ics/bics/2020/1810101216
imported on: 2026-06-08T13:40:52.236Z
last refreshed on: 2026-06-08T13:41:38.450Z
source accessed on: 2024-06-05T14:42:36Z
source last accessed on: 2024-06-05T14:42:36Z
label: Chimici ad alto contenuto tecnologico @it
label: Chimie fine @fr
label: Feinchemikalien @de
label: Prod químicos finos @pt
label: Químicos de pureza @es
label: Чистые химикаты @ru
label: 精密化學品 @zh-hant
label: 精细化学品 @zh
label: 정밀 화학제품 @ko
label: ﾌｧｲﾝｹﾐｶﾙ @ja
definition: This segment includes companies that manufacture complex, low-volume, high-purity chemicals. Fine chemicals are expensive and often manufactured under contract, most commonly for pharmaceutical companies.
notation: 1810101216
valid from: 2024-06-07

Flavors & Fragrances
type: BicsLevel5Segment
type: Classifier
type: NamedIndividual
is level5 segment of: Specialty Chemicals
is contemporary version of: http://data.ga-group.nl/ics/bics/1810101217
is version of: http://data.ga-group.nl/ics/bics/1810101217
replaces: http://data.ga-group.nl/ics/bics/2020/1810101217
imported on: 2026-06-08T13:40:52.236Z
last refreshed on: 2026-06-08T13:41:38.450Z
source accessed on: 2024-06-05T14:42:36Z
source last accessed on: 2024-06-05T14:42:36Z
label: Aroma & Düfte @de
label: Sabores e fragrâncias @pt
label: Sabores y fragancias @es
label: Sapori e fragranze @it
label: Saveurs et parfums @fr
label: Вкусовые добавки и ароматизаторы @ru
label: 香料･香水 @ja
label: 香精及香料 @zh-hant
label: 香精香料 @zh
label: 향신료 & 향료 @ko
definition: This segment includes companies that specialize in manufacturing chemicals for flavors and fragrances. These chemicals are used in retail consumer goods or foods.
notation: 1810101217
valid from: 2024-06-07

Cosmetic Additives
type: BicsLevel6Segment
type: Classifier
type: NamedIndividual
is level6 segment of: Functional Additives
is contemporary version of: http://data.ga-group.nl/ics/bics/181010121810
is version of: http://data.ga-group.nl/ics/bics/181010121810
replaces: http://data.ga-group.nl/ics/bics/2020/181010121810
imported on: 2026-06-08T13:40:52.236Z
last refreshed on: 2026-06-08T13:41:38.450Z
source accessed on: 2024-06-05T14:42:36Z
source last accessed on: 2024-06-05T14:42:36Z
label: Additifs de cosmétiques @fr
label: Additivi cosmetici @it
label: Aditivos de cosméticos @es
label: Aditivos p/cosméticos @pt
label: Kosmetische Zusätze @de
label: Косметические добавки @ru
label: 化妆品添加剂 @zh
label: 化妝品添加劑 @zh-hant
label: 化粧用添加剤 @ja
label: 화장품 첨가제 @ko
definition: This segment includes companies that manufacture functional additives used in cosmetics.
notation: 181010121810
valid from: 2024-06-07

Fluid & Lubricant Additives
type: BicsLevel6Segment
type: Classifier
type: NamedIndividual
is level6 segment of: Functional Additives
is contemporary version of: http://data.ga-group.nl/ics/bics/181010121811
is version of: http://data.ga-group.nl/ics/bics/181010121811
replaces: http://data.ga-group.nl/ics/bics/2020/181010121811
imported on: 2026-06-08T13:40:52.236Z
last refreshed on: 2026-06-08T13:41:38.450Z
source accessed on: 2024-06-05T14:42:36Z
source last accessed on: 2024-06-05T14:42:36Z
label: Additifs fluides et lubrifiants @fr
label: Additivi fluidi e lubrificanti @it
label: Aditivos de fluído e lubrific @pt
label: Aditivos de fluidos y lubricantes @es
label: Flüssige & schmierige Zusätze @de
label: Жидкие смазки и присадки для смазочных масел @ru
label: 液体与润滑油添加剂 @zh
label: 液体･潤滑油添加剤 @ja
label: 液狀及潤滑油添加劑 @zh-hant
label: 액체 & 윤활유 첨가제 @ko
definition: This segment includes companies that manufacture finished lubricant products or functional additives that contribute to the viscosity or fluidity of finished goods. Primarily, these are additives for industrial purposes, such as engine and machine lubrication, hydraulics and heat transfer.
notation: 181010121811
valid from: 2024-06-07

Food Additives
type: BicsLevel6Segment
type: Classifier
type: NamedIndividual
is level6 segment of: Functional Additives
is contemporary version of: http://data.ga-group.nl/ics/bics/181010121812
is version of: http://data.ga-group.nl/ics/bics/181010121812
replaces: http://data.ga-group.nl/ics/bics/2020/181010121812
imported on: 2026-06-08T13:40:52.236Z
last refreshed on: 2026-06-08T13:41:38.450Z
source accessed on: 2024-06-05T14:42:36Z
source last accessed on: 2024-06-05T14:42:36Z
label: Additifs alimentaires @fr
label: Additivi alimentari @it
label: Aditivos de alimentos @es
label: Aditivos p/alimentos @pt
label: Lebensmittelzusätze @de
label: Пищевые добавки @ru
label: 食品添加剂 @zh
label: 食品添加剤 @ja
label: 食品添加劑 @zh-hant
label: 식품 첨가제 @ko
definition: This segment includes companies that manufacture functional additives that are primarily used for food processing and functional quality enhancement. Excludes manufacturers that produce consumer facing food additives (see Food Ingredients).
notation: 181010121812
valid from: 2024-06-07

Paper Additives & Process Chem
type: BicsLevel6Segment
type: Classifier
type: NamedIndividual
is level6 segment of: Functional Additives
is contemporary version of: http://data.ga-group.nl/ics/bics/181010121813
is version of: http://data.ga-group.nl/ics/bics/181010121813
replaces: http://data.ga-group.nl/ics/bics/2020/181010121813
imported on: 2026-06-08T13:40:52.236Z
last refreshed on: 2026-06-08T13:41:38.450Z
source accessed on: 2024-06-05T14:42:36Z
source last accessed on: 2024-06-05T14:42:36Z
label: Additifs papier/processus chim @fr
label: Additivi carta e processi chim @it
label: Aditivos de papel e processo quím @pt
label: Aditivos de papel y químicos de procesamiento @es
label: Papierzusätze & Verarbeitungschem. @de
label: Добавки и химикаты для бум. произв. @ru
label: 紙添加剤･ﾌﾟﾛｾｽ化学品 @ja
label: 紙添加劑及加工化學品 @zh-hant
label: 造纸助剂及工艺处理化学品 @zh
label: 제지 첨가제 & 공정용 화학제품 @ko
definition: This segment includes companies that manufacture functional additives that are primarily utilized in paper production processes. Excludes chemicals that contribute to the smell or taste of finished goods (see Flavors & Fragrances).
notation: 181010121813
valid from: 2024-06-07

Polymer Additives
type: BicsLevel6Segment
type: Classifier
type: NamedIndividual
is level6 segment of: Functional Additives
is contemporary version of: http://data.ga-group.nl/ics/bics/181010121814
is version of: http://data.ga-group.nl/ics/bics/181010121814
replaces: http://data.ga-group.nl/ics/bics/2020/181010121814
imported on: 2026-06-08T13:40:52.236Z
last refreshed on: 2026-06-08T13:41:38.450Z
source accessed on: 2024-06-05T14:42:36Z
source last accessed on: 2024-06-05T14:42:36Z
label: Additifs polymères @fr
label: Additivi polimeri @it
label: Aditivos de polímeros @es
label: Aditivos p/polímeros @pt
label: Polymer-Zusätze @de
label: Полимерные добавки @ru
label: 聚合物添加剂 @zh
label: 聚合物添加劑 @zh-hant
label: 폴리머 첨가제 @ko
label: ﾎﾟﾘﾏｰ添加剤 @ja
definition: This segment includes companies that manufacture functional additives that alter/improve the physical properties or performance of a polymer. Includes antioxidants and flame retardants.
notation: 181010121814
valid from: 2024-06-07

Functional Additives
type: BicsLevel5Segment
type: Classifier
type: NamedIndividual
is level5 segment of: Specialty Chemicals
is contemporary version of: http://data.ga-group.nl/ics/bics/1810101218
is version of: http://data.ga-group.nl/ics/bics/1810101218
replaces: http://data.ga-group.nl/ics/bics/2020/1810101218
imported on: 2026-06-08T13:40:52.236Z
last refreshed on: 2026-06-08T13:41:38.450Z
source accessed on: 2024-06-05T14:42:36Z
source last accessed on: 2024-06-05T14:42:36Z
label: Additifs fonctionnels @fr
label: Additivi funzionali @it
label: Aditivos funcionais @pt
label: Aditivos funcionales @es
label: Funktionelle Zusätze @de
label: Функциональные добавки @ru
label: 功能性添加劑 @zh-hant
label: 功能添加剂 @zh
label: 機能的添加剤 @ja
label: 기능성 첨가제 @ko
definition: This segment includes companies that manufacture specialty chemicals that contribute to the functional characteristics of finished goods. Excludes chemicals that contribute to smell or taste of finished goods (see Flavors & Fragrances).
notation: 1810101218
valid from: 2024-06-07

Ind & Instl Cleaning Chemicals
type: BicsLevel5Segment
type: Classifier
type: NamedIndividual
is level5 segment of: Specialty Chemicals
is contemporary version of: http://data.ga-group.nl/ics/bics/1810101219
is version of: http://data.ga-group.nl/ics/bics/1810101219
replaces: http://data.ga-group.nl/ics/bics/2020/1810101219
imported on: 2026-06-08T13:40:52.236Z
last refreshed on: 2026-06-08T13:41:38.450Z
source accessed on: 2024-06-05T14:42:36Z
source last accessed on: 2024-06-05T14:42:36Z
label: Detergenti chimici ind e ist @it
label: Ind. & Inst. Reinigungschemikalien @de
label: Prod quím limpeza ind e instit @pt
label: Produits de nettoyage indus/institut @fr
label: Químicos de limpieza y industrial e inst @es
label: Промышл. и офисные чист. химикаты @ru
label: 工业与机构清洁化学品 @zh
label: 工業及機構清潔用化學品 @zh-hant
label: 工業･研究用化学品 @ja
label: 공업 & 기관용 청소 화학제품 @ko
definition: This segment includes companies that manufacture chemicals and services used in large-scale sanitation, cleaning, and public health applications, such as restaurants, hotels or hospitals.
notation: 1810101219
valid from: 2024-06-07

Oilfield Chemicals
type: BicsLevel5Segment
type: Classifier
type: NamedIndividual
is level5 segment of: Specialty Chemicals
is contemporary version of: http://data.ga-group.nl/ics/bics/1810101220
is version of: http://data.ga-group.nl/ics/bics/1810101220
replaces: http://data.ga-group.nl/ics/bics/2020/1810101220
imported on: 2026-06-08T13:40:52.236Z
last refreshed on: 2026-06-08T13:41:38.450Z
source accessed on: 2024-06-05T14:42:36Z
source last accessed on: 2024-06-05T14:42:36Z
label: Chimici campi petroliferi @it
label: Prod chim champs pétrolifères @fr
label: Prod quím de campo petrolífero @pt
label: Químicos de yacimiento petrolífero @es
label: Ölfeldchemikalien @de
label: Нефтепромысловые химические продукты @ru
label: 油田化学品 @zh
label: 油田化學品 @zh-hant
label: 油田用化学品 @ja
label: 유전 화학제품 @ko
definition: This segment includes chemicals used in oil and natural gas exploration and production, including drilling fluids, fracking aids, antifouling agents, and transport additives.
notation: 1810101220
valid from: 2024-06-07

Industrial Coatings
type: BicsLevel6Segment
type: Classifier
type: NamedIndividual
is level6 segment of: Paints & Coatings
is contemporary version of: http://data.ga-group.nl/ics/bics/181010122110
is version of: http://data.ga-group.nl/ics/bics/181010122110
replaces: http://data.ga-group.nl/ics/bics/2020/181010122110
imported on: 2026-06-08T13:40:52.236Z
last refreshed on: 2026-06-08T13:41:38.450Z
source accessed on: 2024-06-05T14:42:36Z
source last accessed on: 2024-06-05T14:42:36Z
label: Cubrimientos industriales @es
label: Industrielle Beschichtungen @de
label: Revêtements industriels @fr
label: Revest industrial @pt
label: Rivestim industriali @it
label: Промышленные покрытия @ru
label: 工业涂料 @zh
label: 工業塗料 @zh-hant
label: 工業用塗装 @ja
label: 산업용 코팅 @ko
definition: This segment includes companies that manufacture paints and coatings with diversified industrial applications, including automotive, aerospace, marine, industrial and packaging.
notation: 181010122110
valid from: 2024-06-07

Specialty Coatings
type: BicsLevel6Segment
type: Classifier
type: NamedIndividual
is level6 segment of: Paints & Coatings
is contemporary version of: http://data.ga-group.nl/ics/bics/181010122111
is version of: http://data.ga-group.nl/ics/bics/181010122111
replaces: http://data.ga-group.nl/ics/bics/2020/181010122111
imported on: 2026-06-08T13:40:52.236Z
last refreshed on: 2026-06-08T13:41:38.450Z
source accessed on: 2024-06-05T14:42:36Z
source last accessed on: 2024-06-05T14:42:36Z
label: Cubrimientos especiales @es
label: Espec revestimento @pt
label: Revêtements spécialisés @fr
label: Rivestimenti speciali @it
label: Spezialbeschichtungen @de
label: Специальные покрытия @ru
label: 特殊塗料 @zh-hant
label: 特殊塗装 @ja
label: 特种涂料 @zh
label: 특수 코팅 @ko
definition: This segment includes companies that manufacture coating products that improve the appearance of and provide protection to a given material.
notation: 181010122111
valid from: 2024-06-07

Paints & Coatings
type: BicsLevel5Segment
type: Classifier
type: NamedIndividual
is level5 segment of: Specialty Chemicals
is contemporary version of: http://data.ga-group.nl/ics/bics/1810101221
is version of: http://data.ga-group.nl/ics/bics/1810101221
replaces: http://data.ga-group.nl/ics/bics/2020/1810101221
imported on: 2026-06-08T13:40:52.236Z
last refreshed on: 2026-06-08T13:41:38.450Z
source accessed on: 2024-06-05T14:42:36Z
source last accessed on: 2024-06-05T14:42:36Z
label: Farben & Beschichtungen @de
label: Peintures et revêtements @fr
label: Pinturas y cubrimientos @es
label: Pitture e rivestimenti @it
label: Tintas e revestimentos @pt
label: Краски и покрытия @ru
label: 塗料及塗膜 @zh-hant
label: 塗料･塗装 @ja
label: 油漆和涂料 @zh
label: 페인트 및 코팅 @ko
definition: This segment includes companies that manufacture paints and/or mix pigments, solvents, and binders into paints and other coatings.
notation: 1810101221
valid from: 2024-06-07

Printing Ink
type: BicsLevel5Segment
type: Classifier
type: NamedIndividual
is level5 segment of: Specialty Chemicals
is contemporary version of: http://data.ga-group.nl/ics/bics/1810101222
is version of: http://data.ga-group.nl/ics/bics/1810101222
replaces: http://data.ga-group.nl/ics/bics/2020/1810101222
imported on: 2026-06-08T13:40:52.236Z
last refreshed on: 2026-06-08T13:41:38.450Z
source accessed on: 2024-06-05T14:42:36Z
source last accessed on: 2024-06-05T14:42:36Z
label: Druckfarben @de
label: Encre d'imprimerie @fr
label: Inchiostro stampa @it
label: Tinta de impressão @pt
label: Tinta para impresión @es
label: Печатная краска @ru
label: 印刷油墨 @zh-hant
label: 印刷油墨制造 @zh
label: 印刷ｲﾝｷ @ja
label: 인쇄잉크 @ko
definition: This segment includes companies that manufacture printing inks and inkjet cartridges.
notation: 1810101222
valid from: 2024-06-07

Inorganic Dye & Pigments
type: BicsLevel6Segment
type: Classifier
type: NamedIndividual
is level6 segment of: Synthetic Dye & Pigments
is contemporary version of: http://data.ga-group.nl/ics/bics/181010122310
is version of: http://data.ga-group.nl/ics/bics/181010122310
replaces: http://data.ga-group.nl/ics/bics/2020/181010122310
imported on: 2026-06-08T13:40:52.236Z
last refreshed on: 2026-06-08T13:41:38.450Z
source accessed on: 2024-06-05T14:42:36Z
source last accessed on: 2024-06-05T14:42:36Z
label: Anorganische Farbstoffe & Pigmente @de
label: Teintures/pigments inorganiques @fr
label: Tinte y pigmentos inorgánicos @es
label: Tintura e pigmentos inorgân @pt
label: Tintura inorganica e pigmenti @it
label: Неорганическая краска и пигменты @ru
label: 无机染料和颜料 @zh
label: 無機染料及顏料 @zh-hant
label: 無機染料･顔料 @ja
label: 무기염료 및 안료 @ko
definition: This segment includes companies that manufacture non-carbon-based dyes and pigments. Includes color pigments, umber, and zinc-based pigments.
notation: 181010122310
valid from: 2024-06-07

Organic Dye & Pigments
type: BicsLevel6Segment
type: Classifier
type: NamedIndividual
is level6 segment of: Synthetic Dye & Pigments
is contemporary version of: http://data.ga-group.nl/ics/bics/181010122311
is version of: http://data.ga-group.nl/ics/bics/181010122311
replaces: http://data.ga-group.nl/ics/bics/2020/181010122311
imported on: 2026-06-08T13:40:52.236Z
last refreshed on: 2026-06-08T13:41:38.450Z
source accessed on: 2024-06-05T14:42:36Z
source last accessed on: 2024-06-05T14:42:36Z
label: Organische Farbstoffe & Pigmente @de
label: Pigmento e corante orgânico @pt
label: Pigmentos y colorantes orgánicos @es
label: Teintures/pigments organiques @fr
label: Tinture e colori organici @it
label: Органические красители и наполнители @ru
label: 合成有機染料及顏料 @zh-hant
label: 有机染料与颜料 @zh
label: 有機染料･顔料 @ja
label: 유기염료 & 안료 @ko
definition: This segment includes companies that manufacture carbon-based dyes and pigments that do not naturally occur in nature. Includes lakes and toners.
notation: 181010122311
valid from: 2024-06-07

Synthetic Dye & Pigments
type: BicsLevel5Segment
type: Classifier
type: NamedIndividual
is level5 segment of: Specialty Chemicals
is contemporary version of: http://data.ga-group.nl/ics/bics/1810101223
is version of: http://data.ga-group.nl/ics/bics/1810101223
replaces: http://data.ga-group.nl/ics/bics/2020/1810101223
imported on: 2026-06-08T13:40:52.236Z
last refreshed on: 2026-06-08T13:41:38.450Z
source accessed on: 2024-06-05T14:42:36Z
source last accessed on: 2024-06-05T14:42:36Z
label: Colorants et pigments @fr
label: Corantes sintéticos e pigmentos @pt
label: Pigmentos y colorantes sintéticos @es
label: Synthetische Farbstoffe & Pigmente @de
label: Tinture e colori sintetici @it
label: Синтетические краски и пигменты @ru
label: 合成染料与颜料 @zh
label: 合成染料及顏料 @zh-hant
label: 合成染料･顔料 @ja
label: 합성염료&안료 @ko
definition: This segment includes companies that chemically manufacture dyes and pigments.
notation: 1810101223
valid from: 2024-06-07

Water Treatment Chemicals
type: BicsLevel5Segment
type: Classifier
type: NamedIndividual
is level5 segment of: Specialty Chemicals
is contemporary version of: http://data.ga-group.nl/ics/bics/1810101224
is version of: http://data.ga-group.nl/ics/bics/1810101224
replaces: http://data.ga-group.nl/ics/bics/2020/1810101224
imported on: 2026-06-08T13:40:52.236Z
last refreshed on: 2026-06-08T13:41:38.450Z
source accessed on: 2024-06-05T14:42:36Z
source last accessed on: 2024-06-05T14:42:36Z
label: Chimici trattamento acque @it
label: Prod chim traitement des eaux @fr
label: Prod quím p/tratamento de água @pt
label: Químicos de tratamiento de agua @es
label: Wasseraufbereitungschemikalien @de
label: Хим. продукты для водоочистки @ru
label: 水処理化学品 @ja
label: 水处理化学品 @zh
label: 水處理化學品 @zh-hant
label: 수자원처리 화학제품 @ko
definition: This segment includes companies that manufacture chemicals used to treat/disinfect water. Typically, these are used in public utility water treatment or industrial processes. Includes chlorine, chloramine, and chlorine dioxide.
notation: 1810101224
valid from: 2024-06-07

Specialty Chemicals
type: BicsLevel4SubIndustry
type: Classifier
type: NamedIndividual
is sub industry of: Chemicals
is contemporary version of: http://data.ga-group.nl/ics/bics/18101012
is version of: http://data.ga-group.nl/ics/bics/18101012
replaces: http://data.ga-group.nl/ics/bics/2020/18101012
imported on: 2026-06-08T13:40:52.236Z
last refreshed on: 2026-06-08T13:41:38.450Z
source accessed on: 2024-06-05T14:42:36Z
source last accessed on: 2024-06-05T14:42:36Z
label: Chimici specializz @it
label: Prod chimiques spécialisés @fr
label: Prod quím espec @pt
label: Prod quim espec @es
label: Spezialchemikalien @de
label: Специализир. химикаты @ru
label: 特殊化学品 @ja
label: 特用化學品 @zh-hant
label: 特种化学品 @zh
label: 특수 화학제품 @ko
label: ���殊化学品 @ja
definition: This industry subgroup includes companies that manufacture chemicals for specific applications, and sometimes for specific customers. These chemicals are frequently manufactured in smaller volumes and at higher price points.
notation: 18101012
valid from: 2024-06-07

Chem & Allied Prods Whslrs
type: BicsLevel5Segment
type: Classifier
type: NamedIndividual
is level5 segment of: Chemicals Distribution
is contemporary version of: http://data.ga-group.nl/ics/bics/1810101310
is version of: http://data.ga-group.nl/ics/bics/1810101310
replaces: http://data.ga-group.nl/ics/bics/2020/1810101310
imported on: 2026-06-08T13:40:52.236Z
last refreshed on: 2026-06-08T13:41:38.450Z
source accessed on: 2024-06-05T14:42:36Z
source last accessed on: 2024-06-05T14:42:36Z
label: Chemikalien & verw. Produkte @de
label: Comm ingrosso prodotti chimici e associati @it
label: Grossiste prod chim et apparentés @fr
label: Productos químicos y relac @es
label: Produtos químicos e afins-Atacadista @pt
label: Опт. торговля - Химич. и смежные продукты @ru
label: 其他化学品批发商 @zh
label: 其他化學及其製品批發 @zh-hant
label: 其他化學及其製品批�� @zh-hant
label: 化学品･関連品卸売 @ja
label: 화학&관련제품 도매업 @ko
definition: This segment includes companies that wholesale and distribute basic and diversified chemicals and/or specialty chemicals.
notation: 1810101310
valid from: 2024-06-07

Plastic Matl & Forms Whslrs
type: BicsLevel5Segment
type: Classifier
type: NamedIndividual
is level5 segment of: Chemicals Distribution
is contemporary version of: http://data.ga-group.nl/ics/bics/1810101311
is version of: http://data.ga-group.nl/ics/bics/1810101311
replaces: http://data.ga-group.nl/ics/bics/2020/1810101311
imported on: 2026-06-08T13:40:52.236Z
last refreshed on: 2026-06-08T13:41:38.450Z
source accessed on: 2024-06-05T14:42:36Z
source last accessed on: 2024-06-05T14:42:36Z
label: Atac mat plást e formas @pt
label: Gross matériaux/formes en plastique @fr
label: Grossiste forme e mat plastiche @it
label: Mat y formas básicas plásticos @es
label: Plastikmaterial & -formen Großhandel @de
label: Оптовая торговля - пластмассы и формы @ru
label: 塑料材料与型材批发商 @zh
label: 塑膠原料及初級產品批發 @zh-hant
label: 플라스틱원료&틀 도매업 @ko
label: ﾌﾟﾗｽﾁｯｸ材料･成形品卸売 @ja
label: ﾌﾟﾗｽﾁｯｸ材料･成形���卸売 @ja
definition: This segment includes companies that wholesale and distribute intermediate plastic products and/or chemicals used in plastics manufacturing. Includes wholesale distribution of plastics, organic resins, plastic film, plastic sheeting, and plastic foams.
notation: 1810101311
valid from: 2024-06-07

Chemicals Distribution
type: BicsLevel4SubIndustry
type: Classifier
type: NamedIndividual
is sub industry of: Chemicals
is contemporary version of: http://data.ga-group.nl/ics/bics/18101013
is version of: http://data.ga-group.nl/ics/bics/18101013
replaces: http://data.ga-group.nl/ics/bics/2020/18101013
imported on: 2026-06-08T13:40:52.236Z
last refreshed on: 2026-06-08T13:41:38.450Z
source accessed on: 2024-06-05T14:42:36Z
source last accessed on: 2024-06-05T14:42:36Z
label: Chemikalienvertrieb @de
label: Dist prod químicos @pt
label: Distrib prod quim @es
label: Distrib produits chim @fr
label: Distribuzione chimici @it
label: Распростран. химикатов @ru
label: Распростран. хими��атов @ru
label: 化学品卸売 @ja
label: 化學品經銷 @zh-hant
label: 化工分销 @zh
label: 화학제품 유통 @ko
definition: This industry subgroup includes companies that wholesale and distribute chemicals. Excludes companies that manufacture chemicals or wholesale and distribute chemicals for agricultural purposes (see Agricultural Chemicals Retailing & Distribution).
notation: 18101013
valid from: 2024-06-07

Chemicals
type: BicsLevel3Industry
type: Classifier
type: NamedIndividual
is industry of: Materials
is contemporary version of: http://data.ga-group.nl/ics/bics/181010
is version of: http://data.ga-group.nl/ics/bics/181010
replaces: http://data.ga-group.nl/ics/bics/2020/181010
imported on: 2026-06-08T13:40:52.236Z
last refreshed on: 2026-06-08T13:41:38.450Z
source accessed on: 2024-06-05T14:42:36Z
source last accessed on: 2024-06-05T14:42:36Z
label: Chemikalien @de
label: Chimie @fr
label: Prodotti chimici @it
label: Produtos químicos @pt
label: Químicos @es
label: Химическая промышленность @ru
label: 化学工業 @ja
label: 化學 @zh-hant
label: 化工产品 @zh
label: 화학 @ko
definition: This industry includes companies that manufacture organic and inorganic chemicals.
notation: 181010
valid from: 2024-06-07

Crushed Stone
type: BicsLevel6Segment
type: Classifier
type: NamedIndividual
is level6 segment of: Aggregates
is contemporary version of: http://data.ga-group.nl/ics/bics/181011101010
is version of: http://data.ga-group.nl/ics/bics/181011101010
replaces: http://data.ga-group.nl/ics/bics/2020/181011101010
imported on: 2026-06-08T13:40:52.236Z
last refreshed on: 2026-06-08T13:41:38.450Z
source accessed on: 2024-06-05T14:42:36Z
source last accessed on: 2024-06-05T14:42:36Z
label: Brita @pt
label: Piedra triturada @es
label: Pierre concassée @fr
label: Pietrisco @it
label: Schotter @de
label: Дробленый камень @ru
label: 砂黏土礦業及採取業 @zh-hant
label: 砕石 @ja
label: 碎石 @zh
label: 쇄석 @ko
definition: This segment includes companies that mine rock deposits and break the rock into the desired size using crushers.
notation: 181011101010
valid from: 2024-06-07

Sand & Gravel
type: BicsLevel6Segment
type: Classifier
type: NamedIndividual
is level6 segment of: Aggregates
is contemporary version of: http://data.ga-group.nl/ics/bics/181011101011
is version of: http://data.ga-group.nl/ics/bics/181011101011
replaces: http://data.ga-group.nl/ics/bics/2020/181011101011
imported on: 2026-06-08T13:40:52.236Z
last refreshed on: 2026-06-08T13:41:38.450Z
source accessed on: 2024-06-05T14:42:36Z
source last accessed on: 2024-06-05T14:42:36Z
label: Areia e cascalho @pt
label: Arena y grava @es
label: Sabbia e ghiaia @it
label: Sable et gravier @fr
label: Sand & Kies @de
label: Песок и гравий @ru
label: 沙砾 @zh
label: 砂黏土礦業及採取業 @zh-hant
label: 砂･砂利 @ja
label: 모래 및 자갈 @ko
definition: This segment includes companies that extract, mine, and/or quarry sand and gravel.
notation: 181011101011
valid from: 2024-06-07

Aggregates
type: BicsLevel5Segment
type: Classifier
type: NamedIndividual
is level5 segment of: Cement & Aggregates
is contemporary version of: http://data.ga-group.nl/ics/bics/1810111010
is version of: http://data.ga-group.nl/ics/bics/1810111010
replaces: http://data.ga-group.nl/ics/bics/2020/1810111010
imported on: 2026-06-08T13:40:52.236Z
last refreshed on: 2026-06-08T13:41:38.450Z
source accessed on: 2024-06-05T14:42:36Z
source last accessed on: 2024-06-05T14:42:36Z
label: Aggregate @de
label: Aggregati @it
label: Agrégats @fr
label: Agregados @es
label: Совокупные данные @ru
label: 综合 @zh
label: 骨材 @ja
label: 골재 @ko
definition: This segment includes companies that mine and quarry stones. Typically, these aggregates are uniform in size and have other industrial uses beyond construction.
notation: 1810111010
valid from: 2024-06-07

Asfalto
type: BicsLevel5Segment
type: Classifier
type: NamedIndividual
is level5 segment of: Cement & Aggregates
is contemporary version of: http://data.ga-group.nl/ics/bics/1810111011
is version of: http://data.ga-group.nl/ics/bics/1810111011
replaces: http://data.ga-group.nl/ics/bics/2020/1810111011
imported on: 2026-06-08T13:40:52.236Z
last refreshed on: 2026-06-08T13:41:38.450Z
source accessed on: 2024-06-05T14:42:36Z
source last accessed on: 2024-06-05T14:42:36Z
label: Asphalt
label: Asphalte @fr
label: Асфальт @ru
label: 沥青 @zh
label: 瀝青 @zh-hant
label: 아스팔트 @ko
label: ｱｽﾌｧﾙﾄ @ja
definition: This segment includes companies that manufacture asphalt. Asphalt is a byproduct of crude oil production. It is used for road construction, when heated and mixed with aggregates. Also known as bitumen.
notation: 1810111011
valid from: 2024-06-07

Cement
type: BicsLevel5Segment
type: Classifier
type: NamedIndividual
is level5 segment of: Cement & Aggregates
is contemporary version of: http://data.ga-group.nl/ics/bics/1810111012
is version of: http://data.ga-group.nl/ics/bics/1810111012
replaces: http://data.ga-group.nl/ics/bics/2020/1810111012
imported on: 2026-06-08T13:40:52.236Z
last refreshed on: 2026-06-08T13:41:38.450Z
source accessed on: 2024-06-05T14:42:36Z
source last accessed on: 2024-06-05T14:42:36Z
label: Cemento @es
label: Ciment @fr
label: Cimento @pt
label: Zement @de
label: Цемент @ru
label: 水泥 @zh
label: 시멘트 @ko
label: ｾﾒﾝﾄ @ja
definition: This segment includes companies that manufacture cement. Cement is a powdery binder that is added to aggregates to create concrete.
notation: 1810111012
valid from: 2024-06-07

Ready Mix Concrete
type: BicsLevel5Segment
type: Classifier
type: NamedIndividual
is level5 segment of: Cement & Aggregates
is contemporary version of: http://data.ga-group.nl/ics/bics/1810111013
is version of: http://data.ga-group.nl/ics/bics/1810111013
replaces: http://data.ga-group.nl/ics/bics/2020/1810111013
imported on: 2026-06-08T13:40:52.236Z
last refreshed on: 2026-06-08T13:41:38.450Z
source accessed on: 2024-06-05T14:42:36Z
source last accessed on: 2024-06-05T14:42:36Z
label: Béton prêt à l'emploi @fr
label: Calce pronto @it
label: Concreto prefabricado @es
label: Concreto pronto @pt
label: Transportbeton @de
label: Товарный бетон @ru
label: 生ｺﾝｸﾘｰﾄ @ja
label: 預拌混凝土 @zh-hant
label: 预拌混凝土 @zh
label: 레미콘 @ko
definition: This segment includes companies that manufacture concrete. Concrete is a composite material composed of cement, aggregates and water. These companies manufacture concrete at a batching plant and deliver their products to construction sites in concrete mixers. Also known as ready mixed concrete or ReMiCon.
notation: 1810111013
valid from: 2024-06-07

Cement & Aggregates
type: BicsLevel4SubIndustry
type: Classifier
type: NamedIndividual
is sub industry of: Construction Materials
is contemporary version of: http://data.ga-group.nl/ics/bics/18101110
is version of: http://data.ga-group.nl/ics/bics/18101110
replaces: http://data.ga-group.nl/ics/bics/2020/18101110
imported on: 2026-06-08T13:40:52.236Z
last refreshed on: 2026-06-08T13:41:38.450Z
source accessed on: 2024-06-05T14:42:36Z
source last accessed on: 2024-06-05T14:42:36Z
label: Cemento e aggregati @it
label: Cemento y agregados @es
label: Cimento/agregados @pt
label: Ciments et agrégats @fr
label: Zement & Zuschläge @de
label: Цемент и заполнители @ru
label: 水泥与骨料 @zh
label: 水泥及骨材 @zh-hant
label: 水泥��骨材 @zh-hant
label: 시멘트 & 골재 @ko
label: ｾﾒﾝﾄ･骨材 @ja
definition: This industry subgroup includes companies that manufacture cement and aggregates.
notation: 18101110
valid from: 2024-06-07

Brick & Structural Clay Tile
type: BicsLevel6Segment
type: Classifier
type: NamedIndividual
is level6 segment of: Brick, Tile & Clay Bldg Matl
is contemporary version of: http://data.ga-group.nl/ics/bics/181011111010
is version of: http://data.ga-group.nl/ics/bics/181011111010
replaces: http://data.ga-group.nl/ics/bics/2020/181011111010
imported on: 2026-06-08T13:40:52.236Z
last refreshed on: 2026-06-08T13:41:38.450Z
source accessed on: 2024-06-05T14:42:36Z
source last accessed on: 2024-06-05T14:42:36Z
label: Azulejos de ladrillo y arcilla estructural @es
label: Briques/tuiles de structure en argile @fr
label: Mattonelle e mattoni strutturali @it
label: Mauerziegel & Betonbauplatten @de
label: Tijolo e azulejo de argila estrutural @pt
label: Кирпичи и строит. керамич. плитка @ru
label: 砖块与结构粘土瓦 @zh
label: 砖块与结构��土瓦 @zh
label: 磚塊/結構性黏土磚 @zh-hant
label: 벽돌 및 구조용 내화 타일 @ko
label: ﾚﾝｶﾞ･建設用粘土ﾀｲﾙ @ja
definition: This segment includes companies that manufacture clay bricks and clay tiles. Excludes bricks made from concrete (see Concrete Block & Brick Manufacturing).
notation: 181011111010
valid from: 2024-06-07

Non-Clay Refract
type: BicsLevel6Segment
type: Classifier
type: NamedIndividual
is level6 segment of: Brick, Tile & Clay Bldg Matl
is contemporary version of: http://data.ga-group.nl/ics/bics/181011111011
is version of: http://data.ga-group.nl/ics/bics/181011111011
replaces: http://data.ga-group.nl/ics/bics/2020/181011111011
imported on: 2026-06-08T13:40:52.236Z
last refreshed on: 2026-06-08T13:41:38.450Z
source accessed on: 2024-06-05T14:42:36Z
source last accessed on: 2024-06-05T14:42:36Z
label: Feuerfeste Stoffe (Nicht Ton) @de
label: Prod refrat não argila @pt
label: Réfractaires non argileux @fr
label: Refrac no barro @es
label: Refrattari non argillosi @it
label: Неглиняные огнеупорные изделия @ru
label: Неглиняные ��гнеупорные изделия @ru
label: 耐火製品 @ja
label: 非粘土防火材料 @zh
label: 非黏土耐火物 @zh-hant
label: 비내화제품 제조업 @ko
definition: This segment includes companies that manufacture non-clay refractory (high temperature) products.
notation: 181011111011
valid from: 2024-06-07

Brick, Tile & Clay Bldg Matl
type: BicsLevel5Segment
type: Classifier
type: NamedIndividual
is level5 segment of: Building Materials
is contemporary version of: http://data.ga-group.nl/ics/bics/1810111110
is version of: http://data.ga-group.nl/ics/bics/1810111110
replaces: http://data.ga-group.nl/ics/bics/2020/1810111110
imported on: 2026-06-08T13:40:52.236Z
last refreshed on: 2026-06-08T13:41:38.450Z
source accessed on: 2024-06-05T14:42:36Z
source last accessed on: 2024-06-05T14:42:36Z
label: Briques/tuiles/mat constr en argile @fr
label: Ladrillo, azul, arcilla constr @es
label: Mat const, tijolo, azulejo e argila @pt
label: Mattoni, mattonelle e materiali argillosi edili @it
label: Ziegel-, Fliesen- & Tonbaumaterial @de
label: Кирпич, плитка и глиняные строймат. @ru
label: 建築用ﾚﾝｶﾞ･ﾀｲﾙ･粘土 @ja
label: 砖块、瓷砖及粘土建材 @zh
label: 磚塊/磁磚/黏土建材 @zh-hant
label: 벽돌, 타일&점토 건축자재 @ko
definition: This segment includes companies that manufacture building products, including bricks, clay tiles, ceramic wall and floor tiles, and non-clay refractory products.
notation: 1810111110
valid from: 2024-06-07

Concrete Block & Brick
type: BicsLevel6Segment
type: Classifier
type: NamedIndividual
is level6 segment of: Concrete Products
is contemporary version of: http://data.ga-group.nl/ics/bics/181011111110
is version of: http://data.ga-group.nl/ics/bics/181011111110
replaces: http://data.ga-group.nl/ics/bics/2020/181011111110
imported on: 2026-06-08T13:40:52.236Z
last refreshed on: 2026-06-08T13:41:38.450Z
source accessed on: 2024-06-05T14:42:36Z
source last accessed on: 2024-06-05T14:42:36Z
label: Betonziegel und -blöcke @de
label: Bloc/briques en béton @fr
label: Blocchi di cemento e mattoni @it
label: Blocos e tijolos de concreto @pt
label: Bloques y ladrillos de concreto @es
label: Бетонные кирпичи/блоки @ru
label: 混凝土砌块与砖块 @zh
label: 混凝土磚塊 @zh-hant
label: 콘크리트 벽돌 및 블록 @ko
label: ｺﾝｸﾘｰﾄﾌﾞﾛｯｸ･ﾚﾝｶﾞ @ja
definition: This segment includes companies that manufacture concrete blocks and bricks. Excludes bricks made from clay (see Brick & Structural Clay Tile Manufacturing).
notation: 181011111110
valid from: 2024-06-07

Concrete Pipe
type: BicsLevel6Segment
type: Classifier
type: NamedIndividual
is level6 segment of: Concrete Products
is contemporary version of: http://data.ga-group.nl/ics/bics/181011111111
is version of: http://data.ga-group.nl/ics/bics/181011111111
replaces: http://data.ga-group.nl/ics/bics/2020/181011111111
imported on: 2026-06-08T13:40:52.236Z
last refreshed on: 2026-06-08T13:41:38.450Z
source accessed on: 2024-06-05T14:42:36Z
source last accessed on: 2024-06-05T14:42:36Z
label: Betonrohr @de
label: Tubería de concreto @es
label: Tubi in calcestruzzo @it
label: Tubos de concreto @pt
label: Tuyaux en béton @fr
label: Бетонные трубы @ru
label: 混凝土管道 @zh
label: 콘크리트관 제조업 @ko
label: ｺﾝｸﾘｰﾄ管 @ja
definition: This segment includes companies that manufacture concrete pipes used for sewers and irrigation.
notation: 181011111111
valid from: 2024-06-07

Concrete Products
type: BicsLevel5Segment
type: Classifier
type: NamedIndividual
is level5 segment of: Building Materials
is contemporary version of: http://data.ga-group.nl/ics/bics/1810111111
is version of: http://data.ga-group.nl/ics/bics/1810111111
replaces: http://data.ga-group.nl/ics/bics/2020/1810111111
imported on: 2026-06-08T13:40:52.236Z
last refreshed on: 2026-06-08T13:41:38.450Z
source accessed on: 2024-06-05T14:42:36Z
source last accessed on: 2024-06-05T14:42:36Z
label: Betonprodukte @de
label: Prodotti in calcestruzzo @it
label: Productos de hormigón @es
label: Produits en béton @fr
label: Produtos concreto @pt
label: Продукция из бетона @ru
label: 混凝土产品 @zh
label: 混凝土產品 @zh-hant
label: 콘크리트 제품 제조업 @ko
label: ｺﾝｸﾘｰﾄ製品 @ja
definition: This segment includes companies that manufacture concrete construction materials and products.
notation: 1810111111
valid from: 2024-06-07

Building Glass
type: BicsLevel5Segment
type: Classifier
type: NamedIndividual
is level5 segment of: Building Materials
is contemporary version of: http://data.ga-group.nl/ics/bics/1810111112
is version of: http://data.ga-group.nl/ics/bics/1810111112
replaces: http://data.ga-group.nl/ics/bics/2020/1810111112
imported on: 2026-06-08T13:40:52.236Z
last refreshed on: 2026-06-08T13:41:38.450Z
source accessed on: 2024-06-05T14:42:36Z
source last accessed on: 2024-06-05T14:42:36Z
label: Bauglas @de
label: Verre de construction @fr
label: Vetro da costruzione @it
label: Vidrio para construcción @es
label: Vidro para construção @pt
label: Строит. стекло @ru
label: 建筑玻璃 @zh
label: 建築用ｶﾞﾗｽ @ja
label: 玻璃產品製造-建材 @zh-hant
label: 건축용 유리 @ko
definition: This segment includes companies that manufacture glass used in construction applications.
notation: 1810111112
valid from: 2024-06-07

Gypsum Products
type: BicsLevel5Segment
type: Classifier
type: NamedIndividual
is level5 segment of: Building Materials
is contemporary version of: http://data.ga-group.nl/ics/bics/1810111113
is version of: http://data.ga-group.nl/ics/bics/1810111113
replaces: http://data.ga-group.nl/ics/bics/2020/1810111113
imported on: 2026-06-08T13:40:52.236Z
last refreshed on: 2026-06-08T13:41:38.450Z
source accessed on: 2024-06-05T14:42:36Z
source last accessed on: 2024-06-05T14:42:36Z
label: Gipsprodukte @de
label: Prodotti in gesso @it
label: Productos de yeso @es
label: Produits en gypse @fr
label: Produtos de gesso @pt
label: Продукция из гипса @ru
label: 石こう @ja
label: 石膏产品 @zh
label: 石膏產品 @zh-hant
label: 석고제품 제조업 @ko
definition: This segment includes companies that manufacture construction materials made with gypsum. Includes wallboard, drywall, and plasterboard.
notation: 1810111113
valid from: 2024-06-07

Mineral Wool
type: BicsLevel6Segment
type: Classifier
type: NamedIndividual
is level6 segment of: Insulation Products
is contemporary version of: http://data.ga-group.nl/ics/bics/181011111410
is version of: http://data.ga-group.nl/ics/bics/181011111410
replaces: http://data.ga-group.nl/ics/bics/2020/181011111410
imported on: 2026-06-08T13:40:52.236Z
last refreshed on: 2026-06-08T13:41:38.450Z
source accessed on: 2024-06-05T14:42:36Z
source last accessed on: 2024-06-05T14:42:36Z
label: Lã mineral @pt
label: Laine minérale @fr
label: Lana mineral @es
label: Lane minerali @it
label: Mineralwolle @de
label: Минеральная вата @ru
label: 矿棉 @zh
label: 礦棉 @zh-hant
label: 미네랄 울 제조업 @ko
label: ﾐﾈﾗﾙｳｰﾙ @ja
definition: This segment includes companies that manufacture insulation from mineral fibers, such as fiberglass and stone wool.
notation: 181011111410
valid from: 2024-06-07

Polystyrene Foam Insulation
type: BicsLevel6Segment
type: Classifier
type: NamedIndividual
is level6 segment of: Insulation Products
is contemporary version of: http://data.ga-group.nl/ics/bics/181011111411
is version of: http://data.ga-group.nl/ics/bics/181011111411
replaces: http://data.ga-group.nl/ics/bics/2020/181011111411
imported on: 2026-06-08T13:40:52.236Z
last refreshed on: 2026-06-08T13:41:38.450Z
source accessed on: 2024-06-05T14:42:36Z
source last accessed on: 2024-06-05T14:42:36Z
label: Espumas e aislamiento de poliestireno @es
label: Isolamento de espuma de isopor @pt
label: Isolants en mousse de polystyrène @fr
label: Polystyrolschaumisolierung @de
label: Schiuma polistirene per isolamento @it
label: Изоляция из пенополистирола @ru
label: 発砲ｽﾁﾛｰﾙ断熱材 @ja
label: 聚苯乙烯泡沫绝缘产品 @zh
label: 聚苯乙烯泡體保溫品 @zh-hant
label: 폴리스티렌단열재 @ko
definition: This segment includes companies that manufacture polystyrene foam insulation. Excludes companies that manufacture bulk foam used in various end products (see Polystyrene Foam Product).
notation: 181011111411
valid from: 2024-06-07

Insulation Products
type: BicsLevel5Segment
type: Classifier
type: NamedIndividual
is level5 segment of: Building Materials
is contemporary version of: http://data.ga-group.nl/ics/bics/1810111114
is version of: http://data.ga-group.nl/ics/bics/1810111114
replaces: http://data.ga-group.nl/ics/bics/2020/1810111114
imported on: 2026-06-08T13:40:52.236Z
last refreshed on: 2026-06-08T13:41:38.450Z
source accessed on: 2024-06-05T14:42:36Z
source last accessed on: 2024-06-05T14:42:36Z
label: Isolationsstoffe @de
label: Prod isolamento @pt
label: Prodotti isolanti @it
label: Productos insulación @es
label: Produits d'isolation @fr
label: Изоляц. товары @ru
label: 断熱製品 @ja
label: 絕緣製品 @zh-hant
label: 绝缘产品 @zh
label: 단열재 제품 @ko
definition: This segment includes companies that manufacture construction insulation products.
notation: 1810111114
valid from: 2024-06-07

Plastic Building Materials
type: BicsLevel5Segment
type: Classifier
type: NamedIndividual
is level5 segment of: Building Materials
is contemporary version of: http://data.ga-group.nl/ics/bics/1810111115
is version of: http://data.ga-group.nl/ics/bics/1810111115
replaces: http://data.ga-group.nl/ics/bics/2020/1810111115
imported on: 2026-06-08T13:40:52.236Z
last refreshed on: 2026-06-08T13:41:38.450Z
source accessed on: 2024-06-05T14:42:36Z
source last accessed on: 2024-06-05T14:42:36Z
label: Baumaterialien aus Kunststoff @de
label: Matériaux de construction en plastique @fr
label: Materiais para construção de plástico @pt
label: Materiales plásticos de construcción @es
label: Materiali costruzione plastici @it
label: Пластиковые стройматериалы @ru
label: 合成樹脂建材 @ja
label: 塑料建材 @zh
label: 塑膠建材 @zh-hant
label: 塑���建材 @zh
label: 플라스틱건축자재 @ko
definition: This segment includes companies that manufacture construction materials primarily derived from plastic.
notation: 1810111115
valid from: 2024-06-07

Roofing Materials
type: BicsLevel5Segment
type: Classifier
type: NamedIndividual
is level5 segment of: Building Materials
is contemporary version of: http://data.ga-group.nl/ics/bics/1810111116
is version of: http://data.ga-group.nl/ics/bics/1810111116
replaces: http://data.ga-group.nl/ics/bics/2020/1810111116
imported on: 2026-06-08T13:40:52.236Z
last refreshed on: 2026-06-08T13:41:38.450Z
source accessed on: 2024-06-05T14:42:36Z
source last accessed on: 2024-06-05T14:42:36Z
label: Dachmaterialien @de
label: Matériaux de toiture @fr
label: Materiais para telhado @pt
label: Materiales de techos @es
label: Materiali tetti @it
label: Кровельное покрытие @ru
label: Кровельное по��рытие @ru
label: 屋根材 @ja
label: 屋頂材料 @zh-hant
label: 屋顶材料 @zh
label: 지붕 자재 제조업 @ko
definition: This segment includes companies that manufacture roofing materials, components of roofing systems and roofing accessories. Includes asphalt shingles and roofing cement.
notation: 1810111116
valid from: 2024-06-07

Abrasive Products
type: BicsLevel6Segment
type: Classifier
type: NamedIndividual
is level6 segment of: Sundry Building Products
is contemporary version of: http://data.ga-group.nl/ics/bics/181011111710
is version of: http://data.ga-group.nl/ics/bics/181011111710
replaces: http://data.ga-group.nl/ics/bics/2020/181011111710
imported on: 2026-06-08T13:40:52.236Z
last refreshed on: 2026-06-08T13:41:38.450Z
source accessed on: 2024-06-05T14:42:36Z
source last accessed on: 2024-06-05T14:42:36Z
label: Prodotti abrasivi @it
label: Productos abrasivos @es
label: Produits abrasifs @fr
label: Produto abrasivos @pt
label: Schleifmittel @de
label: Абразивные изделия @ru
label: 研磨制品 @zh
label: 研磨材料製品 @zh-hant
label: 研磨用製品 @ja
label: 연마제품 제조업 @ko
definition: This segment includes companies that manufacture sandpaper, grinding wheels, and other abrasive products.
notation: 181011111710
valid from: 2024-06-07

Nonmetal Mineral Products
type: BicsLevel6Segment
type: Classifier
type: NamedIndividual
is level6 segment of: Sundry Building Products
is contemporary version of: http://data.ga-group.nl/ics/bics/181011111711
is version of: http://data.ga-group.nl/ics/bics/181011111711
replaces: http://data.ga-group.nl/ics/bics/2020/181011111711
imported on: 2026-06-08T13:40:52.236Z
last refreshed on: 2026-06-08T13:41:38.450Z
source accessed on: 2024-06-05T14:42:36Z
source last accessed on: 2024-06-05T14:42:36Z
label: Nichtmetallische Mineralprodukte @de
label: Prodotti minerali non metalli @it
label: Productos de minera no metálicos @es
label: Produits minéraux non métalliques @fr
label: Produtos minerais não metálicos @pt
label: Неметаллич. минеральн. продукты @ru
label: その他非金属鉱物製品 @ja
label: 其他非金屬礦物產品 @zh-hant
label: 非金属矿物产品 @zh
label: 비금속 광물제품 @ko
definition: This segment includes companies that manufacture nonmetallic mineral products used in construction not elsewhere classified.
notation: 181011111711
valid from: 2024-06-07

Sundry Building Products
type: BicsLevel5Segment
type: Classifier
type: NamedIndividual
is level5 segment of: Building Materials
is contemporary version of: http://data.ga-group.nl/ics/bics/1810111117
is version of: http://data.ga-group.nl/ics/bics/1810111117
replaces: http://data.ga-group.nl/ics/bics/2020/1810111117
imported on: 2026-06-08T13:40:52.236Z
last refreshed on: 2026-06-08T13:41:38.450Z
source accessed on: 2024-06-05T14:42:36Z
source last accessed on: 2024-06-05T14:42:36Z
label: Productos diversa de construcción @es
label: Produits de construction divers @fr
label: Produtos div prédios @pt
label: Vari prodotti edili @it
label: Verschiedene Baumaterialien @de
label: Различные строительные изделия @ru
label: 各種建築製品 @ja
label: 杂项建筑产品 @zh
label: 기타 건축 제품 @ko
definition: This segment includes companies that manufacture abrasive products and nonmetallic mineral products.
notation: 1810111117
valid from: 2024-06-07

Limestone
type: BicsLevel6Segment
type: Classifier
type: NamedIndividual
is level6 segment of: Stone Building Products
is contemporary version of: http://data.ga-group.nl/ics/bics/181011111810
is version of: http://data.ga-group.nl/ics/bics/181011111810
replaces: http://data.ga-group.nl/ics/bics/2020/181011111810
imported on: 2026-06-08T13:40:52.236Z
last refreshed on: 2026-06-08T13:41:38.450Z
source accessed on: 2024-06-05T14:42:36Z
source last accessed on: 2024-06-05T14:42:36Z
label: Calcário @pt
label: Calcare @it
label: Kalkstein @de
label: Piedra caliza @es
label: Pierre calcaire @fr
label: Известняк @ru
label: 石灰岩 @ja
label: 石灰石 @zh
label: 石灰碎石礦業採取業 @zh-hant
label: 석회 @ko
definition: This segment includes companies that mine or manufacture building products from limestone or related stone. Includes broken limestone, dolomite, cement rock, marl and chalk.
notation: 181011111810
valid from: 2024-06-07

Dimension Stone
type: BicsLevel6Segment
type: Classifier
type: NamedIndividual
is level6 segment of: Stone Building Products
is contemporary version of: http://data.ga-group.nl/ics/bics/181011111811
is version of: http://data.ga-group.nl/ics/bics/181011111811
replaces: http://data.ga-group.nl/ics/bics/2020/181011111811
imported on: 2026-06-08T13:40:52.236Z
last refreshed on: 2026-06-08T13:41:38.450Z
source accessed on: 2024-06-05T14:42:36Z
source last accessed on: 2024-06-05T14:42:36Z
label: Naturstein @de
label: Pedras de dimensão @pt
label: Piedras ornamentales @es
label: Pierre taillée @fr
label: Pietra ornamentale @it
label: Штучный камень @ru
label: 特定尺寸石料 @zh
label: 石材礦業及採取 @zh-hant
label: 規格石材 @ja
label: 치수석재 @ko
definition: This segment includes companies that mine and quarry stones that are shaped to specific sizes and dimensions. Excludes small fabricated stones for use in road manufacturing (see Aggregates).
notation: 181011111811
valid from: 2024-06-07

Granite
type: BicsLevel6Segment
type: Classifier
type: NamedIndividual
is level6 segment of: Stone Building Products
is contemporary version of: http://data.ga-group.nl/ics/bics/181011111812
is version of: http://data.ga-group.nl/ics/bics/181011111812
replaces: http://data.ga-group.nl/ics/bics/2020/181011111812
imported on: 2026-06-08T13:40:52.236Z
last refreshed on: 2026-06-08T13:41:38.450Z
source accessed on: 2024-06-05T14:42:36Z
source last accessed on: 2024-06-05T14:42:36Z
label: Granit @de
label: Granito @es
label: Гранит @ru
label: 花岗岩 @zh
label: 花崗岩 @ja
label: 화강 @ko
definition: This segment includes companies that mine or manufacture building products from granite and related stone. Includes broken granite, gneiss, riprap, syenite, and diorite.
notation: 181011111812
valid from: 2024-06-07

Stone Building Products
type: BicsLevel5Segment
type: Classifier
type: NamedIndividual
is level5 segment of: Building Materials
is contemporary version of: http://data.ga-group.nl/ics/bics/1810111118
is version of: http://data.ga-group.nl/ics/bics/1810111118
replaces: http://data.ga-group.nl/ics/bics/2020/1810111118
imported on: 2026-06-08T13:40:52.236Z
last refreshed on: 2026-06-08T13:41:38.450Z
source accessed on: 2024-06-05T14:42:36Z
source last accessed on: 2024-06-05T14:42:36Z
label: Baumaterialien aus Stein @de
label: Prod de piedra p/construcción @es
label: Prodotti edili pietra @it
label: Produits bâtiments en pierre @fr
label: Produtos de construção de pedra @pt
label: Строит. изделия из камня @ru
label: 其他石礦業 @zh-hant
label: 石建筑产品 @zh
label: 石造建築物製品 @ja
label: 석재 건축제품 @ko
definition: This segment includes companies that mine stone or manufacture stone building products.
notation: 1810111118
valid from: 2024-06-07

Building Materials
type: BicsLevel4SubIndustry
type: Classifier
type: NamedIndividual
is sub industry of: Construction Materials
is contemporary version of: http://data.ga-group.nl/ics/bics/18101111
is version of: http://data.ga-group.nl/ics/bics/18101111
replaces: http://data.ga-group.nl/ics/bics/2020/18101111
imported on: 2026-06-08T13:40:52.236Z
last refreshed on: 2026-06-08T13:41:38.450Z
source accessed on: 2024-06-05T14:42:36Z
source last accessed on: 2024-06-05T14:42:36Z
label: Baustoffe @de
label: Mat. construção, exc madeira @pt
label: Matériaux de construction @fr
label: Materiales de construcción @es
label: Materiali edili @it
label: Строительные материалы @ru
label: 建筑材料 @zh
label: 建築資材 @ja
label: 非木材建材 @zh-hant
label: 건설자재 @ko
definition: This industry subgroup includes companies that manufacture non-wood products and materials used in construction.
notation: 18101111
valid from: 2024-06-07

Construction Materials
type: BicsLevel3Industry
type: Classifier
type: NamedIndividual
is industry of: Materials
is contemporary version of: http://data.ga-group.nl/ics/bics/181011
is version of: http://data.ga-group.nl/ics/bics/181011
replaces: http://data.ga-group.nl/ics/bics/2020/181011
imported on: 2026-06-08T13:40:52.236Z
last refreshed on: 2026-06-08T13:41:38.450Z
source accessed on: 2024-06-05T14:42:36Z
source last accessed on: 2024-06-05T14:42:36Z
label: Baustoffe @de
label: Matériaux de constr @fr
label: Materiais de construção @pt
label: Materiales de construcción @es
label: Materiali edili @it
label: Стройматериалы @ru
label: 建材 @zh-hant
label: 建筑材料 @zh
label: 建設資材 @ja
label: 건설자재 @ko
definition: This industry includes companies that manufacture materials primarily used in construction.
notation: 181011
valid from: 2024-06-07

Glass Containers
type: BicsLevel5Segment
type: Classifier
type: NamedIndividual
is level5 segment of: Containers & Packaging
is contemporary version of: http://data.ga-group.nl/ics/bics/1810121010
is version of: http://data.ga-group.nl/ics/bics/1810121010
replaces: http://data.ga-group.nl/ics/bics/2020/1810121010
imported on: 2026-06-08T13:40:52.236Z
last refreshed on: 2026-06-08T13:41:38.450Z
source accessed on: 2024-06-05T14:42:36Z
source last accessed on: 2024-06-05T14:42:36Z
label: Contêineres de vidro @pt
label: Contenants en verre @fr
label: Contenedores de vidrio @es
label: Contenitori di vetro @it
label: Glasbehälter @de
label: Стеклянные контейнеры @ru
label: 玻璃容器 @zh
label: 유리용기 제조업 @ko
label: ｶﾞﾗｽ容器 @ja
definition: This segment includes companies that manufacture glass containers used in packaging applications. Includes glass bottles, glass jars, and other types of glass containers.
notation: 1810121010
valid from: 2024-06-07

Aluminum Foil for Packaging
type: BicsLevel6Segment
type: Classifier
type: NamedIndividual
is level6 segment of: Metal Containers & Packaging
is contemporary version of: http://data.ga-group.nl/ics/bics/181012101110
is version of: http://data.ga-group.nl/ics/bics/181012101110
replaces: http://data.ga-group.nl/ics/bics/2020/181012101110
imported on: 2026-06-08T13:40:52.236Z
last refreshed on: 2026-06-08T13:41:38.450Z
source accessed on: 2024-06-05T14:42:36Z
source last accessed on: 2024-06-05T14:42:36Z
label: Aluminiumfolie für Verpackungen @de
label: Fogli alluminio per imballaggio @it
label: Folha de alumínio para embalagem @pt
label: Papel de aluminio para empaquetado @es
label: Papier d'aluminium pour emballage @fr
label: Алюмин. фольга для упаковка @ru
label: はり合わせｱﾙﾐ箔 @ja
label: 包装用铝箔 @zh
label: 包裝用鍍膜鋁箔紙 @zh-hant
label: 알루미늄 호일 @ko
definition: This segment includes companies that manufacture aluminum foil used in flexible packaging applications.
notation: 181012101110
valid from: 2024-06-07

Metal Containers
type: BicsLevel6Segment
type: Classifier
type: NamedIndividual
is level6 segment of: Metal Containers & Packaging
is contemporary version of: http://data.ga-group.nl/ics/bics/181012101111
is version of: http://data.ga-group.nl/ics/bics/181012101111
replaces: http://data.ga-group.nl/ics/bics/2020/181012101111
imported on: 2026-06-08T13:40:52.236Z
last refreshed on: 2026-06-08T13:41:38.450Z
source accessed on: 2024-06-05T14:42:36Z
source last accessed on: 2024-06-05T14:42:36Z
label: Contêineres de metal @pt
label: Contenants en métal @fr
label: Contenedores de metal @es
label: Contenitori di metallo @it
label: Metallcontainer @de
label: Металлич. контейнеры @ru
label: 金属容器 @ja
label: 金属容��� @zh
label: 金屬容器 @zh-hant
label: 금속 컨테이너 제조업 @ko
definition: This segment includes companies that manufacture metal containers used in packaging applications. Includes soda cans, soup cans, paint cans, and metal lids.
notation: 181012101111
valid from: 2024-06-07

Metal Containers & Packaging
type: BicsLevel5Segment
type: Classifier
type: NamedIndividual
is level5 segment of: Containers & Packaging
is contemporary version of: http://data.ga-group.nl/ics/bics/1810121011
is version of: http://data.ga-group.nl/ics/bics/1810121011
replaces: http://data.ga-group.nl/ics/bics/2020/1810121011
imported on: 2026-06-08T13:40:52.236Z
last refreshed on: 2026-06-08T13:41:38.450Z
source accessed on: 2024-06-05T14:42:36Z
source last accessed on: 2024-06-05T14:42:36Z
label: Contêineres de metal e embalagem @pt
label: Contenants et emballages en métal @fr
label: Contenedores de metal y embalaje @es
label: Contenitori e imballaggi metallo @it
label: Metallcontainer & -verpackung @de
label: Метал. контейн. и упаков. матер. @ru
label: 金属容器与包装 @zh
label: 金属容器･包装材 @ja
label: 金屬容器及包裝品 @zh-hant
label: 금속컨테이너&포장 @ko
definition: This segment includes companies that manufacture metal containers and metal materials used in packaging applications. Includes metal cans, metal lids, and aluminum foil.
notation: 1810121011
valid from: 2024-06-07

Corrugated Packaging Matl
type: BicsLevel6Segment
type: Classifier
type: NamedIndividual
is level6 segment of: Paper Containers & Packaging
is contemporary version of: http://data.ga-group.nl/ics/bics/181012101210
is version of: http://data.ga-group.nl/ics/bics/181012101210
replaces: http://data.ga-group.nl/ics/bics/2020/181012101210
imported on: 2026-06-08T13:40:52.236Z
last refreshed on: 2026-06-08T13:41:38.450Z
source accessed on: 2024-06-05T14:42:36Z
source last accessed on: 2024-06-05T14:42:36Z
label: Gewelltes Verpackungsmaterial @de
label: Mat de empaquetado corrugado @es
label: Mat embalagens de papel canelado @pt
label: Mat emballage carton ondulé @fr
label: Mat imballaggio cartone ondulato @it
label: Гофрированные упаковочные материалы @ru
label: 梱包用段ﾎﾞｰﾙ @ja
label: 瓦楞紙包裝材料 @zh-hant
label: 瓦楞纸包装材料 @zh
label: 골판지 포장재료 @ko
definition: This segment includes companies that manufacture cardboard items used in packaging applications. Includes corrugated boxes, linerboard boxes, and cardboard boxes.
notation: 181012101210
valid from: 2024-06-07

Molded Fiber Packaging Prods
type: BicsLevel6Segment
type: Classifier
type: NamedIndividual
is level6 segment of: Paper Containers & Packaging
is contemporary version of: http://data.ga-group.nl/ics/bics/181012101211
is version of: http://data.ga-group.nl/ics/bics/181012101211
replaces: http://data.ga-group.nl/ics/bics/2020/181012101211
imported on: 2026-06-08T13:40:52.236Z
last refreshed on: 2026-06-08T13:41:38.450Z
source accessed on: 2024-06-05T14:42:36Z
source last accessed on: 2024-06-05T14:42:36Z
label: Papierfaserverpackungen @de
label: Prod d'emballage fibre moulée @fr
label: Prod embalagem de fibras moldadas @pt
label: Prod empaquetado fibras moldeadas @es
label: Prod imballaggio fibra stampata @it
label: Упаковочные изделия из формованной фибры @ru
label: 梱包用成型ﾊﾟﾙﾌﾟ @ja
label: 梱包���成型ﾊﾟﾙﾌﾟ @ja
label: 模塑纖維包裝品 @zh-hant
label: 模塑纤维包装产品 @zh
label: 파이버주형 포장제품 @ko
definition: This segment includes companies that manufacture molded, paper-based containers. These products are made from paper pulp that is formed by a molding process. Includes egg cartons, food trays, and coffee filters.
notation: 181012101211
valid from: 2024-06-07

Paper Bag
type: BicsLevel6Segment
type: Classifier
type: NamedIndividual
is level6 segment of: Paper Containers & Packaging
is contemporary version of: http://data.ga-group.nl/ics/bics/181012101212
is version of: http://data.ga-group.nl/ics/bics/181012101212
replaces: http://data.ga-group.nl/ics/bics/2020/181012101212
imported on: 2026-06-08T13:40:52.236Z
last refreshed on: 2026-06-08T13:41:38.450Z
source accessed on: 2024-06-05T14:42:36Z
source last accessed on: 2024-06-05T14:42:36Z
label: Bolsas de papel @es
label: Papiertüten @de
label: Sacchetti carta @it
label: Sacolas de papel @pt
label: Sacs en papier @fr
label: Бумажные пакеты @ru
label: 紙袋 @ja
label: 纸袋 @zh
label: 종이가방 제조업 @ko
definition: This segment includes companies that manufacture paper bags used in packaging applications. Includes paper grocery bags, paper multiwall bags, and paper sacks.
notation: 181012101212
valid from: 2024-06-07

Paper Food Containers
type: BicsLevel6Segment
type: Classifier
type: NamedIndividual
is level6 segment of: Paper Containers & Packaging
is contemporary version of: http://data.ga-group.nl/ics/bics/181012101213
is version of: http://data.ga-group.nl/ics/bics/181012101213
replaces: http://data.ga-group.nl/ics/bics/2020/181012101213
imported on: 2026-06-08T13:40:52.236Z
last refreshed on: 2026-06-08T13:41:38.450Z
source accessed on: 2024-06-05T14:42:36Z
source last accessed on: 2024-06-05T14:42:36Z
label: Contêineres de papel para alimentos @pt
label: Contenitori carta per alimentari @it
label: Envases de papel para alimento @es
label: Lebensmittelcontainer aus Papier @de
label: Récipients alimentaires en papier @fr
label: Бумажные пищевые контейнеры @ru
label: 紙製食品容器 @ja
label: 紙類食品容器 @zh-hant
label: 纸质食品容器 @zh
label: 제지식품컨테이너 @ko
definition: This segment includes companies that manufacture sanitary containers used when serving food. Includes milk cartons, paper plates, paper cups, paper bowls, paper takeout boxes, and paper soup cups. Excludes containers used for other packaging applications.
notation: 181012101213
valid from: 2024-06-07

Paperboard Packaging Materials
type: BicsLevel6Segment
type: Classifier
type: NamedIndividual
is level6 segment of: Paper Containers & Packaging
is contemporary version of: http://data.ga-group.nl/ics/bics/181012101214
is version of: http://data.ga-group.nl/ics/bics/181012101214
replaces: http://data.ga-group.nl/ics/bics/2020/181012101214
imported on: 2026-06-08T13:40:52.236Z
last refreshed on: 2026-06-08T13:41:38.450Z
source accessed on: 2024-06-05T14:42:36Z
source last accessed on: 2024-06-05T14:42:36Z
label: Kartonverpackungsmaterialien @de
label: Matériaux d'emballage en carton @fr
label: Materiais de embalagens papelão @pt
label: Materiales de cartón de empaquetado @es
label: Materiali imballaggi cartone @it
label: Картонные упаковочные материалы @ru
label: 梱包用板紙 @ja
label: 紙板包裝材料 @zh-hant
label: 纸板包装材料 @zh
label: 판지 포장재료 @ko
definition: This segment includes companies that manufacture paperboard and paperboard boxes used in packaging applications. Includes carton board boxes, carton board containers, and paperboard sheets.
notation: 181012101214
valid from: 2024-06-07

Paper Containers & Packaging
type: BicsLevel5Segment
type: Classifier
type: NamedIndividual
is level5 segment of: Containers & Packaging
is contemporary version of: http://data.ga-group.nl/ics/bics/1810121012
is version of: http://data.ga-group.nl/ics/bics/1810121012
replaces: http://data.ga-group.nl/ics/bics/2020/1810121012
imported on: 2026-06-08T13:40:52.236Z
last refreshed on: 2026-06-08T13:41:38.450Z
source accessed on: 2024-06-05T14:42:36Z
source last accessed on: 2024-06-05T14:42:36Z
label: Contêineres e embalagem de papel @pt
label: Contenants et emballages en papier @fr
label: Contenedores y embalaje de papel @es
label: Contenitori e imballaggi carta @it
label: Papiercontainer & -verpackung @de
label: Бумажные контейнеры и упаковка @ru
label: 紙容器及包裝品 @zh-hant
label: 紙製容器･包装材 @ja
label: 纸质容器与包装 @zh
label: 纸质容��与包装 @zh
label: 종이 컨테이너&포장 @ko
definition: This segment includes companies that manufacture paper containers and paper-based packaging materials.
notation: 1810121012
valid from: 2024-06-07

Plastic Bag & Pouch
type: BicsLevel6Segment
type: Classifier
type: NamedIndividual
is level6 segment of: Plastic Containers & Packaging
is contemporary version of: http://data.ga-group.nl/ics/bics/181012101310
is version of: http://data.ga-group.nl/ics/bics/181012101310
replaces: http://data.ga-group.nl/ics/bics/2020/181012101310
imported on: 2026-06-08T13:40:52.236Z
last refreshed on: 2026-06-08T13:41:38.450Z
source accessed on: 2024-06-05T14:42:36Z
source last accessed on: 2024-06-05T14:42:36Z
label: Bolsas de plástico y paquetes @es
label: Borsa e custodie plastica @it
label: Plastiktüten & -beutel @de
label: Poches/sacs plastiques @fr
label: Sacolas e bolsas plásticas @pt
label: Полиэтилен. мешки и сумки @ru
label: 塑料袋与小袋 @zh
label: 塑膠袋及小袋 @zh-hant
label: 플라스틱 가방 및 파우치 @ko
label: ﾎﾟﾘ袋･ﾎﾟｰﾁ @ja
definition: This segment includes companies that manufacture plastic bags. Includes storage bags, grocery bags, merchandise bags, plastic multiwall bags, garbage bags, and t-shirt bags.
notation: 181012101310
valid from: 2024-06-07

Plastic Bottle
type: BicsLevel6Segment
type: Classifier
type: NamedIndividual
is level6 segment of: Plastic Containers & Packaging
is contemporary version of: http://data.ga-group.nl/ics/bics/181012101311
is version of: http://data.ga-group.nl/ics/bics/181012101311
replaces: http://data.ga-group.nl/ics/bics/2020/181012101311
imported on: 2026-06-08T13:40:52.236Z
last refreshed on: 2026-06-08T13:41:38.450Z
source accessed on: 2024-06-05T14:42:36Z
source last accessed on: 2024-06-05T14:42:36Z
label: Botellas de plástico @es
label: Bottiglie in plastica @it
label: Bouteilles en plastique @fr
label: Garrafa plástica @pt
label: Plastikflaschen @de
label: Пластиковые бутылки @ru
label: 塑料瓶 @zh
label: 塑膠瓶 @zh-hant
label: 플라스틱병 제조업 @ko
label: ﾌﾟﾗｽﾁｯｸ瓶 @ja
definition: This segment includes companies that manufacture plastic bottles and their closures. Includes PET bottles, plastic bottles, and plastic caps.
notation: 181012101311
valid from: 2024-06-07

Plastic Packaging Film & Sheet
type: BicsLevel6Segment
type: Classifier
type: NamedIndividual
is level6 segment of: Plastic Containers & Packaging
is contemporary version of: http://data.ga-group.nl/ics/bics/181012101312
is version of: http://data.ga-group.nl/ics/bics/181012101312
replaces: http://data.ga-group.nl/ics/bics/2020/181012101312
imported on: 2026-06-08T13:40:52.236Z
last refreshed on: 2026-06-08T13:41:38.450Z
source accessed on: 2024-06-05T14:42:36Z
source last accessed on: 2024-06-05T14:42:36Z
label: Envases y hojas plásticas @es
label: Feuilles/films d'emballage plastique @fr
label: Filme plástico para embalagem @pt
label: Pellicole e lastre imballaggi in plastica @it
label: Plastikverpackungsfilme @de
label: Пластмас. упаковочн. пленки @ru
label: 塑料包装薄膜与板材 @zh
label: 塑膠包裝膜/片 @zh-hant
label: 플라스틱 포장용 필름&시트 @ko
label: ﾌﾟﾗｽﾁｯｸ包装ﾌｨﾙﾑ･ｼｰﾄ @ja
definition: This segment includes companies that manufacture flexible plastic sheets and films used in packaging applications. Includes industrial plastic wrap and packaging shrink wrap.
notation: 181012101312
valid from: 2024-06-07

Protective Packaging Materials
type: BicsLevel6Segment
type: Classifier
type: NamedIndividual
is level6 segment of: Plastic Containers & Packaging
is contemporary version of: http://data.ga-group.nl/ics/bics/181012101313
is version of: http://data.ga-group.nl/ics/bics/181012101313
replaces: http://data.ga-group.nl/ics/bics/2020/181012101313
imported on: 2026-06-08T13:40:52.236Z
last refreshed on: 2026-06-08T13:41:38.450Z
source accessed on: 2024-06-05T14:42:36Z
source last accessed on: 2024-06-05T14:42:36Z
label: Matériel de packaging @fr
label: Materiais de embalagens de proteção @pt
label: Materiales protectores de empaquetado @es
label: Materiali imballaggi protettivi @it
label: Schützende Verpackungsmaterialien @de
label: Защитные упаковочные материалы @ru
label: 保护包装材料 @zh
label: 保護包裝材料 @zh-hant
label: 緩衝包装材 @ja
label: 보호포장재 @ko
definition: This segment includes companies that manufacture packaging materials used to protect other products during shipment. Includes bubble wrap, fabricated foam, and molding foam.
notation: 181012101313
valid from: 2024-06-07

Plastic Containers & Packaging
type: BicsLevel5Segment
type: Classifier
type: NamedIndividual
is level5 segment of: Containers & Packaging
is contemporary version of: http://data.ga-group.nl/ics/bics/1810121013
is version of: http://data.ga-group.nl/ics/bics/1810121013
replaces: http://data.ga-group.nl/ics/bics/2020/1810121013
imported on: 2026-06-08T13:40:52.236Z
last refreshed on: 2026-06-08T13:41:38.450Z
source accessed on: 2024-06-05T14:42:36Z
source last accessed on: 2024-06-05T14:42:36Z
label: Contêineres e embalagem de plástico @pt
label: Contenedores y embalaje plásticos @es
label: Contenitori e imballaggi plastica @it
label: Emballages/contenants plastiques @fr
label: Plastikcontainer & -verpackung @de
label: Пластиковые контейнеры и упаков. материалы @ru
label: 塑料容器与包装 @zh
label: 塑膠容器及包裝品 @zh-hant
label: 플라스틱 컨테이너&포장 @ko
label: ﾌﾟﾗｽﾁｯｸ製容器･包装材 @ja
definition: This segment includes companies that manufacture plastic containers and films used in packaging applications.
notation: 1810121013
valid from: 2024-06-07

Packaging Labels
type: BicsLevel5Segment
type: Classifier
type: NamedIndividual
is level5 segment of: Containers & Packaging
is contemporary version of: http://data.ga-group.nl/ics/bics/1810121014
is version of: http://data.ga-group.nl/ics/bics/1810121014
replaces: http://data.ga-group.nl/ics/bics/2020/1810121014
imported on: 2026-06-08T13:40:52.236Z
last refreshed on: 2026-06-08T13:41:38.450Z
source accessed on: 2024-06-05T14:42:36Z
source last accessed on: 2024-06-05T14:42:36Z
label: Etichette imball @it
label: Etiquetas de embalagem @pt
label: Etiquetas de envase @es
label: Labels d'emballage @fr
label: Verpackungsetiketten @de
label: Упаковочные ярлыки @ru
label: 包装标签 @zh
label: 包装用ﾗﾍﾞﾙ @ja
label: 包裝標籤 @zh-hant
label: 포장 라벨 @ko
definition: This segment includes companies that manufacture packaging labels and tapes. These can be made of paper, plastic, or aluminum with a pressure-sensitive adhesive backing.
notation: 1810121014
valid from: 2024-06-07

Containers & Packaging
type: BicsLevel4SubIndustry
type: Classifier
type: NamedIndividual
is sub industry of: Containers & Packaging
is contemporary version of: http://data.ga-group.nl/ics/bics/18101210
is version of: http://data.ga-group.nl/ics/bics/18101210
replaces: http://data.ga-group.nl/ics/bics/2020/18101210
imported on: 2026-06-08T13:40:52.236Z
last refreshed on: 2026-06-08T13:41:38.450Z
source accessed on: 2024-06-05T14:42:36Z
source last accessed on: 2024-06-05T14:42:36Z
label: Behälter & Verpackung @de
label: Contêineres e embalagem @pt
label: Contenants et emballages @fr
label: Contenedores y embalaje @es
label: Contenitori e imballaggi @it
label: Упаковка и тара @ru
label: 容器与包装 @zh
label: 容器與包裝 @zh-hant
label: 容器･包装 @ja
label: 컨테이너 및 포장 제조업 @ko
definition: This industry subgroup includes companies that manufacture containers and packaging materials.
notation: 18101210
valid from: 2024-06-07

Containers & Packaging
type: BicsLevel3Industry
type: Classifier
type: NamedIndividual
is industry of: Materials
is contemporary version of: http://data.ga-group.nl/ics/bics/181012
is version of: http://data.ga-group.nl/ics/bics/181012
replaces: http://data.ga-group.nl/ics/bics/2020/181012
imported on: 2026-06-08T13:40:52.236Z
last refreshed on: 2026-06-08T13:41:38.450Z
source accessed on: 2024-06-05T14:42:36Z
source last accessed on: 2024-06-05T14:42:36Z
label: Contêiner e embalagem @pt
label: Container & Verpackung @de
label: Contenedores y envasado @es
label: Contenitori e imballaggio @it
label: Emballages & Conteneurs @fr
label: Упаковка и емкости @ru
label: 容器与包装 @zh
label: 容器與包裝 @zh-hant
label: 容器･梱包 @ja
label: 컨테이너 및 포장 @ko
definition: This industry includes companies that manufacture containers and packaging materials.
notation: 181012
valid from: 2024-06-07

Timber Resources
type: BicsLevel5Segment
type: Classifier
type: NamedIndividual
is level5 segment of: Forestry & Logging
is contemporary version of: http://data.ga-group.nl/ics/bics/1810131010
is version of: http://data.ga-group.nl/ics/bics/1810131010
replaces: http://data.ga-group.nl/ics/bics/2020/1810131010
imported on: 2026-06-08T13:40:52.236Z
last refreshed on: 2026-06-08T13:41:38.450Z
source accessed on: 2024-06-05T14:42:36Z
source last accessed on: 2024-06-05T14:42:36Z
label: Fontes de madeira @pt
label: Nutzholzressourcen @de
label: Recursos de madera @es
label: Ressources forestières @fr
label: Risorse legnami @it
label: Ресурсы лесосек @ru
label: 木材資源 @zh-hant
label: 木材资源 @zh
label: 森林資源 @ja
label: 목재 자원 @ko
definition: This segment includes companies that operate and manage forestry lands or timber tracts. These companies own the underlying forest land rights to grow and maintain the timber resources.
notation: 1810131010
valid from: 2024-06-07

Logging
type: BicsLevel5Segment
type: Classifier
type: NamedIndividual
is level5 segment of: Forestry & Logging
is contemporary version of: http://data.ga-group.nl/ics/bics/1810131011
is version of: http://data.ga-group.nl/ics/bics/1810131011
replaces: http://data.ga-group.nl/ics/bics/2020/1810131011
imported on: 2026-06-08T13:40:52.236Z
last refreshed on: 2026-06-08T13:41:38.450Z
source accessed on: 2024-06-05T14:42:36Z
source last accessed on: 2024-06-05T14:42:36Z
label: Exploit. forestière @fr
label: Exploração florestal @pt
label: Holzwirtschaft @de
label: Taglio/trasp legno @it
label: Tala de árboles @es
label: Лесозаготовки @ru
label: 伐木业 @zh
label: 伐木業 @zh-hant
label: 木材伐採 @ja
label: 벌목업 @ko
definition: This segment includes companies that conduct logging operations, including cutting timber, log harvesting, and wood chipping.
notation: 1810131011
valid from: 2024-06-07

Nursery & Tree Products
type: BicsLevel5Segment
type: Classifier
type: NamedIndividual
is level5 segment of: Forestry & Logging
is contemporary version of: http://data.ga-group.nl/ics/bics/1810131012
is version of: http://data.ga-group.nl/ics/bics/1810131012
replaces: http://data.ga-group.nl/ics/bics/2020/1810131012
imported on: 2026-06-08T13:40:52.236Z
last refreshed on: 2026-06-08T13:41:38.450Z
source accessed on: 2024-06-05T14:42:36Z
source last accessed on: 2024-06-05T14:42:36Z
label: Coltivaz vivai @it
label: Cultivo en viveros @es
label: Gärtnerei& Baumzucht @de
label: Pépinière/arboricult @fr
label: Prod de viveiro e árvore @pt
label: Питомники и выращивание деревьев @ru
label: 種苗･植木栽培 @ja
label: 種苗･��木栽培 @ja
label: 苗圃及樹生產 @zh-hant
label: 苗圃和树苗生产 @zh
label: 종묘&나무재배업 @ko
definition: This segment includes companies that specialize in operating nurseries and growing trees and plants for non-retail consumers. Includes flower nurseries, Christmas tree farms, and rose nurseries. Excludes nurseries for retail consumers (Nursery & Garden Centers).
notation: 1810131012
valid from: 2024-06-07

Rubber Plantation
type: BicsLevel5Segment
type: Classifier
type: NamedIndividual
is level5 segment of: Forestry & Logging
is contemporary version of: http://data.ga-group.nl/ics/bics/1810131013
is version of: http://data.ga-group.nl/ics/bics/1810131013
replaces: http://data.ga-group.nl/ics/bics/2020/1810131013
imported on: 2026-06-08T13:40:52.236Z
last refreshed on: 2026-06-08T13:41:38.450Z
source accessed on: 2024-06-05T14:42:36Z
source last accessed on: 2024-06-05T14:42:36Z
label: Exploração de borracha @pt
label: Explotación de goma @es
label: Gummi-Plantage @de
label: Piantagione gomma @it
label: Planta. caoutchouc @fr
label: Каучуковые плантации @ru
label: 橡胶种植 @zh
label: 橡膠林 @zh-hant
label: 橡���林 @zh-hant
label: 고무 플랜테이션 @ko
label: ｺﾞﾑ栽培 @ja
definition: This segment includes companies that grow rubber trees in natural or planted forests.
notation: 1810131013
valid from: 2024-06-07

Forestry & Logging
type: BicsLevel4SubIndustry
type: Classifier
type: NamedIndividual
is sub industry of: Forestry, Paper & Wood Products
is contemporary version of: http://data.ga-group.nl/ics/bics/18101310
is version of: http://data.ga-group.nl/ics/bics/18101310
replaces: http://data.ga-group.nl/ics/bics/2020/18101310
imported on: 2026-06-08T13:40:52.236Z
last refreshed on: 2026-06-08T13:41:38.450Z
source accessed on: 2024-06-05T14:42:36Z
source last accessed on: 2024-06-05T14:42:36Z
label: Forestac y tala mad @es
label: Foresterie/Abattage @fr
label: Forstwirtschaft @de
label: Selvicoltura @it
label: Silvic e expl florestal @pt
label: Лесное хоз-во и лесозаг. @ru
label: 林业和伐木业 @zh
label: 林業及伐木業 @zh-hant
label: 林業･伐木 @ja
label: 임업 & 벌목업 @ko
definition: This industry subgroup includes companies involved in the growth, management and harvest of timber or rubber trees in natural or planted forests. This industry also includes nursery and tree products.
notation: 18101310
valid from: 2024-06-07

Paper
type: BicsLevel5Segment
type: Classifier
type: NamedIndividual
is level5 segment of: Paper & Pulp Mills
is contemporary version of: http://data.ga-group.nl/ics/bics/1810131110
is version of: http://data.ga-group.nl/ics/bics/1810131110
replaces: http://data.ga-group.nl/ics/bics/2020/1810131110
imported on: 2026-06-08T13:40:52.236Z
last refreshed on: 2026-06-08T13:41:38.450Z
source accessed on: 2024-06-05T14:42:36Z
source last accessed on: 2024-06-05T14:42:36Z
label: Carta @it
label: Papel @es
label: Papier @de
label: Бумага @ru
label: 文件 @zh-hant
label: 紙 @ja
label: 纸 @zh
label: 제지 @ko
definition: This segment includes companies that manufacture a diverse offering of paper and paper products from pulp.
notation: 1810131110
valid from: 2024-06-07

Pulp
type: BicsLevel5Segment
type: Classifier
type: NamedIndividual
is level5 segment of: Paper & Pulp Mills
is contemporary version of: http://data.ga-group.nl/ics/bics/1810131111
is version of: http://data.ga-group.nl/ics/bics/1810131111
replaces: http://data.ga-group.nl/ics/bics/2020/1810131111
imported on: 2026-06-08T13:40:52.236Z
last refreshed on: 2026-06-08T13:41:38.450Z
source accessed on: 2024-06-05T14:42:36Z
source last accessed on: 2024-06-05T14:42:36Z
label: Celulose @pt
label: Pâte à papier @fr
label: Polpa @it
label: Pulpa @es
label: Zellstoff @de
label: Целлюлоза @ru
label: 紙漿 @zh-hant
label: 纸浆 @zh
label: 펄프 @ko
label: ﾊﾟﾙﾌﾟ @ja
label: ﾊ��ﾙﾌﾟ @ja
definition: This segment includes mills that produce pulp from plant materials. Includes wood, hemp, cotton, and other plant materials used in paper production.
notation: 1810131111
valid from: 2024-06-07

Paper & Pulp Mills
type: BicsLevel4SubIndustry
type: Classifier
type: NamedIndividual
is sub industry of: Forestry, Paper & Wood Products
is contemporary version of: http://data.ga-group.nl/ics/bics/18101311
is version of: http://data.ga-group.nl/ics/bics/18101311
replaces: http://data.ga-group.nl/ics/bics/2020/18101311
imported on: 2026-06-08T13:40:52.236Z
last refreshed on: 2026-06-08T13:41:38.450Z
source accessed on: 2024-06-05T14:42:36Z
source last accessed on: 2024-06-05T14:42:36Z
label: Fabbriche polpa e carta @it
label: Molinería de papel y pulpa @es
label: Papier- & Zellstofffabriken @de
label: Usinas de papel e celulose @pt
label: Usines de papier/pâte à papier @fr
label: Фабрики - бумага/целлюлоза @ru
label: 紙 @zh-hant
label: 紙･ﾊﾟﾙﾌﾟ @ja
label: 纸和纸浆厂 @zh
label: 纸和纸浆��� @zh
label: 종이 및 펄프 제조업 @ko
definition: This industry subgroup includes companies that manufacture raw pulp materials and bulk paper for printing.
notation: 18101311
valid from: 2024-06-07

Sawmills
type: BicsLevel6Segment
type: Classifier
type: NamedIndividual
is level6 segment of: Structural Wood
is contemporary version of: http://data.ga-group.nl/ics/bics/181013121010
is version of: http://data.ga-group.nl/ics/bics/181013121010
replaces: http://data.ga-group.nl/ics/bics/2020/181013121010
imported on: 2026-06-08T13:40:52.236Z
last refreshed on: 2026-06-08T13:41:38.450Z
source accessed on: 2024-06-05T14:42:36Z
source last accessed on: 2024-06-05T14:42:36Z
label: Aserraderos @es
label: Sägewerke @de
label: Scieries @fr
label: Segherie @it
label: Serrarias @pt
label: Лесопильни @ru
label: 製材 @ja
label: 鋸木廠 @zh-hant
label: 锯木厂 @zh
label: 일반 제재업 @ko
definition: This segment includes companies that operate sawmills.
notation: 181013121010
valid from: 2024-06-07

Softwood Veneer & Plywood
type: BicsLevel6Segment
type: Classifier
type: NamedIndividual
is level6 segment of: Structural Wood
is contemporary version of: http://data.ga-group.nl/ics/bics/181013121011
is version of: http://data.ga-group.nl/ics/bics/181013121011
replaces: http://data.ga-group.nl/ics/bics/2020/181013121011
imported on: 2026-06-08T13:40:52.236Z
last refreshed on: 2026-06-08T13:41:38.450Z
source accessed on: 2024-06-05T14:42:36Z
source last accessed on: 2024-06-05T14:42:36Z
label: Folheados de madeira macia e compensado @pt
label: Laminados y triplay de madera suave @es
label: Legno dolce e compensato @it
label: Placages et contreplaqués de résineux @fr
label: Weichholzfurniere & Sperrholz @de
label: Листовая фанера и обшивка (мгк древесина) @ru
label: 軟木薄板及合板 @zh-hant
label: 軟材製ﾍﾞﾆﾔ板･合板 @ja
label: 软木饰面板及胶合板 @zh
label: 연화 단판 및 합판 @ko
definition: This segment includes companies that manufacture softwood veneer, softwood plywood, and softwood flooring. Includes cedar plywood, pine plywood, and spruce plywood.
notation: 181013121011
valid from: 2024-06-07

Engineered Wood
type: BicsLevel6Segment
type: Classifier
type: NamedIndividual
is level6 segment of: Structural Wood
is contemporary version of: http://data.ga-group.nl/ics/bics/181013121012
is version of: http://data.ga-group.nl/ics/bics/181013121012
replaces: http://data.ga-group.nl/ics/bics/2020/181013121012
imported on: 2026-06-08T13:40:52.236Z
last refreshed on: 2026-06-08T13:41:38.450Z
source accessed on: 2024-06-05T14:42:36Z
source last accessed on: 2024-06-05T14:42:36Z
label: Aglutinados de madera @es
label: Bois d'ingénierie @fr
label: Holzwerkstoffe @de
label: Legno compensato @it
label: Madeira compensada @pt
label: Изделия из дерева @ru
label: 复合木 @zh
label: 工程木材(衍架除外) @zh-hant
label: 집성재 @ko
label: ｴﾝｼﾞﾆｱｰﾄﾞｳｯﾄﾞ @ja
definition: This segment includes companies that manufacture fabricated or laminated wood composites used for structural purposes. Excludes engineered wood in truss or panel form.
notation: 181013121012
valid from: 2024-06-07

Wood Preservation
type: BicsLevel6Segment
type: Classifier
type: NamedIndividual
is level6 segment of: Structural Wood
is contemporary version of: http://data.ga-group.nl/ics/bics/181013121013
is version of: http://data.ga-group.nl/ics/bics/181013121013
replaces: http://data.ga-group.nl/ics/bics/2020/181013121013
imported on: 2026-06-08T13:40:52.236Z
last refreshed on: 2026-06-08T13:41:38.450Z
source accessed on: 2024-06-05T14:42:36Z
source last accessed on: 2024-06-05T14:42:36Z
label: Conservación madera @es
label: Conservazione legno @it
label: Holzkonservierung @de
label: Préservation du bois @fr
label: Preservação de madeira @pt
label: Пропитка древесины консервантами @ru
label: 木材防腐 @zh-hant
label: 木材防腐业 @zh
label: 防腐木材 @ja
label: 목재보존업 @ko
definition: This segment includes companies that treat wood products with preservatives to prevent decay. Excludes manufacturing of wood products.
notation: 181013121013
valid from: 2024-06-07

Structural Wood
type: BicsLevel5Segment
type: Classifier
type: NamedIndividual
is level5 segment of: Wood Products
is contemporary version of: http://data.ga-group.nl/ics/bics/1810131210
is version of: http://data.ga-group.nl/ics/bics/1810131210
replaces: http://data.ga-group.nl/ics/bics/2020/1810131210
imported on: 2026-06-08T13:40:52.236Z
last refreshed on: 2026-06-08T13:41:38.450Z
source accessed on: 2024-06-05T14:42:36Z
source last accessed on: 2024-06-05T14:42:36Z
label: Bois de charpente @fr
label: Legno strutturale @it
label: Madeira estrutural @pt
label: Madera estructurada @es
label: Strukturholz @de
label: Структурная фанера @ru
label: 構造用木材 @ja
label: 結構三夾板 @zh-hant
label: 结构木 @zh
label: 구조용 목재 @ko
label: ��труктурная фанера @ru
definition: This segment includes companies that manufacture wood products used for structural or load bearing purposes. Structural wood is graded for physical properties and strength. Includes trusses, beams, and joists.
notation: 1810131210
valid from: 2024-06-07

Hardwood Veneer & Plywood
type: BicsLevel6Segment
type: Classifier
type: NamedIndividual
is level6 segment of: Non-Structural Wood
is contemporary version of: http://data.ga-group.nl/ics/bics/181013121110
is version of: http://data.ga-group.nl/ics/bics/181013121110
replaces: http://data.ga-group.nl/ics/bics/2020/181013121110
imported on: 2026-06-08T13:40:52.236Z
last refreshed on: 2026-06-08T13:41:38.450Z
source accessed on: 2024-06-05T14:42:36Z
source last accessed on: 2024-06-05T14:42:36Z
label: Contreplaqués/placages de feuillus @fr
label: Folheados de madeira e compensado @pt
label: Hartholzfurnier & Sperrholz @de
label: Laminados y triplay de madera dura @es
label: Legno duro e compensato @it
label: Листовая фанера и обшивка (тв. древесина) @ru
label: 硬木薄板及合板 @zh-hant
label: 硬木饰面板与胶合板 @zh
label: 硬材製ﾍﾞﾆﾔ板･合板 @ja
label: 강화 단판 및 합판 @ko
definition: This segment includes companies that manufacture hardwood veneer and hardwood plywood. Includes ash plywood, birch plywood, balsa plywood, and oak plywood.
notation: 181013121110
valid from: 2024-06-07

Reconstituted Wood Products
type: BicsLevel6Segment
type: Classifier
type: NamedIndividual
is level6 segment of: Non-Structural Wood
is contemporary version of: http://data.ga-group.nl/ics/bics/181013121111
is version of: http://data.ga-group.nl/ics/bics/181013121111
replaces: http://data.ga-group.nl/ics/bics/2020/181013121111
imported on: 2026-06-08T13:40:52.236Z
last refreshed on: 2026-06-08T13:41:38.450Z
source accessed on: 2024-06-05T14:42:36Z
source last accessed on: 2024-06-05T14:42:36Z
label: Prodotti legno ricostituito @it
label: Productos reconstituidos de madera @es
label: Produits en bois reconstitué @fr
label: Produtos de madeira reconstituída @pt
label: Wiederverwendete Holzprodukte @de
label: Реконстр. древесные изделия @ru
label: 再生木材制品 @zh
label: 組合木材 @zh-hant
label: 集成材 @ja
label: 재생목제품 @ko
definition: This segment includes companies that manufacture reconstituted wood sheets and boards.
notation: 181013121111
valid from: 2024-06-07

Non-Structural Wood
type: BicsLevel5Segment
type: Classifier
type: NamedIndividual
is level5 segment of: Wood Products
is contemporary version of: http://data.ga-group.nl/ics/bics/1810131211
is version of: http://data.ga-group.nl/ics/bics/1810131211
replaces: http://data.ga-group.nl/ics/bics/2020/1810131211
imported on: 2026-06-08T13:40:52.236Z
last refreshed on: 2026-06-08T13:41:38.450Z
source accessed on: 2024-06-05T14:42:36Z
source last accessed on: 2024-06-05T14:42:36Z
label: Bois (h pour charpente) @fr
label: Holz, nicht tragend @de
label: Legno non strutturale @it
label: Madeira não estrutural @pt
label: Madera no estructurada @es
label: Неструктурная древесина @ru
label: 非構造用木材 @ja
label: 非結構木製品 @zh-hant
label: 非结构木 @zh
label: 비구조용목재 @ko
definition: This segment includes companies that manufacture wood products that are used for non-structural or decorative purposes.
notation: 1810131211
valid from: 2024-06-07

Wood Products
type: BicsLevel4SubIndustry
type: Classifier
type: NamedIndividual
is sub industry of: Forestry, Paper & Wood Products
is contemporary version of: http://data.ga-group.nl/ics/bics/18101312
is version of: http://data.ga-group.nl/ics/bics/18101312
replaces: http://data.ga-group.nl/ics/bics/2020/18101312
imported on: 2026-06-08T13:40:52.236Z
last refreshed on: 2026-06-08T13:41:38.450Z
source accessed on: 2024-06-05T14:42:36Z
source last accessed on: 2024-06-05T14:42:36Z
label: Holzprodukte @de
label: Prodotti in legno @it
label: Productos de madera @es
label: Produits en bois @fr
label: Produtos de madeira @pt
label: Древесные изделия @ru
label: 木制品 @zh
label: 木材建材製造 @zh-hant
label: 木材製品 @ja
label: 목제품 @ko
definition: This industry subgroup includes companies that manufacture wood products and wood materials primarily used in construction. Excludes wood products used in interior furnishings (see Home Improvement).
notation: 18101312
valid from: 2024-06-07

Forestry, Paper & Wood Products
type: BicsLevel3Industry
type: Classifier
type: NamedIndividual
is industry of: Materials
is contemporary version of: http://data.ga-group.nl/ics/bics/181013
is version of: http://data.ga-group.nl/ics/bics/181013
replaces: http://data.ga-group.nl/ics/bics/2020/181013
imported on: 2026-06-08T13:40:52.236Z
last refreshed on: 2026-06-08T13:41:38.450Z
source accessed on: 2024-06-05T14:42:36Z
source last accessed on: 2024-06-05T14:42:36Z
label: Forst-, Papier- & Holzprodukte @de
label: Prod forestiers/papier/bois @fr
label: Productos forestales, papel y madera @es
label: Selvicoltura, carta, prod legno @it
label: Silvicultura, papel e produtos de madeira @pt
label: Лес, бумага/древесина @ru
label: 林业、纸张及木制品 @zh
label: 林木及紙產品 @zh-hant
label: 林産品･紙･木材製品 @ja
label: 임업, 종이 및 목제품 @ko
definition: This industry includes companies that conduct forestry operations or manufacture paper products. Excludes paper products (see Containers & Packaging).
notation: 181013
valid from: 2024-06-07

Flat Rolled
type: BicsLevel5Segment
type: Classifier
type: NamedIndividual
is level5 segment of: Steel Producers
is contemporary version of: http://data.ga-group.nl/ics/bics/1810141010
is version of: http://data.ga-group.nl/ics/bics/1810141010
replaces: http://data.ga-group.nl/ics/bics/2020/1810141010
imported on: 2026-06-08T13:40:52.236Z
last refreshed on: 2026-06-08T13:41:38.450Z
source accessed on: 2024-06-05T14:42:36Z
source last accessed on: 2024-06-05T14:42:36Z
label: Flachstahl @de
label: Laminé plat @fr
label: Laminado plano @es
label: Laminado @pt
label: Laminati piatti @it
label: Полосовая сталь @ru
label: 圧延製品 @ja
label: 扁軋鋼 @zh-hant
label: 扁钢材 @zh
label: 압연평판 @ko
definition: This segment includes companies that produce steel processed on rolls with flat faces to create flat/sheet steel products. Includes hot-rolled, cold-rolled, and galvanized sheets, strip and tin.
notation: 1810141010
valid from: 2024-06-07

Long Products
type: BicsLevel6Segment
type: Classifier
type: NamedIndividual
is level6 segment of: Long, Pipe & Tubular
is contemporary version of: http://data.ga-group.nl/ics/bics/181014101110
is version of: http://data.ga-group.nl/ics/bics/181014101110
replaces: http://data.ga-group.nl/ics/bics/2020/181014101110
imported on: 2026-06-08T13:40:52.236Z
last refreshed on: 2026-06-08T13:41:38.450Z
source accessed on: 2024-06-05T14:42:36Z
source last accessed on: 2024-06-05T14:42:36Z
label: Long Produkte @de
label: Prodotti long @it
label: Productos largos @es
label: Produits longs @fr
label: Produtos longos @pt
label: Долгосрочные продукты @ru
label: 条鋼 @ja
label: 長型產品 @zh-hant
label: 长材 @zh
label: 장형 제품 @ko
definition: This segment includes companies that produce long products. Includes bars, rods, rebar, channels, and structural products (I-beams, girders).
notation: 181014101110
valid from: 2024-06-07

Pipe & Tubular
type: BicsLevel6Segment
type: Classifier
type: NamedIndividual
is level6 segment of: Long, Pipe & Tubular
is contemporary version of: http://data.ga-group.nl/ics/bics/181014101111
is version of: http://data.ga-group.nl/ics/bics/181014101111
replaces: http://data.ga-group.nl/ics/bics/2020/181014101111
imported on: 2026-06-08T13:40:52.236Z
last refreshed on: 2026-06-08T13:41:38.450Z
source accessed on: 2024-06-05T14:42:36Z
source last accessed on: 2024-06-05T14:42:36Z
label: Condutt e tubol @it
label: Ducto y tubular @es
label: Oleodutos e tubulação @pt
label: Rohr & röhrenförmig @de
label: Tuyaux et tubes @fr
label: Трубы @ru
label: 管材 @zh
label: 管�� @zh
label: 鋼管 @ja
label: 강관 @ko
definition: This segment includes companies that produce steel tubes and pipes.
notation: 181014101111
valid from: 2024-06-07

Steel Wire Drawing
type: BicsLevel6Segment
type: Classifier
type: NamedIndividual
is level6 segment of: Long, Pipe & Tubular
is contemporary version of: http://data.ga-group.nl/ics/bics/181014101112
is version of: http://data.ga-group.nl/ics/bics/181014101112
replaces: http://data.ga-group.nl/ics/bics/2020/181014101112
imported on: 2026-06-08T13:40:52.236Z
last refreshed on: 2026-06-08T13:41:38.450Z
source accessed on: 2024-06-05T14:42:36Z
source last accessed on: 2024-06-05T14:42:36Z
label: Etirage fils d'acier @fr
label: Extr alambres acero @es
label: Rinven filo acciaio @it
label: Trefilação de fios de aço @pt
label: Ziehen v. Stahldraht @de
label: Волочение стальных пружин @ru
label: 线材拉丝 @zh
label: 鋼伸線 @ja
label: 鋼線伸線 @zh-hant
label: 강선 제조업 @ko
definition: This segment includes companies that manufacture steel wire.
notation: 181014101112
valid from: 2024-06-07

Long, Pipe & Tubular
type: BicsLevel5Segment
type: Classifier
type: NamedIndividual
is level5 segment of: Steel Producers
is contemporary version of: http://data.ga-group.nl/ics/bics/1810141011
is version of: http://data.ga-group.nl/ics/bics/1810141011
replaces: http://data.ga-group.nl/ics/bics/2020/1810141011
imported on: 2026-06-08T13:40:52.236Z
last refreshed on: 2026-06-08T13:41:38.450Z
source accessed on: 2024-06-05T14:42:36Z
source last accessed on: 2024-06-05T14:42:36Z
label: Lang, Röhre & röhrenförmig @de
label: Largo, ducto y tubular @es
label: Long, conduttura, tubolare @it
label: Long, tuyaux et tubes @fr
label: Tubulares, longos e dutos @pt
label: Сортовой прокат, трубы @ru
label: 条鋼･鋼管 @ja
label: 钢管 @zh
label: 長管材 @zh-hant
label: 장강, 강관 @ko
definition: This segment includes companies that produce steel pipes, wire, rods, and structural products.
notation: 1810141011
valid from: 2024-06-07

Specialty Metals
type: BicsLevel5Segment
type: Classifier
type: NamedIndividual
is level5 segment of: Steel Producers
is contemporary version of: http://data.ga-group.nl/ics/bics/1810141012
is version of: http://data.ga-group.nl/ics/bics/1810141012
replaces: http://data.ga-group.nl/ics/bics/2020/1810141012
imported on: 2026-06-08T13:40:52.236Z
last refreshed on: 2026-06-08T13:41:38.450Z
source accessed on: 2024-06-05T14:42:36Z
source last accessed on: 2024-06-05T14:42:36Z
label: Métaux spéciaux @fr
label: Metais específicos @pt
label: Metales especiales @es
label: Metalli specializzati @it
label: Sondermetalle @de
label: Металлы со спец. свойствами @ru
label: 特殊金属 @ja
label: 特殊金屬 @zh-hant
label: 特种金属 @zh
label: 특수 금속 @ko
definition: This segment includes companies that manufacture flat-rolled and long products made of stainless steel, titanium, and high alloy steels.
notation: 1810141012
valid from: 2024-06-07

Steel Producers
type: BicsLevel4SubIndustry
type: Classifier
type: NamedIndividual
is sub industry of: Steel
is contemporary version of: http://data.ga-group.nl/ics/bics/18101410
is version of: http://data.ga-group.nl/ics/bics/18101410
replaces: http://data.ga-group.nl/ics/bics/2020/18101410
imported on: 2026-06-08T13:40:52.236Z
last refreshed on: 2026-06-08T13:41:38.450Z
source accessed on: 2024-06-05T14:42:36Z
source last accessed on: 2024-06-05T14:42:36Z
label: Producteurs d'acier @fr
label: Productores de acero @es
label: Produtores de aço @pt
label: Produttori acciaio @it
label: Stahlproduzenten @de
label: Производители стали @ru
label: 鉄鋼製造 @ja
label: 鋼製造業 @zh-hant
label: 钢材生产商 @zh
label: 철강 제조업체 @ko
definition: This industry subgroup includes companies that produce steel and steel products. Typically, these companies are vertically integrated and operate their own iron and steel mills.
notation: 18101410
valid from: 2024-06-07

Metal Service Centers
type: BicsLevel5Segment
type: Classifier
type: NamedIndividual
is level5 segment of: Metal Svc Centers & Processors
is contemporary version of: http://data.ga-group.nl/ics/bics/1810141110
is version of: http://data.ga-group.nl/ics/bics/1810141110
replaces: http://data.ga-group.nl/ics/bics/2020/1810141110
imported on: 2026-06-08T13:40:52.236Z
last refreshed on: 2026-06-08T13:41:38.450Z
source accessed on: 2024-06-05T14:42:36Z
source last accessed on: 2024-06-05T14:42:36Z
label: Centres de services des métaux @fr
label: Centri servizio metallo @it
label: Centros de serviço de metal @pt
label: Centros de servicios metálicos @es
label: Metall-Servicecenter @de
label: Центры услуг по металлу @ru
label: 服務中心 @zh-hant
label: 金属服务中心 @zh
label: 金属ｻｰﾋﾞｽｾﾝﾀｰ @ja
label: 금속 서비스 센터 @ko
definition: This segment includes companies that operate metal service center locations that distribute metal products to industrial customers. These service centers also provide value-added services including cutting, tempering, cold rolling, heat treating, and painting.
notation: 1810141110
valid from: 2024-06-07

Steel Processors
type: BicsLevel5Segment
type: Classifier
type: NamedIndividual
is level5 segment of: Metal Svc Centers & Processors
is contemporary version of: http://data.ga-group.nl/ics/bics/1810141111
is version of: http://data.ga-group.nl/ics/bics/1810141111
replaces: http://data.ga-group.nl/ics/bics/2020/1810141111
imported on: 2026-06-08T13:40:52.236Z
last refreshed on: 2026-06-08T13:41:38.450Z
source accessed on: 2024-06-05T14:42:36Z
source last accessed on: 2024-06-05T14:42:36Z
label: Procesadores de acero @es
label: Processamento de aço @pt
label: Stahlverarbeiter @de
label: Transformation de l'acier @fr
label: Trattamento acciaio @it
label: Устройства по обработке стали @ru
label: 鉄鋼加工 @ja
label: 鋼鐵處理 @zh-hant
label: 钢加工 @zh
label: 철강 가공업 @ko
definition: This segment includes companies that provide processing services for metal products. Excludes companies that wholesale and distribute from a storefront location (see Service Center).
notation: 1810141111
valid from: 2024-06-07

Metal Svc Centers & Processors
type: BicsLevel4SubIndustry
type: Classifier
type: NamedIndividual
is sub industry of: Steel
is contemporary version of: http://data.ga-group.nl/ics/bics/18101411
is version of: http://data.ga-group.nl/ics/bics/18101411
replaces: http://data.ga-group.nl/ics/bics/2020/18101411
imported on: 2026-06-08T13:40:52.236Z
last refreshed on: 2026-06-08T13:41:38.450Z
source accessed on: 2024-06-05T14:42:36Z
source last accessed on: 2024-06-05T14:42:36Z
label: Centres srvc mét/recycl @fr
label: Centri serv, elaboratori met @it
label: Centros de serv e processadores de metal @pt
label: Metall-SvcCenter & Prozessoren @de
label: Procesadores y centros serv metal @es
label: Обслуж. центры и обр. металлов @ru
label: 金属服务中心与加工商 @zh
label: 金属ｻｰﾋﾞｽ･加工 @ja
label: 金屬服務中心/其他批發 @zh-hant
label: 금속 서비스 센터 및 가공업체 @ko
definition: This industry subgroup includes companies that process, store, and distribute steel materials for end use in various industries.
notation: 18101411
valid from: 2024-06-07

Steel
type: BicsLevel3Industry
type: Classifier
type: NamedIndividual
is industry of: Materials
is contemporary version of: http://data.ga-group.nl/ics/bics/181014
is version of: http://data.ga-group.nl/ics/bics/181014
replaces: http://data.ga-group.nl/ics/bics/2020/181014
imported on: 2026-06-08T13:40:52.236Z
last refreshed on: 2026-06-08T13:41:38.450Z
source accessed on: 2024-06-05T14:42:36Z
source last accessed on: 2024-06-05T14:42:36Z
label: Aço @pt
label: Acciaio @it
label: Acero @es
label: Fer @fr
label: Stahl @de
label: Сталь @ru
label: 鉄鋼 @ja
label: 鋼鐵 @zh-hant
label: 钢材 @zh
label: 철강 @ko
definition: This industry includes companies that operate throughout the steel manufacturing supply chain.
notation: 181014
valid from: 2024-06-07

Iron Ore Mining
type: BicsLevel5Segment
type: Classifier
type: NamedIndividual
is level5 segment of: Iron
is contemporary version of: http://data.ga-group.nl/ics/bics/1810151010
is version of: http://data.ga-group.nl/ics/bics/1810151010
replaces: http://data.ga-group.nl/ics/bics/2020/1810151010
imported on: 2026-06-08T13:40:52.236Z
last refreshed on: 2026-06-08T13:41:38.450Z
source accessed on: 2024-06-05T14:42:36Z
source last accessed on: 2024-06-05T14:42:36Z
label: Eisenerzabbau @de
label: Estraz min di ferro @it
label: Extração de minério de ferro @pt
label: Mine minerais de fer @fr
label: Minería de hierro @es
label: Добыча железных руд @ru
label: 生铁矿业 @zh
label: 鉄鉱石業 @ja
label: 鐵礦業 @zh-hant
label: 철 광업 @ko
definition: This segment includes companies that mine iron ore as a raw material for steel making. Also includes companies exploring for new iron ore mining locations.
notation: 1810151010
valid from: 2024-06-07

Iron Foundries
type: BicsLevel5Segment
type: Classifier
type: NamedIndividual
is level5 segment of: Iron
is contemporary version of: http://data.ga-group.nl/ics/bics/1810151011
is version of: http://data.ga-group.nl/ics/bics/1810151011
replaces: http://data.ga-group.nl/ics/bics/2020/1810151011
imported on: 2026-06-08T13:40:52.236Z
last refreshed on: 2026-06-08T13:41:38.450Z
source accessed on: 2024-06-05T14:42:36Z
source last accessed on: 2024-06-05T14:42:36Z
label: Eisengießereien @de
label: Fonderie di ferro @it
label: Fonderies de fer @fr
label: Fundições de ferro @pt
label: Fundiciones hierro @es
label: Железолитейные заводы @ru
label: 鉄鋳造 @ja
label: 鑄鐵業 @zh-hant
label: 铸铁厂 @zh
label: 철 주조업 @ko
definition: This segment includes companies that operate foundries to produce iron castings.
notation: 1810151011
valid from: 2024-06-07

Iron
type: BicsLevel4SubIndustry
type: Classifier
type: NamedIndividual
is sub industry of: Metals & Mining
is contemporary version of: http://data.ga-group.nl/ics/bics/18101510
is version of: http://data.ga-group.nl/ics/bics/18101510
replaces: http://data.ga-group.nl/ics/bics/2020/18101510
imported on: 2026-06-08T13:40:52.236Z
last refreshed on: 2026-06-08T13:41:38.450Z
source accessed on: 2024-06-05T14:42:36Z
source last accessed on: 2024-06-05T14:42:36Z
label: Eisen @de
label: Fer @fr
label: Ferro @it
label: Hierro @es
label: Железо @ru
label: 鉄 @ja
label: 鐵 @zh-hant
label: 铁 @zh
label: 철 @ko
definition: This industry subgroup includes companies that mine, refine, and cast iron.
notation: 18101510
valid from: 2024-06-07

Bauxite Mining
type: BicsLevel6Segment
type: Classifier
type: NamedIndividual
is level6 segment of: Aluminum
is contemporary version of: http://data.ga-group.nl/ics/bics/181015111010
is version of: http://data.ga-group.nl/ics/bics/181015111010
replaces: http://data.ga-group.nl/ics/bics/2020/181015111010
imported on: 2026-06-08T13:40:52.236Z
last refreshed on: 2026-06-08T13:41:38.450Z
source accessed on: 2024-06-05T14:42:36Z
source last accessed on: 2024-06-05T14:42:36Z
label: Bauxitbergbau @de
label: Estrazione bauxite @it
label: Extração de bauxita @pt
label: Extracción de bauxita @es
label: Extraction de bauxite @fr
label: Добыча бокситов @ru
label: 鋁土礦業 @zh-hant
label: 铝土开采 @zh
label: 보크사이트 채광업 @ko
label: ﾎﾞｰｷｻｲﾄ採掘 @ja
definition: This segment includes companies that mine bauxite and refine it into alumina.
notation: 181015111010
valid from: 2024-06-07

Aluminum Smelting & Refining
type: BicsLevel6Segment
type: Classifier
type: NamedIndividual
is level6 segment of: Aluminum
is contemporary version of: http://data.ga-group.nl/ics/bics/181015111011
is version of: http://data.ga-group.nl/ics/bics/181015111011
replaces: http://data.ga-group.nl/ics/bics/2020/181015111011
imported on: 2026-06-08T13:40:52.236Z
last refreshed on: 2026-06-08T13:41:38.450Z
source accessed on: 2024-06-05T14:42:36Z
source last accessed on: 2024-06-05T14:42:36Z
label: Fundição e refino de alumínio @pt
label: Fundición y refinación de aluminio @es
label: Fusion et affinage d'aluminium @fr
label: Fusione e raffinazione alluminio @it
label: Schmelzung & Raffinierung von Aluminium @de
label: Выплавка алюминия @ru
label: 鋁冶鍊及精製 @zh-hant
label: 铝冶炼与精炼 @zh
label: 알루미늄 제련 & 정제업 @ko
label: ｱﾙﾐﾆｳﾑ精錬･精製 @ja
definition: This segment includes companies that produce aluminum from alumina.
notation: 181015111011
valid from: 2024-06-07

Aluminum
type: BicsLevel5Segment
type: Classifier
type: NamedIndividual
is level5 segment of: Base Metals
is contemporary version of: http://data.ga-group.nl/ics/bics/1810151110
is version of: http://data.ga-group.nl/ics/bics/1810151110
replaces: http://data.ga-group.nl/ics/bics/2020/1810151110
imported on: 2026-06-08T13:40:52.236Z
last refreshed on: 2026-06-08T13:41:38.450Z
source accessed on: 2024-06-05T14:42:36Z
source last accessed on: 2024-06-05T14:42:36Z
label: Alluminio @it
label: Alumínio @pt
label: Aluminio @es
label: Aluminium @de
label: Алюминий @ru
label: Алю��иний @ru
label: 鋁 @zh-hant
label: 铝 @zh
label: 알루미늄 @ko
label: ｱﾙﾐﾆｳﾑ @ja
definition: This segment includes companies that mine bauxite, produce alumina, smelt primary aluminum, and process secondary aluminum (recycling scrap to form new aluminum products).
notation: 1810151110
valid from: 2024-06-07

Cobalt
type: BicsLevel5Segment
type: Classifier
type: NamedIndividual
is level5 segment of: Base Metals
is contemporary version of: http://data.ga-group.nl/ics/bics/1810151111
is version of: http://data.ga-group.nl/ics/bics/1810151111
replaces: http://data.ga-group.nl/ics/bics/2020/1810151111
imported on: 2026-06-08T13:40:52.236Z
last refreshed on: 2026-06-08T13:41:38.450Z
source accessed on: 2024-06-05T14:42:36Z
source last accessed on: 2024-06-05T14:42:36Z
label: Cobalto @es
label: Kobalt @de
label: Кобальт @ru
label: 鈷 @zh-hant
label: 钴 @zh
label: 코발트 @ko
label: ｺﾊﾞﾙﾄ @ja
definition: This segment includes companies that mine and refine cobalt.
notation: 1810151111
valid from: 2024-06-07

Copper Mining
type: BicsLevel6Segment
type: Classifier
type: NamedIndividual
is level6 segment of: Copper
is contemporary version of: http://data.ga-group.nl/ics/bics/181015111210
is version of: http://data.ga-group.nl/ics/bics/181015111210
replaces: http://data.ga-group.nl/ics/bics/2020/181015111210
imported on: 2026-06-08T13:40:52.236Z
last refreshed on: 2026-06-08T13:41:38.450Z
source accessed on: 2024-06-05T14:42:36Z
source last accessed on: 2024-06-05T14:42:36Z
label: Estraz rame @it
label: Extraction du cuivre @fr
label: Kupferabbau @de
label: Minería de cobre @es
label: Mineração cobre @pt
label: Добыча медной руды @ru
label: 銅礦 @zh-hant
label: 銅鉱業 @ja
label: 铜矿 @zh
label: 구리 광업 @ko
definition: This segment includes companies that mine copper ore.
notation: 181015111210
valid from: 2024-06-07

Copper Smelting & Refining
type: BicsLevel6Segment
type: Classifier
type: NamedIndividual
is level6 segment of: Copper
is contemporary version of: http://data.ga-group.nl/ics/bics/181015111211
is version of: http://data.ga-group.nl/ics/bics/181015111211
replaces: http://data.ga-group.nl/ics/bics/2020/181015111211
imported on: 2026-06-08T13:40:52.236Z
last refreshed on: 2026-06-08T13:41:38.450Z
source accessed on: 2024-06-05T14:42:36Z
source last accessed on: 2024-06-05T14:42:36Z
label: Fundição e refinação de cobre @pt
label: Fundición y refinación de cobre @es
label: Fusion/affinage du cuivre @fr
label: Fusione e raffinazione rame @it
label: Kupferschmelzung & -raffinierung @de
label: Медь - плавка и переработка @ru
label: 銅冶鍊及精製 @zh-hant
label: 銅精錬･精製 @ja
label: 铜冶炼与精炼 @zh
label: 구리 제련 & 정제업 @ko
definition: This segment includes companies that smelt and refine copper.
notation: 181015111211
valid from: 2024-06-07

Copper
type: BicsLevel5Segment
type: Classifier
type: NamedIndividual
is level5 segment of: Base Metals
is contemporary version of: http://data.ga-group.nl/ics/bics/1810151112
is version of: http://data.ga-group.nl/ics/bics/1810151112
replaces: http://data.ga-group.nl/ics/bics/2020/1810151112
imported on: 2026-06-08T13:40:52.236Z
last refreshed on: 2026-06-08T13:41:38.450Z
source accessed on: 2024-06-05T14:42:36Z
source last accessed on: 2024-06-05T14:42:36Z
label: Cobre @es
label: Cuivre @fr
label: Kupfer @de
label: Rame @it
label: Медь @ru
label: 銅 @ja
label: 铜 @zh
label: 구리 @ko
definition: This segment includes companies that mine and refine copper ore.
notation: 1810151112
valid from: 2024-06-07

Manganese
type: BicsLevel5Segment
type: Classifier
type: NamedIndividual
is level5 segment of: Base Metals
is contemporary version of: http://data.ga-group.nl/ics/bics/1810151113
is version of: http://data.ga-group.nl/ics/bics/1810151113
replaces: http://data.ga-group.nl/ics/bics/2020/1810151113
imported on: 2026-06-08T13:40:52.236Z
last refreshed on: 2026-06-08T13:41:38.450Z
source accessed on: 2024-06-05T14:42:36Z
source last accessed on: 2024-06-05T14:42:36Z
label: Mangan @de
label: Manganèse @fr
label: Manganês @pt
label: Manganeso @es
label: Марганец @ru
label: 錳 @zh-hant
label: 锰 @zh
label: 망간 @ko
label: ﾏﾝｶﾞﾝ @ja
definition: This segment includes companies that mine and refine manganese.
notation: 1810151113
valid from: 2024-06-07

Molybdenum
type: BicsLevel5Segment
type: Classifier
type: NamedIndividual
is level5 segment of: Base Metals
is contemporary version of: http://data.ga-group.nl/ics/bics/1810151114
is version of: http://data.ga-group.nl/ics/bics/1810151114
replaces: http://data.ga-group.nl/ics/bics/2020/1810151114
imported on: 2026-06-08T13:40:52.236Z
last refreshed on: 2026-06-08T13:41:38.450Z
source accessed on: 2024-06-05T14:42:36Z
source last accessed on: 2024-06-05T14:42:36Z
label: Molibdênio @pt
label: Molibdeno @es
label: Molybdän @de
label: Molybdène @fr
label: Молибден @ru
label: 鉬 @zh-hant
label: 钼 @zh
label: 몰리브덴 @ko
label: ﾓﾘﾌﾞﾃﾞﾝ @ja
definition: This segment includes companies that mine and refine molybdenum.
notation: 1810151114
valid from: 2024-06-07

Lead
type: BicsLevel6Segment
type: Classifier
type: NamedIndividual
is level6 segment of: Nickel, Lead & Zinc
is contemporary version of: http://data.ga-group.nl/ics/bics/181015111510
is version of: http://data.ga-group.nl/ics/bics/181015111510
replaces: http://data.ga-group.nl/ics/bics/2020/181015111510
imported on: 2026-06-08T13:40:52.236Z
last refreshed on: 2026-06-08T13:41:38.450Z
source accessed on: 2024-06-05T14:42:36Z
source last accessed on: 2024-06-05T14:42:36Z
label: Blei @de
label: Chumbo @pt
label: Colocadora @es
label: Piombo @it
label: Plomb @fr
label: Свинец @ru
label: 鉛 @ja
label: 铅 @zh
label: 납 @ko
label: �� @ja
definition: This segment includes companies that mine lead ore.
notation: 181015111510
valid from: 2024-06-07

Níquel
type: BicsLevel6Segment
type: Classifier
type: NamedIndividual
is level6 segment of: Nickel, Lead & Zinc
is contemporary version of: http://data.ga-group.nl/ics/bics/181015111511
is version of: http://data.ga-group.nl/ics/bics/181015111511
replaces: http://data.ga-group.nl/ics/bics/2020/181015111511
imported on: 2026-06-08T13:40:52.236Z
last refreshed on: 2026-06-08T13:41:38.450Z
source accessed on: 2024-06-05T14:42:36Z
source last accessed on: 2024-06-05T14:42:36Z
label: Nichel @it
label: Nickel
label: Никель @ru
label: 鎳 @zh-hant
label: 镍 @zh
label: 니켈 @ko
label: ﾆｯｹﾙ @ja
definition: This segment includes companies that mine nickel ore.
notation: 181015111511
valid from: 2024-06-07

Zinc
type: BicsLevel6Segment
type: Classifier
type: NamedIndividual
is level6 segment of: Nickel, Lead & Zinc
is contemporary version of: http://data.ga-group.nl/ics/bics/181015111512
is version of: http://data.ga-group.nl/ics/bics/181015111512
replaces: http://data.ga-group.nl/ics/bics/2020/181015111512
imported on: 2026-06-08T13:40:52.236Z
last refreshed on: 2026-06-08T13:41:38.450Z
source accessed on: 2024-06-05T14:42:36Z
source last accessed on: 2024-06-05T14:42:36Z
label: Zinco @it
label: Zink @de
label: Цинк @ru
label: 亜鉛 @ja
label: 鋅 @zh-hant
label: 锌 @zh
label: 아연 @ko
definition: This segment includes companies that mine zinc ore.
notation: 181015111512
valid from: 2024-06-07

Nickel, Lead & Zinc
type: BicsLevel5Segment
type: Classifier
type: NamedIndividual
is level5 segment of: Base Metals
is contemporary version of: http://data.ga-group.nl/ics/bics/1810151115
is version of: http://data.ga-group.nl/ics/bics/1810151115
replaces: http://data.ga-group.nl/ics/bics/2020/1810151115
imported on: 2026-06-08T13:40:52.236Z
last refreshed on: 2026-06-08T13:41:38.450Z
source accessed on: 2024-06-05T14:42:36Z
source last accessed on: 2024-06-05T14:42:36Z
label: Níquel, chumbo e zinco @pt
label: Níquel, plomo y zinc @es
label: Nichel, piombo e zinco @it
label: Nickel, Blei & Zink @de
label: Nickel, plomb et zinc @fr
label: Никель, свинец и цинк @ru
label: 鎳、鉛及鋅礦 @zh-hant
label: 银，铅及锌 @zh
label: 니켈, 납, 아연 @ko
label: ﾆｯｹﾙ･鉛･亜鉛 @ja
definition: This segment includes companies that mine nickel, lead, and zinc ore and their related aggregates.
notation: 1810151115
valid from: 2024-06-07

Tin
type: BicsLevel5Segment
type: Classifier
type: NamedIndividual
is level5 segment of: Base Metals
is contemporary version of: http://data.ga-group.nl/ics/bics/1810151116
is version of: http://data.ga-group.nl/ics/bics/1810151116
replaces: http://data.ga-group.nl/ics/bics/2020/1810151116
imported on: 2026-06-08T13:40:52.236Z
last refreshed on: 2026-06-08T13:41:38.450Z
source accessed on: 2024-06-05T14:42:36Z
source last accessed on: 2024-06-05T14:42:36Z
label: Estaño @es
label: Estanho @pt
label: Etain @fr
label: Stagno @it
label: Zinn @de
label: Жесть @ru
label: 錫 @zh-hant
label: 锡 @zh
label: 주석 @ko
label: ｽｽﾞ @ja
definition: This segment includes companies that mine and refine tin.
notation: 1810151116
valid from: 2024-06-07

Uranium
type: BicsLevel5Segment
type: Classifier
type: NamedIndividual
is level5 segment of: Base Metals
is contemporary version of: http://data.ga-group.nl/ics/bics/1810151117
is version of: http://data.ga-group.nl/ics/bics/1810151117
replaces: http://data.ga-group.nl/ics/bics/2020/1810151117
imported on: 2026-06-08T13:40:52.236Z
last refreshed on: 2026-06-08T13:41:38.450Z
source accessed on: 2024-06-05T14:42:36Z
source last accessed on: 2024-06-05T14:42:36Z
label: Urânio @pt
label: Uran @de
label: Uranio @es
label: Урановые руды @ru
label: 鈾 @zh-hant
label: 铀 @zh
label: 우라늄 @ko
label: ｳﾗﾆｳﾑ @ja
definition: This segment includes companies that mine uranium ore or extract uranium from the ore for further refinement or enrichment.
notation: 1810151117
valid from: 2024-06-07

Base Metals
type: BicsLevel4SubIndustry
type: Classifier
type: NamedIndividual
is sub industry of: Metals & Mining
is contemporary version of: http://data.ga-group.nl/ics/bics/18101511
is version of: http://data.ga-group.nl/ics/bics/18101511
replaces: http://data.ga-group.nl/ics/bics/2020/18101511
imported on: 2026-06-08T13:40:52.236Z
last refreshed on: 2026-06-08T13:41:38.450Z
source accessed on: 2024-06-05T14:42:36Z
source last accessed on: 2024-06-05T14:42:36Z
label: Grundmetalle @de
label: Métaux de base @fr
label: Metais de base @pt
label: Metales base @es
label: Metalli base @it
label: Цветные металлы @ru
label: 基本金属 @zh
label: 基本金屬 @zh-hant
label: 非鉄金属 @ja
label: 기초금속 @ko
definition: This industry subgroup includes companies that mine base metals and their aggregates, such as aluminum, copper, lead, zinc, and nickel.
notation: 18101511
valid from: 2024-06-07

Gold
type: BicsLevel5Segment
type: Classifier
type: NamedIndividual
is level5 segment of: Precious Metals
is contemporary version of: http://data.ga-group.nl/ics/bics/1810151210
is version of: http://data.ga-group.nl/ics/bics/1810151210
replaces: http://data.ga-group.nl/ics/bics/2020/1810151210
imported on: 2026-06-08T13:40:52.236Z
last refreshed on: 2026-06-08T13:41:38.450Z
source accessed on: 2024-06-05T14:42:36Z
source last accessed on: 2024-06-05T14:42:36Z
label: Or @fr
label: Oro @es
label: Ouro @pt
label: Золото @ru
label: 金 @ja
label: 黃金 @zh-hant
label: 금 @ko
definition: This segment includes companies that mine gold.
notation: 1810151210
valid from: 2024-06-07

Paládio
type: BicsLevel6Segment
type: Classifier
type: NamedIndividual
is level6 segment of: Platinum Group
is contemporary version of: http://data.ga-group.nl/ics/bics/181015121110
is version of: http://data.ga-group.nl/ics/bics/181015121110
replaces: http://data.ga-group.nl/ics/bics/2020/181015121110
imported on: 2026-06-08T13:40:52.236Z
last refreshed on: 2026-06-08T13:41:38.450Z
source accessed on: 2024-06-05T14:42:36Z
source last accessed on: 2024-06-05T14:42:36Z
label: Paladio @es
label: Palladio @it
label: Palladium
label: Палладий @ru
label: 鈀金 @zh-hant
label: 钯 @zh
label: 팔라듐 @ko
label: ﾊﾟﾗｼﾞｳﾑ @ja
definition: This segment includes companies that mine palladium.
notation: 181015121110
valid from: 2024-06-07

Platinum
type: BicsLevel6Segment
type: Classifier
type: NamedIndividual
is level6 segment of: Platinum Group
is contemporary version of: http://data.ga-group.nl/ics/bics/181015121111
is version of: http://data.ga-group.nl/ics/bics/181015121111
replaces: http://data.ga-group.nl/ics/bics/2020/181015121111
imported on: 2026-06-08T13:40:52.236Z
last refreshed on: 2026-06-08T13:41:38.450Z
source accessed on: 2024-06-05T14:42:36Z
source last accessed on: 2024-06-05T14:42:36Z
label: Platin @de
label: Platina @pt
label: Platine @fr
label: Platino @es
label: Платина @ru
label: 白金 @zh-hant
label: 铂金 @zh
label: 플라티늄 @ko
label: ﾌﾟﾗﾁﾅ @ja
definition: This segment includes companies that mine platinum.
notation: 181015121111
valid from: 2024-06-07

Ródio
type: BicsLevel6Segment
type: Classifier
type: NamedIndividual
is level6 segment of: Platinum Group
is contemporary version of: http://data.ga-group.nl/ics/bics/181015121112
is version of: http://data.ga-group.nl/ics/bics/181015121112
replaces: http://data.ga-group.nl/ics/bics/2020/181015121112
imported on: 2026-06-08T13:40:52.236Z
last refreshed on: 2026-06-08T13:41:38.450Z
source accessed on: 2024-06-05T14:42:36Z
source last accessed on: 2024-06-05T14:42:36Z
label: Rhodium
label: Rodio @es
label: Родий @ru
label: 銠 @zh-hant
label: 铑 @zh
label: 로듐 @ko
label: ﾛｼﾞｳﾑ @ja
definition: This segment includes companies that mine rhodium.
notation: 181015121112
valid from: 2024-06-07

Platinum Group
type: BicsLevel5Segment
type: Classifier
type: NamedIndividual
is level5 segment of: Precious Metals
is contemporary version of: http://data.ga-group.nl/ics/bics/1810151211
is version of: http://data.ga-group.nl/ics/bics/1810151211
replaces: http://data.ga-group.nl/ics/bics/2020/1810151211
imported on: 2026-06-08T13:40:52.236Z
last refreshed on: 2026-06-08T13:41:38.450Z
source accessed on: 2024-06-05T14:42:36Z
source last accessed on: 2024-06-05T14:42:36Z
label: Grupo da platina @pt
label: Grupo de platino @es
label: Gruppo platino @it
label: Métaux du groupe platine @fr
label: Platingruppe @de
label: Металлы платиновой группы @ru
label: 白金族 @ja
label: 白金類 @zh-hant
label: 铂族 @zh
label: 백금족 @ko
definition: This segment includes companies that mine platinum, palladium, iridium, rhodium, osmium, and ruthenium.
notation: 1810151211
valid from: 2024-06-07

Silver
type: BicsLevel5Segment
type: Classifier
type: NamedIndividual
is level5 segment of: Precious Metals
is contemporary version of: http://data.ga-group.nl/ics/bics/1810151212
is version of: http://data.ga-group.nl/ics/bics/1810151212
replaces: http://data.ga-group.nl/ics/bics/2020/1810151212
imported on: 2026-06-08T13:40:52.236Z
last refreshed on: 2026-06-08T13:41:38.450Z
source accessed on: 2024-06-05T14:42:36Z
source last accessed on: 2024-06-05T14:42:36Z
label: Argent @fr
label: Argento @it
label: Plata @es
label: Prata @pt
label: Silber @de
label: Серебро @ru
label: 白銀 @zh-hant
label: 銀 @ja
label: 银 @zh
label: 은 @ko
definition: This segment includes companies that mine silver.
notation: 1810151212
valid from: 2024-06-07

Precious Metals
type: BicsLevel4SubIndustry
type: Classifier
type: NamedIndividual
is sub industry of: Metals & Mining
is contemporary version of: http://data.ga-group.nl/ics/bics/18101512
is version of: http://data.ga-group.nl/ics/bics/18101512
replaces: http://data.ga-group.nl/ics/bics/2020/18101512
imported on: 2026-06-08T13:40:52.236Z
last refreshed on: 2026-06-08T13:41:38.450Z
source accessed on: 2024-06-05T14:42:36Z
source last accessed on: 2024-06-05T14:42:36Z
label: Edelmetalle @de
label: Métaux précieux @fr
label: Metais preciosos @pt
label: Metales preciosos @es
label: Metalli preziosi @it
label: Драгоценные металлы @ru
label: 貴金属 @ja
label: 貴金屬礦業 @zh-hant
label: 贵金属 @zh
label: 귀금속 @ko
definition: This industry subgroup includes companies that mine precious metals and their aggregates.
notation: 18101512
valid from: 2024-06-07

Clay
type: BicsLevel6Segment
type: Classifier
type: NamedIndividual
is level6 segment of: Mineral Mining
is contemporary version of: http://data.ga-group.nl/ics/bics/181015131010
is version of: http://data.ga-group.nl/ics/bics/181015131010
replaces: http://data.ga-group.nl/ics/bics/2020/181015131010
imported on: 2026-06-08T13:40:52.236Z
last refreshed on: 2026-06-08T13:41:38.450Z
source accessed on: 2024-06-05T14:42:36Z
source last accessed on: 2024-06-05T14:42:36Z
label: Arcilla @es
label: Argila @pt
label: Argile @fr
label: Argilla @it
label: Ton @de
label: Глина @ru
label: 粘土 @ja
label: 陶土陶瓷 @zh-hant
label: 점토 @ko
definition: This segment includes companies that mine and quarry clays and ceramics.
notation: 181015131010
valid from: 2024-06-07

Lítio
type: BicsLevel6Segment
type: Classifier
type: NamedIndividual
is level6 segment of: Mineral Mining
is contemporary version of: http://data.ga-group.nl/ics/bics/181015131011
is version of: http://data.ga-group.nl/ics/bics/181015131011
replaces: http://data.ga-group.nl/ics/bics/2020/181015131011
imported on: 2026-06-08T13:40:52.236Z
last refreshed on: 2026-06-08T13:41:38.450Z
source accessed on: 2024-06-05T14:42:36Z
source last accessed on: 2024-06-05T14:42:36Z
label: Lithium
label: Litio @es
label: Литий @ru
label: 鋰 @zh-hant
label: 锂 @zh
label: 리튬 @ko
label: ﾘﾁｳﾑ @ja
definition: This segment includes companies that mine and refine lithium.
notation: 181015131011
valid from: 2024-06-07

Phosphate Rock
type: BicsLevel6Segment
type: Classifier
type: NamedIndividual
is level6 segment of: Mineral Mining
is contemporary version of: http://data.ga-group.nl/ics/bics/181015131012
is version of: http://data.ga-group.nl/ics/bics/181015131012
replaces: http://data.ga-group.nl/ics/bics/2020/181015131012
imported on: 2026-06-08T13:40:52.236Z
last refreshed on: 2026-06-08T13:41:38.450Z
source accessed on: 2024-06-05T14:42:36Z
source last accessed on: 2024-06-05T14:42:36Z
label: Fosfati minerali @it
label: Fosfato natural @pt
label: Phosphatgestein @de
label: Phosphorite @fr
label: Roca de fosfatos @es
label: Фосфориты @ru
label: りん鉱石 @ja
label: 磷酸盐岩石 @zh
label: 磷酸石 @zh-hant
label: 인광석 @ko
definition: This segment includes companies that mine rock phosphate.
notation: 181015131012
valid from: 2024-06-07

Potash, Soda, Borate
type: BicsLevel6Segment
type: Classifier
type: NamedIndividual
is level6 segment of: Mineral Mining
is contemporary version of: http://data.ga-group.nl/ics/bics/181015131013
is version of: http://data.ga-group.nl/ics/bics/181015131013
replaces: http://data.ga-group.nl/ics/bics/2020/181015131013
imported on: 2026-06-08T13:40:52.236Z
last refreshed on: 2026-06-08T13:41:38.450Z
source accessed on: 2024-06-05T14:42:36Z
source last accessed on: 2024-06-05T14:42:36Z
label: Potasa, soda y borato @es
label: Potassa, soda, borato @pt
label: Potasse, soude et borate @fr
label: Potassio, soda, borato @it
label: Pottasche, Soda, Borate @de
label: Калий, сода и борат @ru
label: 鉀、碳酸鈉及硼酸 @zh-hant
label: 钾肥、纯碱、硼酸盐 @zh
label: 가성칼리, 소다 및 붕산염 @ko
label: ｶﾘ･ｿｰﾀﾞ･ﾎｳ酸塩 @ja
definition: This segment includes companies that mine and refine potash, soda, and borate.
notation: 181015131013
valid from: 2024-06-07

Rare Earth
type: BicsLevel6Segment
type: Classifier
type: NamedIndividual
is level6 segment of: Mineral Mining
is contemporary version of: http://data.ga-group.nl/ics/bics/181015131014
is version of: http://data.ga-group.nl/ics/bics/181015131014
replaces: http://data.ga-group.nl/ics/bics/2020/181015131014
imported on: 2026-06-08T13:40:52.236Z
last refreshed on: 2026-06-08T13:41:38.450Z
source accessed on: 2024-06-05T14:42:36Z
source last accessed on: 2024-06-05T14:42:36Z
label: Lanthanides @fr
label: Seltene Erden @de
label: Terras raras @pt
label: Terre rare @it
label: Tierra rara @es
label: Редкоземельные @ru
label: 稀土 @zh
label: 희토류 @ko
label: ﾚｱｱｰｽ(希土類) @ja
definition: This segment includes companies that mine and refine rare earth metals.
notation: 181015131014
valid from: 2024-06-07

Mineral Mining
type: BicsLevel5Segment
type: Classifier
type: NamedIndividual
is level5 segment of: Mineral & Precious Stone Mining
is contemporary version of: http://data.ga-group.nl/ics/bics/1810151310
is version of: http://data.ga-group.nl/ics/bics/1810151310
replaces: http://data.ga-group.nl/ics/bics/2020/1810151310
imported on: 2026-06-08T13:40:52.236Z
last refreshed on: 2026-06-08T13:41:38.450Z
source accessed on: 2024-06-05T14:42:36Z
source last accessed on: 2024-06-05T14:42:36Z
label: Estrazione minerali @it
label: Extração mineral @pt
label: Extrac de minéraux @fr
label: Minería de minerales @es
label: Mineralabbau @de
label: Добыча полезных ископаемых @ru
label: 矿物开采 @zh
label: 礦物礦業 @zh-hant
label: 鉱業 @ja
label: 광물 채굴 @ko
definition: This segment includes companies that mine minerals not elsewhere classified.
notation: 1810151310
valid from: 2024-06-07

Diamonds
type: BicsLevel6Segment
type: Classifier
type: NamedIndividual
is level6 segment of: Precious Stone Mining
is contemporary version of: http://data.ga-group.nl/ics/bics/181015131110
is version of: http://data.ga-group.nl/ics/bics/181015131110
replaces: http://data.ga-group.nl/ics/bics/2020/181015131110
imported on: 2026-06-08T13:40:52.236Z
last refreshed on: 2026-06-08T13:41:38.450Z
source accessed on: 2024-06-05T14:42:36Z
source last accessed on: 2024-06-05T14:42:36Z
label: Diamanten @de
label: Diamantes @es
label: Diamanti @it
label: Diamants @fr
label: Алмазы @ru
label: 鑽石 @zh-hant
label: 钻石 @zh
label: 다이아몬드 @ko
label: ﾀﾞｲﾔﾓﾝﾄﾞ @ja
definition: This segment includes companies that mine and quarry diamonds.
notation: 181015131110
valid from: 2024-06-07

Gemstones
type: BicsLevel6Segment
type: Classifier
type: NamedIndividual
is level6 segment of: Precious Stone Mining
is contemporary version of: http://data.ga-group.nl/ics/bics/181015131111
is version of: http://data.ga-group.nl/ics/bics/181015131111
replaces: http://data.ga-group.nl/ics/bics/2020/181015131111
imported on: 2026-06-08T13:40:52.236Z
last refreshed on: 2026-06-08T13:41:38.450Z
source accessed on: 2024-06-05T14:42:36Z
source last accessed on: 2024-06-05T14:42:36Z
label: Gemas @es
label: Gemmes @fr
label: Pedras preciosas @pt
label: Pietre preziose @it
label: Schmucksteine @de
label: Драгоценные камни @ru
label: 其他非金屬礦業 @zh-hant
label: 宝石 @zh
label: 宝石用原石 @ja
label: 보석용 원석 @ko
definition: This segment includes companies that mine and quarry gemstones such as jade, amethyst, zircon, emerald, and garnet.
notation: 181015131111
valid from: 2024-06-07

Precious Stone Mining
type: BicsLevel5Segment
type: Classifier
type: NamedIndividual
is level5 segment of: Mineral & Precious Stone Mining
is contemporary version of: http://data.ga-group.nl/ics/bics/1810151311
is version of: http://data.ga-group.nl/ics/bics/1810151311
replaces: http://data.ga-group.nl/ics/bics/2020/1810151311
imported on: 2026-06-08T13:40:52.236Z
last refreshed on: 2026-06-08T13:41:38.450Z
source accessed on: 2024-06-05T14:42:36Z
source last accessed on: 2024-06-05T14:42:36Z
label: Abbau von Edelsteinen @de
label: Estrazione pietre preziose @it
label: Extração de pedras preciosas @pt
label: Extracción de piedras preciosas @es
label: Extraction pierres précieuses @fr
label: Добыча драг. камней @ru
label: 宝石开采 @zh
label: 宝石採掘 @ja
label: 貴重寶石 @zh-hant
label: 보석 채광업 @ko
definition: This segment includes companies that mine precious stones.
notation: 1810151311
valid from: 2024-06-07

Mineral & Precious Stone Mining
type: BicsLevel4SubIndustry
type: Classifier
type: NamedIndividual
is sub industry of: Metals & Mining
is contemporary version of: http://data.ga-group.nl/ics/bics/18101513
is version of: http://data.ga-group.nl/ics/bics/18101513
replaces: http://data.ga-group.nl/ics/bics/2020/18101513
imported on: 2026-06-08T13:40:52.236Z
last refreshed on: 2026-06-08T13:41:38.450Z
source accessed on: 2024-06-05T14:42:36Z
source last accessed on: 2024-06-05T14:42:36Z
label: Abbau von Mineral & Edelsteinen @de
label: Estraz minerali e pietre prez @it
label: Extração de minerais e pedras preciosas @pt
label: Extracc de piedras preciosas y minerales @es
label: Extract minéraux/p. précieuses @fr
label: Добыча полезн. ископаемых @ru
label: 其他開採礦物 @zh-hant
label: 矿物与宝石开采 @zh
label: 鉱物･宝石採掘 @ja
label: 광물 및 보석 채광업 @ko
definition: This industry subgroup includes companies that mine minerals and precious stones. Excludes non-precious stones (see Stone Building Products).
notation: 18101513
valid from: 2024-06-07

Bitum Coal & Lignite Surface
type: BicsLevel6Segment
type: Classifier
type: NamedIndividual
is level6 segment of: Thermal Coal
is contemporary version of: http://data.ga-group.nl/ics/bics/181015141010
is version of: http://data.ga-group.nl/ics/bics/181015141010
replaces: http://data.ga-group.nl/ics/bics/2020/181015141010
imported on: 2026-06-08T13:40:52.236Z
last refreshed on: 2026-06-08T13:41:38.450Z
source accessed on: 2024-06-05T14:42:36Z
source last accessed on: 2024-06-05T14:42:36Z
label: Bitume carbone e lignite superficie @it
label: Carbón bitum y superficie lignito @es
label: Extr ciel ouvert lignite/charbon bitumineux @fr
label: Steinkohle- & Lignitbergbau @de
label: Superfície lignite e carvão betuminoso @pt
label: Камен. уголь и лигнит @ru
label: 瀝青炭･褐炭鉱業 @ja
label: 烟煤与褐煤地表 @zh
label: 露天煙煤及褐煤礦業 @zh-hant
label: 역청탄 & 갈탄 노천 @ko
definition: This segment includes companies that mine surface bituminous and lignite coal.
notation: 181015141010
valid from: 2024-06-07

Bituminous Coal Underground
type: BicsLevel6Segment
type: Classifier
type: NamedIndividual
is level6 segment of: Thermal Coal
is contemporary version of: http://data.ga-group.nl/ics/bics/181015141011
is version of: http://data.ga-group.nl/ics/bics/181015141011
replaces: http://data.ga-group.nl/ics/bics/2020/181015141011
imported on: 2026-06-08T13:40:52.236Z
last refreshed on: 2026-06-08T13:41:38.450Z
source accessed on: 2024-06-05T14:42:36Z
source last accessed on: 2024-06-05T14:42:36Z
label: Carbone bituminoso sotterraneo @it
label: Extr souterraine charbon bitumineux @fr
label: Mineração subterrânea de carvão betuminoso @pt
label: Steinkohlenbergbau @de
label: Subterráneo de carbón bituminoso @es
label: Каменный уголь (в недрах) @ru
label: 地底煙煤礦業 @zh-hant
label: 瀝青炭地下炭鉱業 @ja
label: 烟煤地下 @zh
label: 역청탄 지하 @ko
definition: This segment includes companies that mine underground bituminous coal.
notation: 181015141011
valid from: 2024-06-07

Thermal Coal
type: BicsLevel5Segment
type: Classifier
type: NamedIndividual
is level5 segment of: Coal Mining
is contemporary version of: http://data.ga-group.nl/ics/bics/1810151410
is version of: http://data.ga-group.nl/ics/bics/1810151410
replaces: http://data.ga-group.nl/ics/bics/2020/1810151410
imported on: 2026-06-08T13:40:52.236Z
last refreshed on: 2026-06-08T13:41:38.450Z
source accessed on: 2024-06-05T14:42:36Z
source last accessed on: 2024-06-05T14:42:36Z
label: Carbón térmico @es
label: Carbone termico @it
label: Carvão térmico @pt
label: Charbon thermique @fr
label: Kraftwerkskohle @de
label: Энергетический уголь @ru
label: 动力煤 @zh
label: 火力発電用石炭 @ja
label: 燃煤 @zh-hant
label: 연료탄 @ko
definition: This segment includes companies that mine coal used for energy production. Also known as thermal coal or steam coal.
notation: 1810151410
valid from: 2024-06-07

Metallurgical Coal
type: BicsLevel5Segment
type: Classifier
type: NamedIndividual
is level5 segment of: Coal Mining
is contemporary version of: http://data.ga-group.nl/ics/bics/1810151411
is version of: http://data.ga-group.nl/ics/bics/1810151411
replaces: http://data.ga-group.nl/ics/bics/2020/1810151411
imported on: 2026-06-08T13:40:52.236Z
last refreshed on: 2026-06-08T13:41:38.450Z
source accessed on: 2024-06-05T14:42:36Z
source last accessed on: 2024-06-05T14:42:36Z
label: Carbón metalúrgico @es
label: Carbone metallurgico @it
label: Carvão metalúrgico @pt
label: Charbon métallurgi. @fr
label: Metallurg Kohleabbau @de
label: Коксующийся уголь @ru
label: 冶金煤炭采矿 @zh
label: 冶金用煤 @zh-hant
label: 原料炭採鉱業 @ja
label: 원료탄 @ko
definition: This segment includes companies that mine coal used for steel production. Also known as coking coal.
notation: 1810151411
valid from: 2024-06-07

Coal Mining
type: BicsLevel4SubIndustry
type: Classifier
type: NamedIndividual
is sub industry of: Metals & Mining
is contemporary version of: http://data.ga-group.nl/ics/bics/18101514
is version of: http://data.ga-group.nl/ics/bics/18101514
replaces: http://data.ga-group.nl/ics/bics/2020/18101514
imported on: 2026-06-08T13:40:52.236Z
last refreshed on: 2026-06-08T13:41:38.450Z
source accessed on: 2024-06-05T14:42:36Z
source last accessed on: 2024-06-05T14:42:36Z
label: Estrazione carbone @it
label: Extraction de charbon @fr
label: Kohleabbau @de
label: Minería de carbón @es
label: Mineração de carvão @pt
label: Добыча угля @ru
label: 煤矿开采 @zh
label: 煤礦業 @zh-hant
label: 石炭採掘 @ja
label: 채탄업 @ko
definition: This industry subgroup includes companies that mine coal.
notation: 18101514
valid from: 2024-06-07

Coal Support Services
type: BicsLevel5Segment
type: Classifier
type: NamedIndividual
is level5 segment of: Mining Services
is contemporary version of: http://data.ga-group.nl/ics/bics/1810151510
is version of: http://data.ga-group.nl/ics/bics/1810151510
replaces: http://data.ga-group.nl/ics/bics/2020/1810151510
imported on: 2026-06-08T13:40:52.236Z
last refreshed on: 2026-06-08T13:41:38.450Z
source accessed on: 2024-06-05T14:42:36Z
source last accessed on: 2024-06-05T14:42:36Z
label: Serv supporto carbone @it
label: Serviços de suporte ao carvão @pt
label: Services de soutien au charbon @fr
label: Servicios de soporte de carbón @es
label: Support-Services für Kohle @de
label: Уголь-Вспомогательные услуги @ru
label: 煤支持服务 @zh
label: 煤炭輔助服務 @zh-hant
label: 石炭ｻﾎﾟｰﾄｻｰﾋﾞｽ @ja
label: 석탄 지원 서비스 @ko
definition: This segment includes companies that provide support services for coal mining operations.
notation: 1810151510
valid from: 2024-06-07

Metals Support Services
type: BicsLevel5Segment
type: Classifier
type: NamedIndividual
is level5 segment of: Mining Services
is contemporary version of: http://data.ga-group.nl/ics/bics/1810151511
is version of: http://data.ga-group.nl/ics/bics/1810151511
replaces: http://data.ga-group.nl/ics/bics/2020/1810151511
imported on: 2026-06-08T13:40:52.236Z
last refreshed on: 2026-06-08T13:41:38.450Z
source accessed on: 2024-06-05T14:42:36Z
source last accessed on: 2024-06-05T14:42:36Z
label: Serviços de suporte à metais @pt
label: Services de soutien aux métaux @fr
label: Servicios de soporte de metales @es
label: Servizi supporto metalli @it
label: Support-Services für Metalle @de
label: Металлы-Вспомогательные услуги @ru
label: 金属支持服务 @zh
label: 金属ｻﾎﾟｰﾄｻｰﾋﾞｽ @ja
label: 金屬輔助服務 @zh-hant
label: 금속 지원 서비스 @ko
definition: This segment includes companies that provide support services for metal mining operations.
notation: 1810151511
valid from: 2024-06-07

Non-Metallic Mining Support
type: BicsLevel5Segment
type: Classifier
type: NamedIndividual
is level5 segment of: Mining Services
is contemporary version of: http://data.ga-group.nl/ics/bics/1810151512
is version of: http://data.ga-group.nl/ics/bics/1810151512
replaces: http://data.ga-group.nl/ics/bics/2020/1810151512
imported on: 2026-06-08T13:40:52.236Z
last refreshed on: 2026-06-08T13:41:38.450Z
source accessed on: 2024-06-05T14:42:36Z
source last accessed on: 2024-06-05T14:42:36Z
label: Servicios de soporte de minería no metálica @es
label: Soutien extraction minière non-métaux @fr
label: Suporte à mineração de não metálicos @pt
label: Supporto minerario non metallo @it
label: Unterstützung für nichtmetall. Bergbau @de
label: Вспомогат. услуги по добыче неметал. ископ. @ru
label: 非金属矿业支持 @zh
label: 非金属鉱業ｻﾎﾟｰﾄ @ja
label: 非金屬礦業支援 @zh-hant
label: 비금속 채굴 지원 @ko
definition: This segment includes companies that provide support services for non-metallic mining operations.
notation: 1810151512
valid from: 2024-06-07

Mining Services
type: BicsLevel4SubIndustry
type: Classifier
type: NamedIndividual
is sub industry of: Metals & Mining
is contemporary version of: http://data.ga-group.nl/ics/bics/18101515
is version of: http://data.ga-group.nl/ics/bics/18101515
replaces: http://data.ga-group.nl/ics/bics/2020/18101515
imported on: 2026-06-08T13:40:52.236Z
last refreshed on: 2026-06-08T13:41:38.450Z
source accessed on: 2024-06-05T14:42:36Z
source last accessed on: 2024-06-05T14:42:36Z
label: Bergbaudienste @de
label: Serv d'extraction @fr
label: Serv mineração @pt
label: Servicios de minería @es
label: Servizi minerari @it
label: Услуги по добыче ископаемых @ru
label: 採礦服務業 @zh-hant
label: 采矿服务 @zh
label: 鉱業関連ｻｰﾋﾞｽ @ja
label: 채굴 서비스 @ko
definition: This industry subgroup includes companies that provide support services for coal and metal mining.
notation: 18101515
valid from: 2024-06-07

Metals & Ore Whslrs & Traders
type: BicsLevel4SubIndustry
type: Classifier
type: NamedIndividual
is sub industry of: Metals & Mining
is contemporary version of: http://data.ga-group.nl/ics/bics/18101516
is version of: http://data.ga-group.nl/ics/bics/18101516
replaces: http://data.ga-group.nl/ics/bics/2020/18101516
imported on: 2026-06-08T13:40:52.236Z
last refreshed on: 2026-06-08T13:41:38.450Z
source accessed on: 2024-06-05T14:42:36Z
source last accessed on: 2024-06-05T14:42:36Z
label: Atac e comerc de metais e minério @pt
label: Com may/ops metales y min @es
label: GH/Trader v. Metall & Erz @de
label: Gross/traders en métaux/minerais @fr
label: Grossisti e comm metalli e minerali @it
label: Оптовые продавцы/трейдеры-Металлы и руда @ru
label: Оптовые продавцы/трейдеры-Металлы и ру��а @ru
label: 金属与矿石批发商及贸易商 @zh
label: 金属･鉱物卸売業者･ﾄﾚｰﾀﾞｰ @ja
label: 金屬及礦物批發/貿易 @zh-hant
label: 금속 & 광석 도매업/거래업체 @ko
definition: This industry subgroup includes companies that trade minerals and/or metals.
notation: 18101516
valid from: 2024-06-07

Metals & Mining
type: BicsLevel3Industry
type: Classifier
type: NamedIndividual
is industry of: Materials
is contemporary version of: http://data.ga-group.nl/ics/bics/181015
is version of: http://data.ga-group.nl/ics/bics/181015
replaces: http://data.ga-group.nl/ics/bics/2020/181015
imported on: 2026-06-08T13:40:52.236Z
last refreshed on: 2026-06-08T13:41:38.450Z
source accessed on: 2024-06-05T14:42:36Z
source last accessed on: 2024-06-05T14:42:36Z
label: Métaux & Minerais @fr
label: Metais e Mineração @pt
label: Metales y minas @es
label: Metalle & Bergbau @de
label: Metalli e minerari @it
label: Металлы и горная пром. @ru
label: 金属与矿业 @zh
label: 金属･鉱業 @ja
label: 金屬與礦業 @zh-hant
label: 금속과 채광 @ko
definition: This industry includes companies that mine metals and minerals. Includes stone mining and quarrying, non-ferrous metals smelting and manufacturing, and mining support services.
notation: 181015
valid from: 2024-06-07

Materials
type: BicsLevel2IndustryGroup
type: Classifier
type: NamedIndividual
is industry group of: Materials
is contemporary version of: http://data.ga-group.nl/ics/bics/1810
is version of: http://data.ga-group.nl/ics/bics/1810
replaces: http://data.ga-group.nl/ics/bics/2020/1810
imported on: 2026-06-08T13:40:52.236Z
last refreshed on: 2026-06-08T13:41:38.450Z
source accessed on: 2024-06-05T14:42:36Z
source last accessed on: 2024-06-05T14:42:36Z
label: Matériaux @fr
label: Materiais @pt
label: Materiales @es
label: Materiali @it
label: Rohstoffe @de
label: Материалы @ru
label: 原材料 @ja
label: 原物料 @zh-hant
label: 材料 @zh
label: 원자재 @ko
definition: This industry group includes companies involved in extracting or producing raw materials or semi-finished, commoditized goods for various manufacturing industries.
notation: 1810
valid from: 2024-06-07

Materials
type: BicsLevel1Sector
type: Classifier
type: NamedIndividual
is contemporary version of: http://data.ga-group.nl/ics/bics/18
is version of: http://data.ga-group.nl/ics/bics/18
replaces: http://data.ga-group.nl/ics/bics/2020/18
imported on: 2026-06-08T13:40:52.236Z
last refreshed on: 2026-06-08T13:41:38.450Z
source accessed on: 2024-06-05T14:42:36Z
source last accessed on: 2024-06-05T14:42:36Z
label: Matériaux @fr
label: Materiais @pt
label: Materiales @es
label: Materiali @it
label: Rohstoffe @de
label: Материалы @ru
label: 原材料 @ja
label: 原物料 @zh-hant
label: 材料 @zh
label: 원자재 @ko
definition: This sector includes companies involved in extracting or producing raw materials or semi-finished, commoditized goods for various manufacturing industries.
notation: 18
valid from: 2024-06-07

Broadcasting Equipment
type: BicsLevel5Segment
type: Classifier
type: NamedIndividual
is level5 segment of: Communications Equipment
is contemporary version of: http://data.ga-group.nl/ics/bics/1910101010
is version of: http://data.ga-group.nl/ics/bics/1910101010
replaces: http://data.ga-group.nl/ics/bics/2020/1910101010
imported on: 2026-06-08T13:40:52.236Z
last refreshed on: 2026-06-08T13:41:38.450Z
source accessed on: 2024-06-05T14:42:36Z
source last accessed on: 2024-06-05T14:42:36Z
label: Apparecchiature trasmissioni @it
label: Equip de transmissão @pt
label: Equipement de diffusion @fr
label: Equipo de transmisión AV @es
label: Fernseh- & Rundfunkgeräte @de
label: Оборудование для радио и телевещания @ru
label: 广播设备 @zh
label: 廣播設備 @zh-hant
label: 放送機器 @ja
label: 방송장비 @ko
definition: This segment includes companies that manufacture television and radio broadcasting equipment used to create, manage and transmit media content.
notation: 1910101010
valid from: 2024-06-07

Home & Sm Business Netw Equip
type: BicsLevel6Segment
type: Classifier
type: NamedIndividual
is level6 segment of: Data Networking Equipment
is contemporary version of: http://data.ga-group.nl/ics/bics/191010101110
is version of: http://data.ga-group.nl/ics/bics/191010101110
replaces: http://data.ga-group.nl/ics/bics/2020/191010101110
imported on: 2026-06-08T13:40:52.236Z
last refreshed on: 2026-06-08T13:41:38.450Z
source accessed on: 2024-06-05T14:42:36Z
source last accessed on: 2024-06-05T14:42:36Z
label: App rete resid e piccole aziende @it
label: Equip réseau maison/petites entreprises @fr
label: Equip rede peq negócios e domésticos @pt
label: Equipo de red para el hogar y la pequeña empresa @es
label: Netzwerkger. f. Haus & Kleinbetr. @de
label: Сетевое оборуд. для дома и малого бизнеса @ru
label: 住宅/小型企業網路設備 @zh-hant
label: 在宅事業･中小企業用ﾈｯﾄﾜｰｸ機器 @ja
label: 家庭与小企业网络设备 @zh
label: 가정 & 소형사업 네트워크설비 @ko
definition: This segment includes companies that manufacture and market home and small business networking equipment, such as routers, modems, and adapters. Includes both wireless and wireline home networking products.
notation: 191010101110
valid from: 2024-06-07

Wireless Data Network Equip
type: BicsLevel6Segment
type: Classifier
type: NamedIndividual
is level6 segment of: Data Networking Equipment
is contemporary version of: http://data.ga-group.nl/ics/bics/191010101111
is version of: http://data.ga-group.nl/ics/bics/191010101111
replaces: http://data.ga-group.nl/ics/bics/2020/191010101111
imported on: 2026-06-08T13:40:52.236Z
last refreshed on: 2026-06-08T13:41:38.450Z
source accessed on: 2024-06-05T14:42:36Z
source last accessed on: 2024-06-05T14:42:36Z
label: Apparecchi di rete mobile @it
label: Equipamento de rede de dados sem fio @pt
label: Equipement de réseaux données sans fil @fr
label: Equipo de redes de datos inalámbricos @es
label: Kabellose Datennetzwerk-Equipment @de
label: Беспроводное сетевое оборудование @ru
label: 无线数据网络设备 @zh
label: 無線ﾃﾞｰﾀﾈｯﾄﾜｰｸ機器 @ja
label: 行動通信數據網路設備 @zh-hant
label: 무선 데이터 네트워크 장비 @ko
definition: This segment includes companies that manufacture data networking equipment used to manage and transmit mobile data.
notation: 191010101111
valid from: 2024-06-07

Wireline Data Network Equip
type: BicsLevel6Segment
type: Classifier
type: NamedIndividual
is level6 segment of: Data Networking Equipment
is contemporary version of: http://data.ga-group.nl/ics/bics/191010101112
is version of: http://data.ga-group.nl/ics/bics/191010101112
replaces: http://data.ga-group.nl/ics/bics/2020/191010101112
imported on: 2026-06-08T13:40:52.236Z
last refreshed on: 2026-06-08T13:41:38.450Z
source accessed on: 2024-06-05T14:42:36Z
source last accessed on: 2024-06-05T14:42:36Z
label: Equipaggiam reti dati telefonia fissa @it
label: Equipamento de rede de dados de linha fixa @pt
label: Equipement de données par réseau filaire @fr
label: Equipo alámbrico de redes de datos @es
label: Geräte für drahtgebundenen Datennetzwerken @de
label: Проводное оборудование сетей данных @ru
label: 固網數據網路設備 @zh-hant
label: 有線ﾃﾞｰﾀﾈｯﾄﾜｰｸ機器 @ja
label: 有线数据联网设备 @zh
label: 유선 데이터 네트워크 장비 @ko
definition: This segment includes companies that manufacture enterprise and carrier-class networking equipment, such as routers, switches, bridges, and gateways.
notation: 191010101112
valid from: 2024-06-07

Data Networking Equipment
type: BicsLevel5Segment
type: Classifier
type: NamedIndividual
is level5 segment of: Communications Equipment
is contemporary version of: http://data.ga-group.nl/ics/bics/1910101011
is version of: http://data.ga-group.nl/ics/bics/1910101011
replaces: http://data.ga-group.nl/ics/bics/2020/1910101011
imported on: 2026-06-08T13:40:52.236Z
last refreshed on: 2026-06-08T13:41:38.450Z
source accessed on: 2024-06-05T14:42:36Z
source last accessed on: 2024-06-05T14:42:36Z
label: Apparecchiature rete dati @it
label: Ausstattung des Datennetzwerks @de
label: Equipamento de rede dados @pt
label: Equipement de réseaux de données @fr
label: Equipo de red de datos @es
label: Оборудование для сетей данных @ru
label: 数据联网设备 @zh
label: 數據網路設備 @zh-hant
label: 데이터 네트워킹 장비 @ko
label: ﾃﾞｰﾀﾈｯﾄﾜｰｸ機器 @ja
definition: This segment includes companies that manufacture data networking equipment for wireless and wireline networks. Includes enterprise networking equipment, as well as small business and home premises equipment.
notation: 1910101011
valid from: 2024-06-07

Mobile Phones
type: BicsLevel5Segment
type: Classifier
type: NamedIndividual
is level5 segment of: Communications Equipment
is contemporary version of: http://data.ga-group.nl/ics/bics/1910101012
is version of: http://data.ga-group.nl/ics/bics/1910101012
replaces: http://data.ga-group.nl/ics/bics/2020/1910101012
imported on: 2026-06-08T13:40:52.236Z
last refreshed on: 2026-06-08T13:41:38.450Z
source accessed on: 2024-06-05T14:42:36Z
source last accessed on: 2024-06-05T14:42:36Z
label: Celulares @es
label: Mobiltelefone @de
label: Téléphones portables @fr
label: Telefones móveis @pt
label: Telefonia mobile @it
label: Мобильные телефоны @ru
label: 携帯電話 @ja
label: 移动电话 @zh
label: 行動手機 @zh-hant
label: 휴대폰 @ko
definition: This segment includes companies that manufacture mobile telephones.
notation: 1910101012
valid from: 2024-06-07

Mobile Radio Comm Equipment
type: BicsLevel7Segment
type: Classifier
type: NamedIndividual
is level7 segment of: Wireless Telecom Equipment
is contemporary version of: http://data.ga-group.nl/ics/bics/19101010131010
is version of: http://data.ga-group.nl/ics/bics/19101010131010
replaces: http://data.ga-group.nl/ics/bics/2020/19101010131010
imported on: 2026-06-08T13:40:52.236Z
last refreshed on: 2026-06-08T13:41:38.450Z
source accessed on: 2024-06-05T14:42:36Z
source last accessed on: 2024-06-05T14:42:36Z
label: Apparecchi com radiomobile @it
label: Equip communication radio mobile @fr
label: Equipamento comunic por rádio móvel @pt
label: Equipo radiocomunicación @es
label: Mobilfunkkommunikationsger. @de
label: Радиокоммуникационное мобильное оборуд. @ru
label: 無線通信機器 @ja
label: 移动无线电通信设备 @zh
label: 行動無線電通訊設備 @zh-hant
label: 모바일 라디오 통신 장비 @ko
definition: This segment includes companies that manufacture mobile radio equipment, such as handheld radios used by police, firefighters, and military.
notation: 19101010131010
valid from: 2024-06-07

RFID Devices
type: BicsLevel7Segment
type: Classifier
type: NamedIndividual
is level7 segment of: Wireless Telecom Equipment
is contemporary version of: http://data.ga-group.nl/ics/bics/19101010131011
is version of: http://data.ga-group.nl/ics/bics/19101010131011
replaces: http://data.ga-group.nl/ics/bics/2020/19101010131011
imported on: 2026-06-08T13:40:52.236Z
last refreshed on: 2026-06-08T13:41:38.450Z
source accessed on: 2024-06-05T14:42:36Z
source last accessed on: 2024-06-05T14:42:36Z
label: Appareils RFID @fr
label: Dispositivi RFID @it
label: Dispositivos RFID @es
label: RFID Aparelhos @pt
label: RFID 장치 @ko
label: RFID-Geräte @de
label: RFID機器 @ja
label: RFID装置 @zh
label: Устройства RFID @ru
label: 無線射頻辨識裝置 @zh-hant
definition: This segment includes companies that manufacture and market radio frequency identification (RFID) equipment used for remote tracking of packages and inventory management.
notation: 19101010131011
valid from: 2024-06-07

Satellite Communications Equip
type: BicsLevel7Segment
type: Classifier
type: NamedIndividual
is level7 segment of: Wireless Telecom Equipment
is contemporary version of: http://data.ga-group.nl/ics/bics/19101010131012
is version of: http://data.ga-group.nl/ics/bics/19101010131012
replaces: http://data.ga-group.nl/ics/bics/2020/19101010131012
imported on: 2026-06-08T13:40:52.236Z
last refreshed on: 2026-06-08T13:41:38.450Z
source accessed on: 2024-06-05T14:42:36Z
source last accessed on: 2024-06-05T14:42:36Z
label: App comunicazione satellitare @it
label: Equip de comm par satellite @fr
label: Equip de comunicações por satélite @pt
label: Equipo comunicaciones por satélite @es
label: Satellitenkommunikationsgeräte @de
label: Оборудование спутниковой связи @ru
label: 卫星通信设备 @zh
label: 衛星通信機器 @ja
label: 衛星通訊設備 @zh-hant
label: 위성통신장비 @ko
definition: This segment includes companies that manufacture and market satellite network equipment, such as transmission equipment, antennas, satellite phones, and other satellite equipment. Many of these companies also produce equipment for related applications, such as radar systems and other specialized applications.
notation: 19101010131012
valid from: 2024-06-07

Wireless Application Svc Equip
type: BicsLevel7Segment
type: Classifier
type: NamedIndividual
is level7 segment of: Wireless Telecom Equipment
is contemporary version of: http://data.ga-group.nl/ics/bics/19101010131013
is version of: http://data.ga-group.nl/ics/bics/19101010131013
replaces: http://data.ga-group.nl/ics/bics/2020/19101010131013
imported on: 2026-06-08T13:40:52.236Z
last refreshed on: 2026-06-08T13:41:38.450Z
source accessed on: 2024-06-05T14:42:36Z
source last accessed on: 2024-06-05T14:42:36Z
label: App swev applicazioni senza fili @it
label: Equip serv aplicações sem fio @pt
label: Equip serv applc sans fil @fr
label: Equipo de servicios de aplicaciones inalámbricas @es
label: Kabell. Applikationsservicegeräte @de
label: Оборуд. для услуг беспроводных приложений @ru
label: 无线应用服务设备 @zh
label: 無線應用服務設備 @zh-hant
label: 無線ｱﾌﾟﾘｹｰｼｮﾝｻｰﾋﾞｽ機器 @ja
label: 무선 애플리케이션 서비스 장비 @ko
label: 무선 애플��케이션 서비스 장비 @ko
definition: This segment includes companies that provide mobile applications services platforms (like applications servers) to support services, such as push-to-talk, enterprise messaging, and field force management.
notation: 19101010131013
valid from: 2024-06-07

Wireless Network Infra Equip
type: BicsLevel7Segment
type: Classifier
type: NamedIndividual
is level7 segment of: Wireless Telecom Equipment
is contemporary version of: http://data.ga-group.nl/ics/bics/19101010131014
is version of: http://data.ga-group.nl/ics/bics/19101010131014
replaces: http://data.ga-group.nl/ics/bics/2020/19101010131014
imported on: 2026-06-08T13:40:52.236Z
last refreshed on: 2026-06-08T13:41:38.450Z
source accessed on: 2024-06-05T14:42:36Z
source last accessed on: 2024-06-05T14:42:36Z
label: App infra rete senza fili @it
label: Equip infra réseaux sans fil @fr
label: Equip infra rede sem fio @pt
label: Equipo de infraestructura de red inalámbrica @es
label: Kabell. Netzinfrastrukturgeräte @de
label: Оборуд. инфраструктуры беспроводной связи @ru
label: 无线网络基础设施设备 @zh
label: 無線網路基礎建設設備 @zh-hant
label: 無線通信ｲﾝﾌﾗ機器 @ja
label: 무선 네트워크 인프라 장비 @ko
definition: This segment includes companies that design, manufactures and sell wireless network transmission, switching and access equipment, such as base stations, microwave radios, and mobile telephone switches.
notation: 19101010131014
valid from: 2024-06-07

Wireless Telecom Equipment
type: BicsLevel6Segment
type: Classifier
type: NamedIndividual
is level6 segment of: Telecommunications Equipment
is contemporary version of: http://data.ga-group.nl/ics/bics/191010101310
is version of: http://data.ga-group.nl/ics/bics/191010101310
replaces: http://data.ga-group.nl/ics/bics/2020/191010101310
imported on: 2026-06-08T13:40:52.236Z
last refreshed on: 2026-06-08T13:41:38.450Z
source accessed on: 2024-06-05T14:42:36Z
source last accessed on: 2024-06-05T14:42:36Z
label: Apparecchi telecom senza fili @it
label: Equipamento telecom sem fio @pt
label: Equipements télécomm sans fil @fr
label: Equipo telecom móvil @es
label: Kabellose Telekommunikationsgeräte @de
label: Беспроводн. телекоммуникац. оборуд. @ru
label: 携帯通信機器 @ja
label: 无线电信设备 @zh
label: 無線電信設備 @zh-hant
label: 무선 정보통신 장비 @ko
definition: This segment includes companies that manufacture wireless and satellite communications equipment, such as wireless networking, satellite communications, and mobile radio communications equipment.
notation: 191010101310
valid from: 2024-06-07

Cable TV Equipment
type: BicsLevel7Segment
type: Classifier
type: NamedIndividual
is level7 segment of: Wireline Telecom Equipment
is contemporary version of: http://data.ga-group.nl/ics/bics/19101010131110
is version of: http://data.ga-group.nl/ics/bics/19101010131110
replaces: http://data.ga-group.nl/ics/bics/2020/19101010131110
imported on: 2026-06-08T13:40:52.236Z
last refreshed on: 2026-06-08T13:41:38.450Z
source accessed on: 2024-06-05T14:42:36Z
source last accessed on: 2024-06-05T14:42:36Z
label: Apparecchi TV cavo @it
label: Equipamento de TV a cabo @pt
label: Equipement Télé câble @fr
label: Equipo de TV de cable @es
label: Geräte für Kabel-TV @de
label: Оборудование для кабельного ТВ @ru
label: 有線電視設備 @zh-hant
label: 有线电视设备 @zh
label: 케이블 TV 장비 @ko
label: ｹｰﾌﾞﾙﾃﾚﾋﾞ機器 @ja
label: ｹｰﾌ��ﾙﾃﾚﾋﾞ機器 @ja
definition: This segment includes companies that manufacture and market cable television set-tops as well as network infrastructure equipment. Includes set-top boxes, high-definition television (HDTV) equipment, Internet Protocol television (IPTV) equipment, video processing products, fiber optic equipment, headends, and systems to manage video on demand (VOD), digital advertising, and digital video recording.
notation: 19101010131110
valid from: 2024-06-07

Fiber Optic Telecom Equipment
type: BicsLevel7Segment
type: Classifier
type: NamedIndividual
is level7 segment of: Wireline Telecom Equipment
is contemporary version of: http://data.ga-group.nl/ics/bics/19101010131111
is version of: http://data.ga-group.nl/ics/bics/19101010131111
replaces: http://data.ga-group.nl/ics/bics/2020/19101010131111
imported on: 2026-06-08T13:40:52.236Z
last refreshed on: 2026-06-08T13:41:38.450Z
source accessed on: 2024-06-05T14:42:36Z
source last accessed on: 2024-06-05T14:42:36Z
label: Apparecchi telecom fibra ottica @it
label: Equipamento telecom fibra ótica @pt
label: Equipement télécom fibre optique @fr
label: Equipo Telecom de fibras ópticas @es
label: Glasfaserkomm.-Geräte @de
label: Волоконнооптическое телекоммуникац. оборуд. @ru
label: 光纖電信設備 @zh-hant
label: 光纤电信设备 @zh
label: 光ﾌｧｲﾊﾞｰ通信機器 @ja
label: 광섬유 정보통신 장비 @ko
definition: This segment includes companies that manufacture and market fiber optic communications equipment including transmission, access, and switching systems.
notation: 19101010131111
valid from: 2024-06-07

Telecommunications Devices
type: BicsLevel7Segment
type: Classifier
type: NamedIndividual
is level7 segment of: Wireline Telecom Equipment
is contemporary version of: http://data.ga-group.nl/ics/bics/19101010131112
is version of: http://data.ga-group.nl/ics/bics/19101010131112
replaces: http://data.ga-group.nl/ics/bics/2020/19101010131112
imported on: 2026-06-08T13:40:52.236Z
last refreshed on: 2026-06-08T13:41:38.450Z
source accessed on: 2024-06-05T14:42:36Z
source last accessed on: 2024-06-05T14:42:36Z
label: Aparelhos de telecomunicações @pt
label: Appareils de télécommunication @fr
label: Dispositivi telecomunicazioni @it
label: Dispositivos de telecomunicaciones @es
label: Telekommunikationsgeräte @de
label: Телекоммуникационные устройства @ru
label: 电信设备 @zh
label: 通信装置 @ja
label: 電信裝置 @zh-hant
label: 정보통신 기기 @ko
definition: This segment includes companies that manufacture fixed-line customer premises equipment (CPE). Includes telephone systems, video conferencing equipment, digital recording equipment, and headsets.
notation: 19101010131112
valid from: 2024-06-07

Wireline Customer Premise Equip
type: BicsLevel7Segment
type: Classifier
type: NamedIndividual
is level7 segment of: Wireline Telecom Equipment
is contemporary version of: http://data.ga-group.nl/ics/bics/19101010131113
is version of: http://data.ga-group.nl/ics/bics/19101010131113
replaces: http://data.ga-group.nl/ics/bics/2020/19101010131113
imported on: 2026-06-08T13:40:52.236Z
last refreshed on: 2026-06-08T13:41:38.450Z
source accessed on: 2024-06-05T14:42:36Z
source last accessed on: 2024-06-05T14:42:36Z
label: App sede cliente via cavo @it
label: Equip instalações para clientes linha fixa @pt
label: Equip locaux clients filaires @fr
label: Equipo alámbrico de instalaciones del cliente @es
label: Kabelgeb. Geräten in Kundenhand @de
label: Абонентское проводное оконечное оборуд. @ru
label: 固定通信加入者宅内機器 @ja
label: 固網用戶終端設備 @zh-hant
label: 有线客户端设备 @zh
label: 유선 고객 소재지 장비 @ko
definition: This segment includes companies that manufacture private switches, office terminals, fixed mobile convergence products, and other products used for wireline telecommunications that exists after a carrier's demarcation point.
notation: 19101010131113
valid from: 2024-06-07

Wireline Network Infra Equip
type: BicsLevel7Segment
type: Classifier
type: NamedIndividual
is level7 segment of: Wireline Telecom Equipment
is contemporary version of: http://data.ga-group.nl/ics/bics/19101010131114
is version of: http://data.ga-group.nl/ics/bics/19101010131114
replaces: http://data.ga-group.nl/ics/bics/2020/19101010131114
imported on: 2026-06-08T13:40:52.236Z
last refreshed on: 2026-06-08T13:41:38.450Z
source accessed on: 2024-06-05T14:42:36Z
source last accessed on: 2024-06-05T14:42:36Z
label: Drahtgebundenes Netzwerk, Infrastr.-Geräte @de
label: Equip infra réseau filaire @fr
label: Equipaggiam reti via cavo @it
label: Equipo infra de red alámb @es
label: Infra equipam de rede fixa @pt
label: Проводное сетевое оборудование @ru
label: 固定ﾈｯﾄﾜｰｸｲﾝﾌﾗ機器 @ja
label: 固網電信基建設備 @zh-hant
label: 有线网络基础设备 @zh
label: 유선 네트워크 인프라 장비 @ko
definition: This segment includes companies that manufacture and market legacy wireline telecommunication equipment including transmission, switching, and access equipment. Includes class 5 switches, digital cross-connects, access multiplexers, and PBXs.
notation: 19101010131114
valid from: 2024-06-07

Wireline Telecom Equipment
type: BicsLevel6Segment
type: Classifier
type: NamedIndividual
is level6 segment of: Telecommunications Equipment
is contemporary version of: http://data.ga-group.nl/ics/bics/191010101311
is version of: http://data.ga-group.nl/ics/bics/191010101311
replaces: http://data.ga-group.nl/ics/bics/2020/191010101311
imported on: 2026-06-08T13:40:52.236Z
last refreshed on: 2026-06-08T13:41:38.450Z
source accessed on: 2024-06-05T14:42:36Z
source last accessed on: 2024-06-05T14:42:36Z
label: Apparecchi telecom fisse @it
label: Equipamento comunic linha fixa @pt
label: Equipements télécomm filaire @fr
label: Equipos de telecomunicaciones @es
label: Kabelgeb. Kommunikationsger. @de
label: Проводное телекоммуникационное оборуд. @ru
label: 固定通信機器 @ja
label: 固網電信設備 @zh-hant
label: 有线电信设备 @zh
label: 유선 정보통신 장비 @ko
label: 유��� 정보통신 장비 @ko
definition: This segment includes companies that manufacture wired communications and networking equipment. Such equipment is used by wireline telecom service providers and cable television operators. Communications devices like phone systems and video conferencing equipment are also included.
notation: 191010101311
valid from: 2024-06-07

Telecommunications Equipment
type: BicsLevel5Segment
type: Classifier
type: NamedIndividual
is level5 segment of: Communications Equipment
is contemporary version of: http://data.ga-group.nl/ics/bics/1910101013
is version of: http://data.ga-group.nl/ics/bics/1910101013
replaces: http://data.ga-group.nl/ics/bics/2020/1910101013
imported on: 2026-06-08T13:40:52.236Z
last refreshed on: 2026-06-08T13:41:38.450Z
source accessed on: 2024-06-05T14:42:36Z
source last accessed on: 2024-06-05T14:42:36Z
label: Apparecchiature telecomunicazione @it
label: Equipamento telecomunicações @pt
label: Equipement de télécommunications @fr
label: Equipo de telecomunicaciones @es
label: Telekommunikationsausrüstung @de
label: Телекоммуник. оборудование @ru
label: 电信设备 @zh
label: 通信機器 @ja
label: 電信設備 @zh-hant
label: 정보통신 장비 @ko
label: 정보통신 장�� @ko
definition: This segment includes companies that manufacture telecommunications equipment. Includes infrastructure and customer premises equipment for wireline and wireless networks.
notation: 1910101013
valid from: 2024-06-07

Communications Equipment
type: BicsLevel4SubIndustry
type: Classifier
type: NamedIndividual
is sub industry of: Technology Hardware
is contemporary version of: http://data.ga-group.nl/ics/bics/19101010
is version of: http://data.ga-group.nl/ics/bics/19101010
replaces: http://data.ga-group.nl/ics/bics/2020/19101010
imported on: 2026-06-08T13:40:52.236Z
last refreshed on: 2026-06-08T13:41:38.450Z
source accessed on: 2024-06-05T14:42:36Z
source last accessed on: 2024-06-05T14:42:36Z
label: Eq comunicaciones @es
label: Equip communications @fr
label: Equip comunicações @pt
label: Equipaggiam comunicazioni @it
label: KommGeräte @de
label: Оборудование связи @ru
label: 通信機器 @ja
label: 通訊設備 @zh-hant
label: 通讯设备 @zh
label: 통신장비 @ko
definition: This industry subgroup includes companies that manufacture technology hardware used for communication purposes. Includes broadcasting equipment, networking equipment, mobile phones, and telecommunication equipment.
notation: 19101010
valid from: 2024-06-07

Home & Car Audio Equipment
type: BicsLevel6Segment
type: Classifier
type: NamedIndividual
is level6 segment of: Audio Equipment
is contemporary version of: http://data.ga-group.nl/ics/bics/191010111010
is version of: http://data.ga-group.nl/ics/bics/191010111010
replaces: http://data.ga-group.nl/ics/bics/2020/191010111010
imported on: 2026-06-08T13:40:52.236Z
last refreshed on: 2026-06-08T13:41:38.450Z
source accessed on: 2024-06-05T14:42:36Z
source last accessed on: 2024-06-05T14:42:36Z
label: Apparecchiature audio casa e auto @it
label: Equipamento de áudio p/casa e carro @pt
label: Equipo audio para el hogar y autos @es
label: Equipt audio voiture et maison @fr
label: Home- und Auto-Stereos @de
label: Дом./автомоб. аудиотехника @ru
label: 家庭及汽車音響設備 @zh-hant
label: 家庭和汽车音响设备 @zh
label: 家庭･自動車用ｵｰﾃﾞｨｵ機器 @ja
label: 가정용 및 자동차 오디오 장비 @ko
definition: This segment includes companies that manufacture home and car stereo systems and equipment. Includes home sound systems, speakers, satellite radio, AM/FM radio, receivers, subwoofers, and car audio dashboard units.
notation: 191010111010
valid from: 2024-06-07

Personal Audio Devices
type: BicsLevel6Segment
type: Classifier
type: NamedIndividual
is level6 segment of: Audio Equipment
is contemporary version of: http://data.ga-group.nl/ics/bics/191010111011
is version of: http://data.ga-group.nl/ics/bics/191010111011
replaces: http://data.ga-group.nl/ics/bics/2020/191010111011
imported on: 2026-06-08T13:40:52.236Z
last refreshed on: 2026-06-08T13:41:38.450Z
source accessed on: 2024-06-05T14:42:36Z
source last accessed on: 2024-06-05T14:42:36Z
label: Aparelhos áudio pessoal @pt
label: Dispositivi audio personali @it
label: Dispositivos personales de audio @es
label: Mat audio à usage perso @fr
label: Persönliche Audiogeräte @de
label: Персонал. аудиоустройства @ru
label: Персонал. аудиоустр��йства @ru
label: 个人音频装置 @zh
label: 個人用ｵｰﾃﾞｨｵ機器 @ja
label: 個人聲音裝置 @zh-hant
label: 개인용 오디오 기기 @ko
definition: This segment includes companies that manufacture personal, portable audio devices. Includes MP3 players, portable CD players, and portable satellite radio devices.
notation: 191010111011
valid from: 2024-06-07

Professional Audio Equipment
type: BicsLevel6Segment
type: Classifier
type: NamedIndividual
is level6 segment of: Audio Equipment
is contemporary version of: http://data.ga-group.nl/ics/bics/191010111012
is version of: http://data.ga-group.nl/ics/bics/191010111012
replaces: http://data.ga-group.nl/ics/bics/2020/191010111012
imported on: 2026-06-08T13:40:52.236Z
last refreshed on: 2026-06-08T13:41:38.450Z
source accessed on: 2024-06-05T14:42:36Z
source last accessed on: 2024-06-05T14:42:36Z
label: Apparecchiature audio professionali @it
label: Equipamentos profissionais áudio @pt
label: Equipo profesional de audio @es
label: Equipt audio professionnel @fr
label: Professionelles Audiozubehör @de
label: Профессион. аудиоприборы @ru
label: 专业音响设备 @zh
label: 專業音響設備 @zh-hant
label: 業務用ｵｰﾃﾞｨｵ機器 @ja
label: 전문오디오장비 @ko
definition: This segment includes companies that manufacture professional audio equipment used to record and process sound in professional forums. Typically, this equipment is used for television/radio broadcasting, film production, and live music entertainment events. Includes turntables, mixers, professional microphones, recorders, signal processors, and boom poles.
notation: 191010111012
valid from: 2024-06-07

Audio Equipment
type: BicsLevel5Segment
type: Classifier
type: NamedIndividual
is level5 segment of: Consumer Electronics
is contemporary version of: http://data.ga-group.nl/ics/bics/1910101110
is version of: http://data.ga-group.nl/ics/bics/1910101110
replaces: http://data.ga-group.nl/ics/bics/2020/1910101110
imported on: 2026-06-08T13:40:52.236Z
last refreshed on: 2026-06-08T13:41:38.450Z
source accessed on: 2024-06-05T14:42:36Z
source last accessed on: 2024-06-05T14:42:36Z
label: Apparecchiature audio @it
label: Audiozubehör @de
label: Equipamento áudio @pt
label: Equipement audio @fr
label: Equipo auditivo @es
label: Пр-во аудио оборудования @ru
label: 音响设备 @zh
label: 音響設備 @zh-hant
label: 오디오장비 @ko
label: ｵｰﾃﾞｨｵ機器 @ja
definition: This segment includes companies that manufacture audio equipment.
notation: 1910101110
valid from: 2024-06-07

Digital Cameras
type: BicsLevel6Segment
type: Classifier
type: NamedIndividual
is level6 segment of: Camera Equipment
is contemporary version of: http://data.ga-group.nl/ics/bics/191010111110
is version of: http://data.ga-group.nl/ics/bics/191010111110
replaces: http://data.ga-group.nl/ics/bics/2020/191010111110
imported on: 2026-06-08T13:40:52.236Z
last refreshed on: 2026-06-08T13:41:38.450Z
source accessed on: 2024-06-05T14:42:36Z
source last accessed on: 2024-06-05T14:42:36Z
label: App photos numéri. @fr
label: Cámaras digitales @es
label: Câmeras digitais @pt
label: Digitalkameras @de
label: Macchine fotografiche digitali @it
label: Цифров. фотоап. @ru
label: 数码相机 @zh
label: 數位相機 @zh-hant
label: 디지털카메라 @ko
label: ﾃﾞｼﾞﾀﾙｶﾒﾗ @ja
definition: This segment includes companies that manufacture both digital and film cameras that are primarily used for taking still photographs.
notation: 191010111110
valid from: 2024-06-07

Video Cameras
type: BicsLevel6Segment
type: Classifier
type: NamedIndividual
is level6 segment of: Camera Equipment
is contemporary version of: http://data.ga-group.nl/ics/bics/191010111111
is version of: http://data.ga-group.nl/ics/bics/191010111111
replaces: http://data.ga-group.nl/ics/bics/2020/191010111111
imported on: 2026-06-08T13:40:52.236Z
last refreshed on: 2026-06-08T13:41:38.450Z
source accessed on: 2024-06-05T14:42:36Z
source last accessed on: 2024-06-05T14:42:36Z
label: Cámaras de video @es
label: Câmeras de vídeo @pt
label: Caméras vidéo @fr
label: Videocamere @it
label: Videokameras @de
label: Видеокамеры @ru
label: 摄像机 @zh
label: 錄影機 @zh-hant
label: 비디오카메라 @ko
label: ﾋﾞﾃﾞｵｶﾒﾗ @ja
definition: This segment includes companies that manufacture both digital and film cameras that are primarily used for recording video.
notation: 191010111111
valid from: 2024-06-07

Camera Accessories
type: BicsLevel6Segment
type: Classifier
type: NamedIndividual
is level6 segment of: Camera Equipment
is contemporary version of: http://data.ga-group.nl/ics/bics/191010111112
is version of: http://data.ga-group.nl/ics/bics/191010111112
replaces: http://data.ga-group.nl/ics/bics/2020/191010111112
imported on: 2026-06-08T13:40:52.236Z
last refreshed on: 2026-06-08T13:41:38.450Z
source accessed on: 2024-06-05T14:42:36Z
source last accessed on: 2024-06-05T14:42:36Z
label: Accesorios cámaras @es
label: Access. app. photo @fr
label: Accessori macch foto @it
label: Acessórios de câmera @pt
label: Kamerazubehör @de
label: Аксессуары для фотоаппаратов @ru
label: 相机配件 @zh
label: 相機配件 @zh-hant
label: 카메라 부속품 @ko
label: ｶﾒﾗｱｸｾｻﾘｰ @ja
definition: This segment includes companies that manufacture camera accessories and supplies, such as interchangeable lenses, flash devices, cables, and photographic film.
notation: 191010111112
valid from: 2024-06-07

Camera Equipment
type: BicsLevel5Segment
type: Classifier
type: NamedIndividual
is level5 segment of: Consumer Electronics
is contemporary version of: http://data.ga-group.nl/ics/bics/1910101111
is version of: http://data.ga-group.nl/ics/bics/1910101111
replaces: http://data.ga-group.nl/ics/bics/2020/1910101111
imported on: 2026-06-08T13:40:52.236Z
last refreshed on: 2026-06-08T13:41:38.450Z
source accessed on: 2024-06-05T14:42:36Z
source last accessed on: 2024-06-05T14:42:36Z
label: Apparecchiature macchine foto @it
label: Equipamento câmera @pt
label: Equipo cámaras @es
label: Kamerazubehör @de
label: Matériel photo @fr
label: Фотооборудование @ru
label: 相机设备 @zh
label: 相機設備 @zh-hant
label: 카메라장비 @ko
label: ｶﾒﾗ機器 @ja
definition: This segment includes companies that manufacture cameras and camera equipment.
notation: 1910101111
valid from: 2024-06-07

TV & Monitors
type: BicsLevel6Segment
type: Classifier
type: NamedIndividual
is level6 segment of: Displays
is contemporary version of: http://data.ga-group.nl/ics/bics/191010111210
is version of: http://data.ga-group.nl/ics/bics/191010111210
replaces: http://data.ga-group.nl/ics/bics/2020/191010111210
imported on: 2026-06-08T13:40:52.236Z
last refreshed on: 2026-06-08T13:41:38.450Z
source accessed on: 2024-06-05T14:42:36Z
source last accessed on: 2024-06-05T14:42:36Z
label: TV & Monitore @de
label: TV & 모니터 @ko
label: TV e monitor @it
label: TV e monitores @pt
label: TV et moniteurs @fr
label: Televisores y monitores @es
label: Экраны и телевизоры @ru
label: 电视与显示器 @zh
label: 電視/螢幕 @zh-hant
label: ﾃﾚﾋﾞ･ﾓﾆﾀｰ @ja
definition: This segment includes companies that design or manufacture televisions and monitors. Televisions have a built-in tuner and are utilized for home entertainment purposes. Monitors do not have a TV tuner and are primarily utilized for computers.
notation: 191010111210
valid from: 2024-06-07

Specialty Displays
type: BicsLevel6Segment
type: Classifier
type: NamedIndividual
is level6 segment of: Displays
is contemporary version of: http://data.ga-group.nl/ics/bics/191010111211
is version of: http://data.ga-group.nl/ics/bics/191010111211
replaces: http://data.ga-group.nl/ics/bics/2020/191010111211
imported on: 2026-06-08T13:40:52.236Z
last refreshed on: 2026-06-08T13:41:38.450Z
source accessed on: 2024-06-05T14:42:36Z
source last accessed on: 2024-06-05T14:42:36Z
label: Display speciali @it
label: Pantallas especializadas @es
label: Spezial-Displays @de
label: Syst d'affichage spécialisés @fr
label: Telas especializadas @pt
label: Специализ. отображение @ru
label: 其他顯示器 @zh-hant
label: 特殊显示 @zh
label: 特殊ﾃﾞｨｽﾌﾟﾚｰ @ja
label: 기타 디스플레이 @ko
definition: This segment includes companies that manufacture displays not elsewhere classified. Includes projectors, LED billboard displays, and other electronic advertising displays.
notation: 191010111211
valid from: 2024-06-07

Displays
type: BicsLevel5Segment
type: Classifier
type: NamedIndividual
is level5 segment of: Consumer Electronics
is contemporary version of: http://data.ga-group.nl/ics/bics/1910101112
is version of: http://data.ga-group.nl/ics/bics/1910101112
replaces: http://data.ga-group.nl/ics/bics/2020/1910101112
imported on: 2026-06-08T13:40:52.236Z
last refreshed on: 2026-06-08T13:41:38.450Z
source accessed on: 2024-06-05T14:42:36Z
source last accessed on: 2024-06-05T14:42:36Z
label: Bildschirme @de
label: Ecrans @fr
label: Esposizioni @it
label: Exibições @pt
label: Pantallas @es
label: Дисплеи @ru
label: 显示器 @zh
label: 顯示器 @zh-hant
label: 디스플레이 @ko
label: ﾃﾞｨｽﾌﾟﾚｲ @ja
definition: This segment includes companies that design or manufacture display hardware. Excludes unfinished products used as components for other types of electronics (see Display Components).
notation: 1910101112
valid from: 2024-06-07

GPS Devices
type: BicsLevel5Segment
type: Classifier
type: NamedIndividual
is level5 segment of: Consumer Electronics
is contemporary version of: http://data.ga-group.nl/ics/bics/1910101113
is version of: http://data.ga-group.nl/ics/bics/1910101113
replaces: http://data.ga-group.nl/ics/bics/2020/1910101113
imported on: 2026-06-08T13:40:52.236Z
last refreshed on: 2026-06-08T13:41:38.450Z
source accessed on: 2024-06-05T14:42:36Z
source last accessed on: 2024-06-05T14:42:36Z
label: Aparelhos GPS @pt
label: Appareils GPS @fr
label: Dispositivi GPS @it
label: Dispositivos GPS @es
label: GPS 장치 @ko
label: GPS-Geräte @de
label: GPS装置 @ja
label: GPS設備 @zh-hant
label: Устройства GPS @ru
definition: This segment includes companies that manufacture portable global positioning system (GPS) devices used in consumer applications, such as in cars or for hiking and traveling.
notation: 1910101113
valid from: 2024-06-07

Keyboards & Mice
type: BicsLevel5Segment
type: Classifier
type: NamedIndividual
is level5 segment of: Consumer Electronics
is contemporary version of: http://data.ga-group.nl/ics/bics/1910101114
is version of: http://data.ga-group.nl/ics/bics/1910101114
replaces: http://data.ga-group.nl/ics/bics/2020/1910101114
imported on: 2026-06-08T13:40:52.236Z
last refreshed on: 2026-06-08T13:41:38.450Z
source accessed on: 2024-06-05T14:42:36Z
source last accessed on: 2024-06-05T14:42:36Z
label: Claviers et souris @fr
label: Tastaturen & Mäuse @de
label: Tastiere e mouse @it
label: Teclados e mouse @pt
label: Teclados y ratones @es
label: Клавиатура и мышь @ru
label: 鍵盤/滑鼠/其他裝置 @zh-hant
label: 键盘及鼠标 @zh
label: 키보드 및 마우스 @ko
label: ｷｰﾎﾞｰﾄﾞ･ﾏｳｽ @ja
definition: This segment includes companies that design or manufacture keyboards, mice, and other input/output computer devices.
notation: 1910101114
valid from: 2024-06-07

Printers, Copiers & Scanners
type: BicsLevel6Segment
type: Classifier
type: NamedIndividual
is level6 segment of: Office Electronics
is contemporary version of: http://data.ga-group.nl/ics/bics/191010111510
is version of: http://data.ga-group.nl/ics/bics/191010111510
replaces: http://data.ga-group.nl/ics/bics/2020/191010111510
imported on: 2026-06-08T13:40:52.236Z
last refreshed on: 2026-06-08T13:41:38.450Z
source accessed on: 2024-06-05T14:42:36Z
source last accessed on: 2024-06-05T14:42:36Z
label: Drucker, Kopierer & Scanner @de
label: Impresoras, fotocopiadoras y escáneres @es
label: Impressoras, copiadoras e scanners @pt
label: Imprimantes/copieurs/scanneurs @fr
label: Stampanti, fotocop e scanner @it
label: Принтеры и сканеры @ru
label: 商用印表機及掃描機 @zh-hant
label: 打印机、复印机和扫描仪 @zh
label: 프린터, 복사기 및 스캐너 @ko
label: ﾌﾟﾘﾝﾀｰ･ｺﾋﾟｰ機･ｽｷｬﾅｰ @ja
definition: This segment includes companies that design or manufacture printers, scanners and photocopying systems.
notation: 191010111510
valid from: 2024-06-07

Office Electronics Supplies
type: BicsLevel6Segment
type: Classifier
type: NamedIndividual
is level6 segment of: Office Electronics
is contemporary version of: http://data.ga-group.nl/ics/bics/191010111511
is version of: http://data.ga-group.nl/ics/bics/191010111511
replaces: http://data.ga-group.nl/ics/bics/2020/191010111511
imported on: 2026-06-08T13:40:52.236Z
last refreshed on: 2026-06-08T13:41:38.450Z
source accessed on: 2024-06-05T14:42:36Z
source last accessed on: 2024-06-05T14:42:36Z
label: Büroelektronikbedarf @de
label: Forniture elettroniche ufficio @it
label: Fournitures électroniques de bureau @fr
label: Suministros electrónicos de oficina @es
label: Suprimentos eletrônicos para escritório @pt
label: Поставщики офисной электроники @ru
label: 事務用電子機器供給 @ja
label: 办公电子设备用品 @zh
label: 辦公室電子設備用品 @zh-hant
label: 사무용 전자 소모품 @ko
definition: This segment includes companies that design or manufacture printing and imaging supplies, as well as other equipment not elsewhere classified.
notation: 191010111511
valid from: 2024-06-07

Office Electronics
type: BicsLevel5Segment
type: Classifier
type: NamedIndividual
is level5 segment of: Consumer Electronics
is contemporary version of: http://data.ga-group.nl/ics/bics/1910101115
is version of: http://data.ga-group.nl/ics/bics/1910101115
replaces: http://data.ga-group.nl/ics/bics/2020/1910101115
imported on: 2026-06-08T13:40:52.236Z
last refreshed on: 2026-06-08T13:41:38.450Z
source accessed on: 2024-06-05T14:42:36Z
source last accessed on: 2024-06-05T14:42:36Z
label: Büroelektronik @de
label: Electrónicos de oficina @es
label: Electronique de bureau @fr
label: Eletrônicos para escritório @pt
label: Prodotti elettronici per ufficio @it
label: Офисная электроника @ru
label: 事務用電子機器 @ja
label: 办公电子设备 @zh
label: 辦公室電子設備 @zh-hant
label: 사무용 전자제품 @ko
label: 사무용 전자제��� @ko
definition: This segment includes companies that design or manufacture electronic hardware used for office-related purposes. Includes printers, scanners, photocopiers, and supplies for these electronics.
notation: 1910101115
valid from: 2024-06-07

Video Equipment
type: BicsLevel5Segment
type: Classifier
type: NamedIndividual
is level5 segment of: Consumer Electronics
is contemporary version of: http://data.ga-group.nl/ics/bics/1910101116
is version of: http://data.ga-group.nl/ics/bics/1910101116
replaces: http://data.ga-group.nl/ics/bics/2020/1910101116
imported on: 2026-06-08T13:40:52.236Z
last refreshed on: 2026-06-08T13:41:38.450Z
source accessed on: 2024-06-05T14:42:36Z
source last accessed on: 2024-06-05T14:42:36Z
label: Apparecchiature video @it
label: Equipamento de vídeo @pt
label: Equipo video @es
label: Equipt vidéo @fr
label: Videogeräte @de
label: Видеооборудование @ru
label: 影像設備 @zh-hant
label: 视频设备 @zh
label: 비디오장비 @ko
label: ﾋﾞﾃﾞｵ機器 @ja
definition: This segment includes companies that manufacture consumer video equipment such as video playback and recording devices.
notation: 1910101116
valid from: 2024-06-07

Video Game Equipment
type: BicsLevel5Segment
type: Classifier
type: NamedIndividual
is level5 segment of: Consumer Electronics
is contemporary version of: http://data.ga-group.nl/ics/bics/1910101117
is version of: http://data.ga-group.nl/ics/bics/1910101117
replaces: http://data.ga-group.nl/ics/bics/2020/1910101117
imported on: 2026-06-08T13:40:52.236Z
last refreshed on: 2026-06-08T13:41:38.450Z
source accessed on: 2024-06-05T14:42:36Z
source last accessed on: 2024-06-05T14:42:36Z
label: Apparecchiature videogiochi @it
label: Equipamento jogos vídeo @pt
label: Equipo juegos de video @es
label: Equipt jeu vidéo @fr
label: Videospielzubehör @de
label: Оборудование для видеоигр @ru
label: 电子游戏设备 @zh
label: 電玩遊戲設備 @zh-hant
label: 비디오게임장비 @ko
label: ﾋﾞﾃﾞｵｹﾞｰﾑ機器 @ja
definition: This segment includes companies that manufacture video game equipment, such as consoles and accessories.
notation: 1910101117
valid from: 2024-06-07

Consumer Electronics
type: BicsLevel4SubIndustry
type: Classifier
type: NamedIndividual
is sub industry of: Technology Hardware
is contemporary version of: http://data.ga-group.nl/ics/bics/19101011
is version of: http://data.ga-group.nl/ics/bics/19101011
replaces: http://data.ga-group.nl/ics/bics/2020/19101011
imported on: 2026-06-08T13:40:52.236Z
last refreshed on: 2026-06-08T13:41:38.450Z
source accessed on: 2024-06-05T14:42:36Z
source last accessed on: 2024-06-05T14:42:36Z
label: Electrónica consumo @es
label: Electro grand public @fr
label: Eletrôn consumo @pt
label: Elettronica al consumo @it
label: Verbraucherelektronik @de
label: Пр-во быт. электр. @ru
label: 消費性電子 @zh-hant
label: 消費者用電子製品 @ja
label: 电子消费品 @zh
label: 소비자 전자제품 @ko
label: ���費性電子 @zh-hant
definition: This industry subgroup includes companies that design or manufacture consumer electronics. Includes audio equipment, cameras, video equipment, televisions, monitors, video game consoles, and GPS devices. Excludes electronics used for communication purposes (see Communication Equipment). Excludes hardware used in offices (see Office Electronics).
notation: 19101011
valid from: 2024-06-07

Desktop Computers
type: BicsLevel6Segment
type: Classifier
type: NamedIndividual
is level6 segment of: Personal Computers
is contemporary version of: http://data.ga-group.nl/ics/bics/191010121010
is version of: http://data.ga-group.nl/ics/bics/191010121010
replaces: http://data.ga-group.nl/ics/bics/2020/191010121010
imported on: 2026-06-08T13:40:52.236Z
last refreshed on: 2026-06-08T13:41:38.450Z
source accessed on: 2024-06-05T14:42:36Z
source last accessed on: 2024-06-05T14:42:36Z
label: Computadores de mesa @pt
label: Computer fissi @it
label: Desktop, Computer @de
label: Ordenadores @es
label: Ordinateurs de bureaux @fr
label: Настольные компьютеры @ru
label: 台式电脑 @zh
label: 桌上型電腦 @zh-hant
label: 데스크탑 컴퓨터 @ko
label: ﾃﾞｽｸﾄｯﾌﾟﾊﾟｿｺﾝ @ja
definition: This segment includes companies that design or manufacture desktop computers.
notation: 191010121010
valid from: 2024-06-07

Handheld Computers
type: BicsLevel6Segment
type: Classifier
type: NamedIndividual
is level6 segment of: Personal Computers
is contemporary version of: http://data.ga-group.nl/ics/bics/191010121011
is version of: http://data.ga-group.nl/ics/bics/191010121011
replaces: http://data.ga-group.nl/ics/bics/2020/191010121011
imported on: 2026-06-08T13:40:52.236Z
last refreshed on: 2026-06-08T13:41:38.450Z
source accessed on: 2024-06-05T14:42:36Z
source last accessed on: 2024-06-05T14:42:36Z
label: Computadores portáteis @pt
label: Handheld-Computer @de
label: Ordenadores manuales @es
label: Ordinateur de poche @fr
label: Prod comp palmari @it
label: Портативные компьютеры @ru
label: 掌上型電腦 @zh-hant
label: 掌上电脑制造 @zh
label: 휴대용컴퓨터제조업 @ko
label: ﾀﾌﾞﾚｯﾄ端末 @ja
definition: This segment includes companies that design or manufacture handheld computers. Includes tablet computers, nano personal computers, and other handheld computing devices.
notation: 191010121011
valid from: 2024-06-07

Notebook Computers
type: BicsLevel6Segment
type: Classifier
type: NamedIndividual
is level6 segment of: Personal Computers
is contemporary version of: http://data.ga-group.nl/ics/bics/191010121012
is version of: http://data.ga-group.nl/ics/bics/191010121012
replaces: http://data.ga-group.nl/ics/bics/2020/191010121012
imported on: 2026-06-08T13:40:52.236Z
last refreshed on: 2026-06-08T13:41:38.450Z
source accessed on: 2024-06-05T14:42:36Z
source last accessed on: 2024-06-05T14:42:36Z
label: Computadores Notebook @pt
label: Computer portatili @it
label: Notebook, Computer @de
label: Ordenadores portátiles @es
label: Ordinateurs portables @fr
label: Портативные компьютеры @ru
label: 笔记本电脑 @zh
label: 筆記型電腦 @zh-hant
label: 노트북 컴퓨터 @ko
label: ﾉｰﾄﾊﾟｿｺﾝ @ja
definition: This segment includes companies that design or manufacture computer notebooks, also known as laptops.
notation: 191010121012
valid from: 2024-06-07

Estações de trabalho
type: BicsLevel6Segment
type: Classifier
type: NamedIndividual
is level6 segment of: Personal Computers
is contemporary version of: http://data.ga-group.nl/ics/bics/191010121013
is version of: http://data.ga-group.nl/ics/bics/191010121013
replaces: http://data.ga-group.nl/ics/bics/2020/191010121013
imported on: 2026-06-08T13:40:52.236Z
last refreshed on: 2026-06-08T13:41:38.450Z
source accessed on: 2024-06-05T14:42:36Z
source last accessed on: 2024-06-05T14:42:36Z
label: Estaciones de trabajo @es
label: Postes de travail @fr
label: Workstation @it
label: Workstations
label: Настольные компьютеры @ru
label: 工作站 @zh
label: 워크스테이션 @ko
label: ﾜｰｸｽﾃｰｼｮﾝ @ja
definition: This segment includes companies that design or manufacture workstations. Workstations are commercial computers that typically offer greater performance than traditional personal computers and are often specialized to operate specific resource-demanding application software.
notation: 191010121013
valid from: 2024-06-07

Personal Computers
type: BicsLevel5Segment
type: Classifier
type: NamedIndividual
is level5 segment of: Computer Hardware & Storage
is contemporary version of: http://data.ga-group.nl/ics/bics/1910101210
is version of: http://data.ga-group.nl/ics/bics/1910101210
replaces: http://data.ga-group.nl/ics/bics/2020/1910101210
imported on: 2026-06-08T13:40:52.236Z
last refreshed on: 2026-06-08T13:41:38.450Z
source accessed on: 2024-06-05T14:42:36Z
source last accessed on: 2024-06-05T14:42:36Z
label: Computadores pessoais @pt
label: Ordenadores personales @es
label: Ordinateurs personnels @fr
label: PC @de
label: Personal Computer @it
label: Персональные компьютеры @ru
label: 个人电脑 @zh
label: 個人電腦 @zh-hant
label: 개인용 컴퓨터 @ko
label: ﾊﾟｰｿﾅﾙｺﾝﾋﾟｭｰﾀｰ @ja
definition: This segment includes companies that design or manufacture personal computers. Includes desktop computers, notebooks, workstations, and handheld devices.
notation: 1910101210
valid from: 2024-06-07

Hard Disk Drives
type: BicsLevel6Segment
type: Classifier
type: NamedIndividual
is level6 segment of: Computer Storage
is contemporary version of: http://data.ga-group.nl/ics/bics/191010121110
is version of: http://data.ga-group.nl/ics/bics/191010121110
replaces: http://data.ga-group.nl/ics/bics/2020/191010121110
imported on: 2026-06-08T13:40:52.236Z
last refreshed on: 2026-06-08T13:41:38.450Z
source accessed on: 2024-06-05T14:42:36Z
source last accessed on: 2024-06-05T14:42:36Z
label: Disques durs @fr
label: Festplattenlaufwerke @de
label: Hard Disk Drive @it
label: Unidades de disco duro @es
label: Unidades de discos rígidos @pt
label: Жесткие диски @ru
label: 硬盘驱动器 @zh
label: 硬碟機 @zh-hant
label: 하드디스크 드라이브 @ko
label: ﾊｰﾄﾞﾃﾞｨｽｸﾄﾞﾗｲﾌﾞ @ja
definition: This segment includes companies that design or manufacture computer hard drives and portable hard drives.
notation: 191010121110
valid from: 2024-06-07

Solid State Drives
type: BicsLevel6Segment
type: Classifier
type: NamedIndividual
is level6 segment of: Computer Storage
is contemporary version of: http://data.ga-group.nl/ics/bics/191010121111
is version of: http://data.ga-group.nl/ics/bics/191010121111
replaces: http://data.ga-group.nl/ics/bics/2020/191010121111
imported on: 2026-06-08T13:40:52.236Z
last refreshed on: 2026-06-08T13:41:38.450Z
source accessed on: 2024-06-05T14:42:36Z
source last accessed on: 2024-06-05T14:42:36Z
label: Dispositivos de estado sólido @es
label: Drive stato solido @it
label: Drives estado sólido @pt
label: Solid-State-Laufwerke @de
label: Твердот. накопитель @ru
label: 固态硬盘驱动器 @zh
label: 固態硬碟 @zh-hant
label: 솔리드 스테이트 드라이브 @ko
label: ｿﾘｯﾄﾞｽﾃｰﾄﾄﾞﾗｲﾌﾞ @ja
definition: This segment includes companies that design or manufacture solid-state disk drives (SSDs). Excludes companies that design or manufacture the underlying memory IC chips (see Memory ICs).
notation: 191010121111
valid from: 2024-06-07

Network Storage & Fabric
type: BicsLevel6Segment
type: Classifier
type: NamedIndividual
is level6 segment of: Computer Storage
is contemporary version of: http://data.ga-group.nl/ics/bics/191010121112
is version of: http://data.ga-group.nl/ics/bics/191010121112
replaces: http://data.ga-group.nl/ics/bics/2020/191010121112
imported on: 2026-06-08T13:40:52.236Z
last refreshed on: 2026-06-08T13:41:38.450Z
source accessed on: 2024-06-05T14:42:36Z
source last accessed on: 2024-06-05T14:42:36Z
label: Almacenamiento y material de red @es
label: Armazenagem de rede e tecidos @pt
label: Memoriz network e fabric @it
label: Network Storage et Fabric @fr
label: Netzwerkspeicher & Gewebe @de
label: Сетевое хранение и шифрование данных @ru
label: 網路儲存及光纖 @zh-hant
label: 网络存储与网络结构 @zh
label: 네트워크 스토리지 & 패브릭 @ko
label: ﾈｯﾄﾜｰｸ･ｽﾄﾚｰｼﾞ･素材 @ja
definition: This segment includes companies that design or manufacture network or server-based storage devices.
notation: 191010121112
valid from: 2024-06-07

Hard Drive Components
type: BicsLevel6Segment
type: Classifier
type: NamedIndividual
is level6 segment of: Computer Storage
is contemporary version of: http://data.ga-group.nl/ics/bics/191010121113
is version of: http://data.ga-group.nl/ics/bics/191010121113
replaces: http://data.ga-group.nl/ics/bics/2020/191010121113
imported on: 2026-06-08T13:40:52.236Z
last refreshed on: 2026-06-08T13:41:38.450Z
source accessed on: 2024-06-05T14:42:36Z
source last accessed on: 2024-06-05T14:42:36Z
label: Componentes de dico duro @es
label: Componentes de discos rígidos @pt
label: Componenti Hard Drive @it
label: Composants de disques durs @fr
label: Festplattenkomponente @de
label: Компоненты жесткого диска @ru
label: 硬盘驱动器组件 @zh
label: 硬碟組件 @zh-hant
label: 하드디스크 드라이브 부품 @ko
label: ﾊｰﾄﾞﾄﾞﾗｲﾌﾞ部品 @ja
definition: This segment includes companies that design or manufacture internal components specifically for use in computer hard drives. Includes spindle heads, magnetic readers, and disk balancing mechanisms. Excludes companies that design or manufacture the underlying memory IC chips (see Memory ICs).
notation: 191010121113
valid from: 2024-06-07

Computer Storage
type: BicsLevel5Segment
type: Classifier
type: NamedIndividual
is level5 segment of: Computer Hardware & Storage
is contemporary version of: http://data.ga-group.nl/ics/bics/1910101211
is version of: http://data.ga-group.nl/ics/bics/1910101211
replaces: http://data.ga-group.nl/ics/bics/2020/1910101211
imported on: 2026-06-08T13:40:52.236Z
last refreshed on: 2026-06-08T13:41:38.450Z
source accessed on: 2024-06-05T14:42:36Z
source last accessed on: 2024-06-05T14:42:36Z
label: Almac eq de cómputo @es
label: Archiviaz computer @it
label: Armazg computador @pt
label: Computer-Speicher @de
label: Mémoire ordi @fr
label: Запомин. устройства @ru
label: 计算机存储 @zh
label: 计算机���储 @zh
label: 電腦資料儲存 @zh-hant
label: 컴퓨터 저장장치 @ko
label: ｺﾝﾋﾟｭｰﾀｰ記憶装置 @ja
definition: This segment includes companies that design or manufacture computer storage devices. Includes hard drives, server-based storage, and flash drives.
notation: 1910101211
valid from: 2024-06-07

Servers
type: BicsLevel5Segment
type: Classifier
type: NamedIndividual
is level5 segment of: Computer Hardware & Storage
is contemporary version of: http://data.ga-group.nl/ics/bics/1910101212
is version of: http://data.ga-group.nl/ics/bics/1910101212
replaces: http://data.ga-group.nl/ics/bics/2020/1910101212
imported on: 2026-06-08T13:40:52.236Z
last refreshed on: 2026-06-08T13:41:38.450Z
source accessed on: 2024-06-05T14:42:36Z
source last accessed on: 2024-06-05T14:42:36Z
label: Server @de
label: Serveurs @fr
label: Servidores @es
label: Серверы @ru
label: 伺服器 @zh-hant
label: 服务器 @zh
label: 서버 @ko
label: ｻｰﾊﾞｰ @ja
definition: This segment includes companies that design or manufacture computer servers.
notation: 1910101212
valid from: 2024-06-07

Supercomputers
type: BicsLevel5Segment
type: Classifier
type: NamedIndividual
is level5 segment of: Computer Hardware & Storage
is contemporary version of: http://data.ga-group.nl/ics/bics/1910101213
is version of: http://data.ga-group.nl/ics/bics/1910101213
replaces: http://data.ga-group.nl/ics/bics/2020/1910101213
imported on: 2026-06-08T13:40:52.236Z
last refreshed on: 2026-06-08T13:41:38.450Z
source accessed on: 2024-06-05T14:42:36Z
source last accessed on: 2024-06-05T14:42:36Z
label: Super-ordinateurs @fr
label: Supercomputadores @pt
label: Supercomputer @de
label: Superordenadores @es
label: Суперкомпьютеры @ru
label: 超級電腦 @zh-hant
label: 高性能电脑/超级电脑 @zh
label: 수퍼컴퓨터 @ko
label: ｽｰﾊﾟｰｺﾝﾋﾟｭｰﾀｰ @ja
definition: This segment includes companies that manufacture high-performance and super computers.
notation: 1910101213
valid from: 2024-06-07

Computer Hardware & Storage
type: BicsLevel4SubIndustry
type: Classifier
type: NamedIndividual
is sub industry of: Technology Hardware
is contemporary version of: http://data.ga-group.nl/ics/bics/19101012
is version of: http://data.ga-group.nl/ics/bics/19101012
replaces: http://data.ga-group.nl/ics/bics/2020/19101012
imported on: 2026-06-08T13:40:52.236Z
last refreshed on: 2026-06-08T13:41:38.450Z
source accessed on: 2024-06-05T14:42:36Z
source last accessed on: 2024-06-05T14:42:36Z
label: Computer Hardware @it
label: Computer-Hardware & Speicher @de
label: Hardware de ordenador @es
label: Hardware-Informát @pt
label: Matériel inform et stockage @fr
label: Компьют. аппаратура @ru
label: 计算机硬件和存储 @zh
label: 電腦硬體及儲存體 @zh-hant
label: 컴퓨터 하드웨어 @ko
label: ｺﾝﾋﾟｭｰﾀ機器･記憶装置 @ja
definition: This industry subgroup includes companies that design or manufacture computer systems or data storage devices. Computer systems include desktops, laptops, tablets, workstations, servers, and supercomputers. Storage devices include hard disk drives, solid disk drives, and other storage devices.
notation: 19101012
valid from: 2024-06-07

3D Printers
type: BicsLevel5Segment
type: Classifier
type: NamedIndividual
is level5 segment of: Specialty Technology Hardware
is contemporary version of: http://data.ga-group.nl/ics/bics/1910101310
is version of: http://data.ga-group.nl/ics/bics/1910101310
replaces: http://data.ga-group.nl/ics/bics/2020/1910101310
imported on: 2026-06-08T13:40:52.236Z
last refreshed on: 2026-06-08T13:41:38.450Z
source accessed on: 2024-06-05T14:42:36Z
source last accessed on: 2024-06-05T14:42:36Z
label: 3D 프린터 @ko
label: 3D-Drucker @de
label: 3D印表機 @zh-hant
label: 3D打印机 @zh
label: 3Dﾌﾟﾘﾝﾀｰ @ja
label: Impresoras 3D @es
label: Impress 3D @pt
label: Imprimantes 3D @fr
label: Stampanti 3D @it
label: Принтеры 3D @ru
definition: This segment includes companies that design or manufacture 3D printers.
notation: 1910101310
valid from: 2024-06-07

Biometric & ID Systems
type: BicsLevel5Segment
type: Classifier
type: NamedIndividual
is level5 segment of: Specialty Technology Hardware
is contemporary version of: http://data.ga-group.nl/ics/bics/1910101311
is version of: http://data.ga-group.nl/ics/bics/1910101311
replaces: http://data.ga-group.nl/ics/bics/2020/1910101311
imported on: 2026-06-08T13:40:52.236Z
last refreshed on: 2026-06-08T13:41:38.450Z
source accessed on: 2024-06-05T14:42:36Z
source last accessed on: 2024-06-05T14:42:36Z
label: Biometrische Identifikationssysteme @de
label: Sistemas biométricos/de identificación @es
label: Sistemas de identificação/biométrico @pt
label: Sistemi identificazione/biometrici @it
label: Syst d'id et biométriques @fr
label: Syst d'id et biom��triques @fr
label: Биометрические/идентификационные системы @ru
label: 生物识别/辨识系统 @zh
label: 生物辨識/ID系統 @zh-hant
label: 생체인식&ID 시스템 @ko
label: ﾊﾞｲｵﾒﾄﾘｯｸ･識別ｼｽﾃﾑ @ja
definition: This segment includes companies that manufacture biometric and other identification systems.
notation: 1910101311
valid from: 2024-06-07

Optical Instruments & Lens
type: BicsLevel5Segment
type: Classifier
type: NamedIndividual
is level5 segment of: Specialty Technology Hardware
is contemporary version of: http://data.ga-group.nl/ics/bics/1910101312
is version of: http://data.ga-group.nl/ics/bics/1910101312
replaces: http://data.ga-group.nl/ics/bics/2020/1910101312
imported on: 2026-06-08T13:40:52.236Z
last refreshed on: 2026-06-08T13:41:38.450Z
source accessed on: 2024-06-05T14:42:36Z
source last accessed on: 2024-06-05T14:42:36Z
label: Instrumento óticos e lentes @pt
label: Instrumentos ópticos y lentes @es
label: Instruments d'optique et verres @fr
label: Optische Instrumente & Linsen @de
label: Strumenti e lenti ottiche @it
label: Оптические инструменты и линзы @ru
label: 光学仪器与镜头 @zh
label: 光学機器･光学ﾚﾝｽﾞ @ja
label: 光學儀器及鏡片 @zh-hant
label: 光���機器･光学ﾚﾝｽﾞ @ja
label: 광학장비 & 렌즈 @ko
definition: This segment includes companies that manufacture lenses (except ophthalmic lenses) and optical instruments. Includes telescopes, binoculars, microscopes, gun sights, prisms, night vision equipment, thermal imaging equipment, and crystals.
notation: 1910101312
valid from: 2024-06-07

Surveil & Traffic Mgmt Systems
type: BicsLevel5Segment
type: Classifier
type: NamedIndividual
is level5 segment of: Specialty Technology Hardware
is contemporary version of: http://data.ga-group.nl/ics/bics/1910101313
is version of: http://data.ga-group.nl/ics/bics/1910101313
replaces: http://data.ga-group.nl/ics/bics/2020/1910101313
imported on: 2026-06-08T13:40:52.236Z
last refreshed on: 2026-06-08T13:41:38.450Z
source accessed on: 2024-06-05T14:42:36Z
source last accessed on: 2024-06-05T14:42:36Z
label: Sistemas de gestão tráfico e vigilância @pt
label: Sistemas de vigilancia y regulación del tráfico @es
label: Sistemi gest traffico e sorveglianza @it
label: Syst surveillance/gestion du trafic @fr
label: Überwachungs-/Verkehrleitungssysteme @de
label: Системы наблюдения/управл. дор. движ. @ru
label: 监视与交通管理系统 @zh
label: 監視/交通管理系統 @zh-hant
label: 監視･交通管理ｼｽﾃﾑ @ja
label: 감시&교통관리시스템 @ko
definition: This segment includes companies that design or manufacture surveillance or traffic management systems.
notation: 1910101313
valid from: 2024-06-07

ATM
type: BicsLevel6Segment
type: Classifier
type: NamedIndividual
is level6 segment of: Transaction Mgmt Systems
is contemporary version of: http://data.ga-group.nl/ics/bics/191010131410
is version of: http://data.ga-group.nl/ics/bics/191010131410
replaces: http://data.ga-group.nl/ics/bics/2020/191010131410
imported on: 2026-06-08T13:40:52.236Z
last refreshed on: 2026-06-08T13:41:38.450Z
source accessed on: 2024-06-05T14:42:36Z
source last accessed on: 2024-06-05T14:42:36Z
label: BANCOMAT @it
label: Guichet automatique @fr
label: 提款機 @zh-hant
label: 自动柜员机 @zh
definition: This segment includes companies that design or manufacture automated teller machines (ATMs).
notation: 191010131410
valid from: 2024-06-07

POS Terminals
type: BicsLevel6Segment
type: Classifier
type: NamedIndividual
is level6 segment of: Transaction Mgmt Systems
is contemporary version of: http://data.ga-group.nl/ics/bics/191010131411
is version of: http://data.ga-group.nl/ics/bics/191010131411
replaces: http://data.ga-group.nl/ics/bics/2020/191010131411
imported on: 2026-06-08T13:40:52.236Z
last refreshed on: 2026-06-08T13:41:38.450Z
source accessed on: 2024-06-05T14:42:36Z
source last accessed on: 2024-06-05T14:42:36Z
label: Kassenterminals @de
label: POS 터미널 @ko
label: POS端末 @ja
label: Terminais POS @pt
label: Terminal point vente @fr
label: Terminales ptos vta @es
label: Terminali di vendita @it
label: Терминалы POS @ru
label: 銷售點終端機 @zh-hant
label: 销售点终端 @zh
definition: This segment includes companies that manufacture point-of-sale (POS) terminals. Includes electronic cash registers, self-checkout kiosks, and credit card readers.
notation: 191010131411
valid from: 2024-06-07

Transaction Mgmt Systems
type: BicsLevel5Segment
type: Classifier
type: NamedIndividual
is level5 segment of: Specialty Technology Hardware
is contemporary version of: http://data.ga-group.nl/ics/bics/1910101314
is version of: http://data.ga-group.nl/ics/bics/1910101314
replaces: http://data.ga-group.nl/ics/bics/2020/1910101314
imported on: 2026-06-08T13:40:52.236Z
last refreshed on: 2026-06-08T13:41:38.450Z
source accessed on: 2024-06-05T14:42:36Z
source last accessed on: 2024-06-05T14:42:36Z
label: Sist gestión transac @es
label: Sist grcto transaç @pt
label: Sistemi gestione transazioni @it
label: Syst gestion de transac @fr
label: Transaktions-Mgmt-Systeme @de
label: Системы управл. транз. @ru
label: 交易管理系統 @zh-hant
label: 交易管理系统 @zh
label: 決済管理ｼｽﾃﾑ @ja
label: 거래관리시스템 @ko
label: 거래���리시스템 @ko
definition: This segment includes companies that design or manufacture transaction management systems. Includes ATMs, self-service kiosks, point-of-sale terminals, and credit card readers.
notation: 1910101314
valid from: 2024-06-07

Specialty Technology Hardware
type: BicsLevel4SubIndustry
type: Classifier
type: NamedIndividual
is sub industry of: Technology Hardware
is contemporary version of: http://data.ga-group.nl/ics/bics/19101013
is version of: http://data.ga-group.nl/ics/bics/19101013
replaces: http://data.ga-group.nl/ics/bics/2020/19101013
imported on: 2026-06-08T13:40:52.236Z
last refreshed on: 2026-06-08T13:41:38.450Z
source accessed on: 2024-06-05T14:42:36Z
source last accessed on: 2024-06-05T14:42:36Z
label: Hardware de tecnología especializada @es
label: Hardware de tecnologia especializada @pt
label: Hardware tecnologia speciale @it
label: Matériel techno spécialisé @fr
label: Spezial-Technologiehardware @de
label: Спец. аппаратное обеспечение @ru
label: 专业技术硬件 @zh
label: 其他硬體 @zh-hant
label: 特殊ﾃｸﾉﾛｼﾞｰ機器 @ja
label: 전문 기술 하드웨어 @ko
definition: This industry subgroup includes companies that design, or manufacture specialty hardware not elsewhere classified. Includes biometrics, traffic management systems, embedded computing hardware, and other miscellaneous hardware.
notation: 19101013
valid from: 2024-06-07

Communication Equip Cmpnts
type: BicsLevel5Segment
type: Classifier
type: NamedIndividual
is level5 segment of: Electronics Components
is contemporary version of: http://data.ga-group.nl/ics/bics/1910101410
is version of: http://data.ga-group.nl/ics/bics/1910101410
replaces: http://data.ga-group.nl/ics/bics/2020/1910101410
imported on: 2026-06-08T13:40:52.236Z
last refreshed on: 2026-06-08T13:41:38.450Z
source accessed on: 2024-06-05T14:42:36Z
source last accessed on: 2024-06-05T14:42:36Z
label: Comp app comunicazione @it
label: Comp telefonia móvel @pt
label: Componentes equipo de comunicación @es
label: Compos équip communication @fr
label: Kommunikationgerätekomp. @de
label: Компоненты коммуникац. оборуд. @ru
label: 通信機器部品 @ja
label: 通訊設備組件 @zh-hant
label: 通讯设备零部件 @zh
label: 통신장비 부품 @ko
definition: This segment includes companies that design or manufacture communications equipment components.
notation: 1910101410
valid from: 2024-06-07

Display Panels
type: BicsLevel6Segment
type: Classifier
type: NamedIndividual
is level6 segment of: Display Components
is contemporary version of: http://data.ga-group.nl/ics/bics/191010141110
is version of: http://data.ga-group.nl/ics/bics/191010141110
replaces: http://data.ga-group.nl/ics/bics/2020/191010141110
imported on: 2026-06-08T13:40:52.236Z
last refreshed on: 2026-06-08T13:41:38.450Z
source accessed on: 2024-06-05T14:42:36Z
source last accessed on: 2024-06-05T14:42:36Z
label: Anzeigetafeln @de
label: Mostrar paneles @es
label: Painéis de exibição @pt
label: Panneaux d'affichage @fr
label: Pannelli @it
label: Индикат. панели @ru
label: 显示屏 @zh
label: 顯示器面板 @zh-hant
label: 顯示��面板 @zh-hant
label: 디스플레이패널 @ko
label: ﾃﾞｨｽﾌﾟﾚｲﾊﾟﾈﾙ @ja
definition: This segment includes companies that manufacture display panels. These display panels are the primary modules that produce the images in the display.
notation: 191010141110
valid from: 2024-06-07

Touch Solution
type: BicsLevel6Segment
type: Classifier
type: NamedIndividual
is level6 segment of: Display Components
is contemporary version of: http://data.ga-group.nl/ics/bics/191010141111
is version of: http://data.ga-group.nl/ics/bics/191010141111
replaces: http://data.ga-group.nl/ics/bics/2020/191010141111
imported on: 2026-06-08T13:40:52.236Z
last refreshed on: 2026-06-08T13:41:38.450Z
source accessed on: 2024-06-05T14:42:36Z
source last accessed on: 2024-06-05T14:42:36Z
label: Solução de toque @pt
label: Soluç��o de toque @pt
label: Solución de contacto @es
label: Solution Touch @fr
label: Soluzione Touch @it
label: Touch-Lösung @de
label: Сенс. мониторы @ru
label: 触控解决方案 @zh
label: 觸控解決方案 @zh-hant
label: 터치 솔루션 @ko
label: ﾀｯﾁｽｸﾘｰﾝ @ja
definition: This segment includes companies that manufacture components utilized to detect touch for touchscreen displays.
notation: 191010141111
valid from: 2024-06-07

Electronic Glass
type: BicsLevel6Segment
type: Classifier
type: NamedIndividual
is level6 segment of: Display Components
is contemporary version of: http://data.ga-group.nl/ics/bics/191010141112
is version of: http://data.ga-group.nl/ics/bics/191010141112
replaces: http://data.ga-group.nl/ics/bics/2020/191010141112
imported on: 2026-06-08T13:40:52.236Z
last refreshed on: 2026-06-08T13:41:38.450Z
source accessed on: 2024-06-05T14:42:36Z
source last accessed on: 2024-06-05T14:42:36Z
label: Elektronisches Glas @de
label: Verre électronique @fr
label: Vetro elettronico @it
label: Vidrio electrónico @es
label: Vidro tela eletr @pt
label: Электр. (стекло) @ru
label: 电子玻璃 @zh
label: 電子玻璃 @zh-hant
label: 電子ｶﾞﾗｽ @ja
label: 전자 유리 @ko
definition: This segment includes companies that manufacture specialized glass involved in the production of a display.
notation: 191010141112
valid from: 2024-06-07

Display Components
type: BicsLevel5Segment
type: Classifier
type: NamedIndividual
is level5 segment of: Electronics Components
is contemporary version of: http://data.ga-group.nl/ics/bics/1910101411
is version of: http://data.ga-group.nl/ics/bics/1910101411
replaces: http://data.ga-group.nl/ics/bics/2020/1910101411
imported on: 2026-06-08T13:40:52.236Z
last refreshed on: 2026-06-08T13:41:38.450Z
source accessed on: 2024-06-05T14:42:36Z
source last accessed on: 2024-06-05T14:42:36Z
label: Componentes de pantalla @es
label: Composants d'affichage @fr
label: Exibir componentes @pt
label: Monitorkomponten @de
label: Visione componenti @it
label: Компоненты системы отображения информации @ru
label: 显示元件 @zh
label: 顯示元件 @zh-hant
label: 디스플레이 부품 @ko
label: ﾃﾞｨｽﾌﾟﾚｲ部品 @ja
definition: This segment includes companies that design or manufacture components for display purposes. These components can be utilized in various types of end products, such as cellphones, tablets and checkout machines.
notation: 1910101411
valid from: 2024-06-07

Electronics Batteries
type: BicsLevel5Segment
type: Classifier
type: NamedIndividual
is level5 segment of: Electronics Components
is contemporary version of: http://data.ga-group.nl/ics/bics/1910101412
is version of: http://data.ga-group.nl/ics/bics/1910101412
replaces: http://data.ga-group.nl/ics/bics/2020/1910101412
imported on: 2026-06-08T13:40:52.236Z
last refreshed on: 2026-06-08T13:41:38.450Z
source accessed on: 2024-06-05T14:42:36Z
source last accessed on: 2024-06-05T14:42:36Z
label: Baterías para dispositivos electrónicos @es
label: Baterias eletrônicas @pt
label: Batterie elettroniche @it
label: Batterien für Elektronik @de
label: Electronique Batteries @fr
label: Электр. батареи @ru
label: 电器电池 @zh
label: 電子機器ﾊﾞｯﾃﾘｰ @ja
label: 電子產品電池 @zh-hant
label: 전자 배터리 @ko
definition: This segment includes companies that manufacture finished batteries or battery cells utilized for technology hardware products.
notation: 1910101412
valid from: 2024-06-07

Passive Components
type: BicsLevel5Segment
type: Classifier
type: NamedIndividual
is level5 segment of: Electronics Components
is contemporary version of: http://data.ga-group.nl/ics/bics/1910101413
is version of: http://data.ga-group.nl/ics/bics/1910101413
replaces: http://data.ga-group.nl/ics/bics/2020/1910101413
imported on: 2026-06-08T13:40:52.236Z
last refreshed on: 2026-06-08T13:41:38.450Z
source accessed on: 2024-06-05T14:42:36Z
source last accessed on: 2024-06-05T14:42:36Z
label: Componentes pasivos @es
label: Componentes passivos @pt
label: Componenti passivi @it
label: Composants passifs @fr
label: Passive Komponenten @de
label: Пассивн. компон. @ru
label: 受動部品 @ja
label: 无源元件 @zh
label: 被動元件 @zh-hant
label: 수동 소자 @ko
definition: This segment includes companies that design or manufacture passive components for use in technology hardware products. Includes resistors, capacitors, inductors, and transformers.
notation: 1910101413
valid from: 2024-06-07

Carte circuit imprimé
type: BicsLevel5Segment
type: Classifier
type: NamedIndividual
is level5 segment of: Electronics Components
is contemporary version of: http://data.ga-group.nl/ics/bics/1910101414
is version of: http://data.ga-group.nl/ics/bics/1910101414
replaces: http://data.ga-group.nl/ics/bics/2020/1910101414
imported on: 2026-06-08T13:40:52.236Z
last refreshed on: 2026-06-08T13:41:38.450Z
source accessed on: 2024-06-05T14:42:36Z
source last accessed on: 2024-06-05T14:42:36Z
label: PCB @it
label: PCBs
label: Печатные платы @ru
label: 印刷电路板 @zh
label: ﾌﾟﾘﾝﾄ基盤(PCB) @ja
definition: This segment includes companies that design or manufacture printed circuit boards (PCB) for use in technology hardware products.
notation: 1910101414
valid from: 2024-06-07

Electronics Components
type: BicsLevel4SubIndustry
type: Classifier
type: NamedIndividual
is sub industry of: Technology Hardware
is contemporary version of: http://data.ga-group.nl/ics/bics/19101014
is version of: http://data.ga-group.nl/ics/bics/19101014
replaces: http://data.ga-group.nl/ics/bics/2020/19101014
imported on: 2026-06-08T13:40:52.236Z
last refreshed on: 2026-06-08T13:41:38.450Z
source accessed on: 2024-06-05T14:42:36Z
source last accessed on: 2024-06-05T14:42:36Z
label: Componentes @pt
label: Componenti elettronici @it
label: Composants électro @fr
label: Comps electrónicos @es
label: Elektr. Komponente @de
label: Компоненты @ru
label: 电子元件 @zh
label: 電子元件 @zh-hant
label: 電子部品 @ja
label: 전자 부품 @ko
definition: This industry subgroup includes companies that design or manufacture components used within technology hardware. Typically, these components are non-finished goods or semi-finished goods. Exclude components used for industrial products (see Electrical Components).
notation: 19101014
valid from: 2024-06-07

EMS
type: BicsLevel5Segment
type: Classifier
type: NamedIndividual
is level5 segment of: EMS/ODM
is contemporary version of: http://data.ga-group.nl/ics/bics/1910101510
is version of: http://data.ga-group.nl/ics/bics/1910101510
replaces: http://data.ga-group.nl/ics/bics/2020/1910101510
imported on: 2026-06-08T13:40:52.236Z
last refreshed on: 2026-06-08T13:41:38.450Z
source accessed on: 2024-06-05T14:42:36Z
source last accessed on: 2024-06-05T14:42:36Z
label: EMS(電子機器受託製造ｻｰﾋﾞｽ) @ja
definition: This segment includes companies that provide electronics manufacturing services (EMS). Such companies provide technology product manufacturing and assembly services on a contract basis.
notation: 1910101510
valid from: 2024-06-07

ODM
type: BicsLevel5Segment
type: Classifier
type: NamedIndividual
is level5 segment of: EMS/ODM
is contemporary version of: http://data.ga-group.nl/ics/bics/1910101511
is version of: http://data.ga-group.nl/ics/bics/1910101511
replaces: http://data.ga-group.nl/ics/bics/2020/1910101511
imported on: 2026-06-08T13:40:52.236Z
last refreshed on: 2026-06-08T13:41:38.450Z
source accessed on: 2024-06-05T14:42:36Z
source last accessed on: 2024-06-05T14:42:36Z
label: ODM(設計製造受託ｻｰﾋﾞｽ) @ja
definition: This segment includes companies that provide original design manufacturing (ODM) services. Unlike pure contract manufacturers, ODM firms also design products that they may sell under their own brand name in addition to what is marketed under the original equipment manufacturer (OEM).
notation: 1910101511
valid from: 2024-06-07

EMS/ODM
type: BicsLevel4SubIndustry
type: Classifier
type: NamedIndividual
is sub industry of: Technology Hardware
is contemporary version of: http://data.ga-group.nl/ics/bics/19101015
is version of: http://data.ga-group.nl/ics/bics/19101015
replaces: http://data.ga-group.nl/ics/bics/2020/19101015
imported on: 2026-06-08T13:40:52.236Z
last refreshed on: 2026-06-08T13:41:38.450Z
source accessed on: 2024-06-05T14:42:36Z
source last accessed on: 2024-06-05T14:42:36Z
label: EMS･ODM(受託製造ｻｰﾋﾞｽ) @ja
definition: This industry subgroup includes companies that provide electronics manufacturing services (EMS) or original design manufacturing (ODM) services. These companies are contract manufacturers that provide outsource manufacturing services for hardware companies. They may also manufacture their own brand-name products.
notation: 19101015
valid from: 2024-06-07

Technology Distributors
type: BicsLevel4SubIndustry
type: Classifier
type: NamedIndividual
is sub industry of: Technology Hardware
is contemporary version of: http://data.ga-group.nl/ics/bics/19101016
is version of: http://data.ga-group.nl/ics/bics/19101016
replaces: http://data.ga-group.nl/ics/bics/2020/19101016
imported on: 2026-06-08T13:40:52.236Z
last refreshed on: 2026-06-08T13:41:38.450Z
source accessed on: 2024-06-05T14:42:36Z
source last accessed on: 2024-06-05T14:42:36Z
label: Distr tecnologia @pt
label: Distrib de technologie @fr
label: Distrib tecnología @es
label: Distributori tecnologia @it
label: TechnVertrieb @de
label: Дистрибьюторы технологий @ru
label: 技术分销商 @zh
label: 科技經銷商 @zh-hant
label: 기술 공급업체 @ko
label: ﾃｸﾉﾛｼﾞｰﾃﾞｨｽﾄﾘﾋﾞｭｰﾀ @ja
definition: This industry subgroup includes companies who specialize in distributing hardware, electronics components, software, and services utilized for technology products. Typically, these companies act as suppliers to technology hardware manufacturers (OEM/EMS/ODM) sourcing components and parts that will be integrated into their final products.
notation: 19101016
valid from: 2024-06-07

Technology Hardware
type: BicsLevel3Industry
type: Classifier
type: NamedIndividual
is industry of: Tech Hardware & Semiconductors
is contemporary version of: http://data.ga-group.nl/ics/bics/191010
is version of: http://data.ga-group.nl/ics/bics/191010
replaces: http://data.ga-group.nl/ics/bics/2020/191010
imported on: 2026-06-08T13:40:52.236Z
last refreshed on: 2026-06-08T13:41:38.450Z
source accessed on: 2024-06-05T14:42:36Z
source last accessed on: 2024-06-05T14:42:36Z
label: Hardware de tecnologia @pt
label: Hardware tecnológico @es
label: Hardware tecnologia @it
label: Matériel technologique @fr
label: Technologiehardware @de
label: Аппаратное обеспечение @ru
label: 技术硬件 @zh
label: 硬體 @zh-hant
label: 기술 하드웨어 @ko
label: ﾃｸﾉﾛｼﾞｰ機器 @ja
definition: This industry includes companies that design or manufacture technology hardware products.
notation: 191010
valid from: 2024-06-07

Back End Capital Equipment
type: BicsLevel5Segment
type: Classifier
type: NamedIndividual
is level5 segment of: Semiconductor Mfg
is contemporary version of: http://data.ga-group.nl/ics/bics/1910111010
is version of: http://data.ga-group.nl/ics/bics/1910111010
replaces: http://data.ga-group.nl/ics/bics/2020/1910111010
imported on: 2026-06-08T13:40:52.236Z
last refreshed on: 2026-06-08T13:41:38.450Z
source accessed on: 2024-06-05T14:42:36Z
source last accessed on: 2024-06-05T14:42:36Z
label: Back-End-Kapitalgeräte @de
label: Equipagg capitale back end @it
label: Equipamento de capital back end @pt
label: Equipo de capital back-end @es
label: Immobilisations back end @fr
label: капитальное оборудование @ru
label: 后端资本设备 @zh
label: 後工程資本設備 @ja
label: 後端資本設備 @zh-hant
label: 백엔드 자본 설비 @ko
definition: This segment includes companies that manufacture back-end semiconductor capital equipment used in the assembly and testing phase of semiconductor fabrication. Includes automated test equipment, wire bonders, die bonders, and encapsulation products.
notation: 1910111010
valid from: 2024-06-07

Front End Capital Equipment
type: BicsLevel5Segment
type: Classifier
type: NamedIndividual
is level5 segment of: Semiconductor Mfg
is contemporary version of: http://data.ga-group.nl/ics/bics/1910111011
is version of: http://data.ga-group.nl/ics/bics/1910111011
replaces: http://data.ga-group.nl/ics/bics/2020/1910111011
imported on: 2026-06-08T13:40:52.236Z
last refreshed on: 2026-06-08T13:41:38.450Z
source accessed on: 2024-06-05T14:42:36Z
source last accessed on: 2024-06-05T14:42:36Z
label: Equipagg capitali front end @it
label: Equipamento de capital front end @pt
label: Equipo de capital inicial @es
label: Front-End-Kapitalgeräte @de
label: Immobilisations front end @fr
label: Фронтальное капитальное оборудование @ru
label: 前工程資本設備 @ja
label: 前端資本設備 @zh-hant
label: 前端资本设备 @zh
label: 프론트엔드 자본 설비 @ko
definition: This segment includes companies that manufacture front-end semiconductor capital equipment or manufacture machinery used to make silicon wafers. Includes deposition equipment (ALD, CVD, PVD), etching equipment, cleaning systems, thermal processing equipment, chemical mechanical planarization equipment, ion implantation equipment, and photolithography equipment.
notation: 1910111011
valid from: 2024-06-07

Assembly Material & Solutions
type: BicsLevel5Segment
type: Classifier
type: NamedIndividual
is level5 segment of: Semiconductor Mfg
is contemporary version of: http://data.ga-group.nl/ics/bics/1910111012
is version of: http://data.ga-group.nl/ics/bics/1910111012
replaces: http://data.ga-group.nl/ics/bics/2020/1910111012
imported on: 2026-06-08T13:40:52.236Z
last refreshed on: 2026-06-08T13:41:38.450Z
source accessed on: 2024-06-05T14:42:36Z
source last accessed on: 2024-06-05T14:42:36Z
label: Matériaux/solutions assemblage @fr
label: Materiales y soluciones de ensamblaje @es
label: Materiali e soluzioni montaggio @it
label: Montagem de materiais e soluções @pt
label: Montagematerialien & -lösungen @de
label: Монтажные материалы и решения @ru
label: 処理材料･ｿﾘｭｰｼｮﾝ @ja
label: 組裝材料/解決方案 @zh-hant
label: 装配材料与解决方案 @zh
label: 조립 재료 및 솔루션 @ko
definition: This segment includes companies that manufacture assembly materials and solutions used in semiconductor integrated circuit (IC) manufacturing.
notation: 1910111012
valid from: 2024-06-07

Assembly & Testing Services
type: BicsLevel5Segment
type: Classifier
type: NamedIndividual
is level5 segment of: Semiconductor Mfg
is contemporary version of: http://data.ga-group.nl/ics/bics/1910111013
is version of: http://data.ga-group.nl/ics/bics/1910111013
replaces: http://data.ga-group.nl/ics/bics/2020/1910111013
imported on: 2026-06-08T13:40:52.236Z
last refreshed on: 2026-06-08T13:41:38.450Z
source accessed on: 2024-06-05T14:42:36Z
source last accessed on: 2024-06-05T14:42:36Z
label: Montage- & Testdienste @de
label: Serviços de montagem e testes @pt
label: Servi��os de montagem e testes @pt
label: Services tests/assemblage @fr
label: Servicios de ensamblaje y pruebas @es
label: Servizi montaggio e test @it
label: Услуги сборки и тестирования @ru
label: 封裝及測試服務 @zh-hant
label: 組立･ﾃｽﾄｻｰﾋﾞｽ @ja
label: 组装与测试服务 @zh
label: 조립 & 테스팅 서비스 @ko
definition: This segment includes companies that provide outsourced assembly (or packaging) and testing services for designers of semiconductor integrated circuits (ICs).
notation: 1910111013
valid from: 2024-06-07

Foundry Services
type: BicsLevel5Segment
type: Classifier
type: NamedIndividual
is level5 segment of: Semiconductor Mfg
is contemporary version of: http://data.ga-group.nl/ics/bics/1910111014
is version of: http://data.ga-group.nl/ics/bics/1910111014
replaces: http://data.ga-group.nl/ics/bics/2020/1910111014
imported on: 2026-06-08T13:40:52.236Z
last refreshed on: 2026-06-08T13:41:38.450Z
source accessed on: 2024-06-05T14:42:36Z
source last accessed on: 2024-06-05T14:42:36Z
label: Gießereidienste @de
label: Serviços de fundição @pt
label: Services de fonderie @fr
label: Servicios de fundición @es
label: Servizi fonderia @it
label: Литье @ru
label: 晶圓代工 @zh-hant
label: 鋳造 @ja
label: 铸造服务 @zh
label: 반도체수탁생산 @ko
definition: This segment includes companies that provide outsourced manufacturing for designers of semiconductor integrated circuits (ICs).
notation: 1910111014
valid from: 2024-06-07

Silicon Products
type: BicsLevel5Segment
type: Classifier
type: NamedIndividual
is level5 segment of: Semiconductor Mfg
is contemporary version of: http://data.ga-group.nl/ics/bics/1910111015
is version of: http://data.ga-group.nl/ics/bics/1910111015
replaces: http://data.ga-group.nl/ics/bics/2020/1910111015
imported on: 2026-06-08T13:40:52.236Z
last refreshed on: 2026-06-08T13:41:38.450Z
source accessed on: 2024-06-05T14:42:36Z
source last accessed on: 2024-06-05T14:42:36Z
label: Prodotti di silicio @it
label: Productos de silicio @es
label: Produits de silicium @fr
label: Produtos de silicone @pt
label: Siliziumprodukte @de
label: Кремниевые продукты @ru
label: 矽產品 @zh-hant
label: 硅制品 @zh
label: 실리콘 제품 @ko
label: ｼﾘｺﾝ製品 @ja
definition: This segment includes companies that manufacture silicon products that are used as raw materials in semiconductor integrated circuit (IC) manufacturing.
notation: 1910111015
valid from: 2024-06-07

Semiconductor Mfg
type: BicsLevel4SubIndustry
type: Classifier
type: NamedIndividual
is sub industry of: Semiconductors
is contemporary version of: http://data.ga-group.nl/ics/bics/19101110
is version of: http://data.ga-group.nl/ics/bics/19101110
replaces: http://data.ga-group.nl/ics/bics/2020/19101110
imported on: 2026-06-08T13:40:52.236Z
last refreshed on: 2026-06-08T13:41:38.450Z
source accessed on: 2024-06-05T14:42:36Z
source last accessed on: 2024-06-05T14:42:36Z
label: Fab de semicondutor @pt
label: Fab semi-conducteurs @fr
label: Fabricación de semiconductores @es
label: Herstellung von Halbleitern @de
label: Prod semiconduttori @it
label: Пр-во полупроводн. @ru
label: 半导体制造 @zh
label: 半導体製造 @ja
label: 半導體製造 @zh-hant
label: 반도체 제조 @ko
definition: This industry subgroup includes companies that manufacture semiconductors. Includes companies that supply capital equipment and materials and outsourced manufacturing services. Excludes companies that design the semiconductor devices themselves (see Semiconductor Devices).
notation: 19101110
valid from: 2024-06-07

App Specific Analog
type: BicsLevel6Segment
type: Classifier
type: NamedIndividual
is level6 segment of: Analog ICs
is contemporary version of: http://data.ga-group.nl/ics/bics/191011111010
is version of: http://data.ga-group.nl/ics/bics/191011111010
replaces: http://data.ga-group.nl/ics/bics/2020/191011111010
imported on: 2026-06-08T13:40:52.236Z
last refreshed on: 2026-06-08T13:41:38.450Z
source accessed on: 2024-06-05T14:42:36Z
source last accessed on: 2024-06-05T14:42:36Z
label: ASSP 특정 아날로그 @ko
label: Análogo específico de app @pt
label: Analogica spec applicazione @it
label: Anw.-spez. Analogon @de
label: Ap específica análogo @es
label: Application spécifique analogue @fr
label: Аналог специализир. применения @ru
label: 特定应用模拟 @zh
label: 特定用途向ｱﾅﾛｸﾞ機器 @ja
label: 特殊應用類比 @zh-hant
definition: This segment includes companies that design or manufacture analog semiconductor devices or integrated circuits (ICs) for application-specific standard products (products specific to certain industries).
notation: 191011111010
valid from: 2024-06-07

Power Management
type: BicsLevel6Segment
type: Classifier
type: NamedIndividual
is level6 segment of: Analog ICs
is contemporary version of: http://data.ga-group.nl/ics/bics/191011111011
is version of: http://data.ga-group.nl/ics/bics/191011111011
replaces: http://data.ga-group.nl/ics/bics/2020/191011111011
imported on: 2026-06-08T13:40:52.236Z
last refreshed on: 2026-06-08T13:41:38.450Z
source accessed on: 2024-06-05T14:42:36Z
source last accessed on: 2024-06-05T14:42:36Z
label: Gerenciamento de energia @pt
label: Gestión de electricidad @es
label: Gestion d'électricité @fr
label: Gestione energia @it
label: Strom-Management @de
label: Управление энергопитанием @ru
label: 电源管理 @zh
label: 電力管理 @ja
label: 電源管理 @zh-hant
label: 전력 관리 @ko
definition: This segment includes companies that design or manufacture analog semiconductor devices or integrated circuits (ICs) for power management products.
notation: 191011111011
valid from: 2024-06-07

Standard Linear - General
type: BicsLevel6Segment
type: Classifier
type: NamedIndividual
is level6 segment of: Analog ICs
is contemporary version of: http://data.ga-group.nl/ics/bics/191011111012
is version of: http://data.ga-group.nl/ics/bics/191011111012
replaces: http://data.ga-group.nl/ics/bics/2020/191011111012
imported on: 2026-06-08T13:40:52.236Z
last refreshed on: 2026-06-08T13:41:38.450Z
source accessed on: 2024-06-05T14:42:36Z
source last accessed on: 2024-06-05T14:42:36Z
label: Linéaire standard - Général @fr
label: Lineal estándar - general @es
label: Linear padrão - Geral @pt
label: Lineare standard - Generale @it
label: Standard-Linear (Allg. Verwendung) @de
label: Стандартные линейные - общее назначение @ru
label: 标准线性-通用 @zh
label: 標準線形(一般用途) @ja
label: 標準線性-一般目的 @zh-hant
label: 표준선형-일반 @ko
definition: This segment includes companies that design or manufacture generic analog semiconductor devices or integrated circuits (ICs) that are used in multiple products in multiple industries.
notation: 191011111012
valid from: 2024-06-07

Analog ICs
type: BicsLevel5Segment
type: Classifier
type: NamedIndividual
is level5 segment of: Semiconductor Devices
is contemporary version of: http://data.ga-group.nl/ics/bics/1910111110
is version of: http://data.ga-group.nl/ics/bics/1910111110
replaces: http://data.ga-group.nl/ics/bics/2020/1910111110
imported on: 2026-06-08T13:40:52.236Z
last refreshed on: 2026-06-08T13:41:38.450Z
source accessed on: 2024-06-05T14:42:36Z
source last accessed on: 2024-06-05T14:42:36Z
label: Analoge ICs @de
label: CI análogo @pt
label: CI analogico @it
label: CI analogues @fr
label: ICs análogos @es
label: Аналогов. ИС @ru
label: 模拟IC @zh
label: 類比IC @zh-hant
label: 아날로그 IC @ko
label: ｱﾅﾛｸﾞIC @ja
definition: This segment includes companies that design or manufacture semiconductor devices or integrated circuits (ICs) for analog or mixed-signal circuitry.
notation: 1910111110
valid from: 2024-06-07

Discretes, Sensors & Actuators
type: BicsLevel6Segment
type: Classifier
type: NamedIndividual
is level6 segment of: Discrete
is contemporary version of: http://data.ga-group.nl/ics/bics/191011111110
is version of: http://data.ga-group.nl/ics/bics/191011111110
replaces: http://data.ga-group.nl/ics/bics/2020/191011111110
imported on: 2026-06-08T13:40:52.236Z
last refreshed on: 2026-06-08T13:41:38.450Z
source accessed on: 2024-06-05T14:42:36Z
source last accessed on: 2024-06-05T14:42:36Z
label: Discreti, sensori e attuatori @it
label: Discretos, sensores e atuadores @pt
label: Discretos, sensores y accionadores @es
label: Diskrete Bauelemente, Sensoren & Aktuatoren @de
label: Données discrètes/capteurs/actionneurs @fr
label: Дискретные компоненты, сенсоры @ru
label: 個別部品･ｾﾝｻｰ･作動装置 @ja
label: 分立器件、传感器及执行器 @zh
label: 分離器/感應器/促動器 @zh-hant
label: 개별소자, 센서 & 구동장치 @ko
definition: This segment includes companies that design or manufacture sensors, actuators, or other discrete semiconductor devices.
notation: 191011111110
valid from: 2024-06-07

LED
type: BicsLevel6Segment
type: Classifier
type: NamedIndividual
is level6 segment of: Discrete
is contemporary version of: http://data.ga-group.nl/ics/bics/191011111111
is version of: http://data.ga-group.nl/ics/bics/191011111111
replaces: http://data.ga-group.nl/ics/bics/2020/191011111111
imported on: 2026-06-08T13:40:52.236Z
last refreshed on: 2026-06-08T13:41:38.450Z
source accessed on: 2024-06-05T14:42:36Z
source last accessed on: 2024-06-05T14:42:36Z
label: Светодиоды @ru
label: 發光二極體 @zh-hant
definition: This segment includes companies that design or manufacture discrete semiconductor devices or discrete circuits for light emitting diodes (LEDs).
notation: 191011111111
valid from: 2024-06-07

Optical Components
type: BicsLevel6Segment
type: Classifier
type: NamedIndividual
is level6 segment of: Discrete
is contemporary version of: http://data.ga-group.nl/ics/bics/191011111112
is version of: http://data.ga-group.nl/ics/bics/191011111112
replaces: http://data.ga-group.nl/ics/bics/2020/191011111112
imported on: 2026-06-08T13:40:52.236Z
last refreshed on: 2026-06-08T13:41:38.450Z
source accessed on: 2024-06-05T14:42:36Z
source last accessed on: 2024-06-05T14:42:36Z
label: Componentes ópticos @es
label: Componentes óticos @pt
label: Componenti ottici @it
label: Composants optiques @fr
label: Optische Komponenten @de
label: Оптические компоненты @ru
label: 光学元件 @zh
label: 光学部品 @ja
label: 光電半導體 @zh-hant
label: 광학 부품 @ko
definition: This segment includes companies that design or manufacture discrete semiconductor devices or discrete circuits focused on optical components.
notation: 191011111112
valid from: 2024-06-07

Discrete
type: BicsLevel5Segment
type: Classifier
type: NamedIndividual
is level5 segment of: Semiconductor Devices
is contemporary version of: http://data.ga-group.nl/ics/bics/1910111111
is version of: http://data.ga-group.nl/ics/bics/1910111111
replaces: http://data.ga-group.nl/ics/bics/2020/1910111111
imported on: 2026-06-08T13:40:52.236Z
last refreshed on: 2026-06-08T13:41:38.450Z
source accessed on: 2024-06-05T14:42:36Z
source last accessed on: 2024-06-05T14:42:36Z
label: Discret @fr
label: Discreto @es
label: Diskret @de
label: Дискретные @ru
label: 非持续 @zh
label: 非連續 @zh-hant
label: 비연속 @ko
label: ﾃﾞｨｽｸﾘｰﾄ @ja
definition: This segment includes companies that design or manufacture discrete semiconductor devices or discrete circuits.
notation: 1910111111
valid from: 2024-06-07

Intellectual Property - Semi
type: BicsLevel5Segment
type: Classifier
type: NamedIndividual
is level5 segment of: Semiconductor Devices
is contemporary version of: http://data.ga-group.nl/ics/bics/1910111112
is version of: http://data.ga-group.nl/ics/bics/1910111112
replaces: http://data.ga-group.nl/ics/bics/2020/1910111112
imported on: 2026-06-08T13:40:52.236Z
last refreshed on: 2026-06-08T13:41:38.450Z
source accessed on: 2024-06-05T14:42:36Z
source last accessed on: 2024-06-05T14:42:36Z
label: Geistiges Eigentum - Halbleiter @de
label: Ppté intellectuelle - Semi @fr
label: Propiedad intelectual - semi @es
label: Propriedade intelectual - Semi @pt
label: Proprietà Intellettuale - Semi @it
label: Интеллект. собств. - дизайн полупров. @ru
label: 智慧財產-半導體設計 @zh-hant
label: 知的財産-半導体 @ja
label: 知识产权-半导体 @zh
label: 지적재산권-반도체 @ko
definition: This segment includes companies that create, license, and market semiconductor intellectual property.
notation: 1910111112
valid from: 2024-06-07

NAND Flash
type: BicsLevel6Segment
type: Classifier
type: NamedIndividual
is level6 segment of: Memory ICs
is contemporary version of: http://data.ga-group.nl/ics/bics/191011111310
is version of: http://data.ga-group.nl/ics/bics/191011111310
replaces: http://data.ga-group.nl/ics/bics/2020/191011111310
imported on: 2026-06-08T13:40:52.236Z
last refreshed on: 2026-06-08T13:41:38.450Z
source accessed on: 2024-06-05T14:42:36Z
source last accessed on: 2024-06-05T14:42:36Z
label: Flash NAND @it
label: Flash NON-ET @fr
label: Memória flash NAND @pt
label: NAND Flash-Speicher @de
label: NAND 快閃記憶體 @zh-hant
label: NAND型ﾌﾗｯｼｭ @ja
label: NAND闪存 @zh
label: 낸드플래시 @ko
definition: This segment includes companies that design or manufacture NAND flash memory semiconductor devices or integrated circuits (ICs).
notation: 191011111310
valid from: 2024-06-07

NOR Flash
type: BicsLevel6Segment
type: Classifier
type: NamedIndividual
is level6 segment of: Memory ICs
is contemporary version of: http://data.ga-group.nl/ics/bics/191011111311
is version of: http://data.ga-group.nl/ics/bics/191011111311
replaces: http://data.ga-group.nl/ics/bics/2020/191011111311
imported on: 2026-06-08T13:40:52.236Z
last refreshed on: 2026-06-08T13:41:38.450Z
source accessed on: 2024-06-05T14:42:36Z
source last accessed on: 2024-06-05T14:42:36Z
label: Flash NON-OU @fr
label: Flash NOR @it
label: Memória flash NOR @pt
label: NOR Flash-Speicher @de
label: NOR 快閃記憶體 @zh-hant
label: NOR型ﾌﾗｯｼｭ @ja
label: NOR闪存 @zh
label: 노어플래시 @ko
definition: This segment includes companies that design or manufacture NOR flash memory semiconductor devices or integrated circuits (ICs).
notation: 191011111311
valid from: 2024-06-07

DRAM
type: BicsLevel6Segment
type: Classifier
type: NamedIndividual
is level6 segment of: Memory ICs
is contemporary version of: http://data.ga-group.nl/ics/bics/191011111312
is version of: http://data.ga-group.nl/ics/bics/191011111312
replaces: http://data.ga-group.nl/ics/bics/2020/191011111312
imported on: 2026-06-08T13:40:52.236Z
last refreshed on: 2026-06-08T13:41:38.450Z
source accessed on: 2024-06-05T14:42:36Z
source last accessed on: 2024-06-05T14:42:36Z
label: D램 @ko
label: Memória DRAM @pt
label: Память DRAM @ru
definition: This segment includes companies that design or manufacture dynamic random access memory (DRAM) semiconductor devices or integrated circuits (ICs). DRAM is a type of volatile memory used extensively in computer hardware.
notation: 191011111312
valid from: 2024-06-07

Memória SRAM
type: BicsLevel6Segment
type: Classifier
type: NamedIndividual
is level6 segment of: Memory ICs
is contemporary version of: http://data.ga-group.nl/ics/bics/191011111313
is version of: http://data.ga-group.nl/ics/bics/191011111313
replaces: http://data.ga-group.nl/ics/bics/2020/191011111313
imported on: 2026-06-08T13:40:52.236Z
last refreshed on: 2026-06-08T13:41:38.450Z
source accessed on: 2024-06-05T14:42:36Z
source last accessed on: 2024-06-05T14:42:36Z
label: SRAM
label: S램 @ko
label: Память SRAM @ru
definition: This segment includes companies that design or manufacture static random access memory (SRAM) semiconductor devices or integrated circuits (ICs). SRAMs are commonly used in electronic switches.
notation: 191011111313
valid from: 2024-06-07

Memory ICs
type: BicsLevel5Segment
type: Classifier
type: NamedIndividual
is level5 segment of: Semiconductor Devices
is contemporary version of: http://data.ga-group.nl/ics/bics/1910111113
is version of: http://data.ga-group.nl/ics/bics/1910111113
replaces: http://data.ga-group.nl/ics/bics/2020/1910111113
imported on: 2026-06-08T13:40:52.236Z
last refreshed on: 2026-06-08T13:41:38.450Z
source accessed on: 2024-06-05T14:42:36Z
source last accessed on: 2024-06-05T14:42:36Z
label: CI mémoire @fr
label: CI memória @pt
label: CI memoria @it
label: ICs de memoria @es
label: Speicher-ICs @de
label: Память ИС @ru
label: 内存IC @zh
label: 記憶體IC @zh-hant
label: 메모리 IC @ko
label: ﾒﾓﾘｰIC @ja
definition: This segment includes companies that design or manufacture memory semiconductor devices or integrated circuits (ICs). Memory ICs are further divided into volatile and non-volatile types.
notation: 1910111113
valid from: 2024-06-07

App Specific Communication
type: BicsLevel6Segment
type: Classifier
type: NamedIndividual
is level6 segment of: Logic, Processors & App Specific
is contemporary version of: http://data.ga-group.nl/ics/bics/191011111410
is version of: http://data.ga-group.nl/ics/bics/191011111410
replaces: http://data.ga-group.nl/ics/bics/2020/191011111410
imported on: 2026-06-08T13:40:52.236Z
last refreshed on: 2026-06-08T13:41:38.450Z
source accessed on: 2024-06-05T14:42:36Z
source last accessed on: 2024-06-05T14:42:36Z
label: Anw.-spezifische Kommunikation @de
label: Ap específica de comunicación @es
label: Communication app spécifique @fr
label: Comunicação específica para app @pt
label: Comunicazione specifica app @it
label: Коммуник. специализ. применения @ru
label: 特定应用通讯 @zh
label: 特定用途向け通信用IC @ja
label: 特殊用途通訊 @zh-hant
label: 앱 특정 통신 @ko
definition: This segment includes companies that design or manufacture analog or digital semiconductor devices or integrated circuits (ICs) for communications products.
notation: 191011111410
valid from: 2024-06-07

App Specific I/O & Storage
type: BicsLevel6Segment
type: Classifier
type: NamedIndividual
is level6 segment of: Logic, Processors & App Specific
is contemporary version of: http://data.ga-group.nl/ics/bics/191011111411
is version of: http://data.ga-group.nl/ics/bics/191011111411
replaces: http://data.ga-group.nl/ics/bics/2020/191011111411
imported on: 2026-06-08T13:40:52.236Z
last refreshed on: 2026-06-08T13:41:38.450Z
source accessed on: 2024-06-05T14:42:36Z
source last accessed on: 2024-06-05T14:42:36Z
label: AP específica y almacenamiento @es
label: Anw.-spezifische I/O & Speicherung @de
label: E/S et stockage app spécifique @fr
label: I/O e archiviazione specifica app @it
label: I/O e armazenagem específica para app @pt
label: Устройства ввода/вывода/хран. данных СП @ru
label: 特定应用输入输出与存储 @zh
label: 特定用途向けPCﾛｼﾞｯｸ @ja
label: 特定用��向けPCﾛｼﾞｯｸ @ja
label: 特殊用途I/O及儲存 @zh-hant
label: 앱 특정 I/O & 스토리지 @ko
definition: This segment includes companies that design or manufacture analog or digital computing and consumer semiconductor devices or integrated circuits (ICs) for personal computer logic products.
notation: 191011111411
valid from: 2024-06-07

App Specific Multimedia
type: BicsLevel6Segment
type: Classifier
type: NamedIndividual
is level6 segment of: Logic, Processors & App Specific
is contemporary version of: http://data.ga-group.nl/ics/bics/191011111412
is version of: http://data.ga-group.nl/ics/bics/191011111412
replaces: http://data.ga-group.nl/ics/bics/2020/191011111412
imported on: 2026-06-08T13:40:52.236Z
last refreshed on: 2026-06-08T13:41:38.450Z
source accessed on: 2024-06-05T14:42:36Z
source last accessed on: 2024-06-05T14:42:36Z
label: Anw.-spezifisches Multimedia @de
label: Ap específico de multimedia @es
label: Disp multimediali specifici app @it
label: Multimédia app spécifique @fr
label: Multimídia específica para app @pt
label: Мультимедиа специализ. применения @ru
label: 特定应用多媒体 @zh
label: 特定用途向けﾏﾙﾁﾒﾃﾞｨｱ @ja
label: 特殊用途多媒體 @zh-hant
label: 앱 특정 멀티미디어 @ko
definition: This segment includes companies that design or manufacture analog or digital computing and consumer semiconductor devices or integrated circuits (ICs) focused on multimedia functions. Includes semiconductor devices, such as graphics ICs and audio codecs.
notation: 191011111412
valid from: 2024-06-07

Logic
type: BicsLevel6Segment
type: Classifier
type: NamedIndividual
is level6 segment of: Logic, Processors & App Specific
is contemporary version of: http://data.ga-group.nl/ics/bics/191011111413
is version of: http://data.ga-group.nl/ics/bics/191011111413
replaces: http://data.ga-group.nl/ics/bics/2020/191011111413
imported on: 2026-06-08T13:40:52.236Z
last refreshed on: 2026-06-08T13:41:38.450Z
source accessed on: 2024-06-05T14:42:36Z
source last accessed on: 2024-06-05T14:42:36Z
label: Lógica @es
label: Logica @it
label: Logik @de
label: Logique @fr
label: Логика @ru
label: 逻辑 @zh
label: 邏輯 @zh-hant
label: 로직 @ko
label: ﾛｼﾞｯｸ @ja
definition: This segment includes companies that design and manufacture programmable logic semiconductor devices (PLDs). Includes field programmable gate arrays (FPGAs) and complex programmable logic devices (CPLDs).
notation: 191011111413
valid from: 2024-06-07

Microcontrollers
type: BicsLevel6Segment
type: Classifier
type: NamedIndividual
is level6 segment of: Logic, Processors & App Specific
is contemporary version of: http://data.ga-group.nl/ics/bics/191011111414
is version of: http://data.ga-group.nl/ics/bics/191011111414
replaces: http://data.ga-group.nl/ics/bics/2020/191011111414
imported on: 2026-06-08T13:40:52.236Z
last refreshed on: 2026-06-08T13:41:38.450Z
source accessed on: 2024-06-05T14:42:36Z
source last accessed on: 2024-06-05T14:42:36Z
label: Microcontrôleurs @fr
label: Microcontroladores @es
label: Microcontrollori @it
label: Mikrokontroller @de
label: Микроконтроллеры @ru
label: 微控制器 @zh
label: 마이크로컨트롤러 @ko
label: ﾏｲｸﾛｺﾝﾄﾛｰﾗｰ @ja
definition: This segment includes companies that design or manufacture analog or digital computing and consumer semiconductor devices or integrated circuits (ICs) for microcontroller products.
notation: 191011111414
valid from: 2024-06-07

Microprocessors
type: BicsLevel6Segment
type: Classifier
type: NamedIndividual
is level6 segment of: Logic, Processors & App Specific
is contemporary version of: http://data.ga-group.nl/ics/bics/191011111415
is version of: http://data.ga-group.nl/ics/bics/191011111415
replaces: http://data.ga-group.nl/ics/bics/2020/191011111415
imported on: 2026-06-08T13:40:52.236Z
last refreshed on: 2026-06-08T13:41:38.450Z
source accessed on: 2024-06-05T14:42:36Z
source last accessed on: 2024-06-05T14:42:36Z
label: Microprocesadores @es
label: Microprocessadores @pt
label: Microprocesseurs @fr
label: Microprocessori @it
label: Mikroprozessoren @de
label: Микропроцессоры @ru
label: 微处理器 @zh
label: 微處理器 @zh-hant
label: 마이크로프로세서 @ko
label: ﾏｲｸﾛﾌﾟﾛｾｯｻｰ @ja
definition: This segment includes companies that design or manufacture analog or digital computing and consumer semiconductor devices or integrated circuits (ICs) for microprocessor products.
notation: 191011111415
valid from: 2024-06-07

Logic, Processors & App Specific
type: BicsLevel5Segment
type: Classifier
type: NamedIndividual
is level5 segment of: Semiconductor Devices
is contemporary version of: http://data.ga-group.nl/ics/bics/1910111114
is version of: http://data.ga-group.nl/ics/bics/1910111114
replaces: http://data.ga-group.nl/ics/bics/2020/1910111114
imported on: 2026-06-08T13:40:52.236Z
last refreshed on: 2026-06-08T13:41:38.450Z
source accessed on: 2024-06-05T14:42:36Z
source last accessed on: 2024-06-05T14:42:36Z
label: Lógica, procesadores e IC esp ap @es
label: Lógica, processadores e ASIC @pt
label: Logica, processori e ASIC @it
label: Logik, Prozessoren & ASIC @de
label: Logiques/processeurs/app spéc @fr
label: Логич., процес. и специализ. ИС @ru
label: 逻辑、处理器及特定应用 @zh
label: 邏輯/處理器/特殊應用IC @zh-hant
label: 로직, 프로세서 & ASIC @ko
label: 로���, 프로세서 & ASIC @ko
label: ﾛｼﾞｯｸ･ﾌﾟﾛｾｯｻｰ･特定用途用 @ja
definition: This segment includes companies that design or manufacture logic integrated circuits (ICs), processors, and application-specific ICs.
notation: 1910111114
valid from: 2024-06-07

Semiconductor Devices
type: BicsLevel4SubIndustry
type: Classifier
type: NamedIndividual
is sub industry of: Semiconductors
is contemporary version of: http://data.ga-group.nl/ics/bics/19101111
is version of: http://data.ga-group.nl/ics/bics/19101111
replaces: http://data.ga-group.nl/ics/bics/2020/19101111
imported on: 2026-06-08T13:40:52.236Z
last refreshed on: 2026-06-08T13:41:38.450Z
source accessed on: 2024-06-05T14:42:36Z
source last accessed on: 2024-06-05T14:42:36Z
label: Aparelhos semicond @pt
label: Appareils semi-cond @fr
label: Dispositivi semiconduttori @it
label: Disps semiconduct @es
label: Halbleitergeräte @de
label: П/проводниковые устройства @ru
label: 半导体元件 @zh
label: 半導体素子 @ja
label: 半導體元件 @zh-hant
label: 반도체 소자 @ko
definition: This industry subgroup includes companies that design or manufacture semiconductor devices or integrated circuits (ICs). Excludes outsourced semiconductor manufacturing services for semiconductor design companies (see Foundries).
notation: 19101111
valid from: 2024-06-07

Semiconductors
type: BicsLevel3Industry
type: Classifier
type: NamedIndividual
is industry of: Tech Hardware & Semiconductors
is contemporary version of: http://data.ga-group.nl/ics/bics/191011
is version of: http://data.ga-group.nl/ics/bics/191011
replaces: http://data.ga-group.nl/ics/bics/2020/191011
imported on: 2026-06-08T13:40:52.236Z
last refreshed on: 2026-06-08T13:41:38.450Z
source accessed on: 2024-06-05T14:42:36Z
source last accessed on: 2024-06-05T14:42:36Z
label: Halbleiter @de
label: Semi-conducteurs @fr
label: Semiconductores @es
label: Semicondutores @pt
label: Semiconduttori @it
label: Полупроводники @ru
label: 半导体 @zh
label: 半導体 @ja
label: 半導體 @zh-hant
label: 반도체 @ko
definition: This industry includes companies that manufacture semiconductor integrated circuits (ICs) or its capital equipment.
notation: 191011
valid from: 2024-06-07

Tech Hardware & Semiconductors
type: BicsLevel2IndustryGroup
type: Classifier
type: NamedIndividual
is industry group of: Technology
is contemporary version of: http://data.ga-group.nl/ics/bics/1910
is version of: http://data.ga-group.nl/ics/bics/1910
replaces: http://data.ga-group.nl/ics/bics/2020/1910
imported on: 2026-06-08T13:40:52.236Z
last refreshed on: 2026-06-08T13:41:38.450Z
source accessed on: 2024-06-05T14:42:36Z
source last accessed on: 2024-06-05T14:42:36Z
label: Hardware de tecn e semicondutores @pt
label: Hardware tecn e semiconduttori @it
label: Matériel tech et semi-conducteurs @fr
label: Semiconductores y maquinarias tec @es
label: Techn. - Hardware & Halbleiter @de
label: Тех. оборудование и полупроводники @ru
label: 技术硬件与半导体 @zh
label: 科技硬體及半導體 @zh-hant
label: 기술 하드웨어 & 반도체 @ko
label: ﾃｸﾉﾛｼﾞｰ機器･半導体 @ja
definition: This industry group includes companies that manufacture physical technology products.
notation: 1910
valid from: 2024-06-07

Analytics & Visualization
type: BicsLevel5Segment
type: Classifier
type: NamedIndividual
is level5 segment of: Application Software
is contemporary version of: http://data.ga-group.nl/ics/bics/1911101010
is version of: http://data.ga-group.nl/ics/bics/1911101010
replaces: http://data.ga-group.nl/ics/bics/2020/1911101010
imported on: 2026-06-08T13:40:52.236Z
last refreshed on: 2026-06-08T13:41:38.450Z
source accessed on: 2024-06-05T14:42:36Z
source last accessed on: 2024-06-05T14:42:36Z
label: Análise e visualização @pt
label: Análisis y visualización @es
label: Analisi e visualizzazione @it
label: Analysen & Visualisierung @de
label: Outils d'analyse/visualisation @fr
label: Аналитика и визуализация @ru
label: 分析与可视化 @zh
label: 分析及視覺化 @zh-hant
label: 分析･可視化ｿﾌﾄｳｴｱ @ja
label: 분석 및 시각화 @ko
definition: This segment includes companies that develop software designed to analyze and display data, such as big data analysis and reporting software.
notation: 1911101010
valid from: 2024-06-07

Content & Collaboration Software
type: BicsLevel5Segment
type: Classifier
type: NamedIndividual
is level5 segment of: Application Software
is contemporary version of: http://data.ga-group.nl/ics/bics/1911101011
is version of: http://data.ga-group.nl/ics/bics/1911101011
replaces: http://data.ga-group.nl/ics/bics/2020/1911101011
imported on: 2026-06-08T13:40:52.236Z
last refreshed on: 2026-06-08T13:41:38.450Z
source accessed on: 2024-06-05T14:42:36Z
source last accessed on: 2024-06-05T14:42:36Z
label: Inhalts- & Kollaborationssoftware @de
label: Logiciels de contenu/collabo @fr
label: Software contenuto e collab @it
label: Software de colaboración y contenido @es
label: Software de conteúdo e colaboração @pt
label: ПО для контента/участия @ru
label: 內容管理軟體(CMS) @zh-hant
label: 内容与协作软件 @zh
label: 컨텐츠 및 협업 소프트웨어 @ko
label: ｺﾝﾃﾝﾂ･ｺﾗﾎﾞﾚｰｼｮﾝｿﾌﾄｳｴｱ @ja
definition: This segment includes companies that develop software that creates, maintains, publishes, or shares content such as documents and digital media. Includes document readers, printing software, graphic design software, media players, 3D modelling, and other media software.
notation: 1911101011
valid from: 2024-06-07

Engenharia de software
type: BicsLevel5Segment
type: Classifier
type: NamedIndividual
is level5 segment of: Application Software
is contemporary version of: http://data.ga-group.nl/ics/bics/1911101012
is version of: http://data.ga-group.nl/ics/bics/1911101012
replaces: http://data.ga-group.nl/ics/bics/2020/1911101012
imported on: 2026-06-08T13:40:52.236Z
last refreshed on: 2026-06-08T13:41:38.450Z
source accessed on: 2024-06-05T14:42:36Z
source last accessed on: 2024-06-05T14:42:36Z
label: Engineering Software
label: Logiciels d'ingénierie @fr
label: Software de ingeniería @es
label: Software per l'ingegneria @it
label: Инженерное ПО @ru
label: 工程軟體 @zh-hant
label: 工程软件 @zh
label: 엔지니어링 소프트웨어 @ko
label: ｴﾝｼﾞﾆｱﾘﾝｸﾞｿﾌﾄｳｴｱ @ja
definition: This segment includes companies that develop software for the scientific, engineering, construction, and manufacturing markets. Includes CAD (computer-aided design) software, digital prototyping software, product life cycle management software, and other software designed to improve manufacturing processes.
notation: 1911101012
valid from: 2024-06-07

Enterprise Software
type: BicsLevel5Segment
type: Classifier
type: NamedIndividual
is level5 segment of: Application Software
is contemporary version of: http://data.ga-group.nl/ics/bics/1911101013
is version of: http://data.ga-group.nl/ics/bics/1911101013
replaces: http://data.ga-group.nl/ics/bics/2020/1911101013
imported on: 2026-06-08T13:40:52.236Z
last refreshed on: 2026-06-08T13:41:38.450Z
source accessed on: 2024-06-05T14:42:36Z
source last accessed on: 2024-06-05T14:42:36Z
label: Logiciels d'entreprise @fr
label: Software de empresa @es
label: Software per aziende @it
label: Unternehmens-Software @de
label: ПО для предприятий @ru
label: 企业软件 @zh
label: 企業向ｿﾌﾄｳｴｱ @ja
label: 企業軟體 @zh-hant
label: 기업용 소프트웨어 @ko
definition: This segment includes companies that develop software used to support the internal operations of organizations and improve productivity and efficiency. Includes software developed for internal accounting, customer relationship management (CRM), data processing, enterprise resource management (ERM), human capital management (HCM), supply chain management (SCM), office tools, and related enterprise-wide solutions.
notation: 1911101013
valid from: 2024-06-07

Communications Software
type: BicsLevel6Segment
type: Classifier
type: NamedIndividual
is level6 segment of: Specialty Software
is contemporary version of: http://data.ga-group.nl/ics/bics/191110101410
is version of: http://data.ga-group.nl/ics/bics/191110101410
replaces: http://data.ga-group.nl/ics/bics/2020/191110101410
imported on: 2026-06-08T13:40:52.236Z
last refreshed on: 2026-06-08T13:41:38.450Z
source accessed on: 2024-06-05T14:42:36Z
source last accessed on: 2024-06-05T14:42:36Z
label: Kommunik.-Software @de
label: Logiciel communica. @fr
label: Software comunicac @es
label: Software comunicaz @it
label: Software de comunicação @pt
label: Коммуникационное оборудование @ru
label: 通信ｿﾌﾄｳｴｱ @ja
label: 通信��ﾌﾄｳｴｱ @ja
label: 通訊軟體 @zh-hant
label: 通讯软件 @zh
label: 통신용소프트웨어 @ko
definition: This segment includes companies that develop software for communication purposes. Includes telecommunications, wireless and other networking software.
notation: 191110101410
valid from: 2024-06-07

Education Software
type: BicsLevel6Segment
type: Classifier
type: NamedIndividual
is level6 segment of: Specialty Software
is contemporary version of: http://data.ga-group.nl/ics/bics/191110101411
is version of: http://data.ga-group.nl/ics/bics/191110101411
replaces: http://data.ga-group.nl/ics/bics/2020/191110101411
imported on: 2026-06-08T13:40:52.236Z
last refreshed on: 2026-06-08T13:41:38.450Z
source accessed on: 2024-06-05T14:42:36Z
source last accessed on: 2024-06-05T14:42:36Z
label: Bildungssoftware @de
label: Logiciels éducatifs @fr
label: Software de educação @pt
label: Software educativo @es
label: Software istruzione @it
label: Обучающее программное обеспечение @ru
label: 教育軟體 @zh-hant
label: 教育软件 @zh
label: 教育ｿﾌﾄｳｴｱ @ja
label: 교육 소프트웨어 @ko
definition: This segment includes companies that develop software for educational purposes.
notation: 191110101411
valid from: 2024-06-07

Gambling Software
type: BicsLevel6Segment
type: Classifier
type: NamedIndividual
is level6 segment of: Specialty Software
is contemporary version of: http://data.ga-group.nl/ics/bics/191110101412
is version of: http://data.ga-group.nl/ics/bics/191110101412
replaces: http://data.ga-group.nl/ics/bics/2020/191110101412
imported on: 2026-06-08T13:40:52.236Z
last refreshed on: 2026-06-08T13:41:38.450Z
source accessed on: 2024-06-05T14:42:36Z
source last accessed on: 2024-06-05T14:42:36Z
label: Glücksspiel-Software @de
label: Logiciels de jeux @fr
label: Softw gioco azzardo @it
label: Software de aposta @pt
label: Software de apuestas @es
label: Программное обеспечение игр @ru
label: 博奕軟體 @zh-hant
label: 赌博软件 @zh
label: 도박 소프트웨어 @ko
label: ｷﾞｬﾝﾌﾞﾙｿﾌﾄｳｴｱ @ja
definition: This segment includes companies that develop software for gambling machines and games, sports betting, and other software that supports gambling operations.
notation: 191110101412
valid from: 2024-06-07

Health Care Software
type: BicsLevel6Segment
type: Classifier
type: NamedIndividual
is level6 segment of: Specialty Software
is contemporary version of: http://data.ga-group.nl/ics/bics/191110101413
is version of: http://data.ga-group.nl/ics/bics/191110101413
replaces: http://data.ga-group.nl/ics/bics/2020/191110101413
imported on: 2026-06-08T13:40:52.236Z
last refreshed on: 2026-06-08T13:41:38.450Z
source accessed on: 2024-06-05T14:42:36Z
source last accessed on: 2024-06-05T14:42:36Z
label: Gesundheitssoftware @de
label: Logiciel - santé @fr
label: Software de saúde @pt
label: Software de salud @es
label: Software sanità @it
label: Медицинское прогр. обеспечение @ru
label: 医疗保健软件 @zh
label: 醫療保健軟體 @zh-hant
label: 헬스케어 소프트웨어 @ko
label: ﾍﾙｽｹｱｿﾌﾄｳｴｱ @ja
definition: This segment includes companies that develop software for use in the health care sector.
notation: 191110101413
valid from: 2024-06-07

Specialty Software
type: BicsLevel5Segment
type: Classifier
type: NamedIndividual
is level5 segment of: Application Software
is contemporary version of: http://data.ga-group.nl/ics/bics/1911101014
is version of: http://data.ga-group.nl/ics/bics/1911101014
replaces: http://data.ga-group.nl/ics/bics/2020/1911101014
imported on: 2026-06-08T13:40:52.236Z
last refreshed on: 2026-06-08T13:41:38.450Z
source accessed on: 2024-06-05T14:42:36Z
source last accessed on: 2024-06-05T14:42:36Z
label: Logiciel spécialisé @fr
label: Software especialidade @pt
label: Software especializado @es
label: Software specializzato @it
label: Spezielle Software @de
label: Спец. программное обеспечение @ru
label: Спец. про��раммное обеспечение @ru
label: 専門ｿﾌﾄｳｴｱ @ja
label: 特殊軟體 @zh-hant
label: 特殊软件 @zh
label: 전문 소프트웨어 @ko
definition: This segment includes companies that develop software to cater to specific applications or niche functions not elsewhere classifiable. Typically, these applications are unique to a single industry.
notation: 1911101014
valid from: 2024-06-07

Application Software
type: BicsLevel4SubIndustry
type: Classifier
type: NamedIndividual
is sub industry of: Logiciel
is contemporary version of: http://data.ga-group.nl/ics/bics/19111010
is version of: http://data.ga-group.nl/ics/bics/19111010
replaces: http://data.ga-group.nl/ics/bics/2020/19111010
imported on: 2026-06-08T13:40:52.236Z
last refreshed on: 2026-06-08T13:41:38.450Z
source accessed on: 2024-06-05T14:42:36Z
source last accessed on: 2024-06-05T14:42:36Z
label: Anwendungssoftware @de
label: Logiciel application @fr
label: Software aplicação @pt
label: Software aplicación @es
label: Software applicativo @it
label: Прогр. обеспечение @ru
label: 应用软件 @zh
label: 應用軟體 @zh-hant
label: 애플리케이션SW @ko
label: ｱﾌﾟﾘｹｰｼｮﾝｿﾌﾄｳｴｱ @ja
definition: This industry subgroup includes companies that develop application software. Typically, application software is designed to assist or perform a specific activity and requires infrastructure software to operate.
notation: 19111010
valid from: 2024-06-07

Cloud & Virtualization Software
type: BicsLevel5Segment
type: Classifier
type: NamedIndividual
is level5 segment of: Infrastructure Software
is contemporary version of: http://data.ga-group.nl/ics/bics/1911101110
is version of: http://data.ga-group.nl/ics/bics/1911101110
replaces: http://data.ga-group.nl/ics/bics/2020/1911101110
imported on: 2026-06-08T13:40:52.236Z
last refreshed on: 2026-06-08T13:41:38.450Z
source accessed on: 2024-06-05T14:42:36Z
source last accessed on: 2024-06-05T14:42:36Z
label: Cloud- & Virtualisierungssoftware @de
label: Logiciels d'infonuag/virtualis @fr
label: Software cloud e virtualizz @it
label: Software de nube y virtual @es
label: Software de nuvem e virtualização @pt
label: ПО для визуализ./облачное ПО @ru
label: 云和虚拟化软件 @zh
label: 雲端與虛擬化 @zh-hant
label: 클라우드 및 가상화 @ko
label: ｸﾗｳﾄﾞ･仮想化ｿﾌﾄｳｴｱ @ja
definition: This segment includes companies that develop and operate cloud and virtualization services.
notation: 1911101110
valid from: 2024-06-07

Database Software
type: BicsLevel5Segment
type: Classifier
type: NamedIndividual
is level5 segment of: Infrastructure Software
is contemporary version of: http://data.ga-group.nl/ics/bics/1911101111
is version of: http://data.ga-group.nl/ics/bics/1911101111
replaces: http://data.ga-group.nl/ics/bics/2020/1911101111
imported on: 2026-06-08T13:40:52.236Z
last refreshed on: 2026-06-08T13:41:38.450Z
source accessed on: 2024-06-05T14:42:36Z
source last accessed on: 2024-06-05T14:42:36Z
label: Datenbank-Software @de
label: Logiciel base de données @fr
label: Software de banco de dados @pt
label: Software de base de datos @es
label: Программное обеспечение для баз данных @ru
label: 数据库软件 @zh
label: 資料庫軟體 @zh-hant
label: 데이터베이스 소프트웨어 @ko
label: ﾃﾞｰﾀﾍﾞｰｽｿﾌﾄｳｴｱ @ja
definition: This segment includes companies that develop software used to manage the creation, storage, maintenance, or querying of databases.
notation: 1911101111
valid from: 2024-06-07

Security Software
type: BicsLevel5Segment
type: Classifier
type: NamedIndividual
is level5 segment of: Infrastructure Software
is contemporary version of: http://data.ga-group.nl/ics/bics/1911101112
is version of: http://data.ga-group.nl/ics/bics/1911101112
replaces: http://data.ga-group.nl/ics/bics/2020/1911101112
imported on: 2026-06-08T13:40:52.236Z
last refreshed on: 2026-06-08T13:41:38.450Z
source accessed on: 2024-06-05T14:42:36Z
source last accessed on: 2024-06-05T14:42:36Z
label: Logiciels de sécurité @fr
label: Sicherheitssoftware @de
label: Software de segurança @pt
label: Software de seguridad @es
label: Software di sicurezza @it
label: ПО для безопасности @ru
label: 安全軟體 @zh-hant
label: 安防软件 @zh
label: 보안 소프트웨어 @ko
label: ｾｷｭﾘﾃｨｿﾌﾄｳｪｱ @ja
definition: This segment includes companies that develop computer security and recovery software for consumer applications. Includes anti-virus software, system resource recovery software, and system backup.
notation: 1911101112
valid from: 2024-06-07

System Software
type: BicsLevel5Segment
type: Classifier
type: NamedIndividual
is level5 segment of: Infrastructure Software
is contemporary version of: http://data.ga-group.nl/ics/bics/1911101113
is version of: http://data.ga-group.nl/ics/bics/1911101113
replaces: http://data.ga-group.nl/ics/bics/2020/1911101113
imported on: 2026-06-08T13:40:52.236Z
last refreshed on: 2026-06-08T13:41:38.450Z
source accessed on: 2024-06-05T14:42:36Z
source last accessed on: 2024-06-05T14:42:36Z
label: Betriebssystem @de
label: Logiciel système @fr
label: Software de sistema @es
label: Software di sistema @it
label: Сист. программное обеспечение @ru
label: 系統軟體 @zh-hant
label: 系统软件 @zh
label: 시스템 소프트웨어 @ko
label: ｼｽﾃﾑｿﾌﾄｳｴｱ @ja
definition: This segment includes companies that develop software that is designed to interface with hardware and provide a platform for application software to operate.
notation: 1911101113
valid from: 2024-06-07

Infrastructure Software
type: BicsLevel4SubIndustry
type: Classifier
type: NamedIndividual
is sub industry of: Logiciel
is contemporary version of: http://data.ga-group.nl/ics/bics/19111011
is version of: http://data.ga-group.nl/ics/bics/19111011
replaces: http://data.ga-group.nl/ics/bics/2020/19111011
imported on: 2026-06-08T13:40:52.236Z
last refreshed on: 2026-06-08T13:41:38.450Z
source accessed on: 2024-06-05T14:42:36Z
source last accessed on: 2024-06-05T14:42:36Z
label: Infrastruktur-Software @de
label: Logiciel infrastruct @fr
label: Softw infrastrutture @it
label: Software infraest @pt
label: Software infraestr @es
label: Прогр. обеспеч. инфраструкт. @ru
label: 基盤ｿﾌﾄｳｴｱ @ja
label: 基础设施软件 @zh
label: 基礎建設軟體 @zh-hant
label: 인프라소프트웨어 @ko
definition: This industry subgroup includes companies that develop software that controls the basic operations and management of computing resources. Also includes cloud and virtualization services.
notation: 19111011
valid from: 2024-06-07

Logiciel
type: BicsLevel3Industry
type: Classifier
type: NamedIndividual
is industry of: Software & Tech Services
is contemporary version of: http://data.ga-group.nl/ics/bics/191110
is version of: http://data.ga-group.nl/ics/bics/191110
replaces: http://data.ga-group.nl/ics/bics/2020/191110
imported on: 2026-06-08T13:40:52.236Z
last refreshed on: 2026-06-08T13:41:38.450Z
source accessed on: 2024-06-05T14:42:36Z
source last accessed on: 2024-06-05T14:42:36Z
label: Software
label: Программное обеспечение @ru
label: 軟體 @zh-hant
label: 软件 @zh
label: 소프트웨어 @ko
label: ｿﾌﾄｳｴｱ @ja
definition: This industry includes companies that develop software to interact with hardware or users.
notation: 191110
valid from: 2024-06-07

Business Process Outsourcing
type: BicsLevel6Segment
type: Classifier
type: NamedIndividual
is level6 segment of: IT Services - Commercial
is contemporary version of: http://data.ga-group.nl/ics/bics/191111101010
is version of: http://data.ga-group.nl/ics/bics/191111101010
replaces: http://data.ga-group.nl/ics/bics/2020/191111101010
imported on: 2026-06-08T13:40:52.236Z
last refreshed on: 2026-06-08T13:41:38.450Z
source accessed on: 2024-06-05T14:42:36Z
source last accessed on: 2024-06-05T14:42:36Z
label: Contratação de serviços p/ processos empresariais @pt
label: Contratación de servicios con terceros para procesos empresariales @es
label: Esternalizzazione attività aziendali @it
label: Outsourcing: Geschäftsprozesse @de
label: Sous-trait processus d'entreprise @fr
label: Аутсорсинг бизнес-процессов (BPO) @ru
label: 业务流程外包 @zh
label: 商務流程委外 @zh-hant
label: 業務処理ｱｳﾄｿｰｼﾝｸﾞ @ja
label: 업무처리 외주업 @ko
definition: This segment includes companies that provide outsourced services related to operational business aspects and processes of the client company. Includes HR administration, accounting, customer service, sourcing & procurement, supply chain management, or any other back office operation excluding technology implementation/management (see IT Outsourcing).
notation: 191111101010
valid from: 2024-06-07

IT Outsourcing
type: BicsLevel6Segment
type: Classifier
type: NamedIndividual
is level6 segment of: IT Services - Commercial
is contemporary version of: http://data.ga-group.nl/ics/bics/191111101011
is version of: http://data.ga-group.nl/ics/bics/191111101011
replaces: http://data.ga-group.nl/ics/bics/2020/191111101011
imported on: 2026-06-08T13:40:52.236Z
last refreshed on: 2026-06-08T13:41:38.450Z
source accessed on: 2024-06-05T14:42:36Z
source last accessed on: 2024-06-05T14:42:36Z
label: Esternalizzazione informatica @it
label: Externalisation IT @fr
label: IT 외주업 @ko
label: IT-Outsourcing @de
label: IT外包 @zh
label: IT業務委託 @ja
label: Serviços terceirizados de IT @pt
label: Subcontratación de tecnología de la información @es
label: Компьютерные усл. - Интегрированные решения @ru
label: 資訊科技外包 @zh-hant
definition: This segment includes companies that provide outsourced software development, IT administration and operations, network management, technology hardware maintenance, and recovery activities.
notation: 191111101011
valid from: 2024-06-07

Network Integration Services
type: BicsLevel6Segment
type: Classifier
type: NamedIndividual
is level6 segment of: IT Services - Commercial
is contemporary version of: http://data.ga-group.nl/ics/bics/191111101012
is version of: http://data.ga-group.nl/ics/bics/191111101012
replaces: http://data.ga-group.nl/ics/bics/2020/191111101012
imported on: 2026-06-08T13:40:52.236Z
last refreshed on: 2026-06-08T13:41:38.450Z
source accessed on: 2024-06-05T14:42:36Z
source last accessed on: 2024-06-05T14:42:36Z
label: Netzwerkintegrationsdienste @de
label: Serviços de integração de rede @pt
label: Service d'intégration de réseaux @fr
label: Servicios de integración de redes @es
label: Servizi di reti integrate @it
label: Услуги сетевой интеграции @ru
label: 網路整合服務 @zh-hant
label: 网络集成服务 @zh
label: 네트워크 통합 서비스 @ko
label: ﾈｯﾄﾜｰｸ統合ｻｰﾋﾞｽ @ja
definition: This segment includes companies that design networks and/or install, manage and maintain network elements, such as transmission, switching, and access systems.
notation: 191111101012
valid from: 2024-06-07

Technology Consulting
type: BicsLevel6Segment
type: Classifier
type: NamedIndividual
is level6 segment of: IT Services - Commercial
is contemporary version of: http://data.ga-group.nl/ics/bics/191111101013
is version of: http://data.ga-group.nl/ics/bics/191111101013
replaces: http://data.ga-group.nl/ics/bics/2020/191111101013
imported on: 2026-06-08T13:40:52.236Z
last refreshed on: 2026-06-08T13:41:38.450Z
source accessed on: 2024-06-05T14:42:36Z
source last accessed on: 2024-06-05T14:42:36Z
label: Asesoría de tecnología @es
label: Consulenza tecnologica @it
label: Services conseils Technologie @fr
label: Technologieberatung @de
label: Tecnologia e consultoria @pt
label: Консалтинг в области технологий @ru
label: 科技咨询 @zh
label: 科技顧問 @zh-hant
label: 기술 컨설팅 @ko
label: ﾃｸﾉﾛｼﾞｰｺﾝｻﾙﾃｨﾝｸﾞ @ja
definition: This segment includes companies that provide IT design and strategy, IT operations assessment, and IT maintenance planning.
notation: 191111101013
valid from: 2024-06-07

IT Services - Commercial
type: BicsLevel5Segment
type: Classifier
type: NamedIndividual
is level5 segment of: IT Services
is contemporary version of: http://data.ga-group.nl/ics/bics/1911111010
is version of: http://data.ga-group.nl/ics/bics/1911111010
replaces: http://data.ga-group.nl/ics/bics/2020/1911111010
imported on: 2026-06-08T13:40:52.236Z
last refreshed on: 2026-06-08T13:41:38.450Z
source accessed on: 2024-06-05T14:42:36Z
source last accessed on: 2024-06-05T14:42:36Z
label: IT 서비스 - 상업용 @ko
label: IT-Dienste - Gewerbe @de
label: IT服务-商业 @zh
label: ITｻｰﾋﾞｽ-商業 @ja
label: Serviços IT- Comercial @pt
label: Services IT - Commercial @fr
label: Servicios IT - Comerciales @es
label: Servizi IT - Commerciale @it
label: Услуги ИТ - Правительственные @ru
label: 資訊科技服務 - 商業 @zh-hant
definition: This segment includes companies that perform specialized IT functions for commercial companies. Includes IT outsourcing, technology consulting, and business process outsourcing (BPO).
notation: 1911111010
valid from: 2024-06-07

IT Services - Government
type: BicsLevel5Segment
type: Classifier
type: NamedIndividual
is level5 segment of: IT Services
is contemporary version of: http://data.ga-group.nl/ics/bics/1911111011
is version of: http://data.ga-group.nl/ics/bics/1911111011
replaces: http://data.ga-group.nl/ics/bics/2020/1911111011
imported on: 2026-06-08T13:40:52.236Z
last refreshed on: 2026-06-08T13:41:38.450Z
source accessed on: 2024-06-05T14:42:36Z
source last accessed on: 2024-06-05T14:42:36Z
label: IT 服务-政府 @zh
label: IT 서비스 - 정부 @ko
label: IT-Dienste - Staat @de
label: ITｻｰﾋﾞｽ-政府 @ja
label: Serviços IT - Governo @pt
label: Services IT - Gouvernement @fr
label: Servicios de información - Estado @es
label: Servizi informatici - Statali @it
label: ИТ услуги - Правительство @ru
label: 資訊科技服務 - 政府 @zh-hant
definition: This segment includes companies that provide IT services to government agencies across a broad range of topics and activities ranging from administrative support and business process outsourcing (BPO) to military project implementation.
notation: 1911111011
valid from: 2024-06-07

IT Services
type: BicsLevel4SubIndustry
type: Classifier
type: NamedIndividual
is sub industry of: IT Services
is contemporary version of: http://data.ga-group.nl/ics/bics/19111110
is version of: http://data.ga-group.nl/ics/bics/19111110
replaces: http://data.ga-group.nl/ics/bics/2020/19111110
imported on: 2026-06-08T13:40:52.236Z
last refreshed on: 2026-06-08T13:41:38.450Z
source accessed on: 2024-06-05T14:42:36Z
source last accessed on: 2024-06-05T14:42:36Z
label: IT 服务 @zh
label: IT 서비스 @ko
label: IT-Dienste @de
label: ITｻｰﾋﾞｽ @ja
label: Serv informatica @es
label: Serviços IT @pt
label: Services IT @fr
label: Servizi IT @it
label: ИТ-услуги @ru
label: 資訊科技服務 @zh-hant
definition: This industry subgroup includes companies that provide information technology services for commercial organizations and government agencies.
notation: 19111110
valid from: 2024-06-07

IT Services
type: BicsLevel3Industry
type: Classifier
type: NamedIndividual
is industry of: Software & Tech Services
is contemporary version of: http://data.ga-group.nl/ics/bics/191111
is version of: http://data.ga-group.nl/ics/bics/191111
replaces: http://data.ga-group.nl/ics/bics/2020/191111
imported on: 2026-06-08T13:40:52.236Z
last refreshed on: 2026-06-08T13:41:38.450Z
source accessed on: 2024-06-05T14:42:36Z
source last accessed on: 2024-06-05T14:42:36Z
label: IT 服务 @zh
label: IT 서비스 @ko
label: IT-Dienste @de
label: ITｻｰﾋﾞｽ @ja
label: Serv informatica @es
label: Serviços IT @pt
label: Services IT @fr
label: Servizi IT @it
label: ИТ-услуги @ru
label: 資訊科技服務 @zh-hant
definition: This industry includes companies that provide services primarily using technology-related skills, software, and technology hardware.
notation: 191111
valid from: 2024-06-07

Software & Tech Services
type: BicsLevel2IndustryGroup
type: Classifier
type: NamedIndividual
is industry group of: Technology
is contemporary version of: http://data.ga-group.nl/ics/bics/1911
is version of: http://data.ga-group.nl/ics/bics/1911
replaces: http://data.ga-group.nl/ics/bics/2020/1911
imported on: 2026-06-08T13:40:52.236Z
last refreshed on: 2026-06-08T13:41:38.450Z
source accessed on: 2024-06-05T14:42:36Z
source last accessed on: 2024-06-05T14:42:36Z
label: Logiciels et srvces tech @fr
label: Software e serviços téc @pt
label: Software e servizi tecn @it
label: Software y servicios tec @es
label: Software- & Tech-Dienste @de
label: ПО и тех. услуги @ru
label: 軟體及技術服務 @zh-hant
label: 軟體及���術服務 @zh-hant
label: 软件与技术服务 @zh
label: 소프트웨어 & 기술 서비스 @ko
label: ｿﾌﾄｳｴｱ･ﾃｸﾉﾛｼﾞｰｻｰﾋﾞｽ @ja
definition: This industry group includes companies that provide technology services and software products.
notation: 1911
valid from: 2024-06-07

Technology
type: BicsLevel1Sector
type: Classifier
type: NamedIndividual
is contemporary version of: http://data.ga-group.nl/ics/bics/19
is version of: http://data.ga-group.nl/ics/bics/19
replaces: http://data.ga-group.nl/ics/bics/2020/19
imported on: 2026-06-08T13:40:52.236Z
last refreshed on: 2026-06-08T13:41:38.450Z
source accessed on: 2024-06-05T14:42:36Z
source last accessed on: 2024-06-05T14:42:36Z
label: Technologie @de
label: Tecnología @es
label: Tecnologia @it
label: Технология @ru
label: 科技 @zh
label: 기술 @ko
label: ﾃｸﾉﾛｼﾞｰ @ja
definition: This sector includes companies that manufacture, design, or develop technology related products and services.
notation: 19
valid from: 2024-06-07

Integrated Electric Utilities
type: BicsLevel4SubIndustry
type: Classifier
type: NamedIndividual
is sub industry of: Electric Utilities
is contemporary version of: http://data.ga-group.nl/ics/bics/20101010
is version of: http://data.ga-group.nl/ics/bics/20101010
replaces: http://data.ga-group.nl/ics/bics/2020/20101010
imported on: 2026-06-08T13:40:52.236Z
last refreshed on: 2026-06-08T13:41:38.450Z
source accessed on: 2024-06-05T14:42:36Z
source last accessed on: 2024-06-05T14:42:36Z
label: Aziende erogaz elettr integrata @it
label: Integrierte Stromversorgung @de
label: Serviços públicos elétricos integrados @pt
label: Servicios públicos integrados eléctricos @es
label: Srvc aux coll intégrés @fr
label: Интегрир. электроэнергетика @ru
label: 一体化电力公用事业 @zh
label: 整合型公用事業 @zh-hant
label: 総合電力 @ja
label: 통합 전기 유틸리티 @ko
definition: This industry subgroup includes companies that operate across the regulated electricity value chains from electricity generation to transmission/distribution networks.
notation: 20101010
valid from: 2024-06-07

Fossil Electric - Regulated
type: BicsLevel6Segment
type: Classifier
type: NamedIndividual
is level6 segment of: Fossil Electric Generation
is contemporary version of: http://data.ga-group.nl/ics/bics/201010111010
is version of: http://data.ga-group.nl/ics/bics/201010111010
replaces: http://data.ga-group.nl/ics/bics/2020/201010111010
imported on: 2026-06-08T13:40:52.236Z
last refreshed on: 2026-06-08T13:41:38.450Z
source accessed on: 2024-06-05T14:42:36Z
source last accessed on: 2024-06-05T14:42:36Z
label: Electricité fossile - Réglementée @fr
label: Eletricidade por combustível fóssil - regulamentada @pt
label: Elettrico fossile - regolato @it
label: Fósil eléctrico - Regulado @es
label: Strom aus fossilem Brennstoff - reguliert @de
label: Электричество на основе органич. топлива - Регулир. @ru
label: 化石燃料発電-規制 @ja
label: 化石燃料電力 - 管制 @zh-hant
label: 火电 - 管制 @zh
label: 화석 전기 - 규제 @ko
definition: This segment includes companies that operate under regulated revenue arrangements to generate electricity from fossil fuels.
notation: 201010111010
valid from: 2024-06-07

Fossil Electric - Deregulated
type: BicsLevel6Segment
type: Classifier
type: NamedIndividual
is level6 segment of: Fossil Electric Generation
is contemporary version of: http://data.ga-group.nl/ics/bics/201010111011
is version of: http://data.ga-group.nl/ics/bics/201010111011
replaces: http://data.ga-group.nl/ics/bics/2020/201010111011
imported on: 2026-06-08T13:40:52.236Z
last refreshed on: 2026-06-08T13:41:38.450Z
source accessed on: 2024-06-05T14:42:36Z
source last accessed on: 2024-06-05T14:42:36Z
label: Electricité fossile - Déréglementée @fr
label: Elettrico fossile - Deregolamentato @it
label: Energía fósil - desregulada @es
label: Energia elétrica fóssil - desregulamentada @pt
label: Strom aus fossilem Brennst. - dereguliert @de
label: Энергия на основе ископаемого топлива - нерегулируемый рынок @ru
label: 化石燃料発電-規制外 @ja
label: 化石燃料発電-規制�� @ja
label: 化石發電-解除管制 @zh-hant
label: 火电 - 解除管制 @zh
label: 화석 발전 - 비규제 @ko
definition: This segment includes companies that operate under deregulated revenue arrangements to generate electricity from fossil fuels.
notation: 201010111011
valid from: 2024-06-07

Fossil Electric Generation
type: BicsLevel5Segment
type: Classifier
type: NamedIndividual
is level5 segment of: Power Generation
is contemporary version of: http://data.ga-group.nl/ics/bics/2010101110
is version of: http://data.ga-group.nl/ics/bics/2010101110
replaces: http://data.ga-group.nl/ics/bics/2020/2010101110
imported on: 2026-06-08T13:40:52.236Z
last refreshed on: 2026-06-08T13:41:38.450Z
source accessed on: 2024-06-05T14:42:36Z
source last accessed on: 2024-06-05T14:42:36Z
label: Generación eléctrica de fósiles @es
label: Generazione energia fossili @it
label: Geração de energia fossil @pt
label: Prod d'électricité fossile @fr
label: Stromerzeugung aus fossilen Brennstoffen @de
label: Электроэнергия из ископаемых видов топлива @ru
label: 化石燃料发电 @zh
label: 化石燃料発電 @ja
label: 化石發電 @zh-hant
label: 化石��電 @zh-hant
label: 화석 전기발전 @ko
definition: This segment includes companies that generate electricity from centralized power plants from fossil electric fuel resources.
notation: 2010101110
valid from: 2024-06-07

Nuclear Power - Regulated
type: BicsLevel6Segment
type: Classifier
type: NamedIndividual
is level6 segment of: Nuclear Power Generation
is contemporary version of: http://data.ga-group.nl/ics/bics/201010111110
is version of: http://data.ga-group.nl/ics/bics/201010111110
replaces: http://data.ga-group.nl/ics/bics/2020/201010111110
imported on: 2026-06-08T13:40:52.236Z
last refreshed on: 2026-06-08T13:41:38.450Z
source accessed on: 2024-06-05T14:42:36Z
source last accessed on: 2024-06-05T14:42:36Z
label: Atomkraft - reguliert @de
label: Energía nuclear - Regulada @es
label: Energia nuclear - regulamentada @pt
label: Energia nucleare - regolato @it
label: Energie nucléaire - Réglementé @fr
label: Ядерная энергетика - Регулируемая @ru
label: 原子力発電-規制 @ja
label: 核能 - 管制 @zh
label: 核能-管制 @zh-hant
label: 원자력발전 - 규제 @ko
definition: This segment includes companies that operate under regulated revenue arrangements to generate electricity from nuclear energy.
notation: 201010111110
valid from: 2024-06-07

Nuclear Power - Deregulated
type: BicsLevel6Segment
type: Classifier
type: NamedIndividual
is level6 segment of: Nuclear Power Generation
is contemporary version of: http://data.ga-group.nl/ics/bics/201010111111
is version of: http://data.ga-group.nl/ics/bics/201010111111
replaces: http://data.ga-group.nl/ics/bics/2020/201010111111
imported on: 2026-06-08T13:40:52.236Z
last refreshed on: 2026-06-08T13:41:38.450Z
source accessed on: 2024-06-05T14:42:36Z
source last accessed on: 2024-06-05T14:42:36Z
label: Atomkraft - dereguliert @de
label: Energía nuclear - desregulada @es
label: Energia nuclear - desregulamentada @pt
label: Energia nucleare - Deregolamentata @it
label: Energie nucléaire - Déréglementée @fr
label: Ядерная энергия - нерегулируемый рынок @ru
label: 原子力発電-規制外 @ja
label: 核电 - 解除管制 @zh
label: 核能發電-解除管制 @zh-hant
label: 원자력 - 비규제 @ko
definition: This segment includes companies that operate under deregulated revenue arrangements to generate electricity from nuclear energy.
notation: 201010111111
valid from: 2024-06-07

Nuclear Power Generation
type: BicsLevel5Segment
type: Classifier
type: NamedIndividual
is level5 segment of: Power Generation
is contemporary version of: http://data.ga-group.nl/ics/bics/2010101111
is version of: http://data.ga-group.nl/ics/bics/2010101111
replaces: http://data.ga-group.nl/ics/bics/2020/2010101111
imported on: 2026-06-08T13:40:52.236Z
last refreshed on: 2026-06-08T13:41:38.450Z
source accessed on: 2024-06-05T14:42:36Z
source last accessed on: 2024-06-05T14:42:36Z
label: Generación de energía nuclear @es
label: Generazione energia nucleare @it
label: Geração de energia nuclear @pt
label: Nukleare Energieerzeugung @de
label: Prod d'énergie nucléaire @fr
label: Ядерная энергия @ru
label: 原子力発電 @ja
label: 核能发电 @zh
label: 核能發電 @zh-hant
label: 원자력 발전 @ko
label: ��能發電 @zh-hant
definition: This segment includes companies that generate electricity using heat supplied by nuclear reactors.
notation: 2010101111
valid from: 2024-06-07

Solar Energy - Regulated
type: BicsLevel7Segment
type: Classifier
type: NamedIndividual
is level7 segment of: Solar Energy Generation
is contemporary version of: http://data.ga-group.nl/ics/bics/20101011121010
is version of: http://data.ga-group.nl/ics/bics/20101011121010
replaces: http://data.ga-group.nl/ics/bics/2020/20101011121010
imported on: 2026-06-08T13:40:52.236Z
last refreshed on: 2026-06-08T13:41:38.450Z
source accessed on: 2024-06-05T14:42:36Z
source last accessed on: 2024-06-05T14:42:36Z
label: Energía solar - regulada @es
label: Energia solar - Regulamentada @pt
label: Energia solare - Regolamentata @it
label: Energie solaire - Réglementée @fr
label: Solarenergie - reguliert @de
label: Солнечная энергия - регулируемая @ru
label: 太阳能-管制 @zh
label: 太陽光発電-規制 @ja
label: 太陽能-管制 @zh-hant
label: 태양에너지 - 규제 @ko
definition: This segment includes companies that operate under regulated revenue arrangements to generate electricity from solar resources.
notation: 20101011121010
valid from: 2024-06-07

Solar Energy - Deregulated
type: BicsLevel7Segment
type: Classifier
type: NamedIndividual
is level7 segment of: Solar Energy Generation
is contemporary version of: http://data.ga-group.nl/ics/bics/20101011121011
is version of: http://data.ga-group.nl/ics/bics/20101011121011
replaces: http://data.ga-group.nl/ics/bics/2020/20101011121011
imported on: 2026-06-08T13:40:52.236Z
last refreshed on: 2026-06-08T13:41:38.450Z
source accessed on: 2024-06-05T14:42:36Z
source last accessed on: 2024-06-05T14:42:36Z
label: Energía solar - desregulada @es
label: Energia solar - desregulamentada @pt
label: Energia solare - Deregolamentata @it
label: Energie solaire - Déréglementée @fr
label: Solarenergie - dereguliert @de
label: Солнечная энергия - нерегулируемый рынок @ru
label: 太阳能 - 解除管制 @zh
label: 太陽能-解除管制 @zh-hant
label: 太陽ｴﾈﾙｷﾞｰ-規制外 @ja
label: 태양 에너지 - 비규제 @ko
definition: This segment includes companies that operate under deregulated revenue arrangements to generate electricity from solar resources.
notation: 20101011121011
valid from: 2024-06-07

Solar Energy Generation
type: BicsLevel6Segment
type: Classifier
type: NamedIndividual
is level6 segment of: Renewable Energy Generation
is contemporary version of: http://data.ga-group.nl/ics/bics/201010111210
is version of: http://data.ga-group.nl/ics/bics/201010111210
replaces: http://data.ga-group.nl/ics/bics/2020/201010111210
imported on: 2026-06-08T13:40:52.236Z
last refreshed on: 2026-06-08T13:41:38.450Z
source accessed on: 2024-06-05T14:42:36Z
source last accessed on: 2024-06-05T14:42:36Z
label: Generación de energía solar @es
label: Generazione energia solare @it
label: Geração de energia solar @pt
label: Prod d'énergie solaire @fr
label: Solare Stromerzeugung @de
label: Генерация солнечной энергии @ru
label: 太阳能发电 @zh
label: 太陽光発電 @ja
label: 太陽能發電 @zh-hant
label: 태양열 에너지 발전 @ko
definition: This segment includes companies that generate electricity from solar energy resources.
notation: 201010111210
valid from: 2024-06-07

Wind Energy - Regulated
type: BicsLevel7Segment
type: Classifier
type: NamedIndividual
is level7 segment of: Wind Energy Generation
is contemporary version of: http://data.ga-group.nl/ics/bics/20101011121110
is version of: http://data.ga-group.nl/ics/bics/20101011121110
replaces: http://data.ga-group.nl/ics/bics/2020/20101011121110
imported on: 2026-06-08T13:40:52.236Z
last refreshed on: 2026-06-08T13:41:38.450Z
source accessed on: 2024-06-05T14:42:36Z
source last accessed on: 2024-06-05T14:42:36Z
label: Energía eólica - regulada @es
label: Energia eólica - Regulamentada @pt
label: Energia eolica - Regolamentata @it
label: Energie éolienne - Réglementée @fr
label: Windenergie - reguliert @de
label: Ветровая энергия - регулируемая @ru
label: 風力発電-規制 @ja
label: 風能-管制 @zh-hant
label: 风能-管制 @zh
label: 풍력에너지 - 규제 @ko
definition: This segment includes companies that operate under regulated revenue arrangements to generate electricity from wind power.
notation: 20101011121110
valid from: 2024-06-07

Wind Energy - Deregulated
type: BicsLevel7Segment
type: Classifier
type: NamedIndividual
is level7 segment of: Wind Energy Generation
is contemporary version of: http://data.ga-group.nl/ics/bics/20101011121111
is version of: http://data.ga-group.nl/ics/bics/20101011121111
replaces: http://data.ga-group.nl/ics/bics/2020/20101011121111
imported on: 2026-06-08T13:40:52.236Z
last refreshed on: 2026-06-08T13:41:38.450Z
source accessed on: 2024-06-05T14:42:36Z
source last accessed on: 2024-06-05T14:42:36Z
label: Energía eólica - desregulada @es
label: Energia eólica - desregulamentada @pt
label: Energia eolica - Deregolamentata @it
label: Energie éolienne - Déréglementée @fr
label: Windenergie - dereguliert @de
label: Ветровая электроэнергия - нерегулируемый рынок @ru
label: 風力ｴﾈﾙｷﾞｰ-規制外 @ja
label: 風能-解除管制 @zh-hant
label: 风能能源 - 解除管制 @zh
label: 풍력 에너지 - 비규제 @ko
definition: This segment includes companies that operate under deregulated revenue arrangements to generate electricity from wind power.
notation: 20101011121111
valid from: 2024-06-07

Wind Energy Generation
type: BicsLevel6Segment
type: Classifier
type: NamedIndividual
is level6 segment of: Renewable Energy Generation
is contemporary version of: http://data.ga-group.nl/ics/bics/201010111211
is version of: http://data.ga-group.nl/ics/bics/201010111211
replaces: http://data.ga-group.nl/ics/bics/2020/201010111211
imported on: 2026-06-08T13:40:52.236Z
last refreshed on: 2026-06-08T13:41:38.450Z
source accessed on: 2024-06-05T14:42:36Z
source last accessed on: 2024-06-05T14:42:36Z
label: Generación de energía eólica @es
label: Generazione energia eolica @it
label: Geração de energia eólica @pt
label: Prod d'énergie éolienne @fr
label: Windenergieerzeugung @de
label: Энергия ветра @ru
label: 風力発電 @ja
label: 風力能源發電 @zh-hant
label: 风能发电 @zh
label: 풍력 에너지 발전 @ko
definition: This segment includes companies that generate electricity from wind resources.
notation: 201010111211
valid from: 2024-06-07

Geothermal - Regulated
type: BicsLevel7Segment
type: Classifier
type: NamedIndividual
is level7 segment of: Geothermal Energy Generation
is contemporary version of: http://data.ga-group.nl/ics/bics/20101011121210
is version of: http://data.ga-group.nl/ics/bics/20101011121210
replaces: http://data.ga-group.nl/ics/bics/2020/20101011121210
imported on: 2026-06-08T13:40:52.236Z
last refreshed on: 2026-06-08T13:41:38.450Z
source accessed on: 2024-06-05T14:42:36Z
source last accessed on: 2024-06-05T14:42:36Z
label: Géothermie - réglementée @fr
label: Geotérmico - regulamentado @pt
label: Geotermal - Regulada @es
label: Geotermico - regolato @it
label: Geothermisch - reguliert @de
label: Геотермальная энергия - рег. @ru
label: 地热能-管制 @zh
label: 地熱-管制 @zh-hant
label: 地熱発電-規制 @ja
label: 지열 - 규제 @ko
definition: This segment includes companies that operate under regulated revenue arrangements to generate electricity from geothermal heat.
notation: 20101011121210
valid from: 2024-06-07

Geothermal - Deregulated
type: BicsLevel7Segment
type: Classifier
type: NamedIndividual
is level7 segment of: Geothermal Energy Generation
is contemporary version of: http://data.ga-group.nl/ics/bics/20101011121211
is version of: http://data.ga-group.nl/ics/bics/20101011121211
replaces: http://data.ga-group.nl/ics/bics/2020/20101011121211
imported on: 2026-06-08T13:40:52.236Z
last refreshed on: 2026-06-08T13:41:38.450Z
source accessed on: 2024-06-05T14:42:36Z
source last accessed on: 2024-06-05T14:42:36Z
label: Energía geotérmica - desregulada @es
label: Energie géothermique - Déréglementée @fr
label: Geotérmica - desregulamentada @pt
label: Geotermia - Deregolamentata @it
label: Geothermisch - dereguliert @de
label: Геотермальная энергия - нерегулируемый рынок @ru
label: Геотермальная энергия - не��егулируемый рынок @ru
label: 地热能源 - 解除管制 @zh
label: 地熱-解除管制 @zh-hant
label: 地熱発電-規制外 @ja
label: 지열 - 비규제 @ko
definition: This segment includes companies that operate under deregulated revenue arrangements to generate electricity from geothermal heat.
notation: 20101011121211
valid from: 2024-06-07

Geothermal Energy Generation
type: BicsLevel6Segment
type: Classifier
type: NamedIndividual
is level6 segment of: Renewable Energy Generation
is contemporary version of: http://data.ga-group.nl/ics/bics/201010111212
is version of: http://data.ga-group.nl/ics/bics/201010111212
replaces: http://data.ga-group.nl/ics/bics/2020/201010111212
imported on: 2026-06-08T13:40:52.236Z
last refreshed on: 2026-06-08T13:41:38.450Z
source accessed on: 2024-06-05T14:42:36Z
source last accessed on: 2024-06-05T14:42:36Z
label: Generación de energía geotermal @es
label: Generazione energia termica @it
label: Geothermische Energiegewinnung @de
label: Geração de energia geotérmica @pt
label: Prod d'énergie géothermique @fr
label: Генерация геотермальной энергии @ru
label: 地热能发电 @zh
label: 地熱発電 @ja
label: 地熱能源發電 @zh-hant
label: 지열 에너지 발전 @ko
definition: This segment includes companies that generate electricity where the heat source to drive steam generators comes from geothermal resources.
notation: 201010111212
valid from: 2024-06-07

Hydropower Energy - Regulated
type: BicsLevel7Segment
type: Classifier
type: NamedIndividual
is level7 segment of: Hydropower Generation
is contemporary version of: http://data.ga-group.nl/ics/bics/20101011121310
is version of: http://data.ga-group.nl/ics/bics/20101011121310
replaces: http://data.ga-group.nl/ics/bics/2020/20101011121310
imported on: 2026-06-08T13:40:52.236Z
last refreshed on: 2026-06-08T13:41:38.450Z
source accessed on: 2024-06-05T14:42:36Z
source last accessed on: 2024-06-05T14:42:36Z
label: Energia hidrelétrica - Regulamentada @pt
label: Energia idroelettrica -Regolam @it
label: Energie hydraulique - rég. @fr
label: Hidroeléctrica - regulada @es
label: Wasserkraftstrom - reguliert @de
label: Гидроэнергия - регулир. @ru
label: 水力発電-規制 @ja
label: 水力發電能源-管制 @zh-hant
label: 水电能源-管制 @zh
label: 수력 에너지 - 규제 @ko
definition: This segment includes companies that operate under regulated revenue arrangements to generate electricity from the flow of water.
notation: 20101011121310
valid from: 2024-06-07

Hydropower Energy - Deregulated
type: BicsLevel7Segment
type: Classifier
type: NamedIndividual
is level7 segment of: Hydropower Generation
is contemporary version of: http://data.ga-group.nl/ics/bics/20101011121311
is version of: http://data.ga-group.nl/ics/bics/20101011121311
replaces: http://data.ga-group.nl/ics/bics/2020/20101011121311
imported on: 2026-06-08T13:40:52.236Z
last refreshed on: 2026-06-08T13:41:38.450Z
source accessed on: 2024-06-05T14:42:36Z
source last accessed on: 2024-06-05T14:42:36Z
label: Energía hidráulica - desregulada @es
label: Energia hidrelétrica - desregulamentada @pt
label: Energia idroelettrica - Deregolamentata @it
label: Energie hydraulique - Déréglementée @fr
label: Wasserkraftstrom - dereguliert @de
label: Гидроэнергия - нерегулируемый рынок @ru
label: 水力発電-規制外 @ja
label: 水力發電能源-解除管制 @zh-hant
label: 水电能源 - 解除管制 @zh
label: 수력 에너지 - 비규제 @ko
definition: This segment includes companies that operate under deregulated revenue arrangements to generate electricity from the flow of water.
notation: 20101011121311
valid from: 2024-06-07

Hydropower Generation
type: BicsLevel6Segment
type: Classifier
type: NamedIndividual
is level6 segment of: Renewable Energy Generation
is contemporary version of: http://data.ga-group.nl/ics/bics/201010111213
is version of: http://data.ga-group.nl/ics/bics/201010111213
replaces: http://data.ga-group.nl/ics/bics/2020/201010111213
imported on: 2026-06-08T13:40:52.236Z
last refreshed on: 2026-06-08T13:41:38.450Z
source accessed on: 2024-06-05T14:42:36Z
source last accessed on: 2024-06-05T14:42:36Z
label: Generación hidroeléctrica @es
label: Generazione energia idroelettrica @it
label: Geração de energia hidráulica @pt
label: Prod d'énergie hydraulique @fr
label: Wasserkraftstromerzeugung @de
label: Гидроэнергетика @ru
label: 水力发电 @zh
label: 水力発電 @ja
label: 水力發電 @zh-hant
label: 수력 발전 @ko
definition: This segment includes companies that generate energy from falling or running water.
notation: 201010111213
valid from: 2024-06-07

Marine Energy - Regulated
type: BicsLevel7Segment
type: Classifier
type: NamedIndividual
is level7 segment of: Marine Energy Generation
is contemporary version of: http://data.ga-group.nl/ics/bics/20101011121410
is version of: http://data.ga-group.nl/ics/bics/20101011121410
replaces: http://data.ga-group.nl/ics/bics/2020/20101011121410
imported on: 2026-06-08T13:40:52.236Z
last refreshed on: 2026-06-08T13:41:38.450Z
source accessed on: 2024-06-05T14:42:36Z
source last accessed on: 2024-06-05T14:42:36Z
label: Energía marina - regulada @es
label: Energia marítimo - Regulamentada @pt
label: Energia marina - Regolamentata @it
label: Energie maritime -Réglementée @fr
label: Maritime Energie - reguliert @de
label: Морская энергия - регулируемая @ru
label: 海洋-管制 @zh-hant
label: 海洋発電-規制 @ja
label: 海洋能源-管制 @zh
label: 해양에너지 - 규제 @ko
definition: This segment includes companies that operate under regulated revenue arrangements to generate electricity from marine water flows using tidal and wave-based technologies.
notation: 20101011121410
valid from: 2024-06-07

Marine Energy - Deregulated
type: BicsLevel7Segment
type: Classifier
type: NamedIndividual
is level7 segment of: Marine Energy Generation
is contemporary version of: http://data.ga-group.nl/ics/bics/20101011121411
is version of: http://data.ga-group.nl/ics/bics/20101011121411
replaces: http://data.ga-group.nl/ics/bics/2020/20101011121411
imported on: 2026-06-08T13:40:52.236Z
last refreshed on: 2026-06-08T13:41:38.450Z
source accessed on: 2024-06-05T14:42:36Z
source last accessed on: 2024-06-05T14:42:36Z
label: Energía marina - desregulada @es
label: Energia marina - Deregolamentata @it
label: Energia marinha - desregulamentada @pt
label: Energie marine - Déréglementée @fr
label: Maritime Energie - dereguliert @de
label: Морская энергия - нерегулируемый рынок @ru
label: 海洋能源 - 解除管制 @zh
label: 海洋能源-解除管制 @zh-hant
label: 海洋ｴﾈﾙｷﾞｰ-規制外 @ja
label: 해양 에너지 - 비규제 @ko
definition: This segment includes companies that operate under deregulated revenue arrangements to generate electricity from marine water flows using tidal and wave-based technologies.
notation: 20101011121411
valid from: 2024-06-07

Marine Energy Generation
type: BicsLevel6Segment
type: Classifier
type: NamedIndividual
is level6 segment of: Renewable Energy Generation
is contemporary version of: http://data.ga-group.nl/ics/bics/201010111214
is version of: http://data.ga-group.nl/ics/bics/201010111214
replaces: http://data.ga-group.nl/ics/bics/2020/201010111214
imported on: 2026-06-08T13:40:52.236Z
last refreshed on: 2026-06-08T13:41:38.450Z
source accessed on: 2024-06-05T14:42:36Z
source last accessed on: 2024-06-05T14:42:36Z
label: Generación de energía marina @es
label: Generazione energia marina @it
label: Geração de energia marítima @pt
label: Meeresenergiegewinnung @de
label: Prod d'énergie marine @fr
label: Морская энергия @ru
label: 海洋発電 @ja
label: 海洋能源发电 @zh
label: 海洋能源發電 @zh-hant
label: 해양 에너지 발전 @ko
label: ���洋能源發電 @zh-hant
definition: This segment includes companies that generate energy from the kinetic motions of waves and tides. Energy can also be generated from temperature and salinity differences.
notation: 201010111214
valid from: 2024-06-07

Biomass & Waste - Regulated
type: BicsLevel7Segment
type: Classifier
type: NamedIndividual
is level7 segment of: Biomass & Waste Energy Gen
is contemporary version of: http://data.ga-group.nl/ics/bics/20101011121510
is version of: http://data.ga-group.nl/ics/bics/20101011121510
replaces: http://data.ga-group.nl/ics/bics/2020/20101011121510
imported on: 2026-06-08T13:40:52.236Z
last refreshed on: 2026-06-08T13:41:38.450Z
source accessed on: 2024-06-05T14:42:36Z
source last accessed on: 2024-06-05T14:42:36Z
label: Biomasa y desechos - Regulados @es
label: Biomassa e desperdícios - regulamentado @pt
label: Biomassa e rifiuti - regolata @it
label: Biomasse & Abfall - reguliert @de
label: Biomasse et déchets - Réglementé @fr
label: Биомассы и отходы - Регулируемые @ru
label: 生物质能及废弃物 - 管制 @zh
label: 生質能及廢棄物-管制 @zh-hant
label: 바이오매스 & 폐기물 - 규제 @ko
label: ﾊﾞｲｵﾏｽ･廃棄物発電-規制 @ja
definition: This segment includes companies that operate under regulated revenue arrangements to generate electricity from biomass or industrial/residential waste resources.
notation: 20101011121510
valid from: 2024-06-07

Biomass & Waste - Deregulated
type: BicsLevel7Segment
type: Classifier
type: NamedIndividual
is level7 segment of: Biomass & Waste Energy Gen
is contemporary version of: http://data.ga-group.nl/ics/bics/20101011121511
is version of: http://data.ga-group.nl/ics/bics/20101011121511
replaces: http://data.ga-group.nl/ics/bics/2020/20101011121511
imported on: 2026-06-08T13:40:52.236Z
last refreshed on: 2026-06-08T13:41:38.450Z
source accessed on: 2024-06-05T14:42:36Z
source last accessed on: 2024-06-05T14:42:36Z
label: Biomasa y desechos - desregulada @es
label: Biomassa e resíduos - desregulamentada @pt
label: Biomasse & Abfall - dereguliert @de
label: Biomasse e rifiuti - Deregolamentato @it
label: Biomasse et déchets - Déréglementé @fr
label: Биомасса и отходы - нерегулируемый рынок @ru
label: 生物质和废物处理 - 解除管制 @zh
label: 生質能及廢棄物-解除管制 @zh-hant
label: 바이오매스 & 폐기물 - 비규제 @ko
label: ﾊﾞｲｵﾏｽ･廃棄物-規制外 @ja
definition: This segment includes companies that operate under deregulated revenue arrangements to generate electricity from biomass or industrial/residential waste resources.
notation: 20101011121511
valid from: 2024-06-07

Biomass & Waste Energy Gen
type: BicsLevel6Segment
type: Classifier
type: NamedIndividual
is level6 segment of: Renewable Energy Generation
is contemporary version of: http://data.ga-group.nl/ics/bics/201010111215
is version of: http://data.ga-group.nl/ics/bics/201010111215
replaces: http://data.ga-group.nl/ics/bics/2020/201010111215
imported on: 2026-06-08T13:40:52.236Z
last refreshed on: 2026-06-08T13:41:38.450Z
source accessed on: 2024-06-05T14:42:36Z
source last accessed on: 2024-06-05T14:42:36Z
label: Biomasse- & Abfallenergieerzeugung @de
label: Gen energia biomassa e rifiuti @it
label: Generación de energía de biomasa y desechos @es
label: Geração de energia de biomassa e resíduos @pt
label: Prod d'énergie de biomasse/déchets @fr
label: Энергия биомасс и отходов @ru
label: 生物质能与废弃物能源发电 @zh
label: 生質與廢棄物發電 @zh-hant
label: 生質與廢棄物���電 @zh-hant
label: 바이오매스 & 폐기물 에너지 발전 @ko
label: ﾊﾞｲｵﾏｽ･廃棄物発電 @ja
definition: This segment includes companies that generate electricity from biomass or industrial/residential waste resources.
notation: 201010111215
valid from: 2024-06-07

Renewable Energy Generation
type: BicsLevel5Segment
type: Classifier
type: NamedIndividual
is level5 segment of: Power Generation
is contemporary version of: http://data.ga-group.nl/ics/bics/2010101112
is version of: http://data.ga-group.nl/ics/bics/2010101112
replaces: http://data.ga-group.nl/ics/bics/2020/2010101112
imported on: 2026-06-08T13:40:52.236Z
last refreshed on: 2026-06-08T13:41:38.450Z
source accessed on: 2024-06-05T14:42:36Z
source last accessed on: 2024-06-05T14:42:36Z
label: Generación de energía renovable @es
label: Generazione energia rinnovabile @it
label: Geração de energia renovável @pt
label: Prod d'énergie srces renouvelables @fr
label: Stromerzeugung aus erneuerbarer Energie @de
label: Возобновляемая энергия @ru
label: 再生可能ｴﾈﾙｷﾞｰ発電 @ja
label: 再生能源發電 @zh-hant
label: 可再生能源发电 @zh
label: 신재생 에너지 발전 @ko
definition: This segment includes companies that operate under regulated revenue arrangements to generate electricity from renewable resources.
notation: 2010101112
valid from: 2024-06-07

Thermal Energy Storage
type: BicsLevel6Segment
type: Classifier
type: NamedIndividual
is level6 segment of: Power Storage
is contemporary version of: http://data.ga-group.nl/ics/bics/201010111310
is version of: http://data.ga-group.nl/ics/bics/201010111310
replaces: http://data.ga-group.nl/ics/bics/2020/201010111310
imported on: 2026-06-08T13:40:52.236Z
last refreshed on: 2026-06-08T13:41:38.450Z
source accessed on: 2024-06-05T14:42:36Z
source last accessed on: 2024-06-05T14:42:36Z
label: Almacenamiento de energía térmica @es
label: Armazenamento de energia térmica @pt
label: Immagazzinamento di energia termica @it
label: Speicherung von thermischer Energie @de
label: Stockage d'énergie thermique @fr
label: Хранение тепловой энергии @ru
label: 热能储存 @zh
label: 熱能儲存 @zh-hant
label: 熱ｴﾈﾙｷﾞｰ貯蔵 @ja
label: 열 에너지 저장 @ko
definition: This segment includes companies that operates facilities that store thermal energy and return it at a later time in the form of thermal energy or other energy vectors.
notation: 201010111310
valid from: 2024-06-07

Power Storage
type: BicsLevel5Segment
type: Classifier
type: NamedIndividual
is level5 segment of: Power Generation
is contemporary version of: http://data.ga-group.nl/ics/bics/2010101113
is version of: http://data.ga-group.nl/ics/bics/2010101113
replaces: http://data.ga-group.nl/ics/bics/2020/2010101113
imported on: 2026-06-08T13:40:52.236Z
last refreshed on: 2026-06-08T13:41:38.450Z
source accessed on: 2024-06-05T14:42:36Z
source last accessed on: 2024-06-05T14:42:36Z
label: Accumulo energia @it
label: Almacenamiento de electricidad @es
label: Armazenagem de energia @pt
label: Stockage d'électricité @fr
label: Stromspeicher @de
label: Хранение электроэнергии @ru
label: 电力储存 @zh
label: 蓄電 @zh-hant
label: 電力貯蔵 @ja
label: 에너지 저장 @ko
definition: This segment includes companies that store energy via large industrial battery systems, compressed air systems, gravitational potential energy systems, thermal storage systems, or other emergent technologies which store and release energy when needed.
notation: 2010101113
valid from: 2024-06-07

Power Generation
type: BicsLevel4SubIndustry
type: Classifier
type: NamedIndividual
is sub industry of: Electric Utilities
is contemporary version of: http://data.ga-group.nl/ics/bics/20101011
is version of: http://data.ga-group.nl/ics/bics/20101011
replaces: http://data.ga-group.nl/ics/bics/2020/20101011
imported on: 2026-06-08T13:40:52.236Z
last refreshed on: 2026-06-08T13:41:38.450Z
source accessed on: 2024-06-05T14:42:36Z
source last accessed on: 2024-06-05T14:42:36Z
label: Generación eléctrica @es
label: Geração de energia @pt
label: Prod électrique @fr
label: Prod energia elett @it
label: Stromerzeugung @de
label: Выработка электроэн. @ru
label: 电力生产 @zh
label: 発電所 @ja
label: 發電業 @zh-hant
label: 전력 발전업 @ko
definition: This industry subgroup includes companies that generate electricity from centralized power plants.
notation: 20101011
valid from: 2024-06-07

Electric Transmission
type: BicsLevel5Segment
type: Classifier
type: NamedIndividual
is level5 segment of: Electric Transmission & Dist
is contemporary version of: http://data.ga-group.nl/ics/bics/2010101210
is version of: http://data.ga-group.nl/ics/bics/2010101210
replaces: http://data.ga-group.nl/ics/bics/2020/2010101210
imported on: 2026-06-08T13:40:52.236Z
last refreshed on: 2026-06-08T13:41:38.450Z
source accessed on: 2024-06-05T14:42:36Z
source last accessed on: 2024-06-05T14:42:36Z
label: Stromübertragung @de
label: Transmisión eléctrica @es
label: Transmissão elétrica @pt
label: Transmission d'électricité @fr
label: Trasmissione elettrica @it
label: Передача электроэнергии @ru
label: 电力输送 @zh
label: 送電 @ja
label: 電力傳輸 @zh-hant
label: 송전 @ko
definition: This segment includes companies that own and operate mid- and high-voltage regulated electricity networks that span wide areas.
notation: 2010101210
valid from: 2024-06-07

Electric Distribution
type: BicsLevel5Segment
type: Classifier
type: NamedIndividual
is level5 segment of: Electric Transmission & Dist
is contemporary version of: http://data.ga-group.nl/ics/bics/2010101211
is version of: http://data.ga-group.nl/ics/bics/2010101211
replaces: http://data.ga-group.nl/ics/bics/2020/2010101211
imported on: 2026-06-08T13:40:52.236Z
last refreshed on: 2026-06-08T13:41:38.450Z
source accessed on: 2024-06-05T14:42:36Z
source last accessed on: 2024-06-05T14:42:36Z
label: Distribución eléctrica @es
label: Distribuição elétrica @pt
label: Distribution d'électricité @fr
label: Distribuzione elettrica @it
label: Stromverteilung @de
label: Распределение электроэнергии @ru
label: 电力配送 @zh
label: 配電 @ja
label: 배전 @ko
definition: This segment includes companies that own and operate low-voltage regulated electricity networks that span local areas.
notation: 2010101211
valid from: 2024-06-07

Electric Transmission & Dist
type: BicsLevel4SubIndustry
type: Classifier
type: NamedIndividual
is sub industry of: Electric Utilities
is contemporary version of: http://data.ga-group.nl/ics/bics/20101012
is version of: http://data.ga-group.nl/ics/bics/20101012
replaces: http://data.ga-group.nl/ics/bics/2020/20101012
imported on: 2026-06-08T13:40:52.236Z
last refreshed on: 2026-06-08T13:41:38.450Z
source accessed on: 2024-06-05T14:42:36Z
source last accessed on: 2024-06-05T14:42:36Z
label: Stromübertragung & -verteilung @de
label: Transmisión y dist eléctrica @es
label: Transmissão e dist elétrica @pt
label: Transmission/distrib d'élec @fr
label: Trasmissione e dist elettrica @it
label: Передача и распред. электроэнергии @ru
label: 电力输送与配送 @zh
label: 送電･配電 @ja
label: 電力網 @zh-hant
label: 송전 및 배전 @ko
definition: This industry subgroup includes companies that own and operate regulated electric transmission and/or distribution assets.
notation: 20101012
valid from: 2024-06-07

District Heating & Cooling
type: BicsLevel4SubIndustry
type: Classifier
type: NamedIndividual
is sub industry of: Electric Utilities
is contemporary version of: http://data.ga-group.nl/ics/bics/20101013
is version of: http://data.ga-group.nl/ics/bics/20101013
replaces: http://data.ga-group.nl/ics/bics/2020/20101013
imported on: 2026-06-08T13:40:52.236Z
last refreshed on: 2026-06-08T13:41:38.450Z
source accessed on: 2024-06-05T14:42:36Z
source last accessed on: 2024-06-05T14:42:36Z
label: Aquecimento e refrigeração de distrito @pt
label: Calefacción y aire acondicionado de Distrito @es
label: Conditionnement air @fr
label: Fernwärme & -kälte @de
label: Riscald distr e aria cond @it
label: Район. отопл. и кондиц. @ru
label: 区域供热和制冷 @zh
label: 地區增熱及冷卻度日 @zh-hant
label: 地域冷暖房 @ja
label: 지역 난방 & 냉방 @ko
definition: This industry subgroup includes companies that operate regulated district heating and cooling networks on both the municipal and industrial park level.
notation: 20101013
valid from: 2024-06-07

Electric Utilities
type: BicsLevel3Industry
type: Classifier
type: NamedIndividual
is industry of: Utilities
is contemporary version of: http://data.ga-group.nl/ics/bics/201010
is version of: http://data.ga-group.nl/ics/bics/201010
replaces: http://data.ga-group.nl/ics/bics/2020/201010
imported on: 2026-06-08T13:40:52.236Z
last refreshed on: 2026-06-08T13:41:38.450Z
source accessed on: 2024-06-05T14:42:36Z
source last accessed on: 2024-06-05T14:42:36Z
label: Serv coll élect @fr
label: Servicios públicos electrícos @es
label: Servizi energia elettrica @it
label: Stromversorgung @de
label: Utilidades públicas Eletricidade @pt
label: Электроснабжение @ru
label: 电力公用事业 @zh
label: 電力公用事業 @zh-hant
label: 電力公益事業 @ja
label: 전기유틸리티 @ko
definition: This industry includes companies that generate, distribute, or market electricity to wholesale and/or end consumers.
notation: 201010
valid from: 2024-06-07

Natural Gas Transmission
type: BicsLevel6Segment
type: Classifier
type: NamedIndividual
is level6 segment of: Gas Transmission & Storage
is contemporary version of: http://data.ga-group.nl/ics/bics/201011101010
is version of: http://data.ga-group.nl/ics/bics/201011101010
replaces: http://data.ga-group.nl/ics/bics/2020/201011101010
imported on: 2026-06-08T13:40:52.236Z
last refreshed on: 2026-06-08T13:41:38.450Z
source accessed on: 2024-06-05T14:42:36Z
source last accessed on: 2024-06-05T14:42:36Z
label: Erdgasübertragung @de
label: Transmisión de gas natural @es
label: Transmissão de gás natural @pt
label: Transmission de gaz naturel @fr
label: Trasmissione gas naturale @it
label: Передача природного газа @ru
label: 天然气输送 @zh
label: 天然ｶﾞｽ輸送 @ja
label: 管線營運 @zh-hant
label: 천연가스 수송 @ko
definition: This segment includes operation and maintenance of natural gas transmission networks. Includes both merchant and regulated revenue arrangements.
notation: 201011101010
valid from: 2024-06-07

Natural Gas Storage
type: BicsLevel6Segment
type: Classifier
type: NamedIndividual
is level6 segment of: Gas Transmission & Storage
is contemporary version of: http://data.ga-group.nl/ics/bics/201011101011
is version of: http://data.ga-group.nl/ics/bics/201011101011
replaces: http://data.ga-group.nl/ics/bics/2020/201011101011
imported on: 2026-06-08T13:40:52.236Z
last refreshed on: 2026-06-08T13:41:38.450Z
source accessed on: 2024-06-05T14:42:36Z
source last accessed on: 2024-06-05T14:42:36Z
label: Almacenamiento de gas natural @es
label: Armazém de gás natural @pt
label: Erdgaslager @de
label: Immagazz gas naturale @it
label: Stockage du gaz naturel @fr
label: Хранение природного газа @ru
label: 天然气库存 @zh
label: 天然氣儲存 @zh-hant
label: 天然ｶﾞｽ貯蔵 @ja
label: 천연가스 저장 @ko
definition: This segment includes natural gas storage facilities connected to transmission networks, such as storage facilities in saline caverns or depleted oil fields. Includes both merchant and regulated revenue arrangements.
notation: 201011101011
valid from: 2024-06-07

Hydrogen Transmission & Storage
type: BicsLevel6Segment
type: Classifier
type: NamedIndividual
is level6 segment of: Gas Transmission & Storage
is contemporary version of: http://data.ga-group.nl/ics/bics/201011101012
is version of: http://data.ga-group.nl/ics/bics/201011101012
replaces: http://data.ga-group.nl/ics/bics/2020/201011101012
imported on: 2026-06-08T13:40:52.236Z
last refreshed on: 2026-06-08T13:41:38.450Z
source accessed on: 2024-06-05T14:42:36Z
source last accessed on: 2024-06-05T14:42:36Z
label: Transmisión y almacenamiento de hidrógeno @es
label: Transmissão e armazenamento hidrogênio @pt
label: Transport & Speicherung von Wasserstoff @de
label: Transport et stockage d'hydrogène @fr
label: Trasporto e immagazzinamento di idrogeno @it
label: Передача и хранение водорода @ru
label: 氢传输与储存 @zh
label: 氫氣傳輸及儲存 @zh-hant
label: 水素送出･貯蔵 @ja
label: 수소 수송 & 저장 @ko
definition: This segment includes companies that operate hydrogen transmission and storage networks used for power generation, fuel-cell recharging, or other energy related purposes.
notation: 201011101012
valid from: 2024-06-07

CO2 Transmission & Storage
type: BicsLevel6Segment
type: Classifier
type: NamedIndividual
is level6 segment of: Gas Transmission & Storage
is contemporary version of: http://data.ga-group.nl/ics/bics/201011101013
is version of: http://data.ga-group.nl/ics/bics/201011101013
replaces: http://data.ga-group.nl/ics/bics/2020/201011101013
imported on: 2026-06-08T13:40:52.236Z
last refreshed on: 2026-06-08T13:41:38.450Z
source accessed on: 2024-06-05T14:42:36Z
source last accessed on: 2024-06-05T14:42:36Z
label: Transmisión y almacenamiento de CO2 @es
label: Transmissão e armazenamento CO2 @pt
label: Transport & Speicherung von CO2 @de
label: Transport et stockage de CO2 @fr
label: Trasporto e immagazzinamento di CO2 @it
label: Передача и хранение CO2 @ru
label: 二氧化碳传输与储存 @zh
label: 二氧化碳傳輸及儲存 @zh-hant
label: 二酸化炭素送出･貯蔵 @ja
label: 이산화탄소 수송 & 저장 @ko
label: ��酸化炭素送出･貯蔵 @ja
definition: This segment includes companies that operate carbon dioxide (CO₂) pipelines and storage, the main purpose of which is the isolation of CO₂ from the atmosphere.
notation: 201011101013
valid from: 2024-06-07

Gas Transmission & Storage
type: BicsLevel5Segment
type: Classifier
type: NamedIndividual
is level5 segment of: Gas Utilities
is contemporary version of: http://data.ga-group.nl/ics/bics/2010111010
is version of: http://data.ga-group.nl/ics/bics/2010111010
replaces: http://data.ga-group.nl/ics/bics/2020/2010111010
imported on: 2026-06-08T13:40:52.236Z
last refreshed on: 2026-06-08T13:41:38.450Z
source accessed on: 2024-06-05T14:42:36Z
source last accessed on: 2024-06-05T14:42:36Z
label: Armazenagem e transmissão de gás @pt
label: Transmisión y almacenamiento de gas @es
label: Transport et stockage de gaz @fr
label: Trasmiss gas e immagazz @it
label: Übertragung & Lagerung von Erdgas @de
label: Передача и хранение газа @ru
label: 天然氣傳輸及儲存 @zh-hant
label: 燃气传输与储存 @zh
label: 가스 수송 & 저장 @ko
label: ｶﾞｽ送出･貯蔵 @ja
definition: This segment includes companies that operate natural gas transmission and storage networks that operate at high pressure or are national networks. It includes both regulated and merchant revenue streams and also transmission of other related gases for energy purposes.
notation: 2010111010
valid from: 2024-06-07

Propane Gas Distributors
type: BicsLevel6Segment
type: Classifier
type: NamedIndividual
is level6 segment of: Gas Distribution
is contemporary version of: http://data.ga-group.nl/ics/bics/201011101110
is version of: http://data.ga-group.nl/ics/bics/201011101110
replaces: http://data.ga-group.nl/ics/bics/2020/201011101110
imported on: 2026-06-08T13:40:52.236Z
last refreshed on: 2026-06-08T13:41:38.450Z
source accessed on: 2024-06-05T14:42:36Z
source last accessed on: 2024-06-05T14:42:36Z
label: Distr gas propano @es
label: Distrib de gás propano @pt
label: Distrib gaz propane @fr
label: Distrib propano @it
label: Propangasverteilung @de
label: Доставка пропана @ru
label: 丙烷气体配售 @zh
label: 丙烷氣配送 @zh-hant
label: 프로판가스 공급 @ko
label: ﾌﾟﾛﾊﾟﾝｶﾞｽ配給 @ja
definition: This segment includes companies that retail propane or liquid petroleum gas (LPG) through distribution networks that distribute gas in portable tanks and/or via tanker trucks. These enterprises operate in competitive, unregulated markets.
notation: 201011101110
valid from: 2024-06-07

Natural Gas Distributors
type: BicsLevel6Segment
type: Classifier
type: NamedIndividual
is level6 segment of: Gas Distribution
is contemporary version of: http://data.ga-group.nl/ics/bics/201011101111
is version of: http://data.ga-group.nl/ics/bics/201011101111
replaces: http://data.ga-group.nl/ics/bics/2020/201011101111
imported on: 2026-06-08T13:40:52.236Z
last refreshed on: 2026-06-08T13:41:38.450Z
source accessed on: 2024-06-05T14:42:36Z
source last accessed on: 2024-06-05T14:42:36Z
label: Distr gas natural @es
label: Distrib de gás natural @pt
label: Distrib gas naturale @it
label: Distrib gaz naturel @fr
label: Erdgasverteilung @de
label: Распределение прир. газа @ru
label: 天然气配售 @zh
label: 天然氣配送 @zh-hant
label: 天然ｶﾞｽ供給所 @ja
label: 천연가스 배관공급 @ko
definition: This segment includes natural gas distribution networks that operate at low pressure / local area networks sending out methane. Revenues are normally regulated by an independent (elected) or politically appointed regulatory body.
notation: 201011101111
valid from: 2024-06-07

Gas Distribution
type: BicsLevel5Segment
type: Classifier
type: NamedIndividual
is level5 segment of: Gas Utilities
is contemporary version of: http://data.ga-group.nl/ics/bics/2010111011
is version of: http://data.ga-group.nl/ics/bics/2010111011
replaces: http://data.ga-group.nl/ics/bics/2020/2010111011
imported on: 2026-06-08T13:40:52.236Z
last refreshed on: 2026-06-08T13:41:38.450Z
source accessed on: 2024-06-05T14:42:36Z
source last accessed on: 2024-06-05T14:42:36Z
label: Distribución de gas @es
label: Distribuição de gás @pt
label: Distribution du gaz @fr
label: Distribuzione gas @it
label: Gasversorgung @de
label: Распределение газа @ru
label: 天然氣配送 @zh-hant
label: 气体分布 @zh
label: 가스 배급 @ko
label: ｶﾞｽ供給 @ja
definition: This segment includes natural gas distribution networks that operate at low pressure or are local area networks. Revenues are normally regulated by an independent (elected) or politically appointed regulatory body. Includes methane and propane.
notation: 2010111011
valid from: 2024-06-07

Gas Utilities
type: BicsLevel4SubIndustry
type: Classifier
type: NamedIndividual
is sub industry of: Gas & Water Utilities
is contemporary version of: http://data.ga-group.nl/ics/bics/20101110
is version of: http://data.ga-group.nl/ics/bics/20101110
replaces: http://data.ga-group.nl/ics/bics/2020/20101110
imported on: 2026-06-08T13:40:52.236Z
last refreshed on: 2026-06-08T13:41:38.450Z
source accessed on: 2024-06-05T14:42:36Z
source last accessed on: 2024-06-05T14:42:36Z
label: Gasversorgung @de
label: Serv púb gás @pt
label: Serv pubb gas @it
label: Servicios gas @es
label: Srvces gaz collectvtés @fr
label: Ком. гзснбж @ru
label: 天然气公用事业 @zh
label: 天然氣公用事業 @zh-hant
label: 가스 유틸리티 @ko
label: ｶﾞｽ公益事業 @ja
definition: This industry subgroup includes companies that operate natural gas transmission and/or distribution networks under either regulated or unregulated revenue arrangements.
notation: 20101110
valid from: 2024-06-07

Water Sewage Networks
type: BicsLevel5Segment
type: Classifier
type: NamedIndividual
is level5 segment of: Water Utilities
is contemporary version of: http://data.ga-group.nl/ics/bics/2010111110
is version of: http://data.ga-group.nl/ics/bics/2010111110
replaces: http://data.ga-group.nl/ics/bics/2020/2010111110
imported on: 2026-06-08T13:40:52.236Z
last refreshed on: 2026-06-08T13:41:38.450Z
source accessed on: 2024-06-05T14:42:36Z
source last accessed on: 2024-06-05T14:42:36Z
label: Netzwerke: Abwasser @de
label: Réseaux d'égouts @fr
label: Redes de água de esgoto @pt
label: Redes de drenaje @es
label: Reti acque fognatura @it
label: Канализационные сети @ru
label: 下水網 @ja
label: 排水网络 @zh
label: 污水網 @zh-hant
label: 수도 하수도 네트워크 @ko
definition: This segment includes companies that own and/or operate networks focusing on the post-consumption components of the water cycle.
notation: 2010111110
valid from: 2024-06-07

Water Supply Networks
type: BicsLevel5Segment
type: Classifier
type: NamedIndividual
is level5 segment of: Water Utilities
is contemporary version of: http://data.ga-group.nl/ics/bics/2010111111
is version of: http://data.ga-group.nl/ics/bics/2010111111
replaces: http://data.ga-group.nl/ics/bics/2020/2010111111
imported on: 2026-06-08T13:40:52.236Z
last refreshed on: 2026-06-08T13:41:38.450Z
source accessed on: 2024-06-05T14:42:36Z
source last accessed on: 2024-06-05T14:42:36Z
label: Netzwerke: Wasserversorgung @de
label: Réseaux de distribution de l'eau @fr
label: Redes de abastecimento de água @pt
label: Redes de suministro de agua @es
label: Reti fornitura idrica @it
label: Сети водоснабжения @ru
label: Сети водоснаб��ения @ru
label: 上水網 @ja
label: 供水網 @zh-hant
label: 供水网络 @zh
label: 수도 공급 네트워크 @ko
definition: This segment includes companies that own or operate networks focusing on the pre-consumption components of the water cycle.
notation: 2010111111
valid from: 2024-06-07

Water Utilities
type: BicsLevel4SubIndustry
type: Classifier
type: NamedIndividual
is sub industry of: Gas & Water Utilities
is contemporary version of: http://data.ga-group.nl/ics/bics/20101111
is version of: http://data.ga-group.nl/ics/bics/20101111
replaces: http://data.ga-group.nl/ics/bics/2020/20101111
imported on: 2026-06-08T13:40:52.236Z
last refreshed on: 2026-06-08T13:41:38.450Z
source accessed on: 2024-06-05T14:42:36Z
source last accessed on: 2024-06-05T14:42:36Z
label: Aziende erogazione idrica @it
label: Fornecimento de água @pt
label: Servicios públicos de agua @es
label: Srvc aux coll - eau @fr
label: Wasserversorgung @de
label: Коммунальное водоснабжение @ru
label: 水公用事业 @zh
label: 水道 @ja
label: 配水網 @zh-hant
label: 수도 유틸리티 @ko
definition: This industry subgroup includes companies that operate regulated water distribution networks and own and/or operate treatment infrastructure.
notation: 20101111
valid from: 2024-06-07

Gas & Water Utilities
type: BicsLevel3Industry
type: Classifier
type: NamedIndividual
is industry of: Utilities
is contemporary version of: http://data.ga-group.nl/ics/bics/201011
is version of: http://data.ga-group.nl/ics/bics/201011
replaces: http://data.ga-group.nl/ics/bics/2020/201011
imported on: 2026-06-08T13:40:52.236Z
last refreshed on: 2026-06-08T13:41:38.450Z
source accessed on: 2024-06-05T14:42:36Z
source last accessed on: 2024-06-05T14:42:36Z
label: Gas- & Wasserversorgung @de
label: Serv coll gaz et eau @fr
label: Servicios públicos de agua y gas @es
label: Servizi pubblici gas e acqua @it
label: Utilidades públicas - Gas e água @pt
label: Коммун. газо- и водоснабж. @ru
label: 天然气与水公用事业 @zh
label: 天然氣及水公用事業 @zh-hant
label: 가스&수도 유틸리티 @ko
label: ｶﾞｽ･水道公益事業 @ja
definition: This industry includes companies that operate natural gas transmission and/or distribution, water distribution, or water treatment infrastructure under either regulated or unregulated revenue arrangements.
notation: 201011
valid from: 2024-06-07

Electricity Marketing & Trading
type: BicsLevel5Segment
type: Classifier
type: NamedIndividual
is level5 segment of: Elec & Gas Marketing & Trading
is contemporary version of: http://data.ga-group.nl/ics/bics/2010121010
is version of: http://data.ga-group.nl/ics/bics/2010121010
replaces: http://data.ga-group.nl/ics/bics/2020/2010121010
imported on: 2026-06-08T13:40:52.236Z
last refreshed on: 2026-06-08T13:41:38.450Z
source accessed on: 2024-06-05T14:42:36Z
source last accessed on: 2024-06-05T14:42:36Z
label: Comercialización y ops de electricidad @es
label: Elektrizität Marketing & Handel @de
label: Marketing e comércio de eletricidade @pt
label: Marketing e commercio elettr @it
label: Marketing/négo électricité @fr
label: Маркетинг энергии и торговля @ru
label: 电力营销与交易 @zh
label: 電力行銷 @zh-hant
label: 電力販売･取引 @ja
label: 전기 마케팅 및 거래 @ko
definition: This segment includes companies that sell and trade electricity to end users.
notation: 2010121010
valid from: 2024-06-07

Gas Marketing & Trading
type: BicsLevel5Segment
type: Classifier
type: NamedIndividual
is level5 segment of: Elec & Gas Marketing & Trading
is contemporary version of: http://data.ga-group.nl/ics/bics/2010121011
is version of: http://data.ga-group.nl/ics/bics/2010121011
replaces: http://data.ga-group.nl/ics/bics/2020/2010121011
imported on: 2026-06-08T13:40:52.236Z
last refreshed on: 2026-06-08T13:41:38.450Z
source accessed on: 2024-06-05T14:42:36Z
source last accessed on: 2024-06-05T14:42:36Z
label: Comercialización y ops de gas @es
label: Gas Marketing & Handel @de
label: Marketing e comércio de gás @pt
label: Marketing e commercio gas @it
label: Marketing/négo gaz naturel @fr
label: Маркетинг газа и торговля @ru
label: 天然气营销与交易 @zh
label: 天然氣行銷 @zh-hant
label: 가스 마케팅 및 거래 @ko
label: ｶﾞｽ販売･取引 @ja
definition: This segment includes companies that sell and trade natural gas to end users.
notation: 2010121011
valid from: 2024-06-07

Elec & Gas Marketing & Trading
type: BicsLevel4SubIndustry
type: Classifier
type: NamedIndividual
is sub industry of: Elec & Gas Marketing & Trading
is contemporary version of: http://data.ga-group.nl/ics/bics/20101210
is version of: http://data.ga-group.nl/ics/bics/20101210
replaces: http://data.ga-group.nl/ics/bics/2020/20101210
imported on: 2026-06-08T13:40:52.236Z
last refreshed on: 2026-06-08T13:41:38.450Z
source accessed on: 2024-06-05T14:42:36Z
source last accessed on: 2024-06-05T14:42:36Z
label: Comercialización y ops de gas y elec @es
label: Marketing e comercialização de gás e eletricidade @pt
label: Marketing e comm elettr e gas @it
label: Marketing/négo élec/gaz nat @fr
label: Strom/Gas Mrktg & Hdl @de
label: Продажи электричества и газа @ru
label: 电力与天然气营销与交易 @zh
label: 電力及天然氣行銷及交易 @zh-hant
label: 電力･ｶﾞｽ販売･取引 @ja
label: 전기 및 가스 마케팅 및 거래 @ko
definition: This industry subgroup includes companies that sell and trade electricity, natural gas, and related commodities to end users.
notation: 20101210
valid from: 2024-06-07

Elec & Gas Marketing & Trading
type: BicsLevel3Industry
type: Classifier
type: NamedIndividual
is industry of: Utilities
is contemporary version of: http://data.ga-group.nl/ics/bics/201012
is version of: http://data.ga-group.nl/ics/bics/201012
replaces: http://data.ga-group.nl/ics/bics/2020/201012
imported on: 2026-06-08T13:40:52.236Z
last refreshed on: 2026-06-08T13:41:38.450Z
source accessed on: 2024-06-05T14:42:36Z
source last accessed on: 2024-06-05T14:42:36Z
label: Comercialización y ops de gas y elec @es
label: Marketing e commercio elett e gas @it
label: Marketing e negociação - Elet e gas @pt
label: Mrktg/négo élec et gaz nat @fr
label: Strom & Erdgas - Marketing & Handel @de
label: Продажи электричества и газа @ru
label: 电力与天然气营销与交易 @zh
label: 電力及天然氣行銷及交易 @zh-hant
label: 電力･ｶﾞｽ販売･取引 @ja
label: 전기&가스 판매&거래 @ko
definition: This industry includes companies that sell and trade electricity, natural gas, and related commodities to end users.
notation: 201012
valid from: 2024-06-07

Utilities
type: BicsLevel2IndustryGroup
type: Classifier
type: NamedIndividual
is industry group of: Utilities
is contemporary version of: http://data.ga-group.nl/ics/bics/2010
is version of: http://data.ga-group.nl/ics/bics/2010
replaces: http://data.ga-group.nl/ics/bics/2020/2010
imported on: 2026-06-08T13:40:52.236Z
last refreshed on: 2026-06-08T13:41:38.450Z
source accessed on: 2024-06-05T14:42:36Z
source last accessed on: 2024-06-05T14:42:36Z
label: Serv pubb @it
label: Serviços públicos @pt
label: Services à la collectivité @fr
label: Servicios públicos @es
label: Versorger @de
label: Энергоносители @ru
label: 公用事业 @zh
label: 公用事業 @zh-hant
label: 公益事業 @ja
label: 유틸리티 @ko
definition: This industry group includes companies that generate, distribute, or market electricity, water, or natural gas resources to end consumers.
notation: 2010
valid from: 2024-06-07

Utilities
type: BicsLevel1Sector
type: Classifier
type: NamedIndividual
is contemporary version of: http://data.ga-group.nl/ics/bics/20
is version of: http://data.ga-group.nl/ics/bics/20
replaces: http://data.ga-group.nl/ics/bics/2020/20
imported on: 2026-06-08T13:40:52.236Z
last refreshed on: 2026-06-08T13:41:38.450Z
source accessed on: 2024-06-05T14:42:36Z
source last accessed on: 2024-06-05T14:42:36Z
label: Serv púb @es
label: Serviços públicos @pt
label: Services aux collectivités @fr
label: Servizi pubblici @it
label: Versorgung @de
label: Коммунальные услуги @ru
label: 公用事业 @zh
label: 公用事業 @zh-hant
label: 公益事業 @ja
label: 유틸리티 @ko
definition: This sector includes companies that generate, distribute, or market electricity, water, or natural gas resources to end consumers.
notation: 20
valid from: 2024-06-07

Supranationals
type: BicsLevel4SubIndustry
type: Classifier
type: NamedIndividual
is sub industry of: Supranationals
is contemporary version of: http://data.ga-group.nl/ics/bics/50101010
is version of: http://data.ga-group.nl/ics/bics/50101010
replaces: http://data.ga-group.nl/ics/bics/2020/50101010
imported on: 2026-06-08T13:40:52.236Z
last refreshed on: 2026-06-08T13:41:38.450Z
source accessed on: 2024-06-05T14:42:36Z
source last accessed on: 2024-06-05T14:42:36Z
label: Sopranazionali @it
label: Supranacionais @pt
label: Supranacional @es
label: Supranationale @de
label: Supranationales @fr
label: Наднацион. @ru
label: 国際機関 @ja
label: 超国家 @zh
label: 超國際 @zh-hant
label: 국제기구 @ko
definition: This industry subgroup includes multinational organizations with economic or political objectives that transcend a single country, such as preventing conflicts or providing economic development aid.
notation: 50101010
valid from: 2024-06-07

Supranationals
type: BicsLevel3Industry
type: Classifier
type: NamedIndividual
is industry of: Supranationals
is contemporary version of: http://data.ga-group.nl/ics/bics/501010
is version of: http://data.ga-group.nl/ics/bics/501010
replaces: http://data.ga-group.nl/ics/bics/2020/501010
imported on: 2026-06-08T13:40:52.236Z
last refreshed on: 2026-06-08T13:41:38.450Z
source accessed on: 2024-06-05T14:42:36Z
source last accessed on: 2024-06-05T14:42:36Z
label: Sovranazionale @it
label: Supranacionais @pt
label: Supranacionales @es
label: Supranationale @de
label: Supranationales @fr
label: Наднацион. @ru
label: 国際機関 @ja
label: 超国家 @zh
label: 超國際 @zh-hant
label: 국제기구 @ko
definition: This industry includes multinational organizations with economic or political objectives that transcend a single country, such as preventing conflicts or providing economic development aid.
notation: 501010
valid from: 2024-06-07

Supranationals
type: BicsLevel2IndustryGroup
type: Classifier
type: NamedIndividual
is industry group of: Government
is contemporary version of: http://data.ga-group.nl/ics/bics/5010
is version of: http://data.ga-group.nl/ics/bics/5010
replaces: http://data.ga-group.nl/ics/bics/2020/5010
imported on: 2026-06-08T13:40:52.236Z
last refreshed on: 2026-06-08T13:41:38.450Z
source accessed on: 2024-06-05T14:42:36Z
source last accessed on: 2024-06-05T14:42:36Z
label: Sovranazionale @it
label: Supranacionais @pt
label: Supranacionales @es
label: Supranationale @de
label: Supranationales @fr
label: Наднацион. @ru
label: 国際機関 @ja
label: 超国家 @zh
label: 超國際 @zh-hant
label: 국제기구 @ko
definition: This industry group includes multinational organizations with economic or political objectives that transcend a single country, such as preventing conflicts or providing economic development aid.
notation: 5010
valid from: 2024-06-07

Sovereign Government
type: BicsLevel4SubIndustry
type: Classifier
type: NamedIndividual
is sub industry of: Sovereign Government
is contemporary version of: http://data.ga-group.nl/ics/bics/50111010
is version of: http://data.ga-group.nl/ics/bics/50111010
replaces: http://data.ga-group.nl/ics/bics/2020/50111010
imported on: 2026-06-08T13:40:52.236Z
last refreshed on: 2026-06-08T13:41:38.450Z
source accessed on: 2024-06-05T14:42:36Z
source last accessed on: 2024-06-05T14:42:36Z
label: Estado soberano @es
label: Gouvernement souverain @fr
label: Governo soberano @pt
label: Staatsanleihe Sovereign @de
label: Stato sovrano @it
label: Суверенное правительство @ru
label: 主权政府 @zh
label: 主權政府 @zh-hant
label: 国政府 @ja
label: 국가정부 @ko
definition: This industry subgroup includes entities that have the highest authority over a defined territory. These are independent governments that can levy taxes, issue debt, and create laws.
notation: 50111010
valid from: 2024-06-07

Sovereign Government
type: BicsLevel3Industry
type: Classifier
type: NamedIndividual
is industry of: Nacional
is contemporary version of: http://data.ga-group.nl/ics/bics/501110
is version of: http://data.ga-group.nl/ics/bics/501110
replaces: http://data.ga-group.nl/ics/bics/2020/501110
imported on: 2026-06-08T13:40:52.236Z
last refreshed on: 2026-06-08T13:41:38.450Z
source accessed on: 2024-06-05T14:42:36Z
source last accessed on: 2024-06-05T14:42:36Z
label: Estado soberano @es
label: Gouvernement souverain @fr
label: Governo soberano @pt
label: Staatsanleihe Sovereign @de
label: Stato sovrano @it
label: Суверенное правительство @ru
label: 主权政府 @zh
label: 主權政府 @zh-hant
label: 国政府 @ja
label: 국가정부 @ko
definition: This industry includes entities that have the highest authority over a defined territory. These are independent governments that can levy taxes, issue debt, and create laws.
notation: 501110
valid from: 2024-06-07

Sovereign Agencies
type: BicsLevel4SubIndustry
type: Classifier
type: NamedIndividual
is sub industry of: Sovereign Agencies
is contemporary version of: http://data.ga-group.nl/ics/bics/50111110
is version of: http://data.ga-group.nl/ics/bics/50111110
replaces: http://data.ga-group.nl/ics/bics/2020/50111110
imported on: 2026-06-08T13:40:52.236Z
last refreshed on: 2026-06-08T13:41:38.450Z
source accessed on: 2024-06-05T14:42:36Z
source last accessed on: 2024-06-05T14:42:36Z
label: Agências soberanas @pt
label: Agences souveraines @fr
label: Agencias soberanas @es
label: Agencies Sovereign @de
label: Agenzie sovrane @it
label: Суверенные агентства @ru
label: 主权机构 @zh
label: 主權機構 @zh-hant
label: 国政府機関 @ja
label: 국가기관 @ko
definition: This industry subgroup includes entities that provide administration and oversight of specific governmental functions on behalf of sovereign governments. These activities include regulation, law enforcement, tax collection and distribution, social and economic services, international diplomacy, and other country-level support services. Excludes entities in the private sector providing services elsewhere classifiable, such as utilities, rail transportation, or hospitals.
notation: 50111110
valid from: 2024-06-07

Sovereign Agencies
type: BicsLevel3Industry
type: Classifier
type: NamedIndividual
is industry of: Nacional
is contemporary version of: http://data.ga-group.nl/ics/bics/501111
is version of: http://data.ga-group.nl/ics/bics/501111
replaces: http://data.ga-group.nl/ics/bics/2020/501111
imported on: 2026-06-08T13:40:52.236Z
last refreshed on: 2026-06-08T13:41:38.450Z
source accessed on: 2024-06-05T14:42:36Z
source last accessed on: 2024-06-05T14:42:36Z
label: Agências soberanas @pt
label: Agences souveraines @fr
label: Agencias soberanas @es
label: Agencies Sovereign @de
label: Agenzie sovrane @it
label: Суверенные агентства @ru
label: 主权机构 @zh
label: 主權機構 @zh-hant
label: 国政府機関 @ja
label: 국가기관 @ko
definition: This industry includes entities that provide administration and oversight of specific governmental functions on behalf of sovereign governments. These activities include regulation, law enforcement, tax collection and distribution, social and economic services, international diplomacy, and other country-level support services. Excludes entities in the private sector providing services elsewhere classifiable, such as utilities, rail transportation, or hospitals.
notation: 501111
valid from: 2024-06-07

Central Banks
type: BicsLevel4SubIndustry
type: Classifier
type: NamedIndividual
is sub industry of: Governmental Banks
is contemporary version of: http://data.ga-group.nl/ics/bics/50111210
is version of: http://data.ga-group.nl/ics/bics/50111210
replaces: http://data.ga-group.nl/ics/bics/2020/50111210
imported on: 2026-06-08T13:40:52.236Z
last refreshed on: 2026-06-08T13:41:38.450Z
source accessed on: 2024-06-05T14:42:36Z
source last accessed on: 2024-06-05T14:42:36Z
label: Banche Centrali @it
label: Bancos Centrais @pt
label: Bancos centrales @es
label: Banques centrales @fr
label: Zentralbanken @de
label: Центральные банки @ru
label: 中央銀行 @ja
label: 央行 @zh
label: 중앙은행 @ko
definition: This industry subgroup includes entities that issue currency, regulate the money supply, oversee the banking industry, and control the interest rates in a country.
notation: 50111210
valid from: 2024-06-07

Government Development Banks
type: BicsLevel4SubIndustry
type: Classifier
type: NamedIndividual
is sub industry of: Governmental Banks
is contemporary version of: http://data.ga-group.nl/ics/bics/50111211
is version of: http://data.ga-group.nl/ics/bics/50111211
replaces: http://data.ga-group.nl/ics/bics/2020/50111211
imported on: 2026-06-08T13:40:52.236Z
last refreshed on: 2026-06-08T13:41:38.450Z
source accessed on: 2024-06-05T14:42:36Z
source last accessed on: 2024-06-05T14:42:36Z
label: Banche sviluppo Statali @it
label: Bancos de Desarrollo del Estado @es
label: Bancos governamentais de desenvolvimento @pt
label: Banques dévlpt gouvernementales @fr
label: Staatliche Entwicklungsbanken @de
label: Государств. банки развития @ru
label: 政府开发银行 @zh
label: 政府發展銀行 @zh-hant
label: 政府開発銀行 @ja
label: 정부 개발은행 @ko
definition: This industry subgroup includes government-owned entities that provide financing for economic development for a specific country. These entities are typically structured as banks and provide easier access to credit. They may target specific industries or companies that promote governmental objectives.
notation: 50111211
valid from: 2024-06-07

Export-Import Banks
type: BicsLevel4SubIndustry
type: Classifier
type: NamedIndividual
is sub industry of: Governmental Banks
is contemporary version of: http://data.ga-group.nl/ics/bics/50111212
is version of: http://data.ga-group.nl/ics/bics/50111212
replaces: http://data.ga-group.nl/ics/bics/2020/50111212
imported on: 2026-06-08T13:40:52.236Z
last refreshed on: 2026-06-08T13:41:38.450Z
source accessed on: 2024-06-05T14:42:36Z
source last accessed on: 2024-06-05T14:42:36Z
label: Banche Export-Import @it
label: Bancos de exportações-importações @pt
label: Bancos de exportaciones e importaciones @es
label: Banques d'import-export @fr
label: Export-Import-Banken @de
label: Экспортно-импортный банк @ru
label: 輸出入銀行 @ja
label: 进出口银行 @zh
label: 進出口銀行 @zh-hant
label: 수출입은행 @ko
definition: This industry subgroup includes entities that promote a country's foreign trade by providing financing or other financial services, such as insurance and export guarantees.
notation: 50111212
valid from: 2024-06-07

Governmental Banks
type: BicsLevel3Industry
type: Classifier
type: NamedIndividual
is industry of: Nacional
is contemporary version of: http://data.ga-group.nl/ics/bics/501112
is version of: http://data.ga-group.nl/ics/bics/501112
replaces: http://data.ga-group.nl/ics/bics/2020/501112
imported on: 2026-06-08T13:40:52.236Z
last refreshed on: 2026-06-08T13:41:38.450Z
source accessed on: 2024-06-05T14:42:36Z
source last accessed on: 2024-06-05T14:42:36Z
label: Banche statali @it
label: Bancos gubernamentales @es
label: Bancos públicos @pt
label: Banques gouvernementales @fr
label: Staatliche Banken @de
label: Государственные банки @ru
label: 國營銀行 @zh-hant
label: 政府銀行 @ja
label: 政府银行 @zh
label: 정부은행 @ko
definition: This industry includes entities that provide specialized financing and financial services to promote a specific country's economic development or monetary stability. Typically, these entities are structured as banks and may diversify into private sector banking activities.
notation: 501112
valid from: 2024-06-07

Nacional
type: BicsLevel2IndustryGroup
type: Classifier
type: NamedIndividual
is industry group of: Government
is contemporary version of: http://data.ga-group.nl/ics/bics/5011
is version of: http://data.ga-group.nl/ics/bics/5011
replaces: http://data.ga-group.nl/ics/bics/2020/5011
imported on: 2026-06-08T13:40:52.236Z
last refreshed on: 2026-06-08T13:41:38.450Z
source accessed on: 2024-06-05T14:42:36Z
source last accessed on: 2024-06-05T14:42:36Z
label: National
label: Nazionale @it
label: Национ. @ru
label: 全國 @zh-hant
label: 国 @ja
label: 国家 @zh
label: 전국 @ko
definition: This industry group includes entities that perform governmental activities and services on a national or country-level.
notation: 5011
valid from: 2024-06-07

Regional Government
type: BicsLevel4SubIndustry
type: Classifier
type: NamedIndividual
is sub industry of: Régional
is contemporary version of: http://data.ga-group.nl/ics/bics/50121010
is version of: http://data.ga-group.nl/ics/bics/50121010
replaces: http://data.ga-group.nl/ics/bics/2020/50121010
imported on: 2026-06-08T13:40:52.236Z
last refreshed on: 2026-06-08T13:41:38.450Z
source accessed on: 2024-06-05T14:42:36Z
source last accessed on: 2024-06-05T14:42:36Z
label: Amministrazione regionale @it
label: Gobierno regional @es
label: Gouvernement régional @fr
label: Governo regional @pt
label: Staatsanleihe Regional @de
label: Региональное правительство @ru
label: 地区政府 @zh
label: 地區政府 @zh-hant
label: 地域政府 @ja
label: 지방정부 @ko
definition: This industry subgroup includes entities that operate political systems for regional subdivisions of a country, such as state and provincial governments. These entities maintain space or territory, levy taxes, issue debt, and create laws within their regional subdivision.
notation: 50121010
valid from: 2024-06-07

Regional Agencies
type: BicsLevel4SubIndustry
type: Classifier
type: NamedIndividual
is sub industry of: Régional
is contemporary version of: http://data.ga-group.nl/ics/bics/50121011
is version of: http://data.ga-group.nl/ics/bics/50121011
replaces: http://data.ga-group.nl/ics/bics/2020/50121011
imported on: 2026-06-08T13:40:52.236Z
last refreshed on: 2026-06-08T13:41:38.450Z
source accessed on: 2024-06-05T14:42:36Z
source last accessed on: 2024-06-05T14:42:36Z
label: Agências regionais @pt
label: Agences régionales @fr
label: Agencias regionales @es
label: Agencies Regional @de
label: Agenzie regionali @it
label: Рег. агент. @ru
label: 地区机构 @zh
label: 地區機構 @zh-hant
label: 地域機関 @ja
label: 지방기관 @ko
definition: This industry subgroup includes regional government organizations responsible for the administration and oversight of regulation, law enforcement, tax collection and distribution, social and economic services, and other support services.
notation: 50121011
valid from: 2024-06-07

Régional
type: BicsLevel3Industry
type: Classifier
type: NamedIndividual
is industry of: Regional & Local
is contemporary version of: http://data.ga-group.nl/ics/bics/501210
is version of: http://data.ga-group.nl/ics/bics/501210
replaces: http://data.ga-group.nl/ics/bics/2020/501210
imported on: 2026-06-08T13:40:52.236Z
last refreshed on: 2026-06-08T13:41:38.450Z
source accessed on: 2024-06-05T14:42:36Z
source last accessed on: 2024-06-05T14:42:36Z
label: Regional
label: Regionale @it
label: Регионы @ru
label: 地区 @zh
label: 地區 @zh-hant
label: 地域 @ja
label: 지방 @ko
definition: This industry includes entities that perform governmental activities and services for a regional subdivision of a country, such as a state or province.
notation: 501210
valid from: 2024-06-07

Local Government
type: BicsLevel4SubIndustry
type: Classifier
type: NamedIndividual
is sub industry of: Local
is contemporary version of: http://data.ga-group.nl/ics/bics/50121110
is version of: http://data.ga-group.nl/ics/bics/50121110
replaces: http://data.ga-group.nl/ics/bics/2020/50121110
imported on: 2026-06-08T13:40:52.236Z
last refreshed on: 2026-06-08T13:41:38.450Z
source accessed on: 2024-06-05T14:42:36Z
source last accessed on: 2024-06-05T14:42:36Z
label: Amministrazione locale @it
label: Gobierno local @es
label: Gouvernement local @fr
label: Governo local @pt
label: Staatsanleihe Lokal @de
label: Местное правительство @ru
label: 地方政府 @ja
label: 地方��府 @ja
label: 지방자치단체 @ko
definition: This industry subgroup includes entities that operate political systems for the smallest subdivisions of a country, such as city and township governments. These entities maintain territories, levy taxes, issue debt, and create laws within their local subdivisions.
notation: 50121110
valid from: 2024-06-07

Local Agencies
type: BicsLevel4SubIndustry
type: Classifier
type: NamedIndividual
is sub industry of: Local
is contemporary version of: http://data.ga-group.nl/ics/bics/50121111
is version of: http://data.ga-group.nl/ics/bics/50121111
replaces: http://data.ga-group.nl/ics/bics/2020/50121111
imported on: 2026-06-08T13:40:52.236Z
last refreshed on: 2026-06-08T13:41:38.450Z
source accessed on: 2024-06-05T14:42:36Z
source last accessed on: 2024-06-05T14:42:36Z
label: Agências locais @pt
label: Agences locales @fr
label: Agencias locales @es
label: Agencies Lokal @de
label: Agenzie locali @it
label: Местные агентства @ru
label: 地方机构 @zh
label: 地方機構 @zh-hant
label: 地方機関 @ja
label: 현지기관 @ko
definition: This industry subgroup includes local government organizations responsible for the administration and oversight of regulation, law enforcement, tax collection and distribution, social and economic services, and other support services.
notation: 50121111
valid from: 2024-06-07

Local
type: BicsLevel3Industry
type: Classifier
type: NamedIndividual
is industry of: Regional & Local
is contemporary version of: http://data.ga-group.nl/ics/bics/501211
is version of: http://data.ga-group.nl/ics/bics/501211
replaces: http://data.ga-group.nl/ics/bics/2020/501211
imported on: 2026-06-08T13:40:52.236Z
last refreshed on: 2026-06-08T13:41:38.450Z
source accessed on: 2024-06-05T14:42:36Z
source last accessed on: 2024-06-05T14:42:36Z
label: Locale @fr
label: Lokal @de
label: Местные @ru
label: 地方 @ja
label: 현지 @ko
definition: This industry includes entities that perform governmental activities and services within the smallest administrative division of a country.
notation: 501211
valid from: 2024-06-07

Regional & Local
type: BicsLevel2IndustryGroup
type: Classifier
type: NamedIndividual
is industry group of: Government
is contemporary version of: http://data.ga-group.nl/ics/bics/5012
is version of: http://data.ga-group.nl/ics/bics/5012
replaces: http://data.ga-group.nl/ics/bics/2020/5012
imported on: 2026-06-08T13:40:52.236Z
last refreshed on: 2026-06-08T13:41:38.450Z
source accessed on: 2024-06-05T14:42:36Z
source last accessed on: 2024-06-05T14:42:36Z
label: Régional et local @fr
label: Regional & Lokal @de
label: Regional e local @pt
label: Regional y local @es
label: Regionale e locale @it
label: Региональные и местные @ru
label: 地区与地方 @zh
label: 地區及地方 @zh-hant
label: 地域･地方 @ja
label: 지방 & 현지 @ko
definition: This industry group includes entities that perform governmental activities and services for a country's regional or local levels.
notation: 5012
valid from: 2024-06-07

Government
type: BicsLevel1Sector
type: Classifier
type: NamedIndividual
is contemporary version of: http://data.ga-group.nl/ics/bics/50
is version of: http://data.ga-group.nl/ics/bics/50
replaces: http://data.ga-group.nl/ics/bics/2020/50
imported on: 2026-06-08T13:40:52.236Z
last refreshed on: 2026-06-08T13:41:38.450Z
source accessed on: 2024-06-05T14:42:36Z
source last accessed on: 2024-06-05T14:42:36Z
label: Gobierno @es
label: Gouvernement @fr
label: Governo @pt
label: Regierung @de
label: Stato @it
label: Государств. @ru
label: 政府 @ja
label: 정부 @ko
definition: This sector includes governing bodies of nations, states, or communities. Includes entities that operate political systems and subdivisions, or carry out governmental functions to address social policies, strategic interests, or public services. Also includes entities engaging in activities or services unique to governments and not elsewhere classifiable.
notation: 50
valid from: 2024-06-07

Unknown
type: BicsLevel4SubIndustry
type: Classifier
type: NamedIndividual
is sub industry of: Unclassifiable
is contemporary version of: http://data.ga-group.nl/ics/bics/99101010
is version of: http://data.ga-group.nl/ics/bics/99101010
replaces: http://data.ga-group.nl/ics/bics/2020/99101010
imported on: 2026-06-08T13:40:52.236Z
last refreshed on: 2026-06-08T13:41:38.450Z
source accessed on: 2024-06-05T14:42:36Z
source last accessed on: 2024-06-05T14:42:36Z
label: Deconocido @es
label: Desconhecido @pt
label: Ignoto @it
label: Inconnu @fr
label: Unbekannt @de
label: Нет данных @ru
label: 不明 @ja
label: 未知 @zh
label: 미확인 @ko
definition: For companies where no information is available to determine business activity.
notation: 99101010
valid from: 2024-06-07

Corporate Adjustments
type: BicsLevel4SubIndustry
type: Classifier
type: NamedIndividual
is sub industry of: Unclassifiable
is contemporary version of: http://data.ga-group.nl/ics/bics/99101011
is version of: http://data.ga-group.nl/ics/bics/99101011
replaces: http://data.ga-group.nl/ics/bics/2020/99101011
imported on: 2026-06-08T13:40:52.236Z
last refreshed on: 2026-06-08T13:41:38.450Z
source accessed on: 2024-06-05T14:42:36Z
source last accessed on: 2024-06-05T14:42:36Z
label: Ajustements d'entreprise @fr
label: Ajustes corp @es
label: Ajustes corporativos @pt
label: Rettifiche societarie @it
label: Unternehmensberichtigungen @de
label: Корп. корректировки @ru
label: 企業調整 @ja
label: 公司調整 @zh-hant
label: 公司调整 @zh
label: 기업 조정 @ko
definition: For segments that are reported for corporate adjustments or for administrative office activities. These segments are not considered a part of their business activities.
notation: 99101011
valid from: 2024-06-07

Intersegment Adjustments
type: BicsLevel4SubIndustry
type: Classifier
type: NamedIndividual
is sub industry of: Unclassifiable
is contemporary version of: http://data.ga-group.nl/ics/bics/99101012
is version of: http://data.ga-group.nl/ics/bics/99101012
replaces: http://data.ga-group.nl/ics/bics/2020/99101012
imported on: 2026-06-08T13:40:52.236Z
last refreshed on: 2026-06-08T13:41:38.450Z
source accessed on: 2024-06-05T14:42:36Z
source last accessed on: 2024-06-05T14:42:36Z
label: Ajustements d'intersegment @fr
label: Ajustes de intersegmentos @pt
label: Ajustes intersegmento @es
label: Intersegmentberichtigungen @de
label: Rettifiche intersegmento @it
label: Интерсегм. корректировки @ru
label: 跨分类调整 @zh
label: 跨分類調整 @zh-hant
label: 사업부문간 조정 @ko
label: ｾｸﾞﾒﾝﾄ間取引消去 @ja
definition: For segments that adjusts revenue to account for intersegment or non-external revenue sales. These segments are not considered a part of their business activities.
notation: 99101012
valid from: 2024-06-07

Unclassifiable
type: BicsLevel3Industry
type: Classifier
type: NamedIndividual
is industry of: Unclassifiable
is contemporary version of: http://data.ga-group.nl/ics/bics/991010
is version of: http://data.ga-group.nl/ics/bics/991010
replaces: http://data.ga-group.nl/ics/bics/2020/991010
imported on: 2026-06-08T13:40:52.236Z
last refreshed on: 2026-06-08T13:41:38.450Z
source accessed on: 2024-06-05T14:42:36Z
source last accessed on: 2024-06-05T14:42:36Z
label: Não classificado @pt
label: Nicht klassifiziert @de
label: No clasificado @es
label: Non classifié @fr
label: Non classificabile @it
label: Неклассифицируемо @ru
label: 分類不能 @ja
label: 无法分类 @zh
label: 未分類 @zh-hant
label: 미분류 @ko
definition: For special classification/segment purposes only.
notation: 991010
valid from: 2024-06-07

Unclassifiable
type: BicsLevel2IndustryGroup
type: Classifier
type: NamedIndividual
is industry group of: Unclassifiable
is contemporary version of: http://data.ga-group.nl/ics/bics/9910
is version of: http://data.ga-group.nl/ics/bics/9910
replaces: http://data.ga-group.nl/ics/bics/2020/9910
imported on: 2026-06-08T13:40:52.236Z
last refreshed on: 2026-06-08T13:41:38.450Z
source accessed on: 2024-06-05T14:42:36Z
source last accessed on: 2024-06-05T14:42:36Z
label: Não classificável @pt
label: Nicht klassifizierbar @de
label: No clasificable @es
label: Non classifiable @fr
label: Non classificabile @it
label: Неклассиф. @ru
label: 分類不能 @ja
label: 无法分类 @zh
label: 未分類 @zh-hant
label: 미분류 @ko
definition: For special classification/segment purposes only.
notation: 9910
valid from: 2024-06-07

Unclassifiable
type: BicsLevel1Sector
type: Classifier
type: NamedIndividual
is contemporary version of: http://data.ga-group.nl/ics/bics/99
is version of: http://data.ga-group.nl/ics/bics/99
replaces: http://data.ga-group.nl/ics/bics/2020/99
imported on: 2026-06-08T13:40:52.236Z
last refreshed on: 2026-06-08T13:41:38.450Z
source accessed on: 2024-06-05T14:42:36Z
source last accessed on: 2024-06-05T14:42:36Z
label: Não classificável @pt
label: Nicht klassifizierbar @de
label: No clasificable @es
label: Non classifiable @fr
label: Non classificabile @it
label: Неклассиф. @ru
label: 分類不能 @ja
label: 无法分类 @zh
label: 未分類 @zh-hant
label: 미분류 @ko
definition: For special classification/segment purposes only.
notation: 99
valid from: 2024-06-07