BICS individuals
type: Ontology
download URL: http://data.ga-group.nl/ics/bics2014.ttl
abstract: This ontology includes individuals representing the set of classification codes based on the principal business activity of the company. This set of classification codes is valid from 2014 till 2020.
creator: https://orcid.org/0000-0002-7352-2825
description: The Bloomberg Industry Classification Standard (BICS) is an industry classification taxonomy launched by Bloomberg in 2014. Codes are at least four-tiered, but up to eight tiers are possible. Codes are numeric but not prefix-free. The first tier is called sector, the second tier is the industry group, the third tier is the industry, and the fourth tier is the subindustry. Tiers five to eight are simply called segments. Bloomberg is responsible for assigning a BICS classification to all major public companies. Each company is allocated to the subindustry that most closely represents the nature of its business according to the BICS classification methodology.
format: text/turtle
issued: 2026-06-03T02:25:19Z
language: en
license: https://creativecommons.org/licenses/by-sa/4.0/
modified: 2026-06-03T02:25:19Z
publisher: https://orcid.org/0000-0002-7352-2825
has maturity level: Release
imports: classes
imports: ics
version info: 2014
content language: owl2-quick-reference
label: BICS 2014
contributor: PAMIYA Strategic Advisors GmbH
copyright: Copyright (c) 2014 Bloomberg LLC
copyright: Copyright (c) 2022-2026 PAMIYA Strategic Advisors GmbH
filename: bics2014.ttl
valid from: 2014
valid till: 2020
preferred namespace prefix: bics2014

Advertising Agencies
type: BicsLevel5Segment
type: Classifier
type: NamedIndividual
is level5 segment of: Advertising Agencies & Svcs
is anachronous version of: http://data.ga-group.nl/ics/bics/101010101010
is contemporary version of: http://data.ga-group.nl/ics/bics/1010101010
is replaced by: http://data.ga-group.nl/ics/bics/2020/101010101010
is version of: http://data.ga-group.nl/ics/bics/101010101010
is version of: http://data.ga-group.nl/ics/bics/1010101010
imported on: 2026-06-08T13:03:47.798Z
last refreshed on: 2026-06-08T13:03:47.798Z
source accessed on: 2019-12-03T20:05:01Z
source last accessed on: 2019-12-03T20:05:01Z
label: Agências de propaganda @pt
label: Agences de pub @fr
label: Agencias publicidad @es
label: Soctà pubblicitarie @it
label: Werbeagenturen @de
label: Рекламные агентства @ru
label: 广告代理 @zh
label: 広告代理店 @ja
label: 廣告代理業 @zh-hant
label: 광고대행사 @ko
definition: This segment includes companies that create advertising campaigns for use in newspapers, magazines, radio, television or other media.
notation: 1010101010
valid from: 2014-08-08
valid till: 2020-10-03

Affiliate Marketing
type: BicsLevel6Segment
type: Classifier
type: Discontinued
type: NamedIndividual
is level6 segment of: E-Marketing
is contemporary version of: http://data.ga-group.nl/ics/bics/101010101110
is version of: http://data.ga-group.nl/ics/bics/101010101110
imported on: 2026-06-08T13:03:47.798Z
last refreshed on: 2026-06-08T13:03:47.798Z
source accessed on: 2019-12-03T20:05:01Z
source last accessed on: 2019-12-03T20:05:01Z
label: Affiliate-Marketing @de
label: Marketing affiliazioni @it
label: Marketing afiliado @pt
label: Marketing d'affilié @fr
label: Mercadotecnia afiliada @es
label: Аффилир. маркетинг @ru
label: 联盟营销 @zh
label: 關係行銷 @zh-hant
label: 제휴 마케팅 @ko
label: ｱﾌｨﾘｴｲﾄ･ﾏｰｹﾃｨﾝｸﾞ @ja
definition: This segment includes companies that operate affiliate marketing networks. Affiliates are compensated when a customer is brought to the merchant. These affiliate marketing networks process these transactions and provide the systems for merchants and affiliates to meet on a fee basis.
notation: 101010101110
valid from: 2014-08-08
valid till: 2020-10-03

E-Marketing
type: BicsLevel5Segment
type: Classifier
type: NamedIndividual
is level5 segment of: Advertising Agencies & Svcs
is anachronous version of: http://data.ga-group.nl/ics/bics/101010101011
is contemporary version of: http://data.ga-group.nl/ics/bics/1010101011
is replaced by: http://data.ga-group.nl/ics/bics/2020/101010101011
is version of: http://data.ga-group.nl/ics/bics/101010101011
is version of: http://data.ga-group.nl/ics/bics/1010101011
imported on: 2026-06-08T13:03:47.798Z
last refreshed on: 2026-06-08T13:03:47.798Z
source accessed on: 2019-12-03T20:05:01Z
source last accessed on: 2019-12-03T20:05:01Z
label: E-마케팅 @ko
label: Marketing online @pt
label: Эл. маркетинг @ru
label: 网络营销 @zh
label: 電子行銷 @zh-hant
label: eﾏｰｹﾃｨﾝｸﾞ @ja
definition: This segment includes companies that specialize in creating advertising campaigns via Internet media. Includes email marketing, mobile and website display advertising, search engine optimization, and social media marketing.
notation: 1010101011
valid from: 2014-08-08
valid till: 2020-10-03

Marketing Consulting Services
type: BicsLevel6Segment
type: Classifier
type: NamedIndividual
is level6 segment of: Market Research & Consulting
is anachronous version of: http://data.ga-group.nl/ics/bics/10101010101210
is contemporary version of: http://data.ga-group.nl/ics/bics/101010101210
is replaced by: http://data.ga-group.nl/ics/bics/2020/10101010101210
is version of: http://data.ga-group.nl/ics/bics/10101010101210
is version of: http://data.ga-group.nl/ics/bics/101010101210
imported on: 2026-06-08T13:03:47.798Z
last refreshed on: 2026-06-08T13:03:47.798Z
source accessed on: 2019-12-03T20:05:01Z
source last accessed on: 2019-12-03T20:05:01Z
label: Marketing-Consulting-Dienste @de
label: Serviços de consultoria de marketing @pt
label: Services de conseils en marketing @fr
label: Servicios de consultoría de mercadotecnia @es
label: Servizi consulenza marketing @it
label: Консультационные услуги по маркетингу @ru
label: 营销咨询服务 @zh
label: 行銷顧問服務 @zh-hant
label: 시장 컨설팅 서비스 @ko
label: ﾏｰｹﾃｨﾝｸﾞ･ｺﾝｻﾙﾃｨﾝｸﾞｻｰﾋﾞｽ @ja
definition: This segment includes companies that provide marketing consulting services.
notation: 101010101210
valid from: 2014-08-08
valid till: 2020-10-03

Mktg Res & Public Opinion Poll
type: BicsLevel6Segment
type: Classifier
type: NamedIndividual
is level6 segment of: Market Research & Consulting
is anachronous version of: http://data.ga-group.nl/ics/bics/10101010101211
is contemporary version of: http://data.ga-group.nl/ics/bics/101010101211
is replaced by: http://data.ga-group.nl/ics/bics/2020/10101010101211
is version of: http://data.ga-group.nl/ics/bics/10101010101211
is version of: http://data.ga-group.nl/ics/bics/101010101211
imported on: 2026-06-08T13:03:47.798Z
last refreshed on: 2026-06-08T13:03:47.798Z
source accessed on: 2019-12-03T20:05:01Z
source last accessed on: 2019-12-03T20:05:01Z
label: Estudios de mercado y encuestas de opinión pública @es
label: Etudes de mché et sondage d'opinion @fr
label: Marktforschung & Demoskopie @de
label: Pesq mktg e opnião pública @pt
label: Ric merc e sondaggio d'opinione @it
label: Маркет. исследов. и опросы общ. мнения @ru
label: 市場研究及意見調查 @zh-hant
label: 市場調査･世論調査 @ja
label: 营销研究与民意表决 @zh
label: 시장조사 & 여론조사 @ko
definition: This segment includes companies that provide market research and opinion polling.
notation: 101010101211
valid from: 2014-08-08
valid till: 2020-10-03

Market Research & Consulting
type: BicsLevel5Segment
type: Classifier
type: NamedIndividual
is level5 segment of: Advertising Agencies & Svcs
is anachronous version of: http://data.ga-group.nl/ics/bics/101010101012
is contemporary version of: http://data.ga-group.nl/ics/bics/1010101012
is replaced by: http://data.ga-group.nl/ics/bics/2020/101010101012
is version of: http://data.ga-group.nl/ics/bics/101010101012
is version of: http://data.ga-group.nl/ics/bics/1010101012
imported on: 2026-06-08T13:03:47.798Z
last refreshed on: 2026-06-08T13:03:47.798Z
source accessed on: 2019-12-03T20:05:01Z
source last accessed on: 2019-12-03T20:05:01Z
label: Consulenza e ricerca di mercato @it
label: Consultoria e pesquisa de mercado @pt
label: Estudios y consultoría de mercado @es
label: Etude de marché et conseil @fr
label: Marktforschung & Beratung @de
label: Исследования рынка и консалтинг @ru
label: 市场研究和顾问 @zh
label: 市場研究及顧問 @zh-hant
label: 市場調査及びｺﾝｻﾙﾃｨﾝｸﾞ @ja
label: 시장 리서치 & 컨설팅 @ko
definition: This segment includes companies that provide market research, opinion polling or marketing consulting services.
notation: 1010101012
valid from: 2014-08-08
valid till: 2020-10-03

Media Representatives
type: BicsLevel5Segment
type: Classifier
type: NamedIndividual
is level5 segment of: Advertising Agencies & Svcs
is anachronous version of: http://data.ga-group.nl/ics/bics/101010101013
is contemporary version of: http://data.ga-group.nl/ics/bics/1010101013
is replaced by: http://data.ga-group.nl/ics/bics/2020/101010101013
is version of: http://data.ga-group.nl/ics/bics/101010101013
is version of: http://data.ga-group.nl/ics/bics/1010101013
imported on: 2026-06-08T13:03:47.798Z
last refreshed on: 2026-06-08T13:03:47.798Z
source accessed on: 2019-12-03T20:05:01Z
source last accessed on: 2019-12-03T20:05:01Z
label: Agencias de representación de medios @es
label: Medienvertreter @de
label: Rappresentanti dei media @it
label: Représentants de médias @fr
label: Representantes mídia @pt
label: Представитель средств рекламы @ru
label: 媒体代表 @zh
label: 媒體代表 @zh-hant
label: 광고매체판매업 @ko
label: ﾒﾃﾞｨｱﾚｯﾌﾟ @ja
definition: This segment includes companies that sell media time or space on behalf media owners.
notation: 1010101013
valid from: 2014-08-08
valid till: 2020-10-03

Public Relations Agencies
type: BicsLevel5Segment
type: Classifier
type: NamedIndividual
is level5 segment of: Advertising Agencies & Svcs
is anachronous version of: http://data.ga-group.nl/ics/bics/101010101014
is contemporary version of: http://data.ga-group.nl/ics/bics/1010101014
is replaced by: http://data.ga-group.nl/ics/bics/2020/101010101014
is version of: http://data.ga-group.nl/ics/bics/101010101014
is version of: http://data.ga-group.nl/ics/bics/1010101014
imported on: 2026-06-08T13:03:47.798Z
last refreshed on: 2026-06-08T13:03:47.798Z
source accessed on: 2019-12-03T20:05:01Z
source last accessed on: 2019-12-03T20:05:01Z
label: Agências de relações públicas @pt
label: Agencias de relaciones públicas @es
label: Agenzie di pubbliche relazioni @it
label: Public-Relations-Agenturen @de
label: Services de relations publiques @fr
label: Агентства по связьм с общественностью @ru
label: 公共關係代理 @zh-hant
label: 公关代理 @zh
label: 広報代理店 @ja
label: 홍보기관 @ko
definition: This segment includes companies that provide public relations services. Public relations services manage the communication and the spread of information between their clients and the public.
notation: 1010101014
valid from: 2014-08-08
valid till: 2020-10-03

Advertising Agencies & Svcs
type: BicsLevel4SubIndustry
type: Classifier
type: NamedIndividual
is sub industry of: Advertising & Marketing
is anachronous version of: http://data.ga-group.nl/ics/bics/1010101010
is contemporary version of: http://data.ga-group.nl/ics/bics/10101010
is replaced by: http://data.ga-group.nl/ics/bics/2020/1010101010
is version of: http://data.ga-group.nl/ics/bics/1010101010
is version of: http://data.ga-group.nl/ics/bics/10101010
imported on: 2026-06-08T13:03:47.798Z
last refreshed on: 2026-06-08T13:03:47.798Z
source accessed on: 2019-12-03T20:05:01Z
source last accessed on: 2019-12-03T20:05:01Z
label: Agências de publicidade e serv @pt
label: Agences/serv de publicité @fr
label: Agenzie e serv pubblicitari @it
label: Servicios y agencias de publicidad @es
label: Werbeagenturen & -dienste @de
label: Рекламн. агентства и услг @ru
label: 广告代理商及相关服务 @zh
label: 広告代理店･関連ｻｰﾋﾞｽ @ja
label: 廣告代理及服務 @zh-hant
label: 광고 대행사 & 관련 서비스 @ko
definition: This industry subgroup includes companies that create advertising campaigns for media use, provide market research or marketing consulting services, or act as public relations or media representatives.
notation: 10101010
valid from: 2014-08-08
valid till: 2020-10-03

Advertising Material Distr Svcs
type: BicsLevel5Segment
type: Classifier
type: NamedIndividual
is level5 segment of: Direct Marketing
is anachronous version of: http://data.ga-group.nl/ics/bics/101010101110
is contemporary version of: http://data.ga-group.nl/ics/bics/1010101110
is replaced by: http://data.ga-group.nl/ics/bics/2020/101010101110
is version of: http://data.ga-group.nl/ics/bics/101010101110
is version of: http://data.ga-group.nl/ics/bics/1010101110
imported on: 2026-06-08T13:03:47.798Z
last refreshed on: 2026-06-08T13:03:47.798Z
source accessed on: 2019-12-03T20:05:01Z
source last accessed on: 2019-12-03T20:05:01Z
label: Serv de distr material de publicidad @es
label: Serv de distrib de matériel publicitaire @fr
label: Serv distr material de publicidade @pt
label: Serv distrib materiale pubblicitario @it
label: Werbematerialverteildienste @de
label: Услг по распростр. рекламы @ru
label: 广告材料分发服务 @zh
label: 広告素材配給ｻｰﾋﾞｽ @ja
label: 廣告宣傳物發送服務 @zh-hant
label: 광고물 배포 서비스 @ko
definition: This segment includes companies that direct distribute advertising materials or samples.
notation: 1010101110
valid from: 2014-08-08
valid till: 2020-10-03

Direct Mail Advertising
type: BicsLevel5Segment
type: Classifier
type: NamedIndividual
is level5 segment of: Direct Marketing
is anachronous version of: http://data.ga-group.nl/ics/bics/101010101111
is contemporary version of: http://data.ga-group.nl/ics/bics/1010101111
is replaced by: http://data.ga-group.nl/ics/bics/2020/101010101111
is version of: http://data.ga-group.nl/ics/bics/101010101111
is version of: http://data.ga-group.nl/ics/bics/1010101111
imported on: 2026-06-08T13:03:47.798Z
last refreshed on: 2026-06-08T13:03:47.798Z
source accessed on: 2019-12-03T20:05:01Z
source last accessed on: 2019-12-03T20:05:01Z
label: Agencias de publicidad que operan por correo directo @es
label: Postversandwerbung @de
label: Pubblicità Direct Mail @it
label: Publicidade mala direta @pt
label: Publipostage @fr
label: Реклама через прямую почтовую рассылку @ru
label: 直接投遞廣告 @zh-hant
label: 直邮广告 @zh
label: 직접우편 광고 @ko
label: ﾀﾞｲﾚｸﾄﾒｰﾙ広告業 @ja
definition: This segment includes companies that create advertisements and campaigns that are distributed through mail services. Includes mail advertisements, fliers, pamphlets and coupons.
notation: 1010101111
valid from: 2014-08-08
valid till: 2020-10-03

Direct Marketing
type: BicsLevel4SubIndustry
type: Classifier
type: NamedIndividual
is sub industry of: Advertising & Marketing
is anachronous version of: http://data.ga-group.nl/ics/bics/1010101011
is contemporary version of: http://data.ga-group.nl/ics/bics/10101011
is replaced by: http://data.ga-group.nl/ics/bics/2020/1010101011
is version of: http://data.ga-group.nl/ics/bics/1010101011
is version of: http://data.ga-group.nl/ics/bics/10101011
imported on: 2026-06-08T13:03:47.798Z
last refreshed on: 2026-06-08T13:03:47.798Z
source accessed on: 2019-12-03T20:05:01Z
source last accessed on: 2019-12-03T20:05:01Z
label: Direktmarketing @de
label: Márketing directo @es
label: Marketing direct @fr
label: Marketing direto @pt
label: Vendite dirette @it
label: Прямой маркетинг @ru
label: 直接銷售業 @zh-hant
label: 直销 @zh
label: 通信販売 @ja
label: 다이렉트 마케팅 @ko
definition: This industry subgroup includes companies involved in the creation or distribution of direct marketing advertisements. Includes mail advertisements, telemarketing, coupons, and text (SMS) advertisements.
notation: 10101011
valid from: 2014-08-08
valid till: 2020-10-03

Directory & Mail List Publishers
type: BicsLevel5Segment
type: Classifier
type: Discontinued
type: NamedIndividual
is level5 segment of: Other Advertising Services
is contemporary version of: http://data.ga-group.nl/ics/bics/1010101210
is version of: http://data.ga-group.nl/ics/bics/1010101210
imported on: 2026-06-08T13:03:47.798Z
last refreshed on: 2026-06-08T13:03:47.798Z
source accessed on: 2019-12-03T20:05:01Z
source last accessed on: 2019-12-03T20:05:01Z
label: Edición directorios lista corr @es
label: Editeurs d'annuaires/répert @fr
label: Editori elenchi @it
label: Publicadores de diretório e lista de correios @pt
label: Verzeichnisse & Adressenlisten @de
label: Издатели справочн. и адрес. списков @ru
label: 名簿出版業 @ja
label: 目录与邮递地址出版商 @zh
label: 目錄及郵遞名單出版 @zh-hant
label: 디렉터리 & 우편목록 출판업 @ko
definition: This segment includes companies that publish telephone and business directories or mailing lists.
notation: 1010101210
valid from: 2014-08-08
valid till: 2020-10-03

Other Advertising Services
type: BicsLevel5Segment
type: Classifier
type: Discontinued
type: NamedIndividual
is level5 segment of: Other Advertising Services
is contemporary version of: http://data.ga-group.nl/ics/bics/1010101211
is version of: http://data.ga-group.nl/ics/bics/1010101211
imported on: 2026-06-08T13:03:47.798Z
last refreshed on: 2026-06-08T13:03:47.798Z
source accessed on: 2019-12-03T20:05:01Z
source last accessed on: 2019-12-03T20:05:01Z
label: Altri servizi pubblicitari @it
label: Autres services de publicité @fr
label: Otros servicios de anuncios @es
label: Outros serviços de propaganda @pt
label: Sonstige Werbedienste @de
label: Проч. рекламные услуги @ru
label: その他広告関連ｻｰﾋﾞｽ @ja
label: 其他广告服务 @zh
label: 其他廣告服務 @zh-hant
label: 기타 광고 서비스 @ko
definition: This segment includes companies that provide miscellaneous advertising services not elsewhere classified.
notation: 1010101211
valid from: 2014-08-08
valid till: 2020-10-03

Other Advertising Services
type: BicsLevel4SubIndustry
type: Classifier
type: Discontinued
type: NamedIndividual
is sub industry of: Advertising & Marketing
is contemporary version of: http://data.ga-group.nl/ics/bics/10101012
is version of: http://data.ga-group.nl/ics/bics/10101012
imported on: 2026-06-08T13:03:47.798Z
last refreshed on: 2026-06-08T13:03:47.798Z
source accessed on: 2019-12-03T20:05:01Z
source last accessed on: 2019-12-03T20:05:01Z
label: Altri servizi pubblicitari @it
label: Autres services de publicité @fr
label: Otros servicios de anuncios @es
label: Outros serviços de propaganda @pt
label: Sonstige Werbedienste @de
label: Проч. рекламные услуги @ru
label: その他広告ｻｰﾋﾞｽ @ja
label: 其他廣告服務 @zh-hant
label: 其��广告服务 @zh
label: 기타 광고 서비스 @ko
definition: This industry subgroup includes companies that publish directories or mailing lists and provide other miscellaneous advertising services that are not elsewhere classified.
notation: 10101012
valid from: 2014-08-08
valid till: 2020-10-03

Advertising & Marketing
type: BicsLevel3Industry
type: Classifier
type: NamedIndividual
is industry of: Media
is anachronous version of: http://data.ga-group.nl/ics/bics/10101010
is contemporary version of: http://data.ga-group.nl/ics/bics/101010
is replaced by: http://data.ga-group.nl/ics/bics/2020/10101010
is version of: http://data.ga-group.nl/ics/bics/10101010
is version of: http://data.ga-group.nl/ics/bics/101010
imported on: 2026-06-08T13:03:47.798Z
last refreshed on: 2026-06-08T13:03:47.798Z
source accessed on: 2019-12-03T20:05:01Z
source last accessed on: 2019-12-03T20:05:01Z
label: Mktg e propaganda @pt
label: Pubblicità e marketing @it
label: Publicidad/márketing @es
label: Publicité et Marketing @fr
label: Werbung&Marketing @de
label: Реклама и маркет. @ru
label: 广告营销 @zh
label: 広告･ﾏｰｹﾃｨﾝｸﾞ @ja
label: 廣告及行銷 @zh-hant
label: 광고 & 마케팅 @ko
definition: This industry includes companies that provide advertising and marketing services. These services include the creation of advertising campaigns for use in media, display, or direct mail advertising and other related services.
notation: 101010
valid from: 2014-08-08
valid till: 2020-10-03

Cable Video Services
type: BicsLevel4SubIndustry
type: Classifier
type: NamedIndividual
is sub industry of: Cable & Satellite
is anachronous version of: http://data.ga-group.nl/ics/bics/1010111010
is contemporary version of: http://data.ga-group.nl/ics/bics/10101110
is replaced by: http://data.ga-group.nl/ics/bics/2020/1010111010
is version of: http://data.ga-group.nl/ics/bics/1010111010
is version of: http://data.ga-group.nl/ics/bics/10101110
imported on: 2026-06-08T13:03:47.798Z
last refreshed on: 2026-06-08T13:03:47.798Z
source accessed on: 2019-12-03T20:05:01Z
source last accessed on: 2019-12-03T20:05:01Z
label: Kabel-, Video-Services @de
label: Serviços de vídeo a cabo @pt
label: Services de vidéo par câble @fr
label: Servicio de video de cable @es
label: Servizi video via cavo @it
label: Услуги кабельного телевидения @ru
label: 有線影片服務 @zh-hant
label: 有线电视服务 @zh
label: 케이블 비디오 서비�� @ko
label: ｹｰﾌﾞﾙﾋﾞﾃﾞｵｻｰﾋﾞｽ @ja
definition: This industry subgroup includes companies that offer cable or satellite television access. Access is usually provided to the customer through a set-top box.
notation: 10101110
valid from: 2014-08-08
valid till: 2020-10-03

Wired Internet Services - Media
type: BicsLevel4SubIndustry
type: Classifier
type: NamedIndividual
is sub industry of: Cable & Satellite
is anachronous version of: http://data.ga-group.nl/ics/bics/1010111011
is contemporary version of: http://data.ga-group.nl/ics/bics/10101111
is replaced by: http://data.ga-group.nl/ics/bics/2020/1010111011
is version of: http://data.ga-group.nl/ics/bics/1010111011
is version of: http://data.ga-group.nl/ics/bics/10101111
imported on: 2026-06-08T13:03:47.798Z
last refreshed on: 2026-06-08T13:03:47.798Z
source accessed on: 2019-12-03T20:05:01Z
source last accessed on: 2019-12-03T20:05:01Z
label: Internetdienste, verkabelt - Medien @de
label: Serviços de internet com fio - Mídia @pt
label: Services Internet filaires - Médias @fr
label: Servicio de Internet alámbrico - medios @es
label: Servizi internet via cavo - Media @it
label: Услуги проводного интернета - СМИ @ru
label: 有線網路服務-媒體 @zh-hant
label: 有線ｲﾝﾀｰﾈｯﾄｻｰﾋﾞｽ -ﾒﾃﾞｨｱ @ja
label: 有线互联网服务-媒体 @zh
label: 유선 인터넷 서비스 - 미디어 @ko
definition: This industry subgroup includes cable companies that provide Internet and broadband services.
notation: 10101111
valid from: 2014-08-08
valid till: 2020-10-03

Wired Phone Services - Media
type: BicsLevel4SubIndustry
type: Classifier
type: NamedIndividual
is sub industry of: Cable & Satellite
is anachronous version of: http://data.ga-group.nl/ics/bics/1010111012
is contemporary version of: http://data.ga-group.nl/ics/bics/10101112
is replaced by: http://data.ga-group.nl/ics/bics/2020/1010111012
is version of: http://data.ga-group.nl/ics/bics/1010111012
is version of: http://data.ga-group.nl/ics/bics/10101112
imported on: 2026-06-08T13:03:47.798Z
last refreshed on: 2026-06-08T13:03:47.798Z
source accessed on: 2019-12-03T20:05:01Z
source last accessed on: 2019-12-03T20:05:01Z
label: Festnetztelefonie - Medien @de
label: Serviço de telefonia fixa - Mídia @pt
label: Services téléphoniques filaires - Médias @fr
label: Servicios de telefonía alámbrica - medios @es
label: Servizi telefono via cavo - Media @it
label: Услуги проводной телефонной связи - СМИ @ru
label: 固定電話ｻｰﾋﾞｽ -ﾒﾃﾞｨｱ @ja
label: 有線電話服務-媒體 @zh-hant
label: 有线电话服务-媒体 @zh
label: 유선 전화 서비스 - 미디어 @ko
definition: This industry subgroup includes cable companies that provide phone services.
notation: 10101112
valid from: 2014-08-08
valid till: 2020-10-03

Cable & Satellite
type: BicsLevel3Industry
type: Classifier
type: NamedIndividual
is industry of: Media
is anachronous version of: http://data.ga-group.nl/ics/bics/10101110
is contemporary version of: http://data.ga-group.nl/ics/bics/101011
is replaced by: http://data.ga-group.nl/ics/bics/2020/10101110
is version of: http://data.ga-group.nl/ics/bics/10101110
is version of: http://data.ga-group.nl/ics/bics/101011
imported on: 2026-06-08T13:03:47.798Z
last refreshed on: 2026-06-08T13:03:47.798Z
source accessed on: 2019-12-03T20:05:01Z
source last accessed on: 2019-12-03T20:05:01Z
label: Câble et Satellite @fr
label: Cable y satélite @es
label: Cabo e satélite @pt
label: Kabel & Satelliten @de
label: TV cavo e satellite @it
label: Каб. и спутн. ТВ @ru
label: 有線及衛星 @zh-hant
label: 有线与卫星 @zh
label: 케이블 & 위성 @ko
label: ｹｰﾌﾞﾙﾃﾚﾋﾞ･衛星放送 @ja
definition: This industry includes companies that provide subscription television services delivered by coaxial cable or receiving signals from a satellite dish. Cable companies may also provide Internet and phone service through a cable.
notation: 101011
valid from: 2014-08-08
valid till: 2020-10-03

Film Production (w/o Distr)
type: BicsLevel7Segment
type: Classifier
type: Discontinued
type: NamedIndividual
is level7 segment of: Film Production
is contemporary version of: http://data.ga-group.nl/ics/bics/10101210101010
is version of: http://data.ga-group.nl/ics/bics/10101210101010
imported on: 2026-06-08T13:03:47.798Z
last refreshed on: 2026-06-08T13:03:47.798Z
source accessed on: 2019-12-03T20:05:01Z
source last accessed on: 2019-12-03T20:05:01Z
label: Filmproduktion (ohne Vertrieb) @de
label: Produção de filmes (sem distr) @pt
label: Producción de películas (sin distribución) @es
label: Production de films (sans distrib) @fr
label: Produzione pellicole (sz distrib) @it
label: Кинопроизв. (без проката) @ru
label: 影片製作(不含發行) @zh-hant
label: 映画制作(配給を除く) @ja
label: 电影制作(不含发行) @zh
label: 영화 프로덕션(배급제외) @ko
definition: This segment includes companies that produce, but do not distribute, films.
notation: 10101210101010
valid from: 2014-08-08
valid till: 2020-10-03

Film Production (with Distr)
type: BicsLevel7Segment
type: Classifier
type: Discontinued
type: NamedIndividual
is level7 segment of: Film Production
is contemporary version of: http://data.ga-group.nl/ics/bics/10101210101011
is version of: http://data.ga-group.nl/ics/bics/10101210101011
imported on: 2026-06-08T13:03:47.798Z
last refreshed on: 2026-06-08T13:03:47.798Z
source accessed on: 2019-12-03T20:05:01Z
source last accessed on: 2019-12-03T20:05:01Z
label: Filmproduktion (mit Vertrieb) @de
label: Produção de filmes (com distr) @pt
label: Producción de películas (con distribución) @es
label: Production de films (avec distrib) @fr
label: Produzione pellicole (c/distrib) @it
label: Кинопроизв. (с прокатом) @ru
label: 影片製作(含發行) @zh-hant
label: 映画制作(含配給) @ja
label: 电影制作(含发行) @zh
label: 영화 프로덕션(배급포함) @ko
definition: This segment includes companies that produce and distribute films.
notation: 10101210101011
valid from: 2014-08-08
valid till: 2020-10-03

Film Production
type: BicsLevel6Segment
type: Classifier
type: NamedIndividual
is level6 segment of: Film & TV Production
is anachronous version of: http://data.ga-group.nl/ics/bics/10101210101010
is contemporary version of: http://data.ga-group.nl/ics/bics/101012101010
is replaced by: http://data.ga-group.nl/ics/bics/2020/10101210101010
is version of: http://data.ga-group.nl/ics/bics/10101210101010
is version of: http://data.ga-group.nl/ics/bics/101012101010
imported on: 2026-06-08T13:03:47.798Z
last refreshed on: 2026-06-08T13:03:47.798Z
source accessed on: 2019-12-03T20:05:01Z
source last accessed on: 2019-12-03T20:05:01Z
label: Filmproduktion @de
label: Produção de filmes @pt
label: Producción de películas @es
label: Production de films @fr
label: Produzione pellicole @it
label: Кинопроизводство @ru
label: 影片製作 @zh-hant
label: 映画制作 @ja
label: 电影制作 @zh
label: 영화 프로덕션 @ko
definition: This segment includes companies that produce, or produce and distribute, films.
notation: 101012101010
valid from: 2014-08-08
valid till: 2020-10-03

Cartoon & Animation Production
type: BicsLevel7Segment
type: Classifier
type: Discontinued
type: NamedIndividual
is level7 segment of: TV & Video Production
is contemporary version of: http://data.ga-group.nl/ics/bics/10101210101110
is version of: http://data.ga-group.nl/ics/bics/10101210101110
imported on: 2026-06-08T13:03:47.798Z
last refreshed on: 2026-06-08T13:03:47.798Z
source accessed on: 2019-12-03T20:05:01Z
source last accessed on: 2019-12-03T20:05:01Z
label: Cartoon- & Animationsproduktion @de
label: Prod bandes dessinées/dessins animés @fr
label: Prod de animação e desenho @pt
label: Producción de dibujos animados y otra animación @es
label: Produzione cartoni e animazione @it
label: Производство мультипликационных фильмов @ru
label: 卡通与动画制作 @zh
label: 卡通及動畫製作 @zh-hant
label: 만화 & 애니메이션 프로덕션 @ko
label: ｱﾆﾒ制作 @ja
definition: This segment includes companies that produce cartoons and animation for both movies and television shows.
notation: 10101210101110
valid from: 2014-08-08
valid till: 2020-10-03

Commercial Production
type: BicsLevel7Segment
type: Classifier
type: Discontinued
type: NamedIndividual
is level7 segment of: TV & Video Production
is contemporary version of: http://data.ga-group.nl/ics/bics/10101210101111
is version of: http://data.ga-group.nl/ics/bics/10101210101111
imported on: 2026-06-08T13:03:47.798Z
last refreshed on: 2026-06-08T13:03:47.798Z
source accessed on: 2019-12-03T20:05:01Z
source last accessed on: 2019-12-03T20:05:01Z
label: Produção comercial @pt
label: Producción de comerciales @es
label: Production de publicités @fr
label: Produzione commerciale @it
label: Werbungsendungproduktion @de
label: Коммерческое производство @ru
label: 商業節目製作 @zh-hant
label: 广告节目制作 @zh
label: 広告制作 @ja
label: 상업 프로덕션 @ko
definition: This segment includes companies that produce commercials for movies or television.
notation: 10101210101111
valid from: 2014-08-08
valid till: 2020-10-03

Music Video Production
type: BicsLevel7Segment
type: Classifier
type: Discontinued
type: NamedIndividual
is level7 segment of: TV & Video Production
is contemporary version of: http://data.ga-group.nl/ics/bics/10101210101112
is version of: http://data.ga-group.nl/ics/bics/10101210101112
imported on: 2026-06-08T13:03:47.798Z
last refreshed on: 2026-06-08T13:03:47.798Z
source accessed on: 2019-12-03T20:05:01Z
source last accessed on: 2019-12-03T20:05:01Z
label: Musikvideoproduktion @de
label: Produção vídeo de música @pt
label: Producción de videos musicales @es
label: Production de clips vidéos @fr
label: Produzione di video musicali @it
label: Производство видеофильмов @ru
label: 音乐视频制作 @zh
label: 音楽ﾋﾞﾃﾞｵ制作 @ja
label: 音樂帶製作 @zh-hant
label: 뮤직 비디오 프로덕션 @ko
definition: This segment includes companies that produce music videos.
notation: 10101210101112
valid from: 2014-08-08
valid till: 2020-10-03

TV Show Production
type: BicsLevel7Segment
type: Classifier
type: Discontinued
type: NamedIndividual
is level7 segment of: TV & Video Production
is contemporary version of: http://data.ga-group.nl/ics/bics/10101210101113
is version of: http://data.ga-group.nl/ics/bics/10101210101113
imported on: 2026-06-08T13:03:47.798Z
last refreshed on: 2026-06-08T13:03:47.798Z
source accessed on: 2019-12-03T20:05:01Z
source last accessed on: 2019-12-03T20:05:01Z
label: Fernsehshowproduktion @de
label: Produção de programa de TV @pt
label: Producción de programas de televisión @es
label: Production d'émissions TV @fr
label: Produzioni spettacoli televisivi @it
label: TV 쇼 프로덕션 @ko
label: Производство телевизионных шоу @ru
label: 电视节目制作 @zh
label: 電視節目製作 @zh-hant
label: ﾃﾚﾋﾞ番組制作 @ja
definition: This segment includes companies that produce television and serialized programming.
notation: 10101210101113
valid from: 2014-08-08
valid till: 2020-10-03

TV & Video Production
type: BicsLevel6Segment
type: Classifier
type: NamedIndividual
is level6 segment of: Film & TV Production
is anachronous version of: http://data.ga-group.nl/ics/bics/10101210101011
is contemporary version of: http://data.ga-group.nl/ics/bics/101012101011
is replaced by: http://data.ga-group.nl/ics/bics/2020/10101210101011
is version of: http://data.ga-group.nl/ics/bics/10101210101011
is version of: http://data.ga-group.nl/ics/bics/101012101011
imported on: 2026-06-08T13:03:47.798Z
last refreshed on: 2026-06-08T13:03:47.798Z
source accessed on: 2019-12-03T20:05:01Z
source last accessed on: 2019-12-03T20:05:01Z
label: Produção de vídeo e tv @pt
label: Producción de televisión y video @es
label: Production TV et vidéo @fr
label: Produzione TV e video @it
label: TV & 비디오 프로덕션 @ko
label: TV- & Videoproduktion @de
label: Теле- и видео производство @ru
label: 电视与视频制作 @zh
label: 電視及影音製作 @zh-hant
label: ﾃﾚﾋﾞ番組･ﾋﾞﾃﾞｵ制作 @ja
definition: This segment includes companies that produce television programs and other videos.
notation: 101012101011
valid from: 2014-08-08
valid till: 2020-10-03

Film & TV Production
type: BicsLevel5Segment
type: Classifier
type: NamedIndividual
is level5 segment of: Film & TV Production & Distr
is anachronous version of: http://data.ga-group.nl/ics/bics/101012101010
is contemporary version of: http://data.ga-group.nl/ics/bics/1010121010
is replaced by: http://data.ga-group.nl/ics/bics/2020/101012101010
is version of: http://data.ga-group.nl/ics/bics/101012101010
is version of: http://data.ga-group.nl/ics/bics/1010121010
imported on: 2026-06-08T13:03:47.798Z
last refreshed on: 2026-06-08T13:03:47.798Z
source accessed on: 2019-12-03T20:05:01Z
source last accessed on: 2019-12-03T20:05:01Z
label: Film- & TV-Produktion @de
label: Produção de filmes e TV @pt
label: Producción de películas y televisión @es
label: Production de films et TV @fr
label: Produzione pellicole e TV @it
label: Кино- и ТВ производ��тво @ru
label: 影片及電視製作 @zh-hant
label: 映画･ﾋﾞﾃﾞｵ制作 @ja
label: 电影与电视制作 @zh
label: 영화 & TV 프로덕션 @ko
definition: This segment includes companies that produce, or produce and distribute, film, videos, television programs or television commercials.
notation: 1010121010
valid from: 2014-08-08
valid till: 2020-10-03

Film Distribution
type: BicsLevel6Segment
type: Classifier
type: NamedIndividual
is level6 segment of: Film & Video Distribution
is anachronous version of: http://data.ga-group.nl/ics/bics/10101210101110
is contemporary version of: http://data.ga-group.nl/ics/bics/101012101110
is replaced by: http://data.ga-group.nl/ics/bics/2020/10101210101110
is version of: http://data.ga-group.nl/ics/bics/10101210101110
is version of: http://data.ga-group.nl/ics/bics/101012101110
imported on: 2026-06-08T13:03:47.798Z
last refreshed on: 2026-06-08T13:03:47.798Z
source accessed on: 2019-12-03T20:05:01Z
source last accessed on: 2019-12-03T20:05:01Z
label: Distribución de películas @es
label: Distribuição de filmes @pt
label: Distribution de films @fr
label: Distribuzione pellicole @it
label: Filmvertrieb @de
label: Кинопрокат @ru
label: 影片發行 @zh-hant
label: 映画配給 @ja
label: 电影发行 @zh
label: 영화 배급 @ko
definition: This segment includes companies that acquire film distribution rights and distribute videotapes, DVDs and other formats to movie theaters, television networks and TV stations.
notation: 101012101110
valid from: 2014-08-08
valid till: 2020-10-03

TV Show Syndication
type: BicsLevel6Segment
type: Classifier
type: NamedIndividual
is level6 segment of: Film & Video Distribution
is anachronous version of: http://data.ga-group.nl/ics/bics/10101210101111
is contemporary version of: http://data.ga-group.nl/ics/bics/101012101111
is replaced by: http://data.ga-group.nl/ics/bics/2020/10101210101111
is version of: http://data.ga-group.nl/ics/bics/10101210101111
is version of: http://data.ga-group.nl/ics/bics/101012101111
imported on: 2026-06-08T13:03:47.798Z
last refreshed on: 2026-06-08T13:03:47.798Z
source accessed on: 2019-12-03T20:05:01Z
source last accessed on: 2019-12-03T20:05:01Z
label: Consórcio de programa de TV @pt
label: Fernsehshowsyndikation @de
label: Sindicación de programas de televisión @es
label: Syndication TV @fr
label: TV 쇼 신디케이션 @ko
label: Vendita serie TV @it
label: Распространение телешоу на постанц. основе @ru
label: 独立系ﾃﾚﾋﾞ番組制作 @ja
label: 电视节目联合供应 @zh
label: 電視節目聯合供應 @zh-hant
definition: This segment includes companies that acquire TV show distribution rights and distribute to television networks and stations.
notation: 101012101111
valid from: 2014-08-08
valid till: 2020-10-03

Film & Video Distribution
type: BicsLevel5Segment
type: Classifier
type: NamedIndividual
is level5 segment of: Film & TV Production & Distr
is anachronous version of: http://data.ga-group.nl/ics/bics/101012101011
is contemporary version of: http://data.ga-group.nl/ics/bics/1010121011
is replaced by: http://data.ga-group.nl/ics/bics/2020/101012101011
is version of: http://data.ga-group.nl/ics/bics/101012101011
is version of: http://data.ga-group.nl/ics/bics/1010121011
imported on: 2026-06-08T13:03:47.798Z
last refreshed on: 2026-06-08T13:03:47.798Z
source accessed on: 2019-12-03T20:05:01Z
source last accessed on: 2019-12-03T20:05:01Z
label: Distribución de película y video @es
label: Distribuição de filme e vídeo @pt
label: Distribution de films et vidéo @fr
label: Distribuzione pellicole e video @it
label: Film- & Videovertrieb @de
label: Кино- и видео прокат @ru
label: 影片及影音發行 @zh-hant
label: 映画･ﾋﾞﾃﾞｵ配給 @ja
label: 电影与视频发行 @zh
label: 영화 & 비디오 배급 @ko
definition: This segment includes companies that acquire video distribution rights and distribute film, videotapes, DVDs and other formats to movie theaters, television networks and TV stations.
notation: 1010121011
valid from: 2014-08-08
valid till: 2020-10-03

Other Film & Video Production
type: BicsLevel5Segment
type: Classifier
type: Discontinued
type: NamedIndividual
is level5 segment of: Film & TV Production & Distr
is contemporary version of: http://data.ga-group.nl/ics/bics/1010121012
is version of: http://data.ga-group.nl/ics/bics/1010121012
imported on: 2026-06-08T13:03:47.798Z
last refreshed on: 2026-06-08T13:03:47.798Z
source accessed on: 2019-12-03T20:05:01Z
source last accessed on: 2019-12-03T20:05:01Z
label: Autres productions de films et vidéo @fr
label: Distribuzione altre pellicole e video @it
label: Otra producción de películas y de videos @es
label: Outras produções de vídeo e filmes @pt
label: Sonstige Film- & Videoproduktion @de
label: Др. кино- и видео-продукция @ru
label: その他映画･ﾋﾞﾃﾞｵ制作 @ja
label: 其他影片及影音製作 @zh-hant
label: 其他电影与视频制作 @zh
label: 기타 영화 & 비디오 프로덕션 @ko
definition: This segment includes companies that provide film and video services not elsewhere classified.
notation: 1010121012
valid from: 2014-08-08
valid till: 2020-10-03

Teleprod & Postprod Services
type: BicsLevel5Segment
type: Classifier
type: NamedIndividual
is level5 segment of: Film & TV Production & Distr
is anachronous version of: http://data.ga-group.nl/ics/bics/101012101012
is contemporary version of: http://data.ga-group.nl/ics/bics/1010121013
is replaced by: http://data.ga-group.nl/ics/bics/2020/101012101012
is version of: http://data.ga-group.nl/ics/bics/101012101012
is version of: http://data.ga-group.nl/ics/bics/1010121013
imported on: 2026-06-08T13:03:47.798Z
last refreshed on: 2026-06-08T13:03:47.798Z
source accessed on: 2019-12-03T20:05:01Z
source last accessed on: 2019-12-03T20:05:01Z
label: Fernsehprod. & Nachbearbeitungsdienste @de
label: Serviços de teleprodução pós prod @pt
label: Services de téléprod et postproduction @fr
label: Servicios de tele producción y post producción @es
label: Servizi teleprod e postprod @it
label: Телепроизв. и проч. монтажн. услуги @ru
label: 影像制作及后期制作服务 @zh
label: 影像製作及後製服務 @zh-hant
label: 番組制作及び編集ｻｰﾋﾞ�� @ja
label: 영상제작 & 영상물 편집 서비스업 @ko
definition: This segment includes companies that provide teleproduction and postproduction services for film and TV. Includes editing film and adding titling, subtitling, credits and closed captioning.
notation: 1010121013
valid from: 2014-08-08
valid till: 2020-10-03

Film & TV Production & Distr
type: BicsLevel4SubIndustry
type: Classifier
type: NamedIndividual
is sub industry of: Entertainment Content
is anachronous version of: http://data.ga-group.nl/ics/bics/1010121010
is contemporary version of: http://data.ga-group.nl/ics/bics/10101210
is replaced by: http://data.ga-group.nl/ics/bics/2020/1010121010
is version of: http://data.ga-group.nl/ics/bics/1010121010
is version of: http://data.ga-group.nl/ics/bics/10101210
imported on: 2026-06-08T13:03:47.798Z
last refreshed on: 2026-06-08T13:03:47.798Z
source accessed on: 2019-12-03T20:05:01Z
source last accessed on: 2019-12-03T20:05:01Z
label: Film- & TV-Produktion & -Vertrieb @de
label: Prod et distrib de films et TV @fr
label: Produção e distr de filmes e TV @pt
label: Producción y distribución de películas y televisión @es
label: Produzione e distrib pellicole e TV @it
label: Кино- и ТВ произв. и прокат @ru
label: 影片及電視製作及發行 @zh-hant
label: 映画･ﾃﾚﾋﾞ制作､配給 @ja
label: 电影与电视制作及发行 @zh
label: 영화 & TV 프로덕션 & 배급 @ko
definition: This industry subgroup includes companies that produce, or produce and distribute, film, videos, television programs or television commercials.
notation: 10101210
valid from: 2014-08-08
valid till: 2020-10-03

Adv Rev - Cable Networks
type: BicsLevel6Segment
type: Classifier
type: NamedIndividual
is level6 segment of: Cable Networks
is anachronous version of: http://data.ga-group.nl/ics/bics/10101210111010
is contemporary version of: http://data.ga-group.nl/ics/bics/101012111010
is replaced by: http://data.ga-group.nl/ics/bics/2020/10101210111010
is version of: http://data.ga-group.nl/ics/bics/10101210111010
is version of: http://data.ga-group.nl/ics/bics/101012111010
imported on: 2026-06-08T13:03:47.798Z
last refreshed on: 2026-06-08T13:03:47.798Z
source accessed on: 2019-12-03T20:05:01Z
source last accessed on: 2019-12-03T20:05:01Z
label: Ingreso de publicidad-redes de cable @es
label: Rec prop - Redes a cabo @pt
label: Rev pub-réseaux de c��ble @fr
label: Ric pubb - Reti via cavo @it
label: Werbeerlös - Kabelnetze @de
label: Рекл. врчк - кабельные сети @ru
label: 广告收入-有线网络 @zh
label: 広告売上高-ｹｰﾌﾞﾙ･ﾈｯﾄﾜｰｸ @ja
label: 廣告收入-有線網路 @zh-hant
label: 광고 수익 - 케이블 네트워크 @ko
definition: This segment includes revenue that cable networks generate from advertising.
notation: 101012111010
valid from: 2014-08-08
valid till: 2020-10-03

Other Rev - Cable Networks
type: BicsLevel6Segment
type: Classifier
type: NamedIndividual
is level6 segment of: Cable Networks
is anachronous version of: http://data.ga-group.nl/ics/bics/10101210111011
is contemporary version of: http://data.ga-group.nl/ics/bics/101012111011
is replaced by: http://data.ga-group.nl/ics/bics/2020/10101210111011
is version of: http://data.ga-group.nl/ics/bics/10101210111011
is version of: http://data.ga-group.nl/ics/bics/101012111011
imported on: 2026-06-08T13:03:47.798Z
last refreshed on: 2026-06-08T13:03:47.798Z
source accessed on: 2019-12-03T20:05:01Z
source last accessed on: 2019-12-03T20:05:01Z
label: Altri ric - Reti via cavo @it
label: Autres rev- Réseaux de câble @fr
label: Otro ing-redes de cable @es
label: Out rec- Redes a cabo @pt
label: Sonstiger Erlös - Kabelnetze @de
label: Пр. выручка - кабельные сети @ru
label: その他売上高-ｹｰﾌﾞﾙ･ﾈｯﾄﾜｰｸ @ja
label: 其他收入-有線網路 @zh-hant
label: 其他收入-有线网络 @zh
label: 기타 수익 - 케이블 네트워크 @ko
definition: This segment includes revenue that cable networks generate from other than advertising.
notation: 101012111011
valid from: 2014-08-08
valid till: 2020-10-03

Cable Networks
type: BicsLevel5Segment
type: Classifier
type: NamedIndividual
is level5 segment of: TV Media Networks
is anachronous version of: http://data.ga-group.nl/ics/bics/101012101110
is contemporary version of: http://data.ga-group.nl/ics/bics/1010121110
is replaced by: http://data.ga-group.nl/ics/bics/2020/101012101110
is version of: http://data.ga-group.nl/ics/bics/101012101110
is version of: http://data.ga-group.nl/ics/bics/1010121110
imported on: 2026-06-08T13:03:47.798Z
last refreshed on: 2026-06-08T13:03:47.798Z
source accessed on: 2019-12-03T20:05:01Z
source last accessed on: 2019-12-03T20:05:01Z
label: Canali TV via caco @it
label: Kabelnetze @de
label: Réseaux de câble @fr
label: Redes a cabo @pt
label: Redes de cable @es
label: Кабельные сети @ru
label: 有線網路 @zh-hant
label: 有线网络 @zh
label: 케이블 네트워크 @ko
label: ｹｰﾌﾞﾙ･ﾈｯﾄﾜｰｸ @ja
definition: This segment includes companies that aggregate, market and distribute television programs to cable companies, satellite companies and wireline telecommunications companies. These cable networks negotiate with local and international distributors for broadcasting of the programming on a subscription or fee basis. Typically, the programming content would be viewed on branded cable TV channels.
notation: 1010121110
valid from: 2014-08-08
valid till: 2020-10-03

Adv Rev - TV Broadcast Netw
type: BicsLevel6Segment
type: Classifier
type: NamedIndividual
is level6 segment of: TV Broadcast Networks
is anachronous version of: http://data.ga-group.nl/ics/bics/10101210111110
is contemporary version of: http://data.ga-group.nl/ics/bics/101012111110
is replaced by: http://data.ga-group.nl/ics/bics/2020/10101210111110
is version of: http://data.ga-group.nl/ics/bics/10101210111110
is version of: http://data.ga-group.nl/ics/bics/101012111110
imported on: 2026-06-08T13:03:47.798Z
last refreshed on: 2026-06-08T13:03:47.798Z
source accessed on: 2019-12-03T20:05:01Z
source last accessed on: 2019-12-03T20:05:01Z
label: Ing an - estación de tv @es
label: Rec prop - Redes transm televisiva @pt
label: Rev de pub - Réseau de diffusion télé @fr
label: Ric pub-rete TV @it
label: Werbeerlös - TV Rundfunknetzwerke @de
label: Рекл. выручка - Сети телевещания @ru
label: 广告收入-电视广播网络 @zh
label: 広告売上高 - ﾃﾚﾋﾞ放送ﾈｯﾄﾜｰｸ @ja
label: 廣告收入-電視播放網路 @zh-hant
label: 광고수익-TV 방송국 네트워크 @ko
definition: This segment includes revenue that TV broadcast networks generates from advertising.
notation: 101012111110
valid from: 2014-08-08
valid till: 2020-10-03

Other Rev - TV Broadcast Netw
type: BicsLevel6Segment
type: Classifier
type: NamedIndividual
is level6 segment of: TV Broadcast Networks
is anachronous version of: http://data.ga-group.nl/ics/bics/10101210111111
is contemporary version of: http://data.ga-group.nl/ics/bics/101012111111
is replaced by: http://data.ga-group.nl/ics/bics/2020/10101210111111
is version of: http://data.ga-group.nl/ics/bics/10101210111111
is version of: http://data.ga-group.nl/ics/bics/101012111111
imported on: 2026-06-08T13:03:47.798Z
last refreshed on: 2026-06-08T13:03:47.798Z
source accessed on: 2019-12-03T20:05:01Z
source last accessed on: 2019-12-03T20:05:01Z
label: Altri ric - Reti teletrasmissione @it
label: Autres rev - Rés diffusion TV @fr
label: Otro ingreso - retransmisión de televisión @es
label: Outras rec - Redes transmissão TV @pt
label: Sonst. Erlös - Fernsehübertragungsnetze @de
label: Пр. выручка -сети телевещ. @ru
label: その他収入- ﾃﾚﾋﾞ放送ﾈｯﾄﾜｰｸ @ja
label: 其他收入-电视广播网络 @zh
label: 其他收入-電視播放網路 @zh-hant
label: 기타 수익 - TV 방송국 네트워크 @ko
definition: This segment includes revenue that TV broadcast networks generate from other than advertising.
notation: 101012111111
valid from: 2014-08-08
valid till: 2020-10-03

TV Broadcast Networks
type: BicsLevel5Segment
type: Classifier
type: NamedIndividual
is level5 segment of: TV Media Networks
is anachronous version of: http://data.ga-group.nl/ics/bics/101012101111
is contemporary version of: http://data.ga-group.nl/ics/bics/1010121111
is replaced by: http://data.ga-group.nl/ics/bics/2020/101012101111
is version of: http://data.ga-group.nl/ics/bics/101012101111
is version of: http://data.ga-group.nl/ics/bics/1010121111
imported on: 2026-06-08T13:03:47.798Z
last refreshed on: 2026-06-08T13:03:47.798Z
source accessed on: 2019-12-03T20:05:01Z
source last accessed on: 2019-12-03T20:05:01Z
label: Estaciones de tv @es
label: Réseaux de diffusion TV @fr
label: Redes transmissão televisiva @pt
label: Reti trasmissione TV @it
label: TV Rundfunknetzwerke @de
label: TV 방송국 네트워크 @ko
label: Сети телевещания @ru
label: 电视广播网络 @zh
label: 電視播放網路 @zh-hant
label: ﾃﾚﾋﾞ放送ﾈｯﾄﾜｰｸ @ja
definition: This segment includes companies that aggregate, market and distribute television programs to affiliate TV broadcasting stations. These TV broadcasting stations in turn transmit the programming material to viewers over public airways. Typically, the programming content would be viewed on branded antenna TV channels.
notation: 1010121111
valid from: 2014-08-08
valid till: 2020-10-03

TV Media Networks
type: BicsLevel4SubIndustry
type: Classifier
type: NamedIndividual
is sub industry of: Entertainment Content
is anachronous version of: http://data.ga-group.nl/ics/bics/1010121011
is contemporary version of: http://data.ga-group.nl/ics/bics/10101211
is replaced by: http://data.ga-group.nl/ics/bics/2020/1010121011
is version of: http://data.ga-group.nl/ics/bics/1010121011
is version of: http://data.ga-group.nl/ics/bics/10101211
imported on: 2026-06-08T13:03:47.798Z
last refreshed on: 2026-06-08T13:03:47.798Z
source accessed on: 2019-12-03T20:05:01Z
source last accessed on: 2019-12-03T20:05:01Z
label: Estaciones de medios p/tv @es
label: Redes mídia televisiva @pt
label: Reti media TV @it
label: TV Mediennetzwerke @de
label: TV 미디어 네트워크 @ko
label: TV, médias, réseaux @fr
label: Сети ТВ-СМИ @ru
label: 电视媒体网络 @zh
label: 電視媒體網路 @zh-hant
label: ﾃﾚﾋﾞﾒﾃﾞｨｱﾈｯﾄﾜｰｸ @ja
definition: This industry subgroup includes companies that aggregate, market and distribute television programs to TV broadcasting stations, cable companies, satellite companies and wireline telecommunications companies. The programming is typically narrowcast in nature (e.g., limited format, such as news, sports, education, or youth-oriented). These establishments produce programming in their own facilities or acquire programming from external sources.
notation: 10101211
valid from: 2014-08-08
valid till: 2020-10-03

Integrated Record Prod & Distr
type: BicsLevel5Segment
type: Classifier
type: NamedIndividual
is level5 segment of: Music Production & Distribution
is anachronous version of: http://data.ga-group.nl/ics/bics/1010121110
is contemporary version of: http://data.ga-group.nl/ics/bics/1010121210
is replaced by: http://data.ga-group.nl/ics/bics/2020/1010121110
is version of: http://data.ga-group.nl/ics/bics/1010121110
is version of: http://data.ga-group.nl/ics/bics/1010121210
imported on: 2026-06-08T13:03:47.798Z
last refreshed on: 2026-06-08T13:03:47.798Z
source accessed on: 2019-12-03T20:05:01Z
source last accessed on: 2019-12-03T20:05:01Z
label: Integrierte Musikprod. & -vertrieb @de
label: Prod e dist de gravação integrada @pt
label: Prod e distrib registrazioni integrate @it
label: Prod int d'enregistrements et distrib @fr
label: Produc y distr grabación integr @es
label: Объед. запись и распрост. пластино�� @ru
label: 整合唱片製作及發行 @zh-hant
label: 総合ﾚｺｰﾄﾞ制作/配給 @ja
label: 综合录音制品制作与发行 @zh
label: 통합 음반 제작 & 배급 @ko
definition: This segment includes companies that release, promote and distribute sound recordings. These companies manufacture, or arrange for the manufacture of, recordings, such as audio tapes/cassettes and compact discs, and promote and distribute these products to wholesalers, retailers, or directly to the public. Companies in this segment produce master recordings themselves or obtain reproduction and distribution rights to master recordings produced by record production companies or other integrated record companies.
notation: 1010121210
valid from: 2014-08-08
valid till: 2020-10-03

Music Publishers
type: BicsLevel5Segment
type: Classifier
type: NamedIndividual
is level5 segment of: Music Production & Distribution
is anachronous version of: http://data.ga-group.nl/ics/bics/1010121111
is contemporary version of: http://data.ga-group.nl/ics/bics/1010121211
is replaced by: http://data.ga-group.nl/ics/bics/2020/1010121111
is version of: http://data.ga-group.nl/ics/bics/1010121111
is version of: http://data.ga-group.nl/ics/bics/1010121211
imported on: 2026-06-08T13:03:47.798Z
last refreshed on: 2026-06-08T13:03:47.798Z
source accessed on: 2019-12-03T20:05:01Z
source last accessed on: 2019-12-03T20:05:01Z
label: Editeurs de musique @fr
label: Editoras de música @es
label: Editori di musica @it
label: Musikverleger @de
label: Издатели муз. произведений @ru
label: 音乐出版商 @zh
label: 音楽出版業 @ja
label: 音樂出版 @zh-hant
label: 음반 제작업 @ko
definition: This segment includes companies that acquire and register copyrights for musical compositions, and promote and authorize the use of these compositions in recordings, radio, television, motion pictures, live performances, print or other media. Companies in this segment represent the interests of the songwriter or other owners of musical compositions to produce revenues from the use of such works, generally through licensing agreements. These companies may own the copyright or act as administrator of the music copyrights on behalf of copyright owners. Publishers of music books and sheet music are included in this segment.
notation: 1010121211
valid from: 2014-08-08
valid till: 2020-10-03

Record Production
type: BicsLevel5Segment
type: Classifier
type: NamedIndividual
is level5 segment of: Music Production & Distribution
is anachronous version of: http://data.ga-group.nl/ics/bics/1010121112
is contemporary version of: http://data.ga-group.nl/ics/bics/1010121212
is replaced by: http://data.ga-group.nl/ics/bics/2020/1010121112
is version of: http://data.ga-group.nl/ics/bics/1010121112
is version of: http://data.ga-group.nl/ics/bics/1010121212
imported on: 2026-06-08T13:03:47.798Z
last refreshed on: 2026-06-08T13:03:47.798Z
source accessed on: 2019-12-03T20:05:01Z
source last accessed on: 2019-12-03T20:05:01Z
label: Musikproduktion @de
label: Prod. enreg. sonore @fr
label: Produção de disco @pt
label: Producción de discos @es
label: Produzione di dischi @it
label: Запись пластинок @ru
label: 唱片製作 @zh-hant
label: 录制产品制作 @zh
label: 음반 제작업 @ko
label: ﾚｺｰﾄﾞ制作業 @ja
definition: This segment includes companies that produce records, such as tapes and compact discs. These companies contract with artists and arrange and finance the production of original master recordings. These companies also hold the copyright to the master recording and derive most of their revenues from the sales, leasing and licensing of master recordings. Such companies do not have their own duplication or distribution capabilities.
notation: 1010121212
valid from: 2014-08-08
valid till: 2020-10-03

Sound Recording Studios
type: BicsLevel5Segment
type: Classifier
type: Discontinued
type: NamedIndividual
is level5 segment of: Music Production & Distribution
is contemporary version of: http://data.ga-group.nl/ics/bics/1010121213
is version of: http://data.ga-group.nl/ics/bics/1010121213
imported on: 2026-06-08T13:03:47.798Z
last refreshed on: 2026-06-08T13:03:47.798Z
source accessed on: 2019-12-03T20:05:01Z
source last accessed on: 2019-12-03T20:05:01Z
label: Estúdios de gravação de músicas @pt
label: Estudios de grabación del sonido @es
label: Studi di registrazione @it
label: Studios d'enregistrement sonore @fr
label: Tonaufnahmenstudios @de
label: Студии звукозаписи @ru
label: 录音棚 @zh
label: 錄音室 @zh-hant
label: 録音ｽﾀｼﾞｵ業 @ja
label: 녹음시설 운영업 @ko
definition: This segment includes companies that provide the facilities and technical expertise for sound recording in a studio. These companies provide audio production and postproduction services to produce master recordings. They may provide audio services for film, television and video productions.
notation: 1010121213
valid from: 2014-08-08
valid till: 2020-10-03

Music Production & Distribution
type: BicsLevel4SubIndustry
type: Classifier
type: NamedIndividual
is sub industry of: Entertainment Content
is anachronous version of: http://data.ga-group.nl/ics/bics/10101211
is contemporary version of: http://data.ga-group.nl/ics/bics/10101212
is replaced by: http://data.ga-group.nl/ics/bics/2020/10101211
is version of: http://data.ga-group.nl/ics/bics/10101211
is version of: http://data.ga-group.nl/ics/bics/10101212
imported on: 2026-06-08T13:03:47.798Z
last refreshed on: 2026-06-08T13:03:47.798Z
source accessed on: 2019-12-03T20:05:01Z
source last accessed on: 2019-12-03T20:05:01Z
label: Musikproduktion & -vertrieb @de
label: Produção e distribuição de música @pt
label: Producción y distribución de música @es
label: Production et distribution de musique @fr
label: Produzione e distribuzione musica @it
label: Музыка: производс��во и распространение @ru
label: 音乐制作与发行 @zh
label: 音楽制作･配給 @ja
label: 音樂製作及發行 @zh-hant
label: 음반 제작 & 배급 @ko
definition: This industry subgroup includes companies that acquire distribution rights and distribute music productions.
notation: 10101212
valid from: 2014-08-08
valid till: 2020-10-03

Royalty Income - Media
type: BicsLevel4SubIndustry
type: Classifier
type: NamedIndividual
is sub industry of: Entertainment Content
is anachronous version of: http://data.ga-group.nl/ics/bics/1010121012
is contemporary version of: http://data.ga-group.nl/ics/bics/10101213
is replaced by: http://data.ga-group.nl/ics/bics/2020/1010121012
is version of: http://data.ga-group.nl/ics/bics/1010121012
is version of: http://data.ga-group.nl/ics/bics/10101213
imported on: 2026-06-08T13:03:47.798Z
last refreshed on: 2026-06-08T13:03:47.798Z
source accessed on: 2019-12-03T20:05:01Z
source last accessed on: 2019-12-03T20:05:01Z
label: Ingr regalías-Medios @es
label: Lizenzertrag- Medien @de
label: Redd concess-Media @it
label: Renda de Royalties-Mídia @pt
label: Royalties - Média @fr
label: Лицензионные поступления - СМИ @ru
label: 权利金收入- 媒体 @zh
label: 權利金收入 - 媒體 @zh-hant
label: 로열티수입-미디어 @ko
label: ﾛｲﾔﾙﾃｨ収入-ﾒﾃﾞｨｱ @ja
definition: This industry subgroup includes companies that generate revenue from their rights to assets (such as trademarks, brand names and/or agreements) for which a royalty payment or licensing fee is paid by others.
notation: 10101213
valid from: 2014-08-08
valid till: 2020-10-03

Entertainment Content
type: BicsLevel3Industry
type: Classifier
type: NamedIndividual
is industry of: Media
is contemporary version of: http://data.ga-group.nl/ics/bics/101012
is replaced by: http://data.ga-group.nl/ics/bics/2020/101012
is version of: http://data.ga-group.nl/ics/bics/101012
imported on: 2026-06-08T13:03:47.798Z
last refreshed on: 2026-06-08T13:03:47.798Z
source accessed on: 2019-12-03T20:05:01Z
source last accessed on: 2019-12-03T20:05:01Z
label: Conteúdo entretenimento @pt
label: Contenido entretenimiento @es
label: Contenus de divertissement @fr
label: Contenuto intrattenimento @it
label: Unterhaltungsinhalt @de
label: Развлекательное содерж. @ru
label: 娛樂內容 @zh-hant
label: 娯楽ｺﾝﾃﾝﾂ @ja
label: 娱乐内容 @zh
label: 엔터테인먼트 콘텐츠 @ko
definition: This industry includes companies that create content or acquire the right to distribute content and sell advertising over cable or broadcast media, such as television or radio. Entertainment content includes entertainment programs, news, sports, and educational and children's television programming, as well as the creation of music. Excludes content distributed via the Internet (see Internet Media).
notation: 101012
valid from: 2014-08-08
valid till: 2020-10-03

Dictionary & Ency Publishers
type: BicsLevel6Segment
type: Classifier
type: Discontinued
type: NamedIndividual
is level6 segment of: Book Publishers
is contemporary version of: http://data.ga-group.nl/ics/bics/101013101010
is version of: http://data.ga-group.nl/ics/bics/101013101010
imported on: 2026-06-08T13:03:47.798Z
last refreshed on: 2026-06-08T13:03:47.798Z
source accessed on: 2019-12-03T20:05:01Z
source last accessed on: 2019-12-03T20:05:01Z
label: Editeurs d'encyclopédies et dicos @fr
label: Editori dizionari e encicl @it
label: Editoriales diccionarios e enciclop @es
label: Publicadores de dicionário e encicl @pt
label: Verl. von Wörterbüchern & Enzyklopädien @de
label: Издат. словарей и энциклоп. @ru
label: 字典与百科全书出版社 @zh
label: 字典及百科全書出版社 @zh-hant
label: 辞書･百科事典出版 @ja
label: 사전 & 백과사전 출판사 @ko
definition: This segment includes companies that publish dictionaries and encyclopedias.
notation: 101013101010
valid from: 2014-08-08
valid till: 2020-10-03

Fiction Book Publishers
type: BicsLevel6Segment
type: Classifier
type: Discontinued
type: NamedIndividual
is level6 segment of: Book Publishers
is contemporary version of: http://data.ga-group.nl/ics/bics/101013101011
is version of: http://data.ga-group.nl/ics/bics/101013101011
imported on: 2026-06-08T13:03:47.798Z
last refreshed on: 2026-06-08T13:03:47.798Z
source accessed on: 2019-12-03T20:05:01Z
source last accessed on: 2019-12-03T20:05:01Z
label: Editeurs de livre de fiction @fr
label: Editoras de libros de ficción @es
label: Editoras de livros de ficção @pt
label: Editoria - narrativa @it
label: Verlag für Bellestrik @de
label: Издатели художественной литературы @ru
label: 小說出版社 @zh-hant
label: 小説書籍出版 @ja
label: 小说出版社 @zh
label: 소설 서적 출판사 @ko
definition: This segment includes companies that publish fiction books.
notation: 101013101011
valid from: 2014-08-08
valid till: 2020-10-03

Nonfiction Book Publishers
type: BicsLevel6Segment
type: Classifier
type: Discontinued
type: NamedIndividual
is level6 segment of: Book Publishers
is contemporary version of: http://data.ga-group.nl/ics/bics/101013101012
is version of: http://data.ga-group.nl/ics/bics/101013101012
imported on: 2026-06-08T13:03:47.798Z
last refreshed on: 2026-06-08T13:03:47.798Z
source accessed on: 2019-12-03T20:05:01Z
source last accessed on: 2019-12-03T20:05:01Z
label: Editeurs de livres non fiction @fr
label: Editoras de libros de no ficción @es
label: Editoras de livros não ficção @pt
label: Editoria - saggistica @it
label: Verlag für Sachbücher @de
label: Издатели документальной и научной литературы @ru
label: 非小說出版社 @zh-hant
label: 非小说出版社 @zh
label: 비소설 서적 출판사 @ko
label: ﾉﾝﾌｨｸｼｮﾝ書籍出版 @ja
definition: This segment includes companies that publish nonfiction books.
notation: 101013101012
valid from: 2014-08-08
valid till: 2020-10-03

Professional Book Publishers
type: BicsLevel6Segment
type: Classifier
type: NamedIndividual
is level6 segment of: Book Publishers
is anachronous version of: http://data.ga-group.nl/ics/bics/101013101010
is contemporary version of: http://data.ga-group.nl/ics/bics/101013101013
is replaced by: http://data.ga-group.nl/ics/bics/2020/101013101010
is version of: http://data.ga-group.nl/ics/bics/101013101010
is version of: http://data.ga-group.nl/ics/bics/101013101013
imported on: 2026-06-08T13:03:47.798Z
last refreshed on: 2026-06-08T13:03:47.798Z
source accessed on: 2019-12-03T20:05:01Z
source last accessed on: 2019-12-03T20:05:01Z
label: Editeurs de livres professionnels @fr
label: Editoras de libros profesionales @es
label: Editoras de livros profissionais @pt
label: Editoria - libri professionali @it
label: Verlag für Fachbücher @de
label: Издатели профессиональных книг @ru
label: 专业书籍出版社 @zh
label: 專業書籍出版社 @zh-hant
label: 業界専門書出版 @ja
label: 전문서적 출판사 @ko
definition: This segment includes companies that publish books used by specific professions.
notation: 101013101013
valid from: 2014-08-08
valid till: 2020-10-03

School Textbook Publishers
type: BicsLevel6Segment
type: Classifier
type: NamedIndividual
is level6 segment of: Book Publishers
is anachronous version of: http://data.ga-group.nl/ics/bics/101013101011
is contemporary version of: http://data.ga-group.nl/ics/bics/101013101014
is replaced by: http://data.ga-group.nl/ics/bics/2020/101013101011
is version of: http://data.ga-group.nl/ics/bics/101013101011
is version of: http://data.ga-group.nl/ics/bics/101013101014
imported on: 2026-06-08T13:03:47.798Z
last refreshed on: 2026-06-08T13:03:47.798Z
source accessed on: 2019-12-03T20:05:01Z
source last accessed on: 2019-12-03T20:05:01Z
label: Editeurs de livres scolaires @fr
label: Editoras de libros escolares @es
label: Editoras de livros acadêmicos @pt
label: Editoria - libri scolastici @it
label: Verlag für Schulbücher @de
label: Издатели школьных учебников @ru
label: 教科书出版社 @zh
label: 教科書出版 @ja
label: 教科書出版社 @zh-hant
label: 학교 교과서 출판사 @ko
definition: This segment includes companies that publish, design, edit and market school textbooks.
notation: 101013101014
valid from: 2014-08-08
valid till: 2020-10-03

Other Book Publishers
type: BicsLevel6Segment
type: Classifier
type: Discontinued
type: NamedIndividual
is level6 segment of: Book Publishers
is contemporary version of: http://data.ga-group.nl/ics/bics/101013101015
is version of: http://data.ga-group.nl/ics/bics/101013101015
imported on: 2026-06-08T13:03:47.798Z
last refreshed on: 2026-06-08T13:03:47.798Z
source accessed on: 2019-12-03T20:05:01Z
source last accessed on: 2019-12-03T20:05:01Z
label: Autres éditeurs de livres @fr
label: Editoras de otros libros @es
label: Editoras de outros livros @pt
label: Editoria - altri libri @it
label: Sonstige Buchverlage @de
label: Издатели прочих книг @ru
label: その他書籍出版 @ja
label: 其他书籍出版社 @zh
label: 其他書籍出版社 @zh-hant
label: 기타 서적 출판사 @ko
definition: This segment includes companies that publish other books not elsewhere classified, such as travel guides.
notation: 101013101015
valid from: 2014-08-08
valid till: 2020-10-03

Book Publishers
type: BicsLevel5Segment
type: Classifier
type: NamedIndividual
is level5 segment of: Publishing
is contemporary version of: http://data.ga-group.nl/ics/bics/1010131010
is replaced by: http://data.ga-group.nl/ics/bics/2020/1010131010
is version of: http://data.ga-group.nl/ics/bics/1010131010
imported on: 2026-06-08T13:03:47.798Z
last refreshed on: 2026-06-08T13:03:47.798Z
source accessed on: 2019-12-03T20:05:01Z
source last accessed on: 2019-12-03T20:05:01Z
label: Buchverlage @de
label: Editeurs de livres @fr
label: Editoras de livros @pt
label: Editoras @es
label: Editori di libri @it
label: Книгоиздательства @ru
label: 图书出版商 @zh
label: 書籍出版 @zh-hant
label: 書籍出版業 @ja
label: 서적 출판업 @ko
definition: This segment includes companies that publish and distribute books. These companies provide book design, editing and marketing activities.
notation: 1010131010
valid from: 2014-08-08
valid till: 2020-10-03

Advertising Rev - Newspaper
type: BicsLevel6Segment
type: Classifier
type: NamedIndividual
is level6 segment of: Newspaper Publishers
is contemporary version of: http://data.ga-group.nl/ics/bics/101013101110
is replaced by: http://data.ga-group.nl/ics/bics/2020/101013101110
is version of: http://data.ga-group.nl/ics/bics/101013101110
imported on: 2026-06-08T13:03:47.798Z
last refreshed on: 2026-06-08T13:03:47.798Z
source accessed on: 2019-12-03T20:05:01Z
source last accessed on: 2019-12-03T20:05:01Z
label: Ingreso de publicidad - periódico @es
label: Rec propaganda - Jornais @pt
label: Rev de publicité - Journaux @fr
label: Ric pubblicitari - Quotidiano @it
label: Werbeerlös - Zeitung @de
label: Рекламная выручка - газета @ru
label: 广告收入-报纸 @zh
label: 広告売上高-新聞 @ja
label: 廣告收入-報紙 @zh-hant
label: 광고 수익 - 신문 @ko
definition: This segment includes revenue that newspaper publishers generate from advertising.
notation: 101013101110
valid from: 2014-08-08
valid till: 2020-10-03

Circulation Rev - Newspaper
type: BicsLevel6Segment
type: Classifier
type: NamedIndividual
is level6 segment of: Newspaper Publishers
is contemporary version of: http://data.ga-group.nl/ics/bics/101013101111
is replaced by: http://data.ga-group.nl/ics/bics/2020/101013101111
is version of: http://data.ga-group.nl/ics/bics/101013101111
imported on: 2026-06-08T13:03:47.798Z
last refreshed on: 2026-06-08T13:03:47.798Z
source accessed on: 2019-12-03T20:05:01Z
source last accessed on: 2019-12-03T20:05:01Z
label: Auflagenerlös - Zeitung @de
label: Ingreso circulación - periódicos @es
label: Rec circulação - Jornais @pt
label: Rev de circulation - Journaux @fr
label: Ric circolazione - Quotidiano @it
label: Врчк от продажи тиража - газета @ru
label: 发行收入-报纸 @zh
label: 新聞売上高-新聞 @ja
label: 發行收入-報紙 @zh-hant
label: 발행 수익 - 신문 @ko
definition: This segment includes revenue that newspaper publishers generate from circulation.
notation: 101013101111
valid from: 2014-08-08
valid till: 2020-10-03

Other Revenue - Newspaper
type: BicsLevel6Segment
type: Classifier
type: NamedIndividual
is level6 segment of: Newspaper Publishers
is contemporary version of: http://data.ga-group.nl/ics/bics/101013101112
is replaced by: http://data.ga-group.nl/ics/bics/2020/101013101112
is version of: http://data.ga-group.nl/ics/bics/101013101112
imported on: 2026-06-08T13:03:47.798Z
last refreshed on: 2026-06-08T13:03:47.798Z
source accessed on: 2019-12-03T20:05:01Z
source last accessed on: 2019-12-03T20:05:01Z
label: Altri ricavi - Quotidiano @it
label: Autres revenus - Journaux @fr
label: Otro ingreso - periódicos @es
label: Outras receitas - Jornais @pt
label: Sonstiger Erlös - Zeitung @de
label: Прочая выручка - газета @ru
label: その他売上高 -新聞 @ja
label: 其他收入-報紙 @zh-hant
label: 其他收入-报纸 @zh
label: 기타 수익 - 신문 @ko
definition: This segment includes revenue that newspaper publishers generate from sources other than advertising and circulation.
notation: 101013101112
valid from: 2014-08-08
valid till: 2020-10-03

Newspaper Publishers
type: BicsLevel5Segment
type: Classifier
type: NamedIndividual
is level5 segment of: Publishing
is contemporary version of: http://data.ga-group.nl/ics/bics/1010131011
is replaced by: http://data.ga-group.nl/ics/bics/2020/1010131011
is version of: http://data.ga-group.nl/ics/bics/1010131011
imported on: 2026-06-08T13:03:47.798Z
last refreshed on: 2026-06-08T13:03:47.798Z
source accessed on: 2019-12-03T20:05:01Z
source last accessed on: 2019-12-03T20:05:01Z
label: Edit periódicos @es
label: Editeurs de journaux @fr
label: Editoras de jornais @pt
label: Editori quotidiani @it
label: Zeitungsverlage @de
label: Издатели газет @ru
label: 報紙出版 @zh-hant
label: 报业出版商 @zh
label: 新聞発行業 @ja
label: 신문 발행업 @ko
definition: This segment includes companies that produce and distribute newspapers. These companies gather news and write news columns, features stories and editorials, as well as sell and prepare advertisements.
notation: 1010131011
valid from: 2014-08-08
valid till: 2020-10-03

Advertising Rev - Periodical
type: BicsLevel6Segment
type: Classifier
type: NamedIndividual
is level6 segment of: Periodical Publishers
is contemporary version of: http://data.ga-group.nl/ics/bics/101013101210
is replaced by: http://data.ga-group.nl/ics/bics/2020/101013101210
is version of: http://data.ga-group.nl/ics/bics/101013101210
imported on: 2026-06-08T13:03:47.798Z
last refreshed on: 2026-06-08T13:03:47.798Z
source accessed on: 2019-12-03T20:05:01Z
source last accessed on: 2019-12-03T20:05:01Z
label: Ingreso de publicidad - periódico @es
label: Rec publicação - Periódicos @pt
label: Revenus de publicité - Périodiques @fr
label: Ric pubblicitari - Periodico @it
label: Werbeerlös - Zeitschrift @de
label: Рекламн. врчк - периодика @ru
label: 广告收入-期刊 @zh
label: 広告売上高-定期刊行物 @ja
label: 廣告收入-期刊 @zh-hant
label: 광고 수익 - 정기간행물 @ko
definition: This segment includes revenue that periodical publishers generate from advertising.
notation: 101013101210
valid from: 2014-08-08
valid till: 2020-10-03

Circulation Rev - Periodical
type: BicsLevel6Segment
type: Classifier
type: NamedIndividual
is level6 segment of: Periodical Publishers
is contemporary version of: http://data.ga-group.nl/ics/bics/101013101211
is replaced by: http://data.ga-group.nl/ics/bics/2020/101013101211
is version of: http://data.ga-group.nl/ics/bics/101013101211
imported on: 2026-06-08T13:03:47.798Z
last refreshed on: 2026-06-08T13:03:47.798Z
source accessed on: 2019-12-03T20:05:01Z
source last accessed on: 2019-12-03T20:05:01Z
label: Auflagenerlös - Zeitschrift @de
label: Ingreso circulación - periodicidad @es
label: Rec circulação - Periódicos @pt
label: Rev tirage - Périodiques @fr
label: Ric circolazione - Periodico @it
label: Врчк от прдж тиража - периодика @ru
label: 发行收入-期刊 @zh
label: 新聞売上高-定期刊行物出版 @ja
label: 發行收入-期刊 @zh-hant
label: 발행 수익 - 정기간행물 @ko
definition: This segment includes revenue that periodical publishers generate from circulation.
notation: 101013101211
valid from: 2014-08-08
valid till: 2020-10-03

Other Revenue - Periodical
type: BicsLevel6Segment
type: Classifier
type: NamedIndividual
is level6 segment of: Periodical Publishers
is contemporary version of: http://data.ga-group.nl/ics/bics/101013101212
is replaced by: http://data.ga-group.nl/ics/bics/2020/101013101212
is version of: http://data.ga-group.nl/ics/bics/101013101212
imported on: 2026-06-08T13:03:47.798Z
last refreshed on: 2026-06-08T13:03:47.798Z
source accessed on: 2019-12-03T20:05:01Z
source last accessed on: 2019-12-03T20:05:01Z
label: Altri ricavi - Periodico @it
label: Autres revenus - Périodiques @fr
label: Otro ingreso - periódico @es
label: Outras receitas - Periódicos @pt
label: Sonstiger Erlös - Zeitschrift @de
label: Прочая выручка - периодика @ru
label: その他売上高-定期刊行物 @ja
label: 其他收入-期刊 @zh
label: 기타 수익 - 정기간행물 @ko
definition: This segment includes revenue that periodical publishers generate from sources other than advertising and circulation.
notation: 101013101212
valid from: 2014-08-08
valid till: 2020-10-03

Periodical Publishers
type: BicsLevel5Segment
type: Classifier
type: NamedIndividual
is level5 segment of: Publishing
is contemporary version of: http://data.ga-group.nl/ics/bics/1010131012
is replaced by: http://data.ga-group.nl/ics/bics/2020/1010131012
is version of: http://data.ga-group.nl/ics/bics/1010131012
imported on: 2026-06-08T13:03:47.798Z
last refreshed on: 2026-06-08T13:03:47.798Z
source accessed on: 2019-12-03T20:05:01Z
source last accessed on: 2019-12-03T20:05:01Z
label: Editeurs de périodiques @fr
label: Editoras de periódicos @es
label: Editores de periódicos @pt
label: Editori di periodici @it
label: Herausgeber von Journalen @de
label: Издатели периодики @ru
label: 定期刊行物出版業 @ja
label: 期刊出版 @zh-hant
label: 期刊出版商 @zh
label: 정기간행물 발행업 @ko
definition: This segment includes companies that produce and distribute magazines as well as other periodicals. These companies gather, write and edit articles.
notation: 1010131012
valid from: 2014-08-08
valid till: 2020-10-03

Publishing
type: BicsLevel4SubIndustry
type: Classifier
type: NamedIndividual
is sub industry of: Publishing & Broadcasting
is contemporary version of: http://data.ga-group.nl/ics/bics/10101310
is replaced by: http://data.ga-group.nl/ics/bics/2020/10101310
is version of: http://data.ga-group.nl/ics/bics/10101310
imported on: 2026-06-08T13:03:47.798Z
last refreshed on: 2026-06-08T13:03:47.798Z
source accessed on: 2019-12-03T20:05:01Z
source last accessed on: 2019-12-03T20:05:01Z
label: Edition @fr
label: Editoria @it
label: Editorial @es
label: Publicação @pt
label: Verlagswesen @de
label: Полиграфия @ru
label: 出版 @ja
label: 出版業 @zh-hant
label: 출판 @ko
definition: This industry subgroup includes companies that produce and distribute printed media content such as newspapers, periodicals and books.
notation: 10101310
valid from: 2014-08-08
valid till: 2020-10-03

Adv Rev - Local TV Broadcast
type: BicsLevel6Segment
type: Classifier
type: NamedIndividual
is level6 segment of: Local TV Broadcasting
is contemporary version of: http://data.ga-group.nl/ics/bics/101013111010
is replaced by: http://data.ga-group.nl/ics/bics/2020/101013111010
is version of: http://data.ga-group.nl/ics/bics/101013111010
imported on: 2026-06-08T13:03:47.798Z
last refreshed on: 2026-06-08T13:03:47.798Z
source accessed on: 2019-12-03T20:05:01Z
source last accessed on: 2019-12-03T20:05:01Z
label: Ingreso de publicidad-transmisión de televisión local @es
label: Rec prop - Transmissão de TV local @pt
label: Rev pub - Télédiffusion locale @fr
label: Ric pubb - Trasmissione TV locale @it
label: Werbeerl. - Lokale Fernsehübertragung @de
label: Рекламн. врчк - местное телевещание @ru
label: 广告收入-地方电视广播 @zh
label: 広告売上高-地方ﾃﾚﾋﾞ放送 @ja
label: 廣告收入-地方電視播放 @zh-hant
label: 광고 수익 - 지역 TV 방송 @ko
definition: This segment includes revenue that television broadcasters generate from advertising.
notation: 101013111010
valid from: 2014-08-08
valid till: 2020-10-03

Other Rev - Local TV Broadcast
type: BicsLevel6Segment
type: Classifier
type: NamedIndividual
is level6 segment of: Local TV Broadcasting
is contemporary version of: http://data.ga-group.nl/ics/bics/101013111011
is replaced by: http://data.ga-group.nl/ics/bics/2020/101013111011
is version of: http://data.ga-group.nl/ics/bics/101013111011
imported on: 2026-06-08T13:03:47.798Z
last refreshed on: 2026-06-08T13:03:47.798Z
source accessed on: 2019-12-03T20:05:01Z
source last accessed on: 2019-12-03T20:05:01Z
label: Altri ric - Trasmissione TV locale @it
label: Autres rev - Télédiffusion locale @fr
label: Otro ingreso-retransmisión de televisión local @es
label: Out rec - Transmissão de TV local @pt
label: Sonst. Erl. - Lokale Fernsehübertragung @de
label: Пр. врчк - местное телевещание @ru
label: その他売上高-地方ﾃﾚﾋﾞ放送 @ja
label: 其他收入-地方电视广播 @zh
label: 其他收入-地方電視播放 @zh-hant
label: 기타 수익 - 지역 TV 방송 @ko
definition: This segment includes revenue that television broadcasters generate from sources other than advertising.
notation: 101013111011
valid from: 2014-08-08
valid till: 2020-10-03

Local TV Broadcasting
type: BicsLevel5Segment
type: Classifier
type: NamedIndividual
is level5 segment of: Local TV & Radio Broadcast
is contemporary version of: http://data.ga-group.nl/ics/bics/1010131110
is replaced by: http://data.ga-group.nl/ics/bics/2020/1010131110
is version of: http://data.ga-group.nl/ics/bics/1010131110
imported on: 2026-06-08T13:03:47.798Z
last refreshed on: 2026-06-08T13:03:47.798Z
source accessed on: 2019-12-03T20:05:01Z
source last accessed on: 2019-12-03T20:05:01Z
label: Cadenas de televisión local @es
label: Lokale Fernsehübertragung @de
label: Télédiffusion locale @fr
label: Transmissão de TV local @pt
label: Trasmissione TV locale @it
label: Местное телевещание @ru
label: 地方电视广播 @zh
label: 地方電視播放 @zh-hant
label: 地方ﾃﾚﾋﾞ放送 @ja
label: 지역 TV 방송 @ko
definition: This segment includes companies that operate broadcasting studios, stations and facilities for the transmission of television programming over public airwaves. Such programming may originate in their own studio, from an affiliated network or from external sources.
notation: 1010131110
valid from: 2014-08-08
valid till: 2020-10-03

Adv Revenue - Radio Networks
type: BicsLevel7Segment
type: Classifier
type: Discontinued
type: NamedIndividual
is level7 segment of: Radio Networks
is contemporary version of: http://data.ga-group.nl/ics/bics/10101311111010
is version of: http://data.ga-group.nl/ics/bics/10101311111010
imported on: 2026-06-08T13:03:47.798Z
last refreshed on: 2026-06-08T13:03:47.798Z
source accessed on: 2019-12-03T20:05:01Z
source last accessed on: 2019-12-03T20:05:01Z
label: Ingreso de publicidad-redes de radio @es
label: Rec prop - Estações rádio @pt
label: Revenu pub-Réseaux de radios @fr
label: Ricavi pubb - Canali radio @it
label: Werbeerlös - Rundfunknetze @de
label: Рекламн. врчк - радиосети @ru
label: 广告收入-电台网络 @zh
label: 広告売上高 -ﾗｼﾞｵ･ﾈｯﾄﾜｰｸ @ja
label: 廣告收入-廣播網 @zh-hant
label: 광고 수익 - 라디오 네트워크 @ko
definition: This segment includes revenue that radio networks generate from advertising.
notation: 10101311111010
valid from: 2014-08-08
valid till: 2020-10-03

Other Rev - Radio Networks
type: BicsLevel7Segment
type: Classifier
type: Discontinued
type: NamedIndividual
is level7 segment of: Radio Networks
is contemporary version of: http://data.ga-group.nl/ics/bics/10101311111011
is version of: http://data.ga-group.nl/ics/bics/10101311111011
imported on: 2026-06-08T13:03:47.798Z
last refreshed on: 2026-06-08T13:03:47.798Z
source accessed on: 2019-12-03T20:05:01Z
source last accessed on: 2019-12-03T20:05:01Z
label: Altri ric - Canali radio @it
label: Autres revenus - Réseaux de radios @fr
label: Otro ingreso - redes de radio @es
label: Out rec - Estações rádio @pt
label: Sonst. Erlös - Rundfunknetze @de
label: Пр. врчк - радиосети @ru
label: その他売上高 -ﾗｼﾞｵ･ﾈｯﾄﾜｰｸ @ja
label: 其他收入-廣播網 @zh-hant
label: 其他收入-电台网络 @zh
label: 기타 수익 - 라디오 네트워크 @ko
definition: This segment includes revenue that radio networks generate from sources other than advertising, such as revenue generated from selling programs to radio stations.
notation: 10101311111011
valid from: 2014-08-08
valid till: 2020-10-03

Radio Networks
type: BicsLevel6Segment
type: Classifier
type: NamedIndividual
is level6 segment of: Radio Broadcasting
is contemporary version of: http://data.ga-group.nl/ics/bics/101013111110
is replaced by: http://data.ga-group.nl/ics/bics/2020/101013111110
is version of: http://data.ga-group.nl/ics/bics/101013111110
imported on: 2026-06-08T13:03:47.798Z
last refreshed on: 2026-06-08T13:03:47.798Z
source accessed on: 2019-12-03T20:05:01Z
source last accessed on: 2019-12-03T20:05:01Z
label: Canali radio @it
label: Radiodiffusion @fr
label: Radionetworks @de
label: Redes de rádio @pt
label: Redes de radio @es
label: Радиосети @ru
label: 廣播網 @zh-hant
label: 电台网络 @zh
label: 라디오 네트워크 @ko
label: ﾗｼﾞｵﾈｯﾄﾜｰｸ @ja
definition: This segment includes companies that distribute programming to multiple stations simultaneously or slightly delayed, to extend total coverage beyond the limits of a single broadcast signal. A radio network has two sales departments, one to package and sell programs to radio stations, and one to sell the audience of those programs to advertisers.
notation: 101013111110
valid from: 2014-08-08
valid till: 2020-10-03

Adv Revenue - Radio Stations
type: BicsLevel7Segment
type: Classifier
type: Discontinued
type: NamedIndividual
is level7 segment of: Radio Stations
is contemporary version of: http://data.ga-group.nl/ics/bics/10101311111110
is version of: http://data.ga-group.nl/ics/bics/10101311111110
imported on: 2026-06-08T13:03:47.798Z
last refreshed on: 2026-06-08T13:03:47.798Z
source accessed on: 2019-12-03T20:05:01Z
source last accessed on: 2019-12-03T20:05:01Z
label: Ingreso de publicidad-emisoras de radio @es
label: Rec prop - Estações rádio @pt
label: Rev publicité - Stations de radio @fr
label: Ricavi pubb - Stazioni radio @it
label: Werbeerlös - Radiosender @de
label: Рекламн. врчк - радиостанции @ru
label: 广告收入-电台 @zh
label: 広告売上高 -ﾗｼﾞｵ放送局 @ja
label: 廣告收入-廣播電台 @zh-hant
label: 광고 수익 - 라디오 방송국 @ko
definition: This segment includes revenue that radio stations generate from advertising.
notation: 10101311111110
valid from: 2014-08-08
valid till: 2020-10-03

Other Rev - Radio Stations
type: BicsLevel7Segment
type: Classifier
type: Discontinued
type: NamedIndividual
is level7 segment of: Radio Stations
is contemporary version of: http://data.ga-group.nl/ics/bics/10101311111111
is version of: http://data.ga-group.nl/ics/bics/10101311111111
imported on: 2026-06-08T13:03:47.798Z
last refreshed on: 2026-06-08T13:03:47.798Z
source accessed on: 2019-12-03T20:05:01Z
source last accessed on: 2019-12-03T20:05:01Z
label: Altri ric - Stazioni radio @it
label: Autres rev - Stations de radio @fr
label: Otro ingreso - emisoras de radio @es
label: Out rec - Estações rádio @pt
label: Sonst. Erlös - Radiosender @de
label: Пр. врчк - радиостанции @ru
label: その他売上高 -ﾗｼﾞｵ放送局 @ja
label: 其他收入-廣播電台 @zh-hant
label: 其他收入-电台 @zh
label: 기타 수익 - 라디오 방송국 @ko
definition: This segment includes revenue that radio stations generate from sources other than advertising.
notation: 10101311111111
valid from: 2014-08-08
valid till: 2020-10-03

Radio Stations
type: BicsLevel6Segment
type: Classifier
type: NamedIndividual
is level6 segment of: Radio Broadcasting
is contemporary version of: http://data.ga-group.nl/ics/bics/101013111111
is replaced by: http://data.ga-group.nl/ics/bics/2020/101013111111
is version of: http://data.ga-group.nl/ics/bics/101013111111
imported on: 2026-06-08T13:03:47.798Z
last refreshed on: 2026-06-08T13:03:47.798Z
source accessed on: 2019-12-03T20:05:01Z
source last accessed on: 2019-12-03T20:05:01Z
label: Emisoras de radio @es
label: Estações de rádio @pt
label: Radiosender @de
label: Stations de radio @fr
label: Stazioni radio @it
label: Станции радиовещания @ru
label: 廣播電台 @zh-hant
label: 电台 @zh
label: 라디오 @ko
label: ﾗｼﾞｵ局 @ja
definition: This segment includes companies that operate broadcasting studios, stations and facilities for the transmission of radio programming over public airwaves. Such programming may originate in their own studio, from an affiliated network or from external sources.
notation: 101013111111
valid from: 2014-08-08
valid till: 2020-10-03

Radio Broadcasting
type: BicsLevel5Segment
type: Classifier
type: NamedIndividual
is level5 segment of: Local TV & Radio Broadcast
is contemporary version of: http://data.ga-group.nl/ics/bics/1010131111
is replaced by: http://data.ga-group.nl/ics/bics/2020/1010131111
is version of: http://data.ga-group.nl/ics/bics/1010131111
imported on: 2026-06-08T13:03:47.798Z
last refreshed on: 2026-06-08T13:03:47.798Z
source accessed on: 2019-12-03T20:05:01Z
source last accessed on: 2019-12-03T20:05:01Z
label: Radioübertragung @de
label: Radiodiffusion @fr
label: Radiodiffusione @it
label: Transmisión radio @es
label: Transmissão de rádio @pt
label: Станции радиовещания @ru
label: 廣播 @zh-hant
label: 电台广播 @zh
label: 라디오 방송 @ko
label: ﾗｼﾞｵ放送 @ja
definition: This segment includes companies that produce, acquire, distribute or broadcast radio programming.
notation: 1010131111
valid from: 2014-08-08
valid till: 2020-10-03

Local TV & Radio Broadcast
type: BicsLevel4SubIndustry
type: Classifier
type: NamedIndividual
is sub industry of: Publishing & Broadcasting
is contemporary version of: http://data.ga-group.nl/ics/bics/10101311
is replaced by: http://data.ga-group.nl/ics/bics/2020/10101311
is version of: http://data.ga-group.nl/ics/bics/10101311
imported on: 2026-06-08T13:03:47.798Z
last refreshed on: 2026-06-08T13:03:47.798Z
source accessed on: 2019-12-03T20:05:01Z
source last accessed on: 2019-12-03T20:05:01Z
label: Lokale Fernseh- & Radioübertragung @de
label: Retransmisión local de televisión y radio @es
label: Télé/radiodiffusion locale @fr
label: Tele e radiotrasmissione locale @it
label: Transmissão de TV e rádio local @pt
label: Местное теле- и радиовещание @ru
label: 地方电视与电台广播 @zh
label: 地方電視及廣播播放 @zh-hant
label: 地方ﾃﾚﾋﾞ･ﾗｼﾞｵ放送 @ja
label: 지역 TV & 라디오 방송 @ko
definition: This industry subgroup includes companies that provide television and radio broadcasting.
notation: 10101311
valid from: 2014-08-08
valid till: 2020-10-03

Out-of-Home Display Advertising
type: BicsLevel4SubIndustry
type: Classifier
type: NamedIndividual
is sub industry of: Publishing & Broadcasting
is contemporary version of: http://data.ga-group.nl/ics/bics/10101312
is replaced by: http://data.ga-group.nl/ics/bics/2020/10101312
is version of: http://data.ga-group.nl/ics/bics/10101312
imported on: 2026-06-08T13:03:47.798Z
last refreshed on: 2026-06-08T13:03:47.798Z
source accessed on: 2019-12-03T20:05:01Z
source last accessed on: 2019-12-03T20:05:01Z
label: Out-of-Home Display-Werbung @de
label: Placards publicitaires à l'extérieur de la maison @fr
label: Pubblicità esterna @it
label: Publicidad externa @es
label: Publicidade - Exibição fora de casa @pt
label: Внешние рекламные услуги @ru
label: 屋外広告 @ja
label: 戶外展示廣告 @zh-hant
label: 户外展示广告 @zh
label: 옥외 디스플레이 광고 @ko
definition: This industry subgroup includes companies that own and operate public display advertising, such as billboards, shopping mall and retail displays, bus advertisements and other public displays.
notation: 10101312
valid from: 2014-08-08
valid till: 2020-10-03

Publishing & Broadcasting
type: BicsLevel3Industry
type: Classifier
type: NamedIndividual
is industry of: Media
is contemporary version of: http://data.ga-group.nl/ics/bics/101013
is replaced by: http://data.ga-group.nl/ics/bics/2020/101013
is version of: http://data.ga-group.nl/ics/bics/101013
imported on: 2026-06-08T13:03:47.798Z
last refreshed on: 2026-06-08T13:03:47.798Z
source accessed on: 2019-12-03T20:05:01Z
source last accessed on: 2019-12-03T20:05:01Z
label: Edition et diffusion @fr
label: Editoria e trasmissione @it
label: Publicação e transmissão @pt
label: Publicación y difusión @es
label: Verlagswesen & Rundfunk @de
label: Издательское дело и радио- и телевещание @ru
label: 出版与广播 @zh
label: 出版及播放 @zh-hant
label: 出版･放送 @ja
label: 출판 & 방송 @ko
definition: This industry includes companies that publish books, newspapers and periodicals. It also includes UHF broadcast television and radio broadcast stations and networks.
notation: 101013
valid from: 2014-08-08
valid till: 2020-10-03

Adv Rev - Automotive Web
type: BicsLevel5Segment
type: Classifier
type: NamedIndividual
is level5 segment of: Automotive Web
is anachronous version of: http://data.ga-group.nl/ics/bics/101014101010
is contemporary version of: http://data.ga-group.nl/ics/bics/1010141010
is replaced by: http://data.ga-group.nl/ics/bics/2020/101014101010
is version of: http://data.ga-group.nl/ics/bics/101014101010
is version of: http://data.ga-group.nl/ics/bics/1010141010
imported on: 2026-06-08T13:03:47.798Z
last refreshed on: 2026-06-08T13:03:47.798Z
source accessed on: 2019-12-03T20:05:01Z
source last accessed on: 2019-12-03T20:05:01Z
label: Ingreso de publicidad-web automotriz @es
label: Rec prop - Automotivo web @pt
label: Rev pub - Sites Web automobiles @fr
label: Ric pubb - Siti automobilistici @it
label: Werbeerlös - Auto-Webseiten @de
label: Рекламн. врчк - веб-сайты автомобилей @ru
label: 广告收入-汽车网站 @zh
label: 広告収入-自動車ｳｪﾌﾞｻｲﾄ @ja
label: 廣告收入-汽車網站 @zh-hant
label: 광고 수익 - 자동차 웹 @ko
definition: This segment includes revenue that the automotive websites generate from advertising.
notation: 1010141010
valid from: 2014-08-08
valid till: 2020-10-03

Other Rev - Automotive Web
type: BicsLevel5Segment
type: Classifier
type: NamedIndividual
is level5 segment of: Automotive Web
is anachronous version of: http://data.ga-group.nl/ics/bics/101014101011
is contemporary version of: http://data.ga-group.nl/ics/bics/1010141011
is replaced by: http://data.ga-group.nl/ics/bics/2020/101014101011
is version of: http://data.ga-group.nl/ics/bics/101014101011
is version of: http://data.ga-group.nl/ics/bics/1010141011
imported on: 2026-06-08T13:03:47.798Z
last refreshed on: 2026-06-08T13:03:47.798Z
source accessed on: 2019-12-03T20:05:01Z
source last accessed on: 2019-12-03T20:05:01Z
label: Altri ricavi-auto web @it
label: Autres rev - Sites Web automobiles @fr
label: Otro ing-web automotriz @es
label: Outras rec - Web automóveis @pt
label: Sonst. Erlös - Auto, Web @de
label: Проч. выручка - Автомоб. вебсайты @ru
label: その他収入 - 自動車関連ｳｪﾌﾞｻｲﾄ @ja
label: 其他收入-汽車網站 @zh-hant
label: 其他收入-汽车网页 @zh
label: 기타 수익 - 자동차 웹 @ko
definition: This segment includes revenue that the automotive websites generate from other than advertising.
notation: 1010141011
valid from: 2014-08-08
valid till: 2020-10-03

Automotive Web
type: BicsLevel4SubIndustry
type: Classifier
type: NamedIndividual
is sub industry of: Internet Based Services
is anachronous version of: http://data.ga-group.nl/ics/bics/1010141010
is contemporary version of: http://data.ga-group.nl/ics/bics/10101410
is replaced by: http://data.ga-group.nl/ics/bics/2020/1010141010
is version of: http://data.ga-group.nl/ics/bics/1010141010
is version of: http://data.ga-group.nl/ics/bics/10101410
imported on: 2026-06-08T13:03:47.798Z
last refreshed on: 2026-06-08T13:03:47.798Z
source accessed on: 2019-12-03T20:05:01Z
source last accessed on: 2019-12-03T20:05:01Z
label: Auto-Webseiten @de
label: Automotivo web @pt
label: Sites Web automobiles @fr
label: Siti automobilistici @it
label: Web automotriz @es
label: Веб-сайты автомоб. @ru
label: 汽車網站 @zh-hant
label: 汽车网站 @zh
label: 自動車ｳｪﾌﾞｻｲﾄ @ja
label: 자동차 웹 @ko
definition: This industry subgroup includes companies that provide automotive information and classified listings online.
notation: 10101410
valid from: 2014-08-08
valid till: 2020-10-03

Adv Rev - Dating Services Web
type: BicsLevel5Segment
type: Classifier
type: NamedIndividual
is level5 segment of: Dating Services Web
is anachronous version of: http://data.ga-group.nl/ics/bics/101014101110
is contemporary version of: http://data.ga-group.nl/ics/bics/1010141110
is replaced by: http://data.ga-group.nl/ics/bics/2020/101014101110
is version of: http://data.ga-group.nl/ics/bics/101014101110
is version of: http://data.ga-group.nl/ics/bics/1010141110
imported on: 2026-06-08T13:03:47.798Z
last refreshed on: 2026-06-08T13:03:47.798Z
source accessed on: 2019-12-03T20:05:01Z
source last accessed on: 2019-12-03T20:05:01Z
label: Ingreso de publicidad-sitios web de agencias de contactos @es
label: Rec pub - Sites serv relac @pt
label: Rev pub - Services de rencontres Web @fr
label: Ric pubb - Siti servizi incontri @it
label: Werbeerlös - Webseiten für Partnervermittl. @de
label: Рекламн. врчк - веб-службы знакомств @ru
label: 广告收入-交友服务网站 @zh
label: 広告売上高 -交際ｻｰﾋﾞｽ･ｳｪﾌﾞｻｲﾄ @ja
label: 廣告收入-交友服務網站 @zh-hant
label: 광고 수익 - 만남 주선 서비스 웹 @ko
definition: This segment includes revenue that online dating services generate from advertising.
notation: 1010141110
valid from: 2014-08-08
valid till: 2020-10-03

Other Rev - Dating Svcs Web
type: BicsLevel5Segment
type: Classifier
type: NamedIndividual
is level5 segment of: Dating Services Web
is anachronous version of: http://data.ga-group.nl/ics/bics/101014101111
is contemporary version of: http://data.ga-group.nl/ics/bics/1010141111
is replaced by: http://data.ga-group.nl/ics/bics/2020/101014101111
is version of: http://data.ga-group.nl/ics/bics/101014101111
is version of: http://data.ga-group.nl/ics/bics/1010141111
imported on: 2026-06-08T13:03:47.798Z
last refreshed on: 2026-06-08T13:03:47.798Z
source accessed on: 2019-12-03T20:05:01Z
source last accessed on: 2019-12-03T20:05:01Z
label: Altri ric - Siti serv incontri @it
label: Autres rev - Services de rencontres Web @fr
label: Otro ingreso-Sitios Web de agencias de contactos @es
label: Out rec - Web serv relac @pt
label: Sonst. Erlös - Webseiten für Partnervermittl. @de
label: Пр. врчк - веб-службы знакомств @ru
label: その他売上高 -交際ｻｰﾋﾞ��･ｳｪﾌﾞｻｲﾄ @ja
label: 其他收入-交友服務網站 @zh-hant
label: 其他收入-汽车网站 @zh
label: 기타 수익 - 만남 주선 서비스 웹 @ko
definition: This segment includes revenue that online dating services generate from sources other than advertising.
notation: 1010141111
valid from: 2014-08-08
valid till: 2020-10-03

Dating Services Web
type: BicsLevel4SubIndustry
type: Classifier
type: NamedIndividual
is sub industry of: Internet Based Services
is anachronous version of: http://data.ga-group.nl/ics/bics/1010141011
is contemporary version of: http://data.ga-group.nl/ics/bics/10101411
is replaced by: http://data.ga-group.nl/ics/bics/2020/1010141011
is version of: http://data.ga-group.nl/ics/bics/1010141011
is version of: http://data.ga-group.nl/ics/bics/10101411
imported on: 2026-06-08T13:03:47.798Z
last refreshed on: 2026-06-08T13:03:47.798Z
source accessed on: 2019-12-03T20:05:01Z
source last accessed on: 2019-12-03T20:05:01Z
label: Services de rencontres Web @fr
label: Siti web per incontri @it
label: Web de serviços de relac @pt
label: Web de sitios de citas @es
label: Webseiten für Partnervermittl. @de
label: Веб-службы знакомств @ru
label: 交友服务网站 @zh
label: 交友服務網站 @zh-hant
label: 交際ｻｰﾋﾞｽ･ｳｪﾌﾞｻｲﾄ @ja
label: 만남 주선 서비스 웹 @ko
definition: This industry subgroup includes companies that offer dating services and other matchmaking services online.
notation: 10101411
valid from: 2014-08-08
valid till: 2020-10-03

Adv Rev - Domain Registrar
type: BicsLevel5Segment
type: Classifier
type: NamedIndividual
is level5 segment of: Domain Registrar
is anachronous version of: http://data.ga-group.nl/ics/bics/101014101210
is contemporary version of: http://data.ga-group.nl/ics/bics/1010141210
is replaced by: http://data.ga-group.nl/ics/bics/2020/101014101210
is version of: http://data.ga-group.nl/ics/bics/101014101210
is version of: http://data.ga-group.nl/ics/bics/1010141210
imported on: 2026-06-08T13:03:47.798Z
last refreshed on: 2026-06-08T13:03:47.798Z
source accessed on: 2019-12-03T20:05:01Z
source last accessed on: 2019-12-03T20:05:01Z
label: Ingreso de publicidad-registrador de dominio @es
label: Rec prop - Domínio Registrar @pt
label: Rev pub - Enregistrement nom de domaine @fr
label: Ric pubb - Registrazione dominio @it
label: Werbeerlös - Domain-Registrar @de
label: Рекламн. врчк - регистратор доменов @ru
label: 广告收入-域名注册 @zh
label: 広告売上高 -ﾄﾞﾒｲﾝ登��� @ja
label: 廣告收入-網域註冊商 @zh-hant
label: 광고 수익 - 도메인 등록 @ko
definition: This segment includes revenue that domain registrars generate from advertising on their websites.
notation: 1010141210
valid from: 2014-08-08
valid till: 2020-10-03

Other Rev - Domain Registrar
type: BicsLevel5Segment
type: Classifier
type: NamedIndividual
is level5 segment of: Domain Registrar
is anachronous version of: http://data.ga-group.nl/ics/bics/101014101211
is contemporary version of: http://data.ga-group.nl/ics/bics/1010141211
is replaced by: http://data.ga-group.nl/ics/bics/2020/101014101211
is version of: http://data.ga-group.nl/ics/bics/101014101211
is version of: http://data.ga-group.nl/ics/bics/1010141211
imported on: 2026-06-08T13:03:47.798Z
last refreshed on: 2026-06-08T13:03:47.798Z
source accessed on: 2019-12-03T20:05:01Z
source last accessed on: 2019-12-03T20:05:01Z
label: Altre entrate-Registrazione dominio internet @it
label: Autres revenus - Enregistrement de nom de domaine Internet @fr
label: Otro ingreso-Registrador de dominio @es
label: Outra receita - registro domínio @pt
label: Sonstiger Erlös - Domain-Registrar @de
label: Прочий доход-Регистрация домейнов @ru
label: その他売上高 -ﾄﾞﾒｲﾝ登録 @ja
label: 其他收入 - 域名注册 @zh
label: 其他收入-網域註冊商 @zh-hant
label: 기타수익 - 도메인 등록기관 @ko
definition: This segment includes revenue that domain registrars generate from sources other than advertising.
notation: 1010141211
valid from: 2014-08-08
valid till: 2020-10-03

Domain Registrar
type: BicsLevel4SubIndustry
type: Classifier
type: NamedIndividual
is sub industry of: Internet Based Services
is anachronous version of: http://data.ga-group.nl/ics/bics/1010141012
is contemporary version of: http://data.ga-group.nl/ics/bics/10101412
is replaced by: http://data.ga-group.nl/ics/bics/2020/1010141012
is version of: http://data.ga-group.nl/ics/bics/1010141012
is version of: http://data.ga-group.nl/ics/bics/10101412
imported on: 2026-06-08T13:03:47.798Z
last refreshed on: 2026-06-08T13:03:47.798Z
source accessed on: 2019-12-03T20:05:01Z
source last accessed on: 2019-12-03T20:05:01Z
label: Domain-Registrar @de
label: Enregistrement de nom de domaine Internet @fr
label: Registrador de dominio @es
label: Registrazione dominio internet @it
label: Registros de domínio @pt
label: Регистрация домейнов @ru
label: 域名注册 @zh
label: 網域註冊商 @zh-hant
label: 도메인 등록기관 @ko
label: ﾄﾞﾒｲﾝ登録業 @ja
definition: This industry subgroup includes companies that primarily register Internet domain names.
notation: 10101412
valid from: 2014-08-08
valid till: 2020-10-03

Adv Rev-Entmt Evt Ticket Online
type: BicsLevel5Segment
type: Classifier
type: NamedIndividual
is level5 segment of: Entmt Event Ticket Online
is anachronous version of: http://data.ga-group.nl/ics/bics/101014101310
is contemporary version of: http://data.ga-group.nl/ics/bics/1010141310
is replaced by: http://data.ga-group.nl/ics/bics/2020/101014101310
is version of: http://data.ga-group.nl/ics/bics/101014101310
is version of: http://data.ga-group.nl/ics/bics/1010141310
imported on: 2026-06-08T13:03:47.798Z
last refreshed on: 2026-06-08T13:03:47.798Z
source accessed on: 2019-12-03T20:05:01Z
source last accessed on: 2019-12-03T20:05:01Z
label: Ingreso de publicidad-boleta en línea de evento @es
label: Rec prop - Ingressos evento e entret online @pt
label: Rev pub - Vente de tickets de spectacles Web @fr
label: Ric pubb-Biglietti intratt online @it
label: Werbeerl. - Karten für Entertainm.-Events online @de
label: Рекламн. врчк - интернет-прдж билетов на рзвлк мероприят. @ru
label: 广告收入-娱乐活动在线售票 @zh
label: 広告売上高 -娯楽ｲﾍﾞﾝﾄﾁｹｯﾄ(ｵﾝﾗｲﾝ) @ja
label: 廣告收入-娛樂活動線上售票 @zh-hant
label: 광고 수익 - 엔터테인먼트 행사 티켓 온라인 @ko
definition: This segment includes revenue that entertainment event ticket sales websites generate from advertising.
notation: 1010141310
valid from: 2014-08-08
valid till: 2020-10-03

Other-Entmt Evt Ticket Online
type: BicsLevel5Segment
type: Classifier
type: NamedIndividual
is level5 segment of: Entmt Event Ticket Online
is anachronous version of: http://data.ga-group.nl/ics/bics/101014101311
is contemporary version of: http://data.ga-group.nl/ics/bics/1010141311
is replaced by: http://data.ga-group.nl/ics/bics/2020/101014101311
is version of: http://data.ga-group.nl/ics/bics/101014101311
is version of: http://data.ga-group.nl/ics/bics/1010141311
imported on: 2026-06-08T13:03:47.798Z
last refreshed on: 2026-06-08T13:03:47.798Z
source accessed on: 2019-12-03T20:05:01Z
source last accessed on: 2019-12-03T20:05:01Z
label: Altro-Biglietti intratt online @it
label: Autres rev - Vente de tickets de spectacles Web @fr
label: Otro-boleta en línea de evento @es
label: Outr - Ingressos en entret online @pt
label: Sonst. - Online-Karten Entertainm.-Event @de
label: Пр.- интернет-прдж билетов на рзвлк мероприят. @ru
label: その他 -娯楽ｲﾍﾞﾝﾄﾁｹｯﾄ(ｵﾝﾗｲﾝ) @ja
label: 其他收入-娛樂活動線上售票 @zh-hant
label: 其他收入-娱乐活动在线售票 @zh
label: 기타 - 엔터테인먼트 행사 티켓 온라인 @ko
definition: This segment includes revenue that entertainment event ticket sales websites generate from sources other than advertising.
notation: 1010141311
valid from: 2014-08-08
valid till: 2020-10-03

Entmt Event Ticket Online
type: BicsLevel4SubIndustry
type: Classifier
type: NamedIndividual
is sub industry of: Internet Based Services
is anachronous version of: http://data.ga-group.nl/ics/bics/1010141013
is contemporary version of: http://data.ga-group.nl/ics/bics/10101413
is replaced by: http://data.ga-group.nl/ics/bics/2020/1010141013
is version of: http://data.ga-group.nl/ics/bics/1010141013
is version of: http://data.ga-group.nl/ics/bics/10101413
imported on: 2026-06-08T13:03:47.798Z
last refreshed on: 2026-06-08T13:03:47.798Z
source accessed on: 2019-12-03T20:05:01Z
source last accessed on: 2019-12-03T20:05:01Z
label: Biglietti intrattenimento online @it
label: Evento de entretenimiento boleto en línea @es
label: Ingressos evento e entret online @pt
label: Karten für Entertainm.-Events online @de
label: Vente tickets de spectacle Web @fr
label: Интернет-прдж билетов на развлек. мероприят. @ru
label: 娛樂活動線上售票 @zh-hant
label: 娯楽ｲﾍﾞﾝﾄﾁｹｯﾄ -ｵﾝﾗｲﾝ @ja
label: 娱乐活动在线售票 @zh
label: 엔터테인먼트 행사 티켓 온라인 @ko
definition: This industry subgroup includes companies that retail tickets online for entertainment events, such as musical events, sporting events and theatrical shows.
notation: 10101413
valid from: 2014-08-08
valid till: 2020-10-03

Adv Rev - Photography Web
type: BicsLevel5Segment
type: Classifier
type: NamedIndividual
is level5 segment of: Photography Web
is anachronous version of: http://data.ga-group.nl/ics/bics/101014101410
is contemporary version of: http://data.ga-group.nl/ics/bics/1010141410
is replaced by: http://data.ga-group.nl/ics/bics/2020/101014101410
is version of: http://data.ga-group.nl/ics/bics/101014101410
is version of: http://data.ga-group.nl/ics/bics/1010141410
imported on: 2026-06-08T13:03:47.798Z
last refreshed on: 2026-06-08T13:03:47.798Z
source accessed on: 2019-12-03T20:05:01Z
source last accessed on: 2019-12-03T20:05:01Z
label: Ingreso de publicidad-sitios web de fotografía @es
label: Rec prop - Web fotografia @pt
label: Rev pub - Photographie Web @fr
label: Ric pubb - Siti fotografici @it
label: Werbeerlös - Fotografie-Webseiten @de
label: Рекламн. врчк - сайты с фотогр. @ru
label: 广告收入-摄影网站 @zh
label: 広告売上高 -写真ｳｪﾌﾞｻｲﾄ @ja
label: 廣告收入-攝影網站 @zh-hant
label: 광고 수익 - 사진 웹 @ko
definition: This segment includes revenue that photo sharing and finishing websites generate from advertising.
notation: 1010141410
valid from: 2014-08-08
valid till: 2020-10-03

Other Rev - Photography Web
type: BicsLevel5Segment
type: Classifier
type: NamedIndividual
is level5 segment of: Photography Web
is anachronous version of: http://data.ga-group.nl/ics/bics/101014101411
is contemporary version of: http://data.ga-group.nl/ics/bics/1010141411
is replaced by: http://data.ga-group.nl/ics/bics/2020/101014101411
is version of: http://data.ga-group.nl/ics/bics/101014101411
is version of: http://data.ga-group.nl/ics/bics/1010141411
imported on: 2026-06-08T13:03:47.798Z
last refreshed on: 2026-06-08T13:03:47.798Z
source accessed on: 2019-12-03T20:05:01Z
source last accessed on: 2019-12-03T20:05:01Z
label: Altri ric - Siti fotografici @it
label: Autres rev - Photographie Web @fr
label: Otro ing-web fotografía @es
label: Out rec - Web fotografia @pt
label: Sonst. Erlös - Fotografie-Webseiten @de
label: Пр. выручка - сайты с фотогр. @ru
label: その他売上-写真ｳｪﾌﾞｻｲﾄ @ja
label: 其他收入-摄影网站 @zh
label: 其他收入-攝影網站 @zh-hant
label: 기타 수익 - 사진 웹 @ko
definition: This segment includes revenue that photo sharing and finishing websites generate from sources other than advertising.
notation: 1010141411
valid from: 2014-08-08
valid till: 2020-10-03

Photography Web
type: BicsLevel4SubIndustry
type: Classifier
type: NamedIndividual
is sub industry of: Internet Based Services
is anachronous version of: http://data.ga-group.nl/ics/bics/1010141014
is contemporary version of: http://data.ga-group.nl/ics/bics/10101414
is replaced by: http://data.ga-group.nl/ics/bics/2020/1010141014
is version of: http://data.ga-group.nl/ics/bics/1010141014
is version of: http://data.ga-group.nl/ics/bics/10101414
imported on: 2026-06-08T13:03:47.798Z
last refreshed on: 2026-06-08T13:03:47.798Z
source accessed on: 2019-12-03T20:05:01Z
source last accessed on: 2019-12-03T20:05:01Z
label: Fotografie-Webseiten @de
label: Photographie Web @fr
label: Siti fotografici @it
label: Web de fotografía @es
label: Web fotografia @pt
label: Сайты с фотогр. @ru
label: 写真ｳｪﾌﾞｻｲﾄ @ja
label: 摄影网站 @zh
label: 攝影網站 @zh-hant
label: 사진 웹 @ko
definition: This industry subgroup includes companies that provide photo posting, printing, and collating services online.
notation: 10101414
valid from: 2014-08-08
valid till: 2020-10-03

Adv Rev-Price & Svc Comp Web
type: BicsLevel5Segment
type: Classifier
type: NamedIndividual
is level5 segment of: Price & Svc Comparison Web
is anachronous version of: http://data.ga-group.nl/ics/bics/101014101510
is contemporary version of: http://data.ga-group.nl/ics/bics/1010141510
is replaced by: http://data.ga-group.nl/ics/bics/2020/101014101510
is version of: http://data.ga-group.nl/ics/bics/101014101510
is version of: http://data.ga-group.nl/ics/bics/1010141510
imported on: 2026-06-08T13:03:47.798Z
last refreshed on: 2026-06-08T13:03:47.798Z
source accessed on: 2019-12-03T20:05:01Z
source last accessed on: 2019-12-03T20:05:01Z
label: Ingreso de publicidad- web de precios y comp de servicios @es
label: Rec prop - Web comp preço e serv @pt
label: Rev pub - Sites Web de comparaison de prix/services @fr
label: Ric pubb-Siti confronto prz e serv @it
label: Werbeerlös - Preis-/Servicevergl. Webseiten @de
label: Рекламн. врчк - сайты сравнения цен и услг @ru
label: 广告收入-价格与服务比较网站 @zh
label: 広告売上高 -価格･ｻｰﾋﾞｽ比較ｳｪﾌﾞｻｲﾄ @ja
label: 廣告收入-價格及服務比較網站 @zh-hant
label: 광고 수익 - 가격 & 서비스 비교 웹 @ko
definition: This segment includes revenue that price and service comparison websites generate from advertising.
notation: 1010141510
valid from: 2014-08-08
valid till: 2020-10-03

Other-Price & Svc Comp Web
type: BicsLevel5Segment
type: Classifier
type: NamedIndividual
is level5 segment of: Price & Svc Comparison Web
is anachronous version of: http://data.ga-group.nl/ics/bics/101014101511
is contemporary version of: http://data.ga-group.nl/ics/bics/1010141511
is replaced by: http://data.ga-group.nl/ics/bics/2020/101014101511
is version of: http://data.ga-group.nl/ics/bics/101014101511
is version of: http://data.ga-group.nl/ics/bics/1010141511
imported on: 2026-06-08T13:03:47.798Z
last refreshed on: 2026-06-08T13:03:47.798Z
source accessed on: 2019-12-03T20:05:01Z
source last accessed on: 2019-12-03T20:05:01Z
label: Altro-Siti confronto prz e serv @it
label: Autrs rev - Sites Web de comparaison de prix/services @fr
label: Otro- web de precios y comp de servicios @es
label: Out-Web comp preço e serv @pt
label: Sonst. - Preis-/Servicevergl. Webseiten @de
label: Пр. - сайты сравнения цен и услг @ru
label: その他 -価格･ｻｰﾋﾞｽ比較ｳｪﾌﾞｻｲﾄ @ja
label: 其他收入-价格与服务比较网站 @zh
label: 其他收入-價格及服務比較網站 @zh-hant
label: 기타 - 가격 & 서비스 비교 웹 @ko
definition: This segment includes revenue that price and service comparison websites generate from sources other than advertising.
notation: 1010141511
valid from: 2014-08-08
valid till: 2020-10-03

Price & Svc Comparison Web
type: BicsLevel4SubIndustry
type: Classifier
type: NamedIndividual
is sub industry of: Internet Based Services
is anachronous version of: http://data.ga-group.nl/ics/bics/1010141015
is contemporary version of: http://data.ga-group.nl/ics/bics/10101415
is replaced by: http://data.ga-group.nl/ics/bics/2020/1010141015
is version of: http://data.ga-group.nl/ics/bics/1010141015
is version of: http://data.ga-group.nl/ics/bics/10101415
imported on: 2026-06-08T13:03:47.798Z
last refreshed on: 2026-06-08T13:03:47.798Z
source accessed on: 2019-12-03T20:05:01Z
source last accessed on: 2019-12-03T20:05:01Z
label: Comparaison prix et serv Web @fr
label: Siti confronto prezzi e serv @it
label: Sitios de comparaciones de precios y servicios @es
label: Web comparação de pç e serv @pt
label: Webseiten zum Vergleich von Preisen & Service @de
label: Сайты сравнения цен и услг @ru
label: 价格与服务比较网站 @zh
label: 価格･ｻｰﾋﾞｽ比較ｳｪﾌﾞｻｲﾄ @ja
label: 價格及服務比較網站 @zh-hant
label: 가격 & 서비스 비교 웹 @ko
definition: This industry subgroup includes companies that provide product price comparison services online. Such products include credit card rates, mobile phone rates, holiday prices, flights, digital cameras and printers.
notation: 10101415
valid from: 2014-08-08
valid till: 2020-10-03

Adv Rev - Real Estate Web
type: BicsLevel5Segment
type: Classifier
type: NamedIndividual
is level5 segment of: Real Estate & Property Web
is anachronous version of: http://data.ga-group.nl/ics/bics/101014101610
is contemporary version of: http://data.ga-group.nl/ics/bics/1010141610
is replaced by: http://data.ga-group.nl/ics/bics/2020/101014101610
is version of: http://data.ga-group.nl/ics/bics/101014101610
is version of: http://data.ga-group.nl/ics/bics/1010141610
imported on: 2026-06-08T13:03:47.798Z
last refreshed on: 2026-06-08T13:03:47.798Z
source accessed on: 2019-12-03T20:05:01Z
source last accessed on: 2019-12-03T20:05:01Z
label: Ingreso de publicidad-web inmobiliario @es
label: Rec prop-Web imóveis @pt
label: Rev pub-Sites Web d'agences immobilières @fr
label: Ric pubb - Siti immobiliari @it
label: Werbeerlös - Immobilien-Webseiten @de
label: Рекламн. врчк - сайты недвижим. @ru
label: 广告收入-房地产网站 @zh
label: 広��売上高 -不動産ｳｪﾌﾞｻｲﾄ @ja
label: 廣告收入-不動產及房地產站 @zh-hant
label: 광고 수익 - 부동산 웹 @ko
definition: This segment includes revenue that real estate and property websites generate from advertising.
notation: 1010141610
valid from: 2014-08-08
valid till: 2020-10-03

Other Rev - Real Estate Web
type: BicsLevel5Segment
type: Classifier
type: NamedIndividual
is level5 segment of: Real Estate & Property Web
is anachronous version of: http://data.ga-group.nl/ics/bics/101014101611
is contemporary version of: http://data.ga-group.nl/ics/bics/1010141611
is replaced by: http://data.ga-group.nl/ics/bics/2020/101014101611
is version of: http://data.ga-group.nl/ics/bics/101014101611
is version of: http://data.ga-group.nl/ics/bics/1010141611
imported on: 2026-06-08T13:03:47.798Z
last refreshed on: 2026-06-08T13:03:47.798Z
source accessed on: 2019-12-03T20:05:01Z
source last accessed on: 2019-12-03T20:05:01Z
label: Altri ric - Siti immobiliari @it
label: Autres rev - Sites Web d'agences immobilières @fr
label: Otro ingreso-web inmobiliario @es
label: Out rec-Web imóveis @pt
label: Sonst. Erlös - Immobilien-Webseiten @de
label: Пр. врчк - сайты недвиж. @ru
label: その他売上高 -不動産ｳｪﾌﾞｻｲﾄ @ja
label: 其他收入-不動產網站 @zh-hant
label: 其他收入-房地产网站 @zh
label: 기타 수익 - 부동산 웹 @ko
definition: This segment includes revenue that real estate and property websites generate from sources other than advertising.
notation: 1010141611
valid from: 2014-08-08
valid till: 2020-10-03

Real Estate & Property Web
type: BicsLevel4SubIndustry
type: Classifier
type: NamedIndividual
is sub industry of: Internet Based Services
is anachronous version of: http://data.ga-group.nl/ics/bics/1010141016
is contemporary version of: http://data.ga-group.nl/ics/bics/10101416
is replaced by: http://data.ga-group.nl/ics/bics/2020/1010141016
is version of: http://data.ga-group.nl/ics/bics/1010141016
is version of: http://data.ga-group.nl/ics/bics/10101416
imported on: 2026-06-08T13:03:47.798Z
last refreshed on: 2026-06-08T13:03:47.798Z
source accessed on: 2019-12-03T20:05:01Z
source last accessed on: 2019-12-03T20:05:01Z
label: Agences immobilières en ligne @fr
label: Siti web per immobili e proprietà @it
label: Sitios de inmobiliario @es
label: Webseiten für Immbobilien @de
label: Website de propriedades e imóveis @pt
label: Вебсайты недвижимости и имущества @ru
label: 不動產及房地產網站 @zh-hant
label: 不動産ｳｪﾌﾞｻｲﾄ @ja
label: 房地产和物业网站 @zh
label: 부동산 & 자산 웹사이트 @ko
definition: This industry subgroup includes companies that provide real estate and property information and listings online.
notation: 10101416
valid from: 2014-08-08
valid till: 2020-10-03

Adv Rev - Recruit Svcs Web
type: BicsLevel5Segment
type: Classifier
type: NamedIndividual
is level5 segment of: Recruitment Services Web
is anachronous version of: http://data.ga-group.nl/ics/bics/101014101710
is contemporary version of: http://data.ga-group.nl/ics/bics/1010141710
is replaced by: http://data.ga-group.nl/ics/bics/2020/101014101710
is version of: http://data.ga-group.nl/ics/bics/101014101710
is version of: http://data.ga-group.nl/ics/bics/1010141710
imported on: 2026-06-08T13:03:47.798Z
last refreshed on: 2026-06-08T13:03:47.798Z
source accessed on: 2019-12-03T20:05:01Z
source last accessed on: 2019-12-03T20:05:01Z
label: Ingreso de publicidad-sitios Web de servicios de reclutamiento @es
label: Rec pub-Web serv recrutamento @pt
label: Rev pub - Serv de recrutement Web @fr
label: Ric pubb - Siti reclutamento @it
label: Werbeerlös - Personalvermittlungs-Webseiten @de
label: Рекламн. врчк - сайты служ�� по подбору кадров @ru
label: 广告收入-招聘服务网站 @zh
label: 広告売上高 -求人ｻｰﾋﾞｽ･ｳｪﾌﾞｻｲﾄ @ja
label: 廣告收入-求職求才網站 @zh-hant
label: 광고 수익 - 채용 서비스 웹 @ko
definition: This segment includes revenue that recruitment services websites generate from advertising.
notation: 1010141710
valid from: 2014-08-08
valid till: 2020-10-03

Other Rev - Recruit Svc Web
type: BicsLevel5Segment
type: Classifier
type: NamedIndividual
is level5 segment of: Recruitment Services Web
is anachronous version of: http://data.ga-group.nl/ics/bics/101014101711
is contemporary version of: http://data.ga-group.nl/ics/bics/1010141711
is replaced by: http://data.ga-group.nl/ics/bics/2020/101014101711
is version of: http://data.ga-group.nl/ics/bics/101014101711
is version of: http://data.ga-group.nl/ics/bics/1010141711
imported on: 2026-06-08T13:03:47.798Z
last refreshed on: 2026-06-08T13:03:47.798Z
source accessed on: 2019-12-03T20:05:01Z
source last accessed on: 2019-12-03T20:05:01Z
label: Altri ric - Siti reclutamento @it
label: Autrs rev - Serv de recrutement Web @fr
label: Otro ingreso-Sitios reclutam @es
label: Out rec -Web serv recrutamento @pt
label: Sonst. Erlös - Personalvermittl.-Webseiten @de
label: Пр. врчк - сайты служб по подбору кадров @ru
label: その他売上高-求人ｻｰﾋﾞｽ･ｳｪﾌﾞｻｲﾄ @ja
label: 其他收入-招聘服务网站 @zh
label: 其他收入-求職求才網站 @zh-hant
label: 기타 수익 - 채용 서비스 웹 @ko
definition: This segment includes revenue that recruitment services websites generate from sources other than advertising.
notation: 1010141711
valid from: 2014-08-08
valid till: 2020-10-03

Recruitment Services Web
type: BicsLevel4SubIndustry
type: Classifier
type: NamedIndividual
is sub industry of: Internet Based Services
is anachronous version of: http://data.ga-group.nl/ics/bics/1010141017
is contemporary version of: http://data.ga-group.nl/ics/bics/10101417
is replaced by: http://data.ga-group.nl/ics/bics/2020/1010141017
is version of: http://data.ga-group.nl/ics/bics/1010141017
is version of: http://data.ga-group.nl/ics/bics/10101417
imported on: 2026-06-08T13:03:47.798Z
last refreshed on: 2026-06-08T13:03:47.798Z
source accessed on: 2019-12-03T20:05:01Z
source last accessed on: 2019-12-03T20:05:01Z
label: Personalvermittlungs-Webseiten @de
label: Serv de recrutement Web @fr
label: Servicios web de reclutamiento @es
label: Siti web servizi reclutamento @it
label: Web serviços recrutamento @pt
label: Сайты служб по подбору кадров @ru
label: 招聘服务网站 @zh
label: 求人ｻｰﾋﾞｽ･ｳｪﾌﾞｻｲﾄ @ja
label: 求職求才服務網站 @zh-hant
label: 채용 서비스 웹 @ko
definition: This industry subgroup includes companies that provide recruitment services and listings online for both employers and potential employees.
notation: 10101417
valid from: 2014-08-08
valid till: 2020-10-03

Adv Rev - Travel & Booking Web
type: BicsLevel5Segment
type: Classifier
type: NamedIndividual
is level5 segment of: Travel Info & Booking Web
is anachronous version of: http://data.ga-group.nl/ics/bics/101014101810
is contemporary version of: http://data.ga-group.nl/ics/bics/1010141810
is replaced by: http://data.ga-group.nl/ics/bics/2020/101014101810
is version of: http://data.ga-group.nl/ics/bics/101014101810
is version of: http://data.ga-group.nl/ics/bics/1010141810
imported on: 2026-06-08T13:03:47.798Z
last refreshed on: 2026-06-08T13:03:47.798Z
source accessed on: 2019-12-03T20:05:01Z
source last accessed on: 2019-12-03T20:05:01Z
label: Ingreso de publicidad-sitios Web de información y registración de viajes @es
label: Rec prop -Web viagem e reservas @pt
label: Rev pub- Tourisme et réservations Web @fr
label: Ric pubb - Siti viaggio e prenotazione @it
label: Werbeerlös - Reise- & Buchungs-Webseiten @de
label: Рекламн. врчк - информ. туристич. сайты и бронирование онлайн @ru
label: 广告收入-旅游与预订网站 @zh
label: 広告売上高 -旅行情報･予約ｳｪﾌﾞｻｲﾄ @ja
label: 廣告收入-旅遊資訊及預約網站 @zh-hant
label: 광고 수익 - 여행 & 예약 웹 @ko
definition: This segment includes revenue that travel information and booking websites generate from advertising.
notation: 1010141810
valid from: 2014-08-08
valid till: 2020-10-03

Other - Travel & Booking Web
type: BicsLevel5Segment
type: Classifier
type: NamedIndividual
is level5 segment of: Travel Info & Booking Web
is anachronous version of: http://data.ga-group.nl/ics/bics/101014101811
is contemporary version of: http://data.ga-group.nl/ics/bics/1010141811
is replaced by: http://data.ga-group.nl/ics/bics/2020/101014101811
is version of: http://data.ga-group.nl/ics/bics/101014101811
is version of: http://data.ga-group.nl/ics/bics/1010141811
imported on: 2026-06-08T13:03:47.798Z
last refreshed on: 2026-06-08T13:03:47.798Z
source accessed on: 2019-12-03T20:05:01Z
source last accessed on: 2019-12-03T20:05:01Z
label: Altro - Siti viaggio e prenotazione @it
label: Autres - Tourisme et réservations Web @fr
label: Otros - viajes y reservaciones de web @es
label: Out-Web viagem e reservas @pt
label: Sonst. - Reise- & Buchungs-Webseiten @de
label: Пр. - информ. туристич. сайты и бронирование онлайн @ru
label: その他 -旅行情報･予約ｳｪﾌﾞｻｲﾄ @ja
label: 其他-旅遊資訊及預約網站 @zh-hant
label: 其他收入-旅游与预订网站 @zh
label: 기타 - 여행 & 예약 웹 @ko
definition: This segment includes revenue that travel information and booking websites generate from sources other than advertising.
notation: 1010141811
valid from: 2014-08-08
valid till: 2020-10-03

Travel Info & Booking Web
type: BicsLevel4SubIndustry
type: Classifier
type: NamedIndividual
is sub industry of: Internet Based Services
is anachronous version of: http://data.ga-group.nl/ics/bics/1010141018
is contemporary version of: http://data.ga-group.nl/ics/bics/10101418
is replaced by: http://data.ga-group.nl/ics/bics/2020/1010141018
is version of: http://data.ga-group.nl/ics/bics/1010141018
is version of: http://data.ga-group.nl/ics/bics/10101418
imported on: 2026-06-08T13:03:47.798Z
last refreshed on: 2026-06-08T13:03:47.798Z
source accessed on: 2019-12-03T20:05:01Z
source last accessed on: 2019-12-03T20:05:01Z
label: Information touristique et réservations en ligne @fr
label: Siti web di prenotazione e viaggi @it
label: Sitios de viajes y reservaciones @es
label: Webseiten für Reiseinformationen & Buchungen @de
label: Websites de reservas e informações de viagem @pt
label: Вебсайты информации о путешествиях и бронирования @ru
label: 旅游信息及预订网站 @zh
label: 旅行情報･予約ｳｪﾌﾞｻｲﾄ @ja
label: 旅遊資訊及預約網站 @zh-hant
label: 여행정보 & 예약 웹사이트 @ko
definition: This industry subgroup includes companies that offer travel information and booking services online.
notation: 10101418
valid from: 2014-08-08
valid till: 2020-10-03

Other Internet Based Services
type: BicsLevel4SubIndustry
type: Classifier
type: Discontinued
type: NamedIndividual
is sub industry of: Internet Based Services
is contemporary version of: http://data.ga-group.nl/ics/bics/10101419
is version of: http://data.ga-group.nl/ics/bics/10101419
imported on: 2026-06-08T13:03:47.798Z
last refreshed on: 2026-06-08T13:03:47.798Z
source accessed on: 2019-12-03T20:05:01Z
source last accessed on: 2019-12-03T20:05:01Z
label: Altri servizi base internet @it
label: Autres services basés sur Internet @fr
label: Otros servicios de Internet @es
label: Outros serviços de internet @pt
label: Sonst. internetbasierte Dienste @de
label: Прочие услуги в интернете @ru
label: その他ｲﾝﾀｰﾈｯﾄﾍﾞｰｽｻｰﾋﾞｽ @ja
label: 其他基于互联网的服务 @zh
label: 其他網路為主服務 @zh-hant
label: ��타 인터넷기반 서비스 @ko
definition: This industry subgroup includes companies that provide services through the Internet, which are not elsewhere classified.
notation: 10101419
valid from: 2014-08-08
valid till: 2020-10-03

Internet Based Services
type: BicsLevel3Industry
type: Classifier
type: NamedIndividual
is industry of: Media
is anachronous version of: http://data.ga-group.nl/ics/bics/10101410
is contemporary version of: http://data.ga-group.nl/ics/bics/101014
is replaced by: http://data.ga-group.nl/ics/bics/2020/10101410
is version of: http://data.ga-group.nl/ics/bics/10101410
is version of: http://data.ga-group.nl/ics/bics/101014
imported on: 2026-06-08T13:03:47.798Z
last refreshed on: 2026-06-08T13:03:47.798Z
source accessed on: 2019-12-03T20:05:01Z
source last accessed on: 2019-12-03T20:05:01Z
label: Internet-Dienste @de
label: Serviços internet @pt
label: Services sur Internet @fr
label: Servizi internet @it
label: Servs por Internet @es
label: Интернет-услуги @ru
label: 互联网服务 @zh
label: 網路服務 @zh-hant
label: 인터넷기반 서비스 @ko
label: ｲﾝﾀｰﾈｯﾄﾍﾞｰｽ･ｻｰﾋﾞｽ @ja
definition: This industry includes websites that provide a variety of services including dating services, travel information and booking, real estate listings, car classifieds, photo sharing, and job postings.
notation: 101014
valid from: 2014-08-08
valid till: 2020-10-03

Adv Rev - Education Info Web
type: BicsLevel5Segment
type: Classifier
type: NamedIndividual
is level5 segment of: Education Information Web
is anachronous version of: http://data.ga-group.nl/ics/bics/101014101910
is contemporary version of: http://data.ga-group.nl/ics/bics/1010151010
is replaced by: http://data.ga-group.nl/ics/bics/2020/101014101910
is version of: http://data.ga-group.nl/ics/bics/101014101910
is version of: http://data.ga-group.nl/ics/bics/1010151010
imported on: 2026-06-08T13:03:47.798Z
last refreshed on: 2026-06-08T13:03:47.798Z
source accessed on: 2019-12-03T20:05:01Z
source last accessed on: 2019-12-03T20:05:01Z
label: Ingreso de publicidad-sitios Web de información educativa @es
label: Rec prop -Web info educação @pt
label: Rev pub- Web Info éduc @fr
label: Ric pubb - Siti info istruzione @it
label: Werbeerlös - Bildungsinfo-Webseiten @de
label: Рекламн. врчк - образов. веб-сайты @ru
label: 广告收入-教育信息网站 @zh
label: 広告売上高 -教育情報ｳｪﾌﾞｻｲﾄ @ja
label: 廣告收入-教育資訊網站 @zh-hant
label: 광고 수익 - 교육정보 웹 @ko
definition: This segment includes revenue that educational information websites generate from advertising.
notation: 1010151010
valid from: 2014-08-08
valid till: 2020-10-03

Other - Education Info Web
type: BicsLevel5Segment
type: Classifier
type: NamedIndividual
is level5 segment of: Education Information Web
is anachronous version of: http://data.ga-group.nl/ics/bics/101014101911
is contemporary version of: http://data.ga-group.nl/ics/bics/1010151011
is replaced by: http://data.ga-group.nl/ics/bics/2020/101014101911
is version of: http://data.ga-group.nl/ics/bics/101014101911
is version of: http://data.ga-group.nl/ics/bics/1010151011
imported on: 2026-06-08T13:03:47.798Z
last refreshed on: 2026-06-08T13:03:47.798Z
source accessed on: 2019-12-03T20:05:01Z
source last accessed on: 2019-12-03T20:05:01Z
label: Altro - Siti info istruzione @it
label: Autres - Web Info éduc @fr
label: Otro- web de información educativa @es
label: Out-Web info educação @pt
label: Sonst. - Bildungsinfo-Webseiten @de
label: Пр. - образов. веб-сайты @ru
label: その他 -教育情報ｳｪﾌﾞｻｲﾄ @ja
label: 其他-教育資訊網站 @zh-hant
label: 其他收入-教育信息网站 @zh
label: 기타 - 교육정보 웹 @ko
definition: This segment includes revenue that educational information websites generate from sources other than advertising.
notation: 1010151011
valid from: 2014-08-08
valid till: 2020-10-03

Education Information Web
type: BicsLevel4SubIndustry
type: Classifier
type: NamedIndividual
is sub industry of: Internet Media
is anachronous version of: http://data.ga-group.nl/ics/bics/1010141019
is contemporary version of: http://data.ga-group.nl/ics/bics/10101510
is replaced by: http://data.ga-group.nl/ics/bics/2020/1010141019
is version of: http://data.ga-group.nl/ics/bics/1010141019
is version of: http://data.ga-group.nl/ics/bics/10101510
imported on: 2026-06-08T13:03:47.798Z
last refreshed on: 2026-06-08T13:03:47.798Z
source accessed on: 2019-12-03T20:05:01Z
source last accessed on: 2019-12-03T20:05:01Z
label: Sites Internet d'information sur l'éducation @fr
label: Siti web per informazioni sull'istruzione @it
label: Sitios de información educativa @es
label: Webseiten für Bildungsinformationen @de
label: Websites informação de educação @pt
label: Образовательные вебсайты @ru
label: 教育信息网站 @zh
label: 教育情報ｳｪﾌﾞｻｲﾄ @ja
label: 教育資訊網�� @zh-hant
label: 교육정보 웹사이트 @ko
definition: This industry subgroup includes companies that provide educational information online.
notation: 10101510
valid from: 2014-08-08
valid till: 2020-10-03

Display Advertising
type: BicsLevel6Segment
type: Classifier
type: NamedIndividual
is level6 segment of: Adv Rev - Internet Portals
is anachronous version of: http://data.ga-group.nl/ics/bics/10101410201010
is contemporary version of: http://data.ga-group.nl/ics/bics/101015111010
is replaced by: http://data.ga-group.nl/ics/bics/2020/10101410201010
is version of: http://data.ga-group.nl/ics/bics/10101410201010
is version of: http://data.ga-group.nl/ics/bics/101015111010
imported on: 2026-06-08T13:03:47.798Z
last refreshed on: 2026-06-08T13:03:47.798Z
source accessed on: 2019-12-03T20:05:01Z
source last accessed on: 2019-12-03T20:05:01Z
label: Afficher publicité @fr
label: Anuncio de mostrador @es
label: Display-Werbung @de
label: Exibir propaganda @pt
label: Pubblicità esterna @it
label: Витринно-выставочная реклама @ru
label: 展示廣告 @zh-hant
label: 显示广告 @zh
label: 表示広告 @ja
label: 디스플레이 광고 @ko
definition: This segment includes revenue generated by the display of graphical advertisements on an online page that the user views.
notation: 101015111010
valid from: 2014-08-08
valid till: 2020-10-03

Search Advertising
type: BicsLevel6Segment
type: Classifier
type: NamedIndividual
is level6 segment of: Adv Rev - Internet Portals
is anachronous version of: http://data.ga-group.nl/ics/bics/10101410201011
is contemporary version of: http://data.ga-group.nl/ics/bics/101015111011
is replaced by: http://data.ga-group.nl/ics/bics/2020/10101410201011
is version of: http://data.ga-group.nl/ics/bics/10101410201011
is version of: http://data.ga-group.nl/ics/bics/101015111011
imported on: 2026-06-08T13:03:47.798Z
last refreshed on: 2026-06-08T13:03:47.798Z
source accessed on: 2019-12-03T20:05:01Z
source last accessed on: 2019-12-03T20:05:01Z
label: Anuncio de búsqueda @es
label: Buscar propaganda @pt
label: Recherche publicité @fr
label: Ricerca pubblicità @it
label: Werbungssuche @de
label: Поисковая реклама @ru
label: 搜尋廣告 @zh-hant
label: 搜索广告 @zh
label: 検索広告 @ja
label: 검색 광고 @ko
definition: This segment includes revenue generated from text-based links to an advertiser's website from Web searches conducted on an Internet search engine.
notation: 101015111011
valid from: 2014-08-08
valid till: 2020-10-03

Adv Rev - Internet Portals
type: BicsLevel5Segment
type: Classifier
type: NamedIndividual
is level5 segment of: Internet Advertising Portals
is anachronous version of: http://data.ga-group.nl/ics/bics/101014102010
is contemporary version of: http://data.ga-group.nl/ics/bics/1010151110
is replaced by: http://data.ga-group.nl/ics/bics/2020/101014102010
is version of: http://data.ga-group.nl/ics/bics/101014102010
is version of: http://data.ga-group.nl/ics/bics/1010151110
imported on: 2026-06-08T13:03:47.798Z
last refreshed on: 2026-06-08T13:03:47.798Z
source accessed on: 2019-12-03T20:05:01Z
source last accessed on: 2019-12-03T20:05:01Z
label: Ingreso de publicidad-portales de Internet @es
label: Rec prop - Portais da internet @pt
label: Rev pub - Portails Internet @fr
label: Ric pubb - Portali Internet @it
label: Werbeerlös - Internetportale @de
label: Рекламн. врчк - Интернет-порталы объявл. @ru
label: 广告收入-互联网门户网站 @zh
label: 広告売上高-ｲﾝﾀｰﾈｯﾄ･ﾎﾟｰﾀﾙ @ja
label: 廣告收入-網路入口 @zh-hant
label: 광고 수익 - 인터넷 포털 @ko
definition: This segment includes revenue that Internet search engines generate from advertising.
notation: 1010151110
valid from: 2014-08-08
valid till: 2020-10-03

Other Rev - Internet Portals
type: BicsLevel5Segment
type: Classifier
type: NamedIndividual
is level5 segment of: Internet Advertising Portals
is anachronous version of: http://data.ga-group.nl/ics/bics/101014102011
is contemporary version of: http://data.ga-group.nl/ics/bics/1010151111
is replaced by: http://data.ga-group.nl/ics/bics/2020/101014102011
is version of: http://data.ga-group.nl/ics/bics/101014102011
is version of: http://data.ga-group.nl/ics/bics/1010151111
imported on: 2026-06-08T13:03:47.798Z
last refreshed on: 2026-06-08T13:03:47.798Z
source accessed on: 2019-12-03T20:05:01Z
source last accessed on: 2019-12-03T20:05:01Z
label: Altri ric - Portali Internet @it
label: Autres rev - Portails Internet @fr
label: Otro ing-portales de Internet @es
label: Out rec - Portais internet @pt
label: Sonst. Erlös - Internetportale @de
label: Пр. врчк - Интернет-порталы объявл. @ru
label: その他売上高-ｲﾝﾀｰﾈｯﾄ･ﾎﾟｰﾀﾙ @ja
label: 其他收入-互联网门户网站 @zh
label: 其他收入-網路入口 @zh-hant
label: 기타 수익 - 인터넷 포털 @ko
definition: This segment includes revenue that Internet search engines generate from sources other than advertising.
notation: 1010151111
valid from: 2014-08-08
valid till: 2020-10-03

Internet Advertising Portals
type: BicsLevel4SubIndustry
type: Classifier
type: NamedIndividual
is sub industry of: Internet Media
is anachronous version of: http://data.ga-group.nl/ics/bics/1010141020
is contemporary version of: http://data.ga-group.nl/ics/bics/10101511
is replaced by: http://data.ga-group.nl/ics/bics/2020/1010141020
is version of: http://data.ga-group.nl/ics/bics/1010141020
is version of: http://data.ga-group.nl/ics/bics/10101511
imported on: 2026-06-08T13:03:47.798Z
last refreshed on: 2026-06-08T13:03:47.798Z
source accessed on: 2019-12-03T20:05:01Z
source last accessed on: 2019-12-03T20:05:01Z
label: Portails pub internet @fr
label: Portais de propagando online @pt
label: Portale für Internetwerbung @de
label: Portales de anuncios en Internet @es
label: Portali annunci internet @it
label: Интернет-порталы объявлений @ru
label: 網路廣告入口 @zh-hant
label: 网络广告门户网站 @zh
label: 인터넷 광고 포털 @ko
label: ｲﾝﾀｰﾈｯﾄ広告ﾎﾟｰﾀﾙ @ja
definition: This industry subgroup includes companies that operate websites that use a search engine to generate and maintain extensive databases of Internet addresses and content in an easily searchable format.
notation: 10101511
valid from: 2014-08-08
valid till: 2020-10-03

Adv Rev - Medical & Health Web
type: BicsLevel5Segment
type: Classifier
type: NamedIndividual
is level5 segment of: Medical & Health Web
is anachronous version of: http://data.ga-group.nl/ics/bics/101014102110
is contemporary version of: http://data.ga-group.nl/ics/bics/1010151210
is replaced by: http://data.ga-group.nl/ics/bics/2020/101014102110
is version of: http://data.ga-group.nl/ics/bics/101014102110
is version of: http://data.ga-group.nl/ics/bics/1010151210
imported on: 2026-06-08T13:03:47.798Z
last refreshed on: 2026-06-08T13:03:47.798Z
source accessed on: 2019-12-03T20:05:01Z
source last accessed on: 2019-12-03T20:05:01Z
label: Ingreso de publicidad-sitios web de salud @es
label: Rec prop - Web saúde e médico @pt
label: Rev pub - Cabinets médicaux et santé Web @fr
label: Ric pubb - Siti medicina e salute @it
label: Werbeerlös - Medizin- & Gesundheits-Webseiten @de
label: Рекламн. врчк - сайты по медицине и здоровью @ru
label: 广告收入-医疗与健康网站 @zh
label: 広告売上高 -医療･健康ｳｪﾌﾞｻｲﾄ @ja
label: 廣告收入-醫療及保健網站 @zh-hant
label: 광고 수익 - 의료 & 건강 웹 @ko
definition: This segment includes revenue that medical, health and fitness websites generate from advertising.
notation: 1010151210
valid from: 2014-08-08
valid till: 2020-10-03

Other - Medical & Health Web
type: BicsLevel5Segment
type: Classifier
type: NamedIndividual
is level5 segment of: Medical & Health Web
is anachronous version of: http://data.ga-group.nl/ics/bics/101014102111
is contemporary version of: http://data.ga-group.nl/ics/bics/1010151211
is replaced by: http://data.ga-group.nl/ics/bics/2020/101014102111
is version of: http://data.ga-group.nl/ics/bics/101014102111
is version of: http://data.ga-group.nl/ics/bics/1010151211
imported on: 2026-06-08T13:03:47.798Z
last refreshed on: 2026-06-08T13:03:47.798Z
source accessed on: 2019-12-03T20:05:01Z
source last accessed on: 2019-12-03T20:05:01Z
label: Altro - Siti medicina e salute @it
label: Autres - Sites Web sur la santé et les soins médicaux @fr
label: Otro-web médicos y de sanidad @es
label: Out - Web saúde e médico @pt
label: Sonst. - Medizin- & Gesundheits-Webseiten @de
label: Пр. - сайты по медицине и здоровью @ru
label: その他 -医療��健康ｳｪﾌﾞｻｲﾄ @ja
label: 其他-醫療及保健網站 @zh-hant
label: 其他收入-医疗与健康网站 @zh
label: 기타 - 의료 & 건강 웹 @ko
definition: This segment includes revenue that medical, health and fitness websites generate from sources other than advertising.
notation: 1010151211
valid from: 2014-08-08
valid till: 2020-10-03

Medical & Health Web
type: BicsLevel4SubIndustry
type: Classifier
type: NamedIndividual
is sub industry of: Internet Media
is anachronous version of: http://data.ga-group.nl/ics/bics/1010141021
is contemporary version of: http://data.ga-group.nl/ics/bics/10101512
is replaced by: http://data.ga-group.nl/ics/bics/2020/1010141021
is version of: http://data.ga-group.nl/ics/bics/1010141021
is version of: http://data.ga-group.nl/ics/bics/10101512
imported on: 2026-06-08T13:03:47.798Z
last refreshed on: 2026-06-08T13:03:47.798Z
source accessed on: 2019-12-03T20:05:01Z
source last accessed on: 2019-12-03T20:05:01Z
label: Medizin- & Gesundheits-Webseiten @de
label: Santé et soins médicaux Web @fr
label: Siti web medicina e salute @it
label: Web de saúde e médico @pt
label: Web médico y de salud @es
label: Сайты по медицине и здоровью @ru
label: 医疗与健康网站 @zh
label: 医療･健康ｳｪﾌﾞｻｲﾄ @ja
label: 醫療及保健網站 @zh-hant
label: 의료 & 건강 웹 @ko
definition: This industry subgroup includes companies that provide medical, health and fitness content online in an easily searchable format.
notation: 10101512
valid from: 2014-08-08
valid till: 2020-10-03

Adv Rev-News/Sport/Entmt Web
type: BicsLevel5Segment
type: Classifier
type: NamedIndividual
is level5 segment of: News, Sports & Entmt Web
is anachronous version of: http://data.ga-group.nl/ics/bics/101014102210
is contemporary version of: http://data.ga-group.nl/ics/bics/1010151310
is replaced by: http://data.ga-group.nl/ics/bics/2020/101014102210
is version of: http://data.ga-group.nl/ics/bics/101014102210
is version of: http://data.ga-group.nl/ics/bics/1010151310
imported on: 2026-06-08T13:03:47.798Z
last refreshed on: 2026-06-08T13:03:47.798Z
source accessed on: 2019-12-03T20:05:01Z
source last accessed on: 2019-12-03T20:05:01Z
label: Ingreso de publicidad-sitios web de noticias, deportes y entretenimiento @es
label: Rec prop-Websites/notícias/esporte/entret @pt
label: Rev pub - Infos, sport et divertissement Web @fr
label: Ric pubb-Siti notizie/sport/intratt @it
label: Werbeerlös - Web: News, Sport & Unterhaltung @de
label: Рекламн. врчк - порталы новостей, спорта и развлечений @ru
label: 广告收入-新闻、体育及娱乐网站 @zh
label: 広告売上高 -ﾆｭｰｽ､ｽﾎﾟｰﾂ､芸能ｳｪﾌﾞｻｲﾄ @ja
label: 廣告收入-新聞/體育/娛樂網站 @zh-hant
label: 광고 수익 - 뉴스/스포츠/엔터테인먼트 웹 @ko
definition: This segment includes revenue that news, sports and entertainment portals generate from advertising.
notation: 1010151310
valid from: 2014-08-08
valid till: 2020-10-03

Other-News/Sport/Entmt Web
type: BicsLevel5Segment
type: Classifier
type: NamedIndividual
is level5 segment of: News, Sports & Entmt Web
is anachronous version of: http://data.ga-group.nl/ics/bics/101014102211
is contemporary version of: http://data.ga-group.nl/ics/bics/1010151311
is replaced by: http://data.ga-group.nl/ics/bics/2020/101014102211
is version of: http://data.ga-group.nl/ics/bics/101014102211
is version of: http://data.ga-group.nl/ics/bics/1010151311
imported on: 2026-06-08T13:03:47.798Z
last refreshed on: 2026-06-08T13:03:47.798Z
source accessed on: 2019-12-03T20:05:01Z
source last accessed on: 2019-12-03T20:05:01Z
label: Altro-Siti notizie/sport/intratt @it
label: Autres - Infos, sports et divertissement Web @fr
label: Otro - noticias, deportes, web de entretenimiento @es
label: Out-Web notícias/esporte/entret @pt
label: Sonst. - Web: News, Sport & Unterhaltung @de
label: Пр. - порталы новостей, спорта и развлечений @ru
label: その他 -ﾆｭｰｽ､ｽﾎﾟｰﾂ､芸能ｳｪﾌﾞ���ｲﾄ @ja
label: 其他收入-新聞/體育/娛樂網站 @zh-hant
label: 其他收入-新闻、体育及娱乐网站 @zh
label: 기타 - 뉴스/스포츠/엔터테인먼트 웹 @ko
definition: This segment includes revenue that news, sports and entertainment websites generate from sources other than advertising.
notation: 1010151311
valid from: 2014-08-08
valid till: 2020-10-03

News, Sports & Entmt Web
type: BicsLevel4SubIndustry
type: Classifier
type: NamedIndividual
is sub industry of: Internet Media
is anachronous version of: http://data.ga-group.nl/ics/bics/1010141022
is contemporary version of: http://data.ga-group.nl/ics/bics/10101513
is replaced by: http://data.ga-group.nl/ics/bics/2020/1010141022
is version of: http://data.ga-group.nl/ics/bics/1010141022
is version of: http://data.ga-group.nl/ics/bics/10101513
imported on: 2026-06-08T13:03:47.798Z
last refreshed on: 2026-06-08T13:03:47.798Z
source accessed on: 2019-12-03T20:05:01Z
source last accessed on: 2019-12-03T20:05:01Z
label: Infos, sports et divertissement Web @fr
label: Siti notizie, sport e intratt @it
label: Web de noticias, deport y entret @es
label: Web notícias, esportes e entret @pt
label: Web: News, Sport & Unterhaltung @de
label: Порталы новостей, спорта и развлечений @ru
label: 新聞、體育及娛樂網站 @zh-hant
label: 新闻、体育及娱乐网站 @zh
label: 뉴스, 스포츠 & 엔터테인먼트 웹 @ko
label: ﾆｭｰｽ･ｽﾎﾟｰﾂ･ｴﾝﾀｰﾃｲﾝﾒﾝﾄｳｪﾌﾞｻｲﾄ @ja
definition: This industry subgroup includes companies that provide news, sports and entertainment content online in an easily searchable format.
notation: 10101513
valid from: 2014-08-08
valid till: 2020-10-03

Adv Rev - Online Communities
type: BicsLevel5Segment
type: Classifier
type: NamedIndividual
is level5 segment of: Online Communities
is anachronous version of: http://data.ga-group.nl/ics/bics/101014102310
is contemporary version of: http://data.ga-group.nl/ics/bics/1010151410
is replaced by: http://data.ga-group.nl/ics/bics/2020/101014102310
is version of: http://data.ga-group.nl/ics/bics/101014102310
is version of: http://data.ga-group.nl/ics/bics/1010151410
imported on: 2026-06-08T13:03:47.798Z
last refreshed on: 2026-06-08T13:03:47.798Z
source accessed on: 2019-12-03T20:05:01Z
source last accessed on: 2019-12-03T20:05:01Z
label: Ingreso de publicidad-comunidades @es
label: Rec prob - Comunidades online @pt
label: Rev pub - Communautés en ligne @fr
label: Ric pubb - Comunità online @it
label: Werbeerlös - Online-Gemeinden @de
label: Рекламн. врчк - Интернет-сообщества @ru
label: 广告收入-在线社区 @zh
label: 広告売上高 -ｵﾝﾗｲﾝ･ｺﾐｭﾆﾃｨ @ja
label: 廣告收入-線上社群 @zh-hant
label: 광고 수익 - 온라인 커뮤니티 @ko
definition: This segment includes revenue that online communities’ websites generate from advertising.
notation: 1010151410
valid from: 2014-08-08
valid till: 2020-10-03

Other Rev - Online Communities
type: BicsLevel5Segment
type: Classifier
type: NamedIndividual
is level5 segment of: Online Communities
is anachronous version of: http://data.ga-group.nl/ics/bics/101014102311
is contemporary version of: http://data.ga-group.nl/ics/bics/1010151411
is replaced by: http://data.ga-group.nl/ics/bics/2020/101014102311
is version of: http://data.ga-group.nl/ics/bics/101014102311
is version of: http://data.ga-group.nl/ics/bics/1010151411
imported on: 2026-06-08T13:03:47.798Z
last refreshed on: 2026-06-08T13:03:47.798Z
source accessed on: 2019-12-03T20:05:01Z
source last accessed on: 2019-12-03T20:05:01Z
label: Altri ric - Comunità online @it
label: Autrs rev - Communautés en ligne @fr
label: Otro ing - comunidades en línea @es
label: Out rec - Comunidades online @pt
label: Sonst. Erl. - Online-Gemeinden @de
label: Пр. врчк - Интернет-сообщества @ru
label: その他売上高 -ｵﾝﾗｲﾝ･ｺﾐｭﾆﾃｨ @ja
label: 其他收入-在线社区 @zh
label: 其他收入-線上社群 @zh-hant
label: 기타 수익 - 온라인 커뮤니티 @ko
definition: This segment includes revenue that online communities’ websites generate from sources other than advertising.
notation: 1010151411
valid from: 2014-08-08
valid till: 2020-10-03

Online Communities
type: BicsLevel4SubIndustry
type: Classifier
type: NamedIndividual
is sub industry of: Internet Media
is anachronous version of: http://data.ga-group.nl/ics/bics/1010141023
is contemporary version of: http://data.ga-group.nl/ics/bics/10101514
is replaced by: http://data.ga-group.nl/ics/bics/2020/1010141023
is version of: http://data.ga-group.nl/ics/bics/1010141023
is version of: http://data.ga-group.nl/ics/bics/10101514
imported on: 2026-06-08T13:03:47.798Z
last refreshed on: 2026-06-08T13:03:47.798Z
source accessed on: 2019-12-03T20:05:01Z
source last accessed on: 2019-12-03T20:05:01Z
label: Communautés en ligne @fr
label: Comunidades en línea @es
label: Comunidades online @pt
label: Comunità online @it
label: Online-Gemeinden @de
label: Интернет-сообщества @ru
label: 在线社区 @zh
label: 線上社群 @zh-hant
label: 온라인 커뮤니티 @ko
label: ｵﾝﾗｲﾝ･ｺﾐｭﾆﾃｨ @ja
definition: This industry subgroup includes companies that provide Web communities online. A Web community may take the form of a social network service, an Internet forum or a group of blogs.
notation: 10101514
valid from: 2014-08-08
valid till: 2020-10-03

Adv Rev - Miscellaneous Web
type: BicsLevel5Segment
type: Classifier
type: Discontinued
type: NamedIndividual
is level5 segment of: Miscellaneous Web
is contemporary version of: http://data.ga-group.nl/ics/bics/1010151510
is version of: http://data.ga-group.nl/ics/bics/1010151510
imported on: 2026-06-08T13:03:47.798Z
last refreshed on: 2026-06-08T13:03:47.798Z
source accessed on: 2019-12-03T20:05:01Z
source last accessed on: 2019-12-03T20:05:01Z
label: Entrate pubblicitarie-Altri siti web @it
label: Ingreso de publicidad-Sitios Web variados @es
label: Receita de publicidade -Websites diversos @pt
label: Recettes de publicité - Sites Internet divers @fr
label: Werbungserlös - diverse Webseiten @de
label: Доход от рекламы - Различные вебсайты @ru
label: 广告收入 - 其他网站 @zh
label: 広告売上高 -その他ｳｪﾌﾞｻｲﾄ @ja
label: 廣告收入 - 其他網站 @zh-hant
label: 광고수익 - 기타 웹사이트 @ko
definition: This segment includes revenue that miscellaneous websites generate from advertising.
notation: 1010151510
valid from: 2014-08-08
valid till: 2020-10-03

Other Rev - Miscellaneous Web
type: BicsLevel5Segment
type: Classifier
type: Discontinued
type: NamedIndividual
is level5 segment of: Miscellaneous Web
is contemporary version of: http://data.ga-group.nl/ics/bics/1010151511
is version of: http://data.ga-group.nl/ics/bics/1010151511
imported on: 2026-06-08T13:03:47.798Z
last refreshed on: 2026-06-08T13:03:47.798Z
source accessed on: 2019-12-03T20:05:01Z
source last accessed on: 2019-12-03T20:05:01Z
label: Altri ric- Siti vari @it
label: Autres rev - sites Web divers @fr
label: Otro ing - web variado @es
label: Out rec - Web diversos @pt
label: Sonst. Erlös - Versch. Webseiten @de
label: Др. врчк - пр. веб-сайты @ru
label: その他売上高 -その他ｳｪﾌﾞｻｲﾄ @ja
label: 其他收入-其他網站 @zh-hant
label: 其他收入-其他网站 @zh
label: 기타 수익 - 기타 웹 @ko
definition: This segment includes revenue that miscellaneous websites generate from sources other than advertising.
notation: 1010151511
valid from: 2014-08-08
valid till: 2020-10-03

Miscellaneous Web
type: BicsLevel4SubIndustry
type: Classifier
type: Discontinued
type: NamedIndividual
is sub industry of: Internet Media
is contemporary version of: http://data.ga-group.nl/ics/bics/10101515
is version of: http://data.ga-group.nl/ics/bics/10101515
imported on: 2026-06-08T13:03:47.798Z
last refreshed on: 2026-06-08T13:03:47.798Z
source accessed on: 2019-12-03T20:05:01Z
source last accessed on: 2019-12-03T20:05:01Z
label: Site Web divers @fr
label: Siti vari @it
label: Varios Sitios web @es
label: Versch. Webseiten @de
label: Web diversos @pt
label: Пр. веб-сайты @ru
label: その他ｳｪﾌﾞｻｲﾄ @ja
label: 其他网站 @zh
label: 綜合網站 @zh-hant
label: 기타 웹 @ko
definition: This industry subgroup includes companies that operate websites that provide Internet media not elsewhere classified.
notation: 10101515
valid from: 2014-08-08
valid till: 2020-10-03

Internet Media
type: BicsLevel3Industry
type: Classifier
type: NamedIndividual
is industry of: Media
is anachronous version of: http://data.ga-group.nl/ics/bics/10101410
is contemporary version of: http://data.ga-group.nl/ics/bics/101015
is replaced by: http://data.ga-group.nl/ics/bics/2020/10101410
is version of: http://data.ga-group.nl/ics/bics/10101410
is version of: http://data.ga-group.nl/ics/bics/101015
imported on: 2026-06-08T13:03:47.798Z
last refreshed on: 2026-06-08T13:03:47.798Z
source accessed on: 2019-12-03T20:05:01Z
source last accessed on: 2019-12-03T20:05:01Z
label: Editoria via Internet @it
label: Internet-Medien @de
label: Média internet @fr
label: Mídia-Internet @pt
label: Prensa en Internet @es
label: Интернет СМИ @ru
label: 互联网媒体 @zh
label: 網路媒體 @zh-hant
label: 인터넷 미디어 @ko
label: ｲﾝﾀｰﾈｯﾄﾒﾃﾞｨｱ @ja
definition: This industry includes websites that create or distribute content. Typically, these websites derive revenue from advertisements. Excludes companies that provide services through websites (see Internet Based Services).
notation: 101015
valid from: 2014-08-08
valid till: 2020-10-03

Media
type: BicsLevel2IndustryGroup
type: Classifier
type: NamedIndividual
is industry group of: Communications
is contemporary version of: http://data.ga-group.nl/ics/bics/1010
is replaced by: http://data.ga-group.nl/ics/bics/2020/1010
is version of: http://data.ga-group.nl/ics/bics/1010
imported on: 2026-06-08T13:03:47.798Z
last refreshed on: 2026-06-08T13:03:47.798Z
source accessed on: 2019-12-03T20:05:01Z
source last accessed on: 2019-12-03T20:05:01Z
label: Médias @fr
label: Mídia @pt
label: Medien @de
label: Prensa @es
label: СМИ @ru
label: 媒体 @zh
label: 媒體 @zh-hant
label: 미디어 @ko
label: ﾒﾃﾞｨｱ @ja
definition: This industry group includes companies that create, distribute or publish media content. Media content exists in a wide variety of forms, such as print, advertisements, motion picture, television, music, radio and Internet websites. Also included are cable and satellite providers.
notation: 1010
valid from: 2014-08-08
valid till: 2020-10-03

Mobile Voice Services
type: BicsLevel6Segment
type: Classifier
type: NamedIndividual
is level6 segment of: Wireless Service Providers
is contemporary version of: http://data.ga-group.nl/ics/bics/101110101010
is replaced by: http://data.ga-group.nl/ics/bics/2020/101110101010
is version of: http://data.ga-group.nl/ics/bics/101110101010
imported on: 2026-06-08T13:03:47.798Z
last refreshed on: 2026-06-08T13:03:47.798Z
source accessed on: 2019-12-03T20:05:01Z
source last accessed on: 2019-12-03T20:05:01Z
label: Mobile Sprachdienste @de
label: Serviço de voz móvel @pt
label: Services voix mobiles @fr
label: Servicios móviles de voz @es
label: Servizi voce-Mobile @it
label: Услуги мобильн. голосовой связи @ru
label: 携帯通信音声ｻｰﾋﾞｽ @ja
label: 移动语音服务 @zh
label: 行動語音服務 @zh-hant
label: 모바일 음성 서비스 @ko
definition: This segment includes wireless carriers that offer mobile voice services.
notation: 101110101010
valid from: 2014-08-08
valid till: 2020-10-03

Mobile Data Services
type: BicsLevel6Segment
type: Classifier
type: NamedIndividual
is level6 segment of: Wireless Service Providers
is contemporary version of: http://data.ga-group.nl/ics/bics/101110101011
is replaced by: http://data.ga-group.nl/ics/bics/2020/101110101011
is version of: http://data.ga-group.nl/ics/bics/101110101011
imported on: 2026-06-08T13:03:47.798Z
last refreshed on: 2026-06-08T13:03:47.798Z
source accessed on: 2019-12-03T20:05:01Z
source last accessed on: 2019-12-03T20:05:01Z
label: Mobile Datendienste @de
label: Serviços dados móvel @pt
label: Services données mobiles @fr
label: Servicios móviles de datos @es
label: Servizi dati Mobili @it
label: Мобильн. усл. данных @ru
label: 携帯通信ﾃﾞｰﾀｻｰﾋﾞｽ @ja
label: 移动数据服务 @zh
label: 行動數據服務 @zh-hant
label: 모바일 데이터 서비스 @ko
definition: This segment includes wireless carriers that provide a broad range of mobile data services, such as wireless Internet access, video, games, ring tones, music and other services.
notation: 101110101011
valid from: 2014-08-08
valid till: 2020-10-03

Mobile Text Messaging (SMS)
type: BicsLevel6Segment
type: Classifier
type: NamedIndividual
is level6 segment of: Wireless Service Providers
is contemporary version of: http://data.ga-group.nl/ics/bics/101110101012
is replaced by: http://data.ga-group.nl/ics/bics/2020/101110101012
is version of: http://data.ga-group.nl/ics/bics/101110101012
imported on: 2026-06-08T13:03:47.798Z
last refreshed on: 2026-06-08T13:03:47.798Z
source accessed on: 2019-12-03T20:05:01Z
source last accessed on: 2019-12-03T20:05:01Z
label: Mensagem de texto de telefone móvel @pt
label: Mensajes de texto en celulares (SMS) @es
label: Message texte (SMS) par mobile @fr
label: Messaggi (SMS) @it
label: Textnachrichten (SMS) @de
label: Мобильные текстовые сообщения (SMS) @ru
label: 手机短信 (SMS) @zh
label: 携帯ﾃｷｽﾄﾒｯｾｰｼﾞ(SMS) @ja
label: 行動簡訊(SMS) @zh-hant
label: 모바일 문자 메시지 (SMS) @ko
definition: This segment includes wireless carriers that offer mobile short message service (SMS), also known as text messaging.
notation: 101110101012
valid from: 2014-08-08
valid till: 2020-10-03

Mobile Roaming Services
type: BicsLevel6Segment
type: Classifier
type: NamedIndividual
is level6 segment of: Wireless Service Providers
is contemporary version of: http://data.ga-group.nl/ics/bics/101110101013
is replaced by: http://data.ga-group.nl/ics/bics/2020/101110101013
is version of: http://data.ga-group.nl/ics/bics/101110101013
imported on: 2026-06-08T13:03:47.798Z
last refreshed on: 2026-06-08T13:03:47.798Z
source accessed on: 2019-12-03T20:05:01Z
source last accessed on: 2019-12-03T20:05:01Z
label: Mobile Roaming-Dienste @de
label: Serviços roaming móvel @pt
label: Services d'itinérance de mobiles @fr
label: Servicios móviles de itinerancia @es
label: Servizi roaming Mobile @it
label: Мобильные услуги роуминга @ru
label: 携帯ﾛｰﾐﾝｸﾞｻｰﾋﾞｽ @ja
label: 移动漫游服务 @zh
label: 行動漫遊服務 @zh-hant
label: 모바일 로밍 서비스 @ko
definition: This segment includes wireless carriers that provide mobile roaming services. Such services allow subscribers from other carriers' networks to make and receive calls over its own network.
notation: 101110101013
valid from: 2014-08-08
valid till: 2020-10-03

Wireless Infra Access Revenue
type: BicsLevel6Segment
type: Classifier
type: NamedIndividual
is level6 segment of: Wireless Service Providers
is contemporary version of: http://data.ga-group.nl/ics/bics/101110101014
is replaced by: http://data.ga-group.nl/ics/bics/2020/101110101014
is version of: http://data.ga-group.nl/ics/bics/101110101014
imported on: 2026-06-08T13:03:47.798Z
last refreshed on: 2026-06-08T13:03:47.798Z
source accessed on: 2019-12-03T20:05:01Z
source last accessed on: 2019-12-03T20:05:01Z
label: Erlös kabelloser Infrastrukturzugang @de
label: Ingreso de acceso al infraestructura inalámbrica @es
label: Receita de acesso infra sem fio @pt
label: Revenus d'accès infra sans fil @fr
label: Ricavi accesso infrastruttura senza fili @it
label: Врчк от предост. доступа к инфрастр-ре буспроводн. сети @ru
label: 无线基础设施使用收入 @zh
label: 無線基礎建設使用收入 @zh-hant
label: 無線ｲﾝﾌﾗ���続収入 @ja
label: 무선인프라 접속 수익 @ko
definition: This segment includes carriers that sell wireless network capacity on a wholesale basis to other wireless service providers who, in turn, use this network capacity to market branded mobile services to their customers.
notation: 101110101014
valid from: 2014-08-08
valid till: 2020-10-03

Wireless Service Providers
type: BicsLevel5Segment
type: Classifier
type: NamedIndividual
is level5 segment of: Wireless Telecom Services
is contemporary version of: http://data.ga-group.nl/ics/bics/1011101010
is replaced by: http://data.ga-group.nl/ics/bics/2020/1011101010
is version of: http://data.ga-group.nl/ics/bics/1011101010
imported on: 2026-06-08T13:03:47.798Z
last refreshed on: 2026-06-08T13:03:47.798Z
source accessed on: 2019-12-03T20:05:01Z
source last accessed on: 2019-12-03T20:05:01Z
label: Drahtlose Service-Anbieter @de
label: Fornitori servizi wireless @it
label: Fournisseurs services sans fil @fr
label: Provedores de serviços sem fios @pt
label: Proveedores de servicios inhalámbricos @es
label: Провайдеры беспроводной связи @ru
label: 无线服务供应商 @zh
label: 無線服務供應商 @zh-hant
label: 이동통신서비스 제공업체 @ko
label: ﾜｲﾔﾚｽｻｰﾋﾞｽﾌﾟﾛﾊﾞｲﾀﾞｰ @ja
definition: This segment includes companies that provide mobile phone services, such as telephone voice services, data services, text messaging services and roaming services.
notation: 1011101010
valid from: 2014-08-08
valid till: 2020-10-03

Satellite Telecom (exclude TV)
type: BicsLevel5Segment
type: Classifier
type: NamedIndividual
is level5 segment of: Wireless Telecom Services
is contemporary version of: http://data.ga-group.nl/ics/bics/1011101011
is replaced by: http://data.ga-group.nl/ics/bics/2020/1011101011
is version of: http://data.ga-group.nl/ics/bics/1011101011
imported on: 2026-06-08T13:03:47.798Z
last refreshed on: 2026-06-08T13:03:47.798Z
source accessed on: 2019-12-03T20:05:01Z
source last accessed on: 2019-12-03T20:05:01Z
label: Satelliten-Telekommunikation (exkl. TV) @de
label: Télécom par satellite (hors TV) @fr
label: Telecom satélite (exceto TV) @pt
label: Telecom satélite (sin TV) @es
label: Telecom satellitarie (escl TV) @it
label: Спутниковая связь (искл. ТВ) @ru
label: 衛星通信(除ﾃﾚﾋﾞ) @ja
label: 衛星電信(除電視) @zh-hant
label: 위성 정보통신(TV 제외) @ko
label: ���星电信(除电视) @zh
definition: This segment includes companies that provide telecommunications services via satellite. Also includes resellers, which are carriers that buy satellite capacity on a wholesale basis and resell it as a branded service to their customers as well as owners and operators of satellites.
notation: 1011101011
valid from: 2014-08-08
valid till: 2020-10-03

Mobile Comm Device Revenue
type: BicsLevel5Segment
type: Classifier
type: NamedIndividual
is level5 segment of: Wireless Telecom Services
is contemporary version of: http://data.ga-group.nl/ics/bics/1011101012
is replaced by: http://data.ga-group.nl/ics/bics/2020/1011101012
is version of: http://data.ga-group.nl/ics/bics/1011101012
imported on: 2026-06-08T13:03:47.798Z
last refreshed on: 2026-06-08T13:03:47.798Z
source accessed on: 2019-12-03T20:05:01Z
source last accessed on: 2019-12-03T20:05:01Z
label: Erlös aus mobilen Kommunikationsgeräten @de
label: Ingreso de dispositivos móviles de comunicaciones @es
label: Receita de aparelhos de comunicações móveis @pt
label: Revenu d'appareils de communication mobile @fr
label: Ricavi apparati comunicazione mobile @it
label: Выручка от устройств мобильной связи @ru
label: 移动通信设备收入 @zh
label: 移動体通信機器売上高 @ja
label: 行動通信裝置收入 @zh-hant
label: 이동통신기기 매출액 @ko
definition: This segment includes carriers that generate revenue from the sale of mobile handsets and other wireless devices, such as tablet personal computers. These devices are frequently sold along with a prepaid or postpaid wireless subscription.
notation: 1011101012
valid from: 2014-08-08
valid till: 2020-10-03

Wireless Telecom Services
type: BicsLevel4SubIndustry
type: Classifier
type: NamedIndividual
is sub industry of: Telecom Carriers
is contemporary version of: http://data.ga-group.nl/ics/bics/10111010
is replaced by: http://data.ga-group.nl/ics/bics/2020/10111010
is version of: http://data.ga-group.nl/ics/bics/10111010
imported on: 2026-06-08T13:03:47.798Z
last refreshed on: 2026-06-08T13:03:47.798Z
source accessed on: 2019-12-03T20:05:01Z
source last accessed on: 2019-12-03T20:05:01Z
label: Drahtlose Telekomm.-Dienste @de
label: Serviços sem fio Telecom @pt
label: Services de télécomm sans fil @fr
label: Servicios de telecomunicaciones inalámbricas @es
label: Servizi di telecom senza fili @it
label: Беспроводные телекоммуникационные услуги @ru
label: 无线电信服务 @zh
label: 無線通信ｻｰﾋﾞｽ @ja
label: 無線通訊服務 @zh-hant
label: 무선 정보통신 서비스 @ko
definition: This industry subgroup includes companies that use a wireless infrastructure to provide a variety of services, such as wireless telephony services, wireless data services, text messaging/short messaging services (SMS), roaming, wireless Internet services and satellite telecommunications. These companies have spectrum licenses and provide services using that spectrum.
notation: 10111010
valid from: 2014-08-08
valid till: 2020-10-03

VOIP Services
type: BicsLevel6Segment
type: Classifier
type: NamedIndividual
is level6 segment of: Wireline Voice Svcs - Telecom
is contemporary version of: http://data.ga-group.nl/ics/bics/101110111010
is replaced by: http://data.ga-group.nl/ics/bics/2020/101110111010
is version of: http://data.ga-group.nl/ics/bics/101110111010
imported on: 2026-06-08T13:03:47.798Z
last refreshed on: 2026-06-08T13:03:47.798Z
source accessed on: 2019-12-03T20:05:01Z
source last accessed on: 2019-12-03T20:05:01Z
label: Serviços protocolo Voice over Internet (IP) @pt
label: Servicios de protocolo de Internet (IP) de "voice over" @es
label: Servizi Voice over Internet Protocol (VOIP) @it
label: Téléphonie sur Internet (VOIP) @fr
label: VoIP-Dienstleistungen @de
label: Услуги протокола VoIP @ru
label: 網路語音 (IP) 電話服務 @zh-hant
label: 网络(IP)电话服务 @zh
label: 음성 인터넷 프로토콜(IP) 서비스 @ko
label: ｲﾝﾀｰﾈｯﾄ･ﾌﾟﾛﾄｺﾙ(IP)電話ｻｰﾋﾞｽ @ja
definition: This segment includes carriers that offer voice-over-IP (VoIP) through a wired Internet or broadband connection. Such service entails the transmission of voice over the Internet or through another packet-switched network.
notation: 101110111010
valid from: 2014-08-08
valid till: 2020-10-03

Wireline Local Services
type: BicsLevel6Segment
type: Classifier
type: NamedIndividual
is level6 segment of: Wireline Voice Svcs - Telecom
is contemporary version of: http://data.ga-group.nl/ics/bics/101110111011
is replaced by: http://data.ga-group.nl/ics/bics/2020/101110111011
is version of: http://data.ga-group.nl/ics/bics/101110111011
imported on: 2026-06-08T13:03:47.798Z
last refreshed on: 2026-06-08T13:03:47.798Z
source accessed on: 2019-12-03T20:05:01Z
source last accessed on: 2019-12-03T20:05:01Z
label: Kabelgebundene Ortsgespräche @de
label: Serv tel local-Inal @es
label: Serviços de telefonia fixa locais @pt
label: Services d'appels locaux filaires @fr
label: Tel urbano fisso @it
label: Проводная телефонная связь @ru
label: 固定回線市内電話ｻｰﾋﾞｽ @ja
label: 有線短途服務 @zh-hant
label: 本地电话服务-有线 @zh
label: 유선 지역 서비스 @ko
definition: This segment includes wireline carriers that offer fixed-line local phone service to business and residential customers.
notation: 101110111011
valid from: 2014-08-08
valid till: 2020-10-03

Wireline Long Distance Services
type: BicsLevel6Segment
type: Classifier
type: NamedIndividual
is level6 segment of: Wireline Voice Svcs - Telecom
is contemporary version of: http://data.ga-group.nl/ics/bics/101110111012
is replaced by: http://data.ga-group.nl/ics/bics/2020/101110111012
is version of: http://data.ga-group.nl/ics/bics/101110111012
imported on: 2026-06-08T13:03:47.798Z
last refreshed on: 2026-06-08T13:03:47.798Z
source accessed on: 2019-12-03T20:05:01Z
source last accessed on: 2019-12-03T20:05:01Z
label: Kabelgebundene Ferngesprächsdienste @de
label: Serviços de telefonia fixa de longa distância @pt
label: Services d'appels longue distance filaires @fr
label: Servicios larga dist-alámbricos @es
label: Servizi telefonia fissa a lunga distanza @it
label: Услуги междугородной связи @ru
label: 固定回線長距離電話ｻｰﾋﾞｽ @ja
label: 固網長途服務 @zh-hant
label: 有限长途电话服务 @zh
label: 유선 장거리 서비스 @ko
definition: This segment includes carriers that offer domestic and international long-distance services over a wireline network.
notation: 101110111012
valid from: 2014-08-08
valid till: 2020-10-03

Wireline Rental
type: BicsLevel6Segment
type: Classifier
type: NamedIndividual
is level6 segment of: Wireline Voice Svcs - Telecom
is contemporary version of: http://data.ga-group.nl/ics/bics/101110111013
is replaced by: http://data.ga-group.nl/ics/bics/2020/101110111013
is version of: http://data.ga-group.nl/ics/bics/101110111013
imported on: 2026-06-08T13:03:47.798Z
last refreshed on: 2026-06-08T13:03:47.798Z
source accessed on: 2019-12-03T20:05:01Z
source last accessed on: 2019-12-03T20:05:01Z
label: Alq líneas tel alám @es
label: Aluguel de telefonia fixa @pt
label: Kabelgebunden, Miete @de
label: Loc ligne téléph fil @fr
label: Noleggio linea telef @it
label: Аренда оборуд. для проводной связи @ru
label: 固定回線賃貸収入 @ja
label: 有線電話線出租 @zh-hant
label: 有线电话线出租收入 @zh
label: 유선 대여 @ko
definition: This segment includes revenue that fixed-line carriers generate from leasing lines.
notation: 101110111013
valid from: 2014-08-08
valid till: 2020-10-03

Other Wireline Revenue
type: BicsLevel6Segment
type: Classifier
type: Discontinued
type: NamedIndividual
is level6 segment of: Wireline Voice Svcs - Telecom
is contemporary version of: http://data.ga-group.nl/ics/bics/101110111014
is version of: http://data.ga-group.nl/ics/bics/101110111014
imported on: 2026-06-08T13:03:47.798Z
last refreshed on: 2026-06-08T13:03:47.798Z
source accessed on: 2019-12-03T20:05:01Z
source last accessed on: 2019-12-03T20:05:01Z
label: Altri ricavi line telefoniche @it
label: Autre revenu de filaire @fr
label: Otro ingr telef-Alám @es
label: Outra receita de telefonia fixa @pt
label: Sonstige kabelgebundene Erlöse @de
label: Другой доход от проводной связи @ru
label: その他固定回線収入 @ja
label: 其他有線收入 @zh-hant
label: 其他有线电话收入 @zh
label: 기타 유선 매출 @ko
definition: This segment includes revenue that fixed-line carriers generate from all services, excluding revenue from leased line, local and long-distance services.
notation: 101110111014
valid from: 2014-08-08
valid till: 2020-10-03

Wireline Voice Svcs - Telecom
type: BicsLevel5Segment
type: Classifier
type: NamedIndividual
is level5 segment of: Wireline Telecom Services
is contemporary version of: http://data.ga-group.nl/ics/bics/1011101110
is replaced by: http://data.ga-group.nl/ics/bics/2020/1011101110
is version of: http://data.ga-group.nl/ics/bics/1011101110
imported on: 2026-06-08T13:03:47.798Z
last refreshed on: 2026-06-08T13:03:47.798Z
source accessed on: 2019-12-03T20:05:01Z
source last accessed on: 2019-12-03T20:05:01Z
label: Kabelgebundener Voiceservice - Telekomm. @de
label: Serv vocali cavo - Telecom @it
label: Serv voix filaire - Télécom @fr
label: Serv voz fixa - Telecom @pt
label: Servicios alámbricos de voz - Telecomunicaciones @es
label: Услуги проводн. голосов. связи телекоммуник. @ru
label: 固網通話服務-電信 @zh-hant
label: 有線音声ｻｰﾋﾞｽ -通信 @ja
label: 有线语音服务-电信 @zh
label: 유선 음성 서비스 - 정보통신 @ko
definition: This segment includes wireline network operators that offer voice services over a fixed-line network. Such services include wireline local and long-distance services as well as voice-over-IP (VoIP) to residential and business customers.
notation: 1011101110
valid from: 2014-08-08
valid till: 2020-10-03

Wireline ISPs - Telecom
type: BicsLevel5Segment
type: Classifier
type: NamedIndividual
is level5 segment of: Wireline Telecom Services
is contemporary version of: http://data.ga-group.nl/ics/bics/1011101111
is replaced by: http://data.ga-group.nl/ics/bics/2020/1011101111
is version of: http://data.ga-group.nl/ics/bics/1011101111
imported on: 2026-06-08T13:03:47.798Z
last refreshed on: 2026-06-08T13:03:47.798Z
source accessed on: 2019-12-03T20:05:01Z
source last accessed on: 2019-12-03T20:05:01Z
label: ISP filaire - Télécom @fr
label: Kabelgebundener ISPs - Telekomm. @de
label: Prov Internet alámbr @es
label: Provedores de serviço de internet sem fio - telecom @pt
label: Provider serv Internet fisso - Telecom @it
label: Провайдеры интернет-услуг - телеком. @ru
label: 固定回線ｲﾝﾀｰﾈｯﾄ･ﾌﾟﾛﾊﾞｲﾀﾞｰ -通�� @ja
label: 有線網路服務供應商 - 電信 @zh-hant
label: 有线网络服务提供商 @zh
label: 유선 인터넷 서비스 제공사 - 정보통신 @ko
definition: This segment includes companies that offer Internet access (including broadband) through a wireline network connection.
notation: 1011101111
valid from: 2014-08-08
valid till: 2020-10-03

Wireline Video Svcs - Telecom
type: BicsLevel5Segment
type: Classifier
type: NamedIndividual
is level5 segment of: Wireline Telecom Services
is contemporary version of: http://data.ga-group.nl/ics/bics/1011101112
is replaced by: http://data.ga-group.nl/ics/bics/2020/1011101112
is version of: http://data.ga-group.nl/ics/bics/1011101112
imported on: 2026-06-08T13:03:47.798Z
last refreshed on: 2026-06-08T13:03:47.798Z
source accessed on: 2019-12-03T20:05:01Z
source last accessed on: 2019-12-03T20:05:01Z
label: Festnetz Video-Service - Telekomm. @de
label: Serv vidéo filaire - Télécom @fr
label: Serv video cavo - Telecom @it
label: Serviços de vídeo fixa - Telecom @pt
label: Servicios alámbricos de voz - Telecomunicaciones @es
label: У��луги проводного видео - телекоммун. @ru
label: 固網影片服務-電信 @zh-hant
label: 有線ﾋﾞﾃﾞｵｻｰﾋﾞｽ-電子通信 @ja
label: 有线视频服务-电信 @zh
label: 유선 비디오 서비스 - 정보통신 @ko
definition: This segment includes wireline network operators that offer voice services over a fixed-line network. Wireline phone services include wireline local and long-distance services as well as voice-over-IP (VoIP) to residential and business customers.
notation: 1011101112
valid from: 2014-08-08
valid till: 2020-10-03

Wholesale Telecom Svcs
type: BicsLevel5Segment
type: Classifier
type: NamedIndividual
is level5 segment of: Wireline Telecom Services
is contemporary version of: http://data.ga-group.nl/ics/bics/1011101113
is replaced by: http://data.ga-group.nl/ics/bics/2020/1011101113
is version of: http://data.ga-group.nl/ics/bics/1011101113
imported on: 2026-06-08T13:03:47.798Z
last refreshed on: 2026-06-08T13:03:47.798Z
source accessed on: 2019-12-03T20:05:01Z
source last accessed on: 2019-12-03T20:05:01Z
label: GH-Telekomm.-Dienst @de
label: Serv telecom all'ingrosso @it
label: Serv telecom no atacado @pt
label: Services de télécom en gros @fr
label: Servicios de telecomunicación al por mayor @es
label: Оптовые телеком. услуги @ru
label: 批发电信服务 @zh
label: 批發電信服務 @zh-hant
label: 接続通信ｻｰﾋﾞｽ @ja
label: 도매 정보통신 서비스 @ko
definition: This segment includes network operators that either sell network capacity to resellers or lease their network facilities on a wholesale basis to other carriers and/or resellers.
notation: 1011101113
valid from: 2014-08-08
valid till: 2020-10-03

Data Centers
type: BicsLevel5Segment
type: Classifier
type: NamedIndividual
is level5 segment of: Wireline Telecom Services
is contemporary version of: http://data.ga-group.nl/ics/bics/1011101114
is replaced by: http://data.ga-group.nl/ics/bics/2020/1011101114
is version of: http://data.ga-group.nl/ics/bics/1011101114
imported on: 2026-06-08T13:03:47.798Z
last refreshed on: 2026-06-08T13:03:47.798Z
source accessed on: 2019-12-03T20:05:01Z
source last accessed on: 2019-12-03T20:05:01Z
label: Centrais de dados @pt
label: Centres informatiques @fr
label: Centri dati @it
label: Centros de datos @es
label: Datenzentren @de
label: Центры обработки данных @ru
label: 数据中心 @zh
label: 資料中心 @zh-hant
label: 데이터 센터 @ko
label: ﾃﾞｰﾀｾﾝﾀｰ @ja
definition: This segment includes companies that offer hosting and/or data processing services. Hosting companies offer a broad range of services including Web hosting, streaming services or applications hosting. Other services include application service provisioning and general use of mainframe facilities through time-share agreements. Data-processing companies typically offer complete data processing, data-entry and reporting services.
notation: 1011101114
valid from: 2014-08-08
valid till: 2020-10-03

Wireline Telecom Services
type: BicsLevel4SubIndustry
type: Classifier
type: NamedIndividual
is sub industry of: Telecom Carriers
is contemporary version of: http://data.ga-group.nl/ics/bics/10111011
is replaced by: http://data.ga-group.nl/ics/bics/2020/10111011
is version of: http://data.ga-group.nl/ics/bics/10111011
imported on: 2026-06-08T13:03:47.798Z
last refreshed on: 2026-06-08T13:03:47.798Z
source accessed on: 2019-12-03T20:05:01Z
source last accessed on: 2019-12-03T20:05:01Z
label: Kabelgebundene Telekommunikationsdienste @de
label: Linee telecom fisse @it
label: Services de télécomm filaire @fr
label: Seviços telecom sem fio @pt
label: Telecom cable y TV satélite @es
label: Проводная телефонная связь @ru
label: 有線通信ｻｰﾋﾞｽ @ja
label: 有線電信服務 @zh-hant
label: 有线电信服务 @zh
label: 유선 정보통신 서비스 @ko
definition: This industry subgroup includes companies that operate facilities and infrastructure that supplies voice, data, text and sound using wired switching and transmission networks.
notation: 10111011
valid from: 2014-08-08
valid till: 2020-10-03

Telecom Carriers
type: BicsLevel3Industry
type: Classifier
type: NamedIndividual
is industry of: Telecom
is contemporary version of: http://data.ga-group.nl/ics/bics/101110
is replaced by: http://data.ga-group.nl/ics/bics/2020/101110
is version of: http://data.ga-group.nl/ics/bics/101110
imported on: 2026-06-08T13:03:47.798Z
last refreshed on: 2026-06-08T13:03:47.798Z
source accessed on: 2019-12-03T20:05:01Z
source last accessed on: 2019-12-03T20:05:01Z
label: Carrier telecom @it
label: Entreprises de télécom @fr
label: Provs de telecom @es
label: Telekomm.-Anbieter @de
label: Transp telecom @pt
label: Телеком. услуги @ru
label: 电信运营商 @zh
label: 通信事業者 @ja
label: 電信業者 @zh-hant
label: 정보통신사업자 @ko
definition: This industry includes companies that provide a broad range of telecommunications services including wireless and wireline services as well as satellite services including voice, video and/or data. Also includes companies that sell wholesale access to other service providers. Excludes cable multiple system operators (MSOs).
notation: 101110
valid from: 2014-08-08
valid till: 2020-10-03

Telecom Resellers
type: BicsLevel3Industry
type: Classifier
type: Discontinued
type: NamedIndividual
is industry of: Telecom
is contemporary version of: http://data.ga-group.nl/ics/bics/101111
is version of: http://data.ga-group.nl/ics/bics/101111
imported on: 2026-06-08T13:03:47.798Z
last refreshed on: 2026-06-08T13:03:47.798Z
source accessed on: 2019-12-03T20:05:01Z
source last accessed on: 2019-12-03T20:05:01Z
label: Revend telecom @pt
label: Revendeurs de télécom @fr
label: Reventa serv telecom @es
label: Rivenditori telecom @it
label: TelekommWiederverk. @de
label: Телеком. - посредники @ru
label: 电信分销商 @zh
label: 通信ｻｰﾋﾞｽ再販業 @ja
label: 電信轉售 @zh-hant
label: 별정 통신업 @ko
definition: This industry includes companies that purchase network capacity and/or facilities on a wholesale basis from network operators and resell wired and wireless telecom services (except satellite) to businesses and households. Such companies are often referred to as resellers, because they do not operate network facilities and infrastructure. Instead, they market and resell services using other carriers' networks. Mobile virtual network operators (MVNOs) and carriers that sell prepaid calling cards are good examples of resellers.
notation: 101111
valid from: 2014-08-08
valid till: 2020-10-03

Telecom
type: BicsLevel2IndustryGroup
type: Classifier
type: NamedIndividual
is industry group of: Communications
is contemporary version of: http://data.ga-group.nl/ics/bics/1011
is replaced by: http://data.ga-group.nl/ics/bics/2020/1011
is version of: http://data.ga-group.nl/ics/bics/1011
imported on: 2026-06-08T13:03:47.798Z
last refreshed on: 2026-06-08T13:03:47.798Z
source accessed on: 2019-12-03T20:05:01Z
source last accessed on: 2019-12-03T20:05:01Z
label: Télécom @fr
label: Telecomunicaciones @es
label: Telekomm. @de
label: Телеком @ru
label: 电信 @zh
label: 通信業 @ja
label: 電信 @zh-hant
label: 정보통신 @ko
definition: This industry group includes companies that provide telecommunication services. Excludes cable companies that offer telecommunication services.
notation: 1011
valid from: 2014-08-08
valid till: 2020-10-03

Communications
type: BicsLevel1Sector
type: Classifier
type: NamedIndividual
is contemporary version of: http://data.ga-group.nl/ics/bics/10
is replaced by: http://data.ga-group.nl/ics/bics/2020/10
is version of: http://data.ga-group.nl/ics/bics/10
imported on: 2026-06-08T13:03:47.798Z
last refreshed on: 2026-06-08T13:03:47.798Z
source accessed on: 2019-12-03T20:05:01Z
source last accessed on: 2019-12-03T20:05:01Z
label: Comunicações @pt
label: Comunicaciones @es
label: Comunicazioni @it
label: Kommunikation @de
label: Коммуникации @ru
label: 通信 @ja
label: 通訊 @zh-hant
label: 通讯 @zh
label: 통신 @ko
definition: This sector includes companies that create or distribute content. Includes media and advertising firms, Internet service providers, cable television multiple system operators (MSOs) and telecommunications operators.
notation: 10
valid from: 2014-08-08
valid till: 2020-10-03

Children's Apparel
type: BicsLevel5Segment
type: Classifier
type: NamedIndividual
is level5 segment of: Apparel Design
is anachronous version of: http://data.ga-group.nl/ics/bics/111010101010
is contemporary version of: http://data.ga-group.nl/ics/bics/1110101010
is replaced by: http://data.ga-group.nl/ics/bics/2020/111010101010
is version of: http://data.ga-group.nl/ics/bics/111010101010
is version of: http://data.ga-group.nl/ics/bics/1110101010
imported on: 2026-06-08T13:03:47.798Z
last refreshed on: 2026-06-08T13:03:47.798Z
source accessed on: 2019-12-03T20:05:01Z
source last accessed on: 2019-12-03T20:05:01Z
label: Kinderbekleidung @de
label: Moda bambini @it
label: Ropa de niños @es
label: Vêtements pour enfants @fr
label: Vestuário infantil @pt
label: Детская одежда @ru
label: 兒童服飾 @zh-hant
label: 子供服 @ja
label: 童装设计 @zh
label: 아동용 의류 @ko
definition: This segment includes companies that design and market children's apparel products.
notation: 1110101010
valid from: 2014-08-08
valid till: 2020-10-03

Men's Apparel
type: BicsLevel5Segment
type: Classifier
type: NamedIndividual
is level5 segment of: Apparel Design
is anachronous version of: http://data.ga-group.nl/ics/bics/111010101011
is contemporary version of: http://data.ga-group.nl/ics/bics/1110101011
is replaced by: http://data.ga-group.nl/ics/bics/2020/111010101011
is version of: http://data.ga-group.nl/ics/bics/111010101011
is version of: http://data.ga-group.nl/ics/bics/1110101011
imported on: 2026-06-08T13:03:47.798Z
last refreshed on: 2026-06-08T13:03:47.798Z
source accessed on: 2019-12-03T20:05:01Z
source last accessed on: 2019-12-03T20:05:01Z
label: Abbigliamento maschile @it
label: Herrenbekleidung @de
label: Ropa de hombres @es
label: Vêtements pour hommes @fr
label: Vestuário masculino @pt
label: Мужская одежда @ru
label: 男士服飾 @zh-hant
label: 男士服饰 @zh
label: 紳士服 @ja
label: 남성 의류 @ko
definition: This segment includes companies that design and market men's apparel products.
notation: 1110101011
valid from: 2014-08-08
valid till: 2020-10-03

Women's Apparel
type: BicsLevel5Segment
type: Classifier
type: NamedIndividual
is level5 segment of: Apparel Design
is anachronous version of: http://data.ga-group.nl/ics/bics/111010101012
is contemporary version of: http://data.ga-group.nl/ics/bics/1110101012
is replaced by: http://data.ga-group.nl/ics/bics/2020/111010101012
is version of: http://data.ga-group.nl/ics/bics/111010101012
is version of: http://data.ga-group.nl/ics/bics/1110101012
imported on: 2026-06-08T13:03:47.798Z
last refreshed on: 2026-06-08T13:03:47.798Z
source accessed on: 2019-12-03T20:05:01Z
source last accessed on: 2019-12-03T20:05:01Z
label: Abbigliamento donna @it
label: Frauendesigner @de
label: Ropa de mujeres @es
label: Vêtements pour femmes @fr
label: Vestuário feminino @pt
label: Женская одежда @ru
label: 女士成衣设计 @zh
label: 女士服飾 @zh-hant
label: 婦人服 @ja
label: 여성 의류 @ko
definition: This segment includes companies that design and market women's apparel products.
notation: 1110101012
valid from: 2014-08-08
valid till: 2020-10-03

Women's Lingerie
type: BicsLevel5Segment
type: Classifier
type: NamedIndividual
is level5 segment of: Apparel Design
is anachronous version of: http://data.ga-group.nl/ics/bics/111010101013
is contemporary version of: http://data.ga-group.nl/ics/bics/1110101013
is replaced by: http://data.ga-group.nl/ics/bics/2020/111010101013
is version of: http://data.ga-group.nl/ics/bics/111010101013
is version of: http://data.ga-group.nl/ics/bics/1110101013
imported on: 2026-06-08T13:03:47.798Z
last refreshed on: 2026-06-08T13:03:47.798Z
source accessed on: 2019-12-03T20:05:01Z
source last accessed on: 2019-12-03T20:05:01Z
label: Damendessous @de
label: Dessous féminins @fr
label: Intimo donna @it
label: Lencería @es
label: Lingerie @pt
label: Женское нижнее белье @ru
label: 女士內睡衣 @zh
label: 婦人用肌着 @ja
label: 여성용 속옷 @ko
definition: This segment includes companies that design and market women's lingerie products.
notation: 1110101013
valid from: 2014-08-08
valid till: 2020-10-03

Apparel Design
type: BicsLevel4SubIndustry
type: Classifier
type: NamedIndividual
is sub industry of: Apparel, Footwear & Acc Design
is anachronous version of: http://data.ga-group.nl/ics/bics/1110101010
is contemporary version of: http://data.ga-group.nl/ics/bics/11101010
is replaced by: http://data.ga-group.nl/ics/bics/2020/1110101010
is version of: http://data.ga-group.nl/ics/bics/1110101010
is version of: http://data.ga-group.nl/ics/bics/11101010
imported on: 2026-06-08T13:03:47.798Z
last refreshed on: 2026-06-08T13:03:47.798Z
source accessed on: 2019-12-03T20:05:01Z
source last accessed on: 2019-12-03T20:05:01Z
label: Design abbigliamento @it
label: Design de vêtements @fr
label: Design de vestuário @pt
label: Diseño de ropa @es
label: Kleidungsdesign @de
label: Дизайн одежды @ru
label: 成衣設計 @zh-hant
label: 成衣设计 @zh
label: 衣料品ﾃﾞｻﾞｲﾝ @ja
label: 의류 디자인 @ko
definition: This industry subgroup includes companies that design and market men's, women's and children's apparel products.
notation: 11101010
valid from: 2014-08-08
valid till: 2020-10-03

Apparel Brand Licensing
type: BicsLevel4SubIndustry
type: Classifier
type: NamedIndividual
is sub industry of: Apparel, Footwear & Acc Design
is anachronous version of: http://data.ga-group.nl/ics/bics/1110101011
is contemporary version of: http://data.ga-group.nl/ics/bics/11101011
is replaced by: http://data.ga-group.nl/ics/bics/2020/1110101011
is version of: http://data.ga-group.nl/ics/bics/1110101011
is version of: http://data.ga-group.nl/ics/bics/11101011
imported on: 2026-06-08T13:03:47.798Z
last refreshed on: 2026-06-08T13:03:47.798Z
source accessed on: 2019-12-03T20:05:01Z
source last accessed on: 2019-12-03T20:05:01Z
label: Alquiler de marcas de ropa @es
label: Concession de licence de marque vêtements @fr
label: Licença de marca de vestuário @pt
label: Licenza abbigliamento di marca @it
label: Markenlizenzierung von Bekleidung @de
label: Лицензирование торговых марок @ru
label: 服装品牌授权 @zh
label: 服飾品牌授權 @zh-hant
label: 衣料ﾌﾞﾗﾝﾄﾞ･ﾗｲｾﾝｽ契約 @ja
label: 의류 브랜드 라이센스업 @ko
definition: This industry subgroup includes companies that design and market apparel, footwear and accessories products.
notation: 11101011
valid from: 2014-08-08
valid till: 2020-10-03

Luggage
type: BicsLevel5Segment
type: Classifier
type: NamedIndividual
is level5 segment of: Bags & Leather Goods Design
is anachronous version of: http://data.ga-group.nl/ics/bics/111010101210
is contemporary version of: http://data.ga-group.nl/ics/bics/1110101210
is replaced by: http://data.ga-group.nl/ics/bics/2020/111010101210
is version of: http://data.ga-group.nl/ics/bics/111010101210
is version of: http://data.ga-group.nl/ics/bics/1110101210
imported on: 2026-06-08T13:03:47.798Z
last refreshed on: 2026-06-08T13:03:47.798Z
source accessed on: 2019-12-03T20:05:01Z
source last accessed on: 2019-12-03T20:05:01Z
label: Bagages @fr
label: Bagagli @it
label: Gepäck @de
label: Malas @pt
label: Maletas @es
label: Багаж @ru
label: かばん @ja
label: 旅行箱包 @zh
label: 行李箱 @zh-hant
label: 가방 @ko
definition: This segment includes companies that design and market luggage products.
notation: 1110101210
valid from: 2014-08-08
valid till: 2020-10-03

Personal Leather Goods
type: BicsLevel5Segment
type: Classifier
type: NamedIndividual
is level5 segment of: Bags & Leather Goods Design
is anachronous version of: http://data.ga-group.nl/ics/bics/111010101211
is contemporary version of: http://data.ga-group.nl/ics/bics/1110101211
is replaced by: http://data.ga-group.nl/ics/bics/2020/111010101211
is version of: http://data.ga-group.nl/ics/bics/111010101211
is version of: http://data.ga-group.nl/ics/bics/1110101211
imported on: 2026-06-08T13:03:47.798Z
last refreshed on: 2026-06-08T13:03:47.798Z
source accessed on: 2019-12-03T20:05:01Z
source last accessed on: 2019-12-03T20:05:01Z
label: Articles personnels en cuir @fr
label: Articoli personali in pelle @it
label: Artigos de couro pessoais @pt
label: Bienes personales de cuero @es
label: Persönliche Lederwaren @de
label: Личные кожаные изделия @ru
label: 个人皮革制品 @zh
label: 個人皮革製品 @zh-hant
label: 革製品 @ja
label: 개인 가죽제품 @ko
definition: This segment includes companies that design and market personal leather good products.
notation: 1110101211
valid from: 2014-08-08
valid till: 2020-10-03

Women's Handbag
type: BicsLevel5Segment
type: Classifier
type: NamedIndividual
is level5 segment of: Bags & Leather Goods Design
is anachronous version of: http://data.ga-group.nl/ics/bics/111010101212
is contemporary version of: http://data.ga-group.nl/ics/bics/1110101212
is replaced by: http://data.ga-group.nl/ics/bics/2020/111010101212
is version of: http://data.ga-group.nl/ics/bics/111010101212
is version of: http://data.ga-group.nl/ics/bics/1110101212
imported on: 2026-06-08T13:03:47.798Z
last refreshed on: 2026-06-08T13:03:47.798Z
source accessed on: 2019-12-03T20:05:01Z
source last accessed on: 2019-12-03T20:05:01Z
label: Bolsas femininas @pt
label: Bolsas para mujeres @es
label: Borse per donna @it
label: Damenhandtaschen @de
label: Sacs à main pour femmes @fr
label: Женские сумки @ru
label: 女士手提包 @zh-hant
label: 女式手袋 @zh
label: 婦人用ﾊﾝﾄﾞﾊﾞｯｸﾞ @ja
label: 여성 핸드백 @ko
definition: This segment includes companies that design and market women's handbags products.
notation: 1110101212
valid from: 2014-08-08
valid till: 2020-10-03

Bags & Leather Goods Design
type: BicsLevel4SubIndustry
type: Classifier
type: NamedIndividual
is sub industry of: Apparel, Footwear & Acc Design
is anachronous version of: http://data.ga-group.nl/ics/bics/1110101012
is contemporary version of: http://data.ga-group.nl/ics/bics/11101012
is replaced by: http://data.ga-group.nl/ics/bics/2020/1110101012
is version of: http://data.ga-group.nl/ics/bics/1110101012
is version of: http://data.ga-group.nl/ics/bics/11101012
imported on: 2026-06-08T13:03:47.798Z
last refreshed on: 2026-06-08T13:03:47.798Z
source accessed on: 2019-12-03T20:05:01Z
source last accessed on: 2019-12-03T20:05:01Z
label: Design borse e articoli in pelle @it
label: Design de bolsas e artigos de couro @pt
label: Design de sacs et d'articles en cuir @fr
label: Design von Taschen & Lederwaren @de
label: Diseño de bolsas y bienes de cuero @es
label: Дизайн сумок и изделий из кожи @ru
label: かばん･革製品ﾃﾞｻﾞｲﾝ @ja
label: 包类与皮革制品设计 @zh
label: 袋及皮革製品設計 @zh-hant
label: 가방 & 가축제품 디자인 @ko
definition: This industry subgroup includes companies that design and market luggage, personal leather goods and women's handbags products.
notation: 11101012
valid from: 2014-08-08
valid till: 2020-10-03

Athletic Footwear
type: BicsLevel5Segment
type: Classifier
type: NamedIndividual
is level5 segment of: Footwear Design
is anachronous version of: http://data.ga-group.nl/ics/bics/111010101310
is contemporary version of: http://data.ga-group.nl/ics/bics/1110101310
is replaced by: http://data.ga-group.nl/ics/bics/2020/111010101310
is version of: http://data.ga-group.nl/ics/bics/111010101310
is version of: http://data.ga-group.nl/ics/bics/1110101310
imported on: 2026-06-08T13:03:47.798Z
last refreshed on: 2026-06-08T13:03:47.798Z
source accessed on: 2019-12-03T20:05:01Z
source last accessed on: 2019-12-03T20:05:01Z
label: Calzado atlético @es
label: Chaussures de sport @fr
label: Scarpe sportive @it
label: Sportschuhe @de
label: Valçados atléticos @pt
label: Спортивная обувь @ru
label: 运动鞋 @zh
label: 運動靴 @ja
label: 運動鞋 @zh-hant
label: 운동화 @ko
definition: This segment includes companies that design and market athletic footwear products.
notation: 1110101310
valid from: 2014-08-08
valid till: 2020-10-03

House Slipper
type: BicsLevel6Segment
type: Classifier
type: Discontinued
type: NamedIndividual
is level6 segment of: Non-Athletic Footwear
is contemporary version of: http://data.ga-group.nl/ics/bics/111010131110
is version of: http://data.ga-group.nl/ics/bics/111010131110
imported on: 2026-06-08T13:03:47.798Z
last refreshed on: 2026-06-08T13:03:47.798Z
source accessed on: 2019-12-03T20:05:01Z
source last accessed on: 2019-12-03T20:05:01Z
label: Calzado con corte de tela @es
label: Ciabatte @it
label: Hausschuhe @de
label: Pantoufles @fr
label: Pantufas @pt
label: Домашняя обувь @ru
label: 室內拖鞋 @zh-hant
label: 室内ｽﾘｯﾊﾟ @ja
label: 拖鞋 @zh
label: 가정용 슬리퍼 @ko
definition: This segment includes companies that design and market house slipper products.
notation: 111010131110
valid from: 2014-08-08
valid till: 2020-10-03

Men's Footwear
type: BicsLevel6Segment
type: Classifier
type: NamedIndividual
is level6 segment of: Non-Athletic Footwear
is anachronous version of: http://data.ga-group.nl/ics/bics/11101010131110
is contemporary version of: http://data.ga-group.nl/ics/bics/111010131111
is replaced by: http://data.ga-group.nl/ics/bics/2020/11101010131110
is version of: http://data.ga-group.nl/ics/bics/11101010131110
is version of: http://data.ga-group.nl/ics/bics/111010131111
imported on: 2026-06-08T13:03:47.798Z
last refreshed on: 2026-06-08T13:03:47.798Z
source accessed on: 2019-12-03T20:05:01Z
source last accessed on: 2019-12-03T20:05:01Z
label: Calçados masculinos @pt
label: Calzado varonil @es
label: Chaussures pour hommes @fr
label: Herrenschuhe @de
label: Scarpe per uomo @it
label: Мужская обувь @ru
label: 男鞋 @zh
label: 紳士用履物 @ja
label: 남성 신발 @ko
definition: This segment includes companies that design and market men's footwear products.
notation: 111010131111
valid from: 2014-08-08
valid till: 2020-10-03

Women's Footwear
type: BicsLevel6Segment
type: Classifier
type: NamedIndividual
is level6 segment of: Non-Athletic Footwear
is anachronous version of: http://data.ga-group.nl/ics/bics/11101010131111
is contemporary version of: http://data.ga-group.nl/ics/bics/111010131112
is replaced by: http://data.ga-group.nl/ics/bics/2020/11101010131111
is version of: http://data.ga-group.nl/ics/bics/11101010131111
is version of: http://data.ga-group.nl/ics/bics/111010131112
imported on: 2026-06-08T13:03:47.798Z
last refreshed on: 2026-06-08T13:03:47.798Z
source accessed on: 2019-12-03T20:05:01Z
source last accessed on: 2019-12-03T20:05:01Z
label: Calçados femininos @pt
label: Calzado para mujeres @es
label: Chaussures pour femmes @fr
label: Damenschuhe @de
label: Scarpe per donna @it
label: Женская обувь @ru
label: 女鞋 @zh
label: 婦人用履物 @ja
label: 여성 신발 @ko
definition: This segment includes companies that design and market women's footwear products.
notation: 111010131112
valid from: 2014-08-08
valid till: 2020-10-03

Non-Athletic Footwear
type: BicsLevel5Segment
type: Classifier
type: NamedIndividual
is level5 segment of: Footwear Design
is anachronous version of: http://data.ga-group.nl/ics/bics/111010101311
is contemporary version of: http://data.ga-group.nl/ics/bics/1110101311
is replaced by: http://data.ga-group.nl/ics/bics/2020/111010101311
is version of: http://data.ga-group.nl/ics/bics/111010101311
is version of: http://data.ga-group.nl/ics/bics/1110101311
imported on: 2026-06-08T13:03:47.798Z
last refreshed on: 2026-06-08T13:03:47.798Z
source accessed on: 2019-12-03T20:05:01Z
source last accessed on: 2019-12-03T20:05:01Z
label: Calçados não atléticos @pt
label: Calzado no atlético @es
label: Chaussures de ville @fr
label: Herstellung von Schuhen (nicht-Sport) @de
label: Scarpe non sportive @it
label: Неспортивная обувь @ru
label: 除運動靴履物 @ja
label: 非运动鞋 @zh
label: 非運動鞋 @zh-hant
label: 운동화 제외 신발 @ko
definition: This segment includes companies that design and market house slippers as well as men's and women's footwear products.
notation: 1110101311
valid from: 2014-08-08
valid till: 2020-10-03

Footwear Design
type: BicsLevel4SubIndustry
type: Classifier
type: NamedIndividual
is sub industry of: Apparel, Footwear & Acc Design
is anachronous version of: http://data.ga-group.nl/ics/bics/1110101013
is contemporary version of: http://data.ga-group.nl/ics/bics/11101013
is replaced by: http://data.ga-group.nl/ics/bics/2020/1110101013
is version of: http://data.ga-group.nl/ics/bics/1110101013
is version of: http://data.ga-group.nl/ics/bics/11101013
imported on: 2026-06-08T13:03:47.798Z
last refreshed on: 2026-06-08T13:03:47.798Z
source accessed on: 2019-12-03T20:05:01Z
source last accessed on: 2019-12-03T20:05:01Z
label: Design de chaussures @fr
label: Design di scarpe @it
label: Design para calçados @pt
label: Design von Schuhen @de
label: Diseño de calzado @es
label: Дизайн женской обуви @ru
label: 履物ﾃﾞｻﾞｲﾝ @ja
label: 鞋类设计 @zh
label: 鞋類設計 @zh-hant
label: 신발 디자인 @ko
definition: This industry subgroup includes companies that design and market athletic and non-athletic footwear products.
notation: 11101013
valid from: 2014-08-08
valid till: 2020-10-03

Garment Outsourcing
type: BicsLevel4SubIndustry
type: Classifier
type: NamedIndividual
is sub industry of: Apparel, Footwear & Acc Design
is anachronous version of: http://data.ga-group.nl/ics/bics/1110101014
is contemporary version of: http://data.ga-group.nl/ics/bics/11101014
is replaced by: http://data.ga-group.nl/ics/bics/2020/1110101014
is version of: http://data.ga-group.nl/ics/bics/1110101014
is version of: http://data.ga-group.nl/ics/bics/11101014
imported on: 2026-06-08T13:03:47.798Z
last refreshed on: 2026-06-08T13:03:47.798Z
source accessed on: 2019-12-03T20:05:01Z
source last accessed on: 2019-12-03T20:05:01Z
label: Esternlz prod abbigl @it
label: Externalisation de fabrication de vêtements @fr
label: Outsourcing von Bekleidung @de
label: Subcontratación de prendas @es
label: Terceirização de vestuário @pt
label: Аутсорсинг одежды @ru
label: 衣料縫製ｱｳﾄｿｰｼﾝｸﾞ @ja
label: 衣物制造和外包服务 @zh
label: 衣物製作外包服務 @zh-hant
label: 의상제작 외주 @ko
definition: This industry subgroup includes companies that provide outsourced manufacturing services for apparel, footwear and accessory designers. These companies manufacture under other brand names.
notation: 11101014
valid from: 2014-08-08
valid till: 2020-10-03

Athletic Accessories
type: BicsLevel5Segment
type: Classifier
type: Discontinued
type: NamedIndividual
is level5 segment of: Sporting & Athletic Apparel
is contemporary version of: http://data.ga-group.nl/ics/bics/1110101510
is version of: http://data.ga-group.nl/ics/bics/1110101510
imported on: 2026-06-08T13:03:47.798Z
last refreshed on: 2026-06-08T13:03:47.798Z
source accessed on: 2019-12-03T20:05:01Z
source last accessed on: 2019-12-03T20:05:01Z
label: Accesorios atléticos @es
label: Accessoires de sport @fr
label: Accessori sportivi @it
label: Acessórios esportivos @pt
label: Sportaccessoires @de
label: Спортивные аксессуары @ru
label: 运动配件与用品设计 @zh
label: 運動配件 @zh-hant
label: 운동용 액세서리 @ko
label: ｽﾎﾟｰﾂ用品 @ja
definition: This segment includes companies that design and market athletic accessories products.
notation: 1110101510
valid from: 2014-08-08
valid till: 2020-10-03

Sports Apparel
type: BicsLevel5Segment
type: Classifier
type: NamedIndividual
is level5 segment of: Sporting & Athletic Apparel
is anachronous version of: http://data.ga-group.nl/ics/bics/111010101014
is contemporary version of: http://data.ga-group.nl/ics/bics/1110101511
is replaced by: http://data.ga-group.nl/ics/bics/2020/111010101014
is version of: http://data.ga-group.nl/ics/bics/111010101014
is version of: http://data.ga-group.nl/ics/bics/1110101511
imported on: 2026-06-08T13:03:47.798Z
last refreshed on: 2026-06-08T13:03:47.798Z
source accessed on: 2019-12-03T20:05:01Z
source last accessed on: 2019-12-03T20:05:01Z
label: Abbigliamento sport @it
label: Ropa deportiva @es
label: Sportbekleidung @de
label: Vêtements de sport @fr
label: Vestuário esportivo @pt
label: Спортивная одежда @ru
label: 运动成衣设计 @zh
label: 運動服裝 @zh-hant
label: 스포츠 의류 @ko
label: ｽﾎﾟｰﾂｳｴｱ @ja
definition: This segment includes companies that design and market sports apparel products.
notation: 1110101511
valid from: 2014-08-08
valid till: 2020-10-03

Sporting & Athletic Apparel
type: BicsLevel4SubIndustry
type: Classifier
type: Discontinued
type: NamedIndividual
is sub industry of: Apparel, Footwear & Acc Design
is contemporary version of: http://data.ga-group.nl/ics/bics/11101015
is version of: http://data.ga-group.nl/ics/bics/11101015
imported on: 2026-06-08T13:03:47.798Z
last refreshed on: 2026-06-08T13:03:47.798Z
source accessed on: 2019-12-03T20:05:01Z
source last accessed on: 2019-12-03T20:05:01Z
label: Abbigliamento sportivo @it
label: Sportbekleidung @de
label: Vêtements de sport et d'athlétisme @fr
label: Vestuário atlético e esportivo @pt
label: Vestuario deportivo @es
label: Спортивная одежда @ru
label: 体育与运动服装 @zh
label: 體育及運動服飾 @zh-hant
label: 스포츠 & 운동 의류 디자인 @ko
label: ｽﾎﾟｰﾂｳｪｱ @ja
definition: This industry subgroup includes companies that design and market sporting and athletic apparel products.
notation: 11101015
valid from: 2014-08-08
valid till: 2020-10-03

Costume Jewelry
type: BicsLevel6Segment
type: Classifier
type: Discontinued
type: NamedIndividual
is level6 segment of: Jewelry
is contemporary version of: http://data.ga-group.nl/ics/bics/111010161010
is version of: http://data.ga-group.nl/ics/bics/111010161010
imported on: 2026-06-08T13:03:47.798Z
last refreshed on: 2026-06-08T13:03:47.798Z
source accessed on: 2019-12-03T20:05:01Z
source last accessed on: 2019-12-03T20:05:01Z
label: Bigiotteria @it
label: Bijoux de fantaisie @fr
label: Bijuteria @pt
label: Joyería personalizada @es
label: Modeschmuck @de
label: Дизайнерская бижутерия @ru
label: 人造珠宝 @zh
label: 服裝用珠寶 @zh-hant
label: 模造宝石類 @ja
label: 모조 보석 @ko
definition: This segment includes companies that design and market costume jewelry products.
notation: 111010161010
valid from: 2014-08-08
valid till: 2020-10-03

Jewelry (excluding Costume)
type: BicsLevel6Segment
type: Classifier
type: Discontinued
type: NamedIndividual
is level6 segment of: Jewelry
is contemporary version of: http://data.ga-group.nl/ics/bics/111010161011
is version of: http://data.ga-group.nl/ics/bics/111010161011
imported on: 2026-06-08T13:03:47.798Z
last refreshed on: 2026-06-08T13:03:47.798Z
source accessed on: 2019-12-03T20:05:01Z
source last accessed on: 2019-12-03T20:05:01Z
label: Bijoux (hors costume) @fr
label: Gioielli (eccetto bigiotteria) @it
label: Jóias (exceto bijuteria) @pt
label: Joyería (excepto trabajos especiales) @es
label: Schmuck (ausgenommen Modeschmuck) @de
label: Ювелирные украшения (кроме дизайнерской бижутерии) @ru
label: 宝石(除模造品)ﾃﾞｻﾞｲﾝ @ja
label: 珠宝（除人造珠宝） @zh
label: 珠寶(服飾珠寶除外) @zh-hant
label: 보석류 (모조 제외) @ko
definition: This segment includes companies that design and market jewelry products, except costume jewelry.
notation: 111010161011
valid from: 2014-08-08
valid till: 2020-10-03

Jewelry
type: BicsLevel5Segment
type: Classifier
type: NamedIndividual
is level5 segment of: Watch & Jewelry Design
is anachronous version of: http://data.ga-group.nl/ics/bics/111010101510
is contemporary version of: http://data.ga-group.nl/ics/bics/1110101610
is replaced by: http://data.ga-group.nl/ics/bics/2020/111010101510
is version of: http://data.ga-group.nl/ics/bics/111010101510
is version of: http://data.ga-group.nl/ics/bics/1110101610
imported on: 2026-06-08T13:03:47.798Z
last refreshed on: 2026-06-08T13:03:47.798Z
source accessed on: 2019-12-03T20:05:01Z
source last accessed on: 2019-12-03T20:05:01Z
label: Bijoux @fr
label: Gioielli @it
label: Joias @pt
label: Joyería @es
label: Schmuck @de
label: Ювелирные изделия @ru
label: 宝石 @ja
label: 珠宝 @zh
label: 珠寶 @zh-hant
label: 보석 @ko
definition: This segment includes companies that design, market and/or manufacture jewelry of all types.
notation: 1110101610
valid from: 2014-08-08
valid till: 2020-10-03

Metal Accessories
type: BicsLevel5Segment
type: Classifier
type: Discontinued
type: NamedIndividual
is level5 segment of: Watch & Jewelry Design
is contemporary version of: http://data.ga-group.nl/ics/bics/1110101611
is version of: http://data.ga-group.nl/ics/bics/1110101611
imported on: 2026-06-08T13:03:47.798Z
last refreshed on: 2026-06-08T13:03:47.798Z
source accessed on: 2019-12-03T20:05:01Z
source last accessed on: 2019-12-03T20:05:01Z
label: Accesorios metálicos @es
label: Accessoires aus Metall @de
label: Accessoires en métal @fr
label: Accessori metallici @it
label: Acessórios de metal @pt
label: Металлические аксессуары @ru
label: 金属装飾品 @ja
label: 金属饰品 @zh
label: 金屬配件 @zh-hant
label: 금속 액세서리 @ko
definition: This segment includes companies that design and market any type of metal accessories.
notation: 1110101611
valid from: 2014-08-08
valid till: 2020-10-03

General Watch
type: BicsLevel6Segment
type: Classifier
type: Discontinued
type: NamedIndividual
is level6 segment of: Watch
is contemporary version of: http://data.ga-group.nl/ics/bics/111010161210
is version of: http://data.ga-group.nl/ics/bics/111010161210
imported on: 2026-06-08T13:03:47.798Z
last refreshed on: 2026-06-08T13:03:47.798Z
source accessed on: 2019-12-03T20:05:01Z
source last accessed on: 2019-12-03T20:05:01Z
label: Allg. Armbanduhr @de
label: Montres ordinaires @fr
label: Orologi generali @it
label: Relógios em geral @pt
label: Relojes en general @es
label: Наручные часы массов. производства @ru
label: 一般手錶 @zh-hant
label: 一般腕時計 @ja
label: 普通钟表 @zh
label: 일반 손목시계 @ko
definition: This segment includes companies that design and market general watches.
notation: 111010161210
valid from: 2014-08-08
valid till: 2020-10-03

Luxury Watch
type: BicsLevel6Segment
type: Classifier
type: Discontinued
type: NamedIndividual
is level6 segment of: Watch
is contemporary version of: http://data.ga-group.nl/ics/bics/111010161211
is version of: http://data.ga-group.nl/ics/bics/111010161211
imported on: 2026-06-08T13:03:47.798Z
last refreshed on: 2026-06-08T13:03:47.798Z
source accessed on: 2019-12-03T20:05:01Z
source last accessed on: 2019-12-03T20:05:01Z
label: Luxusarmbanduhren @de
label: Montres de luxe @fr
label: Orologi lusso @it
label: Relógios de luxo @pt
label: Relojes de lujo @es
label: Наручные часы класса люкс @ru
label: 豪华钟表 @zh
label: 高級手錶 @zh-hant
label: 高級腕時計 @ja
label: 고급 손목시계 @ko
definition: This segment includes companies that design and market luxury watches that target high-end customers.
notation: 111010161211
valid from: 2014-08-08
valid till: 2020-10-03

Watch
type: BicsLevel5Segment
type: Classifier
type: NamedIndividual
is level5 segment of: Watch & Jewelry Design
is anachronous version of: http://data.ga-group.nl/ics/bics/111010101511
is contemporary version of: http://data.ga-group.nl/ics/bics/1110101612
is replaced by: http://data.ga-group.nl/ics/bics/2020/111010101511
is version of: http://data.ga-group.nl/ics/bics/111010101511
is version of: http://data.ga-group.nl/ics/bics/1110101612
imported on: 2026-06-08T13:03:47.798Z
last refreshed on: 2026-06-08T13:03:47.798Z
source accessed on: 2019-12-03T20:05:01Z
source last accessed on: 2019-12-03T20:05:01Z
label: Alerta @es
label: Armbanduhr @de
label: Montres @fr
label: Orologi @it
label: Relógios @pt
label: Наручные часы @ru
label: 手錶 @zh-hant
label: 腕時計 @ja
label: 钟表 @zh
label: 손목시계 @ko
definition: This segment includes companies that design and market watches.
notation: 1110101612
valid from: 2014-08-08
valid till: 2020-10-03

Watch & Jewelry Design
type: BicsLevel4SubIndustry
type: Classifier
type: NamedIndividual
is sub industry of: Apparel, Footwear & Acc Design
is anachronous version of: http://data.ga-group.nl/ics/bics/1110101015
is contemporary version of: http://data.ga-group.nl/ics/bics/11101016
is replaced by: http://data.ga-group.nl/ics/bics/2020/1110101015
is version of: http://data.ga-group.nl/ics/bics/1110101015
is version of: http://data.ga-group.nl/ics/bics/11101016
imported on: 2026-06-08T13:03:47.798Z
last refreshed on: 2026-06-08T13:03:47.798Z
source accessed on: 2019-12-03T20:05:01Z
source last accessed on: 2019-12-03T20:05:01Z
label: Design de jóias e relógios @pt
label: Design de montres et bijoux @fr
label: Design orologi e gioielli @it
label: Design von Uhren & Schmuck @de
label: Diseño de relojes y joyería @es
label: Дизайн часов и ювелирных украшений @ru
label: 手錶及珠寶設計 @zh-hant
label: 腕時計･宝石ﾃﾞｻﾞｲﾝ @ja
label: 钟表及珠宝设计 @zh
label: 손목시계 및 보석 디자인 @ko
definition: This industry subgroup includes companies that design and market watch and jewelry products.
notation: 11101016
valid from: 2014-08-08
valid till: 2020-10-03

Bathing Suit
type: BicsLevel5Segment
type: Classifier
type: Discontinued
type: NamedIndividual
is level5 segment of: Other Specialty Apparel Design
is contemporary version of: http://data.ga-group.nl/ics/bics/1110101710
is version of: http://data.ga-group.nl/ics/bics/1110101710
imported on: 2026-06-08T13:03:47.798Z
last refreshed on: 2026-06-08T13:03:47.798Z
source accessed on: 2019-12-03T20:05:01Z
source last accessed on: 2019-12-03T20:05:01Z
label: Badeanzug @de
label: Costumi da bagno @it
label: Maillots de bain @fr
label: Roupas de banho @pt
label: Trajes de baño @es
label: Купальники @ru
label: 水着 @ja
label: 泳衣 @zh-hant
label: 泳装 @zh
label: 수영복 @ko
definition: This segment includes companies that design and market bathing suits.
notation: 1110101710
valid from: 2014-08-08
valid till: 2020-10-03

Fur & Leather Apparel
type: BicsLevel5Segment
type: Classifier
type: NamedIndividual
is level5 segment of: Other Specialty Apparel Design
is anachronous version of: http://data.ga-group.nl/ics/bics/111010101015
is contemporary version of: http://data.ga-group.nl/ics/bics/1110101711
is replaced by: http://data.ga-group.nl/ics/bics/2020/111010101015
is version of: http://data.ga-group.nl/ics/bics/111010101015
is version of: http://data.ga-group.nl/ics/bics/1110101711
imported on: 2026-06-08T13:03:47.798Z
last refreshed on: 2026-06-08T13:03:47.798Z
source accessed on: 2019-12-03T20:05:01Z
source last accessed on: 2019-12-03T20:05:01Z
label: Abbigliamento pelle e pellicce @it
label: Pelz & Lederbekleidung @de
label: Ropa de peluche y piel @es
label: Vêtement en fourrure et cuir @fr
label: Vestuário de pele e couro @pt
label: Изделия из меха и кожи @ru
label: 毛皮与皮革服装 @zh
label: 毛皮服飾 @zh-hant
label: 毛皮･革製衣服 @ja
label: 모피 & 가죽 의류 @ko
definition: This segment includes companies that design and market fur and leather products.
notation: 1110101711
valid from: 2014-08-08
valid till: 2020-10-03

Outerwear Apparel
type: BicsLevel5Segment
type: Classifier
type: NamedIndividual
is level5 segment of: Other Specialty Apparel Design
is anachronous version of: http://data.ga-group.nl/ics/bics/111010101016
is contemporary version of: http://data.ga-group.nl/ics/bics/1110101712
is replaced by: http://data.ga-group.nl/ics/bics/2020/111010101016
is version of: http://data.ga-group.nl/ics/bics/111010101016
is version of: http://data.ga-group.nl/ics/bics/1110101712
imported on: 2026-06-08T13:03:47.798Z
last refreshed on: 2026-06-08T13:03:47.798Z
source accessed on: 2019-12-03T20:05:01Z
source last accessed on: 2019-12-03T20:05:01Z
label: Abbigliam esterno @it
label: Prendas exteriores @es
label: Vêtements d'extérieur @fr
label: Vestuário de uso exterior @pt
label: Überbekleidung @de
label: Верхняя одежда @ru
label: 外出服 @zh-hant
label: 室外服饰设计 @zh
label: 아웃웨어 의류 @ko
label: ｱｳﾀｰｳｪｱ @ja
definition: This segment includes companies that design and market outerwear apparel products.
notation: 1110101712
valid from: 2014-08-08
valid till: 2020-10-03

Professional Uniforms
type: BicsLevel5Segment
type: Classifier
type: NamedIndividual
is level5 segment of: Other Specialty Apparel Design
is anachronous version of: http://data.ga-group.nl/ics/bics/111010101017
is contemporary version of: http://data.ga-group.nl/ics/bics/1110101713
is replaced by: http://data.ga-group.nl/ics/bics/2020/111010101017
is version of: http://data.ga-group.nl/ics/bics/111010101017
is version of: http://data.ga-group.nl/ics/bics/1110101713
imported on: 2026-06-08T13:03:47.798Z
last refreshed on: 2026-06-08T13:03:47.798Z
source accessed on: 2019-12-03T20:05:01Z
source last accessed on: 2019-12-03T20:05:01Z
label: Arbeitsuniformen @de
label: Divise professionali @it
label: Uniformes profesionales @es
label: Uniformes professionnels @fr
label: Uniformes profissionais @pt
label: Профес. форменная одежда @ru
label: 专业制服 @zh
label: 專業制服 @zh-hant
label: 業務用制服 @ja
label: 직업 유니폼 @ko
definition: This segment includes companies that design and market professional uniforms products.
notation: 1110101713
valid from: 2014-08-08
valid till: 2020-10-03

Other Apparel Accessories
type: BicsLevel5Segment
type: Classifier
type: Discontinued
type: NamedIndividual
is level5 segment of: Other Specialty Apparel Design
is contemporary version of: http://data.ga-group.nl/ics/bics/1110101714
is version of: http://data.ga-group.nl/ics/bics/1110101714
imported on: 2026-06-08T13:03:47.798Z
last refreshed on: 2026-06-08T13:03:47.798Z
source accessed on: 2019-12-03T20:05:01Z
source last accessed on: 2019-12-03T20:05:01Z
label: Altri accessori abbigliamento @it
label: Autres accessoires vestimentaires @fr
label: Otros accesorios de ropa @es
label: Outros acessórios para vestuário @pt
label: Sonstige Kleidung, Accessoires @de
label: Производство прочей одежды @ru
label: その他衣料装飾品 @ja
label: 其他服装辅料 @zh
label: 其他服飾配件 @zh-hant
label: 기타 의류 액세서리 @ko
definition: This segment includes companies that design and market other apparel accessories products not elsewhere classified.
notation: 1110101714
valid from: 2014-08-08
valid till: 2020-10-03

Other Specialty Apparel Design
type: BicsLevel4SubIndustry
type: Classifier
type: Discontinued
type: NamedIndividual
is sub industry of: Apparel, Footwear & Acc Design
is contemporary version of: http://data.ga-group.nl/ics/bics/11101017
is version of: http://data.ga-group.nl/ics/bics/11101017
imported on: 2026-06-08T13:03:47.798Z
last refreshed on: 2026-06-08T13:03:47.798Z
source accessed on: 2019-12-03T20:05:01Z
source last accessed on: 2019-12-03T20:05:01Z
label: Design altro abbigliamento speciale @it
label: Design d'autres vêtements spécialisés @fr
label: Design von sonst. spezieller Bekleidung @de
label: Otro diseño de ropa especializada @es
label: Outros designs de vestuário especializado @pt
label: Дизайн прочей спец. одежды @ru
label: その他特殊衣料品ﾃﾞｻﾞｲﾝ @ja
label: 其他特种服装设计 @zh
label: 其它特殊服飾設計 @zh-hant
label: 기타 특수 의류 디자인 @ko
definition: This industry subgroup includes companies that design and market apparel products not elsewhere classified.
notation: 11101017
valid from: 2014-08-08
valid till: 2020-10-03

Apparel, Footwear & Acc Design
type: BicsLevel3Industry
type: Classifier
type: NamedIndividual
is industry of: Apparel & Textile Products
is anachronous version of: http://data.ga-group.nl/ics/bics/11101010
is contemporary version of: http://data.ga-group.nl/ics/bics/111010
is replaced by: http://data.ga-group.nl/ics/bics/2020/11101010
is version of: http://data.ga-group.nl/ics/bics/11101010
is version of: http://data.ga-group.nl/ics/bics/111010
imported on: 2026-06-08T13:03:47.798Z
last refreshed on: 2026-06-08T13:03:47.798Z
source accessed on: 2019-12-03T20:05:01Z
source last accessed on: 2019-12-03T20:05:01Z
label: Design abbigl, calzature e accessori @it
label: Design v. Kleidung/Schuhen/Access. @de
label: Design vêtements, chaussures et acc @fr
label: Diseño de ropa, calzado y accesorios @es
label: Vestuário, calçados e design ac @pt
label: Дизайн одежды, обуви и аксессуаров @ru
label: 服装、鞋类及配饰设计 @zh
label: 服飾、鞋類及配件設計 @zh-hant
label: 衣料･履物･装身具ﾃﾞｻﾞｲﾝ @ja
label: 의류, 신발 & 액세서리 디자인 @ko
definition: This industry includes companies that design and market apparel, footwear and accessories products. Excludes designers who own and operate their own retail store and the majority of their revenue comes from retail operations (see Specialty Apparel Stores).
notation: 111010
valid from: 2014-08-08
valid till: 2020-10-03

Leather, Hide Tan & Finishing
type: BicsLevel4SubIndustry
type: Classifier
type: NamedIndividual
is sub industry of: Textile & Textile Products
is anachronous version of: http://data.ga-group.nl/ics/bics/1110101110
is contemporary version of: http://data.ga-group.nl/ics/bics/11101110
is replaced by: http://data.ga-group.nl/ics/bics/2020/1110101110
is version of: http://data.ga-group.nl/ics/bics/1110101110
is version of: http://data.ga-group.nl/ics/bics/11101110
imported on: 2026-06-08T13:03:47.798Z
last refreshed on: 2026-06-08T13:03:47.798Z
source accessed on: 2019-12-03T20:05:01Z
source last accessed on: 2019-12-03T20:05:01Z
label: Conciatura e rifinitura pelle e cuoio @it
label: Couro, curtimento e acabamenro @pt
label: Cuir, tannage/finissage des peaux @fr
label: Curtido, acabado cuero y piel @es
label: Leder, gerben & Endbehandl. @de
label: Дубление и отделка кожи и шкур @ru
label: 皮革、鞣皮及染皮 @zh-hant
label: 皮革鞣制及整理 @zh
label: 革/なめし革製造･加工 @ja
label: 피혁 가공업 @ko
definition: This industry subgroup includes companies that create leather from hides and skins.
notation: 11101110
valid from: 2014-08-08
valid till: 2020-10-03

Fabric Coating Mills
type: BicsLevel6Segment
type: Classifier
type: NamedIndividual
is level6 segment of: Fabric Finishing
is anachronous version of: http://data.ga-group.nl/ics/bics/11101011111010
is contemporary version of: http://data.ga-group.nl/ics/bics/111011111010
is replaced by: http://data.ga-group.nl/ics/bics/2020/11101011111010
is version of: http://data.ga-group.nl/ics/bics/11101011111010
is version of: http://data.ga-group.nl/ics/bics/111011111010
imported on: 2026-06-08T13:03:47.798Z
last refreshed on: 2026-06-08T13:03:47.798Z
source accessed on: 2019-12-03T20:05:01Z
source last accessed on: 2019-12-03T20:05:01Z
label: Fábricas de revestimento de tecido @pt
label: Fabb rivest tessuto @it
label: Mol recubrim telas @es
label: Revêtement de tissus @fr
label: Stoffbeschichtungen @de
label: Фабрики по отделке текстиля @ru
label: 毛整业 @zh
label: 織物塗佈業 @zh-hant
label: 織物ｺｰﾃｨﾝｸﾞ @ja
label: 섬유 피복 제조업 @ko
definition: This segment includes companies that provide fabric coating, such as coating fabrics in wax to improve strength.
notation: 111011111010
valid from: 2014-08-08
valid till: 2020-10-03

Nonwoven Textile & Fabric Finish
type: BicsLevel6Segment
type: Classifier
type: NamedIndividual
is level6 segment of: Fabric Finishing
is anachronous version of: http://data.ga-group.nl/ics/bics/11101011111011
is contemporary version of: http://data.ga-group.nl/ics/bics/111011111011
is replaced by: http://data.ga-group.nl/ics/bics/2020/11101011111011
is version of: http://data.ga-group.nl/ics/bics/11101011111011
is version of: http://data.ga-group.nl/ics/bics/111011111011
imported on: 2026-06-08T13:03:47.798Z
last refreshed on: 2026-06-08T13:03:47.798Z
source accessed on: 2019-12-03T20:05:01Z
source last accessed on: 2019-12-03T20:05:01Z
label: Acabamento de tecidos e não texturizados @pt
label: Faserstoff & Gewebe-Finish @de
label: Molienda de acabado de textiles y telas no de lana @es
label: Tessuto non tessuto e finitura tessuti @it
label: Textiles non tissés et finissage de tissus @fr
label: Покраска нетканевого текстиля и полотна @ru
label: 不織布紡織及織布整理 @zh-hant
label: 不織繊維･織物仕上げ @ja
label: 无纺布织物与面料加工 @zh
label: 부직포 & 직물 완제품 @ko
definition: This segment includes companies that provide finishing touches to non-fabric textile products.
notation: 111011111011
valid from: 2014-08-08
valid till: 2020-10-03

Woven Fabric Finishing Mills
type: BicsLevel6Segment
type: Classifier
type: NamedIndividual
is level6 segment of: Fabric Finishing
is anachronous version of: http://data.ga-group.nl/ics/bics/11101011111012
is contemporary version of: http://data.ga-group.nl/ics/bics/111011111012
is replaced by: http://data.ga-group.nl/ics/bics/2020/11101011111012
is version of: http://data.ga-group.nl/ics/bics/11101011111012
is version of: http://data.ga-group.nl/ics/bics/111011111012
imported on: 2026-06-08T13:03:47.798Z
last refreshed on: 2026-06-08T13:03:47.798Z
source accessed on: 2019-12-03T20:05:01Z
source last accessed on: 2019-12-03T20:05:01Z
label: Fábrica de acabamento de tecidos @pt
label: Fabbriche di rifinitura tessuti @it
label: Molienda de tejidos y acabados de tejidos de lana @es
label: Usines de finissage de tissus @fr
label: Webereien für Webstoffbehandlungen @de
label: Фабрики по покраске тканевого полотна @ru
label: 人造纖維梭織物整理加工業 @zh-hant
label: 人造纤维织布精整厂 @zh
label: 毛織物仕上げ @ja
label: 직물 가공업 @ko
definition: This segment includes companies that finish woven fabrics by providing basic stitching and other finishing touches.
notation: 111011111012
valid from: 2014-08-08
valid till: 2020-10-03

Fabric Finishing
type: BicsLevel5Segment
type: Classifier
type: NamedIndividual
is level5 segment of: Textile
is anachronous version of: http://data.ga-group.nl/ics/bics/111010111110
is contemporary version of: http://data.ga-group.nl/ics/bics/1110111110
is replaced by: http://data.ga-group.nl/ics/bics/2020/111010111110
is version of: http://data.ga-group.nl/ics/bics/111010111110
is version of: http://data.ga-group.nl/ics/bics/1110111110
imported on: 2026-06-08T13:03:47.798Z
last refreshed on: 2026-06-08T13:03:47.798Z
source accessed on: 2019-12-03T20:05:01Z
source last accessed on: 2019-12-03T20:05:01Z
label: Acabamento de tecido @pt
label: Finition de tissu @fr
label: Gewebeherstellung @de
label: Rifinitura di stoffe @it
label: Terminados de telas @es
label: Отделка тканых полотен @ru
label: 織物仕上げ @ja
label: 織物整理加工 @zh-hant
label: 纤维加工 @zh
label: 직물가공업 @ko
definition: This segment includes mills that finish fabric, which may involve stitching or coating of fabric or other textiles.
notation: 1110111110
valid from: 2014-08-08
valid till: 2020-10-03

Nonwoven Fabric Mill
type: BicsLevel6Segment
type: Classifier
type: NamedIndividual
is level6 segment of: Fabric
is anachronous version of: http://data.ga-group.nl/ics/bics/11101011111110
is contemporary version of: http://data.ga-group.nl/ics/bics/111011111110
is replaced by: http://data.ga-group.nl/ics/bics/2020/11101011111110
is version of: http://data.ga-group.nl/ics/bics/11101011111110
is version of: http://data.ga-group.nl/ics/bics/111011111110
imported on: 2026-06-08T13:03:47.798Z
last refreshed on: 2026-06-08T13:03:47.798Z
source accessed on: 2019-12-03T20:05:01Z
source last accessed on: 2019-12-03T20:05:01Z
label: Conf telas no tejid @es
label: Fábrica de tecido não tecidos @pt
label: Fabb stoffe non tess @it
label: Stoffe o. Webstoffe @de
label: Usine text non tissé @fr
label: Фабрики по произв. нетканых полотен @ru
label: 不織繊維布仕上げ @ja
label: 无纺布 @zh
label: 非梭織布整理加工 @zh-hant
label: 부직포 가공업 @ko
definition: This segment includes mills that manufacture nonwoven fabric material. Nonwoven fabric is created by thermal, mechanical or chemical bonding rather than weaving or knitting. Nonwoven fabric materials are used in a host of industries not limited to apparel and textile products.
notation: 111011111110
valid from: 2014-08-08
valid till: 2020-10-03

Woven Fabric Mills
type: BicsLevel6Segment
type: Classifier
type: NamedIndividual
is level6 segment of: Fabric
is anachronous version of: http://data.ga-group.nl/ics/bics/11101011111111
is contemporary version of: http://data.ga-group.nl/ics/bics/111011111111
is replaced by: http://data.ga-group.nl/ics/bics/2020/11101011111111
is version of: http://data.ga-group.nl/ics/bics/11101011111111
is version of: http://data.ga-group.nl/ics/bics/111011111111
imported on: 2026-06-08T13:03:47.798Z
last refreshed on: 2026-06-08T13:03:47.798Z
source accessed on: 2019-12-03T20:05:01Z
source last accessed on: 2019-12-03T20:05:01Z
label: Fábricas de tecido especial @pt
label: Fabbriche tessitura @it
label: Molinería de tejidos @es
label: Usines de tissu @fr
label: Webstoffwebereien @de
label: Фабрики по произв. тканей @ru
label: 人造纖維梭織布業 @zh-hant
label: 人造纤维织布厂 @zh
label: 毛織物仕上げ @ja
label: 직물 제직업 @ko
definition: This segment includes companies that take fiber, yarn and thread and weave them into fabrics used to make garments.
notation: 111011111111
valid from: 2014-08-08
valid till: 2020-10-03

Other Knit Fabric & Lace Mills
type: BicsLevel6Segment
type: Classifier
type: Discontinued
type: NamedIndividual
is level6 segment of: Fabric
is contemporary version of: http://data.ga-group.nl/ics/bics/111011111112
is version of: http://data.ga-group.nl/ics/bics/111011111112
imported on: 2026-06-08T13:03:47.798Z
last refreshed on: 2026-06-08T13:03:47.798Z
source accessed on: 2019-12-03T20:05:01Z
source last accessed on: 2019-12-03T20:05:01Z
label: Autres usines de tricots et de dentelles @fr
label: Fabbriche altre stoffe lavorate e pizzo @it
label: Otras confección de telas tejidas y de encaje @es
label: Outras fábricas de rendas e tecidos de malha @pt
label: Sonst. Strickstoff- & Spitzenfabriken @de
label: Прочие фабрики по производству трикотажного полотна и кружев @ru
label: その他ﾆｯﾄ生地･ﾚｰｽ製造 @ja
label: 其他針織布及花邊 @zh-hant
label: 其他针织面料与花边制造 @zh
label: 기타 원단 & 레이스 제조업 @ko
definition: This segment includes companies that knit yarns used in sweaters, hats and other knit products not elsewhere classified.
notation: 111011111112
valid from: 2014-08-08
valid till: 2020-10-03

Fabric
type: BicsLevel5Segment
type: Classifier
type: NamedIndividual
is level5 segment of: Textile
is anachronous version of: http://data.ga-group.nl/ics/bics/111010111111
is contemporary version of: http://data.ga-group.nl/ics/bics/1110111111
is replaced by: http://data.ga-group.nl/ics/bics/2020/111010111111
is version of: http://data.ga-group.nl/ics/bics/111010111111
is version of: http://data.ga-group.nl/ics/bics/1110111111
imported on: 2026-06-08T13:03:47.798Z
last refreshed on: 2026-06-08T13:03:47.798Z
source accessed on: 2019-12-03T20:05:01Z
source last accessed on: 2019-12-03T20:05:01Z
label: Gewebe @de
label: Tecidos @pt
label: Telas @es
label: Tessuto @it
label: Tissus @fr
label: Ткань @ru
label: 織布 @zh-hant
label: 織物 @ja
label: 面料 @zh
label: 직물 @ko
definition: This segment includes mills that produce fabric or cloth used to make garments or other textile products.
notation: 1110111111
valid from: 2014-08-08
valid till: 2020-10-03

Synthetic Fiber & Thread
type: BicsLevel6Segment
type: Classifier
type: NamedIndividual
is level6 segment of: Fiber, Yarn & Thread
is anachronous version of: http://data.ga-group.nl/ics/bics/11101011111210
is contemporary version of: http://data.ga-group.nl/ics/bics/111011111210
is replaced by: http://data.ga-group.nl/ics/bics/2020/11101011111210
is version of: http://data.ga-group.nl/ics/bics/11101011111210
is version of: http://data.ga-group.nl/ics/bics/111011111210
imported on: 2026-06-08T13:03:47.798Z
last refreshed on: 2026-06-08T13:03:47.798Z
source accessed on: 2019-12-03T20:05:01Z
source last accessed on: 2019-12-03T20:05:01Z
label: Fibras y tejidos sintéticos @es
label: Fibres et fils synthétiques @fr
label: Fili e fibre sintetici @it
label: Fios e fibras sintéticas @pt
label: Synthetische Fasern & Fäden @de
label: Синтетические волокна и нити @ru
label: 合成繊維･紡績 @ja
label: 合成纖維及針織 @zh-hant
label: 合成纤维与线绳 @zh
label: 합성섬유 & 실 @ko
definition: This segment includes companies that manufacture synthetic fibers and threads, such as polyester, nylon and acrylics, among others. These synthetic materials are used in a host of industries not limited to apparel and textile products.
notation: 111011111210
valid from: 2014-08-08
valid till: 2020-10-03

Thread Mills
type: BicsLevel6Segment
type: Classifier
type: NamedIndividual
is level6 segment of: Fiber, Yarn & Thread
is anachronous version of: http://data.ga-group.nl/ics/bics/11101011111211
is contemporary version of: http://data.ga-group.nl/ics/bics/111011111211
is replaced by: http://data.ga-group.nl/ics/bics/2020/11101011111211
is version of: http://data.ga-group.nl/ics/bics/11101011111211
is version of: http://data.ga-group.nl/ics/bics/111011111211
imported on: 2026-06-08T13:03:47.798Z
last refreshed on: 2026-06-08T13:03:47.798Z
source accessed on: 2019-12-03T20:05:01Z
source last accessed on: 2019-12-03T20:05:01Z
label: Confección de hilos @es
label: Fábricas de fio @pt
label: Fabbriche di fili @it
label: Fadenspinnereien @de
label: Usines de fils @fr
label: Фабрики по изготовл. ниток @ru
label: 制线业 @zh
label: 紡績業 @ja
label: 針織業 @zh-hant
label: 실 편조업 @ko
definition: This segment includes companies that produce threads, which are a thin type of yarn used to stitch fabrics.
notation: 111011111211
valid from: 2014-08-08
valid till: 2020-10-03

Yarn Spinning Mills
type: BicsLevel6Segment
type: Classifier
type: NamedIndividual
is level6 segment of: Fiber, Yarn & Thread
is anachronous version of: http://data.ga-group.nl/ics/bics/11101011111212
is contemporary version of: http://data.ga-group.nl/ics/bics/111011111212
is replaced by: http://data.ga-group.nl/ics/bics/2020/11101011111212
is version of: http://data.ga-group.nl/ics/bics/11101011111212
is version of: http://data.ga-group.nl/ics/bics/111011111212
imported on: 2026-06-08T13:03:47.798Z
last refreshed on: 2026-06-08T13:03:47.798Z
source accessed on: 2019-12-03T20:05:01Z
source last accessed on: 2019-12-03T20:05:01Z
label: Fábricas de fiação de fios @pt
label: Fabbriche filatura @it
label: Garnspinnereien @de
label: Molinería hilos gir @es
label: Usines fils/filature @fr
label: Фабрики по прядению пряжи @ru
label: 紡紗業 @zh-hant
label: 缫丝业 @zh
label: 製糸業 @ja
label: 연사 방적업 @ko
definition: This segment includes companies that spin yarn from the fiber materials, such as cotton.
notation: 111011111212
valid from: 2014-08-08
valid till: 2020-10-03

Yarn Texturizing, Throw & Twist
type: BicsLevel6Segment
type: Classifier
type: NamedIndividual
is level6 segment of: Fiber, Yarn & Thread
is anachronous version of: http://data.ga-group.nl/ics/bics/11101011111213
is contemporary version of: http://data.ga-group.nl/ics/bics/111011111213
is replaced by: http://data.ga-group.nl/ics/bics/2020/11101011111213
is version of: http://data.ga-group.nl/ics/bics/11101011111213
is version of: http://data.ga-group.nl/ics/bics/111011111213
imported on: 2026-06-08T13:03:47.798Z
last refreshed on: 2026-06-08T13:03:47.798Z
source accessed on: 2019-12-03T20:05:01Z
source last accessed on: 2019-12-03T20:05:01Z
label: Filato tramato/gettato/intrecciato @it
label: Molienda de hilos texturizados, tirados y devanados @es
label: Rntrelaçamento, fiação e texturização de fios @pt
label: Texturation, moulinage et retordage de fils @fr
label: Verzwirnen, Wickeln & Spulen von Garn @de
label: Текстурирование, кручение и переплетение пряжи @ru
label: 紡紗締鬈、延伸及撚紗 @zh-hant
label: 織糸･ねん糸･より糸 @ja
label: 纱线初步加工 @zh
label: 섬유사 텍스처가공, 연사 & 합사 @ko
definition: This segment includes companies that texturize yarn, which is a process in which multiple filament yarns are combined to create a strong, spun yarn.
notation: 111011111213
valid from: 2014-08-08
valid till: 2020-10-03

Fiber, Yarn & Thread
type: BicsLevel5Segment
type: Classifier
type: NamedIndividual
is level5 segment of: Textile
is anachronous version of: http://data.ga-group.nl/ics/bics/111010111112
is contemporary version of: http://data.ga-group.nl/ics/bics/1110111112
is replaced by: http://data.ga-group.nl/ics/bics/2020/111010111112
is version of: http://data.ga-group.nl/ics/bics/111010111112
is version of: http://data.ga-group.nl/ics/bics/1110111112
imported on: 2026-06-08T13:03:47.798Z
last refreshed on: 2026-06-08T13:03:47.798Z
source accessed on: 2019-12-03T20:05:01Z
source last accessed on: 2019-12-03T20:05:01Z
label: Fasern, Garn & Faden @de
label: Fibras, hilos y tejidos @es
label: Fibre, filati e fili @it
label: Fibres, filés et fils @fr
label: Linhas, fios e fibras @pt
label: Волокно, пряжа и нити @ru
label: 繊維･製糸･紡績 @ja
label: 纖維、紗及線 @zh-hant
label: 纤维与纱线 @zh
label: 섬유, 제직사 & 봉제사 @ko
definition: This segment includes mills that spin, throw and manufacture yarns, threads and fibers that can then be woven into fabric.
notation: 1110111112
valid from: 2014-08-08
valid till: 2020-10-03

Textile
type: BicsLevel4SubIndustry
type: Classifier
type: NamedIndividual
is sub industry of: Textile & Textile Products
is anachronous version of: http://data.ga-group.nl/ics/bics/1110101111
is contemporary version of: http://data.ga-group.nl/ics/bics/11101111
is replaced by: http://data.ga-group.nl/ics/bics/2020/1110101111
is version of: http://data.ga-group.nl/ics/bics/1110101111
is version of: http://data.ga-group.nl/ics/bics/11101111
imported on: 2026-06-08T13:03:47.798Z
last refreshed on: 2026-06-08T13:03:47.798Z
source accessed on: 2019-12-03T20:05:01Z
source last accessed on: 2019-12-03T20:05:01Z
label: Têxteis @pt
label: Tessili @it
label: Textil @es
label: Textiles @fr
label: Textilien @de
label: Текстиль @ru
label: 紡織 @zh-hant
label: 繊維 @ja
label: 纺织品 @zh
label: 섬유 @ko
definition: This industry subgroup includes mills that manufacture and finish textiles.
notation: 11101111
valid from: 2014-08-08
valid till: 2020-10-03

Curtain & Drapery Mills
type: BicsLevel6Segment
type: Classifier
type: Discontinued
type: NamedIndividual
is level6 segment of: Textile Furnish
is contemporary version of: http://data.ga-group.nl/ics/bics/111011121010
is version of: http://data.ga-group.nl/ics/bics/111011121010
imported on: 2026-06-08T13:03:47.798Z
last refreshed on: 2026-06-08T13:03:47.798Z
source accessed on: 2019-12-03T20:05:01Z
source last accessed on: 2019-12-03T20:05:01Z
label: Confección de cortinas, blancos y similares @es
label: Fábrica de cortinas e acortinados @pt
label: Fabbriche di tende e drappeggi @it
label: Usines de draperie et rideaux @fr
label: Webereien für Gardingen und Vorhänge @de
label: Фабрики по производству занавесей и штор @ru
label: 窗帘与帷帐制造 @zh
label: 窗簾及布幔 @zh-hant
label: 커튼 및 휘장 제조업 @ko
label: ｶｰﾃﾝ・掛け布製造 @ja
definition: This segment includes companies that mill curtains and drapery.
notation: 111011121010
valid from: 2014-08-08
valid till: 2020-10-03

Other Household Textile Prods
type: BicsLevel6Segment
type: Classifier
type: Discontinued
type: NamedIndividual
is level6 segment of: Textile Furnish
is contemporary version of: http://data.ga-group.nl/ics/bics/111011121011
is version of: http://data.ga-group.nl/ics/bics/111011121011
imported on: 2026-06-08T13:03:47.798Z
last refreshed on: 2026-06-08T13:03:47.798Z
source accessed on: 2019-12-03T20:05:01Z
source last accessed on: 2019-12-03T20:05:01Z
label: Altri prodotti tessili per la casa @it
label: Autres produits textiles pour la maison @fr
label: Otros productos textiles domésticos @es
label: Outros produtos têxteis domésticos @pt
label: Sonstige Haushaltstextilprodukte @de
label: Пр. текстильн. изделия дл�� дома @ru
label: 其他家用纺织品 @zh
label: 其他紡織家飾品 @zh-hant
label: 家庭用繊維製品 @ja
label: 기타 가정용 섬유제품 @ko
definition: This segment includes companies that mill other household textiles not elsewhere classified, such as tablecloths.
notation: 111011121011
valid from: 2014-08-08
valid till: 2020-10-03

Textile Furnish
type: BicsLevel5Segment
type: Classifier
type: Discontinued
type: NamedIndividual
is level5 segment of: Textile Products
is contemporary version of: http://data.ga-group.nl/ics/bics/1110111210
is version of: http://data.ga-group.nl/ics/bics/1110111210
imported on: 2026-06-08T13:03:47.798Z
last refreshed on: 2026-06-08T13:03:47.798Z
source accessed on: 2019-12-03T20:05:01Z
source last accessed on: 2019-12-03T20:05:01Z
label: Arredi in tessuto @it
label: Mobília têxtil @pt
label: Textileinrichtung @de
label: Textiles d'ameublement @fr
label: Textiles de muebles @es
label: Текстильная фурнитура @ru
label: 家用纺织品 @zh
label: 紡織家飾 @zh-hant
label: 繊維敷物 @ja
label: 섬유가구 @ko
definition: This segment includes companies that produce textiles used in furniture and home decorations.
notation: 1110111210
valid from: 2014-08-08
valid till: 2020-10-03

Canvas & Related Prods Mills
type: BicsLevel6Segment
type: Classifier
type: NamedIndividual
is level6 segment of: Other Textile Products
is anachronous version of: http://data.ga-group.nl/ics/bics/111010111210
is contemporary version of: http://data.ga-group.nl/ics/bics/111011121110
is replaced by: http://data.ga-group.nl/ics/bics/2020/111010111210
is version of: http://data.ga-group.nl/ics/bics/111010111210
is version of: http://data.ga-group.nl/ics/bics/111011121110
imported on: 2026-06-08T13:03:47.798Z
last refreshed on: 2026-06-08T13:03:47.798Z
source accessed on: 2019-12-03T20:05:01Z
source last accessed on: 2019-12-03T20:05:01Z
label: Fabbriche di tela e prodotti simili @it
label: Fabriken für Kanevas & zugeh. Prod. @de
label: Lonas e fábrica de produtos relacionados @pt
label: Molinería de lienzos y productos relacionados @es
label: Usines de grosse toile et prod connexes @fr
label: Фабрики по произв-ву холста и сопутствующих изделий @ru
label: 帆布制造 @zh
label: 帆布及其他產品 @zh-hant
label: 帆布･関連製品製造 @ja
label: 캔버스 및 관련제품 제조업 @ko
definition: This segment includes companies that produce canvas products.
notation: 111011121110
valid from: 2014-08-08
valid till: 2020-10-03

Cotton Farming
type: BicsLevel6Segment
type: Classifier
type: NamedIndividual
is level6 segment of: Other Textile Products
is anachronous version of: http://data.ga-group.nl/ics/bics/111010111211
is contemporary version of: http://data.ga-group.nl/ics/bics/111011121111
is replaced by: http://data.ga-group.nl/ics/bics/2020/111010111211
is version of: http://data.ga-group.nl/ics/bics/111010111211
is version of: http://data.ga-group.nl/ics/bics/111011121111
imported on: 2026-06-08T13:03:47.798Z
last refreshed on: 2026-06-08T13:03:47.798Z
source accessed on: 2019-12-03T20:05:01Z
source last accessed on: 2019-12-03T20:05:01Z
label: Anbau von Baumwolle @de
label: Coltivazione cotone @it
label: Cultivo de algodão @pt
label: Cultivo de algodón @es
label: Culture du coton @fr
label: Выращивание хлопка @ru
label: 棉花栽培 @zh-hant
label: 棉花种植 @zh
label: 綿花作農業 @ja
label: 면화 재배업 @ko
definition: This segment includes companies that grow cotton plants.
notation: 111011121111
valid from: 2014-08-08
valid till: 2020-10-03

Rope, Cordage & Twine Mills
type: BicsLevel6Segment
type: Classifier
type: NamedIndividual
is level6 segment of: Other Textile Products
is anachronous version of: http://data.ga-group.nl/ics/bics/111010111212
is contemporary version of: http://data.ga-group.nl/ics/bics/111011121112
is replaced by: http://data.ga-group.nl/ics/bics/2020/111010111212
is version of: http://data.ga-group.nl/ics/bics/111010111212
is version of: http://data.ga-group.nl/ics/bics/111011121112
imported on: 2026-06-08T13:03:47.798Z
last refreshed on: 2026-06-08T13:03:47.798Z
source accessed on: 2019-12-03T20:05:01Z
source last accessed on: 2019-12-03T20:05:01Z
label: Fábrica de cordel/cordame/corda @pt
label: Fabbriche di corda/cordame/spago @it
label: Molinería de cuerdas, cordones e hilos @es
label: Usines de corde, cordage et ficelle @fr
label: Webereien für Schiffstau/Tauwerk/Schnüre @de
label: Фабрики по произв-ву веревок/канатов/шпагатов @ru
label: 縄・ひも・より糸製造 @ja
label: 繩索業 @zh-hant
label: 绳索制造 @zh
label: 로프/망/망사 제조업 @ko
definition: This segment includes companies that spin fibers into rope, cordage or twine.
notation: 111011121112
valid from: 2014-08-08
valid till: 2020-10-03

Textile Bag Mills
type: BicsLevel6Segment
type: Classifier
type: NamedIndividual
is level6 segment of: Other Textile Products
is anachronous version of: http://data.ga-group.nl/ics/bics/111010111213
is contemporary version of: http://data.ga-group.nl/ics/bics/111011121113
is replaced by: http://data.ga-group.nl/ics/bics/2020/111010111213
is version of: http://data.ga-group.nl/ics/bics/111010111213
is version of: http://data.ga-group.nl/ics/bics/111011121113
imported on: 2026-06-08T13:03:47.798Z
last refreshed on: 2026-06-08T13:03:47.798Z
source accessed on: 2019-12-03T20:05:01Z
source last accessed on: 2019-12-03T20:05:01Z
label: Conf bolsas textiles @es
label: Fábricas de sacos têxteis @pt
label: Fabb borse tessuto @it
label: Textilbeutelweberei @de
label: Usines sacs textile @fr
label: Фабрики по произв. сумок из текстиля @ru
label: 布包業 @zh-hant
label: 布製ﾊﾞｯｸﾞ製造業 @ja
label: 纺织手袋制造 @zh
label: 직물포대 편조업 @ko
definition: This segment includes companies that manufacture textile bags. This is primarily comprised of non-branded bags, such as generic brown bags used for bulk transport of grains and other substances.
notation: 111011121113
valid from: 2014-08-08
valid till: 2020-10-03

Tire Cord & Tire Fabrics Mills
type: BicsLevel6Segment
type: Classifier
type: NamedIndividual
is level6 segment of: Other Textile Products
is anachronous version of: http://data.ga-group.nl/ics/bics/111010111214
is contemporary version of: http://data.ga-group.nl/ics/bics/111011121114
is replaced by: http://data.ga-group.nl/ics/bics/2020/111010111214
is version of: http://data.ga-group.nl/ics/bics/111010111214
is version of: http://data.ga-group.nl/ics/bics/111011121114
imported on: 2026-06-08T13:03:47.798Z
last refreshed on: 2026-06-08T13:03:47.798Z
source accessed on: 2019-12-03T20:05:01Z
source last accessed on: 2019-12-03T20:05:01Z
label: Fábrica de tecidos e cordões pneumáticos @pt
label: Fabbriche corde e stoffe pneumatici @it
label: Fabricación de cordón y tela de llantas @es
label: Fabriken für Reifencord & -gewebe @de
label: Usines de câbles et tissus pour pneus @fr
label: Фабрики по производству шинного корда и шинных тканей @ru
label: 輪胎簾布 @zh-hant
label: 轮胎帘子布及轮胎纤维制造 @zh
label: 타이어코드 & 타이어 직물 제조업 @ko
label: ﾀｲﾔｺｰﾄﾞ･ﾀｲﾔ用繊維製造 @ja
definition: This segment includes companies that produce tire cord.
notation: 111011121114
valid from: 2014-08-08
valid till: 2020-10-03

Other Textile Prods Mills
type: BicsLevel6Segment
type: Classifier
type: Discontinued
type: NamedIndividual
is level6 segment of: Other Textile Products
is contemporary version of: http://data.ga-group.nl/ics/bics/111011121115
is version of: http://data.ga-group.nl/ics/bics/111011121115
imported on: 2026-06-08T13:03:47.798Z
last refreshed on: 2026-06-08T13:03:47.798Z
source accessed on: 2019-12-03T20:05:01Z
source last accessed on: 2019-12-03T20:05:01Z
label: Autres usines de prod textiles @fr
label: Fabbriche altri prodotti tessili @it
label: Fabriken für sonst. Textilprod. @de
label: Otros molinos de productos textiles @es
label: Outras fábricas prod têxteis @pt
label: Фабрики про произв. пр. текстильных изделий @ru
label: その他繊維製品製造 @ja
label: 其他紡織品 @zh-hant
label: 其他纺织品制造 @zh
label: 기타 섬유제품 제조업 @ko
definition: This segment includes companies that produce any other type of textile product not elsewhere classified.
notation: 111011121115
valid from: 2014-08-08
valid till: 2020-10-03

Other Textile Products
type: BicsLevel5Segment
type: Classifier
type: Discontinued
type: NamedIndividual
is level5 segment of: Textile Products
is contemporary version of: http://data.ga-group.nl/ics/bics/1110111211
is version of: http://data.ga-group.nl/ics/bics/1110111211
imported on: 2026-06-08T13:03:47.798Z
last refreshed on: 2026-06-08T13:03:47.798Z
source accessed on: 2019-12-03T20:05:01Z
source last accessed on: 2019-12-03T20:05:01Z
label: Altri prodotti tessili @it
label: Autres produits textiles @fr
label: Otros productos textiles @es
label: Outros produtos têxteis @pt
label: Sonstige Textilprodukte @de
label: Пр. текстильн. изделия @ru
label: その他繊維製品 @ja
label: 其他紡織品 @zh-hant
label: 其他纺织品 @zh
label: 기타 섬유제품 @ko
definition: This segment includes companies that provide other textile products not elsewhere classified.
notation: 1110111211
valid from: 2014-08-08
valid till: 2020-10-03

Textile Products
type: BicsLevel4SubIndustry
type: Classifier
type: NamedIndividual
is sub industry of: Textile & Textile Products
is anachronous version of: http://data.ga-group.nl/ics/bics/1110101112
is contemporary version of: http://data.ga-group.nl/ics/bics/11101112
is replaced by: http://data.ga-group.nl/ics/bics/2020/1110101112
is version of: http://data.ga-group.nl/ics/bics/1110101112
is version of: http://data.ga-group.nl/ics/bics/11101112
imported on: 2026-06-08T13:03:47.798Z
last refreshed on: 2026-06-08T13:03:47.798Z
source accessed on: 2019-12-03T20:05:01Z
source last accessed on: 2019-12-03T20:05:01Z
label: Prodotti tessili @it
label: Productos textiles @es
label: Produits textiles @fr
label: Produtos têxteis @pt
label: Textilprodukte @de
label: Текстильные изделия @ru
label: 紡織品 @zh-hant
label: 繊維製品 @ja
label: 纺织品 @zh
label: 섬유제품 @ko
definition: This industry subgroup includes companies that produce finished, non-apparel textile products.
notation: 11101112
valid from: 2014-08-08
valid till: 2020-10-03

Textile & Textile Products
type: BicsLevel3Industry
type: Classifier
type: NamedIndividual
is industry of: Apparel & Textile Products
is anachronous version of: http://data.ga-group.nl/ics/bics/11101011
is contemporary version of: http://data.ga-group.nl/ics/bics/111011
is replaced by: http://data.ga-group.nl/ics/bics/2020/11101011
is version of: http://data.ga-group.nl/ics/bics/11101011
is version of: http://data.ga-group.nl/ics/bics/111011
imported on: 2026-06-08T13:03:47.798Z
last refreshed on: 2026-06-08T13:03:47.798Z
source accessed on: 2019-12-03T20:05:01Z
source last accessed on: 2019-12-03T20:05:01Z
label: Têxteis e produtos têxteis @pt
label: Tessuti e prodotti tessili @it
label: Textile et produits textiles @fr
label: Textiles y productos de textiles @es
label: Textilien & Textilprodukte @de
label: Текстиль и текстильная продукция @ru
label: 紡織及紡織品 @zh-hant
label: 繊維･繊維製品 @ja
label: 纺织品与纺织制品 @zh
label: 섬유 & 섬유제품 @ko
definition: This industry includes companies that produce textiles, such as yarns, threads, fabrics and leather goods.
notation: 111011
valid from: 2014-08-08
valid till: 2020-10-03

Apparel & Textile Products
type: BicsLevel2IndustryGroup
type: Classifier
type: NamedIndividual
is industry group of: Consumer Discretionary
is anachronous version of: http://data.ga-group.nl/ics/bics/111010
is contemporary version of: http://data.ga-group.nl/ics/bics/1110
is replaced by: http://data.ga-group.nl/ics/bics/2020/111010
is version of: http://data.ga-group.nl/ics/bics/111010
is version of: http://data.ga-group.nl/ics/bics/1110
imported on: 2026-06-08T13:03:47.798Z
last refreshed on: 2026-06-08T13:03:47.798Z
source accessed on: 2019-12-03T20:05:01Z
source last accessed on: 2019-12-03T20:05:01Z
label: Bekleidungs- & Textilprodukte @de
label: Indumenti e prodotti tessili @it
label: Productos textiles confeccionados @es
label: Produits de tissus et vêtements @fr
label: Produtos têxteis e vestuário @pt
label: Одежда и текстильные изделия @ru
label: 服装和纺织产品 @zh
label: 紡織及服裝產品 @zh-hant
label: 衣料､繊維製品 @ja
label: 의류 & 섬유 제품 @ko
definition: This industry group includes companies that design, manufacture and market apparel and textile products.
notation: 1110
valid from: 2014-08-08
valid till: 2020-10-03

Hybrid Electric Vehicles
type: BicsLevel6Segment
type: Classifier
type: Discontinued
type: NamedIndividual
is level6 segment of: Alternative Passenger Vehicles
is contemporary version of: http://data.ga-group.nl/ics/bics/111110101010
is version of: http://data.ga-group.nl/ics/bics/111110101010
imported on: 2026-06-08T13:03:47.798Z
last refreshed on: 2026-06-08T13:03:47.798Z
source accessed on: 2019-12-03T20:05:01Z
source last accessed on: 2019-12-03T20:05:01Z
label: Autos eléctricos híbridos @es
label: Hybride elektrische Fahrzeuge @de
label: Véhicules hybrides électriques @fr
label: Veículos elétricos híbridos @pt
label: Veicoli elettrici ibridi @it
label: Гибрид. электрич. транспорт. средства @ru
label: 混合动力电动汽车 @zh
label: 混合動力電動車 @zh-hant
label: 하이브리드 전기 자동차 @ko
label: ﾊｲﾌﾞﾘｯﾄﾞ電気自動車 @ja
definition: This segment includes companies that manufacture hybrid electric light trucks and utility vehicles.
notation: 111110101010
valid from: 2014-08-08
valid till: 2020-10-03

Plug-in Electric Vehicles
type: BicsLevel6Segment
type: Classifier
type: Discontinued
type: NamedIndividual
is level6 segment of: Alternative Passenger Vehicles
is contemporary version of: http://data.ga-group.nl/ics/bics/111110101011
is version of: http://data.ga-group.nl/ics/bics/111110101011
imported on: 2026-06-08T13:03:47.798Z
last refreshed on: 2026-06-08T13:03:47.798Z
source accessed on: 2019-12-03T20:05:01Z
source last accessed on: 2019-12-03T20:05:01Z
label: Autos de conexión eléctrica @es
label: Elektr. Fahrzeuge mit Plugin @de
label: Véhicules électriques branchables @fr
label: Veículos elétricos recarregáveis @pt
label: Veicoli elettrici a presa @it
label: Электрич. транспортные средства @ru
label: 插电电动汽��� @zh
label: 插電型車輛 @zh-hant
label: 플러그인 전기 자동차 @ko
label: ﾌﾟﾗｸﾞｲﾝ電気自動車 @ja
definition: This segment includes companies that manufacture plug-in electric light trucks and utility vehicles.
notation: 111110101011
valid from: 2014-08-08
valid till: 2020-10-03

Plug-in Hybrid Electric Vehicles
type: BicsLevel6Segment
type: Classifier
type: Discontinued
type: NamedIndividual
is level6 segment of: Alternative Passenger Vehicles
is contemporary version of: http://data.ga-group.nl/ics/bics/111110101012
is version of: http://data.ga-group.nl/ics/bics/111110101012
imported on: 2026-06-08T13:03:47.798Z
last refreshed on: 2026-06-08T13:03:47.798Z
source accessed on: 2019-12-03T20:05:01Z
source last accessed on: 2019-12-03T20:05:01Z
label: Autos híbridos de conexión eléctrica @es
label: Hybride elektr. Fahrzeuge mit Plugin @de
label: Véhicules électriques hybrides branchables @fr
label: Veículos elétricos híbridos recarregáveis @pt
label: Veicoli elettrici ibridi a presa @it
label: Гибрид. транспортн. средства на электрической подзарядке @ru
label: 插电混合动力电动汽车 @zh
label: 插電型混合動力電動車 @zh-hant
label: 플러그인 하이브리드 전기 자동차 @ko
label: ﾌﾟﾗｸﾞｲﾝ･ﾊｲﾌﾞﾘｯﾄﾞ電気自動車 @ja
definition: This segment includes companies that manufacture plug-in hybrid electric light trucks and utility vehicles.
notation: 111110101012
valid from: 2014-08-08
valid till: 2020-10-03

Other Alternative Energy Veh
type: BicsLevel6Segment
type: Classifier
type: Discontinued
type: NamedIndividual
is level6 segment of: Alternative Passenger Vehicles
is contemporary version of: http://data.ga-group.nl/ics/bics/111110101013
is version of: http://data.ga-group.nl/ics/bics/111110101013
imported on: 2026-06-08T13:03:47.798Z
last refreshed on: 2026-06-08T13:03:47.798Z
source accessed on: 2019-12-03T20:05:01Z
source last accessed on: 2019-12-03T20:05:01Z
label: Altri veicoli energia alternativa @it
label: Otros autos de energía alternativa @es
label: Outros veíc de energia alternativa @pt
label: Sonst. altern. Energiefahrzeuge @de
label: Véhicules élect autre énergie alt @fr
label: Пр трансп. средства на альтернат энергии @ru
label: その他代替ｴﾈﾙｷﾞｰ自動車 @ja
label: 其他替代能源汽车 @zh
label: 其他替代能源車輛 @zh-hant
label: 기타 대체에너지 자동차 @ko
definition: This segment includes companies that manufacture alternative passenger vehicles not elsewhere classified.
notation: 111110101013
valid from: 2014-08-08
valid till: 2020-10-03

Alternative Passenger Vehicles
type: BicsLevel5Segment
type: Classifier
type: Discontinued
type: NamedIndividual
is level5 segment of: Passenger Vehicles
is contemporary version of: http://data.ga-group.nl/ics/bics/1111101010
is version of: http://data.ga-group.nl/ics/bics/1111101010
imported on: 2026-06-08T13:03:47.798Z
last refreshed on: 2026-06-08T13:03:47.798Z
source accessed on: 2019-12-03T20:05:01Z
source last accessed on: 2019-12-03T20:05:01Z
label: Alternative Pkws @de
label: Véhicules de passagers alternatifs @fr
label: Veículos de passageiro alternativos @pt
label: Vehículos alternativos de pasajeros @es
label: Veicoli passeggeri alternativi @it
label: Альтернативн. легков��е транспортные средства @ru
label: 代替乗用車 @ja
label: 另類客車 @zh-hant
label: 替代乘用车 @zh
label: 대체 승용차 @ko
definition: This segment includes companies that manufacture alternative energy drivetrain light trucks and utility vehicles.
notation: 1111101010
valid from: 2014-08-08
valid till: 2020-10-03

Internal Comb Eng Vehicles
type: BicsLevel5Segment
type: Classifier
type: Discontinued
type: NamedIndividual
is level5 segment of: Passenger Vehicles
is contemporary version of: http://data.ga-group.nl/ics/bics/1111101011
is version of: http://data.ga-group.nl/ics/bics/1111101011
imported on: 2026-06-08T13:03:47.798Z
last refreshed on: 2026-06-08T13:03:47.798Z
source accessed on: 2019-12-03T20:05:01Z
source last accessed on: 2019-12-03T20:05:01Z
label: Autos de combustión interna @es
label: Véhicules moteur à combu interne @fr
label: Veículos com mot comb interna @pt
label: Veicoli motore comb interna @it
label: Verbrennungsmotorfahrzeuge @de
label: Автомобили с двигателем внутр. сгорания @ru
label: 內燃機車輛 @zh-hant
label: 内燃机工程车 @zh
label: 内燃機関ｴﾝｼﾞﾝ(ICE)自動車 @ja
label: 내연기관 자동차 @ko
definition: This segment includes companies that manufacture internal combustion engine (ICE) light trucks and utility vehicles.
notation: 1111101011
valid from: 2014-08-08
valid till: 2020-10-03

Passenger Vehicles
type: BicsLevel4SubIndustry
type: Classifier
type: NamedIndividual
is sub industry of: Automobiles
is anachronous version of: http://data.ga-group.nl/ics/bics/1110111010
is contemporary version of: http://data.ga-group.nl/ics/bics/11111010
is replaced by: http://data.ga-group.nl/ics/bics/2020/1110111010
is version of: http://data.ga-group.nl/ics/bics/1110111010
is version of: http://data.ga-group.nl/ics/bics/11111010
imported on: 2026-06-08T13:03:47.798Z
last refreshed on: 2026-06-08T13:03:47.798Z
source accessed on: 2019-12-03T20:05:01Z
source last accessed on: 2019-12-03T20:05:01Z
label: Pkws @de
label: Véhicules de passagers @fr
label: Veículos de passageiros @pt
label: Vehículos de pasajeros @es
label: Veicolo passeggeri @it
label: Пассажирские транспортные средства @ru
label: 乗用車 @ja
label: 乘用车 @zh
label: 客車 @zh-hant
label: 승용차 @ko
definition: This industry subgroup includes companies that manufacture passenger cars. Such vehicles include sports cars, sedans, station wagons, hatchbacks, and microcars.
notation: 11111010
valid from: 2014-08-08
valid till: 2020-10-03

Hybrid Electric Light Trucks
type: BicsLevel6Segment
type: Classifier
type: Discontinued
type: NamedIndividual
is level6 segment of: Alternative Light Trucks
is contemporary version of: http://data.ga-group.nl/ics/bics/111110111010
is version of: http://data.ga-group.nl/ics/bics/111110111010
imported on: 2026-06-08T13:03:47.798Z
last refreshed on: 2026-06-08T13:03:47.798Z
source accessed on: 2019-12-03T20:05:01Z
source last accessed on: 2019-12-03T20:05:01Z
label: Autocarri leggeri elettrici ibridi @it
label: Caminhões elétricos leves híbridos @pt
label: Camiones ligeros eléctricos híbridos @es
label: Camions légers hybrides électriques @fr
label: Hybride elektr. Kleinlaster @de
label: Легкогруз. гибрид. электрические автомобили @ru
label: 混合动力电动轻型卡车 @zh
label: 混合動力電動輕型卡車 @zh-hant
label: 하이브리드 전기 소형트럭 @ko
label: ﾊｲﾌﾞﾘｯﾄﾞ電気軽ﾄﾗｯｸ @ja
definition: This segment includes companies that manufacture hybrid electric passenger cars.
notation: 111110111010
valid from: 2014-08-08
valid till: 2020-10-03

Plug-in Electric Light Trucks
type: BicsLevel6Segment
type: Classifier
type: Discontinued
type: NamedIndividual
is level6 segment of: Alternative Light Trucks
is contemporary version of: http://data.ga-group.nl/ics/bics/111110111011
is version of: http://data.ga-group.nl/ics/bics/111110111011
imported on: 2026-06-08T13:03:47.798Z
last refreshed on: 2026-06-08T13:03:47.798Z
source accessed on: 2019-12-03T20:05:01Z
source last accessed on: 2019-12-03T20:05:01Z
label: Autocarri leggeri elettrici a presa @it
label: Caminhões elétricos leves recarregáveis @pt
label: Camiones ligeros de conexión eléctrica @es
label: Camions légers électriques branchables @fr
label: Elektr. Kleinlaster mit Plugin @de
label: Легкогруз. автомобили на электр. подзарядке @ru
label: 插电电动轻型卡车 @zh
label: 插電型輕型卡車製造 @zh-hant
label: 플러그인 전기 소형트럭 @ko
label: ﾌﾟﾗｸﾞｲﾝ電気軽ﾄﾗｯｸ @ja
definition: This segment includes companies that manufacture plug-in electric passenger cars.
notation: 111110111011
valid from: 2014-08-08
valid till: 2020-10-03

Plug-in Hybrid Light Trucks
type: BicsLevel6Segment
type: Classifier
type: Discontinued
type: NamedIndividual
is level6 segment of: Alternative Light Trucks
is contemporary version of: http://data.ga-group.nl/ics/bics/111110111012
is version of: http://data.ga-group.nl/ics/bics/111110111012
imported on: 2026-06-08T13:03:47.798Z
last refreshed on: 2026-06-08T13:03:47.798Z
source accessed on: 2019-12-03T20:05:01Z
source last accessed on: 2019-12-03T20:05:01Z
label: Autocarri leggeri ibridi a presa @it
label: Caminhões elétricos leves híbridos recarregáveis @pt
label: Camiones ligeros híbridos de conexión eléctrica @es
label: Camions légers hybrides branchables @fr
label: Hybride Kleinlaster mit Plugin @de
label: Гибридные легкогруз. автомобили @ru
label: 插电混合动力电动轻型卡车 @zh
label: 插電型輕型卡車 @zh-hant
label: 플러그인 하이브리드 전기 소형트럭 @ko
label: ﾌﾟﾗｸﾞｲﾝ･ﾊｲﾌﾞﾘｯﾄﾞ軽ﾄﾗｯｸ @ja
definition: This segment includes companies that manufacture plug-in hybrid electric passenger cars.
notation: 111110111012
valid from: 2014-08-08
valid till: 2020-10-03

Other Alt Energy Light Trucks
type: BicsLevel6Segment
type: Classifier
type: Discontinued
type: NamedIndividual
is level6 segment of: Alternative Light Trucks
is contemporary version of: http://data.ga-group.nl/ics/bics/111110111013
is version of: http://data.ga-group.nl/ics/bics/111110111013
imported on: 2026-06-08T13:03:47.798Z
last refreshed on: 2026-06-08T13:03:47.798Z
source accessed on: 2019-12-03T20:05:01Z
source last accessed on: 2019-12-03T20:05:01Z
label: Autocarri leggeri altra energia alt @it
label: Camions légers autre énergie alternative @fr
label: Otros camiones ligeros de energía alternativa @es
label: Outros caminhões leves energ alt @pt
label: Sonst. Kleinlaster altern. Energie @de
label: Проч. легкогруз. автомобили на альт. энергии @ru
label: その他代替燃料軽ﾄﾗｯｸ @ja
label: 其他替代能源輕型卡車 @zh-hant
label: 其他替代能源轻型卡车 @zh
label: 기��� 대체에너지 소형트럭 @ko
definition: This segment includes companies that manufacture all other alternative energy drivetrain passenger cars that are not elsewhere classified.
notation: 111110111013
valid from: 2014-08-08
valid till: 2020-10-03

Alternative Light Trucks
type: BicsLevel5Segment
type: Classifier
type: Discontinued
type: NamedIndividual
is level5 segment of: Light Trucks
is contemporary version of: http://data.ga-group.nl/ics/bics/1111101110
is version of: http://data.ga-group.nl/ics/bics/1111101110
imported on: 2026-06-08T13:03:47.798Z
last refreshed on: 2026-06-08T13:03:47.798Z
source accessed on: 2019-12-03T20:05:01Z
source last accessed on: 2019-12-03T20:05:01Z
label: Alternative Kleinlaster @de
label: Autocarri leggeri alternativi @it
label: Caminhões leves alternativos @pt
label: Camiones ligeros alternativos @es
label: Camions légers transmission alternative @fr
label: Альтернат. грузовики малой грузоподъемн. @ru
label: 代替軽ﾄﾗｯｸ @ja
label: 另類輕型卡車 @zh-hant
label: 替代轻型卡车 @zh
label: 대체 소형트럭 @ko
definition: This segment includes companies that manufacture alternative energy drivetrain passenger cars.
notation: 1111101110
valid from: 2014-08-08
valid till: 2020-10-03

Internal Comb Eng Light Trucks
type: BicsLevel5Segment
type: Classifier
type: Discontinued
type: NamedIndividual
is level5 segment of: Light Trucks
is contemporary version of: http://data.ga-group.nl/ics/bics/1111101111
is version of: http://data.ga-group.nl/ics/bics/1111101111
imported on: 2026-06-08T13:03:47.798Z
last refreshed on: 2026-06-08T13:03:47.798Z
source accessed on: 2019-12-03T20:05:01Z
source last accessed on: 2019-12-03T20:05:01Z
label: Autocarri leggeri motore com interna @it
label: Caminhões leves c/motor comb int @pt
label: Camions légers à combustion interne @fr
label: Combustión interna camiones ligeros @es
label: Kleinlaster mit Verbrennungsmotor @de
label: Легкогруз. автомобили с двигат. внутр. сгорания @ru
label: 內燃機輕型卡車 @zh-hant
label: 内燃机轻型卡车 @zh
label: 内燃機関ｴﾝｼﾞﾝ(ICE)軽ﾄﾗｯｸ @ja
label: 내연기관 소형트럭 @ko
definition: This segment includes companies that manufacture internal combustion engine (ICE) passenger cars.
notation: 1111101111
valid from: 2014-08-08
valid till: 2020-10-03

Light Trucks
type: BicsLevel4SubIndustry
type: Classifier
type: NamedIndividual
is sub industry of: Automobiles
is anachronous version of: http://data.ga-group.nl/ics/bics/1110111011
is contemporary version of: http://data.ga-group.nl/ics/bics/11111011
is replaced by: http://data.ga-group.nl/ics/bics/2020/1110111011
is version of: http://data.ga-group.nl/ics/bics/1110111011
is version of: http://data.ga-group.nl/ics/bics/11111011
imported on: 2026-06-08T13:03:47.798Z
last refreshed on: 2026-06-08T13:03:47.798Z
source accessed on: 2019-12-03T20:05:01Z
source last accessed on: 2019-12-03T20:05:01Z
label: Autocarri leggeri @it
label: Caminhões leves @pt
label: Camiones ligeros @es
label: Camions légers @fr
label: Kleinlaster @de
label: Грузовики малой грузоподъемн. @ru
label: 軽ﾄﾗｯｸ @ja
label: 輕型卡車 @zh-hant
label: 轻型卡车 @zh
label: 소형트럭 @ko
definition: This industry subgroup includes companies that manufacture light duty trucks and utility vehicles. Such vehicles include light trucks, pickup trucks, cabs, light duty vans, minivans and sport utility vehicles.
notation: 11111011
valid from: 2014-08-08
valid till: 2020-10-03

Motorbikes & Parts
type: BicsLevel4SubIndustry
type: Classifier
type: NamedIndividual
is sub industry of: Automobiles
is anachronous version of: http://data.ga-group.nl/ics/bics/1110111012
is contemporary version of: http://data.ga-group.nl/ics/bics/11111012
is replaced by: http://data.ga-group.nl/ics/bics/2020/1110111012
is version of: http://data.ga-group.nl/ics/bics/1110111012
is version of: http://data.ga-group.nl/ics/bics/11111012
imported on: 2026-06-08T13:03:47.798Z
last refreshed on: 2026-06-08T13:03:47.798Z
source accessed on: 2019-12-03T20:05:01Z
source last accessed on: 2019-12-03T20:05:01Z
label: Motocicletas e peças @pt
label: Motocicletas y partes @es
label: Motocicli e parti @it
label: Motorräder & Teile @de
label: Motos et pièces @fr
label: Мопеды и з/части @ru
label: 摩托车及零部件 @zh
label: 機車及零件 @zh-hant
label: 오토바이 & 부품 @ko
label: ｵｰﾄﾊﾞｲ･部品 @ja
definition: This industry subgroup includes companies that manufacture motorcycles and scooters as well as parts specifically designed for motorcycles and scooters.
notation: 11111012
valid from: 2014-08-08
valid till: 2020-10-03

Automobiles
type: BicsLevel3Industry
type: Classifier
type: NamedIndividual
is industry of: Automotive
is anachronous version of: http://data.ga-group.nl/ics/bics/11101110
is contemporary version of: http://data.ga-group.nl/ics/bics/111110
is replaced by: http://data.ga-group.nl/ics/bics/2020/11101110
is version of: http://data.ga-group.nl/ics/bics/11101110
is version of: http://data.ga-group.nl/ics/bics/111110
imported on: 2026-06-08T13:03:47.798Z
last refreshed on: 2026-06-08T13:03:47.798Z
source accessed on: 2019-12-03T20:05:01Z
source last accessed on: 2019-12-03T20:05:01Z
label: Automóveis @pt
label: Automóviles @es
label: Automobili @it
label: Autos @de
label: Автомобили @ru
label: 汽車 @zh-hant
label: 汽车 @zh
label: 自動車 @ja
label: 자동차 @ko
definition: This industry includes companies that manufacture automobiles (passenger cars), light trucks, motorcycles and sport utility vehicles. Excludes passenger vehicles manufactured for commercial use, medium duty trucks and heavy duty trucks.
notation: 111110
valid from: 2014-08-08
valid till: 2020-10-03

Alt Vehicle Drivetrains
type: BicsLevel5Segment
type: Classifier
type: Discontinued
type: NamedIndividual
is level5 segment of: Alternative Vehicle Parts
is contemporary version of: http://data.ga-group.nl/ics/bics/1111111010
is version of: http://data.ga-group.nl/ics/bics/1111111010
imported on: 2026-06-08T13:03:47.798Z
last refreshed on: 2026-06-08T13:03:47.798Z
source accessed on: 2019-12-03T20:05:01Z
source last accessed on: 2019-12-03T20:05:01Z
label: Alternativer Fahrzeugantrieb @de
label: Transmisiones alternativas de autos @es
label: Transmissões de veículos alternativas @pt
label: Trasmissione veicoli alternativi @it
label: Véhicules à transmission alternative @fr
label: Альтернативные автомобили - Трансмиссия @ru
label: 代替燃料車動力伝達装置 @ja
label: 另類車輛傳動系統 @zh-hant
label: 替代汽车动力传动系统 @zh
label: 대체 차량 구동계 @ko
definition: This segment includes companies that manufacture drivetrains for alternative energy and hybrid systems.
notation: 1111111010
valid from: 2014-08-08
valid till: 2020-10-03

Alt Vehicle Energy Storage
type: BicsLevel5Segment
type: Classifier
type: Discontinued
type: NamedIndividual
is level5 segment of: Alternative Vehicle Parts
is contemporary version of: http://data.ga-group.nl/ics/bics/1111111011
is version of: http://data.ga-group.nl/ics/bics/1111111011
imported on: 2026-06-08T13:03:47.798Z
last refreshed on: 2026-06-08T13:03:47.798Z
source accessed on: 2019-12-03T20:05:01Z
source last accessed on: 2019-12-03T20:05:01Z
label: Altern. Fahrzeug Energiespeicher @de
label: Armazenagem de energia veículo alt @pt
label: Camiones alt de almacenamiento de energía @es
label: Immagazz energia veicoli alt @it
label: Véhicules alt à stockage d'énergie @fr
label: Хранение энергии для альтерн. автомобилей @ru
label: 代替燃料車ｴﾈ���ｷﾞｰ貯蔵 @ja
label: 另類車輛能源儲存 @zh-hant
label: 替代汽车能源储存 @zh
label: 대체 차량 에너지저장 @ko
definition: This segment includes companies that manufacture alternative energy storage systems. Includes hybrid batteries, electric vehicle batteries and hydrogen fuel cells. Excludes standard lead acid starter batteries (see Vehicle Battery Manufacturing).
notation: 1111111011
valid from: 2014-08-08
valid till: 2020-10-03

Other Alt Vehicles Parts
type: BicsLevel5Segment
type: Classifier
type: Discontinued
type: NamedIndividual
is level5 segment of: Alternative Vehicle Parts
is contemporary version of: http://data.ga-group.nl/ics/bics/1111111012
is version of: http://data.ga-group.nl/ics/bics/1111111012
imported on: 2026-06-08T13:03:47.798Z
last refreshed on: 2026-06-08T13:03:47.798Z
source accessed on: 2019-12-03T20:05:01Z
source last accessed on: 2019-12-03T20:05:01Z
label: Otras partes de auto alternativas @es
label: Outras peças veículos alt @pt
label: Parti veicoli altra alt @it
label: Pièces pour autres véhicules alt @fr
label: Sonstige altern. Fahrzeugteile @de
label: З/части для альтерн. автомобилей @ru
label: その他代替燃料車部品 @ja
label: 其他另類車輛零件 @zh-hant
label: 其他替代汽车零部件 @zh
label: 기타 대체 차량 부품 @ko
definition: This segment includes companies that manufacture other alternative drivetrain and hybrid system parts not elsewhere classified.
notation: 1111111012
valid from: 2014-08-08
valid till: 2020-10-03

Alternative Vehicle Parts
type: BicsLevel4SubIndustry
type: Classifier
type: NamedIndividual
is sub industry of: Auto Parts
is anachronous version of: http://data.ga-group.nl/ics/bics/1110111110
is contemporary version of: http://data.ga-group.nl/ics/bics/11111110
is replaced by: http://data.ga-group.nl/ics/bics/2020/1110111110
is version of: http://data.ga-group.nl/ics/bics/1110111110
is version of: http://data.ga-group.nl/ics/bics/11111110
imported on: 2026-06-08T13:03:47.798Z
last refreshed on: 2026-06-08T13:03:47.798Z
source accessed on: 2019-12-03T20:05:01Z
source last accessed on: 2019-12-03T20:05:01Z
label: Alternative Fahrzeugteile @de
label: Partes alternativas de vehículos @es
label: Parti veicoli alternativi @it
label: Peças para veículos alternativo @pt
label: Pièces de véhicules alternatifs @fr
label: Запчасти для пр. альтерн. автомобилей @ru
label: 代替燃料車部品 @ja
label: 另類車輛零件 @zh-hant
label: 替代汽车零部件 @zh
label: 대체 ���량 부품 @ko
definition: This industry subgroup includes companies that manufacture alternative drivetrain and hybrid systems and parts for automobiles.
notation: 11111110
valid from: 2014-08-08
valid till: 2020-10-03

Auto Audio & Video Equipment
type: BicsLevel5Segment
type: Classifier
type: Discontinued
type: NamedIndividual
is level5 segment of: Auto Electrical
is contemporary version of: http://data.ga-group.nl/ics/bics/1111111110
is version of: http://data.ga-group.nl/ics/bics/1111111110
imported on: 2026-06-08T13:03:47.798Z
last refreshed on: 2026-06-08T13:03:47.798Z
source accessed on: 2019-12-03T20:05:01Z
source last accessed on: 2019-12-03T20:05:01Z
label: Audio y equipo audiovisual de auto @es
label: Audio- & Videogeräte für Autos @de
label: Equip audio/video auto @it
label: Equipamentos de audio/vídeo carros @pt
label: Equipements audio et vidéo pour automobile @fr
label: Автомоб. аудио/видео оборудование @ru
label: 汽車影音設備 @zh-hant
label: 汽车影音设备 @zh
label: 自動車用音声映像機器 @ja
label: 자동차 오디오 & 비디오 장비 @ko
definition: This segment includes companies that manufacture onboard electrical audio/video equipment. Such equipment includes GPS systems, car component monitoring and telematics.
notation: 1111111110
valid from: 2014-08-08
valid till: 2020-10-03

Auto Light Equipment
type: BicsLevel5Segment
type: Classifier
type: NamedIndividual
is level5 segment of: Auto Electrical
is anachronous version of: http://data.ga-group.nl/ics/bics/111011111110
is contemporary version of: http://data.ga-group.nl/ics/bics/1111111111
is replaced by: http://data.ga-group.nl/ics/bics/2020/111011111110
is version of: http://data.ga-group.nl/ics/bics/111011111110
is version of: http://data.ga-group.nl/ics/bics/1111111111
imported on: 2026-06-08T13:03:47.798Z
last refreshed on: 2026-06-08T13:03:47.798Z
source accessed on: 2019-12-03T20:05:01Z
source last accessed on: 2019-12-03T20:05:01Z
label: Beleuchtungsvorrichtung für Autos @de
label: Equip illuminazione auto @it
label: Equipamentos para carros leves @pt
label: Equipements d'éclairage automobile @fr
label: Equipo ligero de autos @es
label: Автомоб. свет. оборудование @ru
label: 汽車照明設備 @zh-hant
label: 汽车照明设备 @zh
label: 自動車用照明 @ja
label: 자동차 경량 장비 @ko
definition: This segment includes companies that manufacture onboard electrical lighting products.
notation: 1111111111
valid from: 2014-08-08
valid till: 2020-10-03

Other Electrical Equipment
type: BicsLevel5Segment
type: Classifier
type: NamedIndividual
is level5 segment of: Auto Electrical
is anachronous version of: http://data.ga-group.nl/ics/bics/111011111111
is contemporary version of: http://data.ga-group.nl/ics/bics/1111111112
is replaced by: http://data.ga-group.nl/ics/bics/2020/111011111111
is version of: http://data.ga-group.nl/ics/bics/111011111111
is version of: http://data.ga-group.nl/ics/bics/1111111112
imported on: 2026-06-08T13:03:47.798Z
last refreshed on: 2026-06-08T13:03:47.798Z
source accessed on: 2019-12-03T20:05:01Z
source last accessed on: 2019-12-03T20:05:01Z
label: Altre apparecchiature elettriche @it
label: Autres équipements électriques @fr
label: Otro equipo eléctrico @es
label: Outros equipamentos elétricos @pt
label: Sonstige Elektroteile @de
label: Другое электрооборудование @ru
label: その他自動車用電子機器 @ja
label: 其他电气设备 @zh
label: 其他電機設備 @zh-hant
label: 기타 전기 장비 @ko
definition: This segment includes companies that manufacture electrical and electronic equipment, except lighting systems and audio/video equipment. Includes automotive systems, cruise control systems, power window systems, alternators, starters, engine control units, sensors, and wiper systems.
notation: 1111111112
valid from: 2014-08-08
valid till: 2020-10-03

Auto Electrical
type: BicsLevel4SubIndustry
type: Classifier
type: NamedIndividual
is sub industry of: Auto Parts
is anachronous version of: http://data.ga-group.nl/ics/bics/1110111111
is contemporary version of: http://data.ga-group.nl/ics/bics/11111111
is replaced by: http://data.ga-group.nl/ics/bics/2020/1110111111
is version of: http://data.ga-group.nl/ics/bics/1110111111
is version of: http://data.ga-group.nl/ics/bics/11111111
imported on: 2026-06-08T13:03:47.798Z
last refreshed on: 2026-06-08T13:03:47.798Z
source accessed on: 2019-12-03T20:05:01Z
source last accessed on: 2019-12-03T20:05:01Z
label: Auto-elétrica @pt
label: Autoelektrik @de
label: Autos eléctricos @es
label: Electrique automobile @fr
label: Elettrici auto @it
label: Электрич. системы д/автомоб. @ru
label: 汽車電機 @zh-hant
label: 汽车电气 @zh
label: 自動車用電装品 @ja
label: 자동차 전기 @ko
definition: This industry subgroup includes companies that manufacture onboard electrical and electronic equipment for the automobile industry.
notation: 11111111
valid from: 2014-08-08
valid till: 2020-10-03

Auto Glass
type: BicsLevel4SubIndustry
type: Classifier
type: NamedIndividual
is sub industry of: Auto Parts
is anachronous version of: http://data.ga-group.nl/ics/bics/1110111112
is contemporary version of: http://data.ga-group.nl/ics/bics/11111112
is replaced by: http://data.ga-group.nl/ics/bics/2020/1110111112
is version of: http://data.ga-group.nl/ics/bics/1110111112
is version of: http://data.ga-group.nl/ics/bics/11111112
imported on: 2026-06-08T13:03:47.798Z
last refreshed on: 2026-06-08T13:03:47.798Z
source accessed on: 2019-12-03T20:05:01Z
source last accessed on: 2019-12-03T20:05:01Z
label: Autoglas @de
label: Ventanas automotrices @es
label: Verre pour automobiles @fr
label: Vetri auto @it
label: Vidros automotivos @pt
label: Автомобильное стекло @ru
label: 汽車玻璃 @zh-hant
label: 汽车玻璃 @zh
label: 自動車用ガラス @ja
label: 자동차 유리 @ko
definition: This industry subgroup includes companies that manufacture automobile glass. Products include tinted and tintless windshields, windows and sun and moon roofs.
notation: 11111112
valid from: 2014-08-08
valid till: 2020-10-03

Auto Metal Stamping
type: BicsLevel4SubIndustry
type: Classifier
type: NamedIndividual
is sub industry of: Auto Parts
is anachronous version of: http://data.ga-group.nl/ics/bics/1110111114
is contemporary version of: http://data.ga-group.nl/ics/bics/11111113
is replaced by: http://data.ga-group.nl/ics/bics/2020/1110111114
is version of: http://data.ga-group.nl/ics/bics/1110111114
is version of: http://data.ga-group.nl/ics/bics/11111113
imported on: 2026-06-08T13:03:47.798Z
last refreshed on: 2026-06-08T13:03:47.798Z
source accessed on: 2019-12-03T20:05:01Z
source last accessed on: 2019-12-03T20:05:01Z
label: Autometallstanzen @de
label: Estampa metal para automóveis @pt
label: Estampage de métal pour automobiles @fr
label: Estampas de metal de autos @es
label: Stampaggio metalli auto @it
label: Металлочеканные автодетали @ru
label: 汽車金屬沖壓 @zh-hant
label: 汽车金属冲压 @zh
label: 自動車金属ﾌﾟﾚｽ @ja
label: 자동차 금속 스탬핑 @ko
definition: This industry subgroup includes companies that manufacture automobile metal stampings. Products include body parts, fenders, hubcaps and tops.
notation: 11111113
valid from: 2014-08-08
valid till: 2020-10-03

Auto Safety Equipment
type: BicsLevel4SubIndustry
type: Classifier
type: NamedIndividual
is sub industry of: Auto Parts
is anachronous version of: http://data.ga-group.nl/ics/bics/1110111115
is contemporary version of: http://data.ga-group.nl/ics/bics/11111114
is replaced by: http://data.ga-group.nl/ics/bics/2020/1110111115
is version of: http://data.ga-group.nl/ics/bics/1110111115
is version of: http://data.ga-group.nl/ics/bics/11111114
imported on: 2026-06-08T13:03:47.798Z
last refreshed on: 2026-06-08T13:03:47.798Z
source accessed on: 2019-12-03T20:05:01Z
source last accessed on: 2019-12-03T20:05:01Z
label: Autosicherheitsgeräte @de
label: Equipagg sicurezza auto @it
label: Equipamento de segurança automotiva @pt
label: Equipements de sécurité pour automobiles @fr
label: Equipo de seguridad automotriz @es
label: Оборудование автомобильной безопасности @ru
label: 汽車安全設備 @zh-hant
label: 汽车安全设备 @zh
label: 自動車用安全機器 @ja
label: 자동차 안전 장비 @ko
definition: This industry subgroup includes companies that manufacture automotive safety equipment. Products include airbags and seatbelts.
notation: 11111114
valid from: 2014-08-08
valid till: 2020-10-03

Automotive Engineering & Tech
type: BicsLevel4SubIndustry
type: Classifier
type: NamedIndividual
is sub industry of: Auto Parts
is anachronous version of: http://data.ga-group.nl/ics/bics/1110111116
is contemporary version of: http://data.ga-group.nl/ics/bics/11111115
is replaced by: http://data.ga-group.nl/ics/bics/2020/1110111116
is version of: http://data.ga-group.nl/ics/bics/1110111116
is version of: http://data.ga-group.nl/ics/bics/11111115
imported on: 2026-06-08T13:03:47.798Z
last refreshed on: 2026-06-08T13:03:47.798Z
source accessed on: 2019-12-03T20:05:01Z
source last accessed on: 2019-12-03T20:05:01Z
label: Automobiltechnologie @de
label: Engenharia automotiva e tecn @pt
label: Ingegneria e tec automobilistica @it
label: Ingeniería y tec automotriz @es
label: Tech et ingénierie automobile @fr
label: Автомобильное машиностр. и технологии @ru
label: 汽車工程及技術 @zh-hant
label: 汽车工程与技术 @zh
label: 自動車ｴﾝｼﾞﾆｱﾘﾝｸﾞ/ﾃｸﾉﾛｼﾞｰ @ja
label: 자동차공학 & 기술 @ko
definition: This industry subgroup includes companies that develop, license or sell technology applied in the automobile industry but are not involved in the manufacturing process.
notation: 11111115
valid from: 2014-08-08
valid till: 2020-10-03

Body & Chassis
type: BicsLevel4SubIndustry
type: Classifier
type: NamedIndividual
is sub industry of: Auto Parts
is anachronous version of: http://data.ga-group.nl/ics/bics/1110111117
is contemporary version of: http://data.ga-group.nl/ics/bics/11111116
is replaced by: http://data.ga-group.nl/ics/bics/2020/1110111117
is version of: http://data.ga-group.nl/ics/bics/1110111117
is version of: http://data.ga-group.nl/ics/bics/11111116
imported on: 2026-06-08T13:03:47.798Z
last refreshed on: 2026-06-08T13:03:47.798Z
source accessed on: 2019-12-03T20:05:01Z
source last accessed on: 2019-12-03T20:05:01Z
label: Carrocerías @es
label: Carroceria e chassi @pt
label: Carrosseries et châssis @fr
label: Karosserie & Fahrgestell @de
label: Telaio e carrozzeria @it
label: Шасси и кузова автомобилей @ru
label: 車体･ｼｬｰｼ @ja
label: 車體及底盤 @zh-hant
label: 车身与底盘 @zh
label: 본체 & 섀시 @ko
definition: This industry subgroup includes companies that manufacture body and chassis structures, such as frames, roll cages, and joints.
notation: 11111116
valid from: 2014-08-08
valid till: 2020-10-03

Brake Systems
type: BicsLevel4SubIndustry
type: Classifier
type: NamedIndividual
is sub industry of: Auto Parts
is anachronous version of: http://data.ga-group.nl/ics/bics/1110111118
is contemporary version of: http://data.ga-group.nl/ics/bics/11111117
is replaced by: http://data.ga-group.nl/ics/bics/2020/1110111118
is version of: http://data.ga-group.nl/ics/bics/1110111118
is version of: http://data.ga-group.nl/ics/bics/11111117
imported on: 2026-06-08T13:03:47.798Z
last refreshed on: 2026-06-08T13:03:47.798Z
source accessed on: 2019-12-03T20:05:01Z
source last accessed on: 2019-12-03T20:05:01Z
label: Bremssysteme @de
label: Sistema de freios @pt
label: Sistemas de frenos @es
label: Sistemi frenanti @it
label: Systèmes de freinage @fr
label: Тормозные системы @ru
label: 制动系统 @zh
label: 煞車系統 @zh-hant
label: 브레이크 시스템 @ko
label: ﾌﾞﾚｰｷ･ｼｽﾃﾑ @ja
definition: This industry subgroup includes companies that manufacture automobile braking systems and related components.
notation: 11111117
valid from: 2014-08-08
valid till: 2020-10-03

Drivetrain Components
type: BicsLevel4SubIndustry
type: Classifier
type: NamedIndividual
is sub industry of: Auto Parts
is anachronous version of: http://data.ga-group.nl/ics/bics/1110111119
is contemporary version of: http://data.ga-group.nl/ics/bics/11111118
is replaced by: http://data.ga-group.nl/ics/bics/2020/1110111119
is version of: http://data.ga-group.nl/ics/bics/1110111119
is version of: http://data.ga-group.nl/ics/bics/11111118
imported on: 2026-06-08T13:03:47.798Z
last refreshed on: 2026-06-08T13:03:47.798Z
source accessed on: 2019-12-03T20:05:01Z
source last accessed on: 2019-12-03T20:05:01Z
label: Antriebskomponenten @de
label: Componentes de transmisión @es
label: Componentes de transmissão @pt
label: Componenti trasmissione @it
label: Composants de transmission @fr
label: Компоненты привода @ru
label: 傳動組件 @zh-hant
label: 动力传动元件 @zh
label: 駆動系部品 @ja
label: 구동계 부품 @ko
definition: This industry subgroup includes companies that manufacture automobile transmission and powertrain parts.
notation: 11111118
valid from: 2014-08-08
valid till: 2020-10-03

Diesel Engines & Engine Parts
type: BicsLevel5Segment
type: Classifier
type: NamedIndividual
is level5 segment of: Engines & Parts
is anachronous version of: http://data.ga-group.nl/ics/bics/111011112010
is contemporary version of: http://data.ga-group.nl/ics/bics/1111111910
is replaced by: http://data.ga-group.nl/ics/bics/2020/111011112010
is version of: http://data.ga-group.nl/ics/bics/111011112010
is version of: http://data.ga-group.nl/ics/bics/1111111910
imported on: 2026-06-08T13:03:47.798Z
last refreshed on: 2026-06-08T13:03:47.798Z
source accessed on: 2019-12-03T20:05:01Z
source last accessed on: 2019-12-03T20:05:01Z
label: Dieselmotoren & Motorteile @de
label: Moteurs diesel et pièces de moteurs @fr
label: Motor a diesel e peças do motor @pt
label: Motores de diésel y partes @es
label: Motori diesel e parti motore @it
label: Дизельные двигатели и з/части @ru
label: 柴油发动机与发动机零部件 @zh
label: 柴油引擎及引擎零件 @zh-hant
label: 디젤 엔진 & 엔진 부품 @ko
label: ﾃﾞｨｰｾﾞﾙｴﾝｼﾞﾝ､ｴﾝｼﾞﾝ部品 @ja
definition: This segment includes companies that manufacture diesel engines and engine parts for automobiles.
notation: 1111111910
valid from: 2014-08-08
valid till: 2020-10-03

Gasoline Engines & Eng Parts
type: BicsLevel5Segment
type: Classifier
type: NamedIndividual
is level5 segment of: Engines & Parts
is anachronous version of: http://data.ga-group.nl/ics/bics/111011112011
is contemporary version of: http://data.ga-group.nl/ics/bics/1111111911
is replaced by: http://data.ga-group.nl/ics/bics/2020/111011112011
is version of: http://data.ga-group.nl/ics/bics/111011112011
is version of: http://data.ga-group.nl/ics/bics/1111111911
imported on: 2026-06-08T13:03:47.798Z
last refreshed on: 2026-06-08T13:03:47.798Z
source accessed on: 2019-12-03T20:05:01Z
source last accessed on: 2019-12-03T20:05:01Z
label: Benzinmotoren & Motorteile @de
label: Moteurs à essence et leurs pièces @fr
label: Motor de gasolina e peças do motor @pt
label: Motores de gasolina y partes @es
label: Motori benzina e parti motore @it
label: Бензиновые двигатели и з/части @ru
label: 汽油发动机与发动机零部件 @zh
label: 汽油引擎及引擎零件 @zh-hant
label: 휘발유 엔진 & 엔진부품 @ko
label: ｶﾞｿﾘﾝｴﾝｼﾞﾝ/ｴﾝｼﾞﾝ部品 @ja
definition: This segment includes companies that manufacture gasoline engines and engine parts for automobiles.
notation: 1111111911
valid from: 2014-08-08
valid till: 2020-10-03

Engines & Parts
type: BicsLevel4SubIndustry
type: Classifier
type: NamedIndividual
is sub industry of: Auto Parts
is anachronous version of: http://data.ga-group.nl/ics/bics/1110111120
is contemporary version of: http://data.ga-group.nl/ics/bics/11111119
is replaced by: http://data.ga-group.nl/ics/bics/2020/1110111120
is version of: http://data.ga-group.nl/ics/bics/1110111120
is version of: http://data.ga-group.nl/ics/bics/11111119
imported on: 2026-06-08T13:03:47.798Z
last refreshed on: 2026-06-08T13:03:47.798Z
source accessed on: 2019-12-03T20:05:01Z
source last accessed on: 2019-12-03T20:05:01Z
label: Moteur et pièces @fr
label: Motor e peças @pt
label: Motoren & Teile @de
label: Motores y partes @es
label: Motori e parti @it
label: Двигатели и з/части @ru
label: 发动机与零部件 @zh
label: 引擎及零件 @zh-hant
label: 엔진 & 부품 @ko
label: ｴﾝｼﾞﾝ･部品 @ja
definition: This industry subgroup includes companies that manufacture automobile engines and engine parts. Products include gasoline and diesel engines and engine parts.
notation: 11111119
valid from: 2014-08-08
valid till: 2020-10-03

Exhausts & Emissions
type: BicsLevel4SubIndustry
type: Classifier
type: NamedIndividual
is sub industry of: Auto Parts
is anachronous version of: http://data.ga-group.nl/ics/bics/1110111121
is contemporary version of: http://data.ga-group.nl/ics/bics/11111120
is replaced by: http://data.ga-group.nl/ics/bics/2020/1110111121
is version of: http://data.ga-group.nl/ics/bics/1110111121
is version of: http://data.ga-group.nl/ics/bics/11111120
imported on: 2026-06-08T13:03:47.798Z
last refreshed on: 2026-06-08T13:03:47.798Z
source accessed on: 2019-12-03T20:05:01Z
source last accessed on: 2019-12-03T20:05:01Z
label: Auspuffe @de
label: Escapes y emisiones @es
label: Exaustor e emissões @pt
label: Scarichi ed emissioni @it
label: Systèmes d'échappement et émissions @fr
label: Выхлопы и выбросы @ru
label: 尾气排放装置 @zh
label: 排気装置 @ja
label: 排氣及排放 @zh-hant
label: 배기가스 @ko
definition: This industry subgroup includes companies that manufacture exhaust and emissions systems. Products include exhaust manifolds, exhaust pipes and catalytic converters.
notation: 11111120
valid from: 2014-08-08
valid till: 2020-10-03

Auto HVAC Systems
type: BicsLevel4SubIndustry
type: Classifier
type: NamedIndividual
is sub industry of: Auto Parts
is anachronous version of: http://data.ga-group.nl/ics/bics/1110111113
is contemporary version of: http://data.ga-group.nl/ics/bics/11111121
is replaced by: http://data.ga-group.nl/ics/bics/2020/1110111113
is version of: http://data.ga-group.nl/ics/bics/1110111113
is version of: http://data.ga-group.nl/ics/bics/11111121
imported on: 2026-06-08T13:03:47.798Z
last refreshed on: 2026-06-08T13:03:47.798Z
source accessed on: 2019-12-03T20:05:01Z
source last accessed on: 2019-12-03T20:05:01Z
label: Auto HVAC-Systeme @de
label: Sistemas HVAC automóveis @pt
label: Sistemas HVAC de autos @es
label: Sistemi HVAC auto @it
label: Systèmes CVCA auto @fr
label: Оборуд. для обогрева и кондиционирования @ru
label: 汽車冷暖氣系統 @zh-hant
label: 汽车暖通空调系统 @zh
label: 自動車用冷暖房空調ｼｽﾃﾑ @ja
label: 자동차 HVAC 시스템 @ko
definition: This industry subgroup includes companies that manufacture heating, ventilation and air conditioning (HVAC) systems and their components.
notation: 11111121
valid from: 2014-08-08
valid till: 2020-10-03

Seating & Trim
type: BicsLevel4SubIndustry
type: Classifier
type: NamedIndividual
is sub industry of: Auto Parts
is anachronous version of: http://data.ga-group.nl/ics/bics/1110111122
is contemporary version of: http://data.ga-group.nl/ics/bics/11111122
is replaced by: http://data.ga-group.nl/ics/bics/2020/1110111122
is version of: http://data.ga-group.nl/ics/bics/1110111122
is version of: http://data.ga-group.nl/ics/bics/11111122
imported on: 2026-06-08T13:03:47.798Z
last refreshed on: 2026-06-08T13:03:47.798Z
source accessed on: 2019-12-03T20:05:01Z
source last accessed on: 2019-12-03T20:05:01Z
label: Asientos y bordes @es
label: Assentos e acabamentos @pt
label: Sedili e rifinitura @it
label: Sièges et garnitures @fr
label: Sitze & Innenausstattung @de
label: Сидения и отделка салона @ru
label: 座椅与内饰 @zh
label: 座椅及內裝 @zh-hant
label: 自動車用座席･調度品 @ja
label: 자동차 의자 & 내장 @ko
definition: This industry subgroup includes companies that manufacture automobile seating equipment and interiors trims. Products include seats, panels, headliners and textiles.
notation: 11111122
valid from: 2014-08-08
valid till: 2020-10-03

Steering & Suspension
type: BicsLevel4SubIndustry
type: Classifier
type: NamedIndividual
is sub industry of: Auto Parts
is anachronous version of: http://data.ga-group.nl/ics/bics/1110111123
is contemporary version of: http://data.ga-group.nl/ics/bics/11111123
is replaced by: http://data.ga-group.nl/ics/bics/2020/1110111123
is version of: http://data.ga-group.nl/ics/bics/1110111123
is version of: http://data.ga-group.nl/ics/bics/11111123
imported on: 2026-06-08T13:03:47.798Z
last refreshed on: 2026-06-08T13:03:47.798Z
source accessed on: 2019-12-03T20:05:01Z
source last accessed on: 2019-12-03T20:05:01Z
label: Direção e suspensão @pt
label: Direcciones y suspensiones @es
label: Directions/suspensions @fr
label: Lenkung & Aufhängung @de
label: Sterzo e sospensione @it
label: Рулевые устройства и деталей подвески @ru
label: 車輛轉向及懸承元件 @zh-hant
label: 转向与悬挂 @zh
label: 스티어링 & 서스펜션 @ko
label: ｽﾃｱﾘﾝｸﾞ･ｻｽﾍﾟﾝｼｮﾝ部品 @ja
definition: This industry subgroup includes companies that manufacture steering, suspension parts, and shock absorbers, excluding springs.
notation: 11111123
valid from: 2014-08-08
valid till: 2020-10-03

Tire
type: BicsLevel4SubIndustry
type: Classifier
type: NamedIndividual
is sub industry of: Auto Parts
is anachronous version of: http://data.ga-group.nl/ics/bics/1110111124
is contemporary version of: http://data.ga-group.nl/ics/bics/11111124
is replaced by: http://data.ga-group.nl/ics/bics/2020/1110111124
is version of: http://data.ga-group.nl/ics/bics/1110111124
is version of: http://data.ga-group.nl/ics/bics/11111124
imported on: 2026-06-08T13:03:47.798Z
last refreshed on: 2026-06-08T13:03:47.798Z
source accessed on: 2019-12-03T20:05:01Z
source last accessed on: 2019-12-03T20:05:01Z
label: Llantas @es
label: Pneumatici @it
label: Pneus @fr
label: Reifen @de
label: Шины @ru
label: 輪胎 @zh-hant
label: 轮胎 @zh
label: 타이어 @ko
label: ﾀｲﾔ @ja
definition: This industry subgroup includes companies that manufacture tires and inner tubes from natural and synthetic rubber.
notation: 11111124
valid from: 2014-08-08
valid till: 2020-10-03

Vehicle Batteries
type: BicsLevel4SubIndustry
type: Classifier
type: NamedIndividual
is sub industry of: Auto Parts
is anachronous version of: http://data.ga-group.nl/ics/bics/1110111125
is contemporary version of: http://data.ga-group.nl/ics/bics/11111125
is replaced by: http://data.ga-group.nl/ics/bics/2020/1110111125
is version of: http://data.ga-group.nl/ics/bics/1110111125
is version of: http://data.ga-group.nl/ics/bics/11111125
imported on: 2026-06-08T13:03:47.798Z
last refreshed on: 2026-06-08T13:03:47.798Z
source accessed on: 2019-12-03T20:05:01Z
source last accessed on: 2019-12-03T20:05:01Z
label: Baterías de vehículos @es
label: Batterie veicoli @it
label: Batteries de véhicules @fr
label: Fahrzeugbatterien @de
label: Veículos a bateria @pt
label: Аккумулят. батари д/автомобилей @ru
label: 汽车电池 @zh
label: 車両ﾊﾞｯﾃﾘｰ @ja
label: 車用電池 @zh-hant
label: 자동차 배터리 @ko
definition: This industry subgroup includes companies that manufacture batteries to power automobiles.
notation: 11111125
valid from: 2014-08-08
valid till: 2020-10-03

Vehicle Wheels
type: BicsLevel4SubIndustry
type: Classifier
type: NamedIndividual
is sub industry of: Auto Parts
is anachronous version of: http://data.ga-group.nl/ics/bics/1110111126
is contemporary version of: http://data.ga-group.nl/ics/bics/11111126
is replaced by: http://data.ga-group.nl/ics/bics/2020/1110111126
is version of: http://data.ga-group.nl/ics/bics/1110111126
is version of: http://data.ga-group.nl/ics/bics/11111126
imported on: 2026-06-08T13:03:47.798Z
last refreshed on: 2026-06-08T13:03:47.798Z
source accessed on: 2019-12-03T20:05:01Z
source last accessed on: 2019-12-03T20:05:01Z
label: Fahrzeugräder @de
label: Roda de veículo @pt
label: Roues de véhicules @fr
label: Ruedas de vehículos @es
label: Ruote veicoli @it
label: Колеса автомобиля @ru
label: 自動車用車輪 @ja
label: 車輪 @zh-hant
label: 车辆轮圈 @zh
label: 자동차 휠 @ko
definition: This industry subgroup includes companies that manufacture automobile wheels and rims. Products include steel, aluminum and alloy wheels.
notation: 11111126
valid from: 2014-08-08
valid till: 2020-10-03

Other Motor Vehicle Parts
type: BicsLevel4SubIndustry
type: Classifier
type: Discontinued
type: NamedIndividual
is sub industry of: Auto Parts
is contemporary version of: http://data.ga-group.nl/ics/bics/11111127
is version of: http://data.ga-group.nl/ics/bics/11111127
imported on: 2026-06-08T13:03:47.798Z
last refreshed on: 2026-06-08T13:03:47.798Z
source accessed on: 2019-12-03T20:05:01Z
source last accessed on: 2019-12-03T20:05:01Z
label: Altri pezzi automezzi @it
label: Otras partes de vehículos automotrices @es
label: Outras peças de veículos de motor @pt
label: Pièces pour autres véhicules motorisé @fr
label: Sonstige Kraftfahrzeugteile @de
label: Прочие з/части д/автомобиля @ru
label: その他自動車部品 @ja
label: 其他机动车零部件 @zh
label: 其他車輛零件 @zh-hant
label: 기타 자동차 부품 @ko
definition: This industry subgroup includes companies that manufacture other motor vehicle parts not elsewhere classified.
notation: 11111127
valid from: 2014-08-08
valid till: 2020-10-03

Auto Parts
type: BicsLevel3Industry
type: Classifier
type: NamedIndividual
is industry of: Automotive
is anachronous version of: http://data.ga-group.nl/ics/bics/11101111
is contemporary version of: http://data.ga-group.nl/ics/bics/111111
is replaced by: http://data.ga-group.nl/ics/bics/2020/11101111
is version of: http://data.ga-group.nl/ics/bics/11101111
is version of: http://data.ga-group.nl/ics/bics/111111
imported on: 2026-06-08T13:03:47.798Z
last refreshed on: 2026-06-08T13:03:47.798Z
source accessed on: 2019-12-03T20:05:01Z
source last accessed on: 2019-12-03T20:05:01Z
label: Auto-peças @pt
label: Autopartes @es
label: Autoteile @de
label: Parti automobilistiche @it
label: Pièces automobiles @fr
label: Автозапчасти @ru
label: 汽車零件 @zh-hant
label: 汽车配件 @zh
label: 自動車部品 @ja
label: 자동차 부품 @ko
definition: This industry includes companies that manufacture various types of automotive parts. Excludes companies that manufactures parts for commercial vehicles (see Commercial Vehicles) and motorcycles (see Motorbikes & Parts).
notation: 111111
valid from: 2014-08-08
valid till: 2020-10-03

Automotive
type: BicsLevel2IndustryGroup
type: Classifier
type: NamedIndividual
is industry group of: Consumer Discretionary
is anachronous version of: http://data.ga-group.nl/ics/bics/111011
is contemporary version of: http://data.ga-group.nl/ics/bics/1111
is replaced by: http://data.ga-group.nl/ics/bics/2020/111011
is version of: http://data.ga-group.nl/ics/bics/111011
is version of: http://data.ga-group.nl/ics/bics/1111
imported on: 2026-06-08T13:03:47.798Z
last refreshed on: 2026-06-08T13:03:47.798Z
source accessed on: 2019-12-03T20:05:01Z
source last accessed on: 2019-12-03T20:05:01Z
label: Auto @de
label: Automobile @it
label: Automotivo @pt
label: Automotriz @es
label: Industrie automobile @fr
label: Автомобили @ru
label: 汽車業 @zh-hant
label: 汽车 @zh
label: 自動車 @ja
label: 자동차 @ko
definition: This industry group includes companies that manufacture automobiles or automobile parts.
notation: 1111
valid from: 2014-08-08
valid till: 2020-10-03

Single Family Home Const
type: BicsLevel4SubIndustry
type: Classifier
type: NamedIndividual
is sub industry of: Homebuilders
is anachronous version of: http://data.ga-group.nl/ics/bics/1110121010
is contemporary version of: http://data.ga-group.nl/ics/bics/11121010
is replaced by: http://data.ga-group.nl/ics/bics/2020/1110121010
is version of: http://data.ga-group.nl/ics/bics/1110121010
is version of: http://data.ga-group.nl/ics/bics/11121010
imported on: 2026-06-08T13:03:47.798Z
last refreshed on: 2026-06-08T13:03:47.798Z
source accessed on: 2019-12-03T20:05:01Z
source last accessed on: 2019-12-03T20:05:01Z
label: Bau von Einfamilienhäusern @de
label: Const casas unifamiliar @pt
label: Constru maisons individuelles @fr
label: Construcción de viviendas de una familia @es
label: Costruz case unifamiliari @it
label: Строит. домов на одну семью @ru
label: 一戸建住宅建設 @ja
label: 單戶住宅營建 @zh-hant
label: 独栋住宅建筑 @zh
label: 단독가구 주택건설 @ko
definition: This industry subgroup includes companies that build and sell single family homes.
notation: 11121010
valid from: 2014-08-08
valid till: 2020-10-03

Multifamily Home Construction
type: BicsLevel4SubIndustry
type: Classifier
type: NamedIndividual
is sub industry of: Homebuilders
is anachronous version of: http://data.ga-group.nl/ics/bics/1110121011
is contemporary version of: http://data.ga-group.nl/ics/bics/11121011
is replaced by: http://data.ga-group.nl/ics/bics/2020/1110121011
is version of: http://data.ga-group.nl/ics/bics/1110121011
is version of: http://data.ga-group.nl/ics/bics/11121011
imported on: 2026-06-08T13:03:47.798Z
last refreshed on: 2026-06-08T13:03:47.798Z
source accessed on: 2019-12-03T20:05:01Z
source last accessed on: 2019-12-03T20:05:01Z
label: Bau von Mehrfamilienhäusern @de
label: Construção de casas multifamiliar @pt
label: Construcción de viviendas multifamiliares @es
label: Construction de résidences multi-familles @fr
label: Costruzione case multifamiliari @it
label: Строительство многоквартирного дома @ru
label: 多世帯住宅建設 @ja
label: 多戶住宅營建 @zh-hant
label: 多户���宅建筑 @zh
label: 다가구 주택건설 @ko
definition: This industry subgroup includes companies that build and sell multifamily homes. Includes townhouses, condominiums and duplexes.
notation: 11121011
valid from: 2014-08-08
valid till: 2020-10-03

Manufactured (Mobile) Home
type: BicsLevel4SubIndustry
type: Classifier
type: NamedIndividual
is sub industry of: Homebuilders
is anachronous version of: http://data.ga-group.nl/ics/bics/1110121012
is contemporary version of: http://data.ga-group.nl/ics/bics/11121012
is replaced by: http://data.ga-group.nl/ics/bics/2020/1110121012
is version of: http://data.ga-group.nl/ics/bics/1110121012
is version of: http://data.ga-group.nl/ics/bics/11121012
imported on: 2026-06-08T13:03:47.798Z
last refreshed on: 2026-06-08T13:03:47.798Z
source accessed on: 2019-12-03T20:05:01Z
source last accessed on: 2019-12-03T20:05:01Z
label: Casas fabricadas (trailer) @pt
label: Case prefabbricate (mobili) @it
label: Maisons préfabriquées (mobiles) @fr
label: Mobilheime @de
label: Viviendas fabricadas (móviles) @es
label: Готовые (передвижные) дома @ru
label: 移動住宅(ﾄﾚｰﾗｰ住宅) @ja
label: 組合(移動式)房屋 @zh-hant
label: 预制(移动)房屋 @zh
label: 조립식(이동식) 주택 @ko
definition: This industry subgroup includes companies that build and sell manufactured or mobile homes and other buildings.
notation: 11121012
valid from: 2014-08-08
valid till: 2020-10-03

Land Sales
type: BicsLevel4SubIndustry
type: Classifier
type: NamedIndividual
is sub industry of: Homebuilders
is anachronous version of: http://data.ga-group.nl/ics/bics/1110121013
is contemporary version of: http://data.ga-group.nl/ics/bics/11121013
is replaced by: http://data.ga-group.nl/ics/bics/2020/1110121013
is version of: http://data.ga-group.nl/ics/bics/1110121013
is version of: http://data.ga-group.nl/ics/bics/11121013
imported on: 2026-06-08T13:03:47.798Z
last refreshed on: 2026-06-08T13:03:47.798Z
source accessed on: 2019-12-03T20:05:01Z
source last accessed on: 2019-12-03T20:05:01Z
label: Grundstücksverkäufe @de
label: Vendas de terras @pt
label: Vendite di terreno @it
label: Ventas de tierra @es
label: Ventes de terrains @fr
label: Продажа земли @ru
label: 土地出售 @zh
label: 土地売却 @ja
label: 土地銷售 @zh-hant
label: 토지 매매 @ko
definition: This industry subgroup includes revenue derived from land sales by homebuilders.
notation: 11121013
valid from: 2014-08-08
valid till: 2020-10-03

Homebuilders
type: BicsLevel3Industry
type: Classifier
type: NamedIndividual
is industry of: Home & Office Products
is anachronous version of: http://data.ga-group.nl/ics/bics/11101210
is contemporary version of: http://data.ga-group.nl/ics/bics/111210
is replaced by: http://data.ga-group.nl/ics/bics/2020/11101210
is version of: http://data.ga-group.nl/ics/bics/11101210
is version of: http://data.ga-group.nl/ics/bics/111210
imported on: 2026-06-08T13:03:47.798Z
last refreshed on: 2026-06-08T13:03:47.798Z
source accessed on: 2019-12-03T20:05:01Z
source last accessed on: 2019-12-03T20:05:01Z
label: Constr mais @fr
label: Constr viviendas @es
label: Construt casas @pt
label: Edilizia resid @it
label: Hausbauunternehmer @de
label: Жилищно-строит. фирма @ru
label: 住宅建設 @ja
label: 住宅營建 @zh-hant
label: 房屋建筑商 @zh
label: 주택 건설업 @ko
definition: This industry includes companies that build and sell residential buildings, including single and multifamily homes, apartments and condominiums. Excludes companies that rent properties.
notation: 111210
valid from: 2014-08-08
valid till: 2020-10-03

Arch & Decorative Coatings
type: BicsLevel4SubIndustry
type: Classifier
type: Discontinued
type: NamedIndividual
is sub industry of: Home Improvement
is contemporary version of: http://data.ga-group.nl/ics/bics/11121110
is version of: http://data.ga-group.nl/ics/bics/11121110
imported on: 2026-06-08T13:03:47.798Z
last refreshed on: 2026-06-08T13:03:47.798Z
source accessed on: 2019-12-03T20:05:01Z
source last accessed on: 2019-12-03T20:05:01Z
label: Architekt. & dekorative Beschichtungen @de
label: Cubrimientos arquitectónicos y decorativos @es
label: Revêtements arch et décoratifs @fr
label: Revest arquitetônicos e decorativos @pt
label: Rivestim architettonici e decorativi @it
label: Архитектурные и декоративные покрытия @ru
label: 建筑和装饰涂料 @zh
label: 建築用及裝潢塗料 @zh-hant
label: 建築･装飾用ｺｰﾃｨﾝｸﾞ @ja
label: 건축용 & 장식용 코팅 @ko
definition: This industry subgroup includes companies that manufacture wallpaper.
notation: 11121110
valid from: 2014-08-08
valid till: 2020-10-03

Carpets & Rugs
type: BicsLevel5Segment
type: Classifier
type: NamedIndividual
is level5 segment of: Flooring Products
is anachronous version of: http://data.ga-group.nl/ics/bics/111012111010
is contemporary version of: http://data.ga-group.nl/ics/bics/1112111110
is replaced by: http://data.ga-group.nl/ics/bics/2020/111012111010
is version of: http://data.ga-group.nl/ics/bics/111012111010
is version of: http://data.ga-group.nl/ics/bics/1112111110
imported on: 2026-06-08T13:03:47.798Z
last refreshed on: 2026-06-08T13:03:47.798Z
source accessed on: 2019-12-03T20:05:01Z
source last accessed on: 2019-12-03T20:05:01Z
label: Alfombras y tapetes @es
label: Carpete e tapetes @pt
label: Moquettes et tapis @fr
label: Tappeti e moquette @it
label: Teppiche & Vorleger @de
label: Ковры и ковр. издел. @ru
label: 地毯与地垫 @zh
label: 地毯及踏墊 @zh-hant
label: 카펫 & 마루덮개 @ko
label: ｶｰﾍﾟｯﾄ･絨毯 @ja
definition: This segment includes companies that mill carpets and rugs.
notation: 1112111110
valid from: 2014-08-08
valid till: 2020-10-03

Ceramic Wall & Floor Tiles
type: BicsLevel5Segment
type: Classifier
type: NamedIndividual
is level5 segment of: Flooring Products
is anachronous version of: http://data.ga-group.nl/ics/bics/111012111011
is contemporary version of: http://data.ga-group.nl/ics/bics/1112111111
is replaced by: http://data.ga-group.nl/ics/bics/2020/111012111011
is version of: http://data.ga-group.nl/ics/bics/111012111011
is version of: http://data.ga-group.nl/ics/bics/1112111111
imported on: 2026-06-08T13:03:47.798Z
last refreshed on: 2026-06-08T13:03:47.798Z
source accessed on: 2019-12-03T20:05:01Z
source last accessed on: 2019-12-03T20:05:01Z
label: Keramische Wand- & Bodenfliesen @de
label: Mattonelle ceramica pareti e pavimenti @it
label: Parede de cerâmica e piso de azulejo @pt
label: Paredes cerámica y azulejos para pisos @es
label: Tuiles en céramique mur/sol @fr
label: Настенная и напольная плитка @ru
label: 陶瓷墙砖与地砖 @zh
label: 陶瓷牆及地板磁磚 @zh-hant
label: 陶磁器製壁･床ﾀｲﾙ @ja
label: 세라믹벽 & 바닥 타일 @ko
definition: This segment includes companies that manufacture ceramic wall and floor tiles.
notation: 1112111111
valid from: 2014-08-08
valid till: 2020-10-03

Hardwood Flooring
type: BicsLevel5Segment
type: Classifier
type: NamedIndividual
is level5 segment of: Flooring Products
is anachronous version of: http://data.ga-group.nl/ics/bics/111012111012
is contemporary version of: http://data.ga-group.nl/ics/bics/1112111112
is replaced by: http://data.ga-group.nl/ics/bics/2020/111012111012
is version of: http://data.ga-group.nl/ics/bics/111012111012
is version of: http://data.ga-group.nl/ics/bics/1112111112
imported on: 2026-06-08T13:03:47.798Z
last refreshed on: 2026-06-08T13:03:47.798Z
source accessed on: 2019-12-03T20:05:01Z
source last accessed on: 2019-12-03T20:05:01Z
label: Bois à parquet @fr
label: Parkettfußboden @de
label: Pavimenti legno @it
label: Piso madeira @pt
label: Pisos madera @es
label: Твердые напольные покрытия @ru
label: 広葉樹床材 @ja
label: 硬木地板 @zh
label: 硬木地板鋪設 @zh-hant
label: 경목바닥재 @ko
definition: This segment includes companies that plane and finish wood strips for unassembled wood flooring.
notation: 1112111112
valid from: 2014-08-08
valid till: 2020-10-03

Resilient Floor Covering
type: BicsLevel5Segment
type: Classifier
type: NamedIndividual
is level5 segment of: Flooring Products
is anachronous version of: http://data.ga-group.nl/ics/bics/111012111013
is contemporary version of: http://data.ga-group.nl/ics/bics/1112111113
is replaced by: http://data.ga-group.nl/ics/bics/2020/111012111013
is version of: http://data.ga-group.nl/ics/bics/111012111013
is version of: http://data.ga-group.nl/ics/bics/1112111113
imported on: 2026-06-08T13:03:47.798Z
last refreshed on: 2026-06-08T13:03:47.798Z
source accessed on: 2019-12-03T20:05:01Z
source last accessed on: 2019-12-03T20:05:01Z
label: Elastische Bodenverkleidung @de
label: Pavimentazioni rimbalzanti @it
label: Recubierto resistente de pisos @es
label: Revêtements de sol souples @fr
label: Revestimentos de pisos resistentes @pt
label: Упругие напольные покрытия @ru
label: 塑膠彈性地板覆蓋物 @zh-hant
label: 弹性地面装饰材料 @zh
label: 弾力性床材 @ja
label: 장판류 @ko
definition: This segment includes companies that manufacture vinyl and linoleum floor covering.
notation: 1112111113
valid from: 2014-08-08
valid till: 2020-10-03

Flooring Products
type: BicsLevel4SubIndustry
type: Classifier
type: NamedIndividual
is sub industry of: Home Improvement
is anachronous version of: http://data.ga-group.nl/ics/bics/1110121110
is contemporary version of: http://data.ga-group.nl/ics/bics/11121111
is replaced by: http://data.ga-group.nl/ics/bics/2020/1110121110
is version of: http://data.ga-group.nl/ics/bics/1110121110
is version of: http://data.ga-group.nl/ics/bics/11121111
imported on: 2026-06-08T13:03:47.798Z
last refreshed on: 2026-06-08T13:03:47.798Z
source accessed on: 2019-12-03T20:05:01Z
source last accessed on: 2019-12-03T20:05:01Z
label: Bodenbeläge @de
label: Prod pavimenti @it
label: Productos pisos @es
label: Produtos de piso @pt
label: Revêtement de sol @fr
label: Напольная продукция @ru
label: 地板产品 @zh
label: 地板鋪設用品 @zh-hant
label: 床材製品 @ja
label: 바닥재 @ko
definition: This industry subgroup includes companies that manufacture flooring products. Products include carpet, hardwood, tile, resilient, vinyl and laminate flooring.
notation: 11121111
valid from: 2014-08-08
valid till: 2020-10-03

Electric Housewares & Fans
type: BicsLevel5Segment
type: Classifier
type: NamedIndividual
is level5 segment of: Household Appliances
is anachronous version of: http://data.ga-group.nl/ics/bics/1110131010
is contemporary version of: http://data.ga-group.nl/ics/bics/1112111210
is replaced by: http://data.ga-group.nl/ics/bics/2020/1110131010
is version of: http://data.ga-group.nl/ics/bics/1110131010
is version of: http://data.ga-group.nl/ics/bics/1112111210
imported on: 2026-06-08T13:03:47.798Z
last refreshed on: 2026-06-08T13:03:47.798Z
source accessed on: 2019-12-03T20:05:01Z
source last accessed on: 2019-12-03T20:05:01Z
label: Appareils ménagers et ventilateurs électriques @fr
label: Articoli casalinghi elettrici e ventilatori @it
label: Elektr. Haushaltsgeräte & Ventilatoren @de
label: Enseres y ventiladores eléctricos @es
label: Prod domésticos elétricos e ventiladores @pt
label: Электрические предметы и вентиляторы @ru
label: 家用电器与电扇 @zh
label: 家用電動器具及電扇 @zh-hant
label: 電気家庭用品･電気扇風機 @ja
label: 전기 가정용품 & 팬 @ko
definition: This segment includes companies that manufacture small household electrical appliances and housewares.
notation: 1112111210
valid from: 2014-08-08
valid till: 2020-10-03

Household Cooking Appliances
type: BicsLevel5Segment
type: Classifier
type: NamedIndividual
is level5 segment of: Household Appliances
is anachronous version of: http://data.ga-group.nl/ics/bics/1110131011
is contemporary version of: http://data.ga-group.nl/ics/bics/1112111211
is replaced by: http://data.ga-group.nl/ics/bics/2020/1110131011
is version of: http://data.ga-group.nl/ics/bics/1110131011
is version of: http://data.ga-group.nl/ics/bics/1112111211
imported on: 2026-06-08T13:03:47.798Z
last refreshed on: 2026-06-08T13:03:47.798Z
source accessed on: 2019-12-03T20:05:01Z
source last accessed on: 2019-12-03T20:05:01Z
label: Appareils ménagers pour la cuisine @fr
label: Eeletrodomésticos para assar domésticos @pt
label: Elettrodomestici cucina @it
label: Kochgeräte für den Haushalt @de
label: Utensilios domésticos de cocina @es
label: Бытов. кухон. приборы @ru
label: 家庭用電気調理機器 @ja
label: 家用烹飪電器 @zh-hant
label: 家用烹饪电器 @zh
label: 가정용 조리기구 @ko
definition: This segment includes companies that manufacture household cooking equipment.
notation: 1112111211
valid from: 2014-08-08
valid till: 2020-10-03

Household Laundry Equipment
type: BicsLevel5Segment
type: Classifier
type: NamedIndividual
is level5 segment of: Household Appliances
is anachronous version of: http://data.ga-group.nl/ics/bics/1110131012
is contemporary version of: http://data.ga-group.nl/ics/bics/1112111212
is replaced by: http://data.ga-group.nl/ics/bics/2020/1110131012
is version of: http://data.ga-group.nl/ics/bics/1110131012
is version of: http://data.ga-group.nl/ics/bics/1112111212
imported on: 2026-06-08T13:03:47.798Z
last refreshed on: 2026-06-08T13:03:47.798Z
source accessed on: 2019-12-03T20:05:01Z
source last accessed on: 2019-12-03T20:05:01Z
label: Appareils ménagers pour la lessive @fr
label: Equipamentos para lavagem de roupas doméstica @pt
label: Equipo doméstico de lavandería @es
label: Haushaltswaschmaschinen @de
label: Lavatrici per uso domestico @it
label: Бытовые стиральные машины @ru
label: 家庭用電気洗濯機 @ja
label: 家用洗衣机 @zh
label: 家用洗衣設備 @zh-hant
label: 가정용 세탁기 @ko
definition: This segment includes companies that manufacture household laundry equipment.
notation: 1112111212
valid from: 2014-08-08
valid till: 2020-10-03

Household Fridges & Freezers
type: BicsLevel5Segment
type: Classifier
type: NamedIndividual
is level5 segment of: Household Appliances
is anachronous version of: http://data.ga-group.nl/ics/bics/1110131013
is contemporary version of: http://data.ga-group.nl/ics/bics/1112111213
is replaced by: http://data.ga-group.nl/ics/bics/2020/1110131013
is version of: http://data.ga-group.nl/ics/bics/1110131013
is version of: http://data.ga-group.nl/ics/bics/1112111213
imported on: 2026-06-08T13:03:47.798Z
last refreshed on: 2026-06-08T13:03:47.798Z
source accessed on: 2019-12-03T20:05:01Z
source last accessed on: 2019-12-03T20:05:01Z
label: Freezer e refrigeradores domésticos @pt
label: Frigoriferi e congelatori domestici @it
label: Kühlschränke & Gefriertruhen @de
label: Réfrigérateurs et congélateurs ménagers @fr
label: Refrigeradores y cong dom @es
label: Бытовые холодильн. и морозильн. камеры @ru
label: 家庭用冷凍･冷蔵庫 @ja
label: 家用冰箱 @zh
label: 家用電冰箱及冷凍櫃 @zh-hant
label: 가정용 냉장고 & 냉동고 @ko
definition: This segment includes companies that manufacture household refrigerators and freezers.
notation: 1112111213
valid from: 2014-08-08
valid till: 2020-10-03

Household Vacuum Cleaners
type: BicsLevel5Segment
type: Classifier
type: NamedIndividual
is level5 segment of: Household Appliances
is anachronous version of: http://data.ga-group.nl/ics/bics/1110131014
is contemporary version of: http://data.ga-group.nl/ics/bics/1112111214
is replaced by: http://data.ga-group.nl/ics/bics/2020/1110131014
is version of: http://data.ga-group.nl/ics/bics/1110131014
is version of: http://data.ga-group.nl/ics/bics/1112111214
imported on: 2026-06-08T13:03:47.798Z
last refreshed on: 2026-06-08T13:03:47.798Z
source accessed on: 2019-12-03T20:05:01Z
source last accessed on: 2019-12-03T20:05:01Z
label: Aspirador para uso doméstico @pt
label: Aspiradoras para viviendas @es
label: Aspirapolveri per la casa @it
label: Aspirateurs ménagers @fr
label: Haushaltsstaubsauger @de
label: Бытовые пылесосы @ru
label: 家庭用真空掃除機 @ja
label: 家用吸塵器 @zh-hant
label: 家用真空吸尘器 @zh
label: 가정용 진공청소기 @ko
definition: This segment includes companies that manufacture household vacuum cleaners and floor waxing and carpet cleaning machines.
notation: 1112111214
valid from: 2014-08-08
valid till: 2020-10-03

Other Household Appliances
type: BicsLevel5Segment
type: Classifier
type: Discontinued
type: NamedIndividual
is level5 segment of: Household Appliances
is contemporary version of: http://data.ga-group.nl/ics/bics/1112111215
is version of: http://data.ga-group.nl/ics/bics/1112111215
imported on: 2026-06-08T13:03:47.798Z
last refreshed on: 2026-06-08T13:03:47.798Z
source accessed on: 2019-12-03T20:05:01Z
source last accessed on: 2019-12-03T20:05:01Z
label: Altri elettrodomestici @it
label: Autres appareils ménagers @fr
label: Otros enseres domésticos @es
label: Outros eletrodomésticos @pt
label: Sonstige Haushaltsgeräte @de
label: Прочие бытовые приборы @ru
label: その他家電製品 @ja
label: 其他家用电器 @zh
label: 其他家用電器 @zh-hant
label: 기타 가정제품 @ko
definition: This segment includes companies that manufacture major electrical and non-electrical appliances that are not elsewhere classified.
notation: 1112111215
valid from: 2014-08-08
valid till: 2020-10-03

Household Appliances
type: BicsLevel4SubIndustry
type: Classifier
type: NamedIndividual
is sub industry of: Home Improvement
is anachronous version of: http://data.ga-group.nl/ics/bics/11101310
is contemporary version of: http://data.ga-group.nl/ics/bics/11121112
is replaced by: http://data.ga-group.nl/ics/bics/2020/11101310
is version of: http://data.ga-group.nl/ics/bics/11101310
is version of: http://data.ga-group.nl/ics/bics/11121112
imported on: 2026-06-08T13:03:47.798Z
last refreshed on: 2026-06-08T13:03:47.798Z
source accessed on: 2019-12-03T20:05:01Z
source last accessed on: 2019-12-03T20:05:01Z
label: Aparelhos domésticos @pt
label: Appareils électroménagers @fr
label: Electrodomésticos @es
label: Elettrodomestici @it
label: Haushaltsgeräte @de
label: Бытовая техника @ru
label: 家用电器 @zh
label: 家用電器 @zh-hant
label: 家電製品 @ja
label: 가전제품 @ko
definition: This industry subgroup includes companies that manufacture electric housewares, fans, vacuum cleaners, cooking appliances, and major household appliances including refrigerators, freezers, and laundry equipment.
notation: 11121112
valid from: 2014-08-08
valid till: 2020-10-03

Kitchen Cabinets & Countertops
type: BicsLevel4SubIndustry
type: Classifier
type: NamedIndividual
is sub industry of: Home Improvement
is anachronous version of: http://data.ga-group.nl/ics/bics/1110121111
is contemporary version of: http://data.ga-group.nl/ics/bics/11121113
is replaced by: http://data.ga-group.nl/ics/bics/2020/1110121111
is version of: http://data.ga-group.nl/ics/bics/1110121111
is version of: http://data.ga-group.nl/ics/bics/11121113
imported on: 2026-06-08T13:03:47.798Z
last refreshed on: 2026-06-08T13:03:47.798Z
source accessed on: 2019-12-03T20:05:01Z
source last accessed on: 2019-12-03T20:05:01Z
label: Armadi e mensole cucina @it
label: Armoires et comptoirs de cuisine @fr
label: Balcão e armário p/ cozinhas @pt
label: Gabinetes y encimeras de cocinas @es
label: Küchenschränke & Arbeitsplatten @de
label: Кухонные шкафы и столешницы @ru
label: 厨柜与台面 @zh
label: 廚櫃及檯面 @zh-hant
label: 부엌 수납장 & 조리대 @ko
label: ｷｯﾁﾝｷｬﾋﾞﾈｯﾄ･ｶｳﾝﾀｰﾄｯﾌﾟ @ja
definition: This industry subgroup includes companies that manufacture wood cabinets and countertops for kitchens and bathrooms.
notation: 11121113
valid from: 2014-08-08
valid till: 2020-10-03

Lawn & Garden Supplies
type: BicsLevel4SubIndustry
type: Classifier
type: Discontinued
type: NamedIndividual
is sub industry of: Home Improvement
is contemporary version of: http://data.ga-group.nl/ics/bics/11121114
is version of: http://data.ga-group.nl/ics/bics/11121114
imported on: 2026-06-08T13:03:47.798Z
last refreshed on: 2026-06-08T13:03:47.798Z
source accessed on: 2019-12-03T20:05:01Z
source last accessed on: 2019-12-03T20:05:01Z
label: Forniture giardinaggio @it
label: Fournitures de pelouses et jardins @fr
label: Proveedores de césped y jardinería @es
label: Rasen- & Gartenzubehör @de
label: Suprimentos para gramado e jardim @pt
label: Материалы и оборуд. для сада @ru
label: 園藝用品 @zh-hant
label: 芝生･園芸用品 @ja
label: 草坪与花园用品 @zh
label: 잔디 & 정원 용품 @ko
definition: This industry subgroup includes companies that manufacture home lawn and garden supplies and hardware. Includes hoses, sprinklers, bird feeders and outdoor décor. Excludes fertilizers and pesticides manufacturers (see Agricultural Chemicals) and lawn equipment (see Home Lawn & Garden Equipment).
notation: 11121114
valid from: 2014-08-08
valid till: 2020-10-03

Iron Metalware
type: BicsLevel5Segment
type: Classifier
type: Discontinued
type: NamedIndividual
is level5 segment of: Plumbing Products
is contemporary version of: http://data.ga-group.nl/ics/bics/1112111510
is version of: http://data.ga-group.nl/ics/bics/1112111510
imported on: 2026-06-08T13:03:47.798Z
last refreshed on: 2026-06-08T13:03:47.798Z
source accessed on: 2019-12-03T20:05:01Z
source last accessed on: 2019-12-03T20:05:01Z
label: Articoli in ferro @it
label: Artigos de metal de ferro @pt
label: Eisenmetallwaren @de
label: Metales de hierro @es
label: Objets en fer @fr
label: Железная и металлическая сантехника @ru
label: 包鐵金屬衛浴 @zh-hant
label: 鉄金属器具 @ja
label: 铁制品 @zh
label: 철강 금속기구 @ko
definition: This segment includes companies that manufacture enameled iron and metal bathroom fixtures, such as bathtubs, metal plumbing fixtures and metal sinks.
notation: 1112111510
valid from: 2014-08-08
valid till: 2020-10-03

Plastic Plumbing Fixtures
type: BicsLevel5Segment
type: Classifier
type: Discontinued
type: NamedIndividual
is level5 segment of: Plumbing Products
is contemporary version of: http://data.ga-group.nl/ics/bics/1112111511
is version of: http://data.ga-group.nl/ics/bics/1112111511
imported on: 2026-06-08T13:03:47.798Z
last refreshed on: 2026-06-08T13:03:47.798Z
source accessed on: 2019-12-03T20:05:01Z
source last accessed on: 2019-12-03T20:05:01Z
label: Acessórios para encanamento de plástico @pt
label: Impianti idraulici in plastica @it
label: Instalac plomería de plástico @es
label: Plastikklempnervorrichtungen @de
label: Robinetterie sanitaire en plastique @fr
label: Пластиковая водопроводная арматура @ru
label: 塑料管道设备 @zh
label: 塑膠給排水配件 @zh-hant
label: 플라스틱 배관 장치 @ko
label: ﾌﾟﾗｽﾁｯｸ配管用品 @ja
definition: This segment includes companies that manufacture plastic plumbing fixtures, such as fiberglass tubs, hot tubs and shower stalls.
notation: 1112111511
valid from: 2014-08-08
valid till: 2020-10-03

Plumb Fixture Fitting & Trim
type: BicsLevel5Segment
type: Classifier
type: Discontinued
type: NamedIndividual
is level5 segment of: Plumbing Products
is contemporary version of: http://data.ga-group.nl/ics/bics/1112111512
is version of: http://data.ga-group.nl/ics/bics/1112111512
imported on: 2026-06-08T13:03:47.798Z
last refreshed on: 2026-06-08T13:03:47.798Z
source accessed on: 2019-12-03T20:05:01Z
source last accessed on: 2019-12-03T20:05:01Z
label: Armaturen & Dekor @de
label: Instalaciones y adornos de plomería @es
label: Pièces et raccord de plomberie @fr
label: Rubinetteria e finiture idrauliche @it
label: Suporte p/instal canalização e acabamento @pt
label: Водопровод. крепежные детали и клапаны @ru
label: 水管修整產品 @zh-hant
label: 管道设备及附件 @zh
label: 配管工事用付属品 @ja
label: 배관 장치 설치 & 정비 @ko
definition: This segment includes companies that manufacture plumbing fixtures, such as faucets, shower heads and flush valves.
notation: 1112111512
valid from: 2014-08-08
valid till: 2020-10-03

Porcelain Plumbing Fixtures
type: BicsLevel5Segment
type: Classifier
type: Discontinued
type: NamedIndividual
is level5 segment of: Plumbing Products
is contemporary version of: http://data.ga-group.nl/ics/bics/1112111513
is version of: http://data.ga-group.nl/ics/bics/1112111513
imported on: 2026-06-08T13:03:47.798Z
last refreshed on: 2026-06-08T13:03:47.798Z
source accessed on: 2019-12-03T20:05:01Z
source last accessed on: 2019-12-03T20:05:01Z
label: Accesorios de plomería de porcelana @es
label: Acessórios pra encanamento porcelana @pt
label: Impianti idraulici in porcellana @it
label: InstallZubehör, Porzellan @de
label: Robinetterie sanitaire en porcelaine @fr
label: Керамическая водопроводная арматура @ru
label: 瓷製給排水裝備 @zh-hant
label: 陶瓷管道设备 @zh
label: 陶磁器･配管用品 @ja
label: 자기 배관설비 @ko
definition: This segment includes companies that manufacture vitreous china plumbing fixtures and bathroom accessories.
notation: 1112111513
valid from: 2014-08-08
valid till: 2020-10-03

Plumbing Products
type: BicsLevel4SubIndustry
type: Classifier
type: NamedIndividual
is sub industry of: Home Improvement
is anachronous version of: http://data.ga-group.nl/ics/bics/1110121112
is contemporary version of: http://data.ga-group.nl/ics/bics/11121115
is replaced by: http://data.ga-group.nl/ics/bics/2020/1110121112
is version of: http://data.ga-group.nl/ics/bics/1110121112
is version of: http://data.ga-group.nl/ics/bics/11121115
imported on: 2026-06-08T13:03:47.798Z
last refreshed on: 2026-06-08T13:03:47.798Z
source accessed on: 2019-12-03T20:05:01Z
source last accessed on: 2019-12-03T20:05:01Z
label: Klempnerprodukte @de
label: Prodotti idraulici @it
label: Productos de plomería @es
label: Produtos para hidráulica @pt
label: Robinetterie sanitaire @fr
label: Сантехнические изделия @ru
label: 水暖产品 @zh
label: 配管產品 @zh-hant
label: 配管製品 @ja
label: 배관용품 @ko
definition: This industry subgroup includes companies that manufacture plumbing fixtures and bathroom accessories, such as sinks, bathtubs, faucets and hot tubs.
notation: 11121115
valid from: 2014-08-08
valid till: 2020-10-03

Residential Remodel
type: BicsLevel4SubIndustry
type: Classifier
type: NamedIndividual
is sub industry of: Home Improvement
is anachronous version of: http://data.ga-group.nl/ics/bics/11111017
is contemporary version of: http://data.ga-group.nl/ics/bics/11121116
is replaced by: http://data.ga-group.nl/ics/bics/2020/11111017
is version of: http://data.ga-group.nl/ics/bics/11111017
is version of: http://data.ga-group.nl/ics/bics/11121116
imported on: 2026-06-08T13:03:47.798Z
last refreshed on: 2026-06-08T13:03:47.798Z
source accessed on: 2019-12-03T20:05:01Z
source last accessed on: 2019-12-03T20:05:01Z
label: Architecte intérieur @fr
label: Reforma residencial @pt
label: Remodeladores resid @es
label: Rimodellamento case @it
label: Wohnungsumbauten @de
label: Реконструкция жилых домов @ru
label: 住宅改建 @zh
label: 住宅ﾘﾓｰﾃﾞﾙ業 @ja
label: 住家裝修 @zh-hant
label: 거주리모델링건물 @ko
definition: This industry subgroup includes companies that build additions or make alterations, renovations or any other home improvements to residential buildings.
notation: 11121116
valid from: 2014-08-08
valid till: 2020-10-03

Hand Tools
type: BicsLevel5Segment
type: Classifier
type: NamedIndividual
is level5 segment of: Tools
is anachronous version of: http://data.ga-group.nl/ics/bics/171013151710
is contemporary version of: http://data.ga-group.nl/ics/bics/1112111710
is replaced by: http://data.ga-group.nl/ics/bics/2020/171013151710
is version of: http://data.ga-group.nl/ics/bics/1112111710
is version of: http://data.ga-group.nl/ics/bics/171013151710
imported on: 2026-06-08T13:03:47.798Z
last refreshed on: 2026-06-08T13:03:47.798Z
source accessed on: 2019-12-03T20:05:01Z
source last accessed on: 2019-12-03T20:05:01Z
label: Attrezzi @it
label: Ferramentas portáteis @pt
label: Handwerkzeuge @de
label: Herramientas manuales @es
label: Outils à main @fr
label: Ручные инструменты @ru
label: 手动工具 @zh
label: 手動工具 @ja
label: 手工工具 @zh-hant
label: 핸드공구 @ko
definition: This segment includes companies that manufacture nonpowered hand and edge tools. Products include hammers, screwdrivers, axes, garden tools, pliers and ratchets.
notation: 1112111710
valid from: 2014-08-08
valid till: 2020-10-03

Power Tools
type: BicsLevel5Segment
type: Classifier
type: NamedIndividual
is level5 segment of: Tools
is anachronous version of: http://data.ga-group.nl/ics/bics/171013151711
is contemporary version of: http://data.ga-group.nl/ics/bics/1112111711
is replaced by: http://data.ga-group.nl/ics/bics/2020/171013151711
is version of: http://data.ga-group.nl/ics/bics/1112111711
is version of: http://data.ga-group.nl/ics/bics/171013151711
imported on: 2026-06-08T13:03:47.798Z
last refreshed on: 2026-06-08T13:03:47.798Z
source accessed on: 2019-12-03T20:05:01Z
source last accessed on: 2019-12-03T20:05:01Z
label: Elektrowerkzeuge @de
label: Ferramentas elétricas @pt
label: Herramientas eléctricas @es
label: Outils électriques @fr
label: Utens elettr @it
label: Инструменты с электрическим приводом @ru
label: 動力工具 @zh-hant
label: 电动工具 @zh
label: 電動工具 @ja
label: 전력공구 @ko
definition: This segment includes companies that manufacture power-driven hand tools. Such tools include circular saws, chain saws, nail guns, planers, paint spray guns, riveting guns, routers, drills and sanders.
notation: 1112111711
valid from: 2014-08-08
valid till: 2020-10-03

Tool Accessories
type: BicsLevel5Segment
type: Classifier
type: NamedIndividual
is level5 segment of: Tools
is anachronous version of: http://data.ga-group.nl/ics/bics/171013151712
is contemporary version of: http://data.ga-group.nl/ics/bics/1112111712
is replaced by: http://data.ga-group.nl/ics/bics/2020/171013151712
is version of: http://data.ga-group.nl/ics/bics/1112111712
is version of: http://data.ga-group.nl/ics/bics/171013151712
imported on: 2026-06-08T13:03:47.798Z
last refreshed on: 2026-06-08T13:03:47.798Z
source accessed on: 2019-12-03T20:05:01Z
source last accessed on: 2019-12-03T20:05:01Z
label: Accesorios de herramientas @es
label: Accessoires pour outils @fr
label: Acessórios para ferramentas @pt
label: Utensili @it
label: Werkzeugzubehör @de
label: Аксессуары для инструментов @ru
label: 工具配件 @zh
label: 工具ｱｸｾｻﾘｰ @ja
label: 부속공�� @ko
definition: This segment includes companies that manufacture nonpowered handsaws and saw blades. Products include saws for stone and wood cutting.
notation: 1112111712
valid from: 2014-08-08
valid till: 2020-10-03

Tools
type: BicsLevel4SubIndustry
type: Classifier
type: NamedIndividual
is sub industry of: Home Improvement
is anachronous version of: http://data.ga-group.nl/ics/bics/1710131517
is contemporary version of: http://data.ga-group.nl/ics/bics/11121117
is replaced by: http://data.ga-group.nl/ics/bics/2020/1710131517
is version of: http://data.ga-group.nl/ics/bics/11121117
is version of: http://data.ga-group.nl/ics/bics/1710131517
imported on: 2026-06-08T13:03:47.798Z
last refreshed on: 2026-06-08T13:03:47.798Z
source accessed on: 2019-12-03T20:05:01Z
source last accessed on: 2019-12-03T20:05:01Z
label: Attrezzi @it
label: Ferramentas @pt
label: Herramientas @es
label: Outils @fr
label: Werkzeuge @de
label: Инструментарий @ru
label: 工具 @ja
label: 공구 @ko
definition: This industry subgroup includes companies that manufacture hand tools. Products include powered and nonpowered hand tools and saws, as well as saw blades.
notation: 11121117
valid from: 2014-08-08
valid till: 2020-10-03

Metal Windows & Doors
type: BicsLevel5Segment
type: Classifier
type: NamedIndividual
is level5 segment of: Windows & Doors - Bldg Prods
is anachronous version of: http://data.ga-group.nl/ics/bics/111012111310
is contemporary version of: http://data.ga-group.nl/ics/bics/1112111810
is replaced by: http://data.ga-group.nl/ics/bics/2020/111012111310
is version of: http://data.ga-group.nl/ics/bics/111012111310
is version of: http://data.ga-group.nl/ics/bics/1112111810
imported on: 2026-06-08T13:03:47.798Z
last refreshed on: 2026-06-08T13:03:47.798Z
source accessed on: 2019-12-03T20:05:01Z
source last accessed on: 2019-12-03T20:05:01Z
label: Finestre e porte metalliche @it
label: Janelas e porta de metal @pt
label: Metallfenster & -türen @de
label: Portes et fenêtres en métal @fr
label: Ventanas y puertas metálicas @es
label: Металличе��кие окна и двери @ru
label: 金属窓･ﾄﾞｱ製造業 @ja
label: 金属门窗 @zh
label: 金屬門窗 @zh-hant
label: 철제 창호 @ko
definition: This segment includes companies that manufacture metal windows and doors, sashes, windows and door frames.
notation: 1112111810
valid from: 2014-08-08
valid till: 2020-10-03

Vinyl Wind Doors
type: BicsLevel5Segment
type: Classifier
type: Discontinued
type: NamedIndividual
is level5 segment of: Windows & Doors - Bldg Prods
is contemporary version of: http://data.ga-group.nl/ics/bics/1112111811
is version of: http://data.ga-group.nl/ics/bics/1112111811
imported on: 2026-06-08T13:03:47.798Z
last refreshed on: 2026-06-08T13:03:47.798Z
source accessed on: 2019-12-03T20:05:01Z
source last accessed on: 2019-12-03T20:05:01Z
label: Portas contra vento de vinil @pt
label: Porte finestre in vinile @it
label: Portes et fenêtres en vinyle @fr
label: Puertas eólicas de acetato @es
label: Vinylfenster, -türen @de
label: Винилов. двери @ru
label: 塑胶门窗 @zh
label: 塑膠門窗 @zh-hant
label: 비닐 창호 @ko
label: ﾋﾞﾆｰﾙ製窓･ﾄﾞｱ製造 @ja
definition: This segment includes companies that manufacture vinyl windows and doors, sashes, windows and door frames.
notation: 1112111811
valid from: 2014-08-08
valid till: 2020-10-03

Wood Window Doors
type: BicsLevel5Segment
type: Classifier
type: NamedIndividual
is level5 segment of: Windows & Doors - Bldg Prods
is anachronous version of: http://data.ga-group.nl/ics/bics/111012111311
is contemporary version of: http://data.ga-group.nl/ics/bics/1112111812
is replaced by: http://data.ga-group.nl/ics/bics/2020/111012111311
is version of: http://data.ga-group.nl/ics/bics/111012111311
is version of: http://data.ga-group.nl/ics/bics/1112111812
imported on: 2026-06-08T13:03:47.798Z
last refreshed on: 2026-06-08T13:03:47.798Z
source accessed on: 2019-12-03T20:05:01Z
source last accessed on: 2019-12-03T20:05:01Z
label: Holzfenster, -türen @de
label: Portas tipo janela de madeira @pt
label: Porte finestra in legno @it
label: Portes et fenêtres en bois @fr
label: Ventanas/puertas de madera @es
label: Деревянные остекленные двери @ru
label: 木製窓･ﾄﾞｱ製造業 @ja
label: 木製門窗 @zh-hant
label: 木门窗 @zh
label: 목재 창호 @ko
definition: This segment includes companies that manufacture wood windows and doors, sashes, windows and door frames.
notation: 1112111812
valid from: 2014-08-08
valid till: 2020-10-03

Windows & Doors - Bldg Prods
type: BicsLevel4SubIndustry
type: Classifier
type: NamedIndividual
is sub industry of: Home Improvement
is anachronous version of: http://data.ga-group.nl/ics/bics/1110121113
is contemporary version of: http://data.ga-group.nl/ics/bics/11121118
is replaced by: http://data.ga-group.nl/ics/bics/2020/1110121113
is version of: http://data.ga-group.nl/ics/bics/1110121113
is version of: http://data.ga-group.nl/ics/bics/11121118
imported on: 2026-06-08T13:03:47.798Z
last refreshed on: 2026-06-08T13:03:47.798Z
source accessed on: 2019-12-03T20:05:01Z
source last accessed on: 2019-12-03T20:05:01Z
label: Fenstern & Türen - Bauprodukte @de
label: Finestre e porte - Prod edili @it
label: Janelas e portas - Prod const @pt
label: Portes et fenêtres - Prod de constr @fr
label: Ventanas y puertas - prod edif @es
label: Окна и двери - стройматер. @ru
label: 窓･ﾄﾞｱ製造業-建築製品 @ja
label: 窗及門-建築製品 @zh-hant
label: 门窗-建筑产品 @zh
label: 창호 - 건축자재 @ko
definition: This industry subgroup includes companies that manufacture wood, metal and vinyl windows and doors, sashes, windows and door frames.
notation: 11121118
valid from: 2014-08-08
valid till: 2020-10-03

Home Improvement
type: BicsLevel3Industry
type: Classifier
type: NamedIndividual
is industry of: Home & Office Products
is anachronous version of: http://data.ga-group.nl/ics/bics/11101211
is contemporary version of: http://data.ga-group.nl/ics/bics/111211
is replaced by: http://data.ga-group.nl/ics/bics/2020/11101211
is version of: http://data.ga-group.nl/ics/bics/11101211
is version of: http://data.ga-group.nl/ics/bics/111211
imported on: 2026-06-08T13:03:47.798Z
last refreshed on: 2026-06-08T13:03:47.798Z
source accessed on: 2019-12-03T20:05:01Z
source last accessed on: 2019-12-03T20:05:01Z
label: Fai da te @it
label: Heimwerkerei @de
label: Mejoras al hogar @es
label: Melhoria da casa @pt
label: Travaux chez soi @fr
label: Благоустр. жилья @ru
label: 住宅関連用品 @ja
label: 家居装潢 @zh
label: 居家修繕 @zh-hant
label: 주택개량 @ko
definition: This industry includes companies that manufacture building products, appliances, tools, and lawn and garden supplies. Typically, these products are for decorative purposes and are affixed within the home. Excludes products utilized for structural integrity.
notation: 111211
valid from: 2014-08-08
valid till: 2020-10-03

Blinds & Shades
type: BicsLevel5Segment
type: Classifier
type: Discontinued
type: NamedIndividual
is level5 segment of: Home Furniture
is contemporary version of: http://data.ga-group.nl/ics/bics/1112121010
is version of: http://data.ga-group.nl/ics/bics/1112121010
imported on: 2026-06-08T13:03:47.798Z
last refreshed on: 2026-06-08T13:03:47.798Z
source accessed on: 2019-12-03T20:05:01Z
source last accessed on: 2019-12-03T20:05:01Z
label: Jalousien @de
label: Persianas e venezianas @pt
label: Persianas @es
label: Stores et volets @fr
label: Tendine e persiane @it
label: Жалюзи и шторы @ru
label: 百叶窗与遮光帘 @zh
label: 百葉簾及遮陽簾 @zh-hant
label: 블라인드 & 차양 @ko
label: ﾌﾞﾗｲﾝﾄﾞ･ｼｪｰﾄﾞ製造 @ja
definition: This segment includes companies that manufacture blinds, curtains, shades and related fixtures.
notation: 1112121010
valid from: 2014-08-08
valid till: 2020-10-03

Hhld Furniture ex Wood & Metal
type: BicsLevel6Segment
type: Classifier
type: Discontinued
type: NamedIndividual
is level6 segment of: Household Furniture
is contemporary version of: http://data.ga-group.nl/ics/bics/111212101110
is version of: http://data.ga-group.nl/ics/bics/111212101110
imported on: 2026-06-08T13:03:47.798Z
last refreshed on: 2026-06-08T13:03:47.798Z
source accessed on: 2019-12-03T20:05:01Z
source last accessed on: 2019-12-03T20:05:01Z
label: Hauhaltsmöbel exkl. Holz & Metall @de
label: Móveis dom exc madeira e metal @pt
label: Mobili casa escl legno e metallo @it
label: Mobilier de maison h bois/métal @fr
label: Muebles dom no madera y metal @es
label: Дом. мебель (искл. дерев. и метал.) @ru
label: 家具(除木制与金属) @zh
label: 家庭用家具製造業(除木･金属製) @ja
label: 非木製非金屬製家用家具 @zh-hant
label: 가정용가구(목재&금속 제외) @ko
definition: This segment includes companies that manufacture household furniture made from plastic, wicker, fiberglass, rattan, composite materials and reeds.
notation: 111212101110
valid from: 2014-08-08
valid till: 2020-10-03

Metal Household Furniture
type: BicsLevel6Segment
type: Classifier
type: NamedIndividual
is level6 segment of: Household Furniture
is anachronous version of: http://data.ga-group.nl/ics/bics/111013111010
is contemporary version of: http://data.ga-group.nl/ics/bics/111212101111
is replaced by: http://data.ga-group.nl/ics/bics/2020/111013111010
is version of: http://data.ga-group.nl/ics/bics/111013111010
is version of: http://data.ga-group.nl/ics/bics/111212101111
imported on: 2026-06-08T13:03:47.798Z
last refreshed on: 2026-06-08T13:03:47.798Z
source accessed on: 2019-12-03T20:05:01Z
source last accessed on: 2019-12-03T20:05:01Z
label: Haushaltsmöbel aus Metall @de
label: Móveis domésticos de metal @pt
label: Mobili di metallo per la casa @it
label: Mobilier de maison en métal @fr
label: Muebles domésticos de metal @es
label: Металлическая домашняя мебель @ru
label: 金属家用家具 @zh
label: 金属製家具製造業(家庭用) @ja
label: 金屬家用家具 @zh-hant
label: 금속 가정용 가구 @ko
definition: This segment includes companies that manufacture metal household furniture and stand-alone cabinets.
notation: 111212101111
valid from: 2014-08-08
valid till: 2020-10-03

Nonupholstered Wood Furniture
type: BicsLevel7Segment
type: Classifier
type: NamedIndividual
is level7 segment of: Wood Household Furniture
is anachronous version of: http://data.ga-group.nl/ics/bics/11101311101111
is contemporary version of: http://data.ga-group.nl/ics/bics/11121210111210
is replaced by: http://data.ga-group.nl/ics/bics/2020/11101311101111
is version of: http://data.ga-group.nl/ics/bics/11101311101111
is version of: http://data.ga-group.nl/ics/bics/11121210111210
imported on: 2026-06-08T13:03:47.798Z
last refreshed on: 2026-06-08T13:03:47.798Z
source accessed on: 2019-12-03T20:05:01Z
source last accessed on: 2019-12-03T20:05:01Z
label: Móveis de madeira não estofados @pt
label: Mobilier en bois non rembourré @fr
label: Muebles de madera no tapizados @es
label: Nicht gepolsterte Holzmöbel @de
label: Produzione mobili di legno non rivestiti @it
label: Произв. дерев. мебели без обивки @ru
label: 家庭用室内木製家具製造業 @ja
label: 无软垫木制家具 @zh
label: 無布面木製家具 @zh-hant
label: 비내장 목재 가구 @ko
definition: This segment includes companies that manufacture non-upholstered wood household furniture. Products include stand-alone cabinets.
notation: 11121210111210
valid from: 2014-08-08
valid till: 2020-10-03

Upholstered Wood Furniture
type: BicsLevel7Segment
type: Classifier
type: NamedIndividual
is level7 segment of: Wood Household Furniture
is anachronous version of: http://data.ga-group.nl/ics/bics/11101311101110
is contemporary version of: http://data.ga-group.nl/ics/bics/11121210111211
is replaced by: http://data.ga-group.nl/ics/bics/2020/11101311101110
is version of: http://data.ga-group.nl/ics/bics/11101311101110
is version of: http://data.ga-group.nl/ics/bics/11121210111211
imported on: 2026-06-08T13:03:47.798Z
last refreshed on: 2026-06-08T13:03:47.798Z
source accessed on: 2019-12-03T20:05:01Z
source last accessed on: 2019-12-03T20:05:01Z
label: Gepolsterte Holzmöbel @de
label: Móveis domésticos estofados @pt
label: Mobili legno non rivestiti @it
label: Mobilier en bois rembourré @fr
label: Muebles de madera tapizados @es
label: Произв. дерев. мебели с обивкой @ru
label: 家庭用室内装飾家具製造業 @ja
label: 布面木製家具 @zh-hant
label: 带软垫木制家具 @zh
label: 내장 목재 ��구 @ko
definition: This segment includes companies that manufacture upholstered household furniture and stand-alone cabinets.
notation: 11121210111211
valid from: 2014-08-08
valid till: 2020-10-03

Wood Household Furniture
type: BicsLevel6Segment
type: Classifier
type: NamedIndividual
is level6 segment of: Household Furniture
is anachronous version of: http://data.ga-group.nl/ics/bics/111013111011
is contemporary version of: http://data.ga-group.nl/ics/bics/111212101112
is replaced by: http://data.ga-group.nl/ics/bics/2020/111013111011
is version of: http://data.ga-group.nl/ics/bics/111013111011
is version of: http://data.ga-group.nl/ics/bics/111212101112
imported on: 2026-06-08T13:03:47.798Z
last refreshed on: 2026-06-08T13:03:47.798Z
source accessed on: 2019-12-03T20:05:01Z
source last accessed on: 2019-12-03T20:05:01Z
label: Holzmöbel @de
label: Móveis domésticos de madeira @pt
label: Mobili in legno per la casa @it
label: Mobilier de maison en bois @fr
label: Muebles domésticos de madera @es
label: Деревянная домашняя мебель @ru
label: 木制家用家�� @zh
label: 木製家具 @ja
label: 木製家用家具 @zh-hant
label: 목재 가정용 가구 @ko
definition: This segment includes companies that manufacture upholstered, non-upholstered, and stand-alone wood cabinets for the home.
notation: 111212101112
valid from: 2014-08-08
valid till: 2020-10-03

Household Furniture
type: BicsLevel5Segment
type: Classifier
type: NamedIndividual
is level5 segment of: Home Furniture
is anachronous version of: http://data.ga-group.nl/ics/bics/1110131110
is contemporary version of: http://data.ga-group.nl/ics/bics/1112121011
is replaced by: http://data.ga-group.nl/ics/bics/2020/1110131110
is version of: http://data.ga-group.nl/ics/bics/1110131110
is version of: http://data.ga-group.nl/ics/bics/1112121011
imported on: 2026-06-08T13:03:47.798Z
last refreshed on: 2026-06-08T13:03:47.798Z
source accessed on: 2019-12-03T20:05:01Z
source last accessed on: 2019-12-03T20:05:01Z
label: Haushaltsmöbel @de
label: Móveis domésticos @pt
label: Mobili per la casa @it
label: Mobilier de maison @fr
label: Muebles domésticos @es
label: Домашняя мебель @ru
label: 家庭用家具製造 @ja
label: 家用家具制造 @zh
label: 家用家具製造 @zh-hant
label: 가정용가구제조업 @ko
definition: This segment includes companies that manufacture wood, metal and composite household furniture.
notation: 1112121011
valid from: 2014-08-08
valid till: 2020-10-03

Mattress
type: BicsLevel5Segment
type: Classifier
type: NamedIndividual
is level5 segment of: Home Furniture
is anachronous version of: http://data.ga-group.nl/ics/bics/1110131112
is contemporary version of: http://data.ga-group.nl/ics/bics/1112121012
is replaced by: http://data.ga-group.nl/ics/bics/2020/1110131112
is version of: http://data.ga-group.nl/ics/bics/1110131112
is version of: http://data.ga-group.nl/ics/bics/1112121012
imported on: 2026-06-08T13:03:47.798Z
last refreshed on: 2026-06-08T13:03:47.798Z
source accessed on: 2019-12-03T20:05:01Z
source last accessed on: 2019-12-03T20:05:01Z
label: Colchão @pt
label: Colchones @es
label: Matelas @fr
label: Materassi @it
label: Matratzen @de
label: Матрасы @ru
label: 床垫 @zh
label: 床墊 @zh-hant
label: 매트리스 @ko
label: ﾏｯﾄﾚｽ製造 @ja
definition: This segment includes companies that manufacture foam rubber, memory material, innerspring, and non-innerspring mattresses, box springs and waterbeds.
notation: 1112121012
valid from: 2014-08-08
valid till: 2020-10-03

Home Furniture
type: BicsLevel4SubIndustry
type: Classifier
type: NamedIndividual
is sub industry of: Home & Office Furnishings
is anachronous version of: http://data.ga-group.nl/ics/bics/11101311
is contemporary version of: http://data.ga-group.nl/ics/bics/11121210
is replaced by: http://data.ga-group.nl/ics/bics/2020/11101311
is version of: http://data.ga-group.nl/ics/bics/11101311
is version of: http://data.ga-group.nl/ics/bics/11121210
imported on: 2026-06-08T13:03:47.798Z
last refreshed on: 2026-06-08T13:03:47.798Z
source accessed on: 2019-12-03T20:05:01Z
source last accessed on: 2019-12-03T20:05:01Z
label: Haushaltsmöbel @de
label: Móveis para casa @pt
label: Mobili per la casa @it
label: Mobilier de maison @fr
label: Muebles para el hogar @es
label: Мебель для дома @ru
label: 家具 @zh
label: 家庭用家具製造 @ja
label: 家用家具 @zh-hant
label: 가정용 가구 @ko
definition: This industry subgroup includes companies that manufacture household furniture, office furniture, institutional furniture, mattresses, shades and blinds.
notation: 11121210
valid from: 2014-08-08
valid till: 2020-10-03

Crystal & Giftware
type: BicsLevel5Segment
type: Classifier
type: Discontinued
type: NamedIndividual
is level5 segment of: Housewares
is contemporary version of: http://data.ga-group.nl/ics/bics/1112121110
is version of: http://data.ga-group.nl/ics/bics/1112121110
imported on: 2026-06-08T13:03:47.798Z
last refreshed on: 2026-06-08T13:03:47.798Z
source accessed on: 2019-12-03T20:05:01Z
source last accessed on: 2019-12-03T20:05:01Z
label: Cristais e presentes @pt
label: Cristal et cadeaux @fr
label: Cristalería y regalos @es
label: Cristallo/regali @it
label: Kristall & Geschenkartikel @de
label: Хрусталь и подарки @ru
label: 水晶及礼品 @zh
label: 水晶及禮品 @zh-hant
label: 크리스털 & 선물용품 @ko
label: ｸﾘｽﾀﾙ･贈答品 @ja
definition: This segment includes companies that manufacture crystal and giftware.
notation: 1112121110
valid from: 2014-08-08
valid till: 2020-10-03

Cutlery & Flatware
type: BicsLevel5Segment
type: Classifier
type: NamedIndividual
is level5 segment of: Housewares
is anachronous version of: http://data.ga-group.nl/ics/bics/1110131210
is contemporary version of: http://data.ga-group.nl/ics/bics/1112121111
is replaced by: http://data.ga-group.nl/ics/bics/2020/1110131210
is version of: http://data.ga-group.nl/ics/bics/1110131210
is version of: http://data.ga-group.nl/ics/bics/1112121111
imported on: 2026-06-08T13:03:47.798Z
last refreshed on: 2026-06-08T13:03:47.798Z
source accessed on: 2019-12-03T20:05:01Z
source last accessed on: 2019-12-03T20:05:01Z
label: Besteck & Geschirr @de
label: Coutellerie et couverts @fr
label: Fabricación de cubiertos @es
label: Posate e piatti @it
label: Pratos e talheres @pt
label: Ножевые изделия и столовые приборы @ru
label: 刀具与餐具 @zh
label: 刀具及扁平餐具 @zh-hant
label: 刃物･食卓刃物(除貴金属) @ja
label: 수저 & 접시류 @ko
definition: This segment includes companies that manufacture plated metal cutlery and flatware. Includes forks, knives and spoons.
notation: 1112121111
valid from: 2014-08-08
valid till: 2020-10-03

Floriculture Products
type: BicsLevel5Segment
type: Classifier
type: Discontinued
type: NamedIndividual
is level5 segment of: Housewares
is contemporary version of: http://data.ga-group.nl/ics/bics/1112121112
is version of: http://data.ga-group.nl/ics/bics/1112121112
imported on: 2026-06-08T13:03:47.798Z
last refreshed on: 2026-06-08T13:03:47.798Z
source accessed on: 2019-12-03T20:05:01Z
source last accessed on: 2019-12-03T20:05:01Z
label: Articles de floriculture @fr
label: Blumenzucht @de
label: Floricoltura @it
label: Floricultura @es
label: Prod de floricultura @pt
label: Цветоводство @ru
label: 花き栽培 @ja
label: 花卉生产 @zh
label: 花卉生產 @zh-hant
label: 화훼 제품 @ko
definition: This segment includes companies that produce cut flowers.
notation: 1112121112
valid from: 2014-08-08
valid till: 2020-10-03

Garden Products
type: BicsLevel5Segment
type: Classifier
type: Discontinued
type: NamedIndividual
is level5 segment of: Housewares
is contemporary version of: http://data.ga-group.nl/ics/bics/1112121113
is version of: http://data.ga-group.nl/ics/bics/1112121113
imported on: 2026-06-08T13:03:47.798Z
last refreshed on: 2026-06-08T13:03:47.798Z
source accessed on: 2019-12-03T20:05:01Z
source last accessed on: 2019-12-03T20:05:01Z
label: Articles de jardinage @fr
label: Gartenprodukte @de
label: Prod per giardino @it
label: Productos de jardinería @es
label: Produtos de jardinagem @pt
label: Товары для сада @ru
label: 园艺产品 @zh
label: 園芸用品 @ja
label: 園藝產品 @zh-hant
label: 원예 제품 @ko
definition: This segment includes companies that manufacture garden products, such as pots, planters and hoses.
notation: 1112121113
valid from: 2014-08-08
valid till: 2020-10-03

Greet Cards & Gift Wrap
type: BicsLevel5Segment
type: Classifier
type: Discontinued
type: NamedIndividual
is level5 segment of: Housewares
is contemporary version of: http://data.ga-group.nl/ics/bics/1112121114
is version of: http://data.ga-group.nl/ics/bics/1112121114
imported on: 2026-06-08T13:03:47.798Z
last refreshed on: 2026-06-08T13:03:47.798Z
source accessed on: 2019-12-03T20:05:01Z
source last accessed on: 2019-12-03T20:05:01Z
label: Biglietti d'augurio e carta regalo @it
label: Cartões de felicitações e papel de presente @pt
label: Cartes de voeux et papier cadeau @fr
label: Grußkarten & Geschenkpapier @de
label: Tarjetas felicitaciones y env regalos @es
label: Поздрав. открытки и подарочн. упаковка @ru
label: 挨拶状･贈答品包装用品製造 @ja
label: 賀卡及禮品包裝 @zh-hant
label: 贺卡与礼品包装 @zh
label: 인사 카드 & 선물포장지 @ko
definition: This segment includes companies that manufacture greeting cards and gift wrap. Products include ribbons and gift bags.
notation: 1112121114
valid from: 2014-08-08
valid till: 2020-10-03

Home Decoration Products
type: BicsLevel5Segment
type: Classifier
type: NamedIndividual
is level5 segment of: Housewares
is anachronous version of: http://data.ga-group.nl/ics/bics/1110131211
is contemporary version of: http://data.ga-group.nl/ics/bics/1112121115
is replaced by: http://data.ga-group.nl/ics/bics/2020/1110131211
is version of: http://data.ga-group.nl/ics/bics/1110131211
is version of: http://data.ga-group.nl/ics/bics/1112121115
imported on: 2026-06-08T13:03:47.798Z
last refreshed on: 2026-06-08T13:03:47.798Z
source accessed on: 2019-12-03T20:05:01Z
source last accessed on: 2019-12-03T20:05:01Z
label: Articles de décoration de maison @fr
label: Dekorationsartikel @de
label: Prod decorativi casa @it
label: Productos de decoración del hogar @es
label: Produtos de decoração de casa @pt
label: Предметы интерьера @ru
label: 家居装饰产品 @zh
label: 家庭装飾品 @ja
label: 家庭裝飾品 @zh-hant
label: 가정용 장식품 @ko
definition: This segment includes companies that manufacture home decoration products.
notation: 1112121115
valid from: 2014-08-08
valid till: 2020-10-03

Kitchen Utensils
type: BicsLevel5Segment
type: Classifier
type: Discontinued
type: NamedIndividual
is level5 segment of: Housewares
is contemporary version of: http://data.ga-group.nl/ics/bics/1112121116
is version of: http://data.ga-group.nl/ics/bics/1112121116
imported on: 2026-06-08T13:03:47.798Z
last refreshed on: 2026-06-08T13:03:47.798Z
source accessed on: 2019-12-03T20:05:01Z
source last accessed on: 2019-12-03T20:05:01Z
label: Küchenutensilien @de
label: Ustensiles de cuisine @fr
label: Utensílios de cozinha @pt
label: Utensili da cucina @it
label: Utensilios de cocina @es
label: Кухонные принадлежности @ru
label: 厨房用具 @zh
label: 台所用品 @ja
label: 廚用器具 @zh-hant
label: 주방용품 @ko
definition: This segment includes companies that manufacture kitchen utensils, pots, pans and household food storage containers.
notation: 1112121116
valid from: 2014-08-08
valid till: 2020-10-03

Housewares
type: BicsLevel4SubIndustry
type: Classifier
type: NamedIndividual
is sub industry of: Home & Office Furnishings
is anachronous version of: http://data.ga-group.nl/ics/bics/11101312
is contemporary version of: http://data.ga-group.nl/ics/bics/11121211
is replaced by: http://data.ga-group.nl/ics/bics/2020/11101312
is version of: http://data.ga-group.nl/ics/bics/11101312
is version of: http://data.ga-group.nl/ics/bics/11121211
imported on: 2026-06-08T13:03:47.798Z
last refreshed on: 2026-06-08T13:03:47.798Z
source accessed on: 2019-12-03T20:05:01Z
source last accessed on: 2019-12-03T20:05:01Z
label: Artículos del hogar @es
label: Articles ménagers @fr
label: Casalinghi @it
label: Eletrodomésticos @pt
label: Haushaltswaren @de
label: Домаш. утварь @ru
label: 家庭廚具 @zh-hant
label: 家用器皿 @zh
label: 生活用品 @ja
label: 가정용품업 @ko
definition: This industry subgroup includes companies that manufacture kitchen utensils, pots, pans, cutlery and flatware.
notation: 11121211
valid from: 2014-08-08
valid till: 2020-10-03

Office Furniture
type: BicsLevel4SubIndustry
type: Classifier
type: NamedIndividual
is sub industry of: Home & Office Furnishings
is anachronous version of: http://data.ga-group.nl/ics/bics/1110131111
is contemporary version of: http://data.ga-group.nl/ics/bics/11121212
is replaced by: http://data.ga-group.nl/ics/bics/2020/1110131111
is version of: http://data.ga-group.nl/ics/bics/1110131111
is version of: http://data.ga-group.nl/ics/bics/11121212
imported on: 2026-06-08T13:03:47.798Z
last refreshed on: 2026-06-08T13:03:47.798Z
source accessed on: 2019-12-03T20:05:01Z
source last accessed on: 2019-12-03T20:05:01Z
label: Büromöbel @de
label: Móveis para escritórios @pt
label: Mobili per ufficio @it
label: Mobilier de bureau @fr
label: Muebles de oficina @es
label: Офисная мебель @ru
label: 办公家具 @zh
label: 辦公家具 @zh-hant
label: 사무용 가구 @ko
label: ｵﾌｨｽ家具製造 @ja
definition: This industry subgroup includes companies that manufacture nonresidential furniture. Products include office-type cabinets, chairs, desks, tables, showcases, partitions and shelving units.
notation: 11121212
valid from: 2014-08-08
valid till: 2020-10-03

Home & Office Furnishings
type: BicsLevel3Industry
type: Classifier
type: Discontinued
type: NamedIndividual
is industry of: Home & Office Products
is contemporary version of: http://data.ga-group.nl/ics/bics/111212
is version of: http://data.ga-group.nl/ics/bics/111212
imported on: 2026-06-08T13:03:47.798Z
last refreshed on: 2026-06-08T13:03:47.798Z
source accessed on: 2019-12-03T20:05:01Z
source last accessed on: 2019-12-03T20:05:01Z
label: Arredi casa e ufficio @it
label: Mobílias domést e escritório @pt
label: Mobilier de maison et de bureau @fr
label: Muebles dom/oficina @es
label: Wohn- & Büroeinrichtung @de
label: Предм. обстановки (дом/офис) @ru
label: 住家及辦公室裝潢 @zh-hant
label: 家具･事務機器 @ja
label: 家居及办公室用品 @zh
label: 가정용 & 사무용 가구 @ko
definition: This industry includes companies that manufacture household furniture, office furniture and housewares.
notation: 111212
valid from: 2014-08-08
valid till: 2020-10-03

Carbon Paper & Inked Ribbons
type: BicsLevel4SubIndustry
type: Classifier
type: Discontinued
type: NamedIndividual
is sub industry of: Office Supplies
is contemporary version of: http://data.ga-group.nl/ics/bics/11121310
is version of: http://data.ga-group.nl/ics/bics/11121310
imported on: 2026-06-08T13:03:47.798Z
last refreshed on: 2026-06-08T13:03:47.798Z
source accessed on: 2019-12-03T20:05:01Z
source last accessed on: 2019-12-03T20:05:01Z
label: Carta carbone e nastri a inchiostro @it
label: Kohlepapier & Farbbänder @de
label: Papel carbón y repuesto tinta @es
label: Papel de carbono e fita de tinta @pt
label: Papier carbone et rubans encrés @fr
label: Копировальная бумага и красящие ленты @ru
label: 复写纸与色带 @zh
label: 碳紙及色帶 @zh-hant
label: 복사지 & 잉크 리본 @ko
label: ｶｰﾎﾞﾝ用紙･ｲﾝｸﾘﾎﾞﾝ製造業 @ja
definition: This industry subgroup includes companies that manufacture carbon paper and inked ribbons. Products include typewriter ribbons and stencil paper.
notation: 11121310
valid from: 2014-08-08
valid till: 2020-10-03

Die-Cut Paper & Paperboard
type: BicsLevel4SubIndustry
type: Classifier
type: Discontinued
type: NamedIndividual
is sub industry of: Office Supplies
is contemporary version of: http://data.ga-group.nl/ics/bics/11121311
is version of: http://data.ga-group.nl/ics/bics/11121311
imported on: 2026-06-08T13:03:47.798Z
last refreshed on: 2026-06-08T13:03:47.798Z
source accessed on: 2019-12-03T20:05:01Z
source last accessed on: 2019-12-03T20:05:01Z
label: Carta e cartone fustellati @it
label: Gestanztes Papier & Pappe @de
label: Papel cortado e papelão @pt
label: Papel y cartón para oficina @es
label: Papier ou carton coupé à l'emporte-pièce @fr
label: Штампованная бумага и картон @ru
label: 打抜き紙･打抜き板紙 @ja
label: 模切纸与纸板 @zh
label: 裁切紙及紙板 @zh-hant
label: 다이컷 제지 & 판지 @ko
definition: This industry subgroup includes companies that manufacture die-cut paper, manila folders, pocket folders and report covers.
notation: 11121311
valid from: 2014-08-08
valid till: 2020-10-03

Envelopes
type: BicsLevel4SubIndustry
type: Classifier
type: Discontinued
type: NamedIndividual
is sub industry of: Office Supplies
is contemporary version of: http://data.ga-group.nl/ics/bics/11121312
is version of: http://data.ga-group.nl/ics/bics/11121312
imported on: 2026-06-08T13:03:47.798Z
last refreshed on: 2026-06-08T13:03:47.798Z
source accessed on: 2019-12-03T20:05:01Z
source last accessed on: 2019-12-03T20:05:01Z
label: Briefumschläge @de
label: Buste @it
label: Enveloppes @fr
label: Sobres @es
label: Конверты @ru
label: 信封 @zh
label: 封筒製造業 @ja
label: 봉투 @ko
definition: This industry subgroup includes companies that manufacture envelope products, such as envelopes, padded envelopes and seed packets.
notation: 11121312
valid from: 2014-08-08
valid till: 2020-10-03

Stationery & Note Books
type: BicsLevel4SubIndustry
type: Classifier
type: NamedIndividual
is sub industry of: Office Supplies
is anachronous version of: http://data.ga-group.nl/ics/bics/1110131310
is contemporary version of: http://data.ga-group.nl/ics/bics/11121313
is replaced by: http://data.ga-group.nl/ics/bics/2020/1110131310
is version of: http://data.ga-group.nl/ics/bics/1110131310
is version of: http://data.ga-group.nl/ics/bics/11121313
imported on: 2026-06-08T13:03:47.798Z
last refreshed on: 2026-06-08T13:03:47.798Z
source accessed on: 2019-12-03T20:05:01Z
source last accessed on: 2019-12-03T20:05:01Z
label: Cancelleria e quaderni @it
label: Papelaria, blocos de notas @pt
label: Papelería y cuadernos @es
label: Papeterie et cahiers @fr
label: Schreibwaren & Notizblöcke @de
label: Канцелярские товары и блокноты @ru
label: 文具与记事本 @zh
label: 文具及筆記本 @zh-hant
label: 文房具､ﾉｰﾄ @ja
label: 문구 & 공책 @ko
definition: This industry subgroup includes companies that manufacture stationery and related office supplies, such as stationary tablets and notebooks.
notation: 11121313
valid from: 2014-08-08
valid till: 2020-10-03

Writing Instruments
type: BicsLevel4SubIndustry
type: Classifier
type: NamedIndividual
is sub industry of: Office Supplies
is anachronous version of: http://data.ga-group.nl/ics/bics/1110131311
is contemporary version of: http://data.ga-group.nl/ics/bics/11121314
is replaced by: http://data.ga-group.nl/ics/bics/2020/1110131311
is version of: http://data.ga-group.nl/ics/bics/1110131311
is version of: http://data.ga-group.nl/ics/bics/11121314
imported on: 2026-06-08T13:03:47.798Z
last refreshed on: 2026-06-08T13:03:47.798Z
source accessed on: 2019-12-03T20:05:01Z
source last accessed on: 2019-12-03T20:05:01Z
label: Articles d'écriture @fr
label: Instrum de escritura @es
label: Instrumentos de escrita @pt
label: Schreibgeräte @de
label: Strumenti scrittura @it
label: Пишущие инструменты @ru
label: 书写工具 @zh
label: 書寫工具 @zh-hant
label: 筆記具 @ja
label: 필기도구 @ko
definition: This industry subgroup includes companies that manufacture writing instruments. Such instruments include ballpoint pens, pencils, markers, chalk and rubber stamps.
notation: 11121314
valid from: 2014-08-08
valid till: 2020-10-03

Office Supplies
type: BicsLevel3Industry
type: Classifier
type: NamedIndividual
is industry of: Home & Office Products
is anachronous version of: http://data.ga-group.nl/ics/bics/11101313
is contemporary version of: http://data.ga-group.nl/ics/bics/111213
is replaced by: http://data.ga-group.nl/ics/bics/2020/11101313
is version of: http://data.ga-group.nl/ics/bics/11101313
is version of: http://data.ga-group.nl/ics/bics/111213
imported on: 2026-06-08T13:03:47.798Z
last refreshed on: 2026-06-08T13:03:47.798Z
source accessed on: 2019-12-03T20:05:01Z
source last accessed on: 2019-12-03T20:05:01Z
label: Artículos oficina @es
label: Articoli per ufficio @it
label: Bürobedarf @de
label: Fournitures de bureau @fr
label: Mater escritório @pt
label: Канцтовары @ru
label: 事務用品 @ja
label: 办公用品 @zh
label: 辦公用品 @zh-hant
label: 사무용품 @ko
definition: This industry includes companies that manufacture office supplies. Products include envelopes, tablets, notebooks, writing instruments, folders and carbon paper.
notation: 111213
valid from: 2014-08-08
valid till: 2020-10-03

Home & Office Products
type: BicsLevel2IndustryGroup
type: Classifier
type: NamedIndividual
is industry group of: Consumer Discretionary
is anachronous version of: http://data.ga-group.nl/ics/bics/111013
is contemporary version of: http://data.ga-group.nl/ics/bics/1112
is replaced by: http://data.ga-group.nl/ics/bics/2020/111013
is version of: http://data.ga-group.nl/ics/bics/111013
is version of: http://data.ga-group.nl/ics/bics/1112
imported on: 2026-06-08T13:03:47.798Z
last refreshed on: 2026-06-08T13:03:47.798Z
source accessed on: 2019-12-03T20:05:01Z
source last accessed on: 2019-12-03T20:05:01Z
label: Articles de maison et de bureau @fr
label: Haus- & Büroprodukte @de
label: Prodotti per casa e ufficio @it
label: Productos para el hogar y negocios @es
label: Produtos para casa e escritório @pt
label: Товары для дома и офиса @ru
label: 家居及办公用品 @zh
label: 家庭及辦公室產品 @zh-hant
label: 家庭･事務用品 @ja
label: 가정용 & 사무실용 제품 @ko
definition: This industry group includes companies that build homes and manufacture home-related products as well as office supplies.
notation: 1112
valid from: 2014-08-08
valid till: 2020-10-03

Dolls & Stuff Toys
type: BicsLevel5Segment
type: Classifier
type: Discontinued
type: NamedIndividual
is level5 segment of: Dolls, Toys & Games
is contemporary version of: http://data.ga-group.nl/ics/bics/1113101010
is version of: http://data.ga-group.nl/ics/bics/1113101010
imported on: 2026-06-08T13:03:47.798Z
last refreshed on: 2026-06-08T13:03:47.798Z
source accessed on: 2019-12-03T20:05:01Z
source last accessed on: 2019-12-03T20:05:01Z
label: Bambole e peluche @it
label: Bonecas e bonecos de pelúcia @pt
label: Muñecas y muñecos de peluche @es
label: Poupées et peluches @fr
label: Puppen & Stofftiere @de
label: Куклы и набивные игрушки @ru
label: 人形ぬいぐるみ製造 @ja
label: 娃娃及填充玩具 @zh-hant
label: 洋娃娃与填充玩具 @zh
label: 인형 & 봉제완구 @ko
definition: This segment includes companies that manufacture dolls, doll parts, doll clothes, stuffed toys and action figures.
notation: 1113101010
valid from: 2014-08-08
valid till: 2020-10-03

Games, Toys & Child Vehicles
type: BicsLevel5Segment
type: Classifier
type: Discontinued
type: NamedIndividual
is level5 segment of: Dolls, Toys & Games
is contemporary version of: http://data.ga-group.nl/ics/bics/1113101011
is version of: http://data.ga-group.nl/ics/bics/1113101011
imported on: 2026-06-08T13:03:47.798Z
last refreshed on: 2026-06-08T13:03:47.798Z
source accessed on: 2019-12-03T20:05:01Z
source last accessed on: 2019-12-03T20:05:01Z
label: Giochi, giocattoli e veicoli bambini @it
label: Jeux, jouets et véhicules pour enfants @fr
label: Jogos, brinquedos e veículos para crianças @pt
label: Juegos, juguetes y vehículos de niños @es
label: Spiele, Spielzeug & Kinderfahrzeuge @de
label: Игры, игрушки и детские машины @ru
label: 游戏、玩具及童车 @zh
label: 게임, 완구 & 아동용 자동차 @ko
label: ｹﾞｰﾑ･玩具･子供用乗物製造業 @ja
label: ��戲、玩具及兒童玩具車 @zh-hant
definition: This segment includes companies that manufacture games, toys and children's vehicles.
notation: 1113101011
valid from: 2014-08-08
valid till: 2020-10-03

Dolls, Toys & Games
type: BicsLevel4SubIndustry
type: Classifier
type: Discontinued
type: NamedIndividual
is sub industry of: Toys & Games
is contemporary version of: http://data.ga-group.nl/ics/bics/11131010
is version of: http://data.ga-group.nl/ics/bics/11131010
imported on: 2026-06-08T13:03:47.798Z
last refreshed on: 2026-06-08T13:03:47.798Z
source accessed on: 2019-12-03T20:05:01Z
source last accessed on: 2019-12-03T20:05:01Z
label: Bambole, giocattoli e giochi @it
label: Bonecas, brinquedos e jogos @pt
label: Muñecas, juguetes y juegos @es
label: Poupées, jouets et jeux @fr
label: Puppen, Spielzeug & Spiele @de
label: Куклы, игрушки и игры @ru
label: 人形･がん具･ｹﾞｰﾑ @ja
label: 娃娃、玩具及遊戲 @zh-hant
label: 洋娃娃、玩具及游戏 @zh
label: 인형, 완구 & 게임 @ko
definition: This industry subgroup includes companies that manufacture toys and games, such as dolls, board games, stuffed animals, model kit sets, electronic games and go-carts.
notation: 11131010
valid from: 2014-08-08
valid till: 2020-10-03

Royalty Income - Toys & Games
type: BicsLevel4SubIndustry
type: Classifier
type: Discontinued
type: NamedIndividual
is sub industry of: Toys & Games
is contemporary version of: http://data.ga-group.nl/ics/bics/11131011
is version of: http://data.ga-group.nl/ics/bics/11131011
imported on: 2026-06-08T13:03:47.798Z
last refreshed on: 2026-06-08T13:03:47.798Z
source accessed on: 2019-12-03T20:05:01Z
source last accessed on: 2019-12-03T20:05:01Z
label: Ingreso de regalías - juguetes y juegos @es
label: Lizenzertrag - Spielzeuge & Spiele @de
label: Receita de royalty - Brinquedos e jogos @pt
label: Reddito concessioni - Giochi e giocattoli @it
label: Royalties, redevances - Jouets et jeux @fr
label: Лицензионные сборы - игрушки и игры @ru
label: 權利金收入-玩具及遊戲 @zh-hant
label: 版权收入-玩具与游戏 @zh
label: 로열티 수입 - 완구 & 게임 @ko
label: ﾛｲﾔﾘﾃｨ収益 -がん具･ｹﾞｰﾑ @ja
definition: This industry subgroup includes companies that generate money from licensing rights to toys and games.
notation: 11131011
valid from: 2014-08-08
valid till: 2020-10-03

Toys & Games
type: BicsLevel3Industry
type: Classifier
type: NamedIndividual
is industry of: Leisure Products
is anachronous version of: http://data.ga-group.nl/ics/bics/11101410
is contemporary version of: http://data.ga-group.nl/ics/bics/111310
is replaced by: http://data.ga-group.nl/ics/bics/2020/11101410
is version of: http://data.ga-group.nl/ics/bics/11101410
is version of: http://data.ga-group.nl/ics/bics/111310
imported on: 2026-06-08T13:03:47.798Z
last refreshed on: 2026-06-08T13:03:47.798Z
source accessed on: 2019-12-03T20:05:01Z
source last accessed on: 2019-12-03T20:05:01Z
label: Brinquedos e jogos @pt
label: Giochi e giocattoli @it
label: Jeux et jouets @fr
label: Juguetes y juegos @es
label: Spielzeug & Spiele @de
label: Игрушки и игры @ru
label: 玩具与游戏 @zh
label: 玩具及遊戲 @zh-hant
label: 玩具･ｹﾞｰﾑ @ja
label: 완구 및 게임 @ko
definition: This industry includes companies that make dolls, toys, board games, electronic games, action figures, playing cards, riding toys, toy instruments, puzzles and stuffed animals. It does not include metal bicycles or video game consoles or software.
notation: 111310
valid from: 2014-08-08
valid till: 2020-10-03

Music Instruments
type: BicsLevel3Industry
type: Classifier
type: NamedIndividual
is industry of: Leisure Products
is anachronous version of: http://data.ga-group.nl/ics/bics/11101411
is contemporary version of: http://data.ga-group.nl/ics/bics/111311
is replaced by: http://data.ga-group.nl/ics/bics/2020/11101411
is version of: http://data.ga-group.nl/ics/bics/11101411
is version of: http://data.ga-group.nl/ics/bics/111311
imported on: 2026-06-08T13:03:47.798Z
last refreshed on: 2026-06-08T13:03:47.798Z
source accessed on: 2019-12-03T20:05:01Z
source last accessed on: 2019-12-03T20:05:01Z
label: Instrumentos musicais @pt
label: Instrumentos musicales @es
label: Instruments de musique @fr
label: Musikinstrumente @de
label: Strumenti musicali @it
label: Музыкальные инструменты @ru
label: 乐器 @zh
label: 楽器製造 @ja
label: 樂器 @zh-hant
label: 악기 @ko
definition: This industry includes companies that manufacture stringed, keyboard, woodwind, brass and percussion instruments used to perform music.
notation: 111311
valid from: 2014-08-08
valid till: 2020-10-03

Leisure Boats & Yachts Building
type: BicsLevel4SubIndustry
type: Classifier
type: NamedIndividual
is sub industry of: Recreational Vehicles
is anachronous version of: http://data.ga-group.nl/ics/bics/1110141210
is contemporary version of: http://data.ga-group.nl/ics/bics/11131210
is replaced by: http://data.ga-group.nl/ics/bics/2020/1110141210
is version of: http://data.ga-group.nl/ics/bics/1110141210
is version of: http://data.ga-group.nl/ics/bics/11131210
imported on: 2026-06-08T13:03:47.798Z
last refreshed on: 2026-06-08T13:03:47.798Z
source accessed on: 2019-12-03T20:05:01Z
source last accessed on: 2019-12-03T20:05:01Z
label: Bau von Freizeitbooten & Yachten @de
label: Construção de barcos para lazer e iates @pt
label: Construc botes de ocio/yates @es
label: Construction de bateaux et yachts de plaisance @fr
label: Costruzione imbarcazioni da diporto e yacht @it
label: Лодки/яхты @ru
label: 休闲艇与游艇 @zh
label: 遊船遊艇建造 @zh-hant
label: 레저 보트 & 요트 건조 @ko
label: ﾚｼﾞｬｰ用小型船･ﾖｯﾄ製造 @ja
definition: This industry subgroup manufactures recreational watercraft, such as yachts, motorboats, sailboats, canoes, kayaks, rowboats and inflatable rafts.
notation: 11131210
valid from: 2014-08-08
valid till: 2020-10-03

Motorhomes
type: BicsLevel5Segment
type: Classifier
type: NamedIndividual
is level5 segment of: Motorhomes, Trailers & Campers
is anachronous version of: http://data.ga-group.nl/ics/bics/111014121110
is contemporary version of: http://data.ga-group.nl/ics/bics/1113121110
is replaced by: http://data.ga-group.nl/ics/bics/2020/111014121110
is version of: http://data.ga-group.nl/ics/bics/111014121110
is version of: http://data.ga-group.nl/ics/bics/1113121110
imported on: 2026-06-08T13:03:47.798Z
last refreshed on: 2026-06-08T13:03:47.798Z
source accessed on: 2019-12-03T20:05:01Z
source last accessed on: 2019-12-03T20:05:01Z
label: Autocaravanas @es
label: Camper @it
label: Mobile-homes @fr
label: Wohnmobile @de
label: Дома на колесах @ru
label: 房车 @zh
label: 車屋 @zh-hant
label: 이동식 주택 @ko
label: ﾓｰﾀｰﾎｰﾑ @ja
definition: This segment includes companies that manufacture motor homes.
notation: 1113121110
valid from: 2014-08-08
valid till: 2020-10-03

Travel Trailers & Campers
type: BicsLevel5Segment
type: Classifier
type: NamedIndividual
is level5 segment of: Motorhomes, Trailers & Campers
is anachronous version of: http://data.ga-group.nl/ics/bics/111014121111
is contemporary version of: http://data.ga-group.nl/ics/bics/1113121111
is replaced by: http://data.ga-group.nl/ics/bics/2020/111014121111
is version of: http://data.ga-group.nl/ics/bics/111014121111
is version of: http://data.ga-group.nl/ics/bics/1113121111
imported on: 2026-06-08T13:03:47.798Z
last refreshed on: 2026-06-08T13:03:47.798Z
source accessed on: 2019-12-03T20:05:01Z
source last accessed on: 2019-12-03T20:05:01Z
label: Caravanas de viajes y de campamento @es
label: Caravanes et camping cars @fr
label: Roulotte e camper @it
label: Trailers e caravanas @pt
label: Wohnwagen & Campingbusse @de
label: Туристические прицепы и автофургоны @ru
label: 旅行拖车及露营车 @zh
label: 旅行用ﾄﾚｰﾗｰ･ｷｬﾝﾋﾟﾝｸﾞｶｰ @ja
label: 旅行車及露營車 @zh-hant
label: 여행용 트레일러 & 캠핑카 @ko
definition: This segment includes companies that manufacture travel trailers and campers.
notation: 1113121111
valid from: 2014-08-08
valid till: 2020-10-03

Motorhomes, Trailers & Campers
type: BicsLevel4SubIndustry
type: Classifier
type: NamedIndividual
is sub industry of: Recreational Vehicles
is anachronous version of: http://data.ga-group.nl/ics/bics/1110141211
is contemporary version of: http://data.ga-group.nl/ics/bics/11131211
is replaced by: http://data.ga-group.nl/ics/bics/2020/1110141211
is version of: http://data.ga-group.nl/ics/bics/1110141211
is version of: http://data.ga-group.nl/ics/bics/11131211
imported on: 2026-06-08T13:03:47.798Z
last refreshed on: 2026-06-08T13:03:47.798Z
source accessed on: 2019-12-03T20:05:01Z
source last accessed on: 2019-12-03T20:05:01Z
label: Autocaravanas, remolques y campers @es
label: Camper e roulotte @it
label: Mobile-homes, caravanes et camping cars @fr
label: Motorhomes, trailers e caravanas @pt
label: Wohnmobile, Anhänger & Campingbusse @de
label: Дома на колесах, прицепы и автофургоны @ru
label: 房车、拖车及露营车 @zh
label: 車屋、露營拖車及露營車 @zh-hant
label: 이동식 주택, 트레일러 & 캠핑카 @ko
label: ﾓｰﾀｰﾎｰﾑ､ﾄﾚｰﾗｰ､ｷｬﾝﾋﾟﾝｸﾞｶｰ @ja
definition: This industry subgroup includes companies that manufacture motor homes, travel trailers and campers.
notation: 11131211
valid from: 2014-08-08
valid till: 2020-10-03

Other Recreational Vehicles
type: BicsLevel4SubIndustry
type: Classifier
type: Discontinued
type: NamedIndividual
is sub industry of: Recreational Vehicles
is contemporary version of: http://data.ga-group.nl/ics/bics/11131212
is version of: http://data.ga-group.nl/ics/bics/11131212
imported on: 2026-06-08T13:03:47.798Z
last refreshed on: 2026-06-08T13:03:47.798Z
source accessed on: 2019-12-03T20:05:01Z
source last accessed on: 2019-12-03T20:05:01Z
label: Altri veicoli da diporto @it
label: Autres véhicules de loisir @fr
label: Otros vehículos recreativos @es
label: Outros veículos recreativos @pt
label: Sonstige Wohnmobile @de
label: Др. транспорт д/отдыха @ru
label: その他多目的ﾚｼﾞｬｰ車(RV) @ja
label: 其他休旅車 @zh-hant
label: 其他休闲车 @zh
label: 기타 레크레이션용 자동차 @ko
definition: This industry subgroup includes companies that other manufacture recreational transportation equipment, including all-terrain vehicles (ATVs), snowmobiles, personal watercraft and golf carts.
notation: 11131212
valid from: 2014-08-08
valid till: 2020-10-03

Recreational Vehicles
type: BicsLevel3Industry
type: Classifier
type: NamedIndividual
is industry of: Leisure Products
is anachronous version of: http://data.ga-group.nl/ics/bics/11101412
is contemporary version of: http://data.ga-group.nl/ics/bics/111312
is replaced by: http://data.ga-group.nl/ics/bics/2020/11101412
is version of: http://data.ga-group.nl/ics/bics/11101412
is version of: http://data.ga-group.nl/ics/bics/111312
imported on: 2026-06-08T13:03:47.798Z
last refreshed on: 2026-06-08T13:03:47.798Z
source accessed on: 2019-12-03T20:05:01Z
source last accessed on: 2019-12-03T20:05:01Z
label: Véhicules de plaisance @fr
label: Veículos recreativos @pt
label: Vehículos recreativos @es
label: Veicoli ricreativi @it
label: Wohnmobile @de
label: Транспорт для отдыха @ru
label: 休旅車 @zh-hant
label: 休闲车 @zh
label: 娯楽用品 @ja
label: 레크레이션용 자동차 @ko
definition: This industry includes companies that manufacture motor homes, travel trailers and campers, and recreational vehicle equipment.
notation: 111312
valid from: 2014-08-08
valid till: 2020-10-03

Bicycles
type: BicsLevel5Segment
type: Classifier
type: NamedIndividual
is level5 segment of: Bicycles & Parts
is anachronous version of: http://data.ga-group.nl/ics/bics/111014131010
is contemporary version of: http://data.ga-group.nl/ics/bics/1113131010
is replaced by: http://data.ga-group.nl/ics/bics/2020/111014131010
is version of: http://data.ga-group.nl/ics/bics/111014131010
is version of: http://data.ga-group.nl/ics/bics/1113131010
imported on: 2026-06-08T13:03:47.798Z
last refreshed on: 2026-06-08T13:03:47.798Z
source accessed on: 2019-12-03T20:05:01Z
source last accessed on: 2019-12-03T20:05:01Z
label: Bicicletas @es
label: Biciclette @it
label: Bicyclettes @fr
label: Fahrräder @de
label: Велосипеды @ru
label: 腳踏車 @zh-hant
label: 自行车 @zh
label: 自転車製造 @ja
label: 자전거 @ko
definition: This segment includes companies that manufacture bicycles.
notation: 1113131010
valid from: 2014-08-08
valid till: 2020-10-03

Bicycle Parts
type: BicsLevel5Segment
type: Classifier
type: NamedIndividual
is level5 segment of: Bicycles & Parts
is anachronous version of: http://data.ga-group.nl/ics/bics/111014131011
is contemporary version of: http://data.ga-group.nl/ics/bics/1113131011
is replaced by: http://data.ga-group.nl/ics/bics/2020/111014131011
is version of: http://data.ga-group.nl/ics/bics/111014131011
is version of: http://data.ga-group.nl/ics/bics/1113131011
imported on: 2026-06-08T13:03:47.798Z
last refreshed on: 2026-06-08T13:03:47.798Z
source accessed on: 2019-12-03T20:05:01Z
source last accessed on: 2019-12-03T20:05:01Z
label: Fahrradteile @de
label: Partes de bicicleta @es
label: Peças para bicicleta @pt
label: Pièces de bicyclettes @fr
label: Ricambi bici @it
label: Велосипед. запчасти @ru
label: 腳踏車零件 @zh-hant
label: 自行车零件 @zh
label: 自転車部品製造 @ja
label: 자전거 부품 @ko
definition: This segment includes companies that manufacture bicycle parts.
notation: 1113131011
valid from: 2014-08-08
valid till: 2020-10-03

Bicycles & Parts
type: BicsLevel4SubIndustry
type: Classifier
type: NamedIndividual
is sub industry of: Sporting Goods
is anachronous version of: http://data.ga-group.nl/ics/bics/1110141310
is contemporary version of: http://data.ga-group.nl/ics/bics/11131310
is replaced by: http://data.ga-group.nl/ics/bics/2020/1110141310
is version of: http://data.ga-group.nl/ics/bics/1110141310
is version of: http://data.ga-group.nl/ics/bics/11131310
imported on: 2026-06-08T13:03:47.798Z
last refreshed on: 2026-06-08T13:03:47.798Z
source accessed on: 2019-12-03T20:05:01Z
source last accessed on: 2019-12-03T20:05:01Z
label: Bicicleta e peças @pt
label: Bicicletas y partes @es
label: Biciclette e parti @it
label: Bicyclettes et leurs pièces @fr
label: Fahrräder & Teile @de
label: Велосипеды и з/части @ru
label: 腳踏車及零件 @zh-hant
label: 自行车及零件 @zh
label: 自転車･部品 @ja
label: 자전거 & 부품 @ko
definition: This industry subgroup includes companies that manufacture bicycles and bicycle parts.
notation: 11131310
valid from: 2014-08-08
valid till: 2020-10-03

Golf Equipment
type: BicsLevel4SubIndustry
type: Classifier
type: NamedIndividual
is sub industry of: Sporting Goods
is anachronous version of: http://data.ga-group.nl/ics/bics/1110141311
is contemporary version of: http://data.ga-group.nl/ics/bics/11131311
is replaced by: http://data.ga-group.nl/ics/bics/2020/1110141311
is version of: http://data.ga-group.nl/ics/bics/1110141311
is version of: http://data.ga-group.nl/ics/bics/11131311
imported on: 2026-06-08T13:03:47.798Z
last refreshed on: 2026-06-08T13:03:47.798Z
source accessed on: 2019-12-03T20:05:01Z
source last accessed on: 2019-12-03T20:05:01Z
label: Attrezzi per il golf @it
label: Equipamentos para golfe @pt
label: Equipement de golf @fr
label: Equipo de golf @es
label: Golfausrüstung @de
label: Оборудование для гольфа @ru
label: 高尔夫设备 @zh
label: 高爾夫球裝備 @zh-hant
label: 골프 장비 @ko
label: ｺﾞﾙﾌ用品 @ja
definition: This industry subgroup includes companies that manufacture golfing equipment, such as bags, balls, caddy carts, clubs and tees.
notation: 11131311
valid from: 2014-08-08
valid till: 2020-10-03

Other Sporting Equipment
type: BicsLevel4SubIndustry
type: Classifier
type: Discontinued
type: NamedIndividual
is sub industry of: Sporting Goods
is contemporary version of: http://data.ga-group.nl/ics/bics/11131312
is version of: http://data.ga-group.nl/ics/bics/11131312
imported on: 2026-06-08T13:03:47.798Z
last refreshed on: 2026-06-08T13:03:47.798Z
source accessed on: 2019-12-03T20:05:01Z
source last accessed on: 2019-12-03T20:05:01Z
label: Altro equipaggiamento sportivo @it
label: Autres équipements de sport @fr
label: Otro equipo de deportes @es
label: Outros equipamentos esportivos @pt
label: Sonstige Sportartikel @de
label: Пр. спортивное оборудование @ru
label: 其他运动设备 @zh
label: 其他體育用品 @zh-hant
label: 기타 스포츠 장비 @ko
label: ｽﾎﾟｰﾂ用品･競技用品製造業 @ja
definition: This industry subgroup includes companies that manufacture sporting goods not elsewhere classified.
notation: 11131312
valid from: 2014-08-08
valid till: 2020-10-03

Sporting Goods
type: BicsLevel3Industry
type: Classifier
type: NamedIndividual
is industry of: Leisure Products
is anachronous version of: http://data.ga-group.nl/ics/bics/11101413
is contemporary version of: http://data.ga-group.nl/ics/bics/111313
is replaced by: http://data.ga-group.nl/ics/bics/2020/11101413
is version of: http://data.ga-group.nl/ics/bics/11101413
is version of: http://data.ga-group.nl/ics/bics/111313
imported on: 2026-06-08T13:03:47.798Z
last refreshed on: 2026-06-08T13:03:47.798Z
source accessed on: 2019-12-03T20:05:01Z
source last accessed on: 2019-12-03T20:05:01Z
label: Articles de sport @fr
label: Articoli sportivi @it
label: Bienes deportivos @es
label: Materiais esportivos @pt
label: Sportartikel @de
label: Спортивные товары @ru
label: 体育用品 @zh
label: 體育用品 @zh-hant
label: 스포츠 용품 @ko
label: ｽﾎﾟｰﾂ用品製造 @ja
definition: This industry includes companies that manufacture sporting equipment. Includes metal bicycles; hard, soft and inflatable balls; rackets; bats; golf clubs; skates; protective sporting equipment; baseball gloves; bows; and camping and fishing equipment. Excludes recreational firearms (see Munitions & Small Arms).
notation: 111313
valid from: 2014-08-08
valid till: 2020-10-03

Leisure Products
type: BicsLevel2IndustryGroup
type: Classifier
type: NamedIndividual
is industry group of: Consumer Discretionary
is anachronous version of: http://data.ga-group.nl/ics/bics/111014
is contemporary version of: http://data.ga-group.nl/ics/bics/1113
is replaced by: http://data.ga-group.nl/ics/bics/2020/111014
is version of: http://data.ga-group.nl/ics/bics/111014
is version of: http://data.ga-group.nl/ics/bics/1113
imported on: 2026-06-08T13:03:47.798Z
last refreshed on: 2026-06-08T13:03:47.798Z
source accessed on: 2019-12-03T20:05:01Z
source last accessed on: 2019-12-03T20:05:01Z
label: Articoli tempo libero @it
label: Freizeitartikel @de
label: Productos de tiempo libre @es
label: Produits de loisir @fr
label: Produtos de lazer @pt
label: Товары д/отдыха @ru
label: 休閒產品 @zh-hant
label: 休闲产品 @zh
label: 레저 상품 @ko
label: ﾚｼﾞｬｰ用品 @ja
definition: This industry group includes companies that manufacture consumer electronics, recreational products, sporting goods, and toys and games.
notation: 1113
valid from: 2014-08-08
valid till: 2020-10-03

Facility Repair & Maintenance
type: BicsLevel4SubIndustry
type: Classifier
type: NamedIndividual
is sub industry of: Building Maintenance Services
is anachronous version of: http://data.ga-group.nl/ics/bics/1711111010
is contemporary version of: http://data.ga-group.nl/ics/bics/11141010
is replaced by: http://data.ga-group.nl/ics/bics/2020/1711111010
is version of: http://data.ga-group.nl/ics/bics/11141010
is version of: http://data.ga-group.nl/ics/bics/1711111010
imported on: 2026-06-08T13:03:47.798Z
last refreshed on: 2026-06-08T13:03:47.798Z
source accessed on: 2019-12-03T20:05:01Z
source last accessed on: 2019-12-03T20:05:01Z
label: Réparation et maintenance d'installations @fr
label: Reparación y mant de instalación @es
label: Reparatur & Instandhaltung von Einrichtungen @de
label: Reparo e manutenção instalação @pt
label: Riparazioni manutenzione impianti @it
label: Ремонт и техническое обслуживание @ru
label: 施設修理･ﾒﾝﾃﾅﾝ��� @ja
label: 設施維修及保養 @zh-hant
label: 设施修理和维护 @zh
label: 시설 관리 & 수리업 @ko
definition: This industry subgroup includes companies that provide building repair and maintenance services. Typically, these services are offered in an outsourcing model for property owners. These services include minor building repairs, painting, light fixture replacements and general handyman services. These companies may also hire and manage subcontractors, such as plumbers, electricians and HVAC specialists for more specialized services.
notation: 11141010
valid from: 2014-08-08
valid till: 2020-10-03

Janitorial Services
type: BicsLevel4SubIndustry
type: Classifier
type: NamedIndividual
is sub industry of: Building Maintenance Services
is anachronous version of: http://data.ga-group.nl/ics/bics/1711111011
is contemporary version of: http://data.ga-group.nl/ics/bics/11141011
is replaced by: http://data.ga-group.nl/ics/bics/2020/1711111011
is version of: http://data.ga-group.nl/ics/bics/11141011
is version of: http://data.ga-group.nl/ics/bics/1711111011
imported on: 2026-06-08T13:03:47.798Z
last refreshed on: 2026-06-08T13:03:47.798Z
source accessed on: 2019-12-03T20:05:01Z
source last accessed on: 2019-12-03T20:05:01Z
label: Hausmeisterdienste @de
label: Serv de limpeza @pt
label: Serv limpieza inmob @es
label: Servizi di pulizia @it
label: Srv conciergerie @fr
label: Услуги по уборке @ru
label: 保洁服务 @zh
label: 清掃ｻｰﾋﾞｽ業 @ja
label: 清潔服務 @zh-hant
label: 수위 서비스 @ko
definition: This industry subgroup includes companies that clean windows, buildings, interiors and transportation equipment.
notation: 11141011
valid from: 2014-08-08
valid till: 2020-10-03

Landscaping Services
type: BicsLevel4SubIndustry
type: Classifier
type: NamedIndividual
is sub industry of: Building Maintenance Services
is anachronous version of: http://data.ga-group.nl/ics/bics/1711111012
is contemporary version of: http://data.ga-group.nl/ics/bics/11141012
is replaced by: http://data.ga-group.nl/ics/bics/2020/1711111012
is version of: http://data.ga-group.nl/ics/bics/11141012
is version of: http://data.ga-group.nl/ics/bics/1711111012
imported on: 2026-06-08T13:03:47.798Z
last refreshed on: 2026-06-08T13:03:47.798Z
source accessed on: 2019-12-03T20:05:01Z
source last accessed on: 2019-12-03T20:05:01Z
label: Landschaftsbaudienste @de
label: Serviços de jardinagem @pt
label: Services d'aménagement paysager @fr
label: Servicios de jardinería @es
label: Servizi di giardinaggio @it
label: Ландшафтные услуги @ru
label: 景觀服務 @zh-hant
label: 景观服务 @zh
label: 造園ｻｰﾋﾞｽ @ja
label: 조경 서비스 @ko
definition: This industry subgroup includes companies that perform planting, care and maintenance for lawns and flower beds for both commercial and residential properties. Excludes companies that specialize in engineering or designing landscape (see Landscape Architecture Svcs).
notation: 11141012
valid from: 2014-08-08
valid till: 2020-10-03

Pest Control Services
type: BicsLevel4SubIndustry
type: Classifier
type: NamedIndividual
is sub industry of: Building Maintenance Services
is anachronous version of: http://data.ga-group.nl/ics/bics/1711111013
is contemporary version of: http://data.ga-group.nl/ics/bics/11141013
is replaced by: http://data.ga-group.nl/ics/bics/2020/1711111013
is version of: http://data.ga-group.nl/ics/bics/11141013
is version of: http://data.ga-group.nl/ics/bics/1711111013
imported on: 2026-06-08T13:03:47.798Z
last refreshed on: 2026-06-08T13:03:47.798Z
source accessed on: 2019-12-03T20:05:01Z
source last accessed on: 2019-12-03T20:05:01Z
label: Schädlingsbekämpfung @de
label: Serv controle de pragas @pt
label: Serv de fumigación @es
label: Services désinf/extermination @fr
label: Servizi disinfestazione @it
label: Услуги по борьбе с вредителями @ru
label: 害虫駆除ｻｰﾋﾞｽ @ja
label: 病蟲防治服務 @zh-hant
label: 虫害控制服务 @zh
label: 방제 서비스 @ko
definition: This industry subgroup includes companies that provide pest elimination, prevention or deterrence. Excludes pest control services for agricultural purposes (see Support Activities-Crop Prod). Also known as exterminators.
notation: 11141013
valid from: 2014-08-08
valid till: 2020-10-03

Building Maintenance Services
type: BicsLevel3Industry
type: Classifier
type: NamedIndividual
is industry of: Commercial Services
is anachronous version of: http://data.ga-group.nl/ics/bics/17111110
is contemporary version of: http://data.ga-group.nl/ics/bics/111410
is replaced by: http://data.ga-group.nl/ics/bics/2020/17111110
is version of: http://data.ga-group.nl/ics/bics/111410
is version of: http://data.ga-group.nl/ics/bics/17111110
imported on: 2026-06-08T13:03:47.798Z
last refreshed on: 2026-06-08T13:03:47.798Z
source accessed on: 2019-12-03T20:05:01Z
source last accessed on: 2019-12-03T20:05:01Z
label: Instandhaltung von Gebäuden @de
label: Serv de manutenção prédios @pt
label: Services maintenance d'immeubles @fr
label: Servicios mant edificios @es
label: Servizi manutenzione edifici @it
label: Услуги по уборке зданий @ru
label: 建筑维护保养服务 @zh
label: 建築維護保養服務 @zh-hant
label: 건물 유지보수 서비스 @ko
label: ﾋﾞﾙ管理ｻｰﾋﾞｽ @ja
definition: This industry includes companies that provide services to assist in the facility's day-to-day functions. Includes basic building repairs, painting, janitorial cleaning services, landscape maintenance and pest control. Excludes contract construction projects (see Building Subcontractors).
notation: 111410
valid from: 2014-08-08
valid till: 2020-10-03

Architectural Services
type: BicsLevel4SubIndustry
type: Classifier
type: NamedIndividual
is sub industry of: Construction Related Pro Svcs
is anachronous version of: http://data.ga-group.nl/ics/bics/1711131010
is contemporary version of: http://data.ga-group.nl/ics/bics/11141110
is replaced by: http://data.ga-group.nl/ics/bics/2020/1711131010
is version of: http://data.ga-group.nl/ics/bics/11141110
is version of: http://data.ga-group.nl/ics/bics/1711131010
imported on: 2026-06-08T13:03:47.798Z
last refreshed on: 2026-06-08T13:03:47.798Z
source accessed on: 2019-12-03T20:05:01Z
source last accessed on: 2019-12-03T20:05:01Z
label: Architektur @de
label: Serv architettura @it
label: Serv arquitectura @es
label: Serv de arquitetura @pt
label: Service architecture @fr
label: Архитектура @ru
label: 建筑服务 @zh
label: 建築服務 @zh-hant
label: 建築ｻｰﾋﾞｽ業 @ja
label: 건축 서비스업 @ko
definition: This industry subgroup includes companies that provide architectural design services for residential, commercial and industrial buildings.
notation: 11141110
valid from: 2014-08-08
valid till: 2020-10-03

Building Inspection Services
type: BicsLevel4SubIndustry
type: Classifier
type: Discontinued
type: NamedIndividual
is sub industry of: Construction Related Pro Svcs
is contemporary version of: http://data.ga-group.nl/ics/bics/11141111
is version of: http://data.ga-group.nl/ics/bics/11141111
imported on: 2026-06-08T13:03:47.798Z
last refreshed on: 2026-06-08T13:03:47.798Z
source accessed on: 2019-12-03T20:05:01Z
source last accessed on: 2019-12-03T20:05:01Z
label: Gebäudeinpsektionen @de
label: Inspección construc @es
label: Serv de inspeção de construção @pt
label: Serv ispezione edili @it
label: Srv inspect bâtiment @fr
label: Услуги по инспекции зданий @ru
label: 建物検査ｻｰﾋﾞｽ業 @ja
label: 建筑检查服务 @zh
label: 建築物檢驗服務 @zh-hant
label: 건축검사서비스업 @ko
definition: This industry subgroup includes companies that provide building and home inspection services.
notation: 11141111
valid from: 2014-08-08
valid till: 2020-10-03

Landscape Architecture Svcs
type: BicsLevel4SubIndustry
type: Classifier
type: Discontinued
type: NamedIndividual
is sub industry of: Construction Related Pro Svcs
is contemporary version of: http://data.ga-group.nl/ics/bics/11141112
is version of: http://data.ga-group.nl/ics/bics/11141112
imported on: 2026-06-08T13:03:47.798Z
last refreshed on: 2026-06-08T13:03:47.798Z
source accessed on: 2019-12-03T20:05:01Z
source last accessed on: 2019-12-03T20:05:01Z
label: Landschaftsgestaltg @de
label: Serv architettura giardini @it
label: Serv arq de jardinería @es
label: Serv arquit paisagística @pt
label: Serv d'archit paysagère @fr
label: Услг ландшафтной архитектуры @ru
label: 景觀建築服務 @zh-hant
label: 景观建筑服务 @zh
label: 造園建築ｻｰﾋﾞｽ業 @ja
label: 조경설계 서비스 @ko
definition: This industry subgroup includes companies that provide landscape design and land use management services.
notation: 11141112
valid from: 2014-08-08
valid till: 2020-10-03

Construction Related Pro Svcs
type: BicsLevel3Industry
type: Classifier
type: Discontinued
type: NamedIndividual
is industry of: Commercial Services
is contemporary version of: http://data.ga-group.nl/ics/bics/111411
is version of: http://data.ga-group.nl/ics/bics/111411
imported on: 2026-06-08T13:03:47.798Z
last refreshed on: 2026-06-08T13:03:47.798Z
source accessed on: 2019-12-03T20:05:01Z
source last accessed on: 2019-12-03T20:05:01Z
label: Bauverwandte Dienste @de
label: Serv prof construction @fr
label: Serv prof de construcción @es
label: Serv prof relac construção @pt
label: Serv prog associati edilizia @it
label: Связ. со строит. услуги @ru
label: 建筑相关专业服务 @zh
label: 建設関連専門ｻｰﾋﾞｽ @ja
label: 營造相關專業服務 @zh-hant
label: 건설관련 전문서비스 @ko
definition: This industry includes companies that provide construction-related professional services, such as architectural design, landscaping and building inspection.
notation: 111411
valid from: 2014-08-08
valid till: 2020-10-03

Caterers
type: BicsLevel4SubIndustry
type: Classifier
type: NamedIndividual
is sub industry of: Food Services
is anachronous version of: http://data.ga-group.nl/ics/bics/1711111110
is contemporary version of: http://data.ga-group.nl/ics/bics/11141210
is replaced by: http://data.ga-group.nl/ics/bics/2020/1711111110
is version of: http://data.ga-group.nl/ics/bics/11141210
is version of: http://data.ga-group.nl/ics/bics/1711111110
imported on: 2026-06-08T13:03:47.798Z
last refreshed on: 2026-06-08T13:03:47.798Z
source accessed on: 2019-12-03T20:05:01Z
source last accessed on: 2019-12-03T20:05:01Z
label: Caterer @de
label: Fornecedores de alimento @pt
label: Hostelería @es
label: Org banchetti @it
label: Traiteurs @fr
label: Фирмы, обслуживающие торжества @ru
label: 仕出し業 @ja
label: 办宴会者 @zh
label: 外燴服務 @zh-hant
label: 출장요리사 @ko
definition: This industry subgroup includes companies that offer single-event food services.
notation: 11141210
valid from: 2014-08-08
valid till: 2020-10-03

Food Service Contractors
type: BicsLevel4SubIndustry
type: Classifier
type: NamedIndividual
is sub industry of: Food Services
is anachronous version of: http://data.ga-group.nl/ics/bics/1711111111
is contemporary version of: http://data.ga-group.nl/ics/bics/11141211
is replaced by: http://data.ga-group.nl/ics/bics/2020/1711111111
is version of: http://data.ga-group.nl/ics/bics/11141211
is version of: http://data.ga-group.nl/ics/bics/1711111111
imported on: 2026-06-08T13:03:47.798Z
last refreshed on: 2026-06-08T13:03:47.798Z
source accessed on: 2019-12-03T20:05:01Z
source last accessed on: 2019-12-03T20:05:01Z
label: Appaltatori ristorazione @it
label: Empreiteiros de serviços de alimentação @pt
label: Entrepreneurs en restauration @fr
label: Servicios de comedor @es
label: Unternehmer im Lebensmitteldienst @de
label: Подрядчики общественного питания @ru
label: 合約供餐服務 @zh-hant
label: 食品服务承包商 @zh
label: 食品ｻｰﾋﾞｽ請負 @ja
label: 식품 서비스 계약���체 @ko
definition: This industry subgroup includes companies that provide food services to institutional, governmental, commercial, or industrial clients, usually on a contractual basis.
notation: 11141211
valid from: 2014-08-08
valid till: 2020-10-03

Food Services
type: BicsLevel3Industry
type: Classifier
type: NamedIndividual
is industry of: Commercial Services
is anachronous version of: http://data.ga-group.nl/ics/bics/17111111
is contemporary version of: http://data.ga-group.nl/ics/bics/111412
is replaced by: http://data.ga-group.nl/ics/bics/2020/17111111
is version of: http://data.ga-group.nl/ics/bics/111412
is version of: http://data.ga-group.nl/ics/bics/17111111
imported on: 2026-06-08T13:03:47.798Z
last refreshed on: 2026-06-08T13:03:47.798Z
source accessed on: 2019-12-03T20:05:01Z
source last accessed on: 2019-12-03T20:05:01Z
label: Serv de alimentos @pt
label: Service alim @fr
label: Servicios alimentos @es
label: Servizi alimentari @it
label: Verpflegung @de
label: Предост. продов-я @ru
label: 食品服务 @zh
label: 食品服務 @zh-hant
label: 食品ｻｰﾋﾞｽ @ja
label: 식품 서비스 @ko
definition: This industry includes companies that provide catering for a single event or long-term food services for a specified period of time via contract. They may cater single events at different locations or continually operate concessions at sports or similar facilities. The food may be served or offered cafeteria style.
notation: 111412
valid from: 2014-08-08
valid till: 2020-10-03

Newspaper, Book & Mag Printing
type: BicsLevel4SubIndustry
type: Classifier
type: NamedIndividual
is sub industry of: Printing Services
is anachronous version of: http://data.ga-group.nl/ics/bics/1711111210
is contemporary version of: http://data.ga-group.nl/ics/bics/11141310
is replaced by: http://data.ga-group.nl/ics/bics/2020/1711111210
is version of: http://data.ga-group.nl/ics/bics/11141310
is version of: http://data.ga-group.nl/ics/bics/1711111210
imported on: 2026-06-08T13:03:47.798Z
last refreshed on: 2026-06-08T13:03:47.798Z
source accessed on: 2019-12-03T20:05:01Z
source last accessed on: 2019-12-03T20:05:01Z
label: Impresión periódicos, libros y revistas @es
label: Impress journaux, livres et magazines @fr
label: Impressão de jornais, livros e revistas @pt
label: Stampa libri, riviste e giornali @it
label: Zeitungen, Bücher & Magazine @de
label: Печать газет, кни��, журн. @ru
label: 报纸、书籍及杂志印刷 @zh
label: 新聞･書籍･雑誌印刷業 @ja
label: 書報雜誌印刷 @zh-hant
label: 신문, 서적 & 잡지 인쇄 @ko
definition: This industry subgroup includes companies that provide newspaper, book and magazine printing and binding services.
notation: 11141310
valid from: 2014-08-08
valid till: 2020-10-03

Printing Support
type: BicsLevel4SubIndustry
type: Classifier
type: NamedIndividual
is sub industry of: Printing Services
is anachronous version of: http://data.ga-group.nl/ics/bics/1711111211
is contemporary version of: http://data.ga-group.nl/ics/bics/11141311
is replaced by: http://data.ga-group.nl/ics/bics/2020/1711111211
is version of: http://data.ga-group.nl/ics/bics/11141311
is version of: http://data.ga-group.nl/ics/bics/1711111211
imported on: 2026-06-08T13:03:47.798Z
last refreshed on: 2026-06-08T13:03:47.798Z
source accessed on: 2019-12-03T20:05:01Z
source last accessed on: 2019-12-03T20:05:01Z
label: Assistenza stampa @it
label: Druck-Support @de
label: Soporte de impresión @es
label: Suporte à impressão @pt
label: Support pour imprimerie @fr
label: Поддержка печатной деятельность @ru
label: 印刷支持服务 @zh
label: 印刷支援服務 @zh-hant
label: 印刷支援ｻｰﾋﾞｽ @ja
label: 인쇄 지원 @ko
definition: This industry subgroup includes companies that provide printing support services.
notation: 11141311
valid from: 2014-08-08
valid till: 2020-10-03

Other Commercial Printing
type: BicsLevel4SubIndustry
type: Classifier
type: Discontinued
type: NamedIndividual
is sub industry of: Printing Services
is contemporary version of: http://data.ga-group.nl/ics/bics/11141312
is version of: http://data.ga-group.nl/ics/bics/11141312
imported on: 2026-06-08T13:03:47.798Z
last refreshed on: 2026-06-08T13:03:47.798Z
source accessed on: 2019-12-03T20:05:01Z
source last accessed on: 2019-12-03T20:05:01Z
label: Altra stampa commerciale @it
label: Autre impression commerciale @fr
label: Otra impresión comercial @es
label: Outras impressões comerciais @pt
label: Sonstiges gewerbliches Drucken @de
label: Печать проч. коммерческой продукции @ru
label: その他商業印刷業 @ja
label: 其他商业印刷 @zh
label: 其他商業印刷 @zh-hant
label: 기타 상업용 인쇄 @ko
definition: This industry subgroup includes companies that provide commercial printing services not elsewhere classified. Includes letterpress and engraving printing services.
notation: 11141312
valid from: 2014-08-08
valid till: 2020-10-03

Printing Services
type: BicsLevel3Industry
type: Classifier
type: NamedIndividual
is industry of: Commercial Services
is anachronous version of: http://data.ga-group.nl/ics/bics/17111112
is contemporary version of: http://data.ga-group.nl/ics/bics/111413
is replaced by: http://data.ga-group.nl/ics/bics/2020/17111112
is version of: http://data.ga-group.nl/ics/bics/111413
is version of: http://data.ga-group.nl/ics/bics/17111112
imported on: 2026-06-08T13:03:47.798Z
last refreshed on: 2026-06-08T13:03:47.798Z
source accessed on: 2019-12-03T20:05:01Z
source last accessed on: 2019-12-03T20:05:01Z
label: Druckerdienste @de
label: Serv de impressão @pt
label: Serv impresión @es
label: Servizi di stampa @it
label: Srv imprimerie @fr
label: Полиграф. услуги @ru
label: 印刷服务 @zh
label: 印刷服務 @zh-hant
label: 印刷ｻｰﾋﾞｽ @ja
label: 인쇄 서비스 @ko
definition: This industry includes companies that provide a variety of copying, document preparation and support services for printing activities.
notation: 111413
valid from: 2014-08-08
valid till: 2020-10-03

Lawyer Offices
type: BicsLevel5Segment
type: Classifier
type: NamedIndividual
is level5 segment of: Legal Services
is anachronous version of: http://data.ga-group.nl/ics/bics/171111161010
is contemporary version of: http://data.ga-group.nl/ics/bics/1114141010
is replaced by: http://data.ga-group.nl/ics/bics/2020/171111161010
is version of: http://data.ga-group.nl/ics/bics/1114141010
is version of: http://data.ga-group.nl/ics/bics/171111161010
imported on: 2026-06-08T13:03:47.798Z
last refreshed on: 2026-06-08T13:03:47.798Z
source accessed on: 2019-12-03T20:05:01Z
source last accessed on: 2019-12-03T20:05:01Z
label: Anwaltsbüros @de
label: Escritórios de advocacia @pt
label: Etudes d'avocats @fr
label: Oficinas de abogados @es
label: Studi legali @it
label: Офисы юристов @ru
label: 弁護士事務所 @ja
label: 律师事务所 @zh
label: 律師事務所 @zh-hant
label: 변호사 사무실 @ko
definition: This segment includes offices of legal practitioners. Such offices include attorneys' offices, barristers' offices, criminal law offices, law firms and solicitors' offices.
notation: 1114141010
valid from: 2014-08-08
valid till: 2020-10-03

Patent, Notary & Paralegal Svcs
type: BicsLevel5Segment
type: Classifier
type: NamedIndividual
is level5 segment of: Legal Services
is anachronous version of: http://data.ga-group.nl/ics/bics/171111161011
is contemporary version of: http://data.ga-group.nl/ics/bics/1114141011
is replaced by: http://data.ga-group.nl/ics/bics/2020/171111161011
is version of: http://data.ga-group.nl/ics/bics/1114141011
is version of: http://data.ga-group.nl/ics/bics/171111161011
imported on: 2026-06-08T13:03:47.798Z
last refreshed on: 2026-06-08T13:03:47.798Z
source accessed on: 2019-12-03T20:05:01Z
source last accessed on: 2019-12-03T20:05:01Z
label: Patent- & Notariatsdienste @de
label: Patentes, notarios y serv jur @es
label: Ser brevets/notaires/paralégaux @fr
label: Serv brevetto, notarili e paralegali @it
label: Serv patente, notário e paralegais @pt
label: Услуги нотариуса, юриста и лицензир. @ru
label: 专利、公证及法律助理服务 @zh
label: 專利、公證及法務助理服務 @zh-hant
label: 特許､公証､ﾊﾟﾗﾘｰｶﾞﾙ･ｻｰﾋﾞｽ @ja
label: 특허, 공증 & 법무서비스 @ko
definition: This segment includes companies that provide notary services, public services, paralegal services, patent agent services and process-serving services.
notation: 1114141011
valid from: 2014-08-08
valid till: 2020-10-03

Legal Services
type: BicsLevel4SubIndustry
type: Classifier
type: NamedIndividual
is sub industry of: Professional Services
is anachronous version of: http://data.ga-group.nl/ics/bics/1711111610
is contemporary version of: http://data.ga-group.nl/ics/bics/11141410
is replaced by: http://data.ga-group.nl/ics/bics/2020/1711111610
is version of: http://data.ga-group.nl/ics/bics/11141410
is version of: http://data.ga-group.nl/ics/bics/1711111610
imported on: 2026-06-08T13:03:47.798Z
last refreshed on: 2026-06-08T13:03:47.798Z
source accessed on: 2019-12-03T20:05:01Z
source last accessed on: 2019-12-03T20:05:01Z
label: Rechtsdienst @de
label: Serviços jurídicos @pt
label: Services juridiques @fr
label: Servicios jurídicos @es
label: Servizi legali @it
label: Юридические услуги @ru
label: 法務ｻｰﾋﾞｽ @ja
label: 法律服务 @zh
label: 法律服務 @zh-hant
label: 법률 서비스 @ko
definition: This industry subgroup includes groups or organizations of lawyers who provide expertise in a range of specific areas of law, such as criminal, family, estate, patent, real estate, or tax law.
notation: 11141410
valid from: 2014-08-08
valid till: 2020-10-03

Employment Agencies
type: BicsLevel5Segment
type: Classifier
type: NamedIndividual
is level5 segment of: Mgmt & Admin Consulting Svcs
is anachronous version of: http://data.ga-group.nl/ics/bics/171111161110
is contemporary version of: http://data.ga-group.nl/ics/bics/1114141110
is replaced by: http://data.ga-group.nl/ics/bics/2020/171111161110
is version of: http://data.ga-group.nl/ics/bics/1114141110
is version of: http://data.ga-group.nl/ics/bics/171111161110
imported on: 2026-06-08T13:03:47.798Z
last refreshed on: 2026-06-08T13:03:47.798Z
source accessed on: 2019-12-03T20:05:01Z
source last accessed on: 2019-12-03T20:05:01Z
label: Agências de empregos @pt
label: Agences de placement @fr
label: Agencias de empleo @es
label: Agenzie collocamento @it
label: Stellenvermittlungen @de
label: Кадровые агентства @ru
label: 职业介绍服务机构 @zh
label: 職業紹介所 @ja
label: 취업알선기관 @ko
label: ��業仲介服務 @zh-hant
definition: This segment includes companies that serve as an intermediary between hiring companies and potential job candidates.
notation: 1114141110
valid from: 2014-08-08
valid till: 2020-10-03

Executive Search
type: BicsLevel5Segment
type: Classifier
type: NamedIndividual
is level5 segment of: Mgmt & Admin Consulting Svcs
is anachronous version of: http://data.ga-group.nl/ics/bics/171111161111
is contemporary version of: http://data.ga-group.nl/ics/bics/1114141111
is replaced by: http://data.ga-group.nl/ics/bics/2020/171111161111
is version of: http://data.ga-group.nl/ics/bics/1114141111
is version of: http://data.ga-group.nl/ics/bics/171111161111
imported on: 2026-06-08T13:03:47.798Z
last refreshed on: 2026-06-08T13:03:47.798Z
source accessed on: 2019-12-03T20:05:01Z
source last accessed on: 2019-12-03T20:05:01Z
label: Agencias ejecutivos @es
label: Busca executiva @pt
label: Recherche de cadres @fr
label: Ricerca dirigenti @it
label: Suche: Führungskraft @de
label: Услуги подбора персонала @ru
label: 管理层检索 @zh
label: 管理職人材あっせん @ja
label: 高階主管仲介服務 @zh-hant
label: 경영진 구인서비스 @ko
definition: This segment includes companies that provide executive search, recruitment and placement services for clients with specific executive and senior management position requirements.
notation: 1114141111
valid from: 2014-08-08
valid till: 2020-10-03

General Management Consulting
type: BicsLevel5Segment
type: Classifier
type: NamedIndividual
is level5 segment of: Mgmt & Admin Consulting Svcs
is anachronous version of: http://data.ga-group.nl/ics/bics/171111161112
is contemporary version of: http://data.ga-group.nl/ics/bics/1114141112
is replaced by: http://data.ga-group.nl/ics/bics/2020/171111161112
is version of: http://data.ga-group.nl/ics/bics/1114141112
is version of: http://data.ga-group.nl/ics/bics/171111161112
imported on: 2026-06-08T13:03:47.798Z
last refreshed on: 2026-06-08T13:03:47.798Z
source accessed on: 2019-12-03T20:05:01Z
source last accessed on: 2019-12-03T20:05:01Z
label: Allgemeines Consulting @de
label: Asesoría de admin general @es
label: Conseils généraux en gestion @fr
label: Consultoria de gestão geral @pt
label: Servizi consulenza aziendale @it
label: Управленческое консультирование @ru
label: 一般管理顧問 @zh-hant
label: 経営管理ｺﾝｻﾙﾃｨﾝｸﾞｻｰﾋﾞｽ業 @ja
label: 行政管理与一般咨询 @zh
label: 일반 경영컨설팅 @ko
definition: This segment includes companies that provide operating advice and assistance to businesses and other organizations on administrative management issues, such as financial planning and budgeting, records management, office planning, strategic and organizational planning, site selection, new business startup and business process improvement.
notation: 1114141112
valid from: 2014-08-08
valid till: 2020-10-03

Talent Management Services
type: BicsLevel5Segment
type: Classifier
type: NamedIndividual
is level5 segment of: Mgmt & Admin Consulting Svcs
is anachronous version of: http://data.ga-group.nl/ics/bics/171111161113
is contemporary version of: http://data.ga-group.nl/ics/bics/1114141113
is replaced by: http://data.ga-group.nl/ics/bics/2020/171111161113
is version of: http://data.ga-group.nl/ics/bics/1114141113
is version of: http://data.ga-group.nl/ics/bics/171111161113
imported on: 2026-06-08T13:03:47.798Z
last refreshed on: 2026-06-08T13:03:47.798Z
source accessed on: 2019-12-03T20:05:01Z
source last accessed on: 2019-12-03T20:05:01Z
label: Mitarbeiterentwicklung @de
label: Serv de gestión de talento @es
label: Serviços gerenc talento @pt
label: Services gestion des aptitudes @fr
label: Servizi gestione talento @it
label: Услуги по упр��влению развитием сотрудников @ru
label: 人才管理服务 @zh
label: 人才管理服務 @zh-hant
label: 人材管理ｻｰﾋﾞｽ @ja
label: 인재 관리 서비스 @ko
definition: This segment includes companies that provide promotional agency services. These companies enter into contractual agreements with their clients and aid in job placements and career development. Typically, these companies operate agencies and are specialized in job-related fields (modelling, music, sports, etc.). Also known as talent agencies.
notation: 1114141113
valid from: 2014-08-08
valid till: 2020-10-03

Temporary Help
type: BicsLevel5Segment
type: Classifier
type: NamedIndividual
is level5 segment of: Mgmt & Admin Consulting Svcs
is anachronous version of: http://data.ga-group.nl/ics/bics/171111161114
is contemporary version of: http://data.ga-group.nl/ics/bics/1114141114
is replaced by: http://data.ga-group.nl/ics/bics/2020/171111161114
is version of: http://data.ga-group.nl/ics/bics/1114141114
is version of: http://data.ga-group.nl/ics/bics/171111161114
imported on: 2026-06-08T13:03:47.798Z
last refreshed on: 2026-06-08T13:03:47.798Z
source accessed on: 2019-12-03T20:05:01Z
source last accessed on: 2019-12-03T20:05:01Z
label: Agencias empleo temp @es
label: Ajuda temporária @pt
label: Personale temporario @it
label: Personnel suppléant @fr
label: Zeitpersonal @de
label: Временное трудоустройство @ru
label: 临时工派遣服务 @zh
label: 人材派遣ｻｰﾋﾞｽ業 @ja
label: 臨時派遣服務 @zh-hant
label: 임시 지원 서비스 @ko
definition: This segment includes companies that provide workers to clients' businesses for limited periods of time to supplement the client's existing work force. Also known as temp agencies.
notation: 1114141114
valid from: 2014-08-08
valid till: 2020-10-03

Mgmt & Admin Consulting Svcs
type: BicsLevel4SubIndustry
type: Classifier
type: NamedIndividual
is sub industry of: Professional Services
is anachronous version of: http://data.ga-group.nl/ics/bics/1711111611
is contemporary version of: http://data.ga-group.nl/ics/bics/11141411
is replaced by: http://data.ga-group.nl/ics/bics/2020/1711111611
is version of: http://data.ga-group.nl/ics/bics/11141411
is version of: http://data.ga-group.nl/ics/bics/1711111611
imported on: 2026-06-08T13:03:47.798Z
last refreshed on: 2026-06-08T13:03:47.798Z
source accessed on: 2019-12-03T20:05:01Z
source last accessed on: 2019-12-03T20:05:01Z
label: Beratungsdienste @de
label: Serv conseils en gestion et admin @fr
label: Serv consulenza gestione e ammin @it
label: Serv consultoría administrativa @es
label: Serv consultoria admin e gerenc @pt
label: Консультац. услуги по вопросам управл. @ru
label: 管理与行政顾问服务 @zh
label: 管理及行政顧問服務 @zh-hant
label: 経営･管理ｺﾝｻﾙﾃｨﾝｸﾞ･ｻｰﾋﾞｽ @ja
label: 경영 & 관리 컨설팅 @ko
definition: This industry subgroup includes organizations that provide advice and assistance to businesses and other organizations on management issues, such as organizational planning, financial planning and budgeting, marketing, human resources, business process outsourcing and other third-party services.
notation: 11141411
valid from: 2014-08-08
valid till: 2020-10-03

Accounting Services
type: BicsLevel5Segment
type: Classifier
type: NamedIndividual
is level5 segment of: Other Professional Services
is anachronous version of: http://data.ga-group.nl/ics/bics/171111161210
is contemporary version of: http://data.ga-group.nl/ics/bics/1114141210
is replaced by: http://data.ga-group.nl/ics/bics/2020/171111161210
is version of: http://data.ga-group.nl/ics/bics/1114141210
is version of: http://data.ga-group.nl/ics/bics/171111161210
imported on: 2026-06-08T13:03:47.798Z
last refreshed on: 2026-06-08T13:03:47.798Z
source accessed on: 2019-12-03T20:05:01Z
source last accessed on: 2019-12-03T20:05:01Z
label: Buchführungsdienste @de
label: Serv contábeis @pt
label: Services comptables @fr
label: Servicios contables @es
label: Servizi contabilità @it
label: Услуги бухгалтерского учета @ru
label: 会計ｻｰﾋﾞｽ @ja
label: 会计服务 @zh
label: 會計服務 @zh-hant
label: 회계 서비스 @ko
definition: This segment includes companies that audit the accounting records of public and private organizations.
notation: 1114141210
valid from: 2014-08-08
valid till: 2020-10-03

Tax Preparation Services
type: BicsLevel5Segment
type: Classifier
type: NamedIndividual
is level5 segment of: Other Professional Services
is anachronous version of: http://data.ga-group.nl/ics/bics/171111161211
is contemporary version of: http://data.ga-group.nl/ics/bics/1114141211
is replaced by: http://data.ga-group.nl/ics/bics/2020/171111161211
is version of: http://data.ga-group.nl/ics/bics/1114141211
is version of: http://data.ga-group.nl/ics/bics/171111161211
imported on: 2026-06-08T13:03:47.798Z
last refreshed on: 2026-06-08T13:03:47.798Z
source accessed on: 2019-12-03T20:05:01Z
source last accessed on: 2019-12-03T20:05:01Z
label: Prépa décla revenus @fr
label: Prep dichiaraz redd @it
label: Prep imposto @pt
label: Serv prep impuestos @es
label: Steuerdienste @de
label: Подготовка налогов Услуги @ru
label: 報稅服務 @zh-hant
label: 报税服务 @zh
label: 税務ｻｰﾋﾞｽ業 @ja
label: 세무관련 서비스업 @ko
definition: This segment includes companies that provide tax return, payroll and bookkeeping services.
notation: 1114141211
valid from: 2014-08-08
valid till: 2020-10-03

Other Professional Services
type: BicsLevel4SubIndustry
type: Classifier
type: NamedIndividual
is sub industry of: Professional Services
is anachronous version of: http://data.ga-group.nl/ics/bics/1711111612
is contemporary version of: http://data.ga-group.nl/ics/bics/11141412
is replaced by: http://data.ga-group.nl/ics/bics/2020/1711111612
is version of: http://data.ga-group.nl/ics/bics/11141412
is version of: http://data.ga-group.nl/ics/bics/1711111612
imported on: 2026-06-08T13:03:47.798Z
last refreshed on: 2026-06-08T13:03:47.798Z
source accessed on: 2019-12-03T20:05:01Z
source last accessed on: 2019-12-03T20:05:01Z
label: Altri serv profess @it
label: Autres srv profess @fr
label: Otros serv profes @es
label: Out serv prof @pt
label: Sonst. prof. Dienste @de
label: Другие проф. услуги @ru
label: その他専門ｻｰﾋﾞｽ @ja
label: 其他专业服务 @zh
label: 其他專業服務 @zh-hant
label: 기타 전문 서비스 @ko
definition: This industry subgroup includes organizations that provide professional services not elsewhere classified.
notation: 11141412
valid from: 2014-08-08
valid till: 2020-10-03

Professional Services
type: BicsLevel3Industry
type: Classifier
type: NamedIndividual
is industry of: Commercial Services
is anachronous version of: http://data.ga-group.nl/ics/bics/17111116
is contemporary version of: http://data.ga-group.nl/ics/bics/111414
is replaced by: http://data.ga-group.nl/ics/bics/2020/17111116
is version of: http://data.ga-group.nl/ics/bics/111414
is version of: http://data.ga-group.nl/ics/bics/17111116
imported on: 2026-06-08T13:03:47.798Z
last refreshed on: 2026-06-08T13:03:47.798Z
source accessed on: 2019-12-03T20:05:01Z
source last accessed on: 2019-12-03T20:05:01Z
label: Prof. Dienste @de
label: Serv profesionales @es
label: Serv professionali @it
label: Serviços prof @pt
label: Services profession. @fr
label: Профессион. услуги @ru
label: 专业服务 @zh
label: 専門職ｻｰﾋﾞｽ @ja
label: 專業服務 @zh-hant
label: 전문 서비스 @ko
definition: This industry includes companies that provide services based on the unique skills and knowledge of their employees, often on an assignment basis, where an individual or a team is responsible for the delivery of services to clients.
notation: 111414
valid from: 2014-08-08
valid till: 2020-10-03

Investigation Services
type: BicsLevel4SubIndustry
type: Classifier
type: NamedIndividual
is sub industry of: Security Services
is anachronous version of: http://data.ga-group.nl/ics/bics/1711111310
is contemporary version of: http://data.ga-group.nl/ics/bics/11141510
is replaced by: http://data.ga-group.nl/ics/bics/2020/1711111310
is version of: http://data.ga-group.nl/ics/bics/11141510
is version of: http://data.ga-group.nl/ics/bics/1711111310
imported on: 2026-06-08T13:03:47.798Z
last refreshed on: 2026-06-08T13:03:47.798Z
source accessed on: 2019-12-03T20:05:01Z
source last accessed on: 2019-12-03T20:05:01Z
label: Ermittlungsdienste @de
label: Serv de investigação @pt
label: Serv investigación @es
label: Serv investigazione @it
label: Services d'enquêtes @fr
label: Следственные услуги @ru
label: 捜査ｻｰﾋﾞｽ業 @ja
label: 調查服務 @zh-hant
label: 调查服务 @zh
label: 수사 서비스 @ko
definition: This industry subgroup includes companies that provide investigation and detective services.
notation: 11141510
valid from: 2014-08-08
valid till: 2020-10-03

Security Guards Services
type: BicsLevel4SubIndustry
type: Classifier
type: NamedIndividual
is sub industry of: Security Services
is anachronous version of: http://data.ga-group.nl/ics/bics/1711111311
is contemporary version of: http://data.ga-group.nl/ics/bics/11141511
is replaced by: http://data.ga-group.nl/ics/bics/2020/1711111311
is version of: http://data.ga-group.nl/ics/bics/11141511
is version of: http://data.ga-group.nl/ics/bics/1711111311
imported on: 2026-06-08T13:03:47.798Z
last refreshed on: 2026-06-08T13:03:47.798Z
source accessed on: 2019-12-03T20:05:01Z
source last accessed on: 2019-12-03T20:05:01Z
label: Serv guardias de seguridad @es
label: Serviços de guardas de segurança @pt
label: Services gardiens de sécurité @fr
label: Servizi guardie sicurezza @it
label: Sicherheitsbediensteter, Dienste @de
label: Охранники и караульная служба @ru
label: 保全服務 @zh-hant
label: 保安服务 @zh
label: 警備ｻｰﾋﾞｽ @ja
label: 보안경비 서비스 @ko
definition: This industry subgroup includes companies that provide guard and patrol services.
notation: 11141511
valid from: 2014-08-08
valid till: 2020-10-03

Security System Services
type: BicsLevel4SubIndustry
type: Classifier
type: NamedIndividual
is sub industry of: Security Services
is anachronous version of: http://data.ga-group.nl/ics/bics/1711111312
is contemporary version of: http://data.ga-group.nl/ics/bics/11141512
is replaced by: http://data.ga-group.nl/ics/bics/2020/1711111312
is version of: http://data.ga-group.nl/ics/bics/11141512
is version of: http://data.ga-group.nl/ics/bics/1711111312
imported on: 2026-06-08T13:03:47.798Z
last refreshed on: 2026-06-08T13:03:47.798Z
source accessed on: 2019-12-03T20:05:01Z
source last accessed on: 2019-12-03T20:05:01Z
label: Serv de sistemas segurança @pt
label: Serv sistemas de seguridad @es
label: Services systèmes de sécurité @fr
label: Servizi sistema sicurezza @it
label: Sicherheitssystemdienste @de
label: Услуги в области систем безопасности @ru
label: 保全系統服務 @zh-hant
label: 保安系统服务 @zh
label: 警備ｼｽﾃﾑｻｰﾋﾞｽ @ja
label: 보안 시스템 서비스 @ko
definition: This industry subgroup includes companies that install, maintain and operate security systems. Typically, these companies provide comprehensive security monitoring and alerting services for commercial and household clients.
notation: 11141512
valid from: 2014-08-08
valid till: 2020-10-03

Security Services
type: BicsLevel3Industry
type: Classifier
type: NamedIndividual
is industry of: Commercial Services
is anachronous version of: http://data.ga-group.nl/ics/bics/17111113
is contemporary version of: http://data.ga-group.nl/ics/bics/111415
is replaced by: http://data.ga-group.nl/ics/bics/2020/17111113
is version of: http://data.ga-group.nl/ics/bics/111415
is version of: http://data.ga-group.nl/ics/bics/17111113
imported on: 2026-06-08T13:03:47.798Z
last refreshed on: 2026-06-08T13:03:47.798Z
source accessed on: 2019-12-03T20:05:01Z
source last accessed on: 2019-12-03T20:05:01Z
label: Serv de segurança @pt
label: Serv seguridad @es
label: Services de sécurité @fr
label: Servizi di sicurezza @it
label: Sicherheitsdienste @de
label: Услуги по охране @ru
label: 保全服務 @zh-hant
label: 保安服务 @zh
label: 警備ｻｰﾋﾞｽ @ja
label: 보안 서비스 @ko
definition: This industry includes companies that provide security services including guard/patrol services, armored car transportation, bodyguards, polygraph testing, security system operation and fingerprinting services.
notation: 111415
valid from: 2014-08-08
valid till: 2020-10-03

Auction Houses & Art Dealers
type: BicsLevel4SubIndustry
type: Classifier
type: NamedIndividual
is sub industry of: Other Commercial Services
is anachronous version of: http://data.ga-group.nl/ics/bics/1711111410
is contemporary version of: http://data.ga-group.nl/ics/bics/11141610
is replaced by: http://data.ga-group.nl/ics/bics/2020/1711111410
is version of: http://data.ga-group.nl/ics/bics/11141610
is version of: http://data.ga-group.nl/ics/bics/1711111410
imported on: 2026-06-08T13:03:47.798Z
last refreshed on: 2026-06-08T13:03:47.798Z
source accessed on: 2019-12-03T20:05:01Z
source last accessed on: 2019-12-03T20:05:01Z
label: Auktionshaus/Kunsthändler @de
label: Casa de leilão/Dealers arte @pt
label: Case d'asta/Mercanti d'arte @it
label: Salles ventes/March. d'art @fr
label: Subastadora/Dealers de arte @es
label: Аукционные дома/Арт-дилеры @ru
label: 拍卖行/艺术经纪人 @zh
label: 拍賣市場/藝術品交易商 @zh-hant
label: 경매회사/아트 딜러 @ko
label: ｵｰｸｼｮﾝﾊｳｽ､美術品ﾃﾞｨｰﾗｰ @ja
definition: This industry subgroup includes companies that operate auction houses, as well as art dealers. Excludes online auction marketplaces (see Electronic Auctions).
notation: 11141610
valid from: 2014-08-08
valid till: 2020-10-03

Convention & Trade Show Org
type: BicsLevel4SubIndustry
type: Classifier
type: NamedIndividual
is sub industry of: Other Commercial Services
is anachronous version of: http://data.ga-group.nl/ics/bics/1711111411
is contemporary version of: http://data.ga-group.nl/ics/bics/11141611
is replaced by: http://data.ga-group.nl/ics/bics/2020/1711111411
is version of: http://data.ga-group.nl/ics/bics/11141611
is version of: http://data.ga-group.nl/ics/bics/1711111411
imported on: 2026-06-08T13:03:47.798Z
last refreshed on: 2026-06-08T13:03:47.798Z
source accessed on: 2019-12-03T20:05:01Z
source last accessed on: 2019-12-03T20:05:01Z
label: Convenc y ferias com e industr @es
label: Kongress- & Messeorganisatoren @de
label: Org congrès/salons @fr
label: Org de convenções e feiras @pt
label: Org fiere comm e convegni @it
label: Организ. собраний и выставок @ru
label: 会议与展会组织者 @zh
label: 會議及商展組織 @zh-hant
label: 컨벤션 & 무역쇼 조직기구 @ko
label: ｺﾝﾍﾞﾝｼｮﾝ､見本市企画運営業 @ja
definition: This industry subgroup includes companies that organize, promote and manage events for business trade shows, conventions and conferences.
notation: 11141611
valid from: 2014-08-08
valid till: 2020-10-03

Geophysical Survey & Map Svcs
type: BicsLevel4SubIndustry
type: Classifier
type: NamedIndividual
is sub industry of: Other Commercial Services
is anachronous version of: http://data.ga-group.nl/ics/bics/1711111412
is contemporary version of: http://data.ga-group.nl/ics/bics/11141612
is replaced by: http://data.ga-group.nl/ics/bics/2020/1711111412
is version of: http://data.ga-group.nl/ics/bics/11141612
is version of: http://data.ga-group.nl/ics/bics/1711111412
imported on: 2026-06-08T13:03:47.798Z
last refreshed on: 2026-06-08T13:03:47.798Z
source accessed on: 2019-12-03T20:05:01Z
source last accessed on: 2019-12-03T20:05:01Z
label: Geophysikalische Studien @de
label: Serv arpentage et carto géophysique @fr
label: Serv de pesquisa geofísica e mapa @pt
label: Serv geofísicos encuestas, mapas @es
label: Serv mappa e rilevamenti geofisici @it
label: Геофизич. услуги, разведка @ru
label: 地球物理测绘服务 @zh
label: 地球物理調査･地図作成ｻｰﾋﾞｽ業 @ja
label: 地質調查及地圖服務 @zh-hant
label: 지구물리학 조사 & 지도 서비스 @ko
definition: This industry subgroup includes companies that gather, interpret and map geophysical data.
notation: 11141612
valid from: 2014-08-08
valid till: 2020-10-03

Interior Design
type: BicsLevel4SubIndustry
type: Classifier
type: NamedIndividual
is sub industry of: Other Commercial Services
is anachronous version of: http://data.ga-group.nl/ics/bics/1711111413
is contemporary version of: http://data.ga-group.nl/ics/bics/11141613
is replaced by: http://data.ga-group.nl/ics/bics/2020/1711111413
is version of: http://data.ga-group.nl/ics/bics/11141613
is version of: http://data.ga-group.nl/ics/bics/1711111413
imported on: 2026-06-08T13:03:47.798Z
last refreshed on: 2026-06-08T13:03:47.798Z
source accessed on: 2019-12-03T20:05:01Z
source last accessed on: 2019-12-03T20:05:01Z
label: Architettura interni @it
label: Design d'intérieur @fr
label: Design de interiores @pt
label: Diseño interior @es
label: Innenarchitektur @de
label: Дизайн интерьера @ru
label: 内装設計ｻｰﾋﾞｽ @ja
label: 室內設計 @zh-hant
label: 室内设计服务 @zh
label: 인테리어 디자인 @ko
definition: This industry subgroup includes companies that create and develop design based on specifications that optimize the appearance, branding, efficiency of interior space through the use of textiles, furniture, color selections and surface finishes.
notation: 11141613
valid from: 2014-08-08
valid till: 2020-10-03

Parking Lots & Garages
type: BicsLevel4SubIndustry
type: Classifier
type: NamedIndividual
is sub industry of: Other Commercial Services
is anachronous version of: http://data.ga-group.nl/ics/bics/1711111414
is contemporary version of: http://data.ga-group.nl/ics/bics/11141614
is replaced by: http://data.ga-group.nl/ics/bics/2020/1711111414
is version of: http://data.ga-group.nl/ics/bics/11141614
is version of: http://data.ga-group.nl/ics/bics/1711111414
imported on: 2026-06-08T13:03:47.798Z
last refreshed on: 2026-06-08T13:03:47.798Z
source accessed on: 2019-12-03T20:05:01Z
source last accessed on: 2019-12-03T20:05:01Z
label: Estacionamentos e garagens @pt
label: Lotes de estacionamiento y garajes @es
label: Parcheggi e garage @it
label: Parkplätze und Garagen @de
label: Stationnements et garages @fr
label: Гаражи и стоянки автомашин @ru
label: 停車場及車庫 @zh-hant
label: 停车场和车库 @zh
label: 駐車場･ｶﾞﾚｰｼﾞ業 @ja
label: 주차장 및 주차건물 @ko
definition: This industry subgroup includes companies that provide parking lot facility management services. These companies provide outsourced parking lot operations for property owners.
notation: 11141614
valid from: 2014-08-08
valid till: 2020-10-03

Testing Laboratories
type: BicsLevel4SubIndustry
type: Classifier
type: NamedIndividual
is sub industry of: Other Commercial Services
is anachronous version of: http://data.ga-group.nl/ics/bics/1711111415
is contemporary version of: http://data.ga-group.nl/ics/bics/11141615
is replaced by: http://data.ga-group.nl/ics/bics/2020/1711111415
is version of: http://data.ga-group.nl/ics/bics/11141615
is version of: http://data.ga-group.nl/ics/bics/1711111415
imported on: 2026-06-08T13:03:47.798Z
last refreshed on: 2026-06-08T13:03:47.798Z
source accessed on: 2019-12-03T20:05:01Z
source last accessed on: 2019-12-03T20:05:01Z
label: Laboratórios de teste @pt
label: Laboratoires d'essai @fr
label: Laboratori verifica @it
label: Laboratorios pruebas @es
label: Testlaboratorien @de
label: Испытательные лаборатории @ru
label: 检测实验室 @zh
label: 測試實驗室 @zh-hant
label: 試験所 @ja
label: 시험 연구업 @ko
definition: This industry subgroup includes companies that perform physical, chemical and other analytical testing services, such as acoustics or vibration testing, biological testing, calibration testing, electrical and electronic testing, mechanical testing, nondestructive testing or thermal testing. The testing may occur in a laboratory or on-site.
notation: 11141615
valid from: 2014-08-08
valid till: 2020-10-03

Uniforms Rental
type: BicsLevel4SubIndustry
type: Classifier
type: NamedIndividual
is sub industry of: Other Commercial Services
is anachronous version of: http://data.ga-group.nl/ics/bics/1711111416
is contemporary version of: http://data.ga-group.nl/ics/bics/11141616
is replaced by: http://data.ga-group.nl/ics/bics/2020/1711111416
is version of: http://data.ga-group.nl/ics/bics/11141616
is version of: http://data.ga-group.nl/ics/bics/1711111416
imported on: 2026-06-08T13:03:47.798Z
last refreshed on: 2026-06-08T13:03:47.798Z
source accessed on: 2019-12-03T20:05:01Z
source last accessed on: 2019-12-03T20:05:01Z
label: Affitto uniformi @it
label: Alquiler de uniformes @es
label: Aluguel de uniformes @pt
label: Location d'uniformes @fr
label: Uniformvermietung @de
label: Прокат форменной одежды @ru
label: 专业制服租赁 @zh
label: 專業制服出租 @zh-hant
label: 業務用制服ﾚﾝﾀﾙ @ja
label: 유니폼 임대업 @ko
definition: This industry subgroup includes companies that rent uniforms products.
notation: 11141616
valid from: 2014-08-08
valid till: 2020-10-03

Misc. Commercial Services
type: BicsLevel4SubIndustry
type: Classifier
type: Discontinued
type: NamedIndividual
is sub industry of: Other Commercial Services
is contemporary version of: http://data.ga-group.nl/ics/bics/11141617
is version of: http://data.ga-group.nl/ics/bics/11141617
imported on: 2026-06-08T13:03:47.798Z
last refreshed on: 2026-06-08T13:03:47.798Z
source accessed on: 2019-12-03T20:05:01Z
source last accessed on: 2019-12-03T20:05:01Z
label: Div serviços comerciais @pt
label: Serv commerciaux divers @fr
label: Servizi commerciali vari @it
label: Varios Servicios comerciales @es
label: Versch. gewerbliche Dienste @de
label: Разл. коммерч. услуги @ru
label: その他商業ｻｰﾋﾞｽ @ja
label: 其他商业服务 @zh
label: 其他商業服務 @zh-hant
label: 기타 상용 서비스 @ko
definition: This industry subgroup includes companies that provide commercial services not elsewhere classified. Includes bartering services, electric/gas meter reading services, diving services and other organizational support services.
notation: 11141617
valid from: 2014-08-08
valid till: 2020-10-03

Other Commercial Services
type: BicsLevel3Industry
type: Classifier
type: NamedIndividual
is industry of: Commercial Services
is anachronous version of: http://data.ga-group.nl/ics/bics/17111114
is contemporary version of: http://data.ga-group.nl/ics/bics/111416
is replaced by: http://data.ga-group.nl/ics/bics/2020/17111114
is version of: http://data.ga-group.nl/ics/bics/111416
is version of: http://data.ga-group.nl/ics/bics/17111114
imported on: 2026-06-08T13:03:47.798Z
last refreshed on: 2026-06-08T13:03:47.798Z
source accessed on: 2019-12-03T20:05:01Z
source last accessed on: 2019-12-03T20:05:01Z
label: Altri servizi commerciali @it
label: Autres serv commerciaux @fr
label: Otros servs comerc @es
label: Outros serv comerc @pt
label: Sonst. gewerbl. Dienste @de
label: Проч. коммерческие услуги @ru
label: その他商業ｻｰﾋﾞｽ @ja
label: 其他商業服務 @zh-hant
label: 기타 상업 서비스 @ko
label: ��他商业服务 @zh
definition: This industry includes companies that provide commercial services not elsewhere classified.
notation: 111416
valid from: 2014-08-08
valid till: 2020-10-03

Commercial Services
type: BicsLevel2IndustryGroup
type: Classifier
type: NamedIndividual
is industry group of: Consumer Discretionary
is anachronous version of: http://data.ga-group.nl/ics/bics/171111
is contemporary version of: http://data.ga-group.nl/ics/bics/1114
is replaced by: http://data.ga-group.nl/ics/bics/2020/171111
is version of: http://data.ga-group.nl/ics/bics/1114
is version of: http://data.ga-group.nl/ics/bics/171111
imported on: 2026-06-08T13:03:47.798Z
last refreshed on: 2026-06-08T13:03:47.798Z
source accessed on: 2019-12-03T20:05:01Z
source last accessed on: 2019-12-03T20:05:01Z
label: Gewerbliche Dienste @de
label: Serviços comerciais @pt
label: Services commerciaux @fr
label: Servicios comerciales @es
label: Servizi commerciali @it
label: Коммерческие услуги @ru
label: 商业服务 @zh
label: 商業服務 @zh-hant
label: 商業ｻｰﾋﾞｽ @ja
label: 상용 서비스 @ko
definition: This industry group includes companies that provide services to primarily commercial customers.
notation: 1114
valid from: 2014-08-08
valid till: 2020-10-03

Consumer Elec & Applc Rental
type: BicsLevel4SubIndustry
type: Classifier
type: NamedIndividual
is sub industry of: Consumer Goods Rental
is anachronous version of: http://data.ga-group.nl/ics/bics/1111101010
is contemporary version of: http://data.ga-group.nl/ics/bics/11151010
is replaced by: http://data.ga-group.nl/ics/bics/2020/1111101010
is version of: http://data.ga-group.nl/ics/bics/1111101010
is version of: http://data.ga-group.nl/ics/bics/11151010
imported on: 2026-06-08T13:03:47.798Z
last refreshed on: 2026-06-08T13:03:47.798Z
source accessed on: 2019-12-03T20:05:01Z
source last accessed on: 2019-12-03T20:05:01Z
label: Affitto elettronica di consumo ed elettrodomestici @it
label: Alquiler aparatos electrodom @es
label: Aluguel elet consumo e eletrod @pt
label: Location appareils électroniques @fr
label: Verbraucherelektronik @de
label: Аренда бытовой электроники и приборов @ru
label: 消費者用電子機器･家電ﾚﾝﾀﾙ業 @ja
label: 消費電子及電器用品出租 @zh-hant
label: 电子品与电器出租 @zh
label: 전자제품 임대업 @ko
definition: This industry subgroup includes companies that rent televisions, stereos, refrigerators, and other consumer electronics equipment and appliances.
notation: 11151010
valid from: 2014-08-08
valid till: 2020-10-03

Formal Wear & Costume Rental
type: BicsLevel4SubIndustry
type: Classifier
type: Discontinued
type: NamedIndividual
is sub industry of: Consumer Goods Rental
is contemporary version of: http://data.ga-group.nl/ics/bics/11151011
is version of: http://data.ga-group.nl/ics/bics/11151011
imported on: 2026-06-08T13:03:47.798Z
last refreshed on: 2026-06-08T13:03:47.798Z
source accessed on: 2019-12-03T20:05:01Z
source last accessed on: 2019-12-03T20:05:01Z
label: Alquiler de ropa formal @es
label: Aluguel de trajes e roupa formal @pt
label: Location de vêtements de cérémonie et de costumes @fr
label: Noleggio di abiti da cerimonia e costumi @it
label: Vermietung von formeller Kleidung und Kostümen @de
label: Прокат костюмов и торжественной одежды @ru
label: 正装及礼服出租 @zh
label: 礼服･衣装ﾚﾝﾀﾙ @ja
label: 禮服及戲服出租 @zh-hant
label: 야외복 및 의류 임대업 @ko
definition: This industry subgroup includes companies that rent formal wear, costumes or other clothing, excluding work uniforms.
notation: 11151011
valid from: 2014-08-08
valid till: 2020-10-03

Home Health Equipment Rental
type: BicsLevel4SubIndustry
type: Classifier
type: NamedIndividual
is sub industry of: Consumer Goods Rental
is anachronous version of: http://data.ga-group.nl/ics/bics/1111101011
is contemporary version of: http://data.ga-group.nl/ics/bics/11151012
is replaced by: http://data.ga-group.nl/ics/bics/2020/1111101011
is version of: http://data.ga-group.nl/ics/bics/1111101011
is version of: http://data.ga-group.nl/ics/bics/11151012
imported on: 2026-06-08T13:03:47.798Z
last refreshed on: 2026-06-08T13:03:47.798Z
source accessed on: 2019-12-03T20:05:01Z
source last accessed on: 2019-12-03T20:05:01Z
label: Alquiler de equipo médico para el hogar @es
label: Aluguel de equipamentos de saúde para o lar @pt
label: Location d'équipement de santé pour domiciles @fr
label: Noleggio di apparecchiature sanitarie per la casa @it
label: Vermietung von Heimfitnessgeräten @de
label: Прокат домашнего медицинского оборудования @ru
label: 家庭用健康機器ﾚﾝﾀﾙ @ja
label: 家用保健设备出租 @zh
label: 家用健康設備出租 @zh-hant
label: 가정용 건강 장비 임대업 @ko
definition: This industry subgroup includes companies that rent wheelchairs, hospital beds, oxygen tanks, walkers, crutches and other home health care equipment.
notation: 11151012
valid from: 2014-08-08
valid till: 2020-10-03

Other Consumer Goods Rental
type: BicsLevel4SubIndustry
type: Classifier
type: Discontinued
type: NamedIndividual
is sub industry of: Consumer Goods Rental
is contemporary version of: http://data.ga-group.nl/ics/bics/11151013
is version of: http://data.ga-group.nl/ics/bics/11151013
imported on: 2026-06-08T13:03:47.798Z
last refreshed on: 2026-06-08T13:03:47.798Z
source accessed on: 2019-12-03T20:05:01Z
source last accessed on: 2019-12-03T20:05:01Z
label: Aluguel de outros bens de consumo @pt
label: Location d'autres biens de consommation @fr
label: Locazione altri beni di consumo @it
label: Otros productos de consumo de alquiler @es
label: Vermietung sonstiger Konsumgüter @de
label: Прокат прочих потребительских товаров @ru
label: その他消費財ﾚﾝﾀﾙ @ja
label: 其他消費品出租 @zh-hant
label: 其他消费品出租 @zh
label: 기타 소비재 임대업 @ko
definition: This industry subgroup includes companies that rent power tools, furniture, tents, helium tanks, portable storage containers, and pallets.
notation: 11151013
valid from: 2014-08-08
valid till: 2020-10-03

Consumer Goods Rental
type: BicsLevel3Industry
type: Classifier
type: NamedIndividual
is industry of: Consumer Services
is anachronous version of: http://data.ga-group.nl/ics/bics/11111010
is contemporary version of: http://data.ga-group.nl/ics/bics/111510
is replaced by: http://data.ga-group.nl/ics/bics/2020/11111010
is version of: http://data.ga-group.nl/ics/bics/11111010
is version of: http://data.ga-group.nl/ics/bics/111510
imported on: 2026-06-08T13:03:47.798Z
last refreshed on: 2026-06-08T13:03:47.798Z
source accessed on: 2019-12-03T20:05:01Z
source last accessed on: 2019-12-03T20:05:01Z
label: Alquiler bienes cons @es
label: Aluguel bens cons @pt
label: Konsumgütervermiet. @de
label: Location biens conso @fr
label: Locazione beni cons @it
label: Потреб. товары, лизинг @ru
label: 消費品出租 @zh-hant
label: 消費財ﾚﾝﾀﾙ @ja
label: 消费品出租 @zh
label: 소비재 임대업 @ko
definition: This industry includes companies that rent various types of consumer goods, such as appliances, formal wear, costumes, fitness equipment and power tools.
notation: 111510
valid from: 2014-08-08
valid till: 2020-10-03

Business & Secretarial Schools
type: BicsLevel4SubIndustry
type: Classifier
type: NamedIndividual
is sub industry of: Educational Services
is anachronous version of: http://data.ga-group.nl/ics/bics/1111101113
is contemporary version of: http://data.ga-group.nl/ics/bics/11151110
is replaced by: http://data.ga-group.nl/ics/bics/2020/1111101113
is version of: http://data.ga-group.nl/ics/bics/1111101113
is version of: http://data.ga-group.nl/ics/bics/11151110
imported on: 2026-06-08T13:03:47.798Z
last refreshed on: 2026-06-08T13:03:47.798Z
source accessed on: 2019-12-03T20:05:01Z
source last accessed on: 2019-12-03T20:05:01Z
label: Ecoles de commerce et de secrétariat @fr
label: Escolas de secretariado e comércio @pt
label: Escuelas de administración y de secretarias @es
label: Scuole commerciali e per segretarie @it
label: Wirtschafts- & Sekretariatsfachschulen @de
label: Школы бизнеса и подготовки секретарей @ru
label: 商务和秘书学校 @zh
label: 商業及秘書學校 @zh-hant
label: 경영학 & 비서학 교육기관 @ko
label: ﾋﾞｼﾞﾈｽ･秘書学校 @ja
definition: This industry subgroup includes companies that offer courses in basic business skills, such as word processing, communication and presentation skills.
notation: 11151110
valid from: 2014-08-08
valid till: 2020-10-03

College, University & Pro Schools
type: BicsLevel4SubIndustry
type: Classifier
type: NamedIndividual
is sub industry of: Educational Services
is anachronous version of: http://data.ga-group.nl/ics/bics/1111101112
is contemporary version of: http://data.ga-group.nl/ics/bics/11151111
is replaced by: http://data.ga-group.nl/ics/bics/2020/1111101112
is version of: http://data.ga-group.nl/ics/bics/1111101112
is version of: http://data.ga-group.nl/ics/bics/11151111
imported on: 2026-06-08T13:03:47.798Z
last refreshed on: 2026-06-08T13:03:47.798Z
source accessed on: 2019-12-03T20:05:01Z
source last accessed on: 2019-12-03T20:05:01Z
label: Collèges, universités et écoles prof @fr
label: College, università e scuole prof @it
label: Colleges, Universitäten & Berufsschulen @de
label: Faculdades, universidades e escolas prof @pt
label: Universidades y escuelas de educación terciaria @es
label: Колледжи, университеты и проф. школы @ru
label: 大学･総合大学･専門学校 @ja
label: 大專、大學及職業學校 @zh-hant
label: 学院、大学及专科学校 @zh
label: 전문대, 대학교 & 직업학교 @ko
definition: This industry subgroup includes companies that offer academic courses that lead to degrees at the baccalaureate or graduate level.
notation: 11151111
valid from: 2014-08-08
valid till: 2020-10-03

Elementary Schools
type: BicsLevel4SubIndustry
type: Classifier
type: NamedIndividual
is sub industry of: Educational Services
is anachronous version of: http://data.ga-group.nl/ics/bics/1111101110
is contemporary version of: http://data.ga-group.nl/ics/bics/11151112
is replaced by: http://data.ga-group.nl/ics/bics/2020/1111101110
is version of: http://data.ga-group.nl/ics/bics/1111101110
is version of: http://data.ga-group.nl/ics/bics/11151112
imported on: 2026-06-08T13:03:47.798Z
last refreshed on: 2026-06-08T13:03:47.798Z
source accessed on: 2019-12-03T20:05:01Z
source last accessed on: 2019-12-03T20:05:01Z
label: Ecoles primaires @fr
label: Escolas de ensino básico @pt
label: Escuelas prim secund @es
label: Grundschulen @de
label: Scuole elementari @it
label: Начальные школы @ru
label: 小学及中学 @zh
label: 小学校 @ja
label: 小學 @zh-hant
label: 초등학교및중학교 @ko
definition: This industry subgroup includes companies that offer basic preparatory education.
notation: 11151112
valid from: 2014-08-08
valid till: 2020-10-03

Junior Colleges
type: BicsLevel4SubIndustry
type: Classifier
type: NamedIndividual
is sub industry of: Educational Services
is anachronous version of: http://data.ga-group.nl/ics/bics/1111101111
is contemporary version of: http://data.ga-group.nl/ics/bics/11151113
is replaced by: http://data.ga-group.nl/ics/bics/2020/1111101111
is version of: http://data.ga-group.nl/ics/bics/1111101111
is version of: http://data.ga-group.nl/ics/bics/11151113
imported on: 2026-06-08T13:03:47.798Z
last refreshed on: 2026-06-08T13:03:47.798Z
source accessed on: 2019-12-03T20:05:01Z
source last accessed on: 2019-12-03T20:05:01Z
label: Biennio universitario @it
label: Collèges communau. @fr
label: Escuelas postbachill @es
label: Faculdades júnior @pt
label: US Junior Colleges @de
label: Двухгодичные колледжи @ru
label: 大专 @zh
label: 大学(短期大学) @ja
label: 專科學校 @zh-hant
label: 초급대학 @ko
definition: This industry subgroup includes companies that offer academic courses that lead to associate degrees, certificates, or diplomas below the baccalaureate level.
notation: 11151113
valid from: 2014-08-08
valid till: 2020-10-03

Language Schools
type: BicsLevel4SubIndustry
type: Classifier
type: NamedIndividual
is sub industry of: Educational Services
is anachronous version of: http://data.ga-group.nl/ics/bics/1111101114
is contemporary version of: http://data.ga-group.nl/ics/bics/11151114
is replaced by: http://data.ga-group.nl/ics/bics/2020/1111101114
is version of: http://data.ga-group.nl/ics/bics/1111101114
is version of: http://data.ga-group.nl/ics/bics/11151114
imported on: 2026-06-08T13:03:47.798Z
last refreshed on: 2026-06-08T13:03:47.798Z
source accessed on: 2019-12-03T20:05:01Z
source last accessed on: 2019-12-03T20:05:01Z
label: Ecoles de langues @fr
label: Escolas de idiomas @pt
label: Escuelas de idiomas @es
label: Scuole di lingua @it
label: Sprachschulen @de
label: Школы по изучению иностр. языков @ru
label: 語学学校 @ja
label: 語言學校 @zh-hant
label: 语言学校 @zh
label: 언어 학원 @ko
definition: This industry subgroup includes companies that offer foreign language courses.
notation: 11151114
valid from: 2014-08-08
valid till: 2020-10-03

Other Schools
type: BicsLevel4SubIndustry
type: Classifier
type: Discontinued
type: NamedIndividual
is sub industry of: Educational Services
is contemporary version of: http://data.ga-group.nl/ics/bics/11151115
is version of: http://data.ga-group.nl/ics/bics/11151115
imported on: 2026-06-08T13:03:47.798Z
last refreshed on: 2026-06-08T13:03:47.798Z
source accessed on: 2019-12-03T20:05:01Z
source last accessed on: 2019-12-03T20:05:01Z
label: Altre scuole @it
label: Autres écoles @fr
label: Otras escuelas @es
label: Outras escolas @pt
label: Sonstige Schulen @de
label: Пр. школы @ru
label: その他学校 @ja
label: 其他学校 @zh
label: 其他學校 @zh-hant
label: 기타 학교 @ko
definition: This industry subgroup includes companies that offer educational services not elsewhere classified.
notation: 11151115
valid from: 2014-08-08
valid till: 2020-10-03

Educational Services
type: BicsLevel3Industry
type: Classifier
type: NamedIndividual
is industry of: Consumer Services
is anachronous version of: http://data.ga-group.nl/ics/bics/11111011
is contemporary version of: http://data.ga-group.nl/ics/bics/111511
is replaced by: http://data.ga-group.nl/ics/bics/2020/11111011
is version of: http://data.ga-group.nl/ics/bics/11111011
is version of: http://data.ga-group.nl/ics/bics/111511
imported on: 2026-06-08T13:03:47.798Z
last refreshed on: 2026-06-08T13:03:47.798Z
source accessed on: 2019-12-03T20:05:01Z
source last accessed on: 2019-12-03T20:05:01Z
label: Bildungsdienste @de
label: Serv educacionais @pt
label: Service enseignement @fr
label: Servicios educativos @es
label: Servizi istruzione @it
label: Услуги образования @ru
label: 教育服务 @zh
label: 教育服務 @zh-hant
label: 教育ｻｰﾋﾞｽ @ja
label: 교육 서비스 @ko
definition: This industry includes companies that provide instruction and training in a variety of social, business and language sciences and subjects. The instruction and training could be delivered on a full-time, part-time, distance learning and occasional basis through establishments, such as schools, colleges, universities and professional institutes.
notation: 111511
valid from: 2014-08-08
valid till: 2020-10-03

Cemeteries & Crematories
type: BicsLevel4SubIndustry
type: Classifier
type: NamedIndividual
is sub industry of: Funeral Services
is anachronous version of: http://data.ga-group.nl/ics/bics/1111101211
is contemporary version of: http://data.ga-group.nl/ics/bics/11151210
is replaced by: http://data.ga-group.nl/ics/bics/2020/1111101211
is version of: http://data.ga-group.nl/ics/bics/1111101211
is version of: http://data.ga-group.nl/ics/bics/11151210
imported on: 2026-06-08T13:03:47.798Z
last refreshed on: 2026-06-08T13:03:47.798Z
source accessed on: 2019-12-03T20:05:01Z
source last accessed on: 2019-12-03T20:05:01Z
label: Cementerios/crematorios @es
label: Cemitérios/crematórios @pt
label: Cimetières et crématoriums @fr
label: Cimiteri e crematori @it
label: Friedhöfe & Krematorien @de
label: Кладбища и крематории @ru
label: 墓地与火葬场 @zh
label: 墓地及火葬場 @zh-hant
label: 墓地･火葬業 @ja
label: 묘지 및 화장업 @ko
definition: This industry subgroup includes companies that operate cemeteries and crematories.
notation: 11151210
valid from: 2014-08-08
valid till: 2020-10-03

Funeral Homes & Services
type: BicsLevel4SubIndustry
type: Classifier
type: NamedIndividual
is sub industry of: Funeral Services
is anachronous version of: http://data.ga-group.nl/ics/bics/1111101210
is contemporary version of: http://data.ga-group.nl/ics/bics/11151211
is replaced by: http://data.ga-group.nl/ics/bics/2020/1111101210
is version of: http://data.ga-group.nl/ics/bics/1111101210
is version of: http://data.ga-group.nl/ics/bics/11151211
imported on: 2026-06-08T13:03:47.798Z
last refreshed on: 2026-06-08T13:03:47.798Z
source accessed on: 2019-12-03T20:05:01Z
source last accessed on: 2019-12-03T20:05:01Z
label: Bestattungsinstitute & Beerdigungsdienste @de
label: Salons et services funéraires @fr
label: Serv funerários e funerárias @pt
label: Servizi e pompe funebri @it
label: Servs de funerarias @es
label: Похоронные дома и услуги @ru
label: 殡仪馆和葬礼服务 @zh
label: 殯儀館及服務 @zh-hant
label: 葬儀屋･葬儀ｻｰﾋﾞｽ業 @ja
label: 장례식장 & 장의업 @ko
definition: This industry subgroup includes companies that provide funeral services.
notation: 11151211
valid from: 2014-08-08
valid till: 2020-10-03

Funeral Services
type: BicsLevel3Industry
type: Classifier
type: NamedIndividual
is industry of: Consumer Services
is anachronous version of: http://data.ga-group.nl/ics/bics/11111012
is contemporary version of: http://data.ga-group.nl/ics/bics/111512
is replaced by: http://data.ga-group.nl/ics/bics/2020/11111012
is version of: http://data.ga-group.nl/ics/bics/11111012
is version of: http://data.ga-group.nl/ics/bics/111512
imported on: 2026-06-08T13:03:47.798Z
last refreshed on: 2026-06-08T13:03:47.798Z
source accessed on: 2019-12-03T20:05:01Z
source last accessed on: 2019-12-03T20:05:01Z
label: Bestattungsdienste @de
label: Serviços funerários @pt
label: Services de pompes funèbres @fr
label: Servicios funerarios @es
label: Servizi pompe funebri @it
label: Похоронные услуги @ru
label: 殯葬服務 @zh-hant
label: 葬儀ｻｰﾋﾞｽ @ja
label: 葬礼服务 @zh
label: 장례 서비스 @ko
definition: This industry includes companies that provide services for burial or incineration of human or animal corpses. Includes mortician services, burial plots, tombs and grave stones.
notation: 111512
valid from: 2014-08-08
valid till: 2020-10-03

Non-Profit Organization
type: BicsLevel3Industry
type: Classifier
type: NamedIndividual
is industry of: Consumer Services
is anachronous version of: http://data.ga-group.nl/ics/bics/11111013
is contemporary version of: http://data.ga-group.nl/ics/bics/111513
is replaced by: http://data.ga-group.nl/ics/bics/2020/11111013
is version of: http://data.ga-group.nl/ics/bics/11111013
is version of: http://data.ga-group.nl/ics/bics/111513
imported on: 2026-06-08T13:03:47.798Z
last refreshed on: 2026-06-08T13:03:47.798Z
source accessed on: 2019-12-03T20:05:01Z
source last accessed on: 2019-12-03T20:05:01Z
label: Gemeinnützige Organisation @de
label: Instituição sem fins lucrativos @pt
label: Organisations à but non lucratif @fr
label: Organizaciones sin fines de lucro @es
label: Organizzazioni non-profit @it
label: Некоммерческие организации @ru
label: 非営利慈善事業 @ja
label: 非盈利組織 @zh-hant
label: 非营利机构 @zh
label: 비영리기관 @ko
definition: This industry includes organizations that do not have owners. Revenues generated by the organization will be used to continue and expand operations.
notation: 111513
valid from: 2014-08-08
valid till: 2020-10-03

Beauty Salons
type: BicsLevel4SubIndustry
type: Classifier
type: NamedIndividual
is sub industry of: Personal Care Services
is anachronous version of: http://data.ga-group.nl/ics/bics/1111101410
is contemporary version of: http://data.ga-group.nl/ics/bics/11151410
is replaced by: http://data.ga-group.nl/ics/bics/2020/1111101410
is version of: http://data.ga-group.nl/ics/bics/1111101410
is version of: http://data.ga-group.nl/ics/bics/11151410
imported on: 2026-06-08T13:03:47.798Z
last refreshed on: 2026-06-08T13:03:47.798Z
source accessed on: 2019-12-03T20:05:01Z
source last accessed on: 2019-12-03T20:05:01Z
label: Parrucchieri @it
label: Salões de beleza @pt
label: Salones de belleza @es
label: Salons de beauté @fr
label: Schönheitssalons @de
label: Салоны красоты @ru
label: 美容業 @ja
label: 美容沙龍 @zh-hant
label: 美容院 @zh
label: 미용업 @ko
definition: This industry subgroup includes stores that provide haircutting, washing, setting, dyeing, tinting, straightening and styling.
notation: 11151410
valid from: 2014-08-08
valid till: 2020-10-03

Weight Management Services
type: BicsLevel4SubIndustry
type: Classifier
type: NamedIndividual
is sub industry of: Personal Care Services
is anachronous version of: http://data.ga-group.nl/ics/bics/1111101411
is contemporary version of: http://data.ga-group.nl/ics/bics/11151411
is replaced by: http://data.ga-group.nl/ics/bics/2020/1111101411
is version of: http://data.ga-group.nl/ics/bics/1111101411
is version of: http://data.ga-group.nl/ics/bics/11151411
imported on: 2026-06-08T13:03:47.798Z
last refreshed on: 2026-06-08T13:03:47.798Z
source accessed on: 2019-12-03T20:05:01Z
source last accessed on: 2019-12-03T20:05:01Z
label: Gewichtsmanagement @de
label: Serv manutenção de peso @pt
label: Services contrôle du poids @fr
label: Servicios de control de peso @es
label: Servizi controllo peso @it
label: Услуги по оптимизации веса @ru
label: 体重管理服务 @zh
label: 体重管理ｻｰﾋﾞｽ @ja
label: 體重管理服務 @zh-hant
label: 체중관리 서비스 @ko
definition: This industry subgroup includes companies that offer a weight loss program that may include prepared meals, exercise programs and calorie control methods, while keeping meals nutritionally balanced.
notation: 11151411
valid from: 2014-08-08
valid till: 2020-10-03

Personal Care Services
type: BicsLevel3Industry
type: Classifier
type: NamedIndividual
is industry of: Consumer Services
is anachronous version of: http://data.ga-group.nl/ics/bics/11111014
is contemporary version of: http://data.ga-group.nl/ics/bics/111514
is replaced by: http://data.ga-group.nl/ics/bics/2020/11111014
is version of: http://data.ga-group.nl/ics/bics/11111014
is version of: http://data.ga-group.nl/ics/bics/111514
imported on: 2026-06-08T13:03:47.798Z
last refreshed on: 2026-06-08T13:03:47.798Z
source accessed on: 2019-12-03T20:05:01Z
source last accessed on: 2019-12-03T20:05:01Z
label: Körperpflegedienste @de
label: Serv cuidados pessoais @pt
label: Services soins personnels @fr
label: Servicios personales @es
label: Servizi cura personale @it
label: Услуги по уходу за собой @ru
label: 个人护理服务 @zh
label: 個人保健服務 @zh-hant
label: 개인관리 서비스 @ko
label: ﾊﾟｰｿﾅﾙｹｱ･ｻｰﾋﾞｽ @ja
definition: This industry includes companies that provide services for personal wellness, including beauty salons and weight management services. This industry does not include fitness centers (see Fitness & Recreation Centers).
notation: 111514
valid from: 2014-08-08
valid till: 2020-10-03

Photo Printing Services
type: BicsLevel4SubIndustry
type: Classifier
type: NamedIndividual
is sub industry of: Photography Services
is anachronous version of: http://data.ga-group.nl/ics/bics/1111101511
is contemporary version of: http://data.ga-group.nl/ics/bics/11151510
is replaced by: http://data.ga-group.nl/ics/bics/2020/1111101511
is version of: http://data.ga-group.nl/ics/bics/1111101511
is version of: http://data.ga-group.nl/ics/bics/11151510
imported on: 2026-06-08T13:03:47.798Z
last refreshed on: 2026-06-08T13:03:47.798Z
source accessed on: 2019-12-03T20:05:01Z
source last accessed on: 2019-12-03T20:05:01Z
label: Fotodruckdienste @de
label: Serv impresión fotos @es
label: Serviços de revelação de fotos @pt
label: Servizi sviluppo foto @it
label: Tirage de photos @fr
label: Услуги печати фотографий @ru
label: 写真現像･焼付業 @ja
label: 照片冲印服务 @zh
label: 相片沖印服務 @zh-hant
label: 사진 현상 서비스 @ko
definition: This industry subgroup includes companies that specialize in film development, processing, enlargement and printing. These companies may process photos for commercial or retail clients. Excludes companies that are involved in photography activities (see Photography Studios).
notation: 11151510
valid from: 2014-08-08
valid till: 2020-10-03

Photography Studios
type: BicsLevel4SubIndustry
type: Classifier
type: NamedIndividual
is sub industry of: Photography Services
is anachronous version of: http://data.ga-group.nl/ics/bics/1111101510
is contemporary version of: http://data.ga-group.nl/ics/bics/11151511
is replaced by: http://data.ga-group.nl/ics/bics/2020/1111101510
is version of: http://data.ga-group.nl/ics/bics/1111101510
is version of: http://data.ga-group.nl/ics/bics/11151511
imported on: 2026-06-08T13:03:47.798Z
last refreshed on: 2026-06-08T13:03:47.798Z
source accessed on: 2019-12-03T20:05:01Z
source last accessed on: 2019-12-03T20:05:01Z
label: Estúdios de fotografia @pt
label: Estudio fotográfico @es
label: Foto-Studio @de
label: Studi fotografici @it
label: Studios de photographie @fr
label: Фотостудии @ru
label: 写真ｽﾀｼﾞｵ @ja
label: 摄影工作室 @zh
label: 攝影工作室 @zh-hant
label: 사진 스튜디오 @ko
definition: This industry subgroup includes companies that operate photography studios or provide on-site photography services for memorable events. These companies may also process and print these photos in various merchandise formats.
notation: 11151511
valid from: 2014-08-08
valid till: 2020-10-03

Photography Services
type: BicsLevel3Industry
type: Classifier
type: NamedIndividual
is industry of: Consumer Services
is anachronous version of: http://data.ga-group.nl/ics/bics/11111015
is contemporary version of: http://data.ga-group.nl/ics/bics/111515
is replaced by: http://data.ga-group.nl/ics/bics/2020/11111015
is version of: http://data.ga-group.nl/ics/bics/11111015
is version of: http://data.ga-group.nl/ics/bics/111515
imported on: 2026-06-08T13:03:47.798Z
last refreshed on: 2026-06-08T13:03:47.798Z
source accessed on: 2019-12-03T20:05:01Z
source last accessed on: 2019-12-03T20:05:01Z
label: Fotografiedienste @de
label: Serviços de fotografia @pt
label: Services de photographie @fr
label: Servicio de fotografía @es
label: Servizi totografici @it
label: Фотоуслуги @ru
label: 写真現像店 @ja
label: 摄影服务 @zh
label: 相片沖印服務 @zh-hant
label: 사진 서비스 @ko
definition: This industry includes companies that offer portrait and video photography of memorable events, such as weddings and school graduations. Includes developing and printing services that utilize the photo in a retail product like picture books, cards and coffee mugs.
notation: 111515
valid from: 2014-08-08
valid till: 2020-10-03

Consumer Goods Repair & Maint
type: BicsLevel4SubIndustry
type: Classifier
type: NamedIndividual
is sub industry of: Other Consumer Services
is anachronous version of: http://data.ga-group.nl/ics/bics/1111101810
is contemporary version of: http://data.ga-group.nl/ics/bics/11151610
is replaced by: http://data.ga-group.nl/ics/bics/2020/1111101810
is version of: http://data.ga-group.nl/ics/bics/1111101810
is version of: http://data.ga-group.nl/ics/bics/11151610
imported on: 2026-06-08T13:03:47.798Z
last refreshed on: 2026-06-08T13:03:47.798Z
source accessed on: 2019-12-03T20:05:01Z
source last accessed on: 2019-12-03T20:05:01Z
label: Entretien/répar biens de consommation @fr
label: Konsumgüter, Rep. & Wartung @de
label: Reparación y mantenimiento bienes de consumo @es
label: Reparos e manut de bens pessoais @pt
label: Riparazione e manut beni consumo @it
label: Ремонт и обслуж. потребит. товаров @ru
label: 個人･家庭用品修理･ﾒﾝﾃﾅﾝｽ業 @ja
label: 消費用品維修及保養 @zh-hant
label: 消费品修理与维护 @zh
label: 소비재 수리 & 유지보수 @ko
definition: This industry subgroup includes companies that provide repair and maintenance services for consumer goods, such as household appliances, watches and consumer electronics. These services may be offered for retail or commercial customers.
notation: 11151610
valid from: 2014-08-08
valid till: 2020-10-03

Laundry Services
type: BicsLevel4SubIndustry
type: Classifier
type: NamedIndividual
is sub industry of: Other Consumer Services
is anachronous version of: http://data.ga-group.nl/ics/bics/1111101811
is contemporary version of: http://data.ga-group.nl/ics/bics/11151611
is replaced by: http://data.ga-group.nl/ics/bics/2020/1111101811
is version of: http://data.ga-group.nl/ics/bics/1111101811
is version of: http://data.ga-group.nl/ics/bics/11151611
imported on: 2026-06-08T13:03:47.798Z
last refreshed on: 2026-06-08T13:03:47.798Z
source accessed on: 2019-12-03T20:05:01Z
source last accessed on: 2019-12-03T20:05:01Z
label: Serviços de lavanderia @pt
label: Services de blanchissage @fr
label: Servicios de lavandería @es
label: Servizi di lavanderia @it
label: Wäschereidienste @de
label: Услуги прачечной @ru
label: 干洗服务 @zh
label: 洗濯業 @ja
label: 洗衣服務 @zh-hant
label: 세탁 서비스 @ko
definition: This industry subgroup includes companies that provide laundering or dry cleaning services. These companies may operate self-service laundromats or provide outsourced linen and garment cleaning services for commercial customers.
notation: 11151611
valid from: 2014-08-08
valid till: 2020-10-03

Other Consumer Services
type: BicsLevel3Industry
type: Classifier
type: NamedIndividual
is industry of: Consumer Services
is anachronous version of: http://data.ga-group.nl/ics/bics/11111018
is contemporary version of: http://data.ga-group.nl/ics/bics/111516
is replaced by: http://data.ga-group.nl/ics/bics/2020/11111018
is version of: http://data.ga-group.nl/ics/bics/11111018
is version of: http://data.ga-group.nl/ics/bics/111516
imported on: 2026-06-08T13:03:47.798Z
last refreshed on: 2026-06-08T13:03:47.798Z
source accessed on: 2019-12-03T20:05:01Z
source last accessed on: 2019-12-03T20:05:01Z
label: Altri servizi consumatore @it
label: Autres services aux consomm @fr
label: Otros servicios al consumidor @es
label: Outros serv ao consumidor @pt
label: Sonstige Verbraucherdienste @de
label: Проч. потребительские услуги @ru
label: その他消費者ｻｰﾋﾞｽ @ja
label: 其他消費者服務 @zh-hant
label: 其他消费服务 @zh
label: 기타 고객 서비스 @ko
definition: This industry includes companies that provide laundry services, consumer goods repair services and consumer services not elsewhere classified.
notation: 111516
valid from: 2014-08-08
valid till: 2020-10-03

Consumer Services
type: BicsLevel2IndustryGroup
type: Classifier
type: NamedIndividual
is industry group of: Consumer Discretionary
is anachronous version of: http://data.ga-group.nl/ics/bics/111110
is contemporary version of: http://data.ga-group.nl/ics/bics/1115
is replaced by: http://data.ga-group.nl/ics/bics/2020/111110
is version of: http://data.ga-group.nl/ics/bics/111110
is version of: http://data.ga-group.nl/ics/bics/1115
imported on: 2026-06-08T13:03:47.798Z
last refreshed on: 2026-06-08T13:03:47.798Z
source accessed on: 2019-12-03T20:05:01Z
source last accessed on: 2019-12-03T20:05:01Z
label: Serv ao consumidor @pt
label: Services aux consomm @fr
label: Servicios al consumidor @es
label: Servizi consumatore @it
label: Verbraucherdienste @de
label: Потребительские услуги @ru
label: 消費者服務 @zh-hant
label: 消費者ｻｰﾋﾞｽ @ja
label: 消费者服务 @zh
label: 고객 서비스 @ko
definition: This industry group includes companies that provide services to retail consumers.
notation: 1115
valid from: 2014-08-08
valid till: 2020-10-03

Casinos
type: BicsLevel4SubIndustry
type: Classifier
type: NamedIndividual
is sub industry of: Casinos & Gaming
is anachronous version of: http://data.ga-group.nl/ics/bics/1111111010
is contemporary version of: http://data.ga-group.nl/ics/bics/11161010
is replaced by: http://data.ga-group.nl/ics/bics/2020/1111111010
is version of: http://data.ga-group.nl/ics/bics/1111111010
is version of: http://data.ga-group.nl/ics/bics/11161010
imported on: 2026-06-08T13:03:47.798Z
last refreshed on: 2026-06-08T13:03:47.798Z
source accessed on: 2019-12-03T20:05:01Z
source last accessed on: 2019-12-03T20:05:01Z
label: Casino' @it
label: Casinos (no hoteles) @es
label: Kasinos @de
label: Казино @ru
label: 賭場(賭場飯店除外) @zh-hant
label: 赌场(除赌场旅馆外) @zh
label: 카지노 @ko
label: ｶｼﾞﾉ @ja
definition: This industry subgroup includes companies that own and operate facilities that host gambling operations, such as coin-operated gambling machines, wagering at table games, off-track betting and certain floating facilities like riverboats. Excludes operations of cruise ships (see Cruise Lines).
notation: 11161010
valid from: 2014-08-08
valid till: 2020-10-03

Gaming Equipment Mfg
type: BicsLevel5Segment
type: Classifier
type: Discontinued
type: NamedIndividual
is level5 segment of: Gaming Equipment
is contemporary version of: http://data.ga-group.nl/ics/bics/1116101110
is version of: http://data.ga-group.nl/ics/bics/1116101110
imported on: 2026-06-08T13:03:47.798Z
last refreshed on: 2026-06-08T13:03:47.798Z
source accessed on: 2019-12-03T20:05:01Z
source last accessed on: 2019-12-03T20:05:01Z
label: App giochi-Manif @it
label: Fab d'équipement de jeu @fr
label: Fab de equipo de juegos @es
label: Fabr de equipamento para jogos @pt
label: Herstellung von Gaming-Equipment @de
label: Произв. игрового оборуд. @ru
label: 博弈設備製造 @zh-hant
label: 博彩设备制造 @zh
label: 게임 장비 제조업 @ko
label: ｹﾞｰﾐﾝｸﾞ機器製造 @ja
definition: This segment includes companies that manufacture mechanical or electronic equipment utilized for gambling purposes. Also includes manufactures of these components as well as computerized gaming systems. Typically, this equipment is regulated by government regulations. Includes slot machines, pachinko machines, lottery machines, race booking equipment and gambling revenue monitoring equipment.
notation: 1116101110
valid from: 2014-08-08
valid till: 2020-10-03

Gaming Equipment Leasing
type: BicsLevel5Segment
type: Classifier
type: Discontinued
type: NamedIndividual
is level5 segment of: Gaming Equipment
is contemporary version of: http://data.ga-group.nl/ics/bics/1116101111
is version of: http://data.ga-group.nl/ics/bics/1116101111
imported on: 2026-06-08T13:03:47.798Z
last refreshed on: 2026-06-08T13:03:47.798Z
source accessed on: 2019-12-03T20:05:01Z
source last accessed on: 2019-12-03T20:05:01Z
label: App giochi-Lease @it
label: Arrendamento de equipamentos para jogos @pt
label: Arrendamiento de equipo de juegos @es
label: Leasing von Gaming-Equipment @de
label: Location d'équipement de jeu @fr
label: Аренда игрового оборуд. @ru
label: 博弈設備租賃 @zh-hant
label: 博彩设备租赁 @zh
label: 게임 장비 리스 @ko
label: ｹﾞｰﾐﾝｸﾞ機器ﾘｰｽ @ja
definition: This segment includes companies that lease gaming equipment to customers. Excludes capital leasing of gambling machines (see Commercial Finance).
notation: 1116101111
valid from: 2014-08-08
valid till: 2020-10-03

Gaming Equipment
type: BicsLevel4SubIndustry
type: Classifier
type: NamedIndividual
is sub industry of: Casinos & Gaming
is anachronous version of: http://data.ga-group.nl/ics/bics/1111111011
is contemporary version of: http://data.ga-group.nl/ics/bics/11161011
is replaced by: http://data.ga-group.nl/ics/bics/2020/1111111011
is version of: http://data.ga-group.nl/ics/bics/1111111011
is version of: http://data.ga-group.nl/ics/bics/11161011
imported on: 2026-06-08T13:03:47.798Z
last refreshed on: 2026-06-08T13:03:47.798Z
source accessed on: 2019-12-03T20:05:01Z
source last accessed on: 2019-12-03T20:05:01Z
label: Apparecchiature giochi @it
label: Equipamentos para jogos @pt
label: Equipement de jeu @fr
label: Equipo de juegos @es
label: Gaming-Equipment @de
label: Игровое оборудование @ru
label: 博弈設備 @zh-hant
label: 博彩设备 @zh
label: 게임 장비 @ko
label: ｹﾞｰﾐﾝｸﾞ機器 @ja
definition: This industry subgroup includes companies that manufacture or lease gaming equipment.
notation: 11161011
valid from: 2014-08-08
valid till: 2020-10-03

Mobile & Online Gambling
type: BicsLevel4SubIndustry
type: Classifier
type: NamedIndividual
is sub industry of: Casinos & Gaming
is anachronous version of: http://data.ga-group.nl/ics/bics/1111111012
is contemporary version of: http://data.ga-group.nl/ics/bics/11161012
is replaced by: http://data.ga-group.nl/ics/bics/2020/1111111012
is version of: http://data.ga-group.nl/ics/bics/1111111012
is version of: http://data.ga-group.nl/ics/bics/11161012
imported on: 2026-06-08T13:03:47.798Z
last refreshed on: 2026-06-08T13:03:47.798Z
source accessed on: 2019-12-03T20:05:01Z
source last accessed on: 2019-12-03T20:05:01Z
label: Apuestas en línea y móviles @es
label: Gioco d'azzardo online e mobile @it
label: Jeux sur appareils mobiles et en ligne @fr
label: Jogos de apostas online @pt
label: Mobiles & Online-Glücksspiel @de
label: Мобильные и онлайн азартные игры @ru
label: 移动电话及在线赌博 @zh
label: 行動及線上博奕 @zh-hant
label: 모바일 & 온라인 도박 @ko
label: ｵﾝﾗｲﾝｷﾞｬﾝﾌﾞﾙ @ja
definition: This industry subgroup includes companies that provide gambling services through Internet or mobile devices.
notation: 11161012
valid from: 2014-08-08
valid till: 2020-10-03

Lottery Services
type: BicsLevel4SubIndustry
type: Classifier
type: NamedIndividual
is sub industry of: Casinos & Gaming
is anachronous version of: http://data.ga-group.nl/ics/bics/1111111013
is contemporary version of: http://data.ga-group.nl/ics/bics/11161013
is replaced by: http://data.ga-group.nl/ics/bics/2020/1111111013
is version of: http://data.ga-group.nl/ics/bics/1111111013
is version of: http://data.ga-group.nl/ics/bics/11161013
imported on: 2026-06-08T13:03:47.798Z
last refreshed on: 2026-06-08T13:03:47.798Z
source accessed on: 2019-12-03T20:05:01Z
source last accessed on: 2019-12-03T20:05:01Z
label: Lotteriedienstleistungen @de
label: Serviços lotéricos @pt
label: Services de lotterie @fr
label: Servicios de lotería @es
label: Servizi lotteria @it
label: Услуги лотереи @ru
label: 宝くじｻｰﾋﾞｽ @ja
label: 彩券服務 @zh-hant
label: 彩票服务 @zh
label: 복권 서비스 @ko
definition: This industry subgroup includes companies that operate establishments, other than retail stores, that sell lottery tickets.
notation: 11161013
valid from: 2014-08-08
valid till: 2020-10-03

Racetracks
type: BicsLevel4SubIndustry
type: Classifier
type: NamedIndividual
is sub industry of: Casinos & Gaming
is anachronous version of: http://data.ga-group.nl/ics/bics/1111111014
is contemporary version of: http://data.ga-group.nl/ics/bics/11161014
is replaced by: http://data.ga-group.nl/ics/bics/2020/1111111014
is version of: http://data.ga-group.nl/ics/bics/1111111014
is version of: http://data.ga-group.nl/ics/bics/11161014
imported on: 2026-06-08T13:03:47.798Z
last refreshed on: 2026-06-08T13:03:47.798Z
source accessed on: 2019-12-03T20:05:01Z
source last accessed on: 2019-12-03T20:05:01Z
label: Champs de course @fr
label: Circuitos carreras @es
label: Pistas de corrida @pt
label: Piste @it
label: Rennbahnen @de
label: Гоночные треки @ru
label: 賽場 @zh-hant
label: 赛马 @zh
label: 레이스장 @ko
label: ﾚｰｽ場 @ja
definition: This industry subgroup includes companies that operate racetrack facilities.
notation: 11161014
valid from: 2014-08-08
valid till: 2020-10-03

Betting
type: BicsLevel4SubIndustry
type: Classifier
type: NamedIndividual
is sub industry of: Casinos & Gaming
is anachronous version of: http://data.ga-group.nl/ics/bics/1111111015
is contemporary version of: http://data.ga-group.nl/ics/bics/11161015
is replaced by: http://data.ga-group.nl/ics/bics/2020/1111111015
is version of: http://data.ga-group.nl/ics/bics/1111111015
is version of: http://data.ga-group.nl/ics/bics/11161015
imported on: 2026-06-08T13:03:47.798Z
last refreshed on: 2026-06-08T13:03:47.798Z
source accessed on: 2019-12-03T20:05:01Z
source last accessed on: 2019-12-03T20:05:01Z
label: Apostas @pt
label: Apuestas @es
label: Paris @fr
label: Scommesse @it
label: Wetten @de
label: Пари @ru
label: 博彩 @zh
label: 投注 @zh-hant
label: 賭博 @ja
label: 베팅 @ko
definition: This industry subgroup includes companies that provide betting services. These betting services can be done at a retail storefront (betting shop) or over the phone via call centers. Includes sports betting and off-racetrack betting. Excludes betting services provided through the Internet (see Mobile & Online Gambling).
notation: 11161015
valid from: 2014-08-08
valid till: 2020-10-03

Casinos & Gaming
type: BicsLevel3Industry
type: Classifier
type: NamedIndividual
is industry of: Gaming, Lodging & Restaurants
is anachronous version of: http://data.ga-group.nl/ics/bics/11111110
is contemporary version of: http://data.ga-group.nl/ics/bics/111610
is replaced by: http://data.ga-group.nl/ics/bics/2020/11111110
is version of: http://data.ga-group.nl/ics/bics/11111110
is version of: http://data.ga-group.nl/ics/bics/111610
imported on: 2026-06-08T13:03:47.798Z
last refreshed on: 2026-06-08T13:03:47.798Z
source accessed on: 2019-12-03T20:05:01Z
source last accessed on: 2019-12-03T20:05:01Z
label: Casino' e gioco d'azzardo @it
label: Casinos y juegos @es
label: Casinos/jeu @fr
label: Cassinos e jogos @pt
label: Kasinos&Spielen @de
label: Казино и игры @ru
label: 賭場及博弈 @zh-hant
label: 赌场和博彩 @zh
label: 카지노 & 게임 @ko
label: ｶｼﾞﾉ､ｹﾞｰﾐﾝｸﾞ @ja
definition: This industry includes companies that provide casino gaming without lodging. Also includes online gaming, racetracks, gaming equipment manufacturers and lottery services.
notation: 111610
valid from: 2014-08-08
valid till: 2020-10-03

Cruise Lines
type: BicsLevel3Industry
type: Classifier
type: NamedIndividual
is industry of: Gaming, Lodging & Restaurants
is anachronous version of: http://data.ga-group.nl/ics/bics/11111111
is contemporary version of: http://data.ga-group.nl/ics/bics/111611
is replaced by: http://data.ga-group.nl/ics/bics/2020/11111111
is version of: http://data.ga-group.nl/ics/bics/11111111
is version of: http://data.ga-group.nl/ics/bics/111611
imported on: 2026-06-08T13:03:47.798Z
last refreshed on: 2026-06-08T13:03:47.798Z
source accessed on: 2019-12-03T20:05:01Z
source last accessed on: 2019-12-03T20:05:01Z
label: Croisières @fr
label: Kreuzfahrtlinien @de
label: Líneas de cruceros @es
label: Linee di crociera @it
label: Linhas de cruzeiro @pt
label: Круизные линии @ru
label: 海上旅客輸送 @ja
label: 游轮公司 @zh
label: 郵輪 @zh-hant
label: 유람선 @ko
definition: This industry includes companies that provide transportation and leisure entertainment, such as deep sea cruises and river cruises.
notation: 111611
valid from: 2014-08-08
valid till: 2020-10-03

Food & Beverage Rev - Hotels
type: BicsLevel5Segment
type: Classifier
type: NamedIndividual
is level5 segment of: Hotel & Motel (excl Casino Hotel)
is anachronous version of: http://data.ga-group.nl/ics/bics/111111121010
is contemporary version of: http://data.ga-group.nl/ics/bics/1116121010
is replaced by: http://data.ga-group.nl/ics/bics/2020/111111121010
is version of: http://data.ga-group.nl/ics/bics/111111121010
is version of: http://data.ga-group.nl/ics/bics/1116121010
imported on: 2026-06-08T13:03:47.798Z
last refreshed on: 2026-06-08T13:03:47.798Z
source accessed on: 2019-12-03T20:05:01Z
source last accessed on: 2019-12-03T20:05:01Z
label: Erlös aus Speisen & Getränken - Hotels @de
label: Ingreso de alimento y bebidas - hoteles @es
label: Rec alimentos e bebidas - Hotéis @pt
label: Rev boissons et aliments - Hôtels @fr
label: Ric ristorazione - Alberghi @it
label: Врчк от еды и напитков - отели @ru
label: 食品与饮料收入-酒店 @zh
label: 食品及飲料收入-飯店 @zh-hant
label: 식음료 수익 - 호텔 @ko
label: ﾎﾃﾙ飲食収入 @ja
definition: This segment includes the hotel revenue attributed to the food and beverage component.
notation: 1116121010
valid from: 2014-08-08
valid till: 2020-10-03

Room Revenue - Hotels
type: BicsLevel5Segment
type: Classifier
type: NamedIndividual
is level5 segment of: Hotel & Motel (excl Casino Hotel)
is anachronous version of: http://data.ga-group.nl/ics/bics/111111121011
is contemporary version of: http://data.ga-group.nl/ics/bics/1116121011
is replaced by: http://data.ga-group.nl/ics/bics/2020/111111121011
is version of: http://data.ga-group.nl/ics/bics/111111121011
is version of: http://data.ga-group.nl/ics/bics/1116121011
imported on: 2026-06-08T13:03:47.798Z
last refreshed on: 2026-06-08T13:03:47.798Z
source accessed on: 2019-12-03T20:05:01Z
source last accessed on: 2019-12-03T20:05:01Z
label: Erlös aus Zimmern - Hotels @de
label: Ingreso de habitaciones - hoteles @es
label: Receita de quarto - Hotel @pt
label: Revenus des chambres - Hôtels @fr
label: Ricavi camere - Alberghi @it
label: Выручка за комнату - отели @ru
label: 客房收入-酒店 @zh
label: 房租收入-飯店 @zh-hant
label: 객실 수익 - 호텔 @ko
label: ﾎﾃﾙ室料収入 @ja
definition: This segment includes the hotel revenue attributed to the room component.
notation: 1116121011
valid from: 2014-08-08
valid till: 2020-10-03

Time-Share Revenue - Hotels
type: BicsLevel5Segment
type: Classifier
type: NamedIndividual
is level5 segment of: Hotel & Motel (excl Casino Hotel)
is anachronous version of: http://data.ga-group.nl/ics/bics/111111121012
is contemporary version of: http://data.ga-group.nl/ics/bics/1116121012
is replaced by: http://data.ga-group.nl/ics/bics/2020/111111121012
is version of: http://data.ga-group.nl/ics/bics/111111121012
is version of: http://data.ga-group.nl/ics/bics/1116121012
imported on: 2026-06-08T13:03:47.798Z
last refreshed on: 2026-06-08T13:03:47.798Z
source accessed on: 2019-12-03T20:05:01Z
source last accessed on: 2019-12-03T20:05:01Z
label: Erlös aus Timesharing - Hotels @de
label: Ingreso de tiempo compartido - hoteles @es
label: Receita de time-share - Hotel @pt
label: Revenus de co-propriétés - Hôtels @fr
label: Ricavi Time-Share - Alberghi @it
label: Выручка от таймшер - отели @ru
label: 分时度假收入-旅店 @zh
label: 分時度假收入-飯店 @zh-hant
label: 사용공유 수익 - 호텔 @ko
label: ﾀｲﾑｼｪｱ収益 @ja
definition: This segment includes companies that sell vacation ownership or time-share units.
notation: 1116121012
valid from: 2014-08-08
valid till: 2020-10-03

Other Revenue - Hotels
type: BicsLevel5Segment
type: Classifier
type: NamedIndividual
is level5 segment of: Hotel & Motel (excl Casino Hotel)
is anachronous version of: http://data.ga-group.nl/ics/bics/111111121013
is contemporary version of: http://data.ga-group.nl/ics/bics/1116121013
is replaced by: http://data.ga-group.nl/ics/bics/2020/111111121013
is version of: http://data.ga-group.nl/ics/bics/111111121013
is version of: http://data.ga-group.nl/ics/bics/1116121013
imported on: 2026-06-08T13:03:47.798Z
last refreshed on: 2026-06-08T13:03:47.798Z
source accessed on: 2019-12-03T20:05:01Z
source last accessed on: 2019-12-03T20:05:01Z
label: Altri ricavi - Alberghi @it
label: Autres revenus - Hôtels @fr
label: Otro ingreso - hoteles @es
label: Outras receitas - Hotel @pt
label: Sonstiger Erlös - Hotels @de
label: Прочая выручка - отели @ru
label: その他ﾎﾃﾙ収入 @ja
label: 其他收入-酒店 @zh
label: 其他收入-飯店 @zh-hant
label: 기타 수익 - 호텔 @ko
definition: This segment includes the hotel revenue attributed to components other than room or food and beverage.
notation: 1116121013
valid from: 2014-08-08
valid till: 2020-10-03

Hotel & Motel (excl Casino Hotel)
type: BicsLevel4SubIndustry
type: Classifier
type: NamedIndividual
is sub industry of: Lodging
is anachronous version of: http://data.ga-group.nl/ics/bics/1111111210
is contemporary version of: http://data.ga-group.nl/ics/bics/11161210
is replaced by: http://data.ga-group.nl/ics/bics/2020/1111111210
is version of: http://data.ga-group.nl/ics/bics/1111111210
is version of: http://data.ga-group.nl/ics/bics/11161210
imported on: 2026-06-08T13:03:47.798Z
last refreshed on: 2026-06-08T13:03:47.798Z
source accessed on: 2019-12-03T20:05:01Z
source last accessed on: 2019-12-03T20:05:01Z
label: Hôtels et motels (h hôtels-casinos) @fr
label: Hotéis e pousadas (ex hotel cassino) @pt
label: Hotel & Motel (exkl. Kasinohotel) @de
label: Hotel e motel (escl Hotel Casinò) @it
label: Hotel y motel (sin casino) @es
label: Гостиницы и мотели (искл. казино-отели) @ru
label: 酒店与汽车旅馆(除赌场酒店) @zh
label: 飯店及汽車旅館(賭場飯店除外) @zh-hant
label: 호텔 & 모텔(카지노 호텔제외) @ko
label: ﾎﾃﾙ･ﾓ-ﾃﾙ(除ｶｼﾞﾉ･ﾎﾃﾙ)業 @ja
definition: This industry subgroup includes companies (other than casino hotels) that provide short-term lodgings.
notation: 11161210
valid from: 2014-08-08
valid till: 2020-10-03

Food & Bev Rev - Casino Hotels
type: BicsLevel5Segment
type: Classifier
type: NamedIndividual
is level5 segment of: Casino Hotels
is anachronous version of: http://data.ga-group.nl/ics/bics/111111121110
is contemporary version of: http://data.ga-group.nl/ics/bics/1116121110
is replaced by: http://data.ga-group.nl/ics/bics/2020/111111121110
is version of: http://data.ga-group.nl/ics/bics/111111121110
is version of: http://data.ga-group.nl/ics/bics/1116121110
imported on: 2026-06-08T13:03:47.798Z
last refreshed on: 2026-06-08T13:03:47.798Z
source accessed on: 2019-12-03T20:05:01Z
source last accessed on: 2019-12-03T20:05:01Z
label: Erl. aus Speisen & Getr. - Kasinohotels @de
label: Ingreso de alimento y bebidas - hoteles de casino @es
label: Rec alim e bebidas - Hotéis cassino @pt
label: Rev boissons et aliments - Hôtels-casinos @fr
label: Ric ristorazione - Hotel casinò @it
label: Врчк от еды и напитков - казино-отели @ru
label: 食品与饮料收入-赌场酒店 @zh
label: 食品及飲料收入-賭場飯店 @zh-hant
label: 식음료 수익 - 카지노 호텔 @ko
label: ｶｼﾞﾉﾎﾃﾙ飲食収入 @ja
definition: This segment includes the casino hotel revenue attributed to the food and beverage component.
notation: 1116121110
valid from: 2014-08-08
valid till: 2020-10-03

Room Revenue - Casino Hotels
type: BicsLevel5Segment
type: Classifier
type: NamedIndividual
is level5 segment of: Casino Hotels
is anachronous version of: http://data.ga-group.nl/ics/bics/111111121111
is contemporary version of: http://data.ga-group.nl/ics/bics/1116121111
is replaced by: http://data.ga-group.nl/ics/bics/2020/111111121111
is version of: http://data.ga-group.nl/ics/bics/111111121111
is version of: http://data.ga-group.nl/ics/bics/1116121111
imported on: 2026-06-08T13:03:47.798Z
last refreshed on: 2026-06-08T13:03:47.798Z
source accessed on: 2019-12-03T20:05:01Z
source last accessed on: 2019-12-03T20:05:01Z
label: Ingreso de habitaciones - hoteles de casinos @es
label: Receita de quarto - Hotéis cassino @pt
label: Revenus des chambres - Hôtels-casinos @fr
label: Ricavi camere - Hotel casinò @it
label: Zimmererlös - Kasinohotels @de
label: Выручка за комнату - казино-отели @ru
label: 客房收入-赌场酒店 @zh
label: 房租收入-賭場飯店 @zh-hant
label: 객실 수익 - 카지노 호텔 @ko
label: ｶｼﾞﾉﾎﾃﾙ室料収入 @ja
definition: This segment includes the casino hotel revenue attributed to the room component.
notation: 1116121111
valid from: 2014-08-08
valid till: 2020-10-03

Other Rev - Casino Hotels
type: BicsLevel5Segment
type: Classifier
type: NamedIndividual
is level5 segment of: Casino Hotels
is anachronous version of: http://data.ga-group.nl/ics/bics/111111121112
is contemporary version of: http://data.ga-group.nl/ics/bics/1116121112
is replaced by: http://data.ga-group.nl/ics/bics/2020/111111121112
is version of: http://data.ga-group.nl/ics/bics/111111121112
is version of: http://data.ga-group.nl/ics/bics/1116121112
imported on: 2026-06-08T13:03:47.798Z
last refreshed on: 2026-06-08T13:03:47.798Z
source accessed on: 2019-12-03T20:05:01Z
source last accessed on: 2019-12-03T20:05:01Z
label: Altri ric - Hotel casinò @it
label: Autres rev - Hôtels-casinos @fr
label: Otro ing-hoteles de casinos @es
label: Outras receitas - Hoteis cassino @pt
label: Sonst. Erlös - Kasinohotels @de
label: Пр. врчк - казино-отели @ru
label: その他ｶｼﾞﾉﾎﾃﾙ収入 @ja
label: 其他收入-賭場飯店 @zh-hant
label: 其他收入-赌场酒店 @zh
label: 기타 수익 - 카지노 호텔 @ko
definition: This segment includes the casino hotel revenue attributed to the components other than room or food and beverage.
notation: 1116121112
valid from: 2014-08-08
valid till: 2020-10-03

Casino Hotels
type: BicsLevel4SubIndustry
type: Classifier
type: NamedIndividual
is sub industry of: Lodging
is anachronous version of: http://data.ga-group.nl/ics/bics/1111111211
is contemporary version of: http://data.ga-group.nl/ics/bics/11161211
is replaced by: http://data.ga-group.nl/ics/bics/2020/1111111211
is version of: http://data.ga-group.nl/ics/bics/1111111211
is version of: http://data.ga-group.nl/ics/bics/11161211
imported on: 2026-06-08T13:03:47.798Z
last refreshed on: 2026-06-08T13:03:47.798Z
source accessed on: 2019-12-03T20:05:01Z
source last accessed on: 2019-12-03T20:05:01Z
label: Alberghi casino' @it
label: Casinos @es
label: Hôtels casino @fr
label: Hotéis-cassino @pt
label: Kasino-Hotels @de
label: Казино-отель @ru
label: 賭場旅館 @zh-hant
label: 赌场酒店 @zh
label: 카지노 호텔 @ko
label: ｶｼﾞﾉ･ﾎﾃﾙ業 @ja
definition: This industry subgroup includes companies that provide short-term lodging in facilities with a casino on the premises.
notation: 11161211
valid from: 2014-08-08
valid till: 2020-10-03

Bed & Breakfast Inns
type: BicsLevel4SubIndustry
type: Classifier
type: NamedIndividual
is sub industry of: Lodging
is anachronous version of: http://data.ga-group.nl/ics/bics/1111111212
is contemporary version of: http://data.ga-group.nl/ics/bics/11161212
is replaced by: http://data.ga-group.nl/ics/bics/2020/1111111212
is version of: http://data.ga-group.nl/ics/bics/1111111212
is version of: http://data.ga-group.nl/ics/bics/11161212
imported on: 2026-06-08T13:03:47.798Z
last refreshed on: 2026-06-08T13:03:47.798Z
source accessed on: 2019-12-03T20:05:01Z
source last accessed on: 2019-12-03T20:05:01Z
label: (민박)여관업 @ko
label: Bed e Breakfast @it
label: Gîtes touristiques @fr
label: Hotel garnis @de
label: Moteles con desayuno @es
label: Pousadas @pt
label: Мини-гостиницы @ru
label: 住宿加早餐的旅店 @zh
label: 民宿 @zh-hant
label: 民宿業 @ja
definition: This industry subgroup includes companies that provide short-term lodging in facilities known as bed-and-breakfast inns.
notation: 11161212
valid from: 2014-08-08
valid till: 2020-10-03

Other Travel Accommodations
type: BicsLevel4SubIndustry
type: Classifier
type: Discontinued
type: NamedIndividual
is sub industry of: Lodging
is contemporary version of: http://data.ga-group.nl/ics/bics/11161213
is version of: http://data.ga-group.nl/ics/bics/11161213
imported on: 2026-06-08T13:03:47.798Z
last refreshed on: 2026-06-08T13:03:47.798Z
source accessed on: 2019-12-03T20:05:01Z
source last accessed on: 2019-12-03T20:05:01Z
label: Autres services d'hébergement des voyageurs @fr
label: Sonst. Reiseunterkünfte @de
label: Todas as outras acomodações de viagem @pt
label: Todos los otros servicios de alojamiento @es
label: Tutte le altre vacanze @it
label: Все прочие услуги гостиничного пребывания @ru
label: その他宿泊施設 @ja
label: 全部其他旅遊住宿 @zh-hant
label: 所有其他旅游住宿 @zh
label: 전체 기타 관광 숙박시설 @ko
definition: This industry subgroup includes companies that provide lodging services not elsewhere classified.
notation: 11161213
valid from: 2014-08-08
valid till: 2020-10-03

Lodging
type: BicsLevel3Industry
type: Classifier
type: NamedIndividual
is industry of: Gaming, Lodging & Restaurants
is anachronous version of: http://data.ga-group.nl/ics/bics/11111112
is contemporary version of: http://data.ga-group.nl/ics/bics/111612
is replaced by: http://data.ga-group.nl/ics/bics/2020/11111112
is version of: http://data.ga-group.nl/ics/bics/11111112
is version of: http://data.ga-group.nl/ics/bics/111612
imported on: 2026-06-08T13:03:47.798Z
last refreshed on: 2026-06-08T13:03:47.798Z
source accessed on: 2019-12-03T20:05:01Z
source last accessed on: 2019-12-03T20:05:01Z
label: Alloggi @it
label: Alojamento @pt
label: Alojamiento @es
label: Hébergement @fr
label: Hotellerie @de
label: Гостиницы @ru
label: 住宿 @zh-hant
label: 宿泊施設 @ja
label: 旅店 @zh
label: 숙박 @ko
definition: This industry includes companies that provide temporary quarters in a room or rooms and usually charge a daily rate for their use.
notation: 111612
valid from: 2014-08-08
valid till: 2020-10-03

Bars & Taverns
type: BicsLevel5Segment
type: Classifier
type: NamedIndividual
is level5 segment of: Limited Service Restaurants
is anachronous version of: http://data.ga-group.nl/ics/bics/111111131013
is contemporary version of: http://data.ga-group.nl/ics/bics/1116131010
is replaced by: http://data.ga-group.nl/ics/bics/2020/111111131013
is version of: http://data.ga-group.nl/ics/bics/111111131013
is version of: http://data.ga-group.nl/ics/bics/1116131010
imported on: 2026-06-08T13:03:47.798Z
last refreshed on: 2026-06-08T13:03:47.798Z
source accessed on: 2019-12-03T20:05:01Z
source last accessed on: 2019-12-03T20:05:01Z
label: Bar e taverne @it
label: Bares e pubs @pt
label: Barras y Bares @es
label: Bars & Tavernen @de
label: Bars et tavernes @fr
label: Бары и таверны @ru
label: 酒吧与酒馆 @zh
label: 酒吧及小酒館 @zh-hant
label: 酒場 @ja
label: 바 & 주점 @ko
definition: This segment includes companies known as bars, taverns, nightclubs or drinking places that prepare and serve alcoholic beverages for immediate consumption. Such companies may also provide limited food services.
notation: 1116131010
valid from: 2014-08-08
valid till: 2020-10-03

Cafe & Buffets - Franchise
type: BicsLevel6Segment
type: Classifier
type: Discontinued
type: NamedIndividual
is level6 segment of: Cafétérias et buffets
is contemporary version of: http://data.ga-group.nl/ics/bics/111613101110
is version of: http://data.ga-group.nl/ics/bics/111613101110
imported on: 2026-06-08T13:03:47.798Z
last refreshed on: 2026-06-08T13:03:47.798Z
source accessed on: 2019-12-03T20:05:01Z
source last accessed on: 2019-12-03T20:05:01Z
label: Caf et buffets - Franchises @fr
label: Café & Selbstbedienung - Franchise @de
label: Cafés, bufets - franquicias @es
label: Caffetterie e buffet - Franchising @it
label: Lanchonete e buffets - Franquia @pt
label: Кафе и буфеты - франшиза @ru
label: 半自助和自助餐厅-特许经营 @zh
label: 簡速及自助式餐廳-加盟店 @zh-hant
label: 카페 & 뷔페 - 프랜차이즈 @ko
label: ｶﾌｪﾃﾘｱ､ｸﾞﾘﾙﾋﾞｭｯﾌｪ-ﾌﾗﾝﾁｬｲｽﾞ収益 @ja
definition: This segment includes companies that have franchise revenue for cafeterias, buffets and grill buffet style restaurants.
notation: 111613101110
valid from: 2014-08-08
valid till: 2020-10-03

Cafe & Buffets - Owned
type: BicsLevel6Segment
type: Classifier
type: Discontinued
type: NamedIndividual
is level6 segment of: Cafétérias et buffets
is contemporary version of: http://data.ga-group.nl/ics/bics/111613101111
is version of: http://data.ga-group.nl/ics/bics/111613101111
imported on: 2026-06-08T13:03:47.798Z
last refreshed on: 2026-06-08T13:03:47.798Z
source accessed on: 2019-12-03T20:05:01Z
source last accessed on: 2019-12-03T20:05:01Z
label: Caf et buffets - Détenus @fr
label: Café & Selbstbedienung - In Besitz @de
label: Cafés y bufets - propios @es
label: Caffetterie e buffet - Di proprietà @it
label: Lanchonete e buffets - Propriedade @pt
label: Кафе и буфеты - в собственности @ru
label: 半自助和自助餐厅-自营 @zh
label: 簡速及自助式餐廳-直營店 @zh-hant
label: 카페 & 뷔페 - 자가소유 @ko
label: ｶﾌｪﾃﾘｱ､ｸﾞﾘﾙ･ﾋﾞｭｯﾌｪ-直営店収益 @ja
definition: This segment includes cafeterias, buffets or grills buffets that prepare and serve meals for immediate consumption using cafeteria-style or buffet serving equipment, such as steam tables, refrigerated areas, display grills, and self-service nonalcoholic beverage dispensing equipment. Patrons select from food and drink items on display in a continuous cafeteria line or from buffet stations. This segment includes only company-owned restaurant revenue.
notation: 111613101111
valid from: 2014-08-08
valid till: 2020-10-03

Cafétérias et buffets
type: BicsLevel5Segment
type: Classifier
type: Discontinued
type: NamedIndividual
is level5 segment of: Limited Service Restaurants
is contemporary version of: http://data.ga-group.nl/ics/bics/1116131011
is version of: http://data.ga-group.nl/ics/bics/1116131011
imported on: 2026-06-08T13:03:47.798Z
last refreshed on: 2026-06-08T13:03:47.798Z
source accessed on: 2019-12-03T20:05:01Z
source last accessed on: 2019-12-03T20:05:01Z
label: Cafeterías y bufetes @es
label: Cafeterias & Buffets
label: Caffetterie e buffet @it
label: Lanchonetes e buffets @pt
label: Кафетерии и буфеты @ru
label: 半自助和自助餐厅 @zh
label: 簡速及自助式餐廳 @zh-hant
label: 카페 & 뷔페 @ko
label: ｶﾌｪﾃﾘｱ､ﾋﾞｭｯﾌｪ @ja
definition: This segment includes cafeterias, buffets or grills buffets that prepare and serve meals for immediate consumption using cafeteria-style or buffet serving equipment, such as steam tables, refrigerated areas, display grills, and self-service nonalcoholic beverage dispensing equipment. Patrons select from food and drink items on display in a continuous cafeteria line or from buffet stations. This segment includes company-owned and franchise revenue.
notation: 1116131011
valid from: 2014-08-08
valid till: 2020-10-03

Fast Casual Rest - Franchise
type: BicsLevel6Segment
type: Classifier
type: NamedIndividual
is level6 segment of: Fast Casual Restaurants
is anachronous version of: http://data.ga-group.nl/ics/bics/11111113101010
is contemporary version of: http://data.ga-group.nl/ics/bics/111613101210
is replaced by: http://data.ga-group.nl/ics/bics/2020/11111113101010
is version of: http://data.ga-group.nl/ics/bics/11111113101010
is version of: http://data.ga-group.nl/ics/bics/111613101210
imported on: 2026-06-08T13:03:47.798Z
last refreshed on: 2026-06-08T13:03:47.798Z
source accessed on: 2019-12-03T20:05:01Z
source last accessed on: 2019-12-03T20:05:01Z
label: Fast-Casual-Rest. - Franchise @de
label: Franquicia - rest de comida rápida informal @es
label: Restaur rapide - Franchise @fr
label: Restaurantes casuais - Franquia @pt
label: Ristorazione veloce - Franchise @it
label: Рестор. быстр. обслуж. - Франч. @ru
label: 休闲快餐厅-特许经营 @zh
label: 速食休閒餐廳 - 加盟 @zh-hant
label: 패스트 캐주얼 레스토랑 - 프랜차이즈 @ko
label: ﾌｧｽﾄﾌｰﾄﾞ･ﾚｽﾄﾗﾝ - ﾌﾗﾝﾁｬｲｽﾞ @ja
definition: This segment includes companies that have franchise revenue for fast casual restaurants.
notation: 111613101210
valid from: 2014-08-08
valid till: 2020-10-03

Fast Casual Rest - Owned
type: BicsLevel6Segment
type: Classifier
type: NamedIndividual
is level6 segment of: Fast Casual Restaurants
is anachronous version of: http://data.ga-group.nl/ics/bics/11111113101011
is contemporary version of: http://data.ga-group.nl/ics/bics/111613101211
is replaced by: http://data.ga-group.nl/ics/bics/2020/11111113101011
is version of: http://data.ga-group.nl/ics/bics/11111113101011
is version of: http://data.ga-group.nl/ics/bics/111613101211
imported on: 2026-06-08T13:03:47.798Z
last refreshed on: 2026-06-08T13:03:47.798Z
source accessed on: 2019-12-03T20:05:01Z
source last accessed on: 2019-12-03T20:05:01Z
label: Fast-Casual-Rest. - Eigentum @de
label: Propios - rest de comida rápida informal @es
label: Restaur rapide - Etablissements détenus @fr
label: Restaurantes casuais - Próprio @pt
label: Ristorazione veloce - Di proprietà @it
label: Рестор. быстр. обслуж.- Собств. @ru
label: 休闲快餐厅-自有店铺 @zh
label: 速食休閒餐廳 - 直營 @zh-hant
label: 패스트 캐주얼 레스토랑 - 자기매장 @ko
label: ﾌｧｽﾄﾌｰﾄﾞ･ﾚｽﾄﾗﾝ - 直営店 @ja
definition: This segment includes restaurants that provide food services where food is made to order, often in front of the customer with customizable options. Patrons pay before self-seating in an upscale environment. Food and drink may be consumed on premises, taken out or delivered to the customer's location. Alcohol may or may not be available. This segment includes only company-owned restaurant revenue.
notation: 111613101211
valid from: 2014-08-08
valid till: 2020-10-03

Fast Casual Restaurants
type: BicsLevel5Segment
type: Classifier
type: NamedIndividual
is level5 segment of: Limited Service Restaurants
is anachronous version of: http://data.ga-group.nl/ics/bics/111111131010
is contemporary version of: http://data.ga-group.nl/ics/bics/1116131012
is replaced by: http://data.ga-group.nl/ics/bics/2020/111111131010
is version of: http://data.ga-group.nl/ics/bics/111111131010
is version of: http://data.ga-group.nl/ics/bics/1116131012
imported on: 2026-06-08T13:03:47.798Z
last refreshed on: 2026-06-08T13:03:47.798Z
source accessed on: 2019-12-03T20:05:01Z
source last accessed on: 2019-12-03T20:05:01Z
label: Fast-Casual-Restaurants @de
label: Restaurante de comida rápida informal @es
label: Restaurantes casuais @pt
label: Restauration rapide @fr
label: Ristorazione veloce @it
label: Рестор. быстр. обслуж. @ru
label: 休闲快餐厅 @zh
label: 速食休閒餐廳 @zh-hant
label: 패스트 캐주얼 레스토랑 @ko
label: ﾌｧｽﾄﾌｰﾄﾞ･ﾚｽﾄﾗﾝ @ja
definition: This segment includes restaurants that provide food services where food is made to order, often in front of the customer with customizable options. Patrons pay before self-seating in an upscale environment. Food and drink may be consumed on premises, taken out, or delivered to the customer's location. Alcohol may or may not be available. This segment includes company-owned and franchise revenue.
notation: 1116131012
valid from: 2014-08-08
valid till: 2020-10-03

Fast Food Rest - Franchise
type: BicsLevel6Segment
type: Classifier
type: NamedIndividual
is level6 segment of: Fast Food Restaurants
is anachronous version of: http://data.ga-group.nl/ics/bics/11111113101110
is contemporary version of: http://data.ga-group.nl/ics/bics/111613101310
is replaced by: http://data.ga-group.nl/ics/bics/2020/11111113101110
is version of: http://data.ga-group.nl/ics/bics/11111113101110
is version of: http://data.ga-group.nl/ics/bics/111613101310
imported on: 2026-06-08T13:03:47.798Z
last refreshed on: 2026-06-08T13:03:47.798Z
source accessed on: 2019-12-03T20:05:01Z
source last accessed on: 2019-12-03T20:05:01Z
label: Fast Food - Franchise @it
label: Fast-Food-Rest. - Franchise @de
label: Franquicia - rest de comida rápida @es
label: Rest fast food - Franquia @pt
label: Restaur rapide - Franchises @fr
label: Рестор. быстрого питания - франшиза @ru
label: 快餐厅-特许经营 @zh
label: 速食餐廳-加盟 @zh-hant
label: 패스트푸드 음식점 - 프랜차이즈 @ko
label: ﾌｧｰｽﾄﾌｰｰﾌﾗﾝﾁｬｲｽﾞ @ja
definition: This segment includes companies that have franchise revenue for limited-service restaurants.
notation: 111613101310
valid from: 2014-08-08
valid till: 2020-10-03

Fast Food Rest - Owned
type: BicsLevel6Segment
type: Classifier
type: NamedIndividual
is level6 segment of: Fast Food Restaurants
is anachronous version of: http://data.ga-group.nl/ics/bics/11111113101111
is contemporary version of: http://data.ga-group.nl/ics/bics/111613101311
is replaced by: http://data.ga-group.nl/ics/bics/2020/11111113101111
is version of: http://data.ga-group.nl/ics/bics/11111113101111
is version of: http://data.ga-group.nl/ics/bics/111613101311
imported on: 2026-06-08T13:03:47.798Z
last refreshed on: 2026-06-08T13:03:47.798Z
source accessed on: 2019-12-03T20:05:01Z
source last accessed on: 2019-12-03T20:05:01Z
label: Fast Food - Di proprietà @it
label: Fast-Food-Rest. - In Besitz @de
label: Propios - rest de comida rápida @es
label: Rest fast food - Propriedade @pt
label: Restaur rapide - Détenu @fr
label: Рестор. быстрого питания - в собственности @ru
label: 快餐厅-自营 @zh
label: 速食餐廳-直營 @zh-hant
label: 패스트푸드 음식점 - 자가 @ko
label: ﾌｧｰｽﾄﾌｰﾄﾞｰ直営店 @ja
definition: This segment includes restaurants that provide food services where patrons generally order their food and pay before eating. Food and drink may be consumed on premises, taken out or delivered to the customer's location. This segment only includes company-owned restaurant revenue.
notation: 111613101311
valid from: 2014-08-08
valid till: 2020-10-03

Fast Food Restaurants
type: BicsLevel5Segment
type: Classifier
type: NamedIndividual
is level5 segment of: Limited Service Restaurants
is anachronous version of: http://data.ga-group.nl/ics/bics/111111131011
is contemporary version of: http://data.ga-group.nl/ics/bics/1116131013
is replaced by: http://data.ga-group.nl/ics/bics/2020/111111131011
is version of: http://data.ga-group.nl/ics/bics/111111131011
is version of: http://data.ga-group.nl/ics/bics/1116131013
imported on: 2026-06-08T13:03:47.798Z
last refreshed on: 2026-06-08T13:03:47.798Z
source accessed on: 2019-12-03T20:05:01Z
source last accessed on: 2019-12-03T20:05:01Z
label: Fast Food @it
label: Fast-Food-Restaurants @de
label: Restaurantes de comida rápida @es
label: Restaurantes fast food @pt
label: Restauration rapide @fr
label: Рестораны быстрого питания @ru
label: 快餐店 @zh
label: 速食餐廳 @zh-hant
label: 패스트푸드 레스토랑 @ko
label: ﾌｧｰｽﾄﾌｰﾄﾞ店 @ja
definition: This segment includes restaurants that provide food services where patrons order their food and pay before eating. Food and drink may be consumed on premises, taken out or delivered to the customer's location. This segment includes both company-owned restaurant and franchise revenue.
notation: 1116131013
valid from: 2014-08-08
valid till: 2020-10-03

Snack & Juice Bars-Franchise
type: BicsLevel6Segment
type: Classifier
type: NamedIndividual
is level6 segment of: Snack & Juice Bars
is anachronous version of: http://data.ga-group.nl/ics/bics/11111113101210
is contemporary version of: http://data.ga-group.nl/ics/bics/111613101410
is replaced by: http://data.ga-group.nl/ics/bics/2020/11111113101210
is version of: http://data.ga-group.nl/ics/bics/11111113101210
is version of: http://data.ga-group.nl/ics/bics/111613101410
imported on: 2026-06-08T13:03:47.798Z
last refreshed on: 2026-06-08T13:03:47.798Z
source accessed on: 2019-12-03T20:05:01Z
source last accessed on: 2019-12-03T20:05:01Z
label: Alimentos livianos y jugo barras - franquicias @es
label: Bares de petiscos e bebidas não alcoólicas - Franquia @pt
label: Imbissstube & Saftbar - Franchise @de
label: Kiosques à jus et collations - Franch @fr
label: Tavole calde e juice bar-Franchise @it
label: Бар со снэками и соками-франшиза @ru
label: 零食与饮料吧-特许经营 @zh
label: 零食及果汁吧-加盟 @zh-hant
label: 스낵 & 쥬스 판매점 - 프랜차이즈 @ko
label: ｽﾅｯｸ･非ｱﾙｺｰﾙ飲料ﾊﾞｰ-ﾌﾗﾝﾁｬｲｽﾞ @ja
definition: This segment includes companies that have franchise revenue for snack and nonalcoholic beverage bars.
notation: 111613101410
valid from: 2014-08-08
valid till: 2020-10-03

Snack & Juice Bars - Owned
type: BicsLevel6Segment
type: Classifier
type: NamedIndividual
is level6 segment of: Snack & Juice Bars
is anachronous version of: http://data.ga-group.nl/ics/bics/11111113101211
is contemporary version of: http://data.ga-group.nl/ics/bics/111613101411
is replaced by: http://data.ga-group.nl/ics/bics/2020/11111113101211
is version of: http://data.ga-group.nl/ics/bics/11111113101211
is version of: http://data.ga-group.nl/ics/bics/111613101411
imported on: 2026-06-08T13:03:47.798Z
last refreshed on: 2026-06-08T13:03:47.798Z
source accessed on: 2019-12-03T20:05:01Z
source last accessed on: 2019-12-03T20:05:01Z
label: Alimentos livianos y jugo barras - propios @es
label: Bares de petiscos e bebidas não alcoólicas - Propriedade @pt
label: Imbissstube & Saftbar - In Besitz @de
label: Kiosques à jus et collations - Détenus @fr
label: Tavole calde e juice bar-Di proprietà @it
label: Бар со снэками и соками - в собственности @ru
label: 零食及果汁吧-直營 @zh-hant
label: 零食��饮料吧-自营 @zh
label: 스낵 & 쥬스 판매점 - 자가 @ko
label: ｽﾅｯｸ･非ｱﾙｺｰﾙ飲料ﾊﾞｰ-直営店収益 @ja
definition: This segment includes companies that prepare and/or serve a specialty snack, such as ice cream, frozen yogurt, cookies or popcorn, or nonalcoholic beverages, such as coffee, juices, sodas or smoothies. The food is prepared for immediate consumption. This segment includes only company-owned restaurant revenue.
notation: 111613101411
valid from: 2014-08-08
valid till: 2020-10-03

Snack & Juice Bars
type: BicsLevel5Segment
type: Classifier
type: NamedIndividual
is level5 segment of: Limited Service Restaurants
is anachronous version of: http://data.ga-group.nl/ics/bics/111111131012
is contemporary version of: http://data.ga-group.nl/ics/bics/1116131014
is replaced by: http://data.ga-group.nl/ics/bics/2020/111111131012
is version of: http://data.ga-group.nl/ics/bics/111111131012
is version of: http://data.ga-group.nl/ics/bics/1116131014
imported on: 2026-06-08T13:03:47.798Z
last refreshed on: 2026-06-08T13:03:47.798Z
source accessed on: 2019-12-03T20:05:01Z
source last accessed on: 2019-12-03T20:05:01Z
label: Alimentos livianos y barras @es
label: Bares de aperitivos e bebidas não alcoólicas @pt
label: Imbissstube & Saftbar @de
label: Kiosques à jus et collations @fr
label: Tavole calde e juice bar @it
label: Бар со снэками и соками @ru
label: 零食与饮料吧 @zh
label: 零食及果汁吧 @zh-hant
label: 스낵 & 쥬스 판매점 @ko
label: ｽﾅｯｸ･非ｱﾙｺｰﾙ飲料ﾊﾞｰ @ja
definition: This segment includes companies that prepare and/or serve a specialty snack, such as ice cream, frozen yogurt, cookies or popcorn, or serve nonalcoholic beverages, such as coffee, juices, sodas or smoothies. This segment includes company-owned and franchise revenue.
notation: 1116131014
valid from: 2014-08-08
valid till: 2020-10-03

Limited Service Restaurants
type: BicsLevel4SubIndustry
type: Classifier
type: NamedIndividual
is sub industry of: Restaurantes
is anachronous version of: http://data.ga-group.nl/ics/bics/1111111310
is contemporary version of: http://data.ga-group.nl/ics/bics/11161310
is replaced by: http://data.ga-group.nl/ics/bics/2020/1111111310
is version of: http://data.ga-group.nl/ics/bics/1111111310
is version of: http://data.ga-group.nl/ics/bics/11161310
imported on: 2026-06-08T13:03:47.798Z
last refreshed on: 2026-06-08T13:03:47.798Z
source accessed on: 2019-12-03T20:05:01Z
source last accessed on: 2019-12-03T20:05:01Z
label: Restaurantes de serviço limitado @pt
label: Restaurantes de servicio limitado @es
label: Restaurants mit begrenztem Service @de
label: Restaurants service limité @fr
label: Ristoranti a servizio limitato @it
label: Рестораны с ограниченным обслуживанием @ru
label: 小型餐飲店 @zh-hant
label: 有限服务餐厅 @zh
label: 한정서비스 음식점 @ko
label: ｾﾙﾌｻｰﾋﾞｽ･ﾚｽﾄﾗﾝ業 @ja
definition: This industry subgroup includes establishments that provide food services where patrons generally order or select items and pay before eating. Food and drink may be consumed on premises, taken out or delivered to the customer's location. This industry subgroup includes company-owned and franchise revenue.
notation: 11161310
valid from: 2014-08-08
valid till: 2020-10-03

Casual Rest - Franchise
type: BicsLevel6Segment
type: Classifier
type: NamedIndividual
is level6 segment of: Casual Full Svc Restaurants
is anachronous version of: http://data.ga-group.nl/ics/bics/11111113111010
is contemporary version of: http://data.ga-group.nl/ics/bics/111613111010
is replaced by: http://data.ga-group.nl/ics/bics/2020/11111113111010
is version of: http://data.ga-group.nl/ics/bics/11111113111010
is version of: http://data.ga-group.nl/ics/bics/111613111010
imported on: 2026-06-08T13:03:47.798Z
last refreshed on: 2026-06-08T13:03:47.798Z
source accessed on: 2019-12-03T20:05:01Z
source last accessed on: 2019-12-03T20:05:01Z
label: Franquicia - rest informal @es
label: Rest casuais - Franquia @pt
label: Restaurants familiaux - Franch @fr
label: Ristor informali - Franchise @it
label: Zwangloses Rest. - Franchise @de
label: Повседн. рестораны - франшиза @ru
label: 休閒家庭式餐廳-加盟 @zh-hant
label: 休闲餐厅-特许经营 @zh
label: 캐주얼 레스토랑- 프랜차이즈 @ko
label: ｶｼﾞｭｱﾙ･ﾚｽﾄﾗﾝｰﾌﾗﾝﾁｬｲｽﾞ @ja
definition: This segment includes companies that have franchise revenue for casual family restaurants.
notation: 111613111010
valid from: 2014-08-08
valid till: 2020-10-03

Casual Rest - Owned
type: BicsLevel6Segment
type: Classifier
type: NamedIndividual
is level6 segment of: Casual Full Svc Restaurants
is anachronous version of: http://data.ga-group.nl/ics/bics/11111113111011
is contemporary version of: http://data.ga-group.nl/ics/bics/111613111011
is replaced by: http://data.ga-group.nl/ics/bics/2020/11111113111011
is version of: http://data.ga-group.nl/ics/bics/11111113111011
is version of: http://data.ga-group.nl/ics/bics/111613111011
imported on: 2026-06-08T13:03:47.798Z
last refreshed on: 2026-06-08T13:03:47.798Z
source accessed on: 2019-12-03T20:05:01Z
source last accessed on: 2019-12-03T20:05:01Z
label: Propios - rest informal @es
label: Rest casuais - Propriedade @pt
label: Restaurants familiaux - Dét @fr
label: Ristor informali - Di proprietà @it
label: Zwangloses Rest. - In Besitz @de
label: Повседн. рестораны - в собственности @ru
label: 休閒家庭式餐廳-直營 @zh-hant
label: 休闲餐厅-自营 @zh
label: 캐주얼 레스토랑 - 자가 @ko
label: ｶｼﾞｭｱﾙﾌｧﾐﾘｰﾚｽﾄﾗﾝ-直営店収益 @ja
definition: This segment includes lower- to mid-priced restaurants that provide food services to patrons who order their food, are served by wait staff while seated and pay after eating. This segment only includes company-owned restaurant revenue.
notation: 111613111011
valid from: 2014-08-08
valid till: 2020-10-03

Casual Full Svc Restaurants
type: BicsLevel5Segment
type: Classifier
type: NamedIndividual
is level5 segment of: Full Service Restaurants
is anachronous version of: http://data.ga-group.nl/ics/bics/111111131110
is contemporary version of: http://data.ga-group.nl/ics/bics/1116131110
is replaced by: http://data.ga-group.nl/ics/bics/2020/111111131110
is version of: http://data.ga-group.nl/ics/bics/111111131110
is version of: http://data.ga-group.nl/ics/bics/1116131110
imported on: 2026-06-08T13:03:47.798Z
last refreshed on: 2026-06-08T13:03:47.798Z
source accessed on: 2019-12-03T20:05:01Z
source last accessed on: 2019-12-03T20:05:01Z
label: Restaurantes de serv completo casual @pt
label: Restaurantes informales de servicio completo @es
label: Restaurants familiaux serv compl @fr
label: Ristoranti informali serv completo @it
label: Zwangloses Full-Service-Rest. @de
label: Повседн. рестор. с полным обслуж. @ru
label: 休閒家庭式全套服務餐廳 @zh-hant
label: 全方位服务休闲餐厅 @zh
label: 캐주얼 풀서비스 레스토랑 @ko
label: ﾌﾙ��ｰﾋﾞｽ･ｶｼﾞｭｱﾙﾌｧﾐﾘｰﾚｽﾄﾗﾝ @ja
definition: This segment includes lower- to mid-priced restaurants that provide food services to patrons who order their food, are served by wait staff while seated and pay after eating. This segment includes both company-owned restaurant and franchise revenue.
notation: 1116131110
valid from: 2014-08-08
valid till: 2020-10-03

Upscale Rest - Franchise
type: BicsLevel6Segment
type: Classifier
type: NamedIndividual
is level6 segment of: Upscale Full Svc Restaurants
is anachronous version of: http://data.ga-group.nl/ics/bics/11111113111110
is contemporary version of: http://data.ga-group.nl/ics/bics/111613111110
is replaced by: http://data.ga-group.nl/ics/bics/2020/11111113111110
is version of: http://data.ga-group.nl/ics/bics/11111113111110
is version of: http://data.ga-group.nl/ics/bics/111613111110
imported on: 2026-06-08T13:03:47.798Z
last refreshed on: 2026-06-08T13:03:47.798Z
source accessed on: 2019-12-03T20:05:01Z
source last accessed on: 2019-12-03T20:05:01Z
label: Gehobene Rest. - Franchise @de
label: Rest sofisticado - Franquia @pt
label: Restaurantes de lujo - franquicia @es
label: Restaurants ht de gamme- Franch @fr
label: Ristor formali - Franchise @it
label: Элитн. рестораны - франшиза @ru
label: 高档餐厅-特许经营 @zh
label: 高級餐廳-加盟 @zh-hant
label: 高級ﾌｧﾐﾚｽ-ﾌﾗﾝﾁｬｲｽﾞ @ja
label: 고급 레스토랑 - 프랜차이즈 @ko
definition: This segment includes companies that have franchise revenue for upscale family restaurants.
notation: 111613111110
valid from: 2014-08-08
valid till: 2020-10-03

Upscale Rest - Owned
type: BicsLevel6Segment
type: Classifier
type: NamedIndividual
is level6 segment of: Upscale Full Svc Restaurants
is anachronous version of: http://data.ga-group.nl/ics/bics/11111113111111
is contemporary version of: http://data.ga-group.nl/ics/bics/111613111111
is replaced by: http://data.ga-group.nl/ics/bics/2020/11111113111111
is version of: http://data.ga-group.nl/ics/bics/11111113111111
is version of: http://data.ga-group.nl/ics/bics/111613111111
imported on: 2026-06-08T13:03:47.798Z
last refreshed on: 2026-06-08T13:03:47.798Z
source accessed on: 2019-12-03T20:05:01Z
source last accessed on: 2019-12-03T20:05:01Z
label: Gehobene Rest. - In Besitz @de
label: Rest sofisticado - Propriedade @pt
label: Restaurantes de lujo - propios @es
label: Restaurants ht de gamme- Dét @fr
label: Ristor formali - Di proprietà @it
label: Элитн. рестораны - в собственности @ru
label: 高档餐厅-自营 @zh
label: 高級餐廳-直營 @zh-hant
label: 高級ﾌｧﾐﾘｰﾚｽﾄﾗﾝ @ja
label: 고급 레스토랑 - 자가 @ko
definition: This segment includes high-priced restaurants that provide food services to patrons who order their food, are served by wait staff while seated and pay after eating. This segment only includes company-owned restaurant revenue.
notation: 111613111111
valid from: 2014-08-08
valid till: 2020-10-03

Upscale Full Svc Restaurants
type: BicsLevel5Segment
type: Classifier
type: NamedIndividual
is level5 segment of: Full Service Restaurants
is anachronous version of: http://data.ga-group.nl/ics/bics/111111131111
is contemporary version of: http://data.ga-group.nl/ics/bics/1116131111
is replaced by: http://data.ga-group.nl/ics/bics/2020/111111131111
is version of: http://data.ga-group.nl/ics/bics/111111131111
is version of: http://data.ga-group.nl/ics/bics/1116131111
imported on: 2026-06-08T13:03:47.798Z
last refreshed on: 2026-06-08T13:03:47.798Z
source accessed on: 2019-12-03T20:05:01Z
source last accessed on: 2019-12-03T20:05:01Z
label: Gehobene Full-Service-Rest. @de
label: Restaurantes de lujo con servicio completo @es
label: Restaurantes serv completo sofisticado @pt
label: Restaurants ht de gamme serv compl @fr
label: Ristoranti formali serv completo @it
label: Элитн. рестораны с полным обслуж. @ru
label: 全方位服务高档餐厅 @zh
label: 高級全套服務餐廳 @zh-hant
label: 고급 풀서비스 레스토랑 @ko
label: ﾌﾙｻｰﾋﾞｽ高級ﾌｧﾐﾘｰﾚｽﾄﾗﾝ @ja
definition: This segment includes companies that provide food services to patrons who order their food, are served by wait staff while seated and pay after eating. This segment includes company-owned and franchise revenue.
notation: 1116131111
valid from: 2014-08-08
valid till: 2020-10-03

Full Service Restaurants
type: BicsLevel4SubIndustry
type: Classifier
type: NamedIndividual
is sub industry of: Restaurantes
is anachronous version of: http://data.ga-group.nl/ics/bics/1111111311
is contemporary version of: http://data.ga-group.nl/ics/bics/11161311
is replaced by: http://data.ga-group.nl/ics/bics/2020/1111111311
is version of: http://data.ga-group.nl/ics/bics/1111111311
is version of: http://data.ga-group.nl/ics/bics/11161311
imported on: 2026-06-08T13:03:47.798Z
last refreshed on: 2026-06-08T13:03:47.798Z
source accessed on: 2019-12-03T20:05:01Z
source last accessed on: 2019-12-03T20:05:01Z
label: Full-Service-Restaurants @de
label: Restaurantes de serviço completo @pt
label: Restaurantes de servicio completo @es
label: Restaurants service complet @fr
label: Ristoranti a servizio completo @it
label: Рестораны с полным обслуживанием @ru
label: 全套服務餐廳 @zh-hant
label: 全方位服务餐厅 @zh
label: 풀서비스 레스토랑 @ko
label: ﾌﾙｻｰﾋﾞｽ･ﾚｽﾄﾗﾝ @ja
definition: This industry subgroup includes restaurants that provide food services to patrons who order their food, are served by wait staff while seated and pay after eating.
notation: 11161311
valid from: 2014-08-08
valid till: 2020-10-03

Restaurantes
type: BicsLevel3Industry
type: Classifier
type: NamedIndividual
is industry of: Gaming, Lodging & Restaurants
is anachronous version of: http://data.ga-group.nl/ics/bics/11111113
is contemporary version of: http://data.ga-group.nl/ics/bics/111613
is replaced by: http://data.ga-group.nl/ics/bics/2020/11111113
is version of: http://data.ga-group.nl/ics/bics/11111113
is version of: http://data.ga-group.nl/ics/bics/111613
imported on: 2026-06-08T13:03:47.798Z
last refreshed on: 2026-06-08T13:03:47.798Z
source accessed on: 2019-12-03T20:05:01Z
source last accessed on: 2019-12-03T20:05:01Z
label: Restaurants
label: Ristoranti @it
label: Рестораны @ru
label: 餐廳 @zh-hant
label: 餐饮业 @zh
label: 식당업 @ko
label: ﾚｽﾄﾗﾝ @ja
definition: This industry includes companies that prepares, serves or provides self-serve food for immediate consumption. The facilities can be seated, takeout, or mobile vehicles or carts.
notation: 111613
valid from: 2014-08-08
valid till: 2020-10-03

Gaming, Lodging & Restaurants
type: BicsLevel2IndustryGroup
type: Classifier
type: NamedIndividual
is industry group of: Consumer Discretionary
is anachronous version of: http://data.ga-group.nl/ics/bics/111111
is contemporary version of: http://data.ga-group.nl/ics/bics/1116
is replaced by: http://data.ga-group.nl/ics/bics/2020/111111
is version of: http://data.ga-group.nl/ics/bics/111111
is version of: http://data.ga-group.nl/ics/bics/1116
imported on: 2026-06-08T13:03:47.798Z
last refreshed on: 2026-06-08T13:03:47.798Z
source accessed on: 2019-12-03T20:05:01Z
source last accessed on: 2019-12-03T20:05:01Z
label: Gioco d'azzardo, alloggi e ristoranti @it
label: Glücksspiel, Unterkunft & Restaurants @de
label: Jeux, hébergement et restaurants @fr
label: Juegos de apuestas, alojamiento y restaurantes @es
label: Viagem, alojamento e restaurantes @pt
label: Азартные игры, гостиницы и рестораны @ru
label: 博弈、住宿及餐廳 @zh-hant
label: 博彩、住宿及餐馆 @zh
label: 게임, 숙박 & 식당 @ko
label: ｹﾞｰﾐﾝｸﾞ､宿泊施設､外食 @ja
definition: This industry group includes companies that operate establishments in casinos and gambling, cruises lines, lodging, passenger transportation and restaurants.
notation: 1116
valid from: 2014-08-08
valid till: 2020-10-03

Charter Airline - Full Svc
type: BicsLevel5Segment
type: Classifier
type: NamedIndividual
is level5 segment of: Full Service Airline
is anachronous version of: http://data.ga-group.nl/ics/bics/171112101010
is contemporary version of: http://data.ga-group.nl/ics/bics/1117101010
is replaced by: http://data.ga-group.nl/ics/bics/2020/171112101010
is version of: http://data.ga-group.nl/ics/bics/1117101010
is version of: http://data.ga-group.nl/ics/bics/171112101010
imported on: 2026-06-08T13:03:47.798Z
last refreshed on: 2026-06-08T13:03:47.798Z
source accessed on: 2019-12-03T20:05:01Z
source last accessed on: 2019-12-03T20:05:01Z
label: Alquiler de aerolínea - serv completo @es
label: Charter - Full-Service @de
label: Cies aériennes charters - Serv complet @fr
label: Companhia aérea fretada - Serv completo @pt
label: Linea aerea charter - Serv compl @it
label: Врчк от чартер. перевозок - авиалинии с полным обслуж. @ru
label: 包机航线-全方位服务 @zh
label: 包機航線-全方位 @zh-hant
label: 전세기 항공사 - 풀서비스 @ko
label: ﾁｬｰﾀｰ機���客輸送業収益(ﾌﾙｻｰﾋﾞｽ) @ja
definition: This segment includes full-service carrier revenue generated from chartered airline operations. Charter flights are usually nonscheduled and carry mainly tourists as passengers. Airlines can also offer charter flights to carry military personnel.
notation: 1117101010
valid from: 2014-08-08
valid till: 2020-10-03

Mainline Airline - Full Svc
type: BicsLevel5Segment
type: Classifier
type: NamedIndividual
is level5 segment of: Full Service Airline
is anachronous version of: http://data.ga-group.nl/ics/bics/171112101011
is contemporary version of: http://data.ga-group.nl/ics/bics/1117101011
is replaced by: http://data.ga-group.nl/ics/bics/2020/171112101011
is version of: http://data.ga-group.nl/ics/bics/1117101011
is version of: http://data.ga-group.nl/ics/bics/171112101011
imported on: 2026-06-08T13:03:47.798Z
last refreshed on: 2026-06-08T13:03:47.798Z
source accessed on: 2019-12-03T20:05:01Z
source last accessed on: 2019-12-03T20:05:01Z
label: Aerolínea principal - serv completo @es
label: Companhia aérea principal - Serv completo @pt
label: Hauptlinie, Fluggesellschaft - Full-Service @de
label: Lignes aériennes principales - Serv compl @fr
label: Linea aerea principale - Serv compl @it
label: Врчк основных авиалиний - авиалинии с полным обслуж. @ru
label: 主线航线-全方位服务 @zh
label: 主要航線-全方位 @zh-hant
label: 主要路線旅客輸送業収益(ﾌﾙｻｰﾋﾞｽ) @ja
label: 정기노선 항공사 - 풀서비스 @ko
definition: This segment includes full-service carrier revenue generated from mainline passenger air operations. Services are conducted with long-haul aircraft to domestic and international destinations.
notation: 1117101011
valid from: 2014-08-08
valid till: 2020-10-03

Onboard Airline - Full Svc
type: BicsLevel5Segment
type: Classifier
type: Discontinued
type: NamedIndividual
is level5 segment of: Full Service Airline
is contemporary version of: http://data.ga-group.nl/ics/bics/1117101012
is version of: http://data.ga-group.nl/ics/bics/1117101012
imported on: 2026-06-08T13:03:47.798Z
last refreshed on: 2026-06-08T13:03:47.798Z
source accessed on: 2019-12-03T20:05:01Z
source last accessed on: 2019-12-03T20:05:01Z
label: Aerolínea a bordo - serv completo @es
label: Companhia a bordo - Serv completo @pt
label: Linea aerea a bordo - Serv compl @it
label: Onboard, Fluggesellschaft - Full-Service @de
label: Rev 'A bord' lignes aériennes - Serv compl @fr
label: Бортовой доход авиалиний - авиалинии с полным обслуж. @ru
label: 机舱服务-全方位服务 @zh
label: 機内ｻｰﾋﾞｽ収益(ﾌﾙｻｰﾋﾞｽ) @ja
label: 機艙服務-全方位 @zh-hant
label: 기내 항공사 - 풀서비스 @ko
definition: This segment includes full-service carrier revenue generated from the sale of onboard food, goods, telecommunications services and gaming proceeds.
notation: 1117101012
valid from: 2014-08-08
valid till: 2020-10-03

Regional Airline - Full Svc
type: BicsLevel5Segment
type: Classifier
type: NamedIndividual
is level5 segment of: Full Service Airline
is anachronous version of: http://data.ga-group.nl/ics/bics/171112101012
is contemporary version of: http://data.ga-group.nl/ics/bics/1117101013
is replaced by: http://data.ga-group.nl/ics/bics/2020/171112101012
is version of: http://data.ga-group.nl/ics/bics/1117101013
is version of: http://data.ga-group.nl/ics/bics/171112101012
imported on: 2026-06-08T13:03:47.798Z
last refreshed on: 2026-06-08T13:03:47.798Z
source accessed on: 2019-12-03T20:05:01Z
source last accessed on: 2019-12-03T20:05:01Z
label: Aerolínea regional - serv completo @es
label: Lignes aériennes régionales - Serv compl @fr
label: Linea aerea regionale - Serv compl @it
label: Rec de companhia aérea regional, serviço completo @pt
label: Regional, Fluggesellschaft - Full-Service @de
label: Регион. авиалинии - авиалинии с полным обслуж. @ru
label: 地区航线-全方位服务 @zh
label: 地區性航線-全方位 @zh-hant
label: 地方路線旅���輸送業収益(ﾌﾙｻｰﾋﾞｽ) @ja
label: 지역 항공사 - 풀서비스 @ko
definition: This segment includes full-service carrier revenue generated from regional operations, such as contract carriers and/or regional subsidiaries.
notation: 1117101013
valid from: 2014-08-08
valid till: 2020-10-03

Other Passenger Rev - Full Svc
type: BicsLevel5Segment
type: Classifier
type: NamedIndividual
is level5 segment of: Full Service Airline
is anachronous version of: http://data.ga-group.nl/ics/bics/171112101013
is contemporary version of: http://data.ga-group.nl/ics/bics/1117101014
is replaced by: http://data.ga-group.nl/ics/bics/2020/171112101013
is version of: http://data.ga-group.nl/ics/bics/1117101014
is version of: http://data.ga-group.nl/ics/bics/171112101013
imported on: 2026-06-08T13:03:47.798Z
last refreshed on: 2026-06-08T13:03:47.798Z
source accessed on: 2019-12-03T20:05:01Z
source last accessed on: 2019-12-03T20:05:01Z
label: Altri ric passeggeri - Serv compl @it
label: Autres rev passagers - Serv compl @fr
label: Otro ingreso pasajero - serv completo @es
label: Outras rec passageiro - Serv completo @pt
label: Sonstiger Passagiererlös - Full-Service @de
label: Пр. врчк от перевозки пассажиров - авиалинии с полным обслуж. @ru
label: その他旅客輸送業収益(ﾌﾙｻｰﾋﾞｽ) @ja
label: 其他客运收入-全方位服务 @zh
label: 其他航線客運營收-全方位 @zh-hant
label: 기타 여객 수익 - 풀서비스 @ko
definition: This segment includes full-service carrier revenue generated from ancillary passenger activities, such as booking fees, baggage fees, frequent flyer programs and leasing income.
notation: 1117101014
valid from: 2014-08-08
valid till: 2020-10-03

Full Service Airline
type: BicsLevel4SubIndustry
type: Classifier
type: NamedIndividual
is sub industry of: Airlines
is anachronous version of: http://data.ga-group.nl/ics/bics/1711121010
is contemporary version of: http://data.ga-group.nl/ics/bics/11171010
is replaced by: http://data.ga-group.nl/ics/bics/2020/1711121010
is version of: http://data.ga-group.nl/ics/bics/11171010
is version of: http://data.ga-group.nl/ics/bics/1711121010
imported on: 2026-06-08T13:03:47.798Z
last refreshed on: 2026-06-08T13:03:47.798Z
source accessed on: 2019-12-03T20:05:01Z
source last accessed on: 2019-12-03T20:05:01Z
label: Aerolínea servicio completo @es
label: Compagnies aériennes service complet @fr
label: Companhia aérea de serviço completo @pt
label: Full-Service-Fluggesellschaft @de
label: Linea aerea pieno servizio @it
label: Авиакомпании с полным обслуживанием @ru
label: 全方位服务航空公司 @zh
label: 全方位航空 @zh-hant
label: 풀서비스 항공사 @ko
label: ﾌﾙｻｰﾋﾞｽ旅客航空輸送業 @ja
definition: This industry subgroup includes companies that provide traditional full-service hub-and-spoke scheduled passenger flights.
notation: 11171010
valid from: 2014-08-08
valid till: 2020-10-03

Chartered Airline - LCC
type: BicsLevel5Segment
type: Classifier
type: NamedIndividual
is level5 segment of: Low Cost Airline
is anachronous version of: http://data.ga-group.nl/ics/bics/171112101110
is contemporary version of: http://data.ga-group.nl/ics/bics/1117101110
is replaced by: http://data.ga-group.nl/ics/bics/2020/171112101110
is version of: http://data.ga-group.nl/ics/bics/1117101110
is version of: http://data.ga-group.nl/ics/bics/171112101110
imported on: 2026-06-08T13:03:47.798Z
last refreshed on: 2026-06-08T13:03:47.798Z
source accessed on: 2019-12-03T20:05:01Z
source last accessed on: 2019-12-03T20:05:01Z
label: Alquiler de aerolínea - LCC @es
label: Companhia aérea fretada - Bx cst @pt
label: Gecharterte Fluggesellschaft - LCC @de
label: Lignes aériennes charters - Bas px @fr
label: Linea aerea charter - LCC @it
label: Чартерные авиалинии - LCC @ru
label: 包机航线-廉航 @zh
label: 包機航���-廉價 @zh-hant
label: 전세기 항공사 - LCC @ko
label: ﾁｬｰﾀｰ機旅客航空輸送業収益(格安) @ja
definition: This segment includes low-cost carrier revenue generated from charted airline operations.
notation: 1117101110
valid from: 2014-08-08
valid till: 2020-10-03

Mainline Airline - LCC
type: BicsLevel5Segment
type: Classifier
type: NamedIndividual
is level5 segment of: Low Cost Airline
is anachronous version of: http://data.ga-group.nl/ics/bics/171112101111
is contemporary version of: http://data.ga-group.nl/ics/bics/1117101111
is replaced by: http://data.ga-group.nl/ics/bics/2020/171112101111
is version of: http://data.ga-group.nl/ics/bics/1117101111
is version of: http://data.ga-group.nl/ics/bics/171112101111
imported on: 2026-06-08T13:03:47.798Z
last refreshed on: 2026-06-08T13:03:47.798Z
source accessed on: 2019-12-03T20:05:01Z
source last accessed on: 2019-12-03T20:05:01Z
label: Aerolínea principal - LCC @es
label: Cies aériennes Réseau principal- Bas px @fr
label: Companhia aérea de linha principal - Bx cst @pt
label: Hauptlinie, Fluggesellschaft - LCC @de
label: Linea aerea principale - LCC @it
label: Основные авиалинии - LCC @ru
label: 主线航线-廉航 @zh
label: 主要航線-廉價 @zh-hant
label: 主要路線旅客航空輸送業収益(格安) @ja
label: 정기노선 항공사 - LCC @ko
definition: This segment includes low-cost carrier revenue generated from airline mainline operations.
notation: 1117101111
valid from: 2014-08-08
valid till: 2020-10-03

Onboard Airline - LCC
type: BicsLevel5Segment
type: Classifier
type: Discontinued
type: NamedIndividual
is level5 segment of: Low Cost Airline
is contemporary version of: http://data.ga-group.nl/ics/bics/1117101112
is version of: http://data.ga-group.nl/ics/bics/1117101112
imported on: 2026-06-08T13:03:47.798Z
last refreshed on: 2026-06-08T13:03:47.798Z
source accessed on: 2019-12-03T20:05:01Z
source last accessed on: 2019-12-03T20:05:01Z
label: Aerolínea a bordo - LCC @es
label: Cies aériennes 'A bord' - Bas px @fr
label: Companhia aérea a bordo - Bx cst @pt
label: Linea aerea a bordo - LCC @it
label: Onboard, Fluggesellschaft - LCC @de
label: Бортовой доход авиалиний - LCC @ru
label: 机舱服务-廉航 @zh
label: 機内ｻｰﾋﾞｽ収益(格安) @ja
label: 機艙服務-廉價 @zh-hant
label: 기내 항공사 - LCC @ko
definition: This segment includes low-cost carrier revenue from the sale of onboard items and services.
notation: 1117101112
valid from: 2014-08-08
valid till: 2020-10-03

Regional Airline - LCC
type: BicsLevel5Segment
type: Classifier
type: NamedIndividual
is level5 segment of: Low Cost Airline
is anachronous version of: http://data.ga-group.nl/ics/bics/171112101112
is contemporary version of: http://data.ga-group.nl/ics/bics/1117101113
is replaced by: http://data.ga-group.nl/ics/bics/2020/171112101112
is version of: http://data.ga-group.nl/ics/bics/1117101113
is version of: http://data.ga-group.nl/ics/bics/171112101112
imported on: 2026-06-08T13:03:47.798Z
last refreshed on: 2026-06-08T13:03:47.798Z
source accessed on: 2019-12-03T20:05:01Z
source last accessed on: 2019-12-03T20:05:01Z
label: Aerolínea regional - LCC @es
label: Compagnies aériennes régionales - Bas px @fr
label: Companhia aérea regional - Bx cst @pt
label: Linea aerea regionale - LCC @it
label: Regional, Fluggesellschaft - LCC @de
label: Регион. авиалинии - LCC - @ru
label: 地区航线-廉航 @zh
label: 地區性航線-廉價 @zh-hant
label: 地方路線旅客航空輸送業収益(格安) @ja
label: 지역 항공사 - LCC @ko
definition: This segment includes low-cost carrier revenue generated from regional operations, such as contract carriers and/or regional subsidiaries.
notation: 1117101113
valid from: 2014-08-08
valid till: 2020-10-03

Other Passenger Rev - LCC
type: BicsLevel5Segment
type: Classifier
type: NamedIndividual
is level5 segment of: Low Cost Airline
is anachronous version of: http://data.ga-group.nl/ics/bics/171112101113
is contemporary version of: http://data.ga-group.nl/ics/bics/1117101114
is replaced by: http://data.ga-group.nl/ics/bics/2020/171112101113
is version of: http://data.ga-group.nl/ics/bics/1117101114
is version of: http://data.ga-group.nl/ics/bics/171112101113
imported on: 2026-06-08T13:03:47.798Z
last refreshed on: 2026-06-08T13:03:47.798Z
source accessed on: 2019-12-03T20:05:01Z
source last accessed on: 2019-12-03T20:05:01Z
label: Altri ricavi passeggeri - LCC @it
label: Autres rev de passagers - Bas px @fr
label: Otro ingreso pasajero - LCC @es
label: Outra rec passageiro - Bx cst @pt
label: Sonstiger Passagiererlös - LCC @de
label: Пр. врчк от пассаж.перевозок - LCC @ru
label: その他旅客航空輸送業収益(格安) @ja
label: 其他客运收入-廉航 @zh
label: 其他航線客運營收-廉價 @zh-hant
label: 기타 여객 수익 - LCC @ko
definition: This segment includes low-cost carrier revenue from ancillary revenue, luggage handling, airport services and other items and services not elsewhere classified.
notation: 1117101114
valid from: 2014-08-08
valid till: 2020-10-03

Low Cost Airline
type: BicsLevel4SubIndustry
type: Classifier
type: NamedIndividual
is sub industry of: Airlines
is anachronous version of: http://data.ga-group.nl/ics/bics/1711121011
is contemporary version of: http://data.ga-group.nl/ics/bics/11171011
is replaced by: http://data.ga-group.nl/ics/bics/2020/1711121011
is version of: http://data.ga-group.nl/ics/bics/11171011
is version of: http://data.ga-group.nl/ics/bics/1711121011
imported on: 2026-06-08T13:03:47.798Z
last refreshed on: 2026-06-08T13:03:47.798Z
source accessed on: 2019-12-03T20:05:01Z
source last accessed on: 2019-12-03T20:05:01Z
label: Aerolíneas de bajo coste @es
label: Billigflieger @de
label: Compagnies aériennes à bas prix @fr
label: Companhia aérea baixo custo @pt
label: Linea aerea low cost @it
label: Лоукостеры @ru
label: 低成本航空公司 @zh
label: 廉價航空 @zh-hant
label: 格安旅客航空輸送業 @ja
label: 저가 항공사 @ko
definition: This industry subgroup includes airlines that operate under a low-cost business model. Such a model may include providing low ticket prices, a single passenger class and limited services.
notation: 11171011
valid from: 2014-08-08
valid till: 2020-10-03

Branded Airline - Regional
type: BicsLevel5Segment
type: Classifier
type: Discontinued
type: NamedIndividual
is level5 segment of: Regional Airline
is contemporary version of: http://data.ga-group.nl/ics/bics/1117101210
is version of: http://data.ga-group.nl/ics/bics/1117101210
imported on: 2026-06-08T13:03:47.798Z
last refreshed on: 2026-06-08T13:03:47.798Z
source accessed on: 2019-12-03T20:05:01Z
source last accessed on: 2019-12-03T20:05:01Z
label: Aerolíneas marcadas - regional @es
label: Companhia aérea de marca - Regional @pt
label: Linea aerea marca - Regionale @it
label: Markenfluglinie - Regional @de
label: Marques de lignes aériennes - Régional @fr
label: Фирменные авиалинии - регион. @ru
label: 品牌航線-地區性 @zh-hant
label: 品牌航线-地区 @zh
label: 航空会社ﾌﾞﾗﾝﾄﾞ収入 地方路線 @ja
label: 브랜드 항공사 - 지역 @ko
definition: This segment includes revenue that regional carriers generate from branded flying operations.
notation: 1117101210
valid from: 2014-08-08
valid till: 2020-10-03

Chartered Airline - Regional
type: BicsLevel5Segment
type: Classifier
type: NamedIndividual
is level5 segment of: Regional Airline
is anachronous version of: http://data.ga-group.nl/ics/bics/171112101210
is contemporary version of: http://data.ga-group.nl/ics/bics/1117101211
is replaced by: http://data.ga-group.nl/ics/bics/2020/171112101210
is version of: http://data.ga-group.nl/ics/bics/1117101211
is version of: http://data.ga-group.nl/ics/bics/171112101210
imported on: 2026-06-08T13:03:47.798Z
last refreshed on: 2026-06-08T13:03:47.798Z
source accessed on: 2019-12-03T20:05:01Z
source last accessed on: 2019-12-03T20:05:01Z
label: Alquiler de aerolínea - regional @es
label: Companhia aérea fretada - Regional @pt
label: Gecharterte Fluggesellschaft - Regional @de
label: Lignes aériennes charters - Régional @fr
label: Linea aerea charter - Regionale @it
label: Чартерные авиалинии - регион. @ru
label: 包机航线-地区 @zh
label: 包機航線-地區性 @zh-hant
label: 전세기 항공사 - 지역 @ko
label: ﾁｬｰﾀｰ機旅客航空輸送業収益(地方) @ja
definition: This segment includes regional carrier revenue generated from airline charter operations.
notation: 1117101211
valid from: 2014-08-08
valid till: 2020-10-03

Mainline Airline - Regional
type: BicsLevel5Segment
type: Classifier
type: NamedIndividual
is level5 segment of: Regional Airline
is anachronous version of: http://data.ga-group.nl/ics/bics/171112101211
is contemporary version of: http://data.ga-group.nl/ics/bics/1117101212
is replaced by: http://data.ga-group.nl/ics/bics/2020/171112101211
is version of: http://data.ga-group.nl/ics/bics/1117101212
is version of: http://data.ga-group.nl/ics/bics/171112101211
imported on: 2026-06-08T13:03:47.798Z
last refreshed on: 2026-06-08T13:03:47.798Z
source accessed on: 2019-12-03T20:05:01Z
source last accessed on: 2019-12-03T20:05:01Z
label: Aerolínea principal - regional @es
label: Cies aériennes Réseau principal - Régional @fr
label: Companhia aérea de linha principal - Regional @pt
label: Hauptlinie, Fluggesellschaft - Regional @de
label: Linea aerea principale - Regionale @it
label: Основные авиалинии - регион. @ru
label: 主线航线-地区 @zh
label: 主要航線-地區性 @zh-hant
label: 主要路線旅客航空輸送業収益(地方) @ja
label: 정기노선 항공사 - 지역 @ko
definition: This segment includes regional carrier revenue generated from airline mainline operations.
notation: 1117101212
valid from: 2014-08-08
valid till: 2020-10-03

Onboard Airline - Regional
type: BicsLevel5Segment
type: Classifier
type: Discontinued
type: NamedIndividual
is level5 segment of: Regional Airline
is contemporary version of: http://data.ga-group.nl/ics/bics/1117101213
is version of: http://data.ga-group.nl/ics/bics/1117101213
imported on: 2026-06-08T13:03:47.798Z
last refreshed on: 2026-06-08T13:03:47.798Z
source accessed on: 2019-12-03T20:05:01Z
source last accessed on: 2019-12-03T20:05:01Z
label: A bordo linea aerea - Regionale @it
label: Aerolínea a bordo - regional @es
label: Cies aériennes 'A bord' - Régional @fr
label: Companhia aérea a bordo - Regional @pt
label: Onboard, Fluggesellschaft - Regional @de
label: Бортовой дхд авиалиний - регион. @ru
label: 机舱服务-地区 @zh
label: 機内ｻｰﾋﾞｽ収益(地方) @ja
label: 機艙服務-地區性 @zh-hant
label: 기내 항공사 - 지역 @ko
definition: This segment includes regional carrier revenue generated from the sale of onboard items/services.
notation: 1117101213
valid from: 2014-08-08
valid till: 2020-10-03

Regional Airline - Regional
type: BicsLevel5Segment
type: Classifier
type: NamedIndividual
is level5 segment of: Regional Airline
is anachronous version of: http://data.ga-group.nl/ics/bics/171112101212
is contemporary version of: http://data.ga-group.nl/ics/bics/1117101214
is replaced by: http://data.ga-group.nl/ics/bics/2020/171112101212
is version of: http://data.ga-group.nl/ics/bics/1117101214
is version of: http://data.ga-group.nl/ics/bics/171112101212
imported on: 2026-06-08T13:03:47.798Z
last refreshed on: 2026-06-08T13:03:47.798Z
source accessed on: 2019-12-03T20:05:01Z
source last accessed on: 2019-12-03T20:05:01Z
label: Aerolínea regional - regional @es
label: Companhia aérea regional - Regional @pt
label: Lignes aériennes régionales - Régionales @fr
label: Linea aerea regionale - Regionale @it
label: Regional, Fluggesellschaft - Regional @de
label: Региональные авиалинии - регион. @ru
label: 地区航线-地区 @zh
label: 地區性航線-地區性 @zh-hant
label: 地���路線旅客輸送業収益 @ja
label: 지역 항공사 - 지역 @ko
definition: This segment includes regional carrier revenue generated from regional operations, such as contract carriers and/or regional subsidiaries.
notation: 1117101214
valid from: 2014-08-08
valid till: 2020-10-03

Other Passenger Rev - Regional
type: BicsLevel5Segment
type: Classifier
type: NamedIndividual
is level5 segment of: Regional Airline
is anachronous version of: http://data.ga-group.nl/ics/bics/171112101213
is contemporary version of: http://data.ga-group.nl/ics/bics/1117101215
is replaced by: http://data.ga-group.nl/ics/bics/2020/171112101213
is version of: http://data.ga-group.nl/ics/bics/1117101215
is version of: http://data.ga-group.nl/ics/bics/171112101213
imported on: 2026-06-08T13:03:47.798Z
last refreshed on: 2026-06-08T13:03:47.798Z
source accessed on: 2019-12-03T20:05:01Z
source last accessed on: 2019-12-03T20:05:01Z
label: Altri ric passeggeri - Regionale @it
label: Autres rev passagers - Régional @fr
label: Otro ingreso pasajero - regional @es
label: Outras rec passageiro - Regionaç @pt
label: Sonstige Passagiererlöse - Regional @de
label: Пр. врчк от пассаж. перевозок - регион. @ru
label: その他旅客航空輸送業収益(地方) @ja
label: 其他客运收入-地区 @zh
label: 其他航線客運營收-地區性 @zh-hant
label: 기타 여객 수익 - 지역 @ko
definition: This segment includes regional carrier revenue generated from ancillary revenue, luggage handling, airport services and other items and services not elsewhere classified.
notation: 1117101215
valid from: 2014-08-08
valid till: 2020-10-03

Regional Airline
type: BicsLevel4SubIndustry
type: Classifier
type: NamedIndividual
is sub industry of: Airlines
is anachronous version of: http://data.ga-group.nl/ics/bics/1711121012
is contemporary version of: http://data.ga-group.nl/ics/bics/11171012
is replaced by: http://data.ga-group.nl/ics/bics/2020/1711121012
is version of: http://data.ga-group.nl/ics/bics/11171012
is version of: http://data.ga-group.nl/ics/bics/1711121012
imported on: 2026-06-08T13:03:47.798Z
last refreshed on: 2026-06-08T13:03:47.798Z
source accessed on: 2019-12-03T20:05:01Z
source last accessed on: 2019-12-03T20:05:01Z
label: Aerolínea regional @es
label: Compagnie aérienne régionale @fr
label: Companhia aérea regional @pt
label: Linee aeree reg @it
label: Regionale Fluggesellschaft @de
label: Региональные авиалинии @ru
label: 地区航线 @zh
label: 地區性航線 @zh-hant
label: 地方路線旅客航空輸送業 @ja
label: 지역 항공사 @ko
definition: This industry subgroup includes companies that provide airline service from small cities. Regional carriers are also used to support larger full-service carriers.
notation: 11171012
valid from: 2014-08-08
valid till: 2020-10-03

Airlines
type: BicsLevel3Industry
type: Classifier
type: NamedIndividual
is industry of: Passenger Transportation
is anachronous version of: http://data.ga-group.nl/ics/bics/17111210
is contemporary version of: http://data.ga-group.nl/ics/bics/111710
is replaced by: http://data.ga-group.nl/ics/bics/2020/17111210
is version of: http://data.ga-group.nl/ics/bics/111710
is version of: http://data.ga-group.nl/ics/bics/17111210
imported on: 2026-06-08T13:03:47.798Z
last refreshed on: 2026-06-08T13:03:47.798Z
source accessed on: 2019-12-03T20:05:01Z
source last accessed on: 2019-12-03T20:05:01Z
label: Empresas aéreas @pt
label: Fluglinien @de
label: Líneas aéreas @es
label: Lignes aériennes @fr
label: Linee aeree @it
label: Авиалинии @ru
label: 旅客航空輸送業 @ja
label: 航空 @zh-hant
label: 航空公司 @zh
label: 항공사 @ko
definition: This industry includes companies that provide passenger air transportation services by air carriers and air commuter carriers.
notation: 111710
valid from: 2014-08-08
valid till: 2020-10-03

Passenger Rail Transport
type: BicsLevel5Segment
type: Classifier
type: NamedIndividual
is level5 segment of: Railway Services
is anachronous version of: http://data.ga-group.nl/ics/bics/171112161010
is contemporary version of: http://data.ga-group.nl/ics/bics/1117111010
is replaced by: http://data.ga-group.nl/ics/bics/2020/171112161010
is version of: http://data.ga-group.nl/ics/bics/1117111010
is version of: http://data.ga-group.nl/ics/bics/171112161010
imported on: 2026-06-08T13:03:47.798Z
last refreshed on: 2026-06-08T13:03:47.798Z
source accessed on: 2019-12-03T20:05:01Z
source last accessed on: 2019-12-03T20:05:01Z
label: Personenbeförderung mit der Bahn @de
label: Transp ferroviário de passageiro @pt
label: Transport ferrov de passagers @fr
label: Transporte ferroviario de pasajeros @es
label: Trasporto ferroviario passeggeri @it
label: Пассажирский ж/д трансп. @ru
label: 客運鐵路運輸 @zh-hant
label: 鉄道旅客輸送 @ja
label: 铁路客运 @zh
label: 여객 철도운송 @ko
definition: This segment includes companies that provide railway passenger services. Such services are provided between cities or over a long distance.
notation: 1117111010
valid from: 2014-08-08
valid till: 2020-10-03

Commuter Rail Transport
type: BicsLevel5Segment
type: Classifier
type: NamedIndividual
is level5 segment of: Railway Services
is anachronous version of: http://data.ga-group.nl/ics/bics/171112161011
is contemporary version of: http://data.ga-group.nl/ics/bics/1117111011
is replaced by: http://data.ga-group.nl/ics/bics/2020/171112161011
is version of: http://data.ga-group.nl/ics/bics/1117111011
is version of: http://data.ga-group.nl/ics/bics/171112161011
imported on: 2026-06-08T13:03:47.798Z
last refreshed on: 2026-06-08T13:03:47.798Z
source accessed on: 2019-12-03T20:05:01Z
source last accessed on: 2019-12-03T20:05:01Z
label: Bahnbeförderung von Pendlern @de
label: Transport commun ferroviaire @fr
label: Transporte ferroviário suburbano @pt
label: Transporte ferroviario de pasajeros @es
label: Trasporto ferroviario interurbano @it
label: Пригородн. ж/д транспорт @ru
label: 通勤旅客鉄道輸送 @ja
label: 通勤鐵路運輸 @zh-hant
label: 通勤铁路客运 @zh
label: 통근 철도운송 @ko
definition: This segment includes companies that operate local and suburban commuter rail systems. Such services are provided within a metropolitan area and its adjacent suburban areas. Subways are included in this segment.
notation: 1117111011
valid from: 2014-08-08
valid till: 2020-10-03

Railway Services
type: BicsLevel4SubIndustry
type: Classifier
type: NamedIndividual
is sub industry of: Transit Services
is anachronous version of: http://data.ga-group.nl/ics/bics/1711121610
is contemporary version of: http://data.ga-group.nl/ics/bics/11171110
is replaced by: http://data.ga-group.nl/ics/bics/2020/1711121610
is version of: http://data.ga-group.nl/ics/bics/11171110
is version of: http://data.ga-group.nl/ics/bics/1711121610
imported on: 2026-06-08T13:03:47.798Z
last refreshed on: 2026-06-08T13:03:47.798Z
source accessed on: 2019-12-03T20:05:01Z
source last accessed on: 2019-12-03T20:05:01Z
label: Serviços ferroviários @pt
label: Services de chemin de fer @fr
label: Servicios ferroviarios @es
label: Servizi ferroviari @it
label: Zugverkehr @de
label: Железн./дорож. услуги @ru
label: 鉄道ｻｰﾋﾞｽ @ja
label: 鐵路服務 @zh-hant
label: 铁路服务 @zh
label: 철도 서비스 @ko
definition: This industry subgroup includes companies that provide railway-based passenger transportation services.
notation: 11171110
valid from: 2014-08-08
valid till: 2020-10-03

Interurban & Rural Bus Transp
type: BicsLevel5Segment
type: Classifier
type: NamedIndividual
is level5 segment of: Bus Transit Services
is anachronous version of: http://data.ga-group.nl/ics/bics/171112161110
is contemporary version of: http://data.ga-group.nl/ics/bics/1117111110
is replaced by: http://data.ga-group.nl/ics/bics/2020/171112161110
is version of: http://data.ga-group.nl/ics/bics/1117111110
is version of: http://data.ga-group.nl/ics/bics/171112161110
imported on: 2026-06-08T13:03:47.798Z
last refreshed on: 2026-06-08T13:03:47.798Z
source accessed on: 2019-12-03T20:05:01Z
source last accessed on: 2019-12-03T20:05:01Z
label: Bustranport, überland & ländl. @de
label: Transp ônibus interurbano e rural @pt
label: Transp rural/interurbain par bus @fr
label: Transp urbana y rural de bus @es
label: Trasp autobus interurbani e rurali @it
label: Междугород. и сельские автобус. перевозки @ru
label: 城乡间公汽运输 @zh
label: 都市間即城鄉巴士運輸 @zh-hant
label: 都市間･地方ﾊﾞｽ輸送業 @ja
label: 시외 & 지방 버스 운송업 @ko
definition: This segment includes companies that provide bus passenger services outside a single metropolitan area. Such services are provided between cities or in rural areas.
notation: 1117111110
valid from: 2014-08-08
valid till: 2020-10-03

Local Bus Services
type: BicsLevel5Segment
type: Classifier
type: NamedIndividual
is level5 segment of: Bus Transit Services
is anachronous version of: http://data.ga-group.nl/ics/bics/171112161111
is contemporary version of: http://data.ga-group.nl/ics/bics/1117111111
is replaced by: http://data.ga-group.nl/ics/bics/2020/171112161111
is version of: http://data.ga-group.nl/ics/bics/1117111111
is version of: http://data.ga-group.nl/ics/bics/171112161111
imported on: 2026-06-08T13:03:47.798Z
last refreshed on: 2026-06-08T13:03:47.798Z
source accessed on: 2019-12-03T20:05:01Z
source last accessed on: 2019-12-03T20:05:01Z
label: Lokale Busdienste @de
label: Serv autobus locali @it
label: Serv de ônibus local @pt
label: Serv local autobuses @es
label: Service bus local @fr
label: Местные автобусные перевозки @ru
label: 地方ﾊﾞｽ旅客輸送 @ja
label: 通勤与短途汽车服务 @zh
label: 通勤及短途公車服務 @zh-hant
label: 시내버스서비스 @ko
definition: This segment includes companies that provide local and suburban bus passenger services within metropolitan areas and their adjacent suburban areas.
notation: 1117111111
valid from: 2014-08-08
valid till: 2020-10-03

Bus Transit Services
type: BicsLevel4SubIndustry
type: Classifier
type: NamedIndividual
is sub industry of: Transit Services
is anachronous version of: http://data.ga-group.nl/ics/bics/1711121611
is contemporary version of: http://data.ga-group.nl/ics/bics/11171111
is replaced by: http://data.ga-group.nl/ics/bics/2020/1711121611
is version of: http://data.ga-group.nl/ics/bics/11171111
is version of: http://data.ga-group.nl/ics/bics/1711121611
imported on: 2026-06-08T13:03:47.798Z
last refreshed on: 2026-06-08T13:03:47.798Z
source accessed on: 2019-12-03T20:05:01Z
source last accessed on: 2019-12-03T20:05:01Z
label: Bustransitdienste @de
label: Serv de trânsito de ônibus @pt
label: Services de bus @fr
label: Servizi di autobus @it
label: Tránsito de autobús @es
label: Транзитные автобусные услуги @ru
label: 公車轉運服務 @zh-hant
label: 汽车转运服务 @zh
label: 버스통행 서비스 @ko
label: ﾊﾞｽ旅客輸送 @ja
definition: This industry subgroup includes companies that provide bus passenger transit services. Such services can operate within metropolitan and suburban areas or between cities and urban areas.
notation: 11171111
valid from: 2014-08-08
valid till: 2020-10-03

Taxi Services
type: BicsLevel4SubIndustry
type: Classifier
type: NamedIndividual
is sub industry of: Transit Services
is anachronous version of: http://data.ga-group.nl/ics/bics/1711121612
is contemporary version of: http://data.ga-group.nl/ics/bics/11171112
is replaced by: http://data.ga-group.nl/ics/bics/2020/1711121612
is version of: http://data.ga-group.nl/ics/bics/11171112
is version of: http://data.ga-group.nl/ics/bics/1711121612
imported on: 2026-06-08T13:03:47.798Z
last refreshed on: 2026-06-08T13:03:47.798Z
source accessed on: 2019-12-03T20:05:01Z
source last accessed on: 2019-12-03T20:05:01Z
label: Serviço de táxi @pt
label: Services de taxi @fr
label: Servicios de taxis @es
label: Servizi taxi @it
label: Taxiservice @de
label: Услуги такси @ru
label: 出租车服务 @zh
label: 計程車服務 @zh-hant
label: 택시 서비스 @ko
label: ﾀｸｼｰ業 @ja
definition: This industry subgroup includes companies that provide taxi services. Such services are provided by automobile or van.
notation: 11171112
valid from: 2014-08-08
valid till: 2020-10-03

Ferry Services
type: BicsLevel4SubIndustry
type: Classifier
type: NamedIndividual
is sub industry of: Transit Services
is anachronous version of: http://data.ga-group.nl/ics/bics/1711121613
is contemporary version of: http://data.ga-group.nl/ics/bics/11171113
is replaced by: http://data.ga-group.nl/ics/bics/2020/1711121613
is version of: http://data.ga-group.nl/ics/bics/11171113
is version of: http://data.ga-group.nl/ics/bics/1711121613
imported on: 2026-06-08T13:03:47.798Z
last refreshed on: 2026-06-08T13:03:47.798Z
source accessed on: 2019-12-03T20:05:01Z
source last accessed on: 2019-12-03T20:05:01Z
label: Fährdienste @de
label: Serv ferry @pt
label: Serv transbordador @es
label: Services de ferry @fr
label: Servizi traghetto @it
label: Паромные перевозки @ru
label: 渡輪服務 @zh-hant
label: 渡轮服务 @zh
label: 連絡船輸送 @ja
label: 여객선 서비스 @ko
definition: This industry subgroup includes companies that transport passengers on ferries and other inland waters vessels that are not suited for ocean transport.
notation: 11171113
valid from: 2014-08-08
valid till: 2020-10-03

Helicopter Services
type: BicsLevel4SubIndustry
type: Classifier
type: NamedIndividual
is sub industry of: Transit Services
is anachronous version of: http://data.ga-group.nl/ics/bics/1711121614
is contemporary version of: http://data.ga-group.nl/ics/bics/11171114
is replaced by: http://data.ga-group.nl/ics/bics/2020/1711121614
is version of: http://data.ga-group.nl/ics/bics/11171114
is version of: http://data.ga-group.nl/ics/bics/1711121614
imported on: 2026-06-08T13:03:47.798Z
last refreshed on: 2026-06-08T13:03:47.798Z
source accessed on: 2019-12-03T20:05:01Z
source last accessed on: 2019-12-03T20:05:01Z
label: Helikopterservices @de
label: Serviços de helicóptero @pt
label: Services d'hélicoptères @fr
label: Servicios de helicóptero @es
label: Servizi elicottero @it
label: Вертолетные услуги @ru
label: 直升机服务 @zh
label: 直升機服務 @zh-hant
label: 헬리콥터 서비스 @ko
label: ﾍﾘｺﾌﾟﾀｰ旅客 @ja
definition: This industry subgroup includes companies that provide helicopter passenger services, such as commuter helicopter service. Excludes transportation of oil workers to oil platforms (see Oil & Gas Services).
notation: 11171114
valid from: 2014-08-08
valid till: 2020-10-03

Transit Services
type: BicsLevel3Industry
type: Classifier
type: NamedIndividual
is industry of: Passenger Transportation
is anachronous version of: http://data.ga-group.nl/ics/bics/17111216
is contemporary version of: http://data.ga-group.nl/ics/bics/111711
is replaced by: http://data.ga-group.nl/ics/bics/2020/17111216
is version of: http://data.ga-group.nl/ics/bics/111711
is version of: http://data.ga-group.nl/ics/bics/17111216
imported on: 2026-06-08T13:03:47.798Z
last refreshed on: 2026-06-08T13:03:47.798Z
source accessed on: 2019-12-03T20:05:01Z
source last accessed on: 2019-12-03T20:05:01Z
label: Serviços trânsito @pt
label: Services de transport @fr
label: Servicios de transporte @es
label: Servizi transito @it
label: Transitdienste @de
label: Услуги транзита @ru
label: 中转服务 @zh
label: 接駁服務 @zh-hant
label: 旅客輸送 @ja
label: 환승 서비스 @ko
definition: This industry includes companies that operate passenger transit systems. Includes services such as bus and commuter rail passenger transportation, as well as taxi services and ferries. Excludes airlines and cruise ships.
notation: 111711
valid from: 2014-08-08
valid till: 2020-10-03

Passenger Transportation
type: BicsLevel2IndustryGroup
type: Classifier
type: Discontinued
type: NamedIndividual
is industry group of: Consumer Discretionary
is contemporary version of: http://data.ga-group.nl/ics/bics/1117
is version of: http://data.ga-group.nl/ics/bics/1117
imported on: 2026-06-08T13:03:47.798Z
last refreshed on: 2026-06-08T13:03:47.798Z
source accessed on: 2019-12-03T20:05:01Z
source last accessed on: 2019-12-03T20:05:01Z
label: Passagiertransport @de
label: Trans de pasajeros @es
label: Transp passageiros @pt
label: Transport de passagers @fr
label: Trasporto passeggeri @it
label: Пассаж. транспорт @ru
label: 客运 @zh
label: 客運 @zh-hant
label: 旅客輸送業 @ja
label: 여객 운송업 @ko
definition: This industry group includes companies that provide regularly scheduled and charter operations to transport passengers by air or surface for a fee.
notation: 1117
valid from: 2014-08-08
valid till: 2020-10-03

Adult Nightclubs
type: BicsLevel4SubIndustry
type: Classifier
type: NamedIndividual
is sub industry of: Entertainment Facilities
is anachronous version of: http://data.ga-group.nl/ics/bics/1111111410
is contemporary version of: http://data.ga-group.nl/ics/bics/11181010
is replaced by: http://data.ga-group.nl/ics/bics/2020/1111111410
is version of: http://data.ga-group.nl/ics/bics/1111111410
is version of: http://data.ga-group.nl/ics/bics/11181010
imported on: 2026-06-08T13:03:47.798Z
last refreshed on: 2026-06-08T13:03:47.798Z
source accessed on: 2019-12-03T20:05:01Z
source last accessed on: 2019-12-03T20:05:01Z
label: Casa noturna @pt
label: Centros nocturnos @es
label: Erotikclub @de
label: Nightclub @it
label: Nightclubs adultes @fr
label: Ночные клубы для взрослых @ru
label: 成人夜总会 @zh
label: 成人夜總會 @zh-hant
label: 성인 나이트클럽 @ko
label: ﾅｲﾄｸﾗﾌﾞ @ja
definition: This industry subgroup includes companies that operate adult nightclub establishments.
notation: 11181010
valid from: 2014-08-08
valid till: 2020-10-03

Amusement Arcades
type: BicsLevel5Segment
type: Classifier
type: NamedIndividual
is level5 segment of: Amusement & Theme Parks
is anachronous version of: http://data.ga-group.nl/ics/bics/111111141110
is contemporary version of: http://data.ga-group.nl/ics/bics/1118101110
is replaced by: http://data.ga-group.nl/ics/bics/2020/111111141110
is version of: http://data.ga-group.nl/ics/bics/111111141110
is version of: http://data.ga-group.nl/ics/bics/1118101110
imported on: 2026-06-08T13:03:47.798Z
last refreshed on: 2026-06-08T13:03:47.798Z
source accessed on: 2019-12-03T20:05:01Z
source last accessed on: 2019-12-03T20:05:01Z
label: Ferias atracciones @es
label: Salões de jogos @pt
label: Sale videogiochi @it
label: Salles jeux électro. @fr
label: Spielhallen @de
label: Залы игровых автоматов @ru
label: 娯楽ｱｰｹｰﾄﾞ業 @ja
label: 游乐场 @zh
label: 遊樂庭園 @zh-hant
label: 전자게임장운영업 @ko
definition: This segment includes companies that operate amusement arcades.
notation: 1118101110
valid from: 2014-08-08
valid till: 2020-10-03

Amuse Theme Parks
type: BicsLevel5Segment
type: Classifier
type: NamedIndividual
is level5 segment of: Amusement & Theme Parks
is anachronous version of: http://data.ga-group.nl/ics/bics/111111141111
is contemporary version of: http://data.ga-group.nl/ics/bics/1118101111
is replaced by: http://data.ga-group.nl/ics/bics/2020/111111141111
is version of: http://data.ga-group.nl/ics/bics/111111141111
is version of: http://data.ga-group.nl/ics/bics/1118101111
imported on: 2026-06-08T13:03:47.798Z
last refreshed on: 2026-06-08T13:03:47.798Z
source accessed on: 2019-12-03T20:05:01Z
source last accessed on: 2019-12-03T20:05:01Z
label: Lunapark e parchi divertimento @it
label: Parcs d'attractions et arcades @fr
label: Parques temáticos e de jogos @pt
label: Parques y ferias atracciones @es
label: Vergnügungsparks & Spielhallen @de
label: Парки развлечений и отдыха @ru
label: 游乐场与主题公园 @zh
label: 遊園地･ﾃｰﾏﾊﾟｰｸ業 @ja
label: 遊樂及主題樂園 @zh-hant
label: 유원지 테마파크&아케이드 @ko
definition: This segment includes companies that operate theme park facilities.
notation: 1118101111
valid from: 2014-08-08
valid till: 2020-10-03

Amusement & Theme Parks
type: BicsLevel4SubIndustry
type: Classifier
type: NamedIndividual
is sub industry of: Entertainment Facilities
is anachronous version of: http://data.ga-group.nl/ics/bics/1111111411
is contemporary version of: http://data.ga-group.nl/ics/bics/11181011
is replaced by: http://data.ga-group.nl/ics/bics/2020/1111111411
is version of: http://data.ga-group.nl/ics/bics/1111111411
is version of: http://data.ga-group.nl/ics/bics/11181011
imported on: 2026-06-08T13:03:47.798Z
last refreshed on: 2026-06-08T13:03:47.798Z
source accessed on: 2019-12-03T20:05:01Z
source last accessed on: 2019-12-03T20:05:01Z
label: Arcades et parcs thématiques @fr
label: Lunapark e parchi a tema @it
label: Parques de atracciones y centros de entretenimiento @es
label: Parques de diversão e parques temáticos @pt
label: Vergnügungs- & Themenparks @de
label: Парки развлечений и отдыха @ru
label: 娛樂及主題樂園 @zh-hant
label: 游乐场与主题公园 @zh
label: 遊園地･ﾃｰﾏﾊﾟｰｸ･ｱｰｹｰﾄﾞ業 @ja
label: 놀이공원 & 테마파크 @ko
definition: This industry subgroup includes companies that operate theme park facilities and amusement arcades.
notation: 11181011
valid from: 2014-08-08
valid till: 2020-10-03

Entertainment Ticket Agencies
type: BicsLevel4SubIndustry
type: Classifier
type: NamedIndividual
is sub industry of: Entertainment Facilities
is anachronous version of: http://data.ga-group.nl/ics/bics/1111111412
is contemporary version of: http://data.ga-group.nl/ics/bics/11181012
is replaced by: http://data.ga-group.nl/ics/bics/2020/1111111412
is version of: http://data.ga-group.nl/ics/bics/1111111412
is version of: http://data.ga-group.nl/ics/bics/11181012
imported on: 2026-06-08T13:03:47.798Z
last refreshed on: 2026-06-08T13:03:47.798Z
source accessed on: 2019-12-03T20:05:01Z
source last accessed on: 2019-12-03T20:05:01Z
label: Agências de ingressos de entretenimento @pt
label: Agencias de boletos de entretenimiento @es
label: Agenzie biglietti intrattenimento @it
label: Billetteries de spectacles @fr
label: Unterhaltung, Kartenvorverkaufsstellen @de
label: Агентства по прдж билетов на развлек. мероприят. @ru
label: 娛樂活動售票機構 @zh-hant
label: 娱乐售票代理 @zh
label: 엔터테인���트 티켓 판매대리점 @ko
label: ﾁｹｯﾄ代理店 @ja
definition: This industry subgroup includes companies that act as agents in the sale of tickets.
notation: 11181012
valid from: 2014-08-08
valid till: 2020-10-03

Movie Theaters
type: BicsLevel4SubIndustry
type: Classifier
type: NamedIndividual
is sub industry of: Entertainment Facilities
is anachronous version of: http://data.ga-group.nl/ics/bics/1111111413
is contemporary version of: http://data.ga-group.nl/ics/bics/11181013
is replaced by: http://data.ga-group.nl/ics/bics/2020/1111111413
is version of: http://data.ga-group.nl/ics/bics/1111111413
is version of: http://data.ga-group.nl/ics/bics/11181013
imported on: 2026-06-08T13:03:47.798Z
last refreshed on: 2026-06-08T13:03:47.798Z
source accessed on: 2019-12-03T20:05:01Z
source last accessed on: 2019-12-03T20:05:01Z
label: Cinémas @fr
label: Cinemas cinematográficos exc-drive -Ins @pt
label: Cines @es
label: Kinos @de
label: Sale cinema @it
label: Кинотеатры @ru
label: 映画館 @ja
label: 电影院 @zh
label: 電影院 @zh-hant
label: 영화관 @ko
definition: This industry subgroup includes cinema viewing facilities that project motion pictures onto a large screen.
notation: 11181013
valid from: 2014-08-08
valid till: 2020-10-03

Museums & Galleries
type: BicsLevel5Segment
type: Classifier
type: NamedIndividual
is level5 segment of: Perform Arts & Museums
is anachronous version of: http://data.ga-group.nl/ics/bics/111111141410
is contemporary version of: http://data.ga-group.nl/ics/bics/1118101410
is replaced by: http://data.ga-group.nl/ics/bics/2020/111111141410
is version of: http://data.ga-group.nl/ics/bics/111111141410
is version of: http://data.ga-group.nl/ics/bics/1118101410
imported on: 2026-06-08T13:03:47.798Z
last refreshed on: 2026-06-08T13:03:47.798Z
source accessed on: 2019-12-03T20:05:01Z
source last accessed on: 2019-12-03T20:05:01Z
label: Musées/Galeries @fr
label: Museen & Gallerien @de
label: Musei e gallerie @it
label: Museos y galerías @es
label: Museus e galerias @pt
label: Музеи и галереи @ru
label: 博物館、藝廊及展場 @zh-hant
label: 博物馆、画廊及展馆 @zh
label: 美術館･画廊･展示場 @ja
label: 박물관 & 갤러리 @ko
definition: This segment includes companies that provide the facilities for displays of various artifacts primarily for educational or cultural reasons.
notation: 1118101410
valid from: 2014-08-08
valid till: 2020-10-03

Independent Artists
type: BicsLevel6Segment
type: Classifier
type: NamedIndividual
is level6 segment of: Performing Arts
is anachronous version of: http://data.ga-group.nl/ics/bics/11111114141110
is contemporary version of: http://data.ga-group.nl/ics/bics/111810141110
is replaced by: http://data.ga-group.nl/ics/bics/2020/11111114141110
is version of: http://data.ga-group.nl/ics/bics/11111114141110
is version of: http://data.ga-group.nl/ics/bics/111810141110
imported on: 2026-06-08T13:03:47.798Z
last refreshed on: 2026-06-08T13:03:47.798Z
source accessed on: 2019-12-03T20:05:01Z
source last accessed on: 2019-12-03T20:05:01Z
label: Artistas independentes @pt
label: Artistas independien @es
label: Artiste indépendant @fr
label: Artisti indipendenti @it
label: Unabhängige Künstler @de
label: Независимые художники @ru
label: 独立艺术家 @zh
label: 獨立藝術家 @zh-hant
label: 芸術･文筆自営��� @ja
label: 독립 아티스트 @ko
definition: This segment includes companies that provide performing arts production, such as choreography, cinematography, acting and directing.
notation: 111810141110
valid from: 2014-08-08
valid till: 2020-10-03

Event Promoters w/ Facilities
type: BicsLevel6Segment
type: Classifier
type: NamedIndividual
is level6 segment of: Performing Arts
is anachronous version of: http://data.ga-group.nl/ics/bics/11111114141111
is contemporary version of: http://data.ga-group.nl/ics/bics/111810141111
is replaced by: http://data.ga-group.nl/ics/bics/2020/11111114141111
is version of: http://data.ga-group.nl/ics/bics/11111114141111
is version of: http://data.ga-group.nl/ics/bics/111810141111
imported on: 2026-06-08T13:03:47.798Z
last refreshed on: 2026-06-08T13:03:47.798Z
source accessed on: 2019-12-03T20:05:01Z
source last accessed on: 2019-12-03T20:05:01Z
label: Organizzatori eventi c/strutture @it
label: Promoter mit Veranstaltungsort @de
label: Promoteurs évèn av installations @fr
label: Promotores de evento con inst @es
label: Promotores de eventos c/instalações @pt
label: Промоутеры событий в помещении @ru
label: 活动推广者(有设施) @zh
label: 自有設備活動推廣機構 @zh-hant
label: 芸術･ｽﾎﾟｰﾂｲﾍﾞﾝﾄ企画業(無施設) @ja
label: 행사 홍보업체(시설포함) @ko
definition: This segment includes companies that produce and organize live theatrical performances and provide facilities for such performances.
notation: 111810141111
valid from: 2014-08-08
valid till: 2020-10-03

Event Promoters w/o Facilities
type: BicsLevel6Segment
type: Classifier
type: NamedIndividual
is level6 segment of: Performing Arts
is anachronous version of: http://data.ga-group.nl/ics/bics/11111114141112
is contemporary version of: http://data.ga-group.nl/ics/bics/111810141112
is replaced by: http://data.ga-group.nl/ics/bics/2020/11111114141112
is version of: http://data.ga-group.nl/ics/bics/11111114141112
is version of: http://data.ga-group.nl/ics/bics/111810141112
imported on: 2026-06-08T13:03:47.798Z
last refreshed on: 2026-06-08T13:03:47.798Z
source accessed on: 2019-12-03T20:05:01Z
source last accessed on: 2019-12-03T20:05:01Z
label: Organizzatori eventi sz strutture @it
label: Promoter ohne Veranstaltungsort @de
label: Promoteurs évèn sans installations @fr
label: Promotores de evento sin instalaciones @es
label: Promotores de eventos sem instalações @pt
label: Промоутеры событий без аппаратуры @ru
label: 活动推广者(无设施) @zh
label: 無設備活動推廣機構 @zh-hant
label: 芸術･ｽﾎﾟｰﾂｲﾍﾞﾝﾄ企画業(無施設) @ja
label: 행사 홍보업체(시설제외) @ko
definition: This segment includes companies that produce events, such as concerts and sports events, but do not actually provide the facilities.
notation: 111810141112
valid from: 2014-08-08
valid till: 2020-10-03

Theaters & Dinner Theaters
type: BicsLevel6Segment
type: Classifier
type: NamedIndividual
is level6 segment of: Performing Arts
is anachronous version of: http://data.ga-group.nl/ics/bics/11111114141113
is contemporary version of: http://data.ga-group.nl/ics/bics/111810141113
is replaced by: http://data.ga-group.nl/ics/bics/2020/11111114141113
is version of: http://data.ga-group.nl/ics/bics/11111114141113
is version of: http://data.ga-group.nl/ics/bics/111810141113
imported on: 2026-06-08T13:03:47.798Z
last refreshed on: 2026-06-08T13:03:47.798Z
source accessed on: 2019-12-03T20:05:01Z
source last accessed on: 2019-12-03T20:05:01Z
label: Cinemas e cinemas com comida @pt
label: Compagnie di teatro @it
label: Teatros con y sin cena @es
label: Théâtres et cafés-théâtres @fr
label: Theater & Dinnertheater @de
label: Театры и минитеатры @ru
label: 剧院与餐馆剧院 @zh
label: 劇団･ﾃﾞｨﾅｰｼｱﾀｰ @ja
label: 劇院及晚宴劇院 @zh-hant
label: 극장 & 디너식 극장 @ko
definition: This segment includes companies that provide facilities for live theatrical performances.
notation: 111810141113
valid from: 2014-08-08
valid till: 2020-10-03

Performing Arts
type: BicsLevel5Segment
type: Classifier
type: NamedIndividual
is level5 segment of: Perform Arts & Museums
is anachronous version of: http://data.ga-group.nl/ics/bics/111111141411
is contemporary version of: http://data.ga-group.nl/ics/bics/1118101411
is replaced by: http://data.ga-group.nl/ics/bics/2020/111111141411
is version of: http://data.ga-group.nl/ics/bics/111111141411
is version of: http://data.ga-group.nl/ics/bics/1118101411
imported on: 2026-06-08T13:03:47.798Z
last refreshed on: 2026-06-08T13:03:47.798Z
source accessed on: 2019-12-03T20:05:01Z
source last accessed on: 2019-12-03T20:05:01Z
label: Arti spettacolo @it
label: Arts du spectacle @fr
label: Darstellende Künste @de
label: Espectáculos @es
label: Teatros @pt
label: Исполнительное искусство @ru
label: 舞台芸術 @ja
label: 表演艺术 @zh
label: 表演藝術 @zh-hant
label: 공연예술 @ko
definition: This segment includes companies that produce live theatrical events.
notation: 1118101411
valid from: 2014-08-08
valid till: 2020-10-03

Perform Arts & Museums
type: BicsLevel4SubIndustry
type: Classifier
type: NamedIndividual
is sub industry of: Entertainment Facilities
is anachronous version of: http://data.ga-group.nl/ics/bics/1111111414
is contemporary version of: http://data.ga-group.nl/ics/bics/11181014
is replaced by: http://data.ga-group.nl/ics/bics/2020/1111111414
is version of: http://data.ga-group.nl/ics/bics/1111111414
is version of: http://data.ga-group.nl/ics/bics/11181014
imported on: 2026-06-08T13:03:47.798Z
last refreshed on: 2026-06-08T13:03:47.798Z
source accessed on: 2019-12-03T20:05:01Z
source last accessed on: 2019-12-03T20:05:01Z
label: Arti spettacolo e musei @it
label: Arts de la scène et musées @fr
label: Atividades de museu e artes cênicas @pt
label: Aufführungen & Museen @de
label: Muestra de artes y museos @es
label: Исполнит. искусство и музеи @ru
label: 舞台芸術･博物館・美術館活動 @ja
label: 表演艺术与博物馆 @zh
label: 表演藝術及博物館 @zh-hant
label: 공연예술 & 박물관 @ko
definition: This industry subgroup includes companies that provide theatrical performances, such as plays, concerts, dance and opera. Also includes museums, zoos and botanical gardens.
notation: 11181014
valid from: 2014-08-08
valid till: 2020-10-03

Broadcast Rights - Sports Teams
type: BicsLevel5Segment
type: Classifier
type: NamedIndividual
is level5 segment of: Pro Sports & Related Activities
is anachronous version of: http://data.ga-group.nl/ics/bics/111111141510
is contemporary version of: http://data.ga-group.nl/ics/bics/1118101510
is replaced by: http://data.ga-group.nl/ics/bics/2020/111111141510
is version of: http://data.ga-group.nl/ics/bics/111111141510
is version of: http://data.ga-group.nl/ics/bics/1118101510
imported on: 2026-06-08T13:03:47.798Z
last refreshed on: 2026-06-08T13:03:47.798Z
source accessed on: 2019-12-03T20:05:01Z
source last accessed on: 2019-12-03T20:05:01Z
label: Derechos de transmisión - equipos deportivos @es
label: Direitos de transmissão- Equipes desportivas @pt
label: Diritti televisivi - Squadre sportive @it
label: Droits de diffusions - Equipes sportives @fr
label: Rundfunkrechte - Mannschaften @de
label: Права на трансляцию - спорт. команды @ru
label: 轉播權利金-運動團隊 @zh-hant
label: 转播权-运动队 @zh
label: 방영권 - 스포츠팀 @ko
label: ﾒﾃﾞｨｱ･放送権-ｽﾎﾟｰﾂ･ﾁｰﾑ @ja
definition: This segment includes companies that manage the media and broadcasting rights of sports teams.
notation: 1118101510
valid from: 2014-08-08
valid till: 2020-10-03

Gate Receipts
type: BicsLevel5Segment
type: Classifier
type: NamedIndividual
is level5 segment of: Pro Sports & Related Activities
is anachronous version of: http://data.ga-group.nl/ics/bics/111111141511
is contemporary version of: http://data.ga-group.nl/ics/bics/1118101511
is replaced by: http://data.ga-group.nl/ics/bics/2020/111111141511
is version of: http://data.ga-group.nl/ics/bics/111111141511
is version of: http://data.ga-group.nl/ics/bics/1118101511
imported on: 2026-06-08T13:03:47.798Z
last refreshed on: 2026-06-08T13:03:47.798Z
source accessed on: 2019-12-03T20:05:01Z
source last accessed on: 2019-12-03T20:05:01Z
label: 'Gate Receipts' @ru
label: Eintrittseinnahmen @de
label: Entrées - Sport @fr
label: Entrate cassa @it
label: Recibos de entrada @es
label: Recibos de portaria @pt
label: 入場料収入 @ja
label: 門票收入 @zh-hant
label: 门票收入 - 运动队 @zh
label: 입장수입 @ko
definition: This segment includes companies that provide ticket sales for live sporting events.
notation: 1118101511
valid from: 2014-08-08
valid till: 2020-10-03

Sports Merchandising
type: BicsLevel5Segment
type: Classifier
type: NamedIndividual
is level5 segment of: Pro Sports & Related Activities
is anachronous version of: http://data.ga-group.nl/ics/bics/111111141512
is contemporary version of: http://data.ga-group.nl/ics/bics/1118101512
is replaced by: http://data.ga-group.nl/ics/bics/2020/111111141512
is version of: http://data.ga-group.nl/ics/bics/111111141512
is version of: http://data.ga-group.nl/ics/bics/1118101512
imported on: 2026-06-08T13:03:47.798Z
last refreshed on: 2026-06-08T13:03:47.798Z
source accessed on: 2019-12-03T20:05:01Z
source last accessed on: 2019-12-03T20:05:01Z
label: Mercancía deportiva @es
label: Merce sportiva @it
label: Prod dériv sportifs @fr
label: Propaganda de esporte @pt
label: Werbeartikel Sport @de
label: Спортивные товары @ru
label: 商品 - 运动队 @zh
label: 商品 - 運動團隊 @zh-hant
label: 상품-스포츠팀 @ko
label: ﾁｰﾑｽﾎﾟｰﾂ商品販売 @ja
definition: This segment includes companies that utilize sports trademarks to sell branded merchandise.
notation: 1118101512
valid from: 2014-08-08
valid till: 2020-10-03

Sports Teams
type: BicsLevel5Segment
type: Classifier
type: NamedIndividual
is level5 segment of: Pro Sports & Related Activities
is anachronous version of: http://data.ga-group.nl/ics/bics/111111141513
is contemporary version of: http://data.ga-group.nl/ics/bics/1118101513
is replaced by: http://data.ga-group.nl/ics/bics/2020/111111141513
is version of: http://data.ga-group.nl/ics/bics/111111141513
is version of: http://data.ga-group.nl/ics/bics/1118101513
imported on: 2026-06-08T13:03:47.798Z
last refreshed on: 2026-06-08T13:03:47.798Z
source accessed on: 2019-12-03T20:05:01Z
source last accessed on: 2019-12-03T20:05:01Z
label: Equipes de esporte @pt
label: Equipes sportives @fr
label: Equipos deportivos @es
label: Sportmannschaften @de
label: Squadre sportive @it
label: Спорт. команды @ru
label: 運動團體 @zh-hant
label: 스포츠 팀 /클럽 @ko
label: ｽﾎﾟｰﾂﾁｰﾑ @ja
label: ���动队和俱乐部 @zh
definition: This segment includes sports clubs that participate in live sporting events, such as baseball and football.
notation: 1118101513
valid from: 2014-08-08
valid till: 2020-10-03

Pro Sports & Related Activities
type: BicsLevel4SubIndustry
type: Classifier
type: NamedIndividual
is sub industry of: Entertainment Facilities
is anachronous version of: http://data.ga-group.nl/ics/bics/1111111415
is contemporary version of: http://data.ga-group.nl/ics/bics/11181015
is replaced by: http://data.ga-group.nl/ics/bics/2020/1111111415
is version of: http://data.ga-group.nl/ics/bics/1111111415
is version of: http://data.ga-group.nl/ics/bics/11181015
imported on: 2026-06-08T13:03:47.798Z
last refreshed on: 2026-06-08T13:03:47.798Z
source accessed on: 2019-12-03T20:05:01Z
source last accessed on: 2019-12-03T20:05:01Z
label: Actividades deportivas profesionales @es
label: Berufssport @de
label: Esportes prof e atividades relacionadas @pt
label: Sport professionale e attività associate @it
label: Sport professionnel et activités connexes @fr
label: Спортивная деятельность @ru
label: 职业体育与相关活动 @zh
label: 職業體育及相關活動 @zh-hant
label: 프로 스포츠 & 관련 활동 @ko
label: ﾌﾟﾛｽﾎﾟｰﾂ･関連事業 @ja
definition: This industry subgroup includes companies that provide professional sports activities.
notation: 11181015
valid from: 2014-08-08
valid till: 2020-10-03

Entertainment Facilities
type: BicsLevel3Industry
type: Classifier
type: NamedIndividual
is industry of: Recreation Facilities & Svcs
is anachronous version of: http://data.ga-group.nl/ics/bics/11111114
is contemporary version of: http://data.ga-group.nl/ics/bics/111810
is replaced by: http://data.ga-group.nl/ics/bics/2020/11111114
is version of: http://data.ga-group.nl/ics/bics/11111114
is version of: http://data.ga-group.nl/ics/bics/111810
imported on: 2026-06-08T13:03:47.798Z
last refreshed on: 2026-06-08T13:03:47.798Z
source accessed on: 2019-12-03T20:05:01Z
source last accessed on: 2019-12-03T20:05:01Z
label: Centres de divertissement @fr
label: Instalações entretenimento @pt
label: Instalaciones de entretenimiento @es
label: Servizi intrattenimento @it
label: Unterhaltungsanlagen @de
label: Места провед. развлекат. мероприят. @ru
label: 娛樂設施 @zh-hant
label: 娯楽施設 @ja
label: 娱乐设施 @zh
label: 엔터테인먼트 시설 @ko
definition: This industry includes companies that operate various types of entertainment facilities, such as movie theaters, amusement parks, sports stadiums and arenas, and adult nightclubs.
notation: 111810
valid from: 2014-08-08
valid till: 2020-10-03

Recreational Goods Rental
type: BicsLevel4SubIndustry
type: Classifier
type: Discontinued
type: NamedIndividual
is sub industry of: Leisure & Travel Services
is contemporary version of: http://data.ga-group.nl/ics/bics/11181110
is version of: http://data.ga-group.nl/ics/bics/11181110
imported on: 2026-06-08T13:03:47.798Z
last refreshed on: 2026-06-08T13:03:47.798Z
source accessed on: 2019-12-03T20:05:01Z
source last accessed on: 2019-12-03T20:05:01Z
label: Alquiler recreación @es
label: Loc équipt récréatif @fr
label: Locaz art tem libero @it
label: Rec bens aluguel @pt
label: Vermietg Freizeit @de
label: Прокат рекреационных товаров @ru
label: 休闲物品出租 @zh
label: 娛樂用品出租 @zh-hant
label: 여가용품 임대업 @ko
label: ﾚｼﾞｬｰ用品ﾚﾝﾀﾙ業 @ja
definition: This industry subgroup includes companies that rent recreational goods, such as ski equipment, personal watercraft and golf carts.
notation: 11181110
valid from: 2014-08-08
valid till: 2020-10-03

Sports & Recreation Instruction
type: BicsLevel4SubIndustry
type: Classifier
type: Discontinued
type: NamedIndividual
is sub industry of: Leisure & Travel Services
is contemporary version of: http://data.ga-group.nl/ics/bics/11181111
is version of: http://data.ga-group.nl/ics/bics/11181111
imported on: 2026-06-08T13:03:47.798Z
last refreshed on: 2026-06-08T13:03:47.798Z
source accessed on: 2019-12-03T20:05:01Z
source last accessed on: 2019-12-03T20:05:01Z
label: Escuelas de deporte y recreación @es
label: Formation loisirs et sports @fr
label: Instrução de esportes e recreações @pt
label: Istruzioni sportive @it
label: Sport- & Freizeiteinrichtungen @de
label: Инструктаж для спорта и любительских спорт. игр @ru
label: 体育与休闲教学 @zh
label: 體育及娛樂業學校 @zh-hant
label: 스포츠 & 레크레이션 지도 @ko
label: ｽﾎﾟｰﾂ･ﾚｸﾘｴｰｼｮﾝ指導業 @ja
definition: This industry subgroup includes companies that provide instruction for sporting and recreational activities.
notation: 11181111
valid from: 2014-08-08
valid till: 2020-10-03

Tour Operators
type: BicsLevel5Segment
type: Classifier
type: NamedIndividual
is level5 segment of: Travel Services
is anachronous version of: http://data.ga-group.nl/ics/bics/1111111510
is contemporary version of: http://data.ga-group.nl/ics/bics/1118111210
is replaced by: http://data.ga-group.nl/ics/bics/2020/1111111510
is version of: http://data.ga-group.nl/ics/bics/1111111510
is version of: http://data.ga-group.nl/ics/bics/1118111210
imported on: 2026-06-08T13:03:47.798Z
last refreshed on: 2026-06-08T13:03:47.798Z
source accessed on: 2019-12-03T20:05:01Z
source last accessed on: 2019-12-03T20:05:01Z
label: Operadores turísticos @pt
label: Organiz excursiones @es
label: Reiseveranstalter @de
label: Tour operator @it
label: Voyagistes @fr
label: Тур-операторы @ru
label: 旅行安排 @zh
label: 行程規劃商 @zh-hant
label: 투어 오퍼레이터 @ko
label: ﾂｱｰｵﾍﾟﾚｰﾀｰ業 @ja
definition: This segment includes companies that arrange and operate tours.
notation: 1118111210
valid from: 2014-08-08
valid till: 2020-10-03

Retail Travel Agencies
type: BicsLevel6Segment
type: Classifier
type: Discontinued
type: NamedIndividual
is level6 segment of: Travel Agencies
is contemporary version of: http://data.ga-group.nl/ics/bics/111811121110
is version of: http://data.ga-group.nl/ics/bics/111811121110
imported on: 2026-06-08T13:03:47.798Z
last refreshed on: 2026-06-08T13:03:47.798Z
source accessed on: 2019-12-03T20:05:01Z
source last accessed on: 2019-12-03T20:05:01Z
label: Agências de viagens @pt
label: Agences de voyage @fr
label: Agencias viaje p/men @es
label: Agenzie viaggi @it
label: Reisebüros @de
label: Агентства путешествий @ru
label: 旅行代理店-ﾘﾃｰﾙ @ja
label: 旅行社 @zh-hant
label: 零售旅行社 @zh
label: 여행사 @ko
definition: This segment includes companies that act as agents in the sale of travel and tour packages and who provide their services through retail locations.
notation: 111811121110
valid from: 2014-08-08
valid till: 2020-10-03

Travel Agencies
type: BicsLevel5Segment
type: Classifier
type: NamedIndividual
is level5 segment of: Travel Services
is anachronous version of: http://data.ga-group.nl/ics/bics/1111111511
is contemporary version of: http://data.ga-group.nl/ics/bics/1118111211
is replaced by: http://data.ga-group.nl/ics/bics/2020/1111111511
is version of: http://data.ga-group.nl/ics/bics/1111111511
is version of: http://data.ga-group.nl/ics/bics/1118111211
imported on: 2026-06-08T13:03:47.798Z
last refreshed on: 2026-06-08T13:03:47.798Z
source accessed on: 2019-12-03T20:05:01Z
source last accessed on: 2019-12-03T20:05:01Z
label: Agências de viagens @pt
label: Agences de voyage @fr
label: Agencias de viaje @es
label: Agenzie viaggi @it
label: Reisebüros @de
label: Туристические фирмы @ru
label: 旅行代理店 @ja
label: 旅行社 @zh
label: 여행사 @ko
definition: This segment includes companies that act as agents in the sale of travel and tour packages.
notation: 1118111211
valid from: 2014-08-08
valid till: 2020-10-03

Travel Reservation Services
type: BicsLevel5Segment
type: Classifier
type: NamedIndividual
is level5 segment of: Travel Services
is anachronous version of: http://data.ga-group.nl/ics/bics/1111111512
is contemporary version of: http://data.ga-group.nl/ics/bics/1118111212
is replaced by: http://data.ga-group.nl/ics/bics/2020/1111111512
is version of: http://data.ga-group.nl/ics/bics/1111111512
is version of: http://data.ga-group.nl/ics/bics/1118111212
imported on: 2026-06-08T13:03:47.798Z
last refreshed on: 2026-06-08T13:03:47.798Z
source accessed on: 2019-12-03T20:05:01Z
source last accessed on: 2019-12-03T20:05:01Z
label: Reisebuchungen @de
label: Serviços de reserva de viagem @pt
label: Service de réservation voyage @fr
label: Servicios de viaje @es
label: Servizi prenotazione viaggio @it
label: Услуги резервирования путешествий @ru
label: 旅游预订服务 @zh
label: 旅行予約ｻｰﾋﾞｽ業 @ja
label: 旅行預訂服務 @zh-hant
label: 여행예약 서비스 @ko
definition: This segment includes companies that arrange travel reservation services. It also includes companies that provide time-share exchange services.
notation: 1118111212
valid from: 2014-08-08
valid till: 2020-10-03

Travel Services
type: BicsLevel4SubIndustry
type: Classifier
type: NamedIndividual
is sub industry of: Leisure & Travel Services
is anachronous version of: http://data.ga-group.nl/ics/bics/11111115
is contemporary version of: http://data.ga-group.nl/ics/bics/11181112
is replaced by: http://data.ga-group.nl/ics/bics/2020/11111115
is version of: http://data.ga-group.nl/ics/bics/11111115
is version of: http://data.ga-group.nl/ics/bics/11181112
imported on: 2026-06-08T13:03:47.798Z
last refreshed on: 2026-06-08T13:03:47.798Z
source accessed on: 2019-12-03T20:05:01Z
source last accessed on: 2019-12-03T20:05:01Z
label: Reisebüros @de
label: Serviços de viagem @pt
label: Services de voyage @fr
label: Servicios de viaje @es
label: Servizi viaggi @it
label: Турист. услуги @ru
label: 旅行服务 @zh
label: 旅行ｻｰﾋﾞｽ @ja
label: 旅遊服務業 @zh-hant
label: 여행 서비스 @ko
definition: This industry subgroup includes companies that provide travel arrangement and/or tour operating services.
notation: 11181112
valid from: 2014-08-08
valid till: 2020-10-03

Leisure & Travel Services
type: BicsLevel3Industry
type: Classifier
type: Discontinued
type: NamedIndividual
is industry of: Recreation Facilities & Svcs
is contemporary version of: http://data.ga-group.nl/ics/bics/111811
is version of: http://data.ga-group.nl/ics/bics/111811
imported on: 2026-06-08T13:03:47.798Z
last refreshed on: 2026-06-08T13:03:47.798Z
source accessed on: 2019-12-03T20:05:01Z
source last accessed on: 2019-12-03T20:05:01Z
label: Agences voyage/loisir @fr
label: Reisebüros @de
label: Serv lazer/viagem @pt
label: Servizi di viaggio @it
label: Svcs tpo libre/viaje @es
label: Туристические услуги @ru
label: 休閒及旅遊服務 @zh-hant
label: 休闲与旅游服务 @zh
label: 레저&여행서비스 @ko
label: ﾚｼﾞｬｰ､旅行ｻｰﾋﾞｽ @ja
definition: This industry includes travel agencies, tour operators, sports instruction services and recreational goods rental. Excludes Internet-based booking services (see Travel Info & Booking Web).
notation: 111811
valid from: 2014-08-08
valid till: 2020-10-03

Bowling Centers
type: BicsLevel4SubIndustry
type: Classifier
type: NamedIndividual
is sub industry of: Leisure Clubs & Facilities
is anachronous version of: http://data.ga-group.nl/ics/bics/1111111416
is contemporary version of: http://data.ga-group.nl/ics/bics/11181210
is replaced by: http://data.ga-group.nl/ics/bics/2020/1111111416
is version of: http://data.ga-group.nl/ics/bics/1111111416
is version of: http://data.ga-group.nl/ics/bics/11181210
imported on: 2026-06-08T13:03:47.798Z
last refreshed on: 2026-06-08T13:03:47.798Z
source accessed on: 2019-12-03T20:05:01Z
source last accessed on: 2019-12-03T20:05:01Z
label: Bowlingzentren @de
label: Centri di bowling @it
label: Centros de boliche @es
label: Salles de bowling @fr
label: Боулинг-центры @ru
label: 保齡球場 @zh-hant
label: 保龄球中心 @zh
label: 볼링장 운영업 @ko
label: ﾎﾞｳﾘﾝｸﾞ場 @ja
definition: This industry subgroup includes companies that operate bowling alleys.
notation: 11181210
valid from: 2014-08-08
valid till: 2020-10-03

Fitness & Recreation Centers
type: BicsLevel4SubIndustry
type: Classifier
type: NamedIndividual
is sub industry of: Leisure Clubs & Facilities
is anachronous version of: http://data.ga-group.nl/ics/bics/1111111417
is contemporary version of: http://data.ga-group.nl/ics/bics/11181211
is replaced by: http://data.ga-group.nl/ics/bics/2020/1111111417
is version of: http://data.ga-group.nl/ics/bics/1111111417
is version of: http://data.ga-group.nl/ics/bics/11181211
imported on: 2026-06-08T13:03:47.798Z
last refreshed on: 2026-06-08T13:03:47.798Z
source accessed on: 2019-12-03T20:05:01Z
source last accessed on: 2019-12-03T20:05:01Z
label: Centres de mise en forme et récréatifs @fr
label: Centros de ginástica e de recreação @pt
label: Fitness e centri ricreativi @it
label: Fitness- & Freizeitcenter @de
label: Gimnasios y centros recreativos @es
label: Фитнес-центры и центры от��ыха @ru
label: 健身及休閒活動中心 @zh-hant
label: 健身和休闲运动中心 @zh
label: 휘트니스 & 레크레이션 센터 @ko
label: ﾌｨｯﾄﾈｽ･娯楽ｽﾎﾟｰﾂ施設 @ja
definition: This industry subgroup includes companies that operate fitness and recreation sports centers, such as athletic club facilities, health spas without accommodations, ice- or roller-skating rinks and swimming pools.
notation: 11181211
valid from: 2014-08-08
valid till: 2020-10-03

Golf Courses & Country Clubs
type: BicsLevel4SubIndustry
type: Classifier
type: NamedIndividual
is sub industry of: Leisure Clubs & Facilities
is anachronous version of: http://data.ga-group.nl/ics/bics/1111111418
is contemporary version of: http://data.ga-group.nl/ics/bics/11181212
is replaced by: http://data.ga-group.nl/ics/bics/2020/1111111418
is version of: http://data.ga-group.nl/ics/bics/1111111418
is version of: http://data.ga-group.nl/ics/bics/11181212
imported on: 2026-06-08T13:03:47.798Z
last refreshed on: 2026-06-08T13:03:47.798Z
source accessed on: 2019-12-03T20:05:01Z
source last accessed on: 2019-12-03T20:05:01Z
label: Campi da golf e country club @it
label: Campos de golf @es
label: Clubes de campo e cursos de golfe @pt
label: Golfplätze & Gesellschaftsklubs @de
label: Terrains de golf et country clubs @fr
label: Поля для гольфа и загородные клубы @ru
label: 高尔夫球场及乡村俱乐部 @zh
label: 高爾夫球場及鄉村俱樂部 @zh-hant
label: 골프장 및 골프클럽 운영업 @ko
label: ｺﾞﾙﾌｺｰｽ･ｶﾝﾄﾘｰｸﾗﾌﾞ @ja
definition: This industry subgroup includes companies that operate golf courses and country clubs.
notation: 11181212
valid from: 2014-08-08
valid till: 2020-10-03

Marinas
type: BicsLevel4SubIndustry
type: Classifier
type: NamedIndividual
is sub industry of: Leisure Clubs & Facilities
is anachronous version of: http://data.ga-group.nl/ics/bics/1111111419
is contemporary version of: http://data.ga-group.nl/ics/bics/11181213
is replaced by: http://data.ga-group.nl/ics/bics/2020/1111111419
is version of: http://data.ga-group.nl/ics/bics/1111111419
is version of: http://data.ga-group.nl/ics/bics/11181213
imported on: 2026-06-08T13:03:47.798Z
last refreshed on: 2026-06-08T13:03:47.798Z
source accessed on: 2019-12-03T20:05:01Z
source last accessed on: 2019-12-03T20:05:01Z
label: Jachthäfen @de
label: Marinas turísticas @es
label: Marinhas @pt
label: Porti turistici @it
label: Пристани @ru
label: 停泊施設業 @ja
label: 码头 @zh
label: 船屋 @zh-hant
label: 수상오락 운영업 @ko
definition: This industry subgroup includes facilities that support the operation of recreational water transports like boats, yachts and wave-runners.
notation: 11181213
valid from: 2014-08-08
valid till: 2020-10-03

Skiing Facilities
type: BicsLevel4SubIndustry
type: Classifier
type: NamedIndividual
is sub industry of: Leisure Clubs & Facilities
is anachronous version of: http://data.ga-group.nl/ics/bics/1111111420
is contemporary version of: http://data.ga-group.nl/ics/bics/11181214
is replaced by: http://data.ga-group.nl/ics/bics/2020/1111111420
is version of: http://data.ga-group.nl/ics/bics/1111111420
is version of: http://data.ga-group.nl/ics/bics/11181214
imported on: 2026-06-08T13:03:47.798Z
last refreshed on: 2026-06-08T13:03:47.798Z
source accessed on: 2019-12-03T20:05:01Z
source last accessed on: 2019-12-03T20:05:01Z
label: Centres de ski @fr
label: Instalações de esqui @pt
label: Pistas para esquiar @es
label: Skianlagen @de
label: Strutture per lo sci @it
label: Лыжные базы @ru
label: 滑雪場 @zh-hant
label: 滑雪设施 @zh
label: 스키장 운영업 @ko
label: ｽｷｰ施設業 @ja
definition: This industry subgroup includes companies that operate ski mountain trails, lifts and ski resorts. These companies may provide lodging and dining in addition to the operation of ski trails.
notation: 11181214
valid from: 2014-08-08
valid till: 2020-10-03

Karaoke Operations
type: BicsLevel5Segment
type: Classifier
type: Discontinued
type: NamedIndividual
is level5 segment of: Other Amusement & Recreation
is contemporary version of: http://data.ga-group.nl/ics/bics/1118121510
is version of: http://data.ga-group.nl/ics/bics/1118121510
imported on: 2026-06-08T13:03:47.798Z
last refreshed on: 2026-06-08T13:03:47.798Z
source accessed on: 2019-12-03T20:05:01Z
source last accessed on: 2019-12-03T20:05:01Z
label: Karaoke @fr
label: Karaokebetrieb @de
label: Operações de karaokê @pt
label: Operaciones karaoke @es
label: Operazione Karaoke @it
label: Караоке @ru
label: 卡拉OK營運 @zh-hant
label: 卡拉OK经营 @zh
label: 카라오케 영업 @ko
label: ｶﾗｵｹ店経営 @ja
definition: This segment includes companies that operate karaoke facilities.
notation: 1118121510
valid from: 2014-08-08
valid till: 2020-10-03

Other Amusement & Recreation
type: BicsLevel4SubIndustry
type: Classifier
type: Discontinued
type: NamedIndividual
is sub industry of: Leisure Clubs & Facilities
is contemporary version of: http://data.ga-group.nl/ics/bics/11181215
is version of: http://data.ga-group.nl/ics/bics/11181215
imported on: 2026-06-08T13:03:47.798Z
last refreshed on: 2026-06-08T13:03:47.798Z
source accessed on: 2019-12-03T20:05:01Z
source last accessed on: 2019-12-03T20:05:01Z
label: Altri divertimento e svago @it
label: Autres services de divertissement et loisirs @fr
label: Otra recreación y entretenimiento @es
label: Outras instalações de entretenimento e recreação @pt
label: Sonstige Vergnügung & Freizeit @de
label: Др. развлечения и отдых @ru
label: その他全娯楽･ﾚｸﾘｴｰｼｮﾝ業 @ja
label: 其他娛樂及休閒 @zh-hant
label: 其他娱乐与休闲 @zh
label: 기타 오락 & 레크레이션 @ko
definition: This industry subgroup includes entertainment facilities not elsewhere classified, such as recreation parks (not theme parks), ski hills (not ski resorts), fairs, shows, beach chair or locker rentals, dance floors, fishing charters, campgrounds and circus events.
notation: 11181215
valid from: 2014-08-08
valid till: 2020-10-03

Leisure Clubs & Facilities
type: BicsLevel3Industry
type: Classifier
type: Discontinued
type: NamedIndividual
is industry of: Recreation Facilities & Svcs
is contemporary version of: http://data.ga-group.nl/ics/bics/111812
is version of: http://data.ga-group.nl/ics/bics/111812
imported on: 2026-06-08T13:03:47.798Z
last refreshed on: 2026-06-08T13:03:47.798Z
source accessed on: 2019-12-03T20:05:01Z
source last accessed on: 2019-12-03T20:05:01Z
label: Clubs/complexes de loisirs @fr
label: Freizeiteinrichtung @de
label: Inst e clubes lazer @pt
label: Locales p/ recreac @es
label: Strutture e club tempo libero @it
label: Клубы и места отдыха @ru
label: 休閒俱樂部及設施 @zh-hant
label: 休闲俱乐部和设施 @zh
label: 레저 클럽 & 시설 @ko
label: ﾚｼﾞｬｰ･ｸﾗﾌﾞ､施設 @ja
definition: This industry includes golf courses and country clubs, bowling centers, fitness centers, small-craft marinas, and skiing facilities without lodging.
notation: 111812
valid from: 2014-08-08
valid till: 2020-10-03

Recreation Facilities & Svcs
type: BicsLevel2IndustryGroup
type: Classifier
type: Discontinued
type: NamedIndividual
is industry group of: Consumer Discretionary
is contemporary version of: http://data.ga-group.nl/ics/bics/1118
is version of: http://data.ga-group.nl/ics/bics/1118
imported on: 2026-06-08T13:03:47.798Z
last refreshed on: 2026-06-08T13:03:47.798Z
source accessed on: 2019-12-03T20:05:01Z
source last accessed on: 2019-12-03T20:05:01Z
label: Freizeitanlagen & -dienste @de
label: Instalaciones y servicios de entretenimiento @es
label: Installations et serv récréatifs @fr
label: Serv e instalações recreativos @pt
label: Serv e strutture ricreative @it
label: Места и услуги отдыха и развлеч. @ru
label: 休閒娛樂設備及服務 @zh-hant
label: 娯楽施設､ｻｰﾋﾞｽ @ja
label: 娱乐设施及服务 @zh
label: 레크레이션 시설 & 서비스 @ko
definition: This industry group includes companies that operate establishments in the entertainment facilities and services, leisure and travel services, and leisure clubs and facilities businesses.
notation: 1118
valid from: 2014-08-08
valid till: 2020-10-03

Clothing & Accessories Whslrs
type: BicsLevel4SubIndustry
type: Classifier
type: NamedIndividual
is sub industry of: Apparel & Footwear Whslrs
is anachronous version of: http://data.ga-group.nl/ics/bics/1112101010
is contemporary version of: http://data.ga-group.nl/ics/bics/11191010
is replaced by: http://data.ga-group.nl/ics/bics/2020/1112101010
is version of: http://data.ga-group.nl/ics/bics/1112101010
is version of: http://data.ga-group.nl/ics/bics/11191010
imported on: 2026-06-08T13:03:47.798Z
last refreshed on: 2026-06-08T13:03:47.798Z
source accessed on: 2019-12-03T20:05:01Z
source last accessed on: 2019-12-03T20:05:01Z
label: Atac de roupas e acessórios @pt
label: Großhändler für Kleidung & Accessoires @de
label: Gross vêtements et accessoires @fr
label: Grossisti abbigl e accessori @it
label: Vta al por mayor de ropa y accesorios @es
label: Опт. торговля - одежда и аксессуары @ru
label: 服装与饰品批发商 @zh
label: 服裝及飾品批發 @zh-hant
label: 衣服･装飾品卸売 @ja
label: 의류 & 액세서리 도매업 @ko
definition: This industry subgroup includes companies that wholesale and distribute men's, women's, children's and infants' clothing.
notation: 11191010
valid from: 2014-08-08
valid till: 2020-10-03

Footwear Wholesalers
type: BicsLevel4SubIndustry
type: Classifier
type: NamedIndividual
is sub industry of: Apparel & Footwear Whslrs
is anachronous version of: http://data.ga-group.nl/ics/bics/1112101011
is contemporary version of: http://data.ga-group.nl/ics/bics/11191011
is replaced by: http://data.ga-group.nl/ics/bics/2020/1112101011
is version of: http://data.ga-group.nl/ics/bics/1112101011
is version of: http://data.ga-group.nl/ics/bics/11191011
imported on: 2026-06-08T13:03:47.798Z
last refreshed on: 2026-06-08T13:03:47.798Z
source accessed on: 2019-12-03T20:05:01Z
source last accessed on: 2019-12-03T20:05:01Z
label: Atacadistas de calçados @pt
label: Comercio al por mayor de calzado @es
label: Großhändler für Fußbekleidung @de
label: Grossistes en chaussures @fr
label: Grossisti calzature @it
label: Оптовая торговля - обувь @ru
label: 履物卸売 @ja
label: 鞋袜批发商 @zh
label: 鞋類批發 @zh-hant
label: 신발 제품 도매업 @ko
definition: This industry subgroup includes companies that wholesale and distribute leather, rubber and composite material footwear.
notation: 11191011
valid from: 2014-08-08
valid till: 2020-10-03

Apparel & Footwear Whslrs
type: BicsLevel3Industry
type: Classifier
type: NamedIndividual
is industry of: Distributors - Discretionary
is anachronous version of: http://data.ga-group.nl/ics/bics/11121010
is contemporary version of: http://data.ga-group.nl/ics/bics/111910
is replaced by: http://data.ga-group.nl/ics/bics/2020/11121010
is version of: http://data.ga-group.nl/ics/bics/11121010
is version of: http://data.ga-group.nl/ics/bics/111910
imported on: 2026-06-08T13:03:47.798Z
last refreshed on: 2026-06-08T13:03:47.798Z
source accessed on: 2019-12-03T20:05:01Z
source last accessed on: 2019-12-03T20:05:01Z
label: Atacad vestuário e calçados @pt
label: Bekleidung & Schuhe - GH @de
label: Grossistes vêtements et chaussures @fr
label: Grossisti abbigl e calzature @it
label: Mayoristas ropa y calzado @es
label: Одежда и обувь - Оптовики @ru
label: 服装与鞋类批发 @zh
label: 服飾及鞋類批發 @zh-hant
label: 衣料･履物卸売業 @ja
label: 의류 & 신발 도매업 @ko
definition: This industry includes companies that wholesale fashion apparel, sports clothing, outerwear, gloves, ties, belts and footwear, including fashion footwear and athletic footwear.
notation: 111910
valid from: 2014-08-08
valid till: 2020-10-03

Auto & Motor Vehicles Whslrs
type: BicsLevel4SubIndustry
type: Classifier
type: NamedIndividual
is sub industry of: Automotive Wholesalers
is anachronous version of: http://data.ga-group.nl/ics/bics/1112101110
is contemporary version of: http://data.ga-group.nl/ics/bics/11191110
is replaced by: http://data.ga-group.nl/ics/bics/2020/1112101110
is version of: http://data.ga-group.nl/ics/bics/1112101110
is version of: http://data.ga-group.nl/ics/bics/11191110
imported on: 2026-06-08T13:03:47.798Z
last refreshed on: 2026-06-08T13:03:47.798Z
source accessed on: 2019-12-03T20:05:01Z
source last accessed on: 2019-12-03T20:05:01Z
label: Atac veículos motorizados e automóveis @pt
label: Großhändler für Autos & Kfz @de
label: Gross en automobiles/véhicules motorisés @fr
label: Grossisti auto e motoveicoli @it
label: Mayoristas automotrices @es
label: Опт. торговля - автомобили и транспортн. средства @ru
label: 汽車及車輛總經銷 @zh-hant
label: 汽车与机动车批发商 @zh
label: 自動車卸売 @ja
label: 자동차 & 차량 도매업 @ko
definition: This industry subgroup includes companies that wholesale and distribute new and used passenger automobiles, trucks, trailers and other motor vehicles, such as motorcycles, motor homes and snowmobiles.
notation: 11191110
valid from: 2014-08-08
valid till: 2020-10-03

Mot Veh Parts (Used) Whslrs
type: BicsLevel4SubIndustry
type: Classifier
type: Discontinued
type: NamedIndividual
is sub industry of: Automotive Wholesalers
is contemporary version of: http://data.ga-group.nl/ics/bics/11191111
is version of: http://data.ga-group.nl/ics/bics/11191111
imported on: 2026-06-08T13:03:47.798Z
last refreshed on: 2026-06-08T13:03:47.798Z
source accessed on: 2019-12-03T20:05:01Z
source last accessed on: 2019-12-03T20:05:01Z
label: Atacadistas de peças de veículos motorizados (usadas) @pt
label: Comercio al por mayor de autopartes (usadas) @es
label: Großhändler für Fahrzeugteile (gebraucht) @de
label: Grossistes de pièces de véhicules motorisés (usagées) @fr
label: Ricambi all'ingrosso (usati) per automezzi @it
label: Оптовая торговля б/у запчастями для автотранспорта @ru
label: 機車零件(二手)批發 @zh-hant
label: 汽车部件（二手）批发商 @zh
label: 自動車部品(中古)卸売 @ja
label: 자동차 부품 (중고) 도매업 @ko
definition: This industry subgroup includes companies that wholesale and distribute used motor vehicle parts.
notation: 11191111
valid from: 2014-08-08
valid till: 2020-10-03

Motor Vehicle Supplies Whslrs
type: BicsLevel4SubIndustry
type: Classifier
type: NamedIndividual
is sub industry of: Automotive Wholesalers
is anachronous version of: http://data.ga-group.nl/ics/bics/1112101111
is contemporary version of: http://data.ga-group.nl/ics/bics/11191112
is replaced by: http://data.ga-group.nl/ics/bics/2020/1112101111
is version of: http://data.ga-group.nl/ics/bics/1112101111
is version of: http://data.ga-group.nl/ics/bics/11191112
imported on: 2026-06-08T13:03:47.798Z
last refreshed on: 2026-06-08T13:03:47.798Z
source accessed on: 2019-12-03T20:05:01Z
source last accessed on: 2019-12-03T20:05:01Z
label: Atac suprimentos para veículos motorizados @pt
label: Großhändler für Kfz-Zubehör @de
label: Gross fournitures pour véh motorisés @fr
label: Grossisti forniture motoveicoli @it
label: Vta al por mayor provisiones automotrices @es
label: Опт. торговля - товары для автотранспорта @ru
label: 机动车用品批发商 @zh
label: 自動車付属品卸売 @ja
label: 車輛用品批發 @zh-hant
label: 자동차 용품 도매업 @ko
definition: This industry subgroup includes companies that wholesale and distribute new motor vehicle parts, accessories, tools and equipment.
notation: 11191112
valid from: 2014-08-08
valid till: 2020-10-03

Tire Wholesalers
type: BicsLevel4SubIndustry
type: Classifier
type: NamedIndividual
is sub industry of: Automotive Wholesalers
is anachronous version of: http://data.ga-group.nl/ics/bics/1112101112
is contemporary version of: http://data.ga-group.nl/ics/bics/11191113
is replaced by: http://data.ga-group.nl/ics/bics/2020/1112101112
is version of: http://data.ga-group.nl/ics/bics/1112101112
is version of: http://data.ga-group.nl/ics/bics/11191113
imported on: 2026-06-08T13:03:47.798Z
last refreshed on: 2026-06-08T13:03:47.798Z
source accessed on: 2019-12-03T20:05:01Z
source last accessed on: 2019-12-03T20:05:01Z
label: Atacadistas de pneus @pt
label: Comercio al por mayor de llantas @es
label: Großhändler für Reifen @de
label: Grossistes de pneus @fr
label: Ingrosso ruote @it
label: Оптовая торговля шинами @ru
label: 輪胎及內胎商品批發 @zh-hant
label: 轮胎与内胎批发商 @zh
label: 타이어 도매업 @ko
label: ﾀｲﾔ卸売 @ja
definition: This industry subgroup includes companies that wholesale and distribute automotive tire products.
notation: 11191113
valid from: 2014-08-08
valid till: 2020-10-03

Automotive Wholesalers
type: BicsLevel3Industry
type: Classifier
type: NamedIndividual
is industry of: Distributors - Discretionary
is anachronous version of: http://data.ga-group.nl/ics/bics/11121011
is contemporary version of: http://data.ga-group.nl/ics/bics/111911
is replaced by: http://data.ga-group.nl/ics/bics/2020/11121011
is version of: http://data.ga-group.nl/ics/bics/11121011
is version of: http://data.ga-group.nl/ics/bics/111911
imported on: 2026-06-08T13:03:47.798Z
last refreshed on: 2026-06-08T13:03:47.798Z
source accessed on: 2019-12-03T20:05:01Z
source last accessed on: 2019-12-03T20:05:01Z
label: Atacadistas automóveis @pt
label: Grossistes en automobiles @fr
label: Grossisti automobilistici @it
label: Kfz-Großhändler @de
label: Mayoristas de autos @es
label: Автомобильные оптовые магазины @ru
label: 汽車總經銷 @zh-hant
label: 汽车批发商 @zh
label: 自動車卸売 @ja
label: 자동차 도매업 @ko
definition: This industry includes companies that wholesale and distribute motor vehicles and parts. Excludes companies that manufacture motor vehicles or their parts.
notation: 111911
valid from: 2014-08-08
valid till: 2020-10-03

Computer & Software Whslrs
type: BicsLevel4SubIndustry
type: Classifier
type: NamedIndividual
is sub industry of: Consumer Elec & Applc Whslrs
is anachronous version of: http://data.ga-group.nl/ics/bics/1112101210
is contemporary version of: http://data.ga-group.nl/ics/bics/11191210
is replaced by: http://data.ga-group.nl/ics/bics/2020/1112101210
is version of: http://data.ga-group.nl/ics/bics/1112101210
is version of: http://data.ga-group.nl/ics/bics/11191210
imported on: 2026-06-08T13:03:47.798Z
last refreshed on: 2026-06-08T13:03:47.798Z
source accessed on: 2019-12-03T20:05:01Z
source last accessed on: 2019-12-03T20:05:01Z
label: Atac computador e software @pt
label: Großhändler für Computer & Software @de
label: Gross ordinateurs et logiciels @fr
label: Grossisti computer e software @it
label: Vta al p/mayor de ordenadores y software @es
label: Опт. торговля - компьютеры и ПО @ru
label: 计算机与软件批发商 @zh
label: 電腦及軟體批發 @zh-hant
label: 컴퓨터 & 소프트웨어 도매업 @ko
label: ｺﾝﾋﾟｭｰﾀ機器･ｿﾌﾄｳｴｱ卸売 @ja
definition: This industry subgroup includes companies that wholesale and distribute computer and computer peripheral equipment. Products include computer boards, computer software, motherboards and printers.
notation: 11191210
valid from: 2014-08-08
valid till: 2020-10-03

Photo Equip & Supplies Whslrs
type: BicsLevel4SubIndustry
type: Classifier
type: NamedIndividual
is sub industry of: Consumer Elec & Applc Whslrs
is anachronous version of: http://data.ga-group.nl/ics/bics/1112101211
is contemporary version of: http://data.ga-group.nl/ics/bics/11191211
is replaced by: http://data.ga-group.nl/ics/bics/2020/1112101211
is version of: http://data.ga-group.nl/ics/bics/1112101211
is version of: http://data.ga-group.nl/ics/bics/11191211
imported on: 2026-06-08T13:03:47.798Z
last refreshed on: 2026-06-08T13:03:47.798Z
source accessed on: 2019-12-03T20:05:01Z
source last accessed on: 2019-12-03T20:05:01Z
label: Atac equip e suprimentos para fotos @pt
label: Comercio al por mayor de equipo fotográfico y provisiones @es
label: Großhändler für Fotogeräte & -zubehör @de
label: Gross fournitures et équip photo @fr
label: Grossisti app e forn foto @it
label: Опт. торговля - фотооборудование и товарами @ru
label: 写真機器･付属品卸売 @ja
label: 摄影器材与用品批发商 @zh
label: 照相設備及用品批發 @zh-hant
label: 사진���비 & 용품 도매업 @ko
definition: This industry subgroup includes companies that wholesale and distribute photographic equipment and supplies. Products include camera equipment, motion picture cameras, projection equipment and theater equipment.
notation: 11191211
valid from: 2014-08-08
valid till: 2020-10-03

Consumer Elec & Applc Whslrs
type: BicsLevel3Industry
type: Classifier
type: NamedIndividual
is industry of: Distributors - Discretionary
is anachronous version of: http://data.ga-group.nl/ics/bics/11121012
is contemporary version of: http://data.ga-group.nl/ics/bics/111912
is replaced by: http://data.ga-group.nl/ics/bics/2020/11121012
is version of: http://data.ga-group.nl/ics/bics/11121012
is version of: http://data.ga-group.nl/ics/bics/111912
imported on: 2026-06-08T13:03:47.798Z
last refreshed on: 2026-06-08T13:03:47.798Z
source accessed on: 2019-12-03T20:05:01Z
source last accessed on: 2019-12-03T20:05:01Z
label: Atac eletrod e elet consumo @pt
label: Comercio al por mayor de electrodomésticos @es
label: Großhändler für Verbraucherlektr. & HH-Geräte @de
label: Gross électron grand public et appareils ménagers @fr
label: Grossisti elett consumo e elettdom @it
label: Опт. торговля - быт. техника и электрон. @ru
label: 消費性電子產品及家電批發 @zh-hant
label: 消费电子电器批发商 @zh
label: 소비자 전자제품 & 애플리케이션 도매업 @ko
label: ﾃﾚﾋﾞ･電化製品卸売 @ja
definition: This industry includes companies that wholesale and distribute household consumer electronics and appliances. Includes consumer electronics, household appliances, photography equipment, computers and software.
notation: 111912
valid from: 2014-08-08
valid till: 2020-10-03

Furniture Wholesalers
type: BicsLevel4SubIndustry
type: Classifier
type: Discontinued
type: NamedIndividual
is sub industry of: Home & Office Product Whslrs
is contemporary version of: http://data.ga-group.nl/ics/bics/11191310
is version of: http://data.ga-group.nl/ics/bics/11191310
imported on: 2026-06-08T13:03:47.798Z
last refreshed on: 2026-06-08T13:03:47.798Z
source accessed on: 2019-12-03T20:05:01Z
source last accessed on: 2019-12-03T20:05:01Z
label: Atacadistas de móveis @pt
label: Großhändler für Möbel @de
label: Grossistes en mobilier @fr
label: Grossisti mobili @it
label: Vta al por mayor de muebles @es
label: Оптовая торговля мебелью @ru
label: 家具批发商 @zh
label: 家具批發 @zh-hant
label: 家���卸売業 @ja
label: 가구 도매업 @ko
definition: This industry subgroup includes companies that wholesale home or office furniture manufactured by various furniture manufacturing companies. They do not manufacture the furniture themselves.
notation: 11191310
valid from: 2014-08-08
valid till: 2020-10-03

Hardware Wholesalers
type: BicsLevel4SubIndustry
type: Classifier
type: NamedIndividual
is sub industry of: Home & Office Product Whslrs
is anachronous version of: http://data.ga-group.nl/ics/bics/1112101310
is contemporary version of: http://data.ga-group.nl/ics/bics/11191311
is replaced by: http://data.ga-group.nl/ics/bics/2020/1112101310
is version of: http://data.ga-group.nl/ics/bics/1112101310
is version of: http://data.ga-group.nl/ics/bics/11191311
imported on: 2026-06-08T13:03:47.798Z
last refreshed on: 2026-06-08T13:03:47.798Z
source accessed on: 2019-12-03T20:05:01Z
source last accessed on: 2019-12-03T20:05:01Z
label: Atacadistas de hardware @pt
label: Comercio al por mayor de herrajes @es
label: Großhändler für Hardware @de
label: Grossistes en matériel informatique @fr
label: Grossisti ferramenta @it
label: Оптовая торговля - скобяные изделия @ru
label: 五金批发商 @zh
label: 五金批發 @zh-hant
label: 하드웨어 도매업 @ko
label: ﾊｰﾄﾞｳｴｱ卸売業 @ja
definition: This industry subgroup includes companies that wholesale and distribute hand tools, fasteners and hardware. Products include blades, staples, nuts, bolts, screws and hand tools.
notation: 11191311
valid from: 2014-08-08
valid till: 2020-10-03

Home Furnishing Wholesalers
type: BicsLevel4SubIndustry
type: Classifier
type: NamedIndividual
is sub industry of: Home & Office Product Whslrs
is anachronous version of: http://data.ga-group.nl/ics/bics/1112101311
is contemporary version of: http://data.ga-group.nl/ics/bics/11191312
is replaced by: http://data.ga-group.nl/ics/bics/2020/1112101311
is version of: http://data.ga-group.nl/ics/bics/1112101311
is version of: http://data.ga-group.nl/ics/bics/11191312
imported on: 2026-06-08T13:03:47.798Z
last refreshed on: 2026-06-08T13:03:47.798Z
source accessed on: 2019-12-03T20:05:01Z
source last accessed on: 2019-12-03T20:05:01Z
label: Atacadistas de mobílias para casa @pt
label: Großhändler für Einrichtungsgegenstände @de
label: Grossistes en ameublement de maison @fr
label: Grossisti arredi casa @it
label: Vta al por mayor de muebles para el hogar @es
label: Опт. торговля - мебель для дома @ru
label: 室内装飾品卸売業 @ja
label: 家装批发商 @zh
label: 家飾品批發 @zh-hant
label: 가정용 가구 도매업 @ko
definition: This industry subgroup includes companies that wholesale home furnishings used to beautify or add comfort to a home. They do not manufacture anything themselves. Home furnishings may include items like crystal, kitchen utensils, porcelain vases, artwork and floriculture products.
notation: 11191312
valid from: 2014-08-08
valid till: 2020-10-03

Office Equip Wholesalers
type: BicsLevel4SubIndustry
type: Classifier
type: NamedIndividual
is sub industry of: Home & Office Product Whslrs
is anachronous version of: http://data.ga-group.nl/ics/bics/1112101312
is contemporary version of: http://data.ga-group.nl/ics/bics/11191313
is replaced by: http://data.ga-group.nl/ics/bics/2020/1112101312
is version of: http://data.ga-group.nl/ics/bics/1112101312
is version of: http://data.ga-group.nl/ics/bics/11191313
imported on: 2026-06-08T13:03:47.798Z
last refreshed on: 2026-06-08T13:03:47.798Z
source accessed on: 2019-12-03T20:05:01Z
source last accessed on: 2019-12-03T20:05:01Z
label: Atacadistas de equip escritório @pt
label: Großhändler für Büromaschinen @de
label: Gross matériel de bureau @fr
label: Grossisti app ufficio @it
label: Vtas al por mayor de equipo oficina @es
label: Оптовая торговля - оф��сное оборудование @ru
label: 事務用機器卸売業 @ja
label: 办公设备批发商 @zh
label: 辦公設備批發 @zh-hant
label: 사무장비 도매업 @ko
definition: This industry subgroup includes companies that wholesale and distribute office machines and related equipment. Includes accounting machines, cash registers, postage meters, safes and copying machines.
notation: 11191313
valid from: 2014-08-08
valid till: 2020-10-03

Paint Wholesalers
type: BicsLevel4SubIndustry
type: Classifier
type: NamedIndividual
is sub industry of: Home & Office Product Whslrs
is anachronous version of: http://data.ga-group.nl/ics/bics/1112101313
is contemporary version of: http://data.ga-group.nl/ics/bics/11191314
is replaced by: http://data.ga-group.nl/ics/bics/2020/1112101313
is version of: http://data.ga-group.nl/ics/bics/1112101313
is version of: http://data.ga-group.nl/ics/bics/11191314
imported on: 2026-06-08T13:03:47.798Z
last refreshed on: 2026-06-08T13:03:47.798Z
source accessed on: 2019-12-03T20:05:01Z
source last accessed on: 2019-12-03T20:05:01Z
label: Atacadistas de tintas @pt
label: Comercio al por mayor de pinturas @es
label: Großhändler für Farben @de
label: Grossistes en peinture @fr
label: Grossisti vernici @it
label: Оптовая торговля - краска @ru
label: 塗料卸売 @ja
label: 油漆批发商 @zh
label: 油漆用品批發 @zh-hant
label: 페인트 도매업 @ko
definition: This industry subgroup includes companies that wholesale and distribute paints, coatings, wallpaper, paintbrushes, rollers and related supplies.
notation: 11191314
valid from: 2014-08-08
valid till: 2020-10-03

Print & Writing Paper Whslrs
type: BicsLevel4SubIndustry
type: Classifier
type: NamedIndividual
is sub industry of: Home & Office Product Whslrs
is anachronous version of: http://data.ga-group.nl/ics/bics/1112101314
is contemporary version of: http://data.ga-group.nl/ics/bics/11191315
is replaced by: http://data.ga-group.nl/ics/bics/2020/1112101314
is version of: http://data.ga-group.nl/ics/bics/1112101314
is version of: http://data.ga-group.nl/ics/bics/11191315
imported on: 2026-06-08T13:03:47.798Z
last refreshed on: 2026-06-08T13:03:47.798Z
source accessed on: 2019-12-03T20:05:01Z
source last accessed on: 2019-12-03T20:05:01Z
label: Atac papel para escrita e impressão @pt
label: Comercio al por mayor de papeles de impresión y escritura @es
label: Großhändler für Druck- & Schreibpapier @de
label: Gross papier imprimerie/pour écrire @fr
label: Grossisti carta stampa e scrivere @it
label: Опт. торговля типограф. и писчей бумагой @ru
label: 列印及書寫用紙批發 @zh-hant
label: 印刷･筆記用紙卸売 @ja
label: 打印与书写纸张��发商 @zh
label: 인쇄 & 필기용지 도매업 @ko
definition: This industry subgroup includes companies that wholesale and distribute bulk printing and writing paper.
notation: 11191315
valid from: 2014-08-08
valid till: 2020-10-03

Stationery & Office Supp Whslrs
type: BicsLevel4SubIndustry
type: Classifier
type: NamedIndividual
is sub industry of: Home & Office Product Whslrs
is anachronous version of: http://data.ga-group.nl/ics/bics/1112101315
is contemporary version of: http://data.ga-group.nl/ics/bics/11191316
is replaced by: http://data.ga-group.nl/ics/bics/2020/1112101315
is version of: http://data.ga-group.nl/ics/bics/1112101315
is version of: http://data.ga-group.nl/ics/bics/11191316
imported on: 2026-06-08T13:03:47.798Z
last refreshed on: 2026-06-08T13:03:47.798Z
source accessed on: 2019-12-03T20:05:01Z
source last accessed on: 2019-12-03T20:05:01Z
label: Atac equip de escritório e de papelaria @pt
label: Comercio al mayor de artículos de papelería y de oficina @es
label: Großhändler für Schreib- & Bürowaren @de
label: Gross papeterie/fournitures de bureau @fr
label: Grossisti forn uff e cancelleria @it
label: Опт. торговля - канцтовары и товары для офиса @ru
label: 文具与办公用品批发商 @zh
label: 文具及辦公用品批發 @zh-hant
label: 文房具･事務用品卸売業 @ja
label: 문구 & 사무용품 도매업 @ko
definition: This industry subgroup includes companies that wholesale and distribute stationery, office supplies and gift wrap.
notation: 11191316
valid from: 2014-08-08
valid till: 2020-10-03

Home & Office Product Whslrs
type: BicsLevel3Industry
type: Classifier
type: NamedIndividual
is industry of: Distributors - Discretionary
is anachronous version of: http://data.ga-group.nl/ics/bics/11121013
is contemporary version of: http://data.ga-group.nl/ics/bics/111913
is replaced by: http://data.ga-group.nl/ics/bics/2020/11121013
is version of: http://data.ga-group.nl/ics/bics/11121013
is version of: http://data.ga-group.nl/ics/bics/111913
imported on: 2026-06-08T13:03:47.798Z
last refreshed on: 2026-06-08T13:03:47.798Z
source accessed on: 2019-12-03T20:05:01Z
source last accessed on: 2019-12-03T20:05:01Z
label: Atacad prod para casa e escritório @pt
label: Grossistes articles de maison/bureau @fr
label: Grossisti prod casa e ufficio @it
label: Haus- & Büroprodukte - GH @de
label: Mayoristas productos hogar y of @es
label: Товары для дома и офиса - Оптовики @ru
label: 家居和办公产品批发 @zh
label: 家庭及辦公室產品批發 @zh-hant
label: 家庭･事務用品卸売業 @ja
label: 가정용 & 사무용품 도매업 @ko
definition: This industry includes companies that wholesale home or office furniture, home furnishings, office equipment, paint, wallpaper and personal or office stationery.
notation: 111913
valid from: 2014-08-08
valid till: 2020-10-03

Book, Periodical & News Whslrs
type: BicsLevel4SubIndustry
type: Classifier
type: NamedIndividual
is sub industry of: Other Wholesalers
is anachronous version of: http://data.ga-group.nl/ics/bics/1112101410
is contemporary version of: http://data.ga-group.nl/ics/bics/11191410
is replaced by: http://data.ga-group.nl/ics/bics/2020/1112101410
is version of: http://data.ga-group.nl/ics/bics/1112101410
is version of: http://data.ga-group.nl/ics/bics/11191410
imported on: 2026-06-08T13:03:47.798Z
last refreshed on: 2026-06-08T13:03:47.798Z
source accessed on: 2019-12-03T20:05:01Z
source last accessed on: 2019-12-03T20:05:01Z
label: Atac de livros, jornais e revistas @pt
label: Großhändler für Bücher, Zeitschriften & Zeitungen @de
label: Gross livres, magazines et journaux @fr
label: Grossisti libri, periodici, notizie @it
label: Vta al por mayor de libros, periódicos y noticias @es
label: Опт. торговля - книги, периодика и газеты @ru
label: 书刊报纸批发商 @zh
label: 書籍/期刊/報紙批發 @zh-hant
label: 書籍･定期刊行物･新聞卸売業 @ja
label: 서적, 정기간행물 & 신문 도매업 @ko
definition: This industry subgroup includes companies that wholesale books, audiobooks and periodicals to retail stores.
notation: 11191410
valid from: 2014-08-08
valid till: 2020-10-03

Fabric & Textile Wholesalers
type: BicsLevel4SubIndustry
type: Classifier
type: NamedIndividual
is sub industry of: Other Wholesalers
is anachronous version of: http://data.ga-group.nl/ics/bics/1112101411
is contemporary version of: http://data.ga-group.nl/ics/bics/11191411
is replaced by: http://data.ga-group.nl/ics/bics/2020/1112101411
is version of: http://data.ga-group.nl/ics/bics/1112101411
is version of: http://data.ga-group.nl/ics/bics/11191411
imported on: 2026-06-08T13:03:47.798Z
last refreshed on: 2026-06-08T13:03:47.798Z
source accessed on: 2019-12-03T20:05:01Z
source last accessed on: 2019-12-03T20:05:01Z
label: Atacadistas de tecidos e têxteis @pt
label: Comercio al por mayor de telas y textiles @es
label: Großhändler für Stoffe & Textilien @de
label: Grossistes en tissus et textiles @fr
label: Grossisti tessili e tessuti @it
label: Опт. торговля - ткани и текстильные изделия @ru
label: 紡織品批發 @zh-hant
label: 織物･繊維卸売 @ja
label: 面料与纺织品批发商 @zh
label: 직물 & 섬유 도매업 @ko
definition: This industry subgroup includes companies that wholesale fabrics and textiles, such as yarn, linen and other fabrics to retailers. Excludes companies that manufacture textiles.
notation: 11191411
valid from: 2014-08-08
valid till: 2020-10-03

Florist Supply Wholesalers
type: BicsLevel4SubIndustry
type: Classifier
type: NamedIndividual
is sub industry of: Other Wholesalers
is anachronous version of: http://data.ga-group.nl/ics/bics/1112101412
is contemporary version of: http://data.ga-group.nl/ics/bics/11191412
is replaced by: http://data.ga-group.nl/ics/bics/2020/1112101412
is version of: http://data.ga-group.nl/ics/bics/1112101412
is version of: http://data.ga-group.nl/ics/bics/11191412
imported on: 2026-06-08T13:03:47.798Z
last refreshed on: 2026-06-08T13:03:47.798Z
source accessed on: 2019-12-03T20:05:01Z
source last accessed on: 2019-12-03T20:05:01Z
label: Atacadistas de suprimentos para floristas @pt
label: Comercio al por mayor de provisiones a florerías @es
label: Großhändler für Floristenzubehör @de
label: Grossistes en fournitures pour fleuristes @fr
label: Grossisti forniture per fiorai @it
label: Опт. торговля товарами для флористики @ru
label: 生花店関連備品卸売 @ja
label: 花卉苗圃用品批發 @zh-hant
label: 花店用品批发商 @zh
label: 꽃꽂이 용품 도매업 @ko
definition: This industry subgroup includes companies that wholesale and distribute flowers, florists supplies and nursery materials.
notation: 11191412
valid from: 2014-08-08
valid till: 2020-10-03

Industrial Paper Wholesalers
type: BicsLevel4SubIndustry
type: Classifier
type: NamedIndividual
is sub industry of: Other Wholesalers
is anachronous version of: http://data.ga-group.nl/ics/bics/1112101413
is contemporary version of: http://data.ga-group.nl/ics/bics/11191413
is replaced by: http://data.ga-group.nl/ics/bics/2020/1112101413
is version of: http://data.ga-group.nl/ics/bics/1112101413
is version of: http://data.ga-group.nl/ics/bics/11191413
imported on: 2026-06-08T13:03:47.798Z
last refreshed on: 2026-06-08T13:03:47.798Z
source accessed on: 2019-12-03T20:05:01Z
source last accessed on: 2019-12-03T20:05:01Z
label: Atacadistas de papel industrial @pt
label: Comercio al por mayor de papel industrial @es
label: Großhändler für Industriepapier @de
label: Grossistes en papier industriel @fr
label: Grossisti carta industriale @it
label: Оптовая торговля промышленной бумагой @ru
label: 工业用纸批发商 @zh
label: 工業紙類批發 @zh-hant
label: 業務用紙卸売 @ja
label: 산업용 제지 도매업 @ko
definition: This industry subgroup includes companies that wholesale and distribute craft wrapping, paperboard, converted paper and disposable paper products.
notation: 11191413
valid from: 2014-08-08
valid till: 2020-10-03

Jewelry Wholesalers
type: BicsLevel4SubIndustry
type: Classifier
type: NamedIndividual
is sub industry of: Other Wholesalers
is anachronous version of: http://data.ga-group.nl/ics/bics/1112101012
is contemporary version of: http://data.ga-group.nl/ics/bics/11191414
is replaced by: http://data.ga-group.nl/ics/bics/2020/1112101012
is version of: http://data.ga-group.nl/ics/bics/1112101012
is version of: http://data.ga-group.nl/ics/bics/11191414
imported on: 2026-06-08T13:03:47.798Z
last refreshed on: 2026-06-08T13:03:47.798Z
source accessed on: 2019-12-03T20:05:01Z
source last accessed on: 2019-12-03T20:05:01Z
label: Atacadistas de joias @pt
label: Comercio al por mayor de joyería @es
label: Großhändler für Schmuck @de
label: Grossistes en bijoux @fr
label: Grossisti gioielli @it
label: Оптовая торговля - ювелирные изделия @ru
label: 宝石卸売 @ja
label: 珠宝批发商 @zh
label: 珠寶批發 @zh-hant
label: 보석 도매업 @ko
definition: This industry subgroup includes companies that wholesale and distribute jewelry, watches, precious stones and precious metal goods. Products include clocks, diamonds, pearls and silverware.
notation: 11191414
valid from: 2014-08-08
valid till: 2020-10-03

Ophthalmic Goods Wholesalers
type: BicsLevel4SubIndustry
type: Classifier
type: NamedIndividual
is sub industry of: Other Wholesalers
is anachronous version of: http://data.ga-group.nl/ics/bics/1112101414
is contemporary version of: http://data.ga-group.nl/ics/bics/11191415
is replaced by: http://data.ga-group.nl/ics/bics/2020/1112101414
is version of: http://data.ga-group.nl/ics/bics/1112101414
is version of: http://data.ga-group.nl/ics/bics/11191415
imported on: 2026-06-08T13:03:47.798Z
last refreshed on: 2026-06-08T13:03:47.798Z
source accessed on: 2019-12-03T20:05:01Z
source last accessed on: 2019-12-03T20:05:01Z
label: Atacadistas de produtos oftalmológicos @pt
label: Comercio al por mayor de bienes oftálmicos @es
label: Großhändler für ophthalmische Produkte @de
label: Grossistes en produits ophtalmiques @fr
label: Grossisti articoli oftalmici @it
label: Опт.-торговля -офтальмологические товары @ru
label: 眼科產品批發 @zh-hant
label: 眼科用品卸売業 @ja
label: 眼科用品批发商 @zh
label: 안과용품 도매업 @ko
definition: This industry subgroup includes companies that wholesale and distribute professional equipment, instruments, and/or goods sold, prescribed or used by ophthalmologists, optometrists and opticians.
notation: 11191415
valid from: 2014-08-08
valid till: 2020-10-03

Sporting Goods Wholesalers
type: BicsLevel4SubIndustry
type: Classifier
type: NamedIndividual
is sub industry of: Other Wholesalers
is anachronous version of: http://data.ga-group.nl/ics/bics/1112101415
is contemporary version of: http://data.ga-group.nl/ics/bics/11191416
is replaced by: http://data.ga-group.nl/ics/bics/2020/1112101415
is version of: http://data.ga-group.nl/ics/bics/1112101415
is version of: http://data.ga-group.nl/ics/bics/11191416
imported on: 2026-06-08T13:03:47.798Z
last refreshed on: 2026-06-08T13:03:47.798Z
source accessed on: 2019-12-03T20:05:01Z
source last accessed on: 2019-12-03T20:05:01Z
label: Atacadistas de artigos esportivos @pt
label: Comercio al por mayor de bienes deportivos @es
label: Großhändler für Sportprodukte @de
label: Grossistes en articles de sport @fr
label: Grossisti articoli sportivi @it
label: Опт. торговля - спортивные товары @ru
label: 体育用品批发商 @zh
label: 運動用品批發 @zh-hant
label: 스포츠용품 도매업 @ko
label: ｽﾎﾟｰﾂ用品卸売 @ja
definition: This industry subgroup includes companies that wholesale and distribute sporting goods and related products. Products include athletic uniforms and apparel, athletic equipment and athletic supplies.
notation: 11191416
valid from: 2014-08-08
valid till: 2020-10-03

Toys & Games Whslrs
type: BicsLevel4SubIndustry
type: Classifier
type: NamedIndividual
is sub industry of: Other Wholesalers
is anachronous version of: http://data.ga-group.nl/ics/bics/1112101416
is contemporary version of: http://data.ga-group.nl/ics/bics/11191417
is replaced by: http://data.ga-group.nl/ics/bics/2020/1112101416
is version of: http://data.ga-group.nl/ics/bics/1112101416
is version of: http://data.ga-group.nl/ics/bics/11191417
imported on: 2026-06-08T13:03:47.798Z
last refreshed on: 2026-06-08T13:03:47.798Z
source accessed on: 2019-12-03T20:05:01Z
source last accessed on: 2019-12-03T20:05:01Z
label: Atac brinquedos e artigos de hobby @pt
label: Großhändler für Spielzeug & Spiele @de
label: Gross jeux/jouets @fr
label: Grossisti giocattoli e giochi @it
label: Venta al por mayor de juguetes y juegos @es
label: Опт. торговля - игрушки и игры @ru
label: がん具･ｹﾞｰﾑ卸売 @ja
label: 玩具与游戏批发商 @zh
label: 玩具及遊戲批發 @zh-hant
label: 완구 & 게임 도매업 @ko
definition: This industry subgroup includes companies that wholesale and distribute games, toys and hobby-related products. Products include children's vehicles, electronic games, playing cards and toys.
notation: 11191417
valid from: 2014-08-08
valid till: 2020-10-03

Other Durable Goods Whslrs
type: BicsLevel4SubIndustry
type: Classifier
type: Discontinued
type: NamedIndividual
is sub industry of: Other Wholesalers
is contemporary version of: http://data.ga-group.nl/ics/bics/11191418
is version of: http://data.ga-group.nl/ics/bics/11191418
imported on: 2026-06-08T13:03:47.798Z
last refreshed on: 2026-06-08T13:03:47.798Z
source accessed on: 2019-12-03T20:05:01Z
source last accessed on: 2019-12-03T20:05:01Z
label: Atac outros bens duráveis @pt
label: Großhändler für sonst. Gebrauchsgüter @de
label: Gross autres biens durables @fr
label: Grossisti altri beni durevoli @it
label: Otros bienes duraderos al por mayor @es
label: Опт. торговля - пр. товары длительного пользования @ru
label: その他耐久消費財卸売 @ja
label: 其他耐久商品批發 @zh-hant
label: 其他耐用品批发商 @zh
label: 기타 내구재 도매업 @ko
definition: This industry subgroup includes companies that wholesale and distribute miscellaneous durable goods. Products include CDs, DVDs, guns, musical instruments and timber products.
notation: 11191418
valid from: 2014-08-08
valid till: 2020-10-03

Other Non-Durable Goods Whslrs
type: BicsLevel4SubIndustry
type: Classifier
type: Discontinued
type: NamedIndividual
is sub industry of: Other Wholesalers
is contemporary version of: http://data.ga-group.nl/ics/bics/11191419
is version of: http://data.ga-group.nl/ics/bics/11191419
imported on: 2026-06-08T13:03:47.798Z
last refreshed on: 2026-06-08T13:03:47.798Z
source accessed on: 2019-12-03T20:05:01Z
source last accessed on: 2019-12-03T20:05:01Z
label: Atac outros bens não duráveis @pt
label: Comercio al por mayor de otros bienes no duraderos varios @es
label: Großhändler für sonst. kurzlebige Güter @de
label: Gross autres biens non durables @fr
label: Grossisti altri beni non durevoli @it
label: Опт. торговля - пр. товары кратковременного пользования @ru
label: その他非耐久消費財卸売 @ja
label: 其他非耐久商品批發 @zh-hant
label: 其他非耐用品批发商 @zh
label: 기타 비내구재 도매업 @ko
definition: This industry subgroup includes companies that wholesale and distribute nondurable goods.
notation: 11191419
valid from: 2014-08-08
valid till: 2020-10-03

Other Wholesalers
type: BicsLevel3Industry
type: Classifier
type: NamedIndividual
is industry of: Distributors - Discretionary
is anachronous version of: http://data.ga-group.nl/ics/bics/11121014
is contemporary version of: http://data.ga-group.nl/ics/bics/111914
is replaced by: http://data.ga-group.nl/ics/bics/2020/11121014
is version of: http://data.ga-group.nl/ics/bics/11121014
is version of: http://data.ga-group.nl/ics/bics/111914
imported on: 2026-06-08T13:03:47.798Z
last refreshed on: 2026-06-08T13:03:47.798Z
source accessed on: 2019-12-03T20:05:01Z
source last accessed on: 2019-12-03T20:05:01Z
label: Altri grossisti @it
label: Autres grossistes @fr
label: Otros mayoristas @es
label: Outros atacadistas @pt
label: Sonst. Großhändler @de
label: Другие оптовики @ru
label: 一般卸売業 @ja
label: 其他批发商 @zh
label: 其他批發 @zh-hant
label: 기타 도매업 @ko
definition: This industry includes companies that wholesale and distribute products not elsewhere classified. Excludes manufacturers that wholesale their own products.
notation: 111914
valid from: 2014-08-08
valid till: 2020-10-03

Import & Export
type: BicsLevel3Industry
type: Classifier
type: NamedIndividual
is industry of: Distributors - Discretionary
is anachronous version of: http://data.ga-group.nl/ics/bics/11121015
is contemporary version of: http://data.ga-group.nl/ics/bics/111915
is replaced by: http://data.ga-group.nl/ics/bics/2020/11121015
is version of: http://data.ga-group.nl/ics/bics/11121015
is version of: http://data.ga-group.nl/ics/bics/111915
imported on: 2026-06-08T13:03:47.798Z
last refreshed on: 2026-06-08T13:03:47.798Z
source accessed on: 2019-12-03T20:05:01Z
source last accessed on: 2019-12-03T20:05:01Z
label: Import-export @fr
label: Import/Export @it
label: Importação e exportação @pt
label: Importaciones y exportaciones @es
label: Импорт и экспорт @ru
label: 輸入･輸出 @ja
label: 进出口 @zh
label: 進口及出口 @zh-hant
label: 수입 & 수출 @ko
definition: This industry includes companies that wholesale trade merchandise overseas using their own money or on behalf of someone else for a fee.
notation: 111915
valid from: 2014-08-08
valid till: 2020-10-03

Distributors - Discretionary
type: BicsLevel2IndustryGroup
type: Classifier
type: NamedIndividual
is industry group of: Consumer Discretionary
is anachronous version of: http://data.ga-group.nl/ics/bics/111210
is contemporary version of: http://data.ga-group.nl/ics/bics/1119
is replaced by: http://data.ga-group.nl/ics/bics/2020/111210
is version of: http://data.ga-group.nl/ics/bics/111210
is version of: http://data.ga-group.nl/ics/bics/1119
imported on: 2026-06-08T13:03:47.798Z
last refreshed on: 2026-06-08T13:03:47.798Z
source accessed on: 2019-12-03T20:05:01Z
source last accessed on: 2019-12-03T20:05:01Z
label: Distribuidores - Discricionário @pt
label: Distribuidores - discrecional @es
label: Distributeurs - Discrétionnaire @fr
label: Distributori - Discrezionale @it
label: Vertriebsunt. - Nichtbasis @de
label: Дистрибьюторы - выборочный спрос @ru
label: 分销商-非必需品 @zh
label: 卸売業 @ja
label: 經銷商-非核心消費 @zh-hant
label: 유통업체 - 자유소비재 @ko
definition: This industry group includes companies that wholesale and distribute auto and general merchandise products.
notation: 1119
valid from: 2014-08-08
valid till: 2020-10-03

Auto Parts & Accessories Stores
type: BicsLevel4SubIndustry
type: Classifier
type: NamedIndividual
is sub industry of: Automotive Retailers
is anachronous version of: http://data.ga-group.nl/ics/bics/1112111010
is contemporary version of: http://data.ga-group.nl/ics/bics/11201010
is replaced by: http://data.ga-group.nl/ics/bics/2020/1112111010
is version of: http://data.ga-group.nl/ics/bics/1112111010
is version of: http://data.ga-group.nl/ics/bics/11201010
imported on: 2026-06-08T13:03:47.798Z
last refreshed on: 2026-06-08T13:03:47.798Z
source accessed on: 2019-12-03T20:05:01Z
source last accessed on: 2019-12-03T20:05:01Z
label: Läden für Autoteile & -zubehör @de
label: Lojas de auto peças e acessórios @pt
label: Magasin de pièces et accessoires automobiles @fr
label: Negozi autoricambi e accessori @it
label: Tiendas de autopartes y accesorios @es
label: З/части и аксессуары для автомоб. - магазины @ru
label: 汽車零件及配件店 @zh-hant
label: 汽车零配件商店 @zh
label: 自動車部品･ｱｸｾｻﾘｰ小売業 @ja
label: 자동차 부품 & 액세서리 매장 @ko
definition: This industry subgroup includes companies that retail automotive parts and accessories.
notation: 11201010
valid from: 2014-08-08
valid till: 2020-10-03

Auto Repair Centers
type: BicsLevel4SubIndustry
type: Classifier
type: NamedIndividual
is sub industry of: Automotive Retailers
is anachronous version of: http://data.ga-group.nl/ics/bics/1112111011
is contemporary version of: http://data.ga-group.nl/ics/bics/11201011
is replaced by: http://data.ga-group.nl/ics/bics/2020/1112111011
is version of: http://data.ga-group.nl/ics/bics/1112111011
is version of: http://data.ga-group.nl/ics/bics/11201011
imported on: 2026-06-08T13:03:47.798Z
last refreshed on: 2026-06-08T13:03:47.798Z
source accessed on: 2019-12-03T20:05:01Z
source last accessed on: 2019-12-03T20:05:01Z
label: Autoreparaturwerkstätten @de
label: Centres de réparation de voitures @fr
label: Centri autoriparazioni @it
label: Oficinas de consertos de carros @pt
label: Reparación de automóviles @es
label: Авторемонтные центры @ru
label: 汽車修理中心 @zh-hant
label: 汽车维修中心 @zh
label: 自動車修理ｾﾝﾀｰ @ja
label: 자동차 수리 센터 @ko
definition: This industry subgroup includes companies that provide automotive repair and maintenance services.
notation: 11201011
valid from: 2014-08-08
valid till: 2020-10-03

Car Dealers
type: BicsLevel4SubIndustry
type: Classifier
type: NamedIndividual
is sub industry of: Automotive Retailers
is anachronous version of: http://data.ga-group.nl/ics/bics/1112111012
is contemporary version of: http://data.ga-group.nl/ics/bics/11201012
is replaced by: http://data.ga-group.nl/ics/bics/2020/1112111012
is version of: http://data.ga-group.nl/ics/bics/1112111012
is version of: http://data.ga-group.nl/ics/bics/11201012
imported on: 2026-06-08T13:03:47.798Z
last refreshed on: 2026-06-08T13:03:47.798Z
source accessed on: 2019-12-03T20:05:01Z
source last accessed on: 2019-12-03T20:05:01Z
label: Autohändler @de
label: Concesionarios de autos @es
label: Concessionárias de automóveis @pt
label: Concessionari auto @it
label: Concessionnaires automobiles @fr
label: Дилеры автомобилей @ru
label: 汽車經銷商 @zh-hant
label: 汽车经销商 @zh
label: 自動車小売 @ja
label: 자동차 딜러 @ko
definition: This industry subgroup includes companies that sell both new and used vehicles including passenger cars, light trucks and utility vehicles.
notation: 11201012
valid from: 2014-08-08
valid till: 2020-10-03

Passenger Vehicle Leasing
type: BicsLevel5Segment
type: Classifier
type: NamedIndividual
is level5 segment of: Passenger Car Rental & Leasing
is anachronous version of: http://data.ga-group.nl/ics/bics/111211101310
is contemporary version of: http://data.ga-group.nl/ics/bics/1120101310
is replaced by: http://data.ga-group.nl/ics/bics/2020/111211101310
is version of: http://data.ga-group.nl/ics/bics/111211101310
is version of: http://data.ga-group.nl/ics/bics/1120101310
imported on: 2026-06-08T13:03:47.798Z
last refreshed on: 2026-06-08T13:03:47.798Z
source accessed on: 2019-12-03T20:05:01Z
source last accessed on: 2019-12-03T20:05:01Z
label: Arrendamento de veículos de passageiros @pt
label: Arrendamiento de carros de pasajero @es
label: Crédit-bail de voitures particulières @fr
label: Leasing autoveicoli @it
label: Pkw-Leasing @de
label: Лизинг легковых автомобилей @ru
label: 乗用車ﾘｰｽ @ja
label: 客車租賃 @zh-hant
label: 客运车辆租赁 @zh
label: 승용차 리스 @ko
definition: This segment includes companies that lease passenger cars without drivers.
notation: 1120101310
valid from: 2014-08-08
valid till: 2020-10-03

Passenger Vehicle Rental
type: BicsLevel5Segment
type: Classifier
type: NamedIndividual
is level5 segment of: Passenger Car Rental & Leasing
is anachronous version of: http://data.ga-group.nl/ics/bics/111211101311
is contemporary version of: http://data.ga-group.nl/ics/bics/1120101311
is replaced by: http://data.ga-group.nl/ics/bics/2020/111211101311
is version of: http://data.ga-group.nl/ics/bics/111211101311
is version of: http://data.ga-group.nl/ics/bics/1120101311
imported on: 2026-06-08T13:03:47.798Z
last refreshed on: 2026-06-08T13:03:47.798Z
source accessed on: 2019-12-03T20:05:01Z
source last accessed on: 2019-12-03T20:05:01Z
label: Affitto autoveicoli @it
label: Alquiler de carros de pasajero @es
label: Aluguel de veículos de passageiros @pt
label: Location de voitures particulières @fr
label: Pkw-Vermietung @de
label: Аренда легковых автомобилей @ru
label: 乗用車ﾚﾝﾀﾙ @ja
label: 客車出租 @zh-hant
label: 客运车辆租赁 @zh
label: 승용차 렌트 @ko
definition: This segment includes companies that rent passenger cars without drivers.
notation: 1120101311
valid from: 2014-08-08
valid till: 2020-10-03

Passenger Car Rental & Leasing
type: BicsLevel4SubIndustry
type: Classifier
type: NamedIndividual
is sub industry of: Automotive Retailers
is anachronous version of: http://data.ga-group.nl/ics/bics/1112111013
is contemporary version of: http://data.ga-group.nl/ics/bics/11201013
is replaced by: http://data.ga-group.nl/ics/bics/2020/1112111013
is version of: http://data.ga-group.nl/ics/bics/1112111013
is version of: http://data.ga-group.nl/ics/bics/11201013
imported on: 2026-06-08T13:03:47.798Z
last refreshed on: 2026-06-08T13:03:47.798Z
source accessed on: 2019-12-03T20:05:01Z
source last accessed on: 2019-12-03T20:05:01Z
label: Aluguel e leasing de carro de passageiro @pt
label: Aquiler y arrendamiento de carros de pasajero @es
label: Autovermietung & -leasing @de
label: Location et crédit-bail de voitures particulières @fr
label: Locazione e leasing automobili @it
label: Прокат и лизинг легковых автомобилей @ru
label: 乗用車ﾚﾝﾀﾙ及びﾘｰｽ @ja
label: 乘用车出租与租赁 @zh
label: 客車出租及租賃 @zh-hant
label: 승용차 렌트 & 리스 @ko
definition: This industry subgroup includes companies that rent and lease passenger cars.
notation: 11201013
valid from: 2014-08-08
valid till: 2020-10-03

Other Motor Vehicle Dealers
type: BicsLevel4SubIndustry
type: Classifier
type: Discontinued
type: NamedIndividual
is sub industry of: Automotive Retailers
is contemporary version of: http://data.ga-group.nl/ics/bics/11201014
is version of: http://data.ga-group.nl/ics/bics/11201014
imported on: 2026-06-08T13:03:47.798Z
last refreshed on: 2026-06-08T13:03:47.798Z
source accessed on: 2019-12-03T20:05:01Z
source last accessed on: 2019-12-03T20:05:01Z
label: Concesionarios de otros vehículos automotrices @es
label: Concessionari di altri automezzi @it
label: Magasins d'autres véhicules automobiles @fr
label: Outras concessionárias de veículos motorizados @pt
label: Sonstige Kfz-Händler @de
label: Дилеры прочих автотранспортных средств @ru
label: その他自動車小売 @ja
label: 其他机动车经销商 @zh
label: 其他車輛經銷商 @zh-hant
label: 기타 자동차 딜러 @ko
definition: This industry subgroup includes companies that sell other new and used vehicles not elsewhere classified. Products may include motorcycles, ATVs and other power equipment.
notation: 11201014
valid from: 2014-08-08
valid till: 2020-10-03

Automotive Retailers
type: BicsLevel3Industry
type: Classifier
type: NamedIndividual
is industry of: Retail - Discretionary
is anachronous version of: http://data.ga-group.nl/ics/bics/11121110
is contemporary version of: http://data.ga-group.nl/ics/bics/112010
is replaced by: http://data.ga-group.nl/ics/bics/2020/11121110
is version of: http://data.ga-group.nl/ics/bics/11121110
is version of: http://data.ga-group.nl/ics/bics/112010
imported on: 2026-06-08T13:03:47.798Z
last refreshed on: 2026-06-08T13:03:47.798Z
source accessed on: 2019-12-03T20:05:01Z
source last accessed on: 2019-12-03T20:05:01Z
label: Auto-EH @de
label: Comercio al por menor autos @es
label: Détaillants pour automobiles @fr
label: Revendedores de automóveis @pt
label: Rivenditori automobili @it
label: Розничная продажа автомобилей @ru
label: 汽車零售商 @zh-hant
label: 汽车零售商 @zh
label: 自動車小売業 @ja
label: 자동차 소매업 @ko
definition: This industry includes companies that retail automotive parts and products. Such companies may also provide repair and maintenance services.
notation: 112010
valid from: 2014-08-08
valid till: 2020-10-03

Mail Catalog Retailers
type: BicsLevel4SubIndustry
type: Classifier
type: NamedIndividual
is sub industry of: Catalog & TV Based Retailers
is anachronous version of: http://data.ga-group.nl/ics/bics/1112111110
is contemporary version of: http://data.ga-group.nl/ics/bics/11201110
is replaced by: http://data.ga-group.nl/ics/bics/2020/1112111110
is version of: http://data.ga-group.nl/ics/bics/1112111110
is version of: http://data.ga-group.nl/ics/bics/11201110
imported on: 2026-06-08T13:03:47.798Z
last refreshed on: 2026-06-08T13:03:47.798Z
source accessed on: 2019-12-03T20:05:01Z
source last accessed on: 2019-12-03T20:05:01Z
label: Catálogo al por menor @es
label: Détaillants vente par correspondance @fr
label: Rivenditori catalogo posta @it
label: Varejistas de catálogo de correios @pt
label: Versandkatalog EH @de
label: Розничная продажа по каталогам @ru
label: 通信販売業 @ja
label: 邮购商品零售商 @zh
label: 郵購型錄零��� @zh-hant
label: 우편주문 카탈로그 소매업 @ko
definition: This industry subgroup includes companies that retail all types of merchandise using mail catalogs to generate clients and display merchandise as well as companies that retail from catalog showrooms of mail-order houses.
notation: 11201110
valid from: 2014-08-08
valid till: 2020-10-03

Multi-Level Marketing
type: BicsLevel4SubIndustry
type: Classifier
type: NamedIndividual
is sub industry of: Catalog & TV Based Retailers
is anachronous version of: http://data.ga-group.nl/ics/bics/1112111111
is contemporary version of: http://data.ga-group.nl/ics/bics/11201111
is replaced by: http://data.ga-group.nl/ics/bics/2020/1112111111
is version of: http://data.ga-group.nl/ics/bics/1112111111
is version of: http://data.ga-group.nl/ics/bics/11201111
imported on: 2026-06-08T13:03:47.798Z
last refreshed on: 2026-06-08T13:03:47.798Z
source accessed on: 2019-12-03T20:05:01Z
source last accessed on: 2019-12-03T20:05:01Z
label: Márketing múlt nivel @es
label: Marketing de vários níveis @pt
label: Mrkting multi-niveau @fr
label: Multi-Level Marketg @de
label: Vendita multilivello @it
label: Многоуровневый маркетинг @ru
label: 多层次市场营销 @zh
label: 多層次傳銷 @zh-hant
label: 복수 레벨 마케팅 @ko
label: ﾏﾙﾁ商法 @ja
definition: This industry subgroup includes companies that sell consumer products through a direct sales force.
notation: 11201111
valid from: 2014-08-08
valid till: 2020-10-03

TV Based Retailers
type: BicsLevel4SubIndustry
type: Classifier
type: NamedIndividual
is sub industry of: Catalog & TV Based Retailers
is anachronous version of: http://data.ga-group.nl/ics/bics/1112111112
is contemporary version of: http://data.ga-group.nl/ics/bics/11201112
is replaced by: http://data.ga-group.nl/ics/bics/2020/1112111112
is version of: http://data.ga-group.nl/ics/bics/1112111112
is version of: http://data.ga-group.nl/ics/bics/11201112
imported on: 2026-06-08T13:03:47.798Z
last refreshed on: 2026-06-08T13:03:47.798Z
source accessed on: 2019-12-03T20:05:01Z
source last accessed on: 2019-12-03T20:05:01Z
label: Comercio al por menor basado en televisión @es
label: Détaillants Vente à la télé @fr
label: Rivenditori TV @it
label: TV-basierter Einzelhandel @de
label: TV홈쇼핑 소매업 @ko
label: Varejistas com base TV @pt
label: Телевизионная розничная торговля @ru
label: 电视购物零售商 @zh
label: 電視購物零售 @zh-hant
label: ﾃﾚﾋﾞ通販小売 @ja
definition: This industry subgroup includes companies that retail all types of merchandise using television to generate clients and display merchandise.
notation: 11201112
valid from: 2014-08-08
valid till: 2020-10-03

Catalog & TV Based Retailers
type: BicsLevel3Industry
type: Classifier
type: NamedIndividual
is industry of: Retail - Discretionary
is anachronous version of: http://data.ga-group.nl/ics/bics/11121111
is contemporary version of: http://data.ga-group.nl/ics/bics/112011
is replaced by: http://data.ga-group.nl/ics/bics/2020/11121111
is version of: http://data.ga-group.nl/ics/bics/11121111
is version of: http://data.ga-group.nl/ics/bics/112011
imported on: 2026-06-08T13:03:47.798Z
last refreshed on: 2026-06-08T13:03:47.798Z
source accessed on: 2019-12-03T20:05:01Z
source last accessed on: 2019-12-03T20:05:01Z
label: Détaillants vente par catalogue/à la télé @fr
label: Katalog- & TV-basierte EH @de
label: Minoristas basados en catálogo y tv @es
label: Rivenditori catalogo e TV @it
label: Varejista catálogo e TV @pt
label: Розничн. торговля - магазины с прдж по ТВ и через каталоги @ru
label: 邮购与电视购物零售商 @zh
label: 郵購及電視購物零售 @zh-hant
label: 카탈로그 & TV홈쇼핑 소매업 @ko
label: ｶﾀﾛｸﾞ&ﾃﾚﾋﾞ通販小売 @ja
definition: This industry includes companies that retail all types of merchandise using mail catalogs or television to generate clients and display merchandise. Included in this industry are companies that retail from catalog showrooms of mail-order houses as well as companies providing a combination of Internet and mail-order sales.
notation: 112011
valid from: 2014-08-08
valid till: 2020-10-03

Computer & Software Stores
type: BicsLevel4SubIndustry
type: Classifier
type: Discontinued
type: NamedIndividual
is sub industry of: Consumer Elec & Applc Stores
is contemporary version of: http://data.ga-group.nl/ics/bics/11201210
is version of: http://data.ga-group.nl/ics/bics/11201210
imported on: 2026-06-08T13:03:47.798Z
last refreshed on: 2026-06-08T13:03:47.798Z
source accessed on: 2019-12-03T20:05:01Z
source last accessed on: 2019-12-03T20:05:01Z
label: Computer- und Softwareläden @de
label: Lojas de computadores e softwares @pt
label: Magasins d'ordinateurs et de logiciels @fr
label: Negozi di computer e software @it
label: Tiendas de computadoras y software @es
label: Магазины компьютеров и програм. обеспечения @ru
label: 电脑与软件商店 @zh
label: 電腦及軟體店 @zh-hant
label: 컴퓨터 및 소프트웨어 매장 @ko
label: ｺﾝﾋﾟｭｰﾀ/ｿﾌﾄｳｴｱ小売業 @ja
definition: This industry subgroup includes companies that retail computers and computer software. This can include Internet sales of brick-and-mortar stores.
notation: 11201210
valid from: 2014-08-08
valid till: 2020-10-03

Consumer Electronics Stores
type: BicsLevel4SubIndustry
type: Classifier
type: NamedIndividual
is sub industry of: Consumer Elec & Applc Stores
is anachronous version of: http://data.ga-group.nl/ics/bics/1112111210
is contemporary version of: http://data.ga-group.nl/ics/bics/11201211
is replaced by: http://data.ga-group.nl/ics/bics/2020/1112111210
is version of: http://data.ga-group.nl/ics/bics/1112111210
is version of: http://data.ga-group.nl/ics/bics/11201211
imported on: 2026-06-08T13:03:47.798Z
last refreshed on: 2026-06-08T13:03:47.798Z
source accessed on: 2019-12-03T20:05:01Z
source last accessed on: 2019-12-03T20:05:01Z
label: Lojas de eletrônicos para consumidores @pt
label: Magasins d'appareils électroniques grand public @fr
label: Negozi di elettronica @it
label: Tiendas de electrodomésticos @es
label: Verbraucherelektronikläden @de
label: Магазины бытовой электроники @ru
label: 消費性電器店 @zh-hant
label: 消費者用電子製品小売業 @ja
label: 电子消费品商店 @zh
label: 소비자 전자제품 매장 @ko
definition: This industry subgroup includes companies that retail consumer electronic products. This can include Internet sales of brick-and-mortar stores.
notation: 11201211
valid from: 2014-08-08
valid till: 2020-10-03

Household Appliance Stores
type: BicsLevel4SubIndustry
type: Classifier
type: NamedIndividual
is sub industry of: Consumer Elec & Applc Stores
is anachronous version of: http://data.ga-group.nl/ics/bics/1112111211
is contemporary version of: http://data.ga-group.nl/ics/bics/11201212
is replaced by: http://data.ga-group.nl/ics/bics/2020/1112111211
is version of: http://data.ga-group.nl/ics/bics/1112111211
is version of: http://data.ga-group.nl/ics/bics/11201212
imported on: 2026-06-08T13:03:47.798Z
last refreshed on: 2026-06-08T13:03:47.798Z
source accessed on: 2019-12-03T20:05:01Z
source last accessed on: 2019-12-03T20:05:01Z
label: Läden für Haushaltsgeräte @de
label: Lojas de eletrodomésticos @pt
label: Magasins d'appareils ménagers @fr
label: Negozi elettrodomestici @it
label: Tiendas de aparatos domésticos @es
label: Магазины бытовой техники @ru
label: 家庭器具店 @zh-hant
label: 家庭用電化製品小売業 @ja
label: 家用电器商店 @zh
label: 가전제품 매장 @ko
definition: This industry subgroup includes companies that retail household appliances. This can include Internet sales of brick-and-mortar stores.
notation: 11201212
valid from: 2014-08-08
valid till: 2020-10-03

Consumer Elec & Applc Stores
type: BicsLevel3Industry
type: Classifier
type: NamedIndividual
is industry of: Retail - Discretionary
is anachronous version of: http://data.ga-group.nl/ics/bics/11121112
is contemporary version of: http://data.ga-group.nl/ics/bics/112012
is replaced by: http://data.ga-group.nl/ics/bics/2020/11121112
is version of: http://data.ga-group.nl/ics/bics/11121112
is version of: http://data.ga-group.nl/ics/bics/112012
imported on: 2026-06-08T13:03:47.798Z
last refreshed on: 2026-06-08T13:03:47.798Z
source accessed on: 2019-12-03T20:05:01Z
source last accessed on: 2019-12-03T20:05:01Z
label: Geschäfte f. VerbrElektr. & -geräte @de
label: Lojas eletrod e eletr @pt
label: Mag d'électro grand public @fr
label: Negozi elettrodom e casalinghi @it
label: Tiendas electrodom @es
label: Мгз быт. электр./техники @ru
label: 消費電子及家電品店 @zh-hant
label: 消费电子和家电商店 @zh
label: 電子製品小売業 @ja
label: 소비자 전자&가전 매장 @ko
definition: This industry includes stores that retail computers and peripherals, video game consoles, off-the-shelf software, video games, household appliances, mobile devices and tablets.
notation: 112012
valid from: 2014-08-08
valid till: 2020-10-03

High-End Department Stores
type: BicsLevel4SubIndustry
type: Classifier
type: NamedIndividual
is sub industry of: Department Stores
is anachronous version of: http://data.ga-group.nl/ics/bics/1112111310
is contemporary version of: http://data.ga-group.nl/ics/bics/11201310
is replaced by: http://data.ga-group.nl/ics/bics/2020/1112111310
is version of: http://data.ga-group.nl/ics/bics/1112111310
is version of: http://data.ga-group.nl/ics/bics/11201310
imported on: 2026-06-08T13:03:47.798Z
last refreshed on: 2026-06-08T13:03:47.798Z
source accessed on: 2019-12-03T20:05:01Z
source last accessed on: 2019-12-03T20:05:01Z
label: Grandi magazzini di lusso @it
label: Grands magasins haut de gamme @fr
label: Lojas de departamento de luxo @pt
label: Luxuskaufhäuser @de
label: Tiendas de departamento de lujo @es
label: Элитные универсальные магазины @ru
label: 高端百货商店 @zh
label: 高級百貨公司 @zh-hant
label: 高級百貨店 @ja
label: 최고급 백화점 @ko
definition: This industry subgroup includes department stores that have separate departments for various merchandise lines, such as apparel, jewelry, home furnishings and linens, each with separate cash registers and sales associates. These are generally companies that target high-income families. This can include Internet sales of brick-and-mortar stores.
notation: 11201310
valid from: 2014-08-08
valid till: 2020-10-03

Mid-Tier Department Stores
type: BicsLevel4SubIndustry
type: Classifier
type: NamedIndividual
is sub industry of: Department Stores
is anachronous version of: http://data.ga-group.nl/ics/bics/1112111311
is contemporary version of: http://data.ga-group.nl/ics/bics/11201311
is replaced by: http://data.ga-group.nl/ics/bics/2020/1112111311
is version of: http://data.ga-group.nl/ics/bics/1112111311
is version of: http://data.ga-group.nl/ics/bics/11201311
imported on: 2026-06-08T13:03:47.798Z
last refreshed on: 2026-06-08T13:03:47.798Z
source accessed on: 2019-12-03T20:05:01Z
source last accessed on: 2019-12-03T20:05:01Z
label: Grandi mag liv medio @it
label: Grands magasins niveau-moyen @fr
label: Mid-Tier Kaufhäuser @de
label: Strs depart prazo médio @pt
label: Tiendas de depto de nivel medio @es
label: Магазины среднего уровня @ru
label: 中型百貨公司 @zh-hant
label: 中型百貨店 @ja
label: 中档��货店 @zh
label: 중형급 백화점 @ko
definition: This industry subgroup includes department stores that have separate departments for various merchandise lines, such as apparel, jewelry, home furnishings and linens, each with separate cash registers and sales associates. These are generally on-mall companies that target mid-income and low-income families. This can include Internet sales of brick-and-mortar stores.
notation: 11201311
valid from: 2014-08-08
valid till: 2020-10-03

Department Stores
type: BicsLevel3Industry
type: Classifier
type: NamedIndividual
is industry of: Retail - Discretionary
is anachronous version of: http://data.ga-group.nl/ics/bics/11121113
is contemporary version of: http://data.ga-group.nl/ics/bics/112013
is replaced by: http://data.ga-group.nl/ics/bics/2020/11121113
is version of: http://data.ga-group.nl/ics/bics/11121113
is version of: http://data.ga-group.nl/ics/bics/112013
imported on: 2026-06-08T13:03:47.798Z
last refreshed on: 2026-06-08T13:03:47.798Z
source accessed on: 2019-12-03T20:05:01Z
source last accessed on: 2019-12-03T20:05:01Z
label: Grandi magazzini @it
label: Grands magasins @fr
label: Kaufhäuser @de
label: Lojas departamento @pt
label: Tiendas departamento @es
label: Универмаги @ru
label: 百貨公司 @zh-hant
label: 百貨店 @ja
label: 百货商店 @zh
label: 백화점 @ko
definition: This industry includes establishments known as department stores that have separate departments for various merchandise lines, such as apparel, jewelry, home furnishings and linens, each with separate cash registers and sales associates.
notation: 112013
valid from: 2014-08-08
valid till: 2020-10-03

Auto Parts & Supply - Online
type: BicsLevel4SubIndustry
type: Classifier
type: NamedIndividual
is sub industry of: E-Commerce Discretionary
is anachronous version of: http://data.ga-group.nl/ics/bics/1112121110
is contemporary version of: http://data.ga-group.nl/ics/bics/11201410
is replaced by: http://data.ga-group.nl/ics/bics/2020/1112121110
is version of: http://data.ga-group.nl/ics/bics/1112121110
is version of: http://data.ga-group.nl/ics/bics/11201410
imported on: 2026-06-08T13:03:47.798Z
last refreshed on: 2026-06-08T13:03:47.798Z
source accessed on: 2019-12-03T20:05:01Z
source last accessed on: 2019-12-03T20:05:01Z
label: Auto peças e suprimentos - online @pt
label: Autoricambi - online @it
label: Autoteile und -zubehör - Online @de
label: Pièces d'automobiles et fournitures - En ligne @fr
label: Tiendas de autopartes y accesorios - En línea @es
label: Запчасти и мат��риалы для автомобилей-Онлайн @ru
label: 汽車零件供應-線上 @zh-hant
label: 汽车零部件和供应-在线 @zh
label: 自動車部品･付属品-ｵﾝﾗｲﾝ @ja
label: 자동차 부품 및 용품 @ko
definition: This industry subgroup includes companies that retail auto parts and accessories on the Internet.
notation: 11201410
valid from: 2014-08-08
valid till: 2020-10-03

Computadores e softwares - online
type: BicsLevel5Segment
type: Classifier
type: Discontinued
type: NamedIndividual
is level5 segment of: Consumer Electronics - Online
is contemporary version of: http://data.ga-group.nl/ics/bics/1120141110
is version of: http://data.ga-group.nl/ics/bics/1120141110
imported on: 2026-06-08T13:03:47.798Z
last refreshed on: 2026-06-08T13:03:47.798Z
source accessed on: 2019-12-03T20:05:01Z
source last accessed on: 2019-12-03T20:05:01Z
label: Computer & Software - Online
label: Computer e software - Online @it
label: Ordenadores y Software - En línea @es
label: Ordinateurs et logiciels - En ligne @fr
label: Компьютеры и программное обеспечение-Онлайн @ru
label: 计算机与软件 - 在线 @zh
label: 電腦及軟體-線上 @zh-hant
label: 컴퓨터 및 소프트웨어 - 온라인 @ko
label: ｺﾝﾋﾟｭｰﾀｰ&ｿﾌﾄｳｴｱ-ｵﾝﾗｲﾝ @ja
definition: This segment includes companies that retail consumer electronic products in brick-and-mortar stores.
notation: 1120141110
valid from: 2014-08-08
valid till: 2020-10-03

Consumer Electronics - Online
type: BicsLevel4SubIndustry
type: Classifier
type: NamedIndividual
is sub industry of: E-Commerce Discretionary
is anachronous version of: http://data.ga-group.nl/ics/bics/1112121111
is contemporary version of: http://data.ga-group.nl/ics/bics/11201411
is replaced by: http://data.ga-group.nl/ics/bics/2020/1112121111
is version of: http://data.ga-group.nl/ics/bics/1112121111
is version of: http://data.ga-group.nl/ics/bics/11201411
imported on: 2026-06-08T13:03:47.798Z
last refreshed on: 2026-06-08T13:03:47.798Z
source accessed on: 2019-12-03T20:05:01Z
source last accessed on: 2019-12-03T20:05:01Z
label: Artigos eletrônicos para consumidores - Online @pt
label: Electrónica de consumo - en línea @es
label: Electronique grand public - En ligne @fr
label: Elettronica di consumo - Online @it
label: Verbraucherelektronik - Online @de
label: Бытовая электроника - онлайн @ru
label: 家庭用電化製品-ｵﾝﾗｲﾝ @ja
label: 消費性電子-線上 @zh-hant
label: 电子消费品-网上 @zh
label: 소비자 가전 - 온라인 @ko
definition: This industry subgroup includes companies that retail consumer electronics products on the Internet.
notation: 11201411
valid from: 2014-08-08
valid till: 2020-10-03

Electronic Auctions
type: BicsLevel4SubIndustry
type: Classifier
type: Discontinued
type: NamedIndividual
is sub industry of: E-Commerce Discretionary
is contemporary version of: http://data.ga-group.nl/ics/bics/11201412
is version of: http://data.ga-group.nl/ics/bics/11201412
imported on: 2026-06-08T13:03:47.798Z
last refreshed on: 2026-06-08T13:03:47.798Z
source accessed on: 2019-12-03T20:05:01Z
source last accessed on: 2019-12-03T20:05:01Z
label: Aste elettroniche @it
label: Elektron. Auktionen @de
label: Enchères électro. @fr
label: Leilões online @pt
label: Subastas electrónic @es
label: Электронные аукционы @ru
label: 电子拍卖 @zh
label: 網上拍賣 @zh-hant
label: 電子ｵｰｸｼｮﾝ @ja
label: 인터넷 경매 @ko
definition: This industry subgroup includes pure-play Internet companies that provide sites for, and facilitate, consumer-to-consumer or business-to-consumer trade in new and used goods, on an auction basis, using the Internet. Companies in this industry provide the electronic location for retail auctions but do not take title to the goods being sold.
notation: 11201412
valid from: 2014-08-08
valid till: 2020-10-03

Electronic Shopping
type: BicsLevel4SubIndustry
type: Classifier
type: NamedIndividual
is sub industry of: E-Commerce Discretionary
is anachronous version of: http://data.ga-group.nl/ics/bics/11121210
is contemporary version of: http://data.ga-group.nl/ics/bics/11201413
is replaced by: http://data.ga-group.nl/ics/bics/2020/11121210
is version of: http://data.ga-group.nl/ics/bics/11121210
is version of: http://data.ga-group.nl/ics/bics/11201413
imported on: 2026-06-08T13:03:47.798Z
last refreshed on: 2026-06-08T13:03:47.798Z
source accessed on: 2019-12-03T20:05:01Z
source last accessed on: 2019-12-03T20:05:01Z
label: Achats en ligne @fr
label: Acquisti elettronici @it
label: Compras online @pt
label: Elektron. Einkaufen @de
label: Tiendas prod electr @es
label: Электронная торговля @ru
label: 电子商务 @zh
label: 網上購物 @zh-hant
label: 電子商取引業 @ja
label: 인터넷 쇼핑 @ko
definition: This industry subgroup includes companies that retail all types of merchandise primarily online.
notation: 11201413
valid from: 2014-08-08
valid till: 2020-10-03

Furniture - Online
type: BicsLevel5Segment
type: Classifier
type: Discontinued
type: NamedIndividual
is level5 segment of: Home & Office Products - Online
is contemporary version of: http://data.ga-group.nl/ics/bics/1120141410
is version of: http://data.ga-group.nl/ics/bics/1120141410
imported on: 2026-06-08T13:03:47.798Z
last refreshed on: 2026-06-08T13:03:47.798Z
source accessed on: 2019-12-03T20:05:01Z
source last accessed on: 2019-12-03T20:05:01Z
label: Arredamento - Online @it
label: Móveis - online @pt
label: Möbel - Online @de
label: Meubles - En ligne @fr
label: Muebles - En línea @es
label: Мебель - Онлайн @ru
label: 家具 - 在线 @zh
label: 家具-線上 @zh-hant
label: 家具-ｵﾝﾗｲﾝ @ja
label: 가구 - 온라인 @ko
definition: This segment includes pure-play Internet companies that retail on the Internet new furniture, such as household furniture (e.g., baby furniture, box springs and mattresses) and outdoor furniture; office furniture (except those sold in combination with office supplies and equipment); and/or furniture sold in combination with major appliances, home electronics, home furnishings or floor coverings.
notation: 1120141410
valid from: 2014-08-08
valid till: 2020-10-03

Home Furnishings - Online
type: BicsLevel5Segment
type: Classifier
type: Discontinued
type: NamedIndividual
is level5 segment of: Home & Office Products - Online
is contemporary version of: http://data.ga-group.nl/ics/bics/1120141411
is version of: http://data.ga-group.nl/ics/bics/1120141411
imported on: 2026-06-08T13:03:47.798Z
last refreshed on: 2026-06-08T13:03:47.798Z
source accessed on: 2019-12-03T20:05:01Z
source last accessed on: 2019-12-03T20:05:01Z
label: Ameublement - en ligne @fr
label: Arredamenti - Online @it
label: Einrichtungsgegenstände - Online @de
label: Móveis residenciais-Online @pt
label: Muebles para el hogar - Internet @es
label: Маг. домашнего обихода-Онлайн @ru
label: 室内装飾品-ｵﾝﾗｲﾝ @ja
label: 家具店 - 在线 @zh
label: 線上家飾品店 @zh-hant
label: 가정용가구-온라인 @ko
definition: This segment includes pure-play Internet companies that retail home furnishings on the Internet.
notation: 1120141411
valid from: 2014-08-08
valid till: 2020-10-03

Home Improvement - Online
type: BicsLevel5Segment
type: Classifier
type: Discontinued
type: NamedIndividual
is level5 segment of: Home & Office Products - Online
is contemporary version of: http://data.ga-group.nl/ics/bics/1120141412
is version of: http://data.ga-group.nl/ics/bics/1120141412
imported on: 2026-06-08T13:03:47.798Z
last refreshed on: 2026-06-08T13:03:47.798Z
source accessed on: 2019-12-03T20:05:01Z
source last accessed on: 2019-12-03T20:05:01Z
label: Bricolage/Réno - En ligne @fr
label: Fai da te - Online @it
label: Heimwerkerei - Online @de
label: Mejoras al hogar - En línea @es
label: Reforma de casas - online @pt
label: Благоустройство жилья - Онлайн @ru
label: 住宅関連用品-ｵﾝﾗｲﾝ @ja
label: 家居装饰 - 在线 @zh
label: 居家修繕-線上 @zh-hant
label: 주택개량 - 온라인 @ko
definition: This segment includes pure-play Internet companies that retail new hardware items, such as tools and builders' hardware, on the Internet.
notation: 1120141412
valid from: 2014-08-08
valid till: 2020-10-03

Office Supp & Stationery - Online
type: BicsLevel5Segment
type: Classifier
type: Discontinued
type: NamedIndividual
is level5 segment of: Home & Office Products - Online
is contemporary version of: http://data.ga-group.nl/ics/bics/1120141413
is version of: http://data.ga-group.nl/ics/bics/1120141413
imported on: 2026-06-08T13:03:47.798Z
last refreshed on: 2026-06-08T13:03:47.798Z
source accessed on: 2019-12-03T20:05:01Z
source last accessed on: 2019-12-03T20:05:01Z
label: Almacenes de útiles de oficina y papelería - en línea @es
label: Articoli ufficio e cartoleria - Online @it
label: Bürozubehör & Schreibwaren - Online @de
label: Fournit bureau/papeterie - En ligne @fr
label: Papelaria e suprimentos para escritórios - Online @pt
label: Тов. д/офиса и канцтовары - онлайн @ru
label: 事務用品･文房具-ｵﾝﾗｲﾝ @ja
label: 办公用品与文具-网上 @zh
label: 辦公用品及文具-線上 @zh-hant
label: 사무용품 & 문구류 - 온라인 @ko
definition: This segment includes companies that retail stationery and office supplies on the Internet.
notation: 1120141413
valid from: 2014-08-08
valid till: 2020-10-03

Home & Office Products - Online
type: BicsLevel4SubIndustry
type: Classifier
type: NamedIndividual
is sub industry of: E-Commerce Discretionary
is anachronous version of: http://data.ga-group.nl/ics/bics/1112121112
is contemporary version of: http://data.ga-group.nl/ics/bics/11201414
is replaced by: http://data.ga-group.nl/ics/bics/2020/1112121112
is version of: http://data.ga-group.nl/ics/bics/1112121112
is version of: http://data.ga-group.nl/ics/bics/11201414
imported on: 2026-06-08T13:03:47.798Z
last refreshed on: 2026-06-08T13:03:47.798Z
source accessed on: 2019-12-03T20:05:01Z
source last accessed on: 2019-12-03T20:05:01Z
label: Articles de maison et de bureau - En ligne @fr
label: Haus- & Büroprodukte - Online @de
label: Prodotti casa e ufficio - Online @it
label: Productos para el hogar y oficina - en línea @es
label: Produtos p/casa e escritório - Online @pt
label: Товары для дома и офиса - онлайн @ru
label: 家居及办公产品-网上 @zh
label: 家庭･事務用品 - ｵﾝﾗｲﾝ @ja
label: 家用及辦公室用品-線上 @zh-hant
label: 가정 & 사무용품 - 온라인 @ko
definition: This industry subgroup includes pure-play Internet companies that retail products utilized in or for the home.
notation: 11201414
valid from: 2014-08-08
valid till: 2020-10-03

Clothing & Accessories - Online
type: BicsLevel5Segment
type: Classifier
type: Discontinued
type: NamedIndividual
is level5 segment of: Apparel & Footwear - Online
is contemporary version of: http://data.ga-group.nl/ics/bics/1120141510
is version of: http://data.ga-group.nl/ics/bics/1120141510
imported on: 2026-06-08T13:03:47.798Z
last refreshed on: 2026-06-08T13:03:47.798Z
source accessed on: 2019-12-03T20:05:01Z
source last accessed on: 2019-12-03T20:05:01Z
label: Abbigliamento e accessori - Online @it
label: Bekleidung & Accessoires - Online @de
label: Ropa y accesorios - en línea @es
label: Roupas e acessórios - Online @pt
label: Vêtements et accessoires - En ligne @fr
label: Одежда и аксессуары - онлайн @ru
label: その他家庭衣料品-ｵﾝﾗｲﾝ @ja
label: 服装与饰品-网上 @zh
label: 服裝及飾品-線上 @zh-hant
label: 의류 & 액세서리 - 온라인 @ko
definition: This segment includes companies that retail clothing apparel and accessories online.
notation: 1120141510
valid from: 2014-08-08
valid till: 2020-10-03

Footwear - Online
type: BicsLevel5Segment
type: Classifier
type: Discontinued
type: NamedIndividual
is level5 segment of: Apparel & Footwear - Online
is contemporary version of: http://data.ga-group.nl/ics/bics/1120141511
is version of: http://data.ga-group.nl/ics/bics/1120141511
imported on: 2026-06-08T13:03:47.798Z
last refreshed on: 2026-06-08T13:03:47.798Z
source accessed on: 2019-12-03T20:05:01Z
source last accessed on: 2019-12-03T20:05:01Z
label: Calçados - online @pt
label: Calzado - En línea @es
label: Calzature - Online @it
label: Chaussure - En ligne @fr
label: Fußbekleidung - Online @de
label: Обувь - Онлайн @ru
label: 履物-ｵﾝﾗｲﾝ @ja
label: 鞋类 - 在线 @zh
label: 鞋類-線上 @zh-hant
label: 신발 - 온라인 @ko
definition: This segment includes pure-play Internet companies that retail shoes.
notation: 1120141511
valid from: 2014-08-08
valid till: 2020-10-03

Apparel & Footwear - Online
type: BicsLevel4SubIndustry
type: Classifier
type: NamedIndividual
is sub industry of: E-Commerce Discretionary
is anachronous version of: http://data.ga-group.nl/ics/bics/1112121113
is contemporary version of: http://data.ga-group.nl/ics/bics/11201415
is replaced by: http://data.ga-group.nl/ics/bics/2020/1112121113
is version of: http://data.ga-group.nl/ics/bics/1112121113
is version of: http://data.ga-group.nl/ics/bics/11201415
imported on: 2026-06-08T13:03:47.798Z
last refreshed on: 2026-06-08T13:03:47.798Z
source accessed on: 2019-12-03T20:05:01Z
source last accessed on: 2019-12-03T20:05:01Z
label: Abbigliamento e calzature - Online @it
label: Bekleidung & Schuhe - Online @de
label: Oдежда/обувь - Онлайн @ru
label: Ropa y calzado - en línea @es
label: Vêtements et chaussures - en ligne @fr
label: Vestuário e calçados - Online @pt
label: 服装鞋袜-网上 @zh
label: 服飾及鞋類-線上 @zh-hant
label: 衣料･履物 - ｵﾝﾗｲﾝ @ja
label: 의류 & 신발 - 온라인 @ko
definition: This industry subgroup includes companies that retail apparel and footwear on the Internet.
notation: 11201415
valid from: 2014-08-08
valid till: 2020-10-03

Books - Online
type: BicsLevel5Segment
type: Classifier
type: NamedIndividual
is level5 segment of: Other Specialty Retail - Online
is anachronous version of: http://data.ga-group.nl/ics/bics/1112121114
is contemporary version of: http://data.ga-group.nl/ics/bics/1120141610
is replaced by: http://data.ga-group.nl/ics/bics/2020/1112121114
is version of: http://data.ga-group.nl/ics/bics/1112121114
is version of: http://data.ga-group.nl/ics/bics/1120141610
imported on: 2026-06-08T13:03:47.798Z
last refreshed on: 2026-06-08T13:03:47.798Z
source accessed on: 2019-12-03T20:05:01Z
source last accessed on: 2019-12-03T20:05:01Z
label: Bücher - Online @de
label: Libri - Online @it
label: Libros - En línea @es
label: Livres - En ligne @fr
label: Livros - online @pt
label: Книги - Онлайн @ru
label: 图书 - 在线 @zh
label: 書籍-線上 @zh-hant
label: 書籍ｰｵﾝﾗｲﾝ @ja
label: 서적 - 온라인 @ko
definition: This segment includes pure-play Internet companies that retail books on the Internet.
notation: 1120141610
valid from: 2014-08-08
valid till: 2020-10-03

Cosmetics & Beauty - Online
type: BicsLevel5Segment
type: Classifier
type: NamedIndividual
is level5 segment of: Other Specialty Retail - Online
is anachronous version of: http://data.ga-group.nl/ics/bics/1112121115
is contemporary version of: http://data.ga-group.nl/ics/bics/1120141611
is replaced by: http://data.ga-group.nl/ics/bics/2020/1112121115
is version of: http://data.ga-group.nl/ics/bics/1112121115
is version of: http://data.ga-group.nl/ics/bics/1120141611
imported on: 2026-06-08T13:03:47.798Z
last refreshed on: 2026-06-08T13:03:47.798Z
source accessed on: 2019-12-03T20:05:01Z
source last accessed on: 2019-12-03T20:05:01Z
label: Cosméticos y belleza - En línea @es
label: Cosmétiques et produits de beauté - En ligne @fr
label: Cosmetici - online @it
label: Kosmetik & -zubehör - Online @de
label: Produtos de beleza e cosméticos - online @pt
label: Косметические средства и товары для красоты - Онлайн @ru
label: 化妆和美容用品- 在线 @zh
label: 化妝及美容用品店 - 線上 @zh-hant
label: 化粧品･美容用品-ｵﾝﾗｲﾝ @ja
label: 화장품 & 미용품 - 온라인 @ko
definition: This segment includes pure-play Internet companies that retail cosmetics and beauty products on the Internet.
notation: 1120141611
valid from: 2014-08-08
valid till: 2020-10-03

Flowers - Online
type: BicsLevel5Segment
type: Classifier
type: NamedIndividual
is level5 segment of: Other Specialty Retail - Online
is anachronous version of: http://data.ga-group.nl/ics/bics/1112121116
is contemporary version of: http://data.ga-group.nl/ics/bics/1120141612
is replaced by: http://data.ga-group.nl/ics/bics/2020/1112121116
is version of: http://data.ga-group.nl/ics/bics/1112121116
is version of: http://data.ga-group.nl/ics/bics/1120141612
imported on: 2026-06-08T13:03:47.798Z
last refreshed on: 2026-06-08T13:03:47.798Z
source accessed on: 2019-12-03T20:05:01Z
source last accessed on: 2019-12-03T20:05:01Z
label: Blumen - Online @de
label: Fiori - Online @it
label: Fleurs - En ligne @fr
label: Flores - En línea @es
label: Flores - Online @pt
label: Цветы - Онлайн @ru
label: 花 - ｵﾝﾗｲﾝ @ja
label: 花卉-在线 @zh
label: 花卉-線上 @zh-hant
label: 꽃-온라인 @ko
definition: This segment includes pure-play Internet companies that retail cut flowers, floral arrangements and potted plants on the Internet.
notation: 1120141612
valid from: 2014-08-08
valid till: 2020-10-03

Toys & Games - Online
type: BicsLevel5Segment
type: Classifier
type: NamedIndividual
is level5 segment of: Other Specialty Retail - Online
is anachronous version of: http://data.ga-group.nl/ics/bics/1112121117
is contemporary version of: http://data.ga-group.nl/ics/bics/1120141613
is replaced by: http://data.ga-group.nl/ics/bics/2020/1112121117
is version of: http://data.ga-group.nl/ics/bics/1112121117
is version of: http://data.ga-group.nl/ics/bics/1120141613
imported on: 2026-06-08T13:03:47.798Z
last refreshed on: 2026-06-08T13:03:47.798Z
source accessed on: 2019-12-03T20:05:01Z
source last accessed on: 2019-12-03T20:05:01Z
label: Brinquedos e jogos - Online @pt
label: Giochi e giocattoli - Online @it
label: Jeux et jouets - En ligne @fr
label: Juguetes y juegos - En línea @es
label: Spielzeug & Spiele - Online @de
label: Игрушки и игры - онлайн @ru
label: 玩具与游戏-网上 @zh
label: 玩具及遊戲-線上 @zh-hant
label: 趣味用品･がん具･ｹﾞｰﾑ - ｵﾝﾗｲﾝ @ja
label: 완구 & 게임 - 온라인 @ko
definition: This segment includes pure-play Internet companies that retail toys, games and hobby products on the Internet.
notation: 1120141613
valid from: 2014-08-08
valid till: 2020-10-03

Jewelry & Watch - Online
type: BicsLevel5Segment
type: Classifier
type: NamedIndividual
is level5 segment of: Other Specialty Retail - Online
is anachronous version of: http://data.ga-group.nl/ics/bics/1112121118
is contemporary version of: http://data.ga-group.nl/ics/bics/1120141614
is replaced by: http://data.ga-group.nl/ics/bics/2020/1112121118
is version of: http://data.ga-group.nl/ics/bics/1112121118
is version of: http://data.ga-group.nl/ics/bics/1120141614
imported on: 2026-06-08T13:03:47.798Z
last refreshed on: 2026-06-08T13:03:47.798Z
source accessed on: 2019-12-03T20:05:01Z
source last accessed on: 2019-12-03T20:05:01Z
label: Bijoux et montres - En ligne @fr
label: Gioielli e orologi - Online @it
label: Joias e relógios - Online @pt
label: Joyería y relojes - en línea @es
label: Schmuck & Armbanduhren - Online @de
label: Ювелирные изделия и часы - онлайн @ru
label: 宝石 - ｵﾝﾗｲﾝ @ja
label: 珠宝与钟表-网上 @zh
label: 珠寶-線上 @zh-hant
label: 보석 & 손목시계 - 온라인 @ko
definition: This segment includes pure-play Internet companies that retail jewelry.
notation: 1120141614
valid from: 2014-08-08
valid till: 2020-10-03

Movie Rental - Online
type: BicsLevel5Segment
type: Classifier
type: Discontinued
type: NamedIndividual
is level5 segment of: Other Specialty Retail - Online
is contemporary version of: http://data.ga-group.nl/ics/bics/1120141615
is version of: http://data.ga-group.nl/ics/bics/1120141615
imported on: 2026-06-08T13:03:47.798Z
last refreshed on: 2026-06-08T13:03:47.798Z
source accessed on: 2019-12-03T20:05:01Z
source last accessed on: 2019-12-03T20:05:01Z
label: Alquiler de películas - En línea @es
label: Aluguel de filmes - online @pt
label: Filmverleih - Online @de
label: Location de film en ligne @fr
label: Noleggio film-Online @it
label: Аренда видеофильмов - Онлайн @ru
label: 影片出租-線上 @zh-hant
label: 映画ｿﾌﾄ･ﾚﾝﾀﾙ -ｵﾝﾗｲﾝ @ja
label: 电影出租 - 在线 @zh
label: 영화 대여 - 온라인 @ko
definition: This segment includes companies that rent movies online to the general public.
notation: 1120141615
valid from: 2014-08-08
valid till: 2020-10-03

Music & Movies - Online
type: BicsLevel5Segment
type: Classifier
type: NamedIndividual
is level5 segment of: Other Specialty Retail - Online
is anachronous version of: http://data.ga-group.nl/ics/bics/1112121119
is contemporary version of: http://data.ga-group.nl/ics/bics/1120141616
is replaced by: http://data.ga-group.nl/ics/bics/2020/1112121119
is version of: http://data.ga-group.nl/ics/bics/1112121119
is version of: http://data.ga-group.nl/ics/bics/1120141616
imported on: 2026-06-08T13:03:47.798Z
last refreshed on: 2026-06-08T13:03:47.798Z
source accessed on: 2019-12-03T20:05:01Z
source last accessed on: 2019-12-03T20:05:01Z
label: Filmes e músicas - Online @pt
label: Música y películas - en línea @es
label: Musica e film - Online @it
label: Musik & Filme - Online @de
label: Musique et films - En ligne @fr
label: Музыка и кино - онлайн @ru
label: 音乐与电影-网上 @zh
label: 音楽･映画ｿﾌﾄ-ｵﾝﾗｲﾝ @ja
label: 音樂及電影-線上 @zh-hant
label: 음악 & 영화 - 온라인 @ko
definition: This segment includes companies that retail prerecorded music and movie products on the Internet.
notation: 1120141616
valid from: 2014-08-08
valid till: 2020-10-03

Music Download Sites
type: BicsLevel5Segment
type: Classifier
type: Discontinued
type: NamedIndividual
is level5 segment of: Other Specialty Retail - Online
is contemporary version of: http://data.ga-group.nl/ics/bics/1120141617
is version of: http://data.ga-group.nl/ics/bics/1120141617
imported on: 2026-06-08T13:03:47.798Z
last refreshed on: 2026-06-08T13:03:47.798Z
source accessed on: 2019-12-03T20:05:01Z
source last accessed on: 2019-12-03T20:05:01Z
label: Musik-Downloads @de
label: Sites de download de música @pt
label: Siti scarica musica @it
label: Sitios descargar mús @es
label: Téléch. musique E/L @fr
label: Веб-сайты по загрузке музыки @ru
label: 音乐下载网站 @zh
label: 音楽ﾀﾞｳﾝﾛｰﾄﾞｻｲﾄ @ja
label: 音樂下載網站 @zh-hant
label: 음악다운로드사이트 @ko
definition: This segment includes pure-play Internet companies that are involved in music downloads on the Internet.
notation: 1120141617
valid from: 2014-08-08
valid till: 2020-10-03

Musical Instrument - Online
type: BicsLevel5Segment
type: Classifier
type: NamedIndividual
is level5 segment of: Other Specialty Retail - Online
is anachronous version of: http://data.ga-group.nl/ics/bics/1112121120
is contemporary version of: http://data.ga-group.nl/ics/bics/1120141618
is replaced by: http://data.ga-group.nl/ics/bics/2020/1112121120
is version of: http://data.ga-group.nl/ics/bics/1112121120
is version of: http://data.ga-group.nl/ics/bics/1120141618
imported on: 2026-06-08T13:03:47.798Z
last refreshed on: 2026-06-08T13:03:47.798Z
source accessed on: 2019-12-03T20:05:01Z
source last accessed on: 2019-12-03T20:05:01Z
label: Instrument de musique - En ligne @fr
label: Instrumentos musicais - Online @pt
label: Instrumentos musicales - en línea @es
label: Musikinstrument - Online @de
label: Strumenti musicali - Online @it
label: Музыкаль��ые инструменты - онлайн @ru
label: 乐器-网上 @zh
label: 楽器･部品 - ｵﾝﾗｲﾝ @ja
label: 樂器-線上 @zh-hant
label: 악기 - 온라인 @ko
definition: This segment includes pure-play Internet companies that retail musical instruments and accessories on the Internet.
notation: 1120141618
valid from: 2014-08-08
valid till: 2020-10-03

Pets & Supplies - Online
type: BicsLevel5Segment
type: Classifier
type: NamedIndividual
is level5 segment of: Other Specialty Retail - Online
is anachronous version of: http://data.ga-group.nl/ics/bics/1112121121
is contemporary version of: http://data.ga-group.nl/ics/bics/1120141619
is replaced by: http://data.ga-group.nl/ics/bics/2020/1112121121
is version of: http://data.ga-group.nl/ics/bics/1112121121
is version of: http://data.ga-group.nl/ics/bics/1120141619
imported on: 2026-06-08T13:03:47.798Z
last refreshed on: 2026-06-08T13:03:47.798Z
source accessed on: 2019-12-03T20:05:01Z
source last accessed on: 2019-12-03T20:05:01Z
label: Animais de estimação e suprimentos - online @pt
label: Animali e forniture - online @it
label: Animaux et fournitures pour animaux - En ligne @fr
label: Haustiere & Haustierbedarf - Online @de
label: Mascotas y provisiones - En línea @es
label: Домашние животные и сопутств. товары - Онлайн @ru
label: 宠物及用品 - 在线 @zh
label: 寵物及寵物用品-線上 @zh-hant
label: 애완동물 & 소모품 - 온라인 @ko
label: ﾍﾟｯﾄ･ﾍﾟｯﾄ用品ｰｵﾝﾗｲﾝ @ja
definition: This segment includes pure-play Internet companies that retail pet products and supplies on the Internet.
notation: 1120141619
valid from: 2014-08-08
valid till: 2020-10-03

Sporting Goods - Online
type: BicsLevel5Segment
type: Classifier
type: NamedIndividual
is level5 segment of: Other Specialty Retail - Online
is anachronous version of: http://data.ga-group.nl/ics/bics/1112121122
is contemporary version of: http://data.ga-group.nl/ics/bics/1120141620
is replaced by: http://data.ga-group.nl/ics/bics/2020/1112121122
is version of: http://data.ga-group.nl/ics/bics/1112121122
is version of: http://data.ga-group.nl/ics/bics/1120141620
imported on: 2026-06-08T13:03:47.798Z
last refreshed on: 2026-06-08T13:03:47.798Z
source accessed on: 2019-12-03T20:05:01Z
source last accessed on: 2019-12-03T20:05:01Z
label: Artículos deportivos - En línea @es
label: Articles de sport - En ligne @fr
label: Articoli sportivi - online @it
label: Bens desportivos - Online @pt
label: Sportartikel - Online @de
label: Спорттовары - Онлайн @ru
label: 运动用品-在线 @zh
label: 運動用品-線上 @zh-hant
label: 스포츠용품-온라인 @ko
label: ｽﾎﾟｰﾂ用品 - ｵﾝﾗｲﾝ @ja
definition: This segment includes pure-play Internet companies that retail sporting goods primarily on the Internet.
notation: 1120141620
valid from: 2014-08-08
valid till: 2020-10-03

Video Game Rental - Online
type: BicsLevel5Segment
type: Classifier
type: Discontinued
type: NamedIndividual
is level5 segment of: Other Specialty Retail - Online
is contemporary version of: http://data.ga-group.nl/ics/bics/1120141621
is version of: http://data.ga-group.nl/ics/bics/1120141621
imported on: 2026-06-08T13:03:47.798Z
last refreshed on: 2026-06-08T13:03:47.798Z
source accessed on: 2019-12-03T20:05:01Z
source last accessed on: 2019-12-03T20:05:01Z
label: Alquiler de juegos de video - En línea @es
label: Aluguel de vídeo games - online @pt
label: Location en ligne de jeux vidéo @fr
label: Noleggio videogiochi-Online @it
label: Videospielverleih - Online @de
label: Аренда видеоигр - Онлайн @ru
label: 电子游戏出租 - 在线 @zh
label: 電玩遊戲出租-線上 @zh-hant
label: 비디오 게임 대여 - 온라인 @ko
label: ﾋﾞﾃﾞｵｹﾞｰﾑ･ﾚﾝﾀﾙ -ｵﾝﾗｲﾝ @ja
definition: This segment includes companies that rent video games online to the general public.
notation: 1120141621
valid from: 2014-08-08
valid till: 2020-10-03

Misc. Retail - Online
type: BicsLevel5Segment
type: Classifier
type: Discontinued
type: NamedIndividual
is level5 segment of: Other Specialty Retail - Online
is contemporary version of: http://data.ga-group.nl/ics/bics/1120141622
is version of: http://data.ga-group.nl/ics/bics/1120141622
imported on: 2026-06-08T13:03:47.798Z
last refreshed on: 2026-06-08T13:03:47.798Z
source accessed on: 2019-12-03T20:05:01Z
source last accessed on: 2019-12-03T20:05:01Z
label: Div varejo - Online @pt
label: Diverser EH - Online @de
label: Varios Al p/menor-en línea @es
label: Vendite al dettaglio varie - Online @it
label: Vente détail div - En ligne @fr
label: Разл. розничная торговля - онлайн @ru
label: その他小売業-ｵﾝﾗｲﾝ @ja
label: 其他零售 - 線上 @zh-hant
label: 其他零售-网上 @zh
label: 기타 소매업 - 온라인 @ko
definition: This segment includes companies that retail miscellaneous items on the Internet.
notation: 1120141622
valid from: 2014-08-08
valid till: 2020-10-03

Other Specialty Retail - Online
type: BicsLevel4SubIndustry
type: Classifier
type: NamedIndividual
is sub industry of: E-Commerce Discretionary
is anachronous version of: http://data.ga-group.nl/ics/bics/11121211
is contemporary version of: http://data.ga-group.nl/ics/bics/11201416
is replaced by: http://data.ga-group.nl/ics/bics/2020/11121211
is version of: http://data.ga-group.nl/ics/bics/11121211
is version of: http://data.ga-group.nl/ics/bics/11201416
imported on: 2026-06-08T13:03:47.798Z
last refreshed on: 2026-06-08T13:03:47.798Z
source accessed on: 2019-12-03T20:05:01Z
source last accessed on: 2019-12-03T20:05:01Z
label: Altri negozi specializzati - Online @it
label: Autre vente au détail spécialisée - En ligne @fr
label: Otro minorista especializado - en línea @es
label: Outros varejistas espec - Online @pt
label: Sonst. Fachhandel - Online @de
label: Прочие специализ. розничные магазины - онлайн @ru
label: その他専門小売業 - ｵﾝﾗｲﾝ @ja
label: 其他特殊產品零售-線上 @zh-hant
label: 其他特种零售-网上 @zh
label: 기타 전문 소매업 - 온라인 @ko
definition: This industry subgroup includes online retail companies not elsewhere classified.
notation: 11201416
valid from: 2014-08-08
valid till: 2020-10-03

E-Commerce Discretionary
type: BicsLevel3Industry
type: Classifier
type: NamedIndividual
is industry of: Retail - Discretionary
is anachronous version of: http://data.ga-group.nl/ics/bics/11121211
is contemporary version of: http://data.ga-group.nl/ics/bics/112014
is replaced by: http://data.ga-group.nl/ics/bics/2020/11121211
is version of: http://data.ga-group.nl/ics/bics/11121211
is version of: http://data.ga-group.nl/ics/bics/112014
imported on: 2026-06-08T13:03:47.798Z
last refreshed on: 2026-06-08T13:03:47.798Z
source accessed on: 2019-12-03T20:05:01Z
source last accessed on: 2019-12-03T20:05:01Z
label: Discric coméc elet @pt
label: E-Commerce - Discretionary @de
label: E-Commerce discrecional @es
label: E-Commerce discrezionale @it
label: E-commerce discrétionnaire @fr
label: Eｺﾏｰｽ-一般消費財 @ja
label: ЭК-Tовары выборочн. спроса @ru
label: 电子商务非必需品 @zh
label: 電子商務非必需品 @zh-hant
label: 전자상거래 자유재량 @ko
definition: This industry includes companies that retail products on the Internet.
notation: 112014
valid from: 2014-08-08
valid till: 2020-10-03

Brick & Stone Bldg Matl Dealers
type: BicsLevel5Segment
type: Classifier
type: NamedIndividual
is level5 segment of: Building Materials Dealers
is anachronous version of: http://data.ga-group.nl/ics/bics/111211141010
is contemporary version of: http://data.ga-group.nl/ics/bics/1120151010
is replaced by: http://data.ga-group.nl/ics/bics/2020/111211141010
is version of: http://data.ga-group.nl/ics/bics/111211141010
is version of: http://data.ga-group.nl/ics/bics/1120151010
imported on: 2026-06-08T13:03:47.798Z
last refreshed on: 2026-06-08T13:03:47.798Z
source accessed on: 2019-12-03T20:05:01Z
source last accessed on: 2019-12-03T20:05:01Z
label: Concessionari mat costruz mattoni e pietra @it
label: Dealers mat de edif ladrillo y piedra @es
label: Distrib matériaux de construction en pierres/briques @fr
label: Distrib tijolos, pedras e mat de constr @pt
label: Händler von Baumaterialien aus Backstein & Stein @de
label: Торговля кирпичом, камнем @ru
label: 煉瓦･石材･建築資材流通 @ja
label: 砖石建材经销商 @zh
label: 磚塊及石頭建材經銷商 @zh-hant
label: 벽돌 & 석재 건축자재 딜러 @ko
definition: This segment includes companies that wholesale and distribute building materials and products, such as brick, stone and related construction materials.
notation: 1120151010
valid from: 2014-08-08
valid till: 2020-10-03

Plumbing & HVAC Dealers
type: BicsLevel5Segment
type: Classifier
type: NamedIndividual
is level5 segment of: Building Materials Dealers
is anachronous version of: http://data.ga-group.nl/ics/bics/111211141011
is contemporary version of: http://data.ga-group.nl/ics/bics/1120151011
is replaced by: http://data.ga-group.nl/ics/bics/2020/111211141011
is version of: http://data.ga-group.nl/ics/bics/111211141011
is version of: http://data.ga-group.nl/ics/bics/1120151011
imported on: 2026-06-08T13:03:47.798Z
last refreshed on: 2026-06-08T13:03:47.798Z
source accessed on: 2019-12-03T20:05:01Z
source last accessed on: 2019-12-03T20:05:01Z
label: Agentes equip tub e HVAC @pt
label: Comerc fontanería, HVAC @es
label: Distrib piombat e HVAC @it
label: Distrib. plomberie et CVCA @fr
label: Händler für Klempnerei & Heizung @de
label: Торговля сантехникой и отопительным оборудованием и материалами (жидкостными) @ru
label: 管道与HVAC经销商 @zh
label: 配管通風冷暖氣經銷商 @zh-hant
label: 配管･冷暖房空調設備流通 @ja
label: 배관 및 HVAC 판매업체 @ko
definition: This segment includes companies that wholesale and distribute consumer-grade plumbing and heating equipment and supplies. Excludes commercial-grade products (see Industrial Equip & Supplies Distr).
notation: 1120151011
valid from: 2014-08-08
valid till: 2020-10-03

Roof, Siding & Insulation Distr
type: BicsLevel5Segment
type: Classifier
type: NamedIndividual
is level5 segment of: Building Materials Dealers
is anachronous version of: http://data.ga-group.nl/ics/bics/111211141012
is contemporary version of: http://data.ga-group.nl/ics/bics/1120151012
is replaced by: http://data.ga-group.nl/ics/bics/2020/111211141012
is version of: http://data.ga-group.nl/ics/bics/111211141012
is version of: http://data.ga-group.nl/ics/bics/1120151012
imported on: 2026-06-08T13:03:47.798Z
last refreshed on: 2026-06-08T13:03:47.798Z
source accessed on: 2019-12-03T20:05:01Z
source last accessed on: 2019-12-03T20:05:01Z
label: Distrib mat isolamento, rev paredes, telhados @pt
label: Distrib tetti, esterni e isolamento @it
label: Distrib toiture, bardage et isolants @fr
label: Distribución de techos, cubrimientos y aislamiento @es
label: Händler von Dachdeckung, Hausverkleidung & Isolierung @de
label: Торговля матер. для кровли, сайдинга и изоляции @ru
label: 屋根材･壁材･絶縁材流通 @ja
label: 屋顶、墙板及绝缘材料分销商 @zh
label: 屋���、牆及隔間材料經銷商 @zh-hant
label: 지붕, 판자벽 & 단열재 판매업 @ko
definition: This segment includes companies that wholesale and distribute building materials and products, such as roofing, siding and insulation materials.
notation: 1120151012
valid from: 2014-08-08
valid till: 2020-10-03

Wood Products Dealers
type: BicsLevel5Segment
type: Classifier
type: NamedIndividual
is level5 segment of: Building Materials Dealers
is anachronous version of: http://data.ga-group.nl/ics/bics/111211141013
is contemporary version of: http://data.ga-group.nl/ics/bics/1120151013
is replaced by: http://data.ga-group.nl/ics/bics/2020/111211141013
is version of: http://data.ga-group.nl/ics/bics/111211141013
is version of: http://data.ga-group.nl/ics/bics/1120151013
imported on: 2026-06-08T13:03:47.798Z
last refreshed on: 2026-06-08T13:03:47.798Z
source accessed on: 2019-12-03T20:05:01Z
source last accessed on: 2019-12-03T20:05:01Z
label: Agentes prod madeira @pt
label: Comerciantes prod madera @es
label: Distrib. produits ligneux @fr
label: Distributori di legnami @it
label: Händler für Holzprodukte @de
label: Торговля лесоматериалами @ru
label: 木制品经销商 @zh
label: 木材製品流通 @ja
label: 木製品經銷商 @zh-hant
label: 목제품 판매업체 @ko
definition: This segment includes companies that wholesale and distribute building materials, such as lumber, plywood, millwork and related product materials.
notation: 1120151013
valid from: 2014-08-08
valid till: 2020-10-03

Other Const Material Dealers
type: BicsLevel5Segment
type: Classifier
type: Discontinued
type: NamedIndividual
is level5 segment of: Building Materials Dealers
is contemporary version of: http://data.ga-group.nl/ics/bics/1120151014
is version of: http://data.ga-group.nl/ics/bics/1120151014
imported on: 2026-06-08T13:03:47.798Z
last refreshed on: 2026-06-08T13:03:47.798Z
source accessed on: 2019-12-03T20:05:01Z
source last accessed on: 2019-12-03T20:05:01Z
label: Concessionari altri materiali edili @it
label: Distrib autres matériaux const @fr
label: Händler von sonst. Baumaterialien @de
label: Otros comerciantes mats constr @es
label: Outros distrib materiais const @pt
label: Др. строит. материалы @ru
label: その他建築資材流通 @ja
label: 其他建材经销商 @zh
label: 其他營建材料經銷商 @zh-hant
label: 기타 건축자재 딜러 @ko
definition: This segment includes companies that wholesale and distribute all other building materials and products not elsewhere classified.
notation: 1120151014
valid from: 2014-08-08
valid till: 2020-10-03

Building Materials Dealers
type: BicsLevel4SubIndustry
type: Classifier
type: NamedIndividual
is sub industry of: Home Products Stores
is anachronous version of: http://data.ga-group.nl/ics/bics/1112111410
is contemporary version of: http://data.ga-group.nl/ics/bics/11201510
is replaced by: http://data.ga-group.nl/ics/bics/2020/1112111410
is version of: http://data.ga-group.nl/ics/bics/1112111410
is version of: http://data.ga-group.nl/ics/bics/11201510
imported on: 2026-06-08T13:03:47.798Z
last refreshed on: 2026-06-08T13:03:47.798Z
source accessed on: 2019-12-03T20:05:01Z
source last accessed on: 2019-12-03T20:05:01Z
label: Concessionari materiali edili @it
label: Dealers de mat de constr @es
label: Distribuidores de materiais de construção @pt
label: Distributeurs de matériaux de construction @fr
label: Händler von Baumaterialien @de
label: Продавцы строительных материалов @ru
label: 建材經銷商 @zh-hant
label: 建材经销商 @zh
label: 建築資材流通 @ja
label: 건축자재 딜러 @ko
definition: This industry subgroup includes companies that wholesale and distribute building materials and products. These building materials and products are utilized for use in homebuilding and other retail-orientated applications.
notation: 11201510
valid from: 2014-08-08
valid till: 2020-10-03

Furniture Stores
type: BicsLevel4SubIndustry
type: Classifier
type: NamedIndividual
is sub industry of: Home Products Stores
is anachronous version of: http://data.ga-group.nl/ics/bics/111211141210
is contemporary version of: http://data.ga-group.nl/ics/bics/11201511
is replaced by: http://data.ga-group.nl/ics/bics/2020/111211141210
is version of: http://data.ga-group.nl/ics/bics/111211141210
is version of: http://data.ga-group.nl/ics/bics/11201511
imported on: 2026-06-08T13:03:47.798Z
last refreshed on: 2026-06-08T13:03:47.798Z
source accessed on: 2019-12-03T20:05:01Z
source last accessed on: 2019-12-03T20:05:01Z
label: Lojas de móveis @pt
label: Möbelgeschäfte @de
label: Magasins de meubles @fr
label: Negozi di mobili @it
label: Tiendas de muebles @es
label: Магазины мебели @ru
label: 家具商店 @zh
label: 家具小売業 @ja
label: 家具店 @zh-hant
label: 가구 매장 @ko
definition: This industry subgroup includes companies that retail furniture. This can include Internet sales of brick-and-mortar stores.
notation: 11201511
valid from: 2014-08-08
valid till: 2020-10-03

Home Furnishings Stores
type: BicsLevel4SubIndustry
type: Classifier
type: NamedIndividual
is sub industry of: Home Products Stores
is anachronous version of: http://data.ga-group.nl/ics/bics/111211141211
is contemporary version of: http://data.ga-group.nl/ics/bics/11201512
is replaced by: http://data.ga-group.nl/ics/bics/2020/111211141211
is version of: http://data.ga-group.nl/ics/bics/111211141211
is version of: http://data.ga-group.nl/ics/bics/11201512
imported on: 2026-06-08T13:03:47.798Z
last refreshed on: 2026-06-08T13:03:47.798Z
source accessed on: 2019-12-03T20:05:01Z
source last accessed on: 2019-12-03T20:05:01Z
label: Einrichtungsläden @de
label: Lojas de mobílias para o lar @pt
label: Magasins d'accessoires de maison @fr
label: Mueblerías para el hogar @es
label: Negozi di arredi @it
label: Магази��ы товаров домашней обстановки @ru
label: 室内装飾品小売業 @ja
label: 家装用品商店 @zh
label: 家飾品店 @zh-hant
label: 가정 장식용가구 매장 @ko
definition: This industry subgroup includes companies that retail home furnishing products. This can include Internet sales of brick-and-mortar stores.
notation: 11201512
valid from: 2014-08-08
valid till: 2020-10-03

Hardware Stores
type: BicsLevel5Segment
type: Classifier
type: NamedIndividual
is level5 segment of: Home Improvement Stores
is anachronous version of: http://data.ga-group.nl/ics/bics/111211141110
is contemporary version of: http://data.ga-group.nl/ics/bics/1120151310
is replaced by: http://data.ga-group.nl/ics/bics/2020/111211141110
is version of: http://data.ga-group.nl/ics/bics/111211141110
is version of: http://data.ga-group.nl/ics/bics/1120151310
imported on: 2026-06-08T13:03:47.798Z
last refreshed on: 2026-06-08T13:03:47.798Z
source accessed on: 2019-12-03T20:05:01Z
source last accessed on: 2019-12-03T20:05:01Z
label: Eisenwarengeschäfte @de
label: Lojas de ferragens @pt
label: Negozi di ferramenta @it
label: Quincailleries @fr
label: Tiendas de herrajes y cerraduras @es
label: Магазины скобяных товаров @ru
label: 五金店 @zh
label: 五金行 @zh-hant
label: 金物小売業 @ja
label: 철물 매장 @ko
definition: This segment includes companies that retail hardware. This can include Internet sales of brick-and-mortar stores.
notation: 1120151310
valid from: 2014-08-08
valid till: 2020-10-03

Home Centers
type: BicsLevel5Segment
type: Classifier
type: NamedIndividual
is level5 segment of: Home Improvement Stores
is anachronous version of: http://data.ga-group.nl/ics/bics/111211141111
is contemporary version of: http://data.ga-group.nl/ics/bics/1120151311
is replaced by: http://data.ga-group.nl/ics/bics/2020/111211141111
is version of: http://data.ga-group.nl/ics/bics/111211141111
is version of: http://data.ga-group.nl/ics/bics/1120151311
imported on: 2026-06-08T13:03:47.798Z
last refreshed on: 2026-06-08T13:03:47.798Z
source accessed on: 2019-12-03T20:05:01Z
source last accessed on: 2019-12-03T20:05:01Z
label: Centre de rénovation @fr
label: Centros p/el hogar @es
label: Home-Center @de
label: Negozi articoli casa @it
label: Домашние центры @ru
label: 家居用品中心 @zh
label: 가정용품 소매업 @ko
label: ﾎｰﾑｾﾝﾀｰ @ja
definition: This segment includes companies that retail home improvement materials and related merchandise. This can include Internet sales of brick-and-mortar stores.
notation: 1120151311
valid from: 2014-08-08
valid till: 2020-10-03

Nursery & Garden Centers
type: BicsLevel5Segment
type: Classifier
type: NamedIndividual
is level5 segment of: Home Improvement Stores
is anachronous version of: http://data.ga-group.nl/ics/bics/111211141112
is contemporary version of: http://data.ga-group.nl/ics/bics/1120151312
is replaced by: http://data.ga-group.nl/ics/bics/2020/111211141112
is version of: http://data.ga-group.nl/ics/bics/111211141112
is version of: http://data.ga-group.nl/ics/bics/1120151312
imported on: 2026-06-08T13:03:47.798Z
last refreshed on: 2026-06-08T13:03:47.798Z
source accessed on: 2019-12-03T20:05:01Z
source last accessed on: 2019-12-03T20:05:01Z
label: Centri coltivaz e giardin @it
label: Centros de invernaderos y jardinería @es
label: Gärtnereien & Gartengeschäfte @de
label: Pépinières et centres de jardinage @fr
label: Viveiro e jardinagem @pt
label: Рассадно-садовые центры @ru
label: 苗圃及园艺中心 @zh
label: 苗圃及園藝中心 @zh-hant
label: 苗木･園芸ｾﾝﾀｰ @ja
label: 종묘 & 정원 센터 @ko
definition: This segment includes companies that retail nursery and gardening products. This can include Internet sales of brick-and-mortar stores.
notation: 1120151312
valid from: 2014-08-08
valid till: 2020-10-03

Other Home Improvement Stores
type: BicsLevel5Segment
type: Classifier
type: Discontinued
type: NamedIndividual
is level5 segment of: Home Improvement Stores
is contemporary version of: http://data.ga-group.nl/ics/bics/1120151313
is version of: http://data.ga-group.nl/ics/bics/1120151313
imported on: 2026-06-08T13:03:47.798Z
last refreshed on: 2026-06-08T13:03:47.798Z
source accessed on: 2019-12-03T20:05:01Z
source last accessed on: 2019-12-03T20:05:01Z
label: Altri negozi fai da te @it
label: Autres magasins de bricolage et rénovation @fr
label: Otras tiendas de proyectos domésticos @es
label: Outras lojas para reforma de casa @pt
label: Sonstige Heimwerkergeschäfte @de
label: Пр. магазины товаров д/обустройства дома @ru
label: その他住宅関連用品小売 @ja
label: 其他家居装修商店 @zh
label: 其他居家修繕商店 @zh-hant
label: 기타 주택개보수 매장 @ko
definition: This segment includes companies that retail other home improvement products. This can include Internet sales of brick-and-mortar stores.
notation: 1120151313
valid from: 2014-08-08
valid till: 2020-10-03

Home Improvement Stores
type: BicsLevel4SubIndustry
type: Classifier
type: NamedIndividual
is sub industry of: Home Products Stores
is anachronous version of: http://data.ga-group.nl/ics/bics/1112111411
is contemporary version of: http://data.ga-group.nl/ics/bics/11201513
is replaced by: http://data.ga-group.nl/ics/bics/2020/1112111411
is version of: http://data.ga-group.nl/ics/bics/1112111411
is version of: http://data.ga-group.nl/ics/bics/11201513
imported on: 2026-06-08T13:03:47.798Z
last refreshed on: 2026-06-08T13:03:47.798Z
source accessed on: 2019-12-03T20:05:01Z
source last accessed on: 2019-12-03T20:05:01Z
label: Baumarkt @de
label: Lojas de renovação casas @pt
label: Magasins de bricolage/rénov @fr
label: Negozi fai da te @it
label: Tiendas proyectos domésticos @es
label: Магазины товаров для благоустройства дома @ru
label: 住宅関連用品小売 @ja
label: 家居装饰店 @zh
label: 居家修繕商店 @zh-hant
label: 주택개량 상점 @ko
definition: This industry subgroup includes companies that retail home improvement products and materials. Products can include lumber, paint, plumbing, tools, lighting, hardware and flooring.
notation: 11201513
valid from: 2014-08-08
valid till: 2020-10-03

Home Products Stores
type: BicsLevel3Industry
type: Classifier
type: NamedIndividual
is industry of: Retail - Discretionary
is anachronous version of: http://data.ga-group.nl/ics/bics/11121114
is contemporary version of: http://data.ga-group.nl/ics/bics/112015
is replaced by: http://data.ga-group.nl/ics/bics/2020/11121114
is version of: http://data.ga-group.nl/ics/bics/11121114
is version of: http://data.ga-group.nl/ics/bics/112015
imported on: 2026-06-08T13:03:47.798Z
last refreshed on: 2026-06-08T13:03:47.798Z
source accessed on: 2019-12-03T20:05:01Z
source last accessed on: 2019-12-03T20:05:01Z
label: Haushaltswarenläden @de
label: Lojas prod domést @pt
label: Mag. prod. maison @fr
label: Negozi casalinghi @it
label: Tiendas prods dom @es
label: Мгз товаров для дома @ru
label: 家居产品专卖店 @zh
label: 家居產品店 @zh-hant
label: 家庭用品小売業 @ja
label: 가정용품 매장 @ko
definition: This industry includes companies that retail furniture, hardware, home furnishings, nursery products, gardening and home improvement products. This industry can include Internet sales of brick-and-mortar stores.
notation: 112015
valid from: 2014-08-08
valid till: 2020-10-03

Jewelry Stores
type: BicsLevel4SubIndustry
type: Classifier
type: NamedIndividual
is sub industry of: Jewelry & Watch Stores
is anachronous version of: http://data.ga-group.nl/ics/bics/1112111510
is contemporary version of: http://data.ga-group.nl/ics/bics/11201610
is replaced by: http://data.ga-group.nl/ics/bics/2020/1112111510
is version of: http://data.ga-group.nl/ics/bics/1112111510
is version of: http://data.ga-group.nl/ics/bics/11201610
imported on: 2026-06-08T13:03:47.798Z
last refreshed on: 2026-06-08T13:03:47.798Z
source accessed on: 2019-12-03T20:05:01Z
source last accessed on: 2019-12-03T20:05:01Z
label: Bijouteries @fr
label: Gioiellerie @it
label: Joalherias @pt
label: Joyerías @es
label: Juweliergeschäfte @de
label: Ювелирные магазины @ru
label: 宝石･貴金属小売業 @ja
label: 珠宝店 @zh
label: 珠寶店 @zh-hant
label: 보석판매점 @ko
definition: This industry subgroup includes companies that retail jewelry. This can include Internet sales of brick-and-mortar stores.
notation: 11201610
valid from: 2014-08-08
valid till: 2020-10-03

Watch Stores
type: BicsLevel4SubIndustry
type: Classifier
type: NamedIndividual
is sub industry of: Jewelry & Watch Stores
is anachronous version of: http://data.ga-group.nl/ics/bics/1112111511
is contemporary version of: http://data.ga-group.nl/ics/bics/11201611
is replaced by: http://data.ga-group.nl/ics/bics/2020/1112111511
is version of: http://data.ga-group.nl/ics/bics/1112111511
is version of: http://data.ga-group.nl/ics/bics/11201611
imported on: 2026-06-08T13:03:47.798Z
last refreshed on: 2026-06-08T13:03:47.798Z
source accessed on: 2019-12-03T20:05:01Z
source last accessed on: 2019-12-03T20:05:01Z
label: Lojas de relógios @pt
label: Magasins de montres @fr
label: Orologerie @it
label: Tiendas de relojes @es
label: Uhrengeschäfte @de
label: Магазины часов @ru
label: 時計小売業 @ja
label: 鐘錶店 @zh-hant
label: 钟表店 @zh
label: 시계 매장 @ko
definition: This industry subgroup includes companies that retail watches. This can include Internet sales of brick-and-mortar stores.
notation: 11201611
valid from: 2014-08-08
valid till: 2020-10-03

Jewelry & Watch Stores
type: BicsLevel3Industry
type: Classifier
type: NamedIndividual
is industry of: Retail - Discretionary
is anachronous version of: http://data.ga-group.nl/ics/bics/11121115
is contemporary version of: http://data.ga-group.nl/ics/bics/112016
is replaced by: http://data.ga-group.nl/ics/bics/2020/11121115
is version of: http://data.ga-group.nl/ics/bics/11121115
is version of: http://data.ga-group.nl/ics/bics/112016
imported on: 2026-06-08T13:03:47.798Z
last refreshed on: 2026-06-08T13:03:47.798Z
source accessed on: 2019-12-03T20:05:01Z
source last accessed on: 2019-12-03T20:05:01Z
label: Gioiellerie e orologerie @it
label: Joalherias e lojas de relógios @pt
label: Joyería y tiendas relojes @es
label: Juwelier- & Uhrengeschäfte @de
label: Mag de bijoux et montres @fr
label: Магазины ювелир. изд. и часов @ru
label: 宝飾品･時計小売業 @ja
label: 珠宝与钟表店 @zh
label: 珠寶及鐘錶店 @zh-hant
label: 보석 & 시계 매장 @ko
definition: This industry includes stores that retail pearls, precious gems, and precious metal crafted into various types of adornments.
notation: 112016
valid from: 2014-08-08
valid till: 2020-10-03

Apparel Stores - Franchising
type: BicsLevel4SubIndustry
type: Classifier
type: NamedIndividual
is sub industry of: Specialty Apparel Stores
is anachronous version of: http://data.ga-group.nl/ics/bics/1112111610
is contemporary version of: http://data.ga-group.nl/ics/bics/11201710
is replaced by: http://data.ga-group.nl/ics/bics/2020/1112111610
is version of: http://data.ga-group.nl/ics/bics/1112111610
is version of: http://data.ga-group.nl/ics/bics/11201710
imported on: 2026-06-08T13:03:47.798Z
last refreshed on: 2026-06-08T13:03:47.798Z
source accessed on: 2019-12-03T20:05:01Z
source last accessed on: 2019-12-03T20:05:01Z
label: Abbigliamento - Franchising @it
label: Bekleidungsgeschäfte - Franchise @de
label: Lojas de roupas - Franquia @pt
label: Magasins de vêtements - Franchises @fr
label: Tiendas de ropa - Franquicia @es
label: Магазины одежды - Франшизы @ru
label: 服装店 - 特许经营 @zh
label: 服飾店-加盟 @zh-hant
label: 衣料品店-ﾌﾗﾝﾁｬｲｽﾞ @ja
label: 의류매장-프랜차이즈 @ko
definition: This industry subgroup includes apparel retailers that have a franchise revenue stream.
notation: 11201710
valid from: 2014-08-08
valid till: 2020-10-03

Child & Infant Clothing Stores
type: BicsLevel4SubIndustry
type: Classifier
type: NamedIndividual
is sub industry of: Specialty Apparel Stores
is anachronous version of: http://data.ga-group.nl/ics/bics/1112111611
is contemporary version of: http://data.ga-group.nl/ics/bics/11201711
is replaced by: http://data.ga-group.nl/ics/bics/2020/1112111611
is version of: http://data.ga-group.nl/ics/bics/1112111611
is version of: http://data.ga-group.nl/ics/bics/11201711
imported on: 2026-06-08T13:03:47.798Z
last refreshed on: 2026-06-08T13:03:47.798Z
source accessed on: 2019-12-03T20:05:01Z
source last accessed on: 2019-12-03T20:05:01Z
label: Kinderer- & Babybekleidungsgeschäfte @de
label: Lojas de roupas infantis @pt
label: Mag vêtements pour enfants et bébés @fr
label: Negozi abbigliamento bambini e neonati @it
label: Tiendas de ropa para niños e infantes @es
label: Магазины одежды д/детей и младенцев @ru
label: 儿童与婴儿服装店 @zh
label: 子供服・ﾍﾞﾋﾞｰ服小売業 @ja
label: 童裝及嬰兒用品店 @zh-hant
label: 아동복 & 유아복 매장 @ko
definition: This industry subgroup includes companies that retail children's and infants' clothing. This can include Internet sales of brick-and-mortar stores.
notation: 11201711
valid from: 2014-08-08
valid till: 2020-10-03

Clothing Accessories Stores
type: BicsLevel4SubIndustry
type: Classifier
type: NamedIndividual
is sub industry of: Specialty Apparel Stores
is anachronous version of: http://data.ga-group.nl/ics/bics/1112111617
is contemporary version of: http://data.ga-group.nl/ics/bics/11201712
is replaced by: http://data.ga-group.nl/ics/bics/2020/1112111617
is version of: http://data.ga-group.nl/ics/bics/1112111617
is version of: http://data.ga-group.nl/ics/bics/11201712
imported on: 2026-06-08T13:03:47.798Z
last refreshed on: 2026-06-08T13:03:47.798Z
source accessed on: 2019-12-03T20:05:01Z
source last accessed on: 2019-12-03T20:05:01Z
label: Bekleidungsaccessoiregeschäfte @de
label: Lojas de acessórios para roupas @pt
label: Magasins d'accessoires vestimentaires @fr
label: Negozi di accessori per abbigliamento @it
label: Tiendas de accesorios de ropa @es
label: Магазины аксессуаров для одежды @ru
label: 服装饰品商店 @zh
label: 服飾配件店 @zh-hant
label: 装身具小売業 @ja
label: 의류 액세서리 매장 @ko
definition: This industry subgroup includes companies that retail clothing accessories. This can include Internet sales of brick-and-mortar stores.
notation: 11201712
valid from: 2014-08-08
valid till: 2020-10-03

Family Clothing Stores
type: BicsLevel4SubIndustry
type: Classifier
type: NamedIndividual
is sub industry of: Specialty Apparel Stores
is anachronous version of: http://data.ga-group.nl/ics/bics/1112111613
is contemporary version of: http://data.ga-group.nl/ics/bics/11201713
is replaced by: http://data.ga-group.nl/ics/bics/2020/1112111613
is version of: http://data.ga-group.nl/ics/bics/1112111613
is version of: http://data.ga-group.nl/ics/bics/11201713
imported on: 2026-06-08T13:03:47.798Z
last refreshed on: 2026-06-08T13:03:47.798Z
source accessed on: 2019-12-03T20:05:01Z
source last accessed on: 2019-12-03T20:05:01Z
label: Familienbekleidungsgeschäfte @de
label: Lojas de roupas para família @pt
label: Magasins de vêtements pour la famille @fr
label: Negozi abbigliamento famiglie @it
label: Tiendas de ropa familiar @es
label: Магазины одежды для семьи @ru
label: 家庭服装店 @zh
label: 家庭服飾店 @zh-hant
label: 総合衣料品小売業 @ja
label: 가족 의류 매장 @ko
definition: This industry subgroup includes companies that retail apparel for men, women and children. This can include Internet sales of brick-and-mortar stores.
notation: 11201713
valid from: 2014-08-08
valid till: 2020-10-03

Footwear Stores
type: BicsLevel4SubIndustry
type: Classifier
type: NamedIndividual
is sub industry of: Specialty Apparel Stores
is anachronous version of: http://data.ga-group.nl/ics/bics/1112111618
is contemporary version of: http://data.ga-group.nl/ics/bics/11201714
is replaced by: http://data.ga-group.nl/ics/bics/2020/1112111618
is version of: http://data.ga-group.nl/ics/bics/1112111618
is version of: http://data.ga-group.nl/ics/bics/11201714
imported on: 2026-06-08T13:03:47.798Z
last refreshed on: 2026-06-08T13:03:47.798Z
source accessed on: 2019-12-03T20:05:01Z
source last accessed on: 2019-12-03T20:05:01Z
label: Lojas de calçados @pt
label: Mag. chaussures @fr
label: Negozi calzature @it
label: Schuhgeschäfte @de
label: Zapaterías @es
label: Магазины обуви @ru
label: 履物小売業 @ja
label: 鞋店 @zh-hant
label: 鞋类商店 @zh
label: 신발 매장 @ko
definition: This industry subgroup includes companies that retail footwear products. This can include Internet sales of brick-and-mortar stores.
notation: 11201714
valid from: 2014-08-08
valid till: 2020-10-03

Men's Clothing Stores
type: BicsLevel4SubIndustry
type: Classifier
type: NamedIndividual
is sub industry of: Specialty Apparel Stores
is anachronous version of: http://data.ga-group.nl/ics/bics/1112111614
is contemporary version of: http://data.ga-group.nl/ics/bics/11201715
is replaced by: http://data.ga-group.nl/ics/bics/2020/1112111614
is version of: http://data.ga-group.nl/ics/bics/1112111614
is version of: http://data.ga-group.nl/ics/bics/11201715
imported on: 2026-06-08T13:03:47.798Z
last refreshed on: 2026-06-08T13:03:47.798Z
source accessed on: 2019-12-03T20:05:01Z
source last accessed on: 2019-12-03T20:05:01Z
label: Herrenbekleidungsgeschäfte @de
label: Lojas de roupas masculinas @pt
label: Magasins de vêtements pour hommes @fr
label: Negozi abbigliamento uomo @it
label: Tiendas de ropa varonil @es
label: Магазины мужской одежды @ru
label: 男士服装店 @zh
label: 男性服飾店 @zh-hant
label: 紳士服小売業 @ja
label: 남성의류 매장 @ko
definition: This industry subgroup includes companies that retail men's clothing. This can include Internet sales of brick-and-mortar stores.
notation: 11201715
valid from: 2014-08-08
valid till: 2020-10-03

Off-Price Apparel
type: BicsLevel4SubIndustry
type: Classifier
type: NamedIndividual
is sub industry of: Specialty Apparel Stores
is anachronous version of: http://data.ga-group.nl/ics/bics/1112111616
is contemporary version of: http://data.ga-group.nl/ics/bics/11201716
is replaced by: http://data.ga-group.nl/ics/bics/2020/1112111616
is version of: http://data.ga-group.nl/ics/bics/1112111616
is version of: http://data.ga-group.nl/ics/bics/11201716
imported on: 2026-06-08T13:03:47.798Z
last refreshed on: 2026-06-08T13:03:47.798Z
source accessed on: 2019-12-03T20:05:01Z
source last accessed on: 2019-12-03T20:05:01Z
label: Abbigliam prezzi ridotti @it
label: Ropa a descuento @es
label: Unterpreisbekleidung @de
label: Vêtements à prix réduits @fr
label: Vestuário com descontos @pt
label: Качественная одежда по сниженным ценам @ru
label: 廉價服飾 @zh-hant
label: 特惠服装 @zh
label: 가격할인 의류 @ko
label: ﾃﾞｨｽｶｳﾝﾄ衣料 @ja
definition: This industry subgroup includes companies that have separate departments for various merchandise lines, such as apparel, jewelry, home furnishings and linens, each with a single line of cash registers. They generally offer merchandise at discounted prices compared with traditional department stores.
notation: 11201716
valid from: 2014-08-08
valid till: 2020-10-03

Teen & Young Adult Cloth Stores
type: BicsLevel4SubIndustry
type: Classifier
type: NamedIndividual
is sub industry of: Specialty Apparel Stores
is anachronous version of: http://data.ga-group.nl/ics/bics/1112111612
is contemporary version of: http://data.ga-group.nl/ics/bics/11201717
is replaced by: http://data.ga-group.nl/ics/bics/2020/1112111612
is version of: http://data.ga-group.nl/ics/bics/1112111612
is version of: http://data.ga-group.nl/ics/bics/11201717
imported on: 2026-06-08T13:03:47.798Z
last refreshed on: 2026-06-08T13:03:47.798Z
source accessed on: 2019-12-03T20:05:01Z
source last accessed on: 2019-12-03T20:05:01Z
label: Bekleidungsgeschäfte für Teen, Tween & junge Heranwachsende @de
label: Lojas de vestuário para adolescentes, jovens adultos @pt
label: Mag vêtement préadolescents, adolescents et jeunes adultes @fr
label: Negozi abbigliamento giovani e giovanissimi @it
label: Tiendas de ropa juvenil @es
label: Магазины одежды д/подростков и молодежи @ru
label: 青少年及年輕人服飾店 @zh-hant
label: 青少年服装店 @zh
label: 青少年��女向衣料小売店 @ja
label: 청소년 & 청년 의류 매장 @ko
definition: This industry subgroup includes companies that retail teen, tween and young adult clothing. This can include Internet sales of brick-and-mortar stores.
notation: 11201717
valid from: 2014-08-08
valid till: 2020-10-03

Women's Clothing Stores
type: BicsLevel4SubIndustry
type: Classifier
type: NamedIndividual
is sub industry of: Specialty Apparel Stores
is anachronous version of: http://data.ga-group.nl/ics/bics/1112111615
is contemporary version of: http://data.ga-group.nl/ics/bics/11201718
is replaced by: http://data.ga-group.nl/ics/bics/2020/1112111615
is version of: http://data.ga-group.nl/ics/bics/1112111615
is version of: http://data.ga-group.nl/ics/bics/11201718
imported on: 2026-06-08T13:03:47.798Z
last refreshed on: 2026-06-08T13:03:47.798Z
source accessed on: 2019-12-03T20:05:01Z
source last accessed on: 2019-12-03T20:05:01Z
label: Frauenbekleidungsgeschäfte @de
label: Lojas de roupas femininas @pt
label: Magasins vêtements pr femmes @fr
label: Negozi abbigliamento donna @it
label: Tiendas de ropa para mujeres @es
label: Магазины женской одежды @ru
label: 女性服飾店 @zh-hant
label: 妇女服装商店 @zh
label: 婦人服小売業 @ja
label: 여성의류 매장 @ko
definition: This industry subgroup includes companies that retail women's clothing. This can include Internet sales of brick-and-mortar stores.
notation: 11201718
valid from: 2014-08-08
valid till: 2020-10-03

Specialty Apparel Stores
type: BicsLevel3Industry
type: Classifier
type: NamedIndividual
is industry of: Retail - Discretionary
is anachronous version of: http://data.ga-group.nl/ics/bics/11121116
is contemporary version of: http://data.ga-group.nl/ics/bics/112017
is replaced by: http://data.ga-group.nl/ics/bics/2020/11121116
is version of: http://data.ga-group.nl/ics/bics/11121116
is version of: http://data.ga-group.nl/ics/bics/112017
imported on: 2026-06-08T13:03:47.798Z
last refreshed on: 2026-06-08T13:03:47.798Z
source accessed on: 2019-12-03T20:05:01Z
source last accessed on: 2019-12-03T20:05:01Z
label: Geschäfte für Sonderbekleidung @de
label: Lojas vest espec @pt
label: Mag. vêtements spécialisés @fr
label: Negozi abbigliamento speciale @it
label: Tiendas ropa espec @es
label: Магазины спец. одежды @ru
label: 专业服饰店 @zh
label: 専門衣料小売店 @ja
label: 特殊服飾商店 @zh-hant
label: 전문 의류 매장 @ko
definition: This industry includes companies that retail family, men's, women's, children's and teen's clothing accessories. This industry can include Internet sales of brick-and-mortar stores.
notation: 112017
valid from: 2014-08-08
valid till: 2020-10-03

Sporting Goods Stores
type: BicsLevel3Industry
type: Classifier
type: NamedIndividual
is industry of: Retail - Discretionary
is anachronous version of: http://data.ga-group.nl/ics/bics/11121117
is contemporary version of: http://data.ga-group.nl/ics/bics/112018
is replaced by: http://data.ga-group.nl/ics/bics/2020/11121117
is version of: http://data.ga-group.nl/ics/bics/11121117
is version of: http://data.ga-group.nl/ics/bics/112018
imported on: 2026-06-08T13:03:47.798Z
last refreshed on: 2026-06-08T13:03:47.798Z
source accessed on: 2019-12-03T20:05:01Z
source last accessed on: 2019-12-03T20:05:01Z
label: Lojas de materiais esportivos @pt
label: Magasins d'articles de sport @fr
label: Negozi per lo sport @it
label: Sportartikelläden @de
label: Tiendas de bienes deportivos @es
label: Магазины спортивных товаров @ru
label: 体育用品店 @zh
label: 運動用品店 @zh-hant
label: 스포츠 용품 매장 @ko
label: ｽﾎﾟｰﾂ用品小売業 @ja
definition: This industry includes stores that retail sporting goods, fishing gear, camping gear, kayaks, rowboats and bicycles.
notation: 112018
valid from: 2014-08-08
valid till: 2020-10-03

Arts & Crafts Stores
type: BicsLevel4SubIndustry
type: Classifier
type: NamedIndividual
is sub industry of: Other Spec Retail - Discr
is anachronous version of: http://data.ga-group.nl/ics/bics/1112111810
is contemporary version of: http://data.ga-group.nl/ics/bics/11201910
is replaced by: http://data.ga-group.nl/ics/bics/2020/1112111810
is version of: http://data.ga-group.nl/ics/bics/1112111810
is version of: http://data.ga-group.nl/ics/bics/11201910
imported on: 2026-06-08T13:03:47.798Z
last refreshed on: 2026-06-08T13:03:47.798Z
source accessed on: 2019-12-03T20:05:01Z
source last accessed on: 2019-12-03T20:05:01Z
label: Artigianato @it
label: Kunst- & Bastelläden @de
label: Lojas de artesanatos e artes @pt
label: Magasins d'art et de bricolage @fr
label: Tiendas de artesanías @es
label: Магазины товаров для искусства и худ. творчества @ru
label: 工艺品店 @zh
label: 工藝品店 @zh-hant
label: 美術工芸品小売業 @ja
label: 예술 & 공예품 매장 @ko
definition: This industry subgroup includes companies that retail arts and crafts products. This can include Internet sales of brick-and-mortar stores.
notation: 11201910
valid from: 2014-08-08
valid till: 2020-10-03

Book Stores
type: BicsLevel4SubIndustry
type: Classifier
type: NamedIndividual
is sub industry of: Other Spec Retail - Discr
is anachronous version of: http://data.ga-group.nl/ics/bics/1112111811
is contemporary version of: http://data.ga-group.nl/ics/bics/11201911
is replaced by: http://data.ga-group.nl/ics/bics/2020/1112111811
is version of: http://data.ga-group.nl/ics/bics/1112111811
is version of: http://data.ga-group.nl/ics/bics/11201911
imported on: 2026-06-08T13:03:47.798Z
last refreshed on: 2026-06-08T13:03:47.798Z
source accessed on: 2019-12-03T20:05:01Z
source last accessed on: 2019-12-03T20:05:01Z
label: Buchhandlungen @de
label: Librairies @fr
label: Librerías @es
label: Librerie @it
label: Livrarias @pt
label: Книжные магазины @ru
label: 书店 @zh
label: 書店 @zh-hant
label: 書籍小売 @ja
label: 서점 @ko
definition: This industry subgroup includes companies that retail new books in brick-and-mortar stores and on the Internet.
notation: 11201911
valid from: 2014-08-08
valid till: 2020-10-03

Cosmetics & Beauty Stores
type: BicsLevel4SubIndustry
type: Classifier
type: NamedIndividual
is sub industry of: Other Spec Retail - Discr
is anachronous version of: http://data.ga-group.nl/ics/bics/1112111812
is contemporary version of: http://data.ga-group.nl/ics/bics/11201912
is replaced by: http://data.ga-group.nl/ics/bics/2020/1112111812
is version of: http://data.ga-group.nl/ics/bics/1112111812
is version of: http://data.ga-group.nl/ics/bics/11201912
imported on: 2026-06-08T13:03:47.798Z
last refreshed on: 2026-06-08T13:03:47.798Z
source accessed on: 2019-12-03T20:05:01Z
source last accessed on: 2019-12-03T20:05:01Z
label: Cosmetici e negozi di bellezza @it
label: Kosmetik- & Schönheitsläden @de
label: Lojas de beleza e cosméticos @pt
label: Magasins de cosmétiques et produits de beauté @fr
label: Tiendas de cosméticos y belleza @es
label: Магазины косметических средств и товаров для красоты @ru
label: 化妆和美容用品商店 @zh
label: 化妝品及美容用品店 @zh-hant
label: 化粧品･美容用品小売 @ja
label: 화장품 및 미용품 매장 @ko
definition: This industry subgroup includes companies that sell cosmetics and hair care products, both consumable and durable. This can include Internet sales of brick-and-mortar stores.
notation: 11201912
valid from: 2014-08-08
valid till: 2020-10-03

Florists
type: BicsLevel4SubIndustry
type: Classifier
type: NamedIndividual
is sub industry of: Other Spec Retail - Discr
is anachronous version of: http://data.ga-group.nl/ics/bics/1112111813
is contemporary version of: http://data.ga-group.nl/ics/bics/11201913
is replaced by: http://data.ga-group.nl/ics/bics/2020/1112111813
is version of: http://data.ga-group.nl/ics/bics/1112111813
is version of: http://data.ga-group.nl/ics/bics/11201913
imported on: 2026-06-08T13:03:47.798Z
last refreshed on: 2026-06-08T13:03:47.798Z
source accessed on: 2019-12-03T20:05:01Z
source last accessed on: 2019-12-03T20:05:01Z
label: Fioristi @it
label: Fleuristes @fr
label: Florerías @es
label: Floristas @pt
label: Floristen @de
label: Цветочные магазины @ru
label: 花商 @zh
label: 花店 @ja
label: 화훼장식업 @ko
definition: This industry subgroup includes companies that retail flowers. This can include Internet sales of brick-and-mortar stores.
notation: 11201913
valid from: 2014-08-08
valid till: 2020-10-03

Gift, Novelty & Souvenir Stores
type: BicsLevel4SubIndustry
type: Classifier
type: NamedIndividual
is sub industry of: Other Spec Retail - Discr
is anachronous version of: http://data.ga-group.nl/ics/bics/1112111814
is contemporary version of: http://data.ga-group.nl/ics/bics/11201914
is replaced by: http://data.ga-group.nl/ics/bics/2020/1112111814
is version of: http://data.ga-group.nl/ics/bics/1112111814
is version of: http://data.ga-group.nl/ics/bics/11201914
imported on: 2026-06-08T13:03:47.798Z
last refreshed on: 2026-06-08T13:03:47.798Z
source accessed on: 2019-12-03T20:05:01Z
source last accessed on: 2019-12-03T20:05:01Z
label: Geschenk-, Novitäten- & Souvenirgeschäfte @de
label: Lojas de lembranças, novidades e presentes @pt
label: Magasins de cadeaux, souvenirs et gadgets @fr
label: Negozi articoli regalo e souvenir @it
label: Tiendas de regalos, novedades y recuerdos @es
label: Магазины подар., новинок и сувениров @ru
label: 礼物、精品及纪念品商店 @zh
label: 禮品、裝飾品、紀念品店 @zh-hant
label: 贈答品･記念品･みやげ物小売業 @ja
label: 선물, 판촉물 & 기념품 판매점 @ko
definition: This industry subgroup includes companies that retail gift, novelty products and souvenirs. This can include Internet sales of brick-and-mortar stores.
notation: 11201914
valid from: 2014-08-08
valid till: 2020-10-03

Health Supplement Stores
type: BicsLevel4SubIndustry
type: Classifier
type: NamedIndividual
is sub industry of: Other Spec Retail - Discr
is anachronous version of: http://data.ga-group.nl/ics/bics/1112111815
is contemporary version of: http://data.ga-group.nl/ics/bics/11201915
is replaced by: http://data.ga-group.nl/ics/bics/2020/1112111815
is version of: http://data.ga-group.nl/ics/bics/1112111815
is version of: http://data.ga-group.nl/ics/bics/11201915
imported on: 2026-06-08T13:03:47.798Z
last refreshed on: 2026-06-08T13:03:47.798Z
source accessed on: 2019-12-03T20:05:01Z
source last accessed on: 2019-12-03T20:05:01Z
label: Lojas de suplementos para saúde @pt
label: Magasins de suppléments alimentaires @fr
label: Nahrungsergänzungsmittelgeschäfte @de
label: Negozi di prodotti naturali @it
label: Tiendas de suplementos nutricionales @es
label: Магазины добавок для поддержания здоровья @ru
label: 保健食品商店 @zh
label: 保健食品店 @zh-hant
label: 健康補助食品小売 @ja
label: 건강 보조식품 매장 @ko
definition: This industry subgroup includes companies that retail food supplements, vitamins and nutritional supplements. This can include Internet sales of brick-and-mortar stores.
notation: 11201915
valid from: 2014-08-08
valid till: 2020-10-03

Toy & Game Stores
type: BicsLevel4SubIndustry
type: Classifier
type: NamedIndividual
is sub industry of: Other Spec Retail - Discr
is anachronous version of: http://data.ga-group.nl/ics/bics/1112111816
is contemporary version of: http://data.ga-group.nl/ics/bics/11201916
is replaced by: http://data.ga-group.nl/ics/bics/2020/1112111816
is version of: http://data.ga-group.nl/ics/bics/1112111816
is version of: http://data.ga-group.nl/ics/bics/11201916
imported on: 2026-06-08T13:03:47.798Z
last refreshed on: 2026-06-08T13:03:47.798Z
source accessed on: 2019-12-03T20:05:01Z
source last accessed on: 2019-12-03T20:05:01Z
label: Lojas para brinquedos e jogos @pt
label: Magasins de jeux et jouets @fr
label: Negozi giocattoli e giochi @it
label: Spielzeug- & Spielwarenläden @de
label: Tiendas de juguetes y juegos @es
label: Магазины игрушек и игр @ru
label: 玩具与游戏商店 @zh
label: 玩具及遊戲店 @zh-hant
label: 趣味用品･がん具･ｹﾞｰﾑ小売業 @ja
label: 완구 & 게임 매장 @ko
definition: This industry subgroup includes companies that retail hobby products, toys and games. This can include Internet sales of brick-and-mortar stores.
notation: 11201916
valid from: 2014-08-08
valid till: 2020-10-03

Movie & Video Game Rent Stores
type: BicsLevel4SubIndustry
type: Classifier
type: NamedIndividual
is sub industry of: Other Spec Retail - Discr
is anachronous version of: http://data.ga-group.nl/ics/bics/1112111817
is contemporary version of: http://data.ga-group.nl/ics/bics/11201917
is replaced by: http://data.ga-group.nl/ics/bics/2020/1112111817
is version of: http://data.ga-group.nl/ics/bics/1112111817
is version of: http://data.ga-group.nl/ics/bics/11201917
imported on: 2026-06-08T13:03:47.798Z
last refreshed on: 2026-06-08T13:03:47.798Z
source accessed on: 2019-12-03T20:05:01Z
source last accessed on: 2019-12-03T20:05:01Z
label: Film- & Videospielverleihgeschäfte @de
label: Locadoras de filmes e vídeo games @pt
label: Mag location de films et jeux vidéo @fr
label: Negozi noleggio film e videogiochi @it
label: Tiendas de alquiler de juegos de video y películas @es
label: Магазины проката видеоигр и видеофильм. @ru
label: 影片及電玩遊戲出租店 @zh-hant
label: 映画･ﾋﾞﾃﾞｵｹﾞｰﾑﾚﾝﾀﾙ店 @ja
label: 电影与视频游戏出租店 @zh
label: 영화 & 비디오 게임 대여점 @ko
definition: This industry subgroup includes companies that specialize in renting movies and video games. This can include Internet sales of brick-and-mortar stores.
notation: 11201917
valid from: 2014-08-08
valid till: 2020-10-03

Music & Movie Stores
type: BicsLevel4SubIndustry
type: Classifier
type: NamedIndividual
is sub industry of: Other Spec Retail - Discr
is anachronous version of: http://data.ga-group.nl/ics/bics/1112111818
is contemporary version of: http://data.ga-group.nl/ics/bics/11201918
is replaced by: http://data.ga-group.nl/ics/bics/2020/1112111818
is version of: http://data.ga-group.nl/ics/bics/1112111818
is version of: http://data.ga-group.nl/ics/bics/11201918
imported on: 2026-06-08T13:03:47.798Z
last refreshed on: 2026-06-08T13:03:47.798Z
source accessed on: 2019-12-03T20:05:01Z
source last accessed on: 2019-12-03T20:05:01Z
label: Läden für bespielte Musik & Filme @de
label: Lojas de filmes e músicas pré-gravados @pt
label: Magasins de films et musique pré-enregistrés @fr
label: Negozi di musica e video @it
label: Tiendas de música grabada y películas @es
label: Магазины музыкальных записей и видеофильмов @ru
label: 音楽･映画ｿﾌﾄ小売業 @ja
label: 預錄音樂及影片店 @zh-hant
label: 预录音乐及电影商店 @zh
label: 사전녹음 음반 & 영화매장 @ko
definition: This industry subgroup includes companies that retail prerecorded music and movie products. This can include Internet sales of brick-and-mortar stores.
notation: 11201918
valid from: 2014-08-08
valid till: 2020-10-03

Musical Instrument Stores
type: BicsLevel4SubIndustry
type: Classifier
type: NamedIndividual
is sub industry of: Other Spec Retail - Discr
is anachronous version of: http://data.ga-group.nl/ics/bics/1112111819
is contemporary version of: http://data.ga-group.nl/ics/bics/11201919
is replaced by: http://data.ga-group.nl/ics/bics/2020/1112111819
is version of: http://data.ga-group.nl/ics/bics/1112111819
is version of: http://data.ga-group.nl/ics/bics/11201919
imported on: 2026-06-08T13:03:47.798Z
last refreshed on: 2026-06-08T13:03:47.798Z
source accessed on: 2019-12-03T20:05:01Z
source last accessed on: 2019-12-03T20:05:01Z
label: Lojas de instrumentos musicais @pt
label: Magasins d'instruments de musique @fr
label: Musikinstrumenthandlungen @de
label: Negozi strumenti musicali @it
label: Tiendas de instrumentos musicales @es
label: Магазины музыкальных инструментов @ru
label: 乐器店 @zh
label: 楽器･関連製品小売業 @ja
label: 樂器店 @zh-hant
label: 악기 판매점 @ko
definition: This industry subgroup includes companies that retail musical instruments and supplies. This can include Internet sales of brick-and-mortar stores.
notation: 11201919
valid from: 2014-08-08
valid till: 2020-10-03

Office Supp & Stationery Stores
type: BicsLevel4SubIndustry
type: Classifier
type: NamedIndividual
is sub industry of: Other Spec Retail - Discr
is anachronous version of: http://data.ga-group.nl/ics/bics/1112111820
is contemporary version of: http://data.ga-group.nl/ics/bics/11201920
is replaced by: http://data.ga-group.nl/ics/bics/2020/1112111820
is version of: http://data.ga-group.nl/ics/bics/1112111820
is version of: http://data.ga-group.nl/ics/bics/11201920
imported on: 2026-06-08T13:03:47.798Z
last refreshed on: 2026-06-08T13:03:47.798Z
source accessed on: 2019-12-03T20:05:01Z
source last accessed on: 2019-12-03T20:05:01Z
label: Almacenes de útiles de oficina y papelería @es
label: Büromaterial- & Schreibwarenläden @de
label: Mag fournitures de bureau/papeterie @fr
label: Negozi articoli ufficio e cartoleria @it
label: Papelaria e artigos para escritórios @pt
label: Магазины тов. для офиса и канцтоваров @ru
label: 事務用品･文房具小売 @ja
label: 办公用品与文具商店 @zh
label: 辦公用品及文具店 @zh-hant
label: 사무용품 & 문구점 @ko
definition: This industry subgroup includes companies that retail stationery and office supplies in brick-and-mortar stores and on the Internet.
notation: 11201920
valid from: 2014-08-08
valid till: 2020-10-03

Optical Goods Stores
type: BicsLevel4SubIndustry
type: Classifier
type: NamedIndividual
is sub industry of: Other Spec Retail - Discr
is anachronous version of: http://data.ga-group.nl/ics/bics/1112111821
is contemporary version of: http://data.ga-group.nl/ics/bics/11201921
is replaced by: http://data.ga-group.nl/ics/bics/2020/1112111821
is version of: http://data.ga-group.nl/ics/bics/1112111821
is version of: http://data.ga-group.nl/ics/bics/11201921
imported on: 2026-06-08T13:03:47.798Z
last refreshed on: 2026-06-08T13:03:47.798Z
source accessed on: 2019-12-03T20:05:01Z
source last accessed on: 2019-12-03T20:05:01Z
label: Geschäfte für optische Waren @de
label: Lojas de produtos óticos @pt
label: Magasins de produits optiques @fr
label: Negozi prod ottici @it
label: Tiendas de bienes ópticos @es
label: Магазины оптических товаров @ru
label: 光学产品店 @zh
label: 眼鏡小売 @ja
label: 眼鏡用品店 @zh-hant
label: 광학용품 매장 @ko
definition: This industry subgroup includes companies that retail eyeglasses, contact lenses and related products. This can include Internet sales of brick-and-mortar stores.
notation: 11201921
valid from: 2014-08-08
valid till: 2020-10-03

Pet & Pet Supplies Stores
type: BicsLevel4SubIndustry
type: Classifier
type: NamedIndividual
is sub industry of: Other Spec Retail - Discr
is anachronous version of: http://data.ga-group.nl/ics/bics/1112111822
is contemporary version of: http://data.ga-group.nl/ics/bics/11201922
is replaced by: http://data.ga-group.nl/ics/bics/2020/1112111822
is version of: http://data.ga-group.nl/ics/bics/1112111822
is version of: http://data.ga-group.nl/ics/bics/11201922
imported on: 2026-06-08T13:03:47.798Z
last refreshed on: 2026-06-08T13:03:47.798Z
source accessed on: 2019-12-03T20:05:01Z
source last accessed on: 2019-12-03T20:05:01Z
label: Animaleries et magasins de fournitures pour animaux @fr
label: Lojas de animais de estimação e suprimentos @pt
label: Negozi di animali domestici e accessori @it
label: Tiendas de animales domésticos y sus provisiones @es
label: Zoohandlungen und Heimtierbedarf @de
label: Магазины товаров для домашних животных @ru
label: 宠物和宠物用品商店 @zh
label: 寵物及寵物用品店 @zh-hant
label: 애완동물 및 애완동물 소모품 매장 @ko
label: ﾍﾟｯﾄ･ﾍﾟｯﾄ用品小売 @ja
definition: This industry subgroup includes companies that retail pets and pet supplies in brick-and-mortar stores. This can include Internet sales of brick-and-mortar stores.
notation: 11201922
valid from: 2014-08-08
valid till: 2020-10-03

Used Merchandise Stores
type: BicsLevel4SubIndustry
type: Classifier
type: NamedIndividual
is sub industry of: Other Spec Retail - Discr
is anachronous version of: http://data.ga-group.nl/ics/bics/1112111823
is contemporary version of: http://data.ga-group.nl/ics/bics/11201923
is replaced by: http://data.ga-group.nl/ics/bics/2020/1112111823
is version of: http://data.ga-group.nl/ics/bics/1112111823
is version of: http://data.ga-group.nl/ics/bics/11201923
imported on: 2026-06-08T13:03:47.798Z
last refreshed on: 2026-06-08T13:03:47.798Z
source accessed on: 2019-12-03T20:05:01Z
source last accessed on: 2019-12-03T20:05:01Z
label: Gebrauchtwarengeschäfte @de
label: Lojas de mercadorias usadas @pt
label: Magasins de marchandises d'occasion @fr
label: Negozi dell'usato @it
label: Tiendas de mercancías usadas @es
label: Магазины товаров, бывших в употреблении @ru
label: 二手商品店 @zh-hant
label: 二手商店 @zh
label: 古物小売業 @ja
label: 중고품 판매업 @ko
definition: This industry subgroup includes companies that retail used merchandise of any sort. This can include Internet sales of brick-and-mortar stores.
notation: 11201923
valid from: 2014-08-08
valid till: 2020-10-03

Video Game Stores
type: BicsLevel4SubIndustry
type: Classifier
type: NamedIndividual
is sub industry of: Other Spec Retail - Discr
is anachronous version of: http://data.ga-group.nl/ics/bics/1112111824
is contemporary version of: http://data.ga-group.nl/ics/bics/11201924
is replaced by: http://data.ga-group.nl/ics/bics/2020/1112111824
is version of: http://data.ga-group.nl/ics/bics/1112111824
is version of: http://data.ga-group.nl/ics/bics/11201924
imported on: 2026-06-08T13:03:47.798Z
last refreshed on: 2026-06-08T13:03:47.798Z
source accessed on: 2019-12-03T20:05:01Z
source last accessed on: 2019-12-03T20:05:01Z
label: Lojas de vídeo games @pt
label: Magasins de jeux vidéo @fr
label: Negozi videogiochi @it
label: Tiendas de juegos de video @es
label: Videospielgeschäfte @de
label: Магазины видеоигр @ru
label: 视频游戏商店 @zh
label: 電玩遊戲商店 @zh-hant
label: 비디오 게임 매장 @ko
label: ﾋﾞﾃﾞｵｹﾞｰﾑ店 @ja
definition: This industry subgroup includes companies that retail video games. This can include Internet sales of brick-and-mortar stores.
notation: 11201924
valid from: 2014-08-08
valid till: 2020-10-03

Other Spec Retail - Discr
type: BicsLevel3Industry
type: Classifier
type: NamedIndividual
is industry of: Retail - Discretionary
is anachronous version of: http://data.ga-group.nl/ics/bics/11121118
is contemporary version of: http://data.ga-group.nl/ics/bics/112019
is replaced by: http://data.ga-group.nl/ics/bics/2020/11121118
is version of: http://data.ga-group.nl/ics/bics/11121118
is version of: http://data.ga-group.nl/ics/bics/112019
imported on: 2026-06-08T13:03:47.798Z
last refreshed on: 2026-06-08T13:03:47.798Z
source accessed on: 2019-12-03T20:05:01Z
source last accessed on: 2019-12-03T20:05:01Z
label: Altro dett spec - Discr @it
label: Distrib. autres - non ess. @fr
label: Otro min espec - discr @es
label: Outro varejo especializado-Discricionário @pt
label: Sonst.Spezial-EH - Discretionary @de
label: Розн. торг. товарами выб. спроса @ru
label: その他専門小売ｰ一般消費財 @ja
label: 其他专业零售-自主 @zh
label: 其他特殊品零售-非必需品 @zh-hant
label: 기타 전문소매업 - 자유소비재 @ko
definition: This industry includes companies that retail arts, crafts, gifts, novelties, souvenirs, toys, games, flowers, jewelry, sporting goods and other consumer discretionary products elsewhere classified. This industry can include Internet sales of brick-and-mortar stores.
notation: 112019
valid from: 2014-08-08
valid till: 2020-10-03

Retail - Discretionary
type: BicsLevel2IndustryGroup
type: Classifier
type: NamedIndividual
is industry group of: Consumer Discretionary
is anachronous version of: http://data.ga-group.nl/ics/bics/111211
is contemporary version of: http://data.ga-group.nl/ics/bics/1120
is replaced by: http://data.ga-group.nl/ics/bics/2020/111211
is version of: http://data.ga-group.nl/ics/bics/111211
is version of: http://data.ga-group.nl/ics/bics/1120
imported on: 2026-06-08T13:03:47.798Z
last refreshed on: 2026-06-08T13:03:47.798Z
source accessed on: 2019-12-03T20:05:01Z
source last accessed on: 2019-12-03T20:05:01Z
label: Al dettaglio - Discrezionale @it
label: Comercio al por menor discrecional @es
label: EH - Nichtbasis @de
label: Varejo - Discricionário @pt
label: Vente au détail - Discrétionnaire @fr
label: Розн. торговля - товары выборочного спроса @ru
label: 小売(一般消費財) @ja
label: 零售-非必需品 @zh
label: 零售-非核心消費 @zh-hant
label: 소매 - 자유소비재 @ko
definition: This industry group includes companies that retail merchandise to the general public through storefront operations.
notation: 1120
valid from: 2014-08-08
valid till: 2020-10-03

Consumer Discretionary
type: BicsLevel1Sector
type: Classifier
type: NamedIndividual
is contemporary version of: http://data.ga-group.nl/ics/bics/11
is replaced by: http://data.ga-group.nl/ics/bics/2020/11
is version of: http://data.ga-group.nl/ics/bics/11
imported on: 2026-06-08T13:03:47.798Z
last refreshed on: 2026-06-08T13:03:47.798Z
source accessed on: 2019-12-03T20:05:01Z
source last accessed on: 2019-12-03T20:05:01Z
label: Conso discrétionnaire @fr
label: Consumo discrecional @es
label: Consumo discrezionale @it
label: Consumo discricionário @pt
label: Gebrauchsgüter @de
label: Товары выборочного спроса @ru
label: 一般消費財 @ja
label: 非必需消费 @zh
label: 非核心消費 @zh-hant
label: 자유 소비재 @ko
definition: This sector includes companies that design, manufacture, retail and/or market consumer discretionary products and services.
notation: 11
valid from: 2014-08-08
valid till: 2020-10-03

Animal Feed
type: BicsLevel4SubIndustry
type: Classifier
type: NamedIndividual
is sub industry of: Agricultural Producers
is anachronous version of: http://data.ga-group.nl/ics/bics/1210101010
is contemporary version of: http://data.ga-group.nl/ics/bics/12101010
is replaced by: http://data.ga-group.nl/ics/bics/2020/1210101010
is version of: http://data.ga-group.nl/ics/bics/1210101010
is version of: http://data.ga-group.nl/ics/bics/12101010
imported on: 2026-06-08T13:03:47.798Z
last refreshed on: 2026-06-08T13:03:47.798Z
source accessed on: 2019-12-03T20:05:01Z
source last accessed on: 2019-12-03T20:05:01Z
label: Alimento de animales @es
label: Alimentos para animais @pt
label: Aliments pour animaux @fr
label: Mangimi per animali @it
label: Tierfutter @de
label: Животный корм @ru
label: その他飼料製造 @ja
label: 动物饲料 @zh
label: 動物飼料製造 @zh-hant
label: 동물 사료 @ko
definition: This industry subgroup includes companies that produce food consumed by farm and other animals.
notation: 12101010
valid from: 2014-08-08
valid till: 2020-10-03

Beef Cattle Ranch & Farming
type: BicsLevel6Segment
type: Classifier
type: NamedIndividual
is level6 segment of: Cattle Ranching & Farming
is anachronous version of: http://data.ga-group.nl/ics/bics/12101010111010
is contemporary version of: http://data.ga-group.nl/ics/bics/121010111010
is replaced by: http://data.ga-group.nl/ics/bics/2020/12101010111010
is version of: http://data.ga-group.nl/ics/bics/12101010111010
is version of: http://data.ga-group.nl/ics/bics/121010111010
imported on: 2026-06-08T13:03:47.798Z
last refreshed on: 2026-06-08T13:03:47.798Z
source accessed on: 2019-12-03T20:05:01Z
source last accessed on: 2019-12-03T20:05:01Z
label: Allev vacche da carne e coltivazione @it
label: Elevage de bovins de boucherie et agriculture @fr
label: Pecuária de gados para cortes @pt
label: Ranchos de ganado de res y cultivo @es
label: Schlachtrinderzucht & Landwirtschaft @de
label: Разведение и выращивание крупного рогатого скота @ru
label: 肉牛放牧与养殖 @zh
label: 肉牛放牧飼育業 @zh-hant
label: 肉用牛畜産 @ja
label: 육우 사육업 @ko
definition: This segment includes companies that raise cattle for beef.
notation: 121010111010
valid from: 2014-08-08
valid till: 2020-10-03

Dairy Cattle & Milk Production
type: BicsLevel6Segment
type: Classifier
type: NamedIndividual
is level6 segment of: Cattle Ranching & Farming
is anachronous version of: http://data.ga-group.nl/ics/bics/12101010111011
is contemporary version of: http://data.ga-group.nl/ics/bics/121010111011
is replaced by: http://data.ga-group.nl/ics/bics/2020/12101010111011
is version of: http://data.ga-group.nl/ics/bics/12101010111011
is version of: http://data.ga-group.nl/ics/bics/121010111011
imported on: 2026-06-08T13:03:47.798Z
last refreshed on: 2026-06-08T13:03:47.798Z
source accessed on: 2019-12-03T20:05:01Z
source last accessed on: 2019-12-03T20:05:01Z
label: Elevage de bovins laitiers et production laitière @fr
label: Explotación de bovinos para leche @es
label: Milchviehzucht & Milchproduktion @de
label: Produção de leite e gado leiteiro @pt
label: Vacche e produzione latte @it
label: Молочное скотоводство и пр-во молока @ru
label: 乳牛及牛奶生產 @zh-hant
label: 奶牛与牛奶生产 @zh
label: 酪農･牛乳生産 @ja
label: 젖소 & 우유 생산 @ko
definition: This segment includes companies that raise and breed dairy cattle as well as companies that produce raw milk.
notation: 121010111011
valid from: 2014-08-08
valid till: 2020-10-03

Cattle Ranching & Farming
type: BicsLevel5Segment
type: Classifier
type: NamedIndividual
is level5 segment of: Animal Production & Process
is anachronous version of: http://data.ga-group.nl/ics/bics/121010101110
is contemporary version of: http://data.ga-group.nl/ics/bics/1210101110
is replaced by: http://data.ga-group.nl/ics/bics/2020/121010101110
is version of: http://data.ga-group.nl/ics/bics/121010101110
is version of: http://data.ga-group.nl/ics/bics/1210101110
imported on: 2026-06-08T13:03:47.798Z
last refreshed on: 2026-06-08T13:03:47.798Z
source accessed on: 2019-12-03T20:05:01Z
source last accessed on: 2019-12-03T20:05:01Z
label: Allev bestiame e coltivazione @it
label: Elevage d'animaux de boucherie et agriculture @fr
label: Pecuária de gados @pt
label: Ranchos de ganado y cultivo @es
label: Schlachtrinderzucht @de
label: Мясное скотоводство @ru
label: 养牛 @zh
label: 牛放牧飼育業 @zh-hant
label: 牛畜産 @ja
label: 목우 축산업 @ko
definition: This segment includes companies that raise cattle.
notation: 1210101110
valid from: 2014-08-08
valid till: 2020-10-03

Hog & Pig Farming
type: BicsLevel5Segment
type: Classifier
type: NamedIndividual
is level5 segment of: Animal Production & Process
is anachronous version of: http://data.ga-group.nl/ics/bics/121010101111
is contemporary version of: http://data.ga-group.nl/ics/bics/1210101111
is replaced by: http://data.ga-group.nl/ics/bics/2020/121010101111
is version of: http://data.ga-group.nl/ics/bics/121010101111
is version of: http://data.ga-group.nl/ics/bics/1210101111
imported on: 2026-06-08T13:03:47.798Z
last refreshed on: 2026-06-08T13:03:47.798Z
source accessed on: 2019-12-03T20:05:01Z
source last accessed on: 2019-12-03T20:05:01Z
label: Allev suini e maiali @it
label: Cultivo de suínos e @pt
label: Elevage de porcs @fr
label: Porcinos en granja @es
label: Schweinezucht @de
label: Свиноводство @ru
label: 养猪场 @zh
label: 豬飼育 @zh-hant
label: 養豚業 @ja
label: 양돈 사육업 @ko
definition: This segment includes companies that raise and breed hogs and pigs.
notation: 1210101111
valid from: 2014-08-08
valid till: 2020-10-03

Poultry Farming
type: BicsLevel5Segment
type: Classifier
type: NamedIndividual
is level5 segment of: Animal Production & Process
is anachronous version of: http://data.ga-group.nl/ics/bics/121010101112
is contemporary version of: http://data.ga-group.nl/ics/bics/1210101112
is replaced by: http://data.ga-group.nl/ics/bics/2020/121010101112
is version of: http://data.ga-group.nl/ics/bics/121010101112
is version of: http://data.ga-group.nl/ics/bics/1210101112
imported on: 2026-06-08T13:03:47.798Z
last refreshed on: 2026-06-08T13:03:47.798Z
source accessed on: 2019-12-03T20:05:01Z
source last accessed on: 2019-12-03T20:05:01Z
label: Allevamenti avicoli @it
label: Cría de aves @es
label: Elevage de volaille @fr
label: Geflügelzucht @de
label: Prod de frango @pt
label: Птицеводство @ru
label: 家禽飼育 @zh-hant
label: 家禽･鶏卵 @ja
label: 禽类养殖 @zh
label: 가금류 사육업 @ko
definition: This segment includes companies that hatch poultry and eggs of various types.
notation: 1210101112
valid from: 2014-08-08
valid till: 2020-10-03

Meat Processing
type: BicsLevel6Segment
type: Classifier
type: NamedIndividual
is level6 segment of: Animal Processing
is anachronous version of: http://data.ga-group.nl/ics/bics/12101010111310
is contemporary version of: http://data.ga-group.nl/ics/bics/121010111310
is replaced by: http://data.ga-group.nl/ics/bics/2020/12101010111310
is version of: http://data.ga-group.nl/ics/bics/12101010111310
is version of: http://data.ga-group.nl/ics/bics/121010111310
imported on: 2026-06-08T13:03:47.798Z
last refreshed on: 2026-06-08T13:03:47.798Z
source accessed on: 2019-12-03T20:05:01Z
source last accessed on: 2019-12-03T20:05:01Z
label: Fleischverarbeitung @de
label: Lavorazione della carne @it
label: Procesamiento de carnes @es
label: Processamento de carne @pt
label: Transformation de viande @fr
label: Обработка мяса @ru
label: と畜 @ja
label: 肉类加工 @zh
label: 肉類加工處理 @zh-hant
label: 육류가공업 @ko
definition: This segment includes companies that slaughter, dress and process animals.
notation: 121010111310
valid from: 2014-08-08
valid till: 2020-10-03

Poultry Processing
type: BicsLevel6Segment
type: Classifier
type: NamedIndividual
is level6 segment of: Animal Processing
is anachronous version of: http://data.ga-group.nl/ics/bics/12101010111311
is contemporary version of: http://data.ga-group.nl/ics/bics/121010111311
is replaced by: http://data.ga-group.nl/ics/bics/2020/12101010111311
is version of: http://data.ga-group.nl/ics/bics/12101010111311
is version of: http://data.ga-group.nl/ics/bics/121010111311
imported on: 2026-06-08T13:03:47.798Z
last refreshed on: 2026-06-08T13:03:47.798Z
source accessed on: 2019-12-03T20:05:01Z
source last accessed on: 2019-12-03T20:05:01Z
label: Geflügelverarbeitung @de
label: Lavorazione pollame @it
label: Proc aves de corral @es
label: Processamento de aves @pt
label: Transfor. volaille @fr
label: Переработка птицы @ru
label: 家きん処理 @ja
label: 家禽加工處理 @zh-hant
label: 家禽处理加工 @zh
label: 가금류 가공업 @ko
definition: This segment includes companies that slaughter, dress and process poultry, such as chickens, turkeys, ducks and geese. This includes processing meat for use in lunch and sandwich meats.
notation: 121010111311
valid from: 2014-08-08
valid till: 2020-10-03

Rendering & Meat Byproducts
type: BicsLevel6Segment
type: Classifier
type: NamedIndividual
is level6 segment of: Animal Processing
is anachronous version of: http://data.ga-group.nl/ics/bics/12101010111312
is contemporary version of: http://data.ga-group.nl/ics/bics/121010111312
is replaced by: http://data.ga-group.nl/ics/bics/2020/12101010111312
is version of: http://data.ga-group.nl/ics/bics/12101010111312
is version of: http://data.ga-group.nl/ics/bics/121010111312
imported on: 2026-06-08T13:03:47.798Z
last refreshed on: 2026-06-08T13:03:47.798Z
source accessed on: 2019-12-03T20:05:01Z
source last accessed on: 2019-12-03T20:05:01Z
label: Fonte et sous-produits de viande @fr
label: Lavorzne sottoprodotti carne @it
label: Preparación de embutidos y otras conservas de carne @es
label: Tierkörperverwertungs- & Fleischnebenprodukte @de
label: Tratamento e processamento de carne @pt
label: Перераб. непищев. животного сырья и мясные побочные продукты @ru
label: 動物性脂肪精製･食肉副産物 @ja
label: 油脂炼制和肉副产品 @zh
label: 油脂精煉及肉類副產品 @zh-hant
label: 가공 및 육류 부산물 @ko
definition: This segment includes companies that render fats and oils from animals and plants. It includes companies that render grease and lard.
notation: 121010111312
valid from: 2014-08-08
valid till: 2020-10-03

Animal Processing
type: BicsLevel5Segment
type: Classifier
type: NamedIndividual
is level5 segment of: Animal Production & Process
is anachronous version of: http://data.ga-group.nl/ics/bics/121010101113
is contemporary version of: http://data.ga-group.nl/ics/bics/1210101113
is replaced by: http://data.ga-group.nl/ics/bics/2020/121010101113
is version of: http://data.ga-group.nl/ics/bics/121010101113
is version of: http://data.ga-group.nl/ics/bics/1210101113
imported on: 2026-06-08T13:03:47.798Z
last refreshed on: 2026-06-08T13:03:47.798Z
source accessed on: 2019-12-03T20:05:01Z
source last accessed on: 2019-12-03T20:05:01Z
label: Lavorazione animali @it
label: Procesamiento de animales @es
label: Processamento de animal @pt
label: Tierverarbeitung @de
label: Transformation animale @fr
label: Переработка скота @ru
label: 动物加工 @zh
label: 動物加工處理 @zh-hant
label: 食肉加工 @ja
label: 축산가공업 @ko
definition: This segment includes companies that are involved in animal processing.
notation: 1210101113
valid from: 2014-08-08
valid till: 2020-10-03

Animal Production & Process
type: BicsLevel4SubIndustry
type: Classifier
type: NamedIndividual
is sub industry of: Agricultural Producers
is anachronous version of: http://data.ga-group.nl/ics/bics/1210101011
is contemporary version of: http://data.ga-group.nl/ics/bics/12101011
is replaced by: http://data.ga-group.nl/ics/bics/2020/1210101011
is version of: http://data.ga-group.nl/ics/bics/1210101011
is version of: http://data.ga-group.nl/ics/bics/12101011
imported on: 2026-06-08T13:03:47.798Z
last refreshed on: 2026-06-08T13:03:47.798Z
source accessed on: 2019-12-03T20:05:01Z
source last accessed on: 2019-12-03T20:05:01Z
label: Cría de animales @es
label: Elevage et transformation @fr
label: Produção e processo animal @pt
label: Produzione e lavorazione animali @it
label: Tierproduktion & -verarbeitung @de
label: Животновод. производство и переработка @ru
label: 动物养殖与加工 @zh
label: 動物產品及加工 @zh-hant
label: 畜産農業･加工 @ja
label: 가축 사육업 & 가공업 @ko
definition: This industry subgroup includes companies that process meat and slaughter animals for use in food products.
notation: 12101011
valid from: 2014-08-08
valid till: 2020-10-03

Finfish Farm & Fish Hatcheries
type: BicsLevel6Segment
type: Classifier
type: NamedIndividual
is level6 segment of: Aquaculture
is anachronous version of: http://data.ga-group.nl/ics/bics/12101010121010
is contemporary version of: http://data.ga-group.nl/ics/bics/121010121010
is replaced by: http://data.ga-group.nl/ics/bics/2020/12101010121010
is version of: http://data.ga-group.nl/ics/bics/12101010121010
is version of: http://data.ga-group.nl/ics/bics/121010121010
imported on: 2026-06-08T13:03:47.798Z
last refreshed on: 2026-06-08T13:03:47.798Z
source accessed on: 2019-12-03T20:05:01Z
source last accessed on: 2019-12-03T20:05:01Z
label: Acuicultura e incubación @es
label: Allevamento pesci e incubatoi @it
label: Finnwalzucht & Fischbrutstätten @de
label: Piscicultura e incubadoras @pt
label: Pisciculture et écloseries @fr
label: Развед. рыбы и рыбные питомники @ru
label: 養魚･魚卵孵化場 @ja
label: 鰭魚類養殖及魚類孵化 @zh-hant
label: 鱼类养殖及孵卵 @zh
label: 참어류 양식/어류 부화장 @ko
definition: This segment includes companies that farm finfish.
notation: 121010121010
valid from: 2014-08-08
valid till: 2020-10-03

Shellfish Farming
type: BicsLevel6Segment
type: Classifier
type: NamedIndividual
is level6 segment of: Aquaculture
is anachronous version of: http://data.ga-group.nl/ics/bics/12101010121011
is contemporary version of: http://data.ga-group.nl/ics/bics/121010121011
is replaced by: http://data.ga-group.nl/ics/bics/2020/12101010121011
is version of: http://data.ga-group.nl/ics/bics/12101010121011
is version of: http://data.ga-group.nl/ics/bics/121010121011
imported on: 2026-06-08T13:03:47.798Z
last refreshed on: 2026-06-08T13:03:47.798Z
source accessed on: 2019-12-03T20:05:01Z
source last accessed on: 2019-12-03T20:05:01Z
label: Allevam crostacei @it
label: Aquaculture crustacé @fr
label: Cultivo de crustáceos @pt
label: Explotac mariscos @es
label: Schalentierzucht @de
label: Разведение моллюсков @ru
label: 虾、贝类养殖 @zh
label: 貝類養殖 @zh-hant
label: 貝類養殖業 @ja
label: 갑각류 양식업 @ko
definition: This segment includes companies that farm shellfish.
notation: 121010121011
valid from: 2014-08-08
valid till: 2020-10-03

Other Aquaculture
type: BicsLevel6Segment
type: Classifier
type: Discontinued
type: NamedIndividual
is level6 segment of: Aquaculture
is contemporary version of: http://data.ga-group.nl/ics/bics/121010121012
is version of: http://data.ga-group.nl/ics/bics/121010121012
imported on: 2026-06-08T13:03:47.798Z
last refreshed on: 2026-06-08T13:03:47.798Z
source accessed on: 2019-12-03T20:05:01Z
source last accessed on: 2019-12-03T20:05:01Z
label: Altra acquicoltura @it
label: Autre pisciculture @fr
label: Otra acuicultura @es
label: Outro tipo de aquacultura @pt
label: Sonstige Aquakultur @de
label: Проч. аквакультуры @ru
label: その他水産養殖 @ja
label: 其他水产业 @zh
label: 其他水產業 @zh-hant
label: 기타 양식업 @ko
definition: This segment includes companies that are involved in other aquaculture activities not elsewhere classified.
notation: 121010121012
valid from: 2014-08-08
valid till: 2020-10-03

Aquaculture
type: BicsLevel5Segment
type: Classifier
type: NamedIndividual
is level5 segment of: Aquaculture Fishing
is anachronous version of: http://data.ga-group.nl/ics/bics/121010101210
is contemporary version of: http://data.ga-group.nl/ics/bics/1210101210
is replaced by: http://data.ga-group.nl/ics/bics/2020/121010101210
is version of: http://data.ga-group.nl/ics/bics/121010101210
is version of: http://data.ga-group.nl/ics/bics/1210101210
imported on: 2026-06-08T13:03:47.798Z
last refreshed on: 2026-06-08T13:03:47.798Z
source accessed on: 2019-12-03T20:05:01Z
source last accessed on: 2019-12-03T20:05:01Z
label: Acquicoltura @it
label: Acuacultura @es
label: Aqüicultura @pt
label: Aquakultur @de
label: Аквакультура @ru
label: 水产业 @zh
label: 水產養殖 @zh-hant
label: 養殖水産品 @ja
label: 양식업 @ko
definition: This segment includes companies that farm aquatic life.
notation: 1210101210
valid from: 2014-08-08
valid till: 2020-10-03

Finfish Fishing
type: BicsLevel6Segment
type: Classifier
type: NamedIndividual
is level6 segment of: Fishing
is anachronous version of: http://data.ga-group.nl/ics/bics/12101010121110
is contemporary version of: http://data.ga-group.nl/ics/bics/121010121110
is replaced by: http://data.ga-group.nl/ics/bics/2020/12101010121110
is version of: http://data.ga-group.nl/ics/bics/12101010121110
is version of: http://data.ga-group.nl/ics/bics/121010121110
imported on: 2026-06-08T13:03:47.798Z
last refreshed on: 2026-06-08T13:03:47.798Z
source accessed on: 2019-12-03T20:05:01Z
source last accessed on: 2019-12-03T20:05:01Z
label: Acuicultura @es
label: Finnwalfischerei @de
label: Pêche (nageoires) @fr
label: Pesca de peixes moluscos @pt
label: Pesca pesci pinne @it
label: Рыболовство @ru
label: 魚類漁業 @ja
label: 鰭魚類漁業 @zh-hant
label: 鱼类捕捞 @zh
label: 물고기류 어업 @ko
definition: This segment includes companies that catch finfish in their natural habitat.
notation: 121010121110
valid from: 2014-08-08
valid till: 2020-10-03

Shellfish Fishing
type: BicsLevel6Segment
type: Classifier
type: NamedIndividual
is level6 segment of: Fishing
is anachronous version of: http://data.ga-group.nl/ics/bics/12101010121111
is contemporary version of: http://data.ga-group.nl/ics/bics/121010121111
is replaced by: http://data.ga-group.nl/ics/bics/2020/12101010121111
is version of: http://data.ga-group.nl/ics/bics/12101010121111
is version of: http://data.ga-group.nl/ics/bics/121010121111
imported on: 2026-06-08T13:03:47.798Z
last refreshed on: 2026-06-08T13:03:47.798Z
source accessed on: 2019-12-03T20:05:01Z
source last accessed on: 2019-12-03T20:05:01Z
label: Pêche mollu/crustacé @fr
label: Pesca de crustáceos @pt
label: Pesca de mariscos @es
label: Pesca di crostacei @it
label: Schalentierfischerei @de
label: Ловля моллюсков @ru
label: 虾、贝类捕捞 @zh
label: 貝類漁業 @ja
label: 갑각류 어업 @ko
definition: This segment includes companies that catch shellfish in their natural habitat.
notation: 121010121111
valid from: 2014-08-08
valid till: 2020-10-03

Other Marine Fishing
type: BicsLevel6Segment
type: Classifier
type: Discontinued
type: NamedIndividual
is level6 segment of: Fishing
is contemporary version of: http://data.ga-group.nl/ics/bics/121010121112
is version of: http://data.ga-group.nl/ics/bics/121010121112
imported on: 2026-06-08T13:03:47.798Z
last refreshed on: 2026-06-08T13:03:47.798Z
source accessed on: 2019-12-03T20:05:01Z
source last accessed on: 2019-12-03T20:05:01Z
label: Altra pesca marina @it
label: Autre pêche maritime @fr
label: Outras pescas marinhas @pt
label: Pesca otras especies @es
label: Sonst. Meeresfischen @de
label: Проч. морское рыболовство @ru
label: その他海産漁業 @ja
label: 其他海洋渔业 @zh
label: 其他海洋漁業 @zh-hant
label: 기타 해조류 어업 @ko
definition: This segment includes companies that catch marine life in their natural habitat not elsewhere classified.
notation: 121010121112
valid from: 2014-08-08
valid till: 2020-10-03

Fishing
type: BicsLevel5Segment
type: Classifier
type: NamedIndividual
is level5 segment of: Aquaculture Fishing
is anachronous version of: http://data.ga-group.nl/ics/bics/121010101211
is contemporary version of: http://data.ga-group.nl/ics/bics/1210101211
is replaced by: http://data.ga-group.nl/ics/bics/2020/121010101211
is version of: http://data.ga-group.nl/ics/bics/121010101211
is version of: http://data.ga-group.nl/ics/bics/1210101211
imported on: 2026-06-08T13:03:47.798Z
last refreshed on: 2026-06-08T13:03:47.798Z
source accessed on: 2019-12-03T20:05:01Z
source last accessed on: 2019-12-03T20:05:01Z
label: Fischerei @de
label: Pêche @fr
label: Pesca @es
label: Рыболовство @ru
label: 渔业 @zh
label: 漁業 @ja
label: 어업 @ko
definition: This segment includes companies that fish.
notation: 1210101211
valid from: 2014-08-08
valid till: 2020-10-03

Aquaculture Fishing
type: BicsLevel4SubIndustry
type: Classifier
type: NamedIndividual
is sub industry of: Agricultural Producers
is anachronous version of: http://data.ga-group.nl/ics/bics/1210101012
is contemporary version of: http://data.ga-group.nl/ics/bics/12101012
is replaced by: http://data.ga-group.nl/ics/bics/2020/1210101012
is version of: http://data.ga-group.nl/ics/bics/1210101012
is version of: http://data.ga-group.nl/ics/bics/12101012
imported on: 2026-06-08T13:03:47.798Z
last refreshed on: 2026-06-08T13:03:47.798Z
source accessed on: 2019-12-03T20:05:01Z
source last accessed on: 2019-12-03T20:05:01Z
label: Acquicoltura e pesca @it
label: Acuacultura y pesca @es
label: Agriculture et pêche @fr
label: Aquakultur&Fischerei @de
label: Pesca de aquicultura @pt
label: Рыбоводное хозяйство и рыболовство @ru
label: 农业与渔业 @zh
label: 水產養殖及漁業 @zh-hant
label: 養殖及び漁業 @ja
label: 양식업 & 어업 @ko
definition: This industry subgroup includes companies involved in aquaculture and fishing.
notation: 12101012
valid from: 2014-08-08
valid till: 2020-10-03

Cocoa Farming
type: BicsLevel5Segment
type: Classifier
type: NamedIndividual
is level5 segment of: Food Crop Production
is anachronous version of: http://data.ga-group.nl/ics/bics/121010101310
is contemporary version of: http://data.ga-group.nl/ics/bics/1210101310
is replaced by: http://data.ga-group.nl/ics/bics/2020/121010101310
is version of: http://data.ga-group.nl/ics/bics/121010101310
is version of: http://data.ga-group.nl/ics/bics/1210101310
imported on: 2026-06-08T13:03:47.798Z
last refreshed on: 2026-06-08T13:03:47.798Z
source accessed on: 2019-12-03T20:05:01Z
source last accessed on: 2019-12-03T20:05:01Z
label: Coltivazione cacao @it
label: Cultivo de cacao @es
label: Cultivo de cacau @pt
label: Kakaoanbau @de
label: Plantation de cacao @fr
label: Возделывание деревьев какао @ru
label: 可可种植 @zh
label: 可可耕作 @zh-hant
label: 코코아 재배 @ko
label: ｺｺｱ栽培 @ja
definition: This segment includes companies that grow cocoa.
notation: 1210101310
valid from: 2014-08-08
valid till: 2020-10-03

Apple Orchards
type: BicsLevel6Segment
type: Classifier
type: NamedIndividual
is level6 segment of: Fruit Farming
is anachronous version of: http://data.ga-group.nl/ics/bics/12101010131110
is contemporary version of: http://data.ga-group.nl/ics/bics/121010131110
is replaced by: http://data.ga-group.nl/ics/bics/2020/12101010131110
is version of: http://data.ga-group.nl/ics/bics/12101010131110
is version of: http://data.ga-group.nl/ics/bics/121010131110
imported on: 2026-06-08T13:03:47.798Z
last refreshed on: 2026-06-08T13:03:47.798Z
source accessed on: 2019-12-03T20:05:01Z
source last accessed on: 2019-12-03T20:05:01Z
label: Apfelplantagen @de
label: Culture de pommes @fr
label: Frutteti di mele @it
label: Huertos de manzanas @es
label: Pomares de maçã @pt
label: Яблоневые сады @ru
label: りんご園 @ja
label: 苹果园 @zh
label: 蘋果園 @zh-hant
label: 사과 재배업 @ko
definition: This segment includes companies that grow apples.
notation: 121010131110
valid from: 2014-08-08
valid till: 2020-10-03

Citrus Groves excl Oranges
type: BicsLevel6Segment
type: Classifier
type: NamedIndividual
is level6 segment of: Fruit Farming
is anachronous version of: http://data.ga-group.nl/ics/bics/12101010131111
is contemporary version of: http://data.ga-group.nl/ics/bics/121010131111
is replaced by: http://data.ga-group.nl/ics/bics/2020/12101010131111
is version of: http://data.ga-group.nl/ics/bics/12101010131111
is version of: http://data.ga-group.nl/ics/bics/121010131111
imported on: 2026-06-08T13:03:47.798Z
last refreshed on: 2026-06-08T13:03:47.798Z
source accessed on: 2019-12-03T20:05:01Z
source last accessed on: 2019-12-03T20:05:01Z
label: Cultivo de cítricas (exceto laranja) @pt
label: Cultivo de cítricos (excepto naranja) @es
label: Culture d'agrumes h oranges @fr
label: Piantagioni di cedri (eccetto arance) @it
label: Zitrushain exkl. Orangen @de
label: Цитрусовые (кроме апельс.) рощи @ru
label: 柑橘(橘子除外)園 @zh-hant
label: 柑橘林（除橙林外） @zh
label: 柑橘類(除ｵﾚﾝｼﾞ)畑 @ja
label: 감류 (오렌지 제외) 재배업 @ko
definition: This segment includes companies that grow citrus fruits other than oranges.
notation: 121010131111
valid from: 2014-08-08
valid till: 2020-10-03

Grape Vineyards
type: BicsLevel6Segment
type: Classifier
type: NamedIndividual
is level6 segment of: Fruit Farming
is anachronous version of: http://data.ga-group.nl/ics/bics/12101010131112
is contemporary version of: http://data.ga-group.nl/ics/bics/121010131112
is replaced by: http://data.ga-group.nl/ics/bics/2020/12101010131112
is version of: http://data.ga-group.nl/ics/bics/12101010131112
is version of: http://data.ga-group.nl/ics/bics/121010131112
imported on: 2026-06-08T13:03:47.798Z
last refreshed on: 2026-06-08T13:03:47.798Z
source accessed on: 2019-12-03T20:05:01Z
source last accessed on: 2019-12-03T20:05:01Z
label: Viñedos @es
label: Vigneti d'uva @it
label: Vignobles @fr
label: Vinhedos de uva @pt
label: Weintraubenplantagen @de
label: Виноградники @ru
label: ぶどう園 @ja
label: 葡萄园 @zh
label: 葡萄園 @zh-hant
label: 포도 재배업 @ko
definition: This segment includes companies that grow grapes.
notation: 121010131112
valid from: 2014-08-08
valid till: 2020-10-03

Orange Groves
type: BicsLevel6Segment
type: Classifier
type: NamedIndividual
is level6 segment of: Fruit Farming
is anachronous version of: http://data.ga-group.nl/ics/bics/12101010131113
is contemporary version of: http://data.ga-group.nl/ics/bics/121010131113
is replaced by: http://data.ga-group.nl/ics/bics/2020/12101010131113
is version of: http://data.ga-group.nl/ics/bics/12101010131113
is version of: http://data.ga-group.nl/ics/bics/121010131113
imported on: 2026-06-08T13:03:47.798Z
last refreshed on: 2026-06-08T13:03:47.798Z
source accessed on: 2019-12-03T20:05:01Z
source last accessed on: 2019-12-03T20:05:01Z
label: Aranceti @it
label: Arvoredos de laranja @pt
label: Cultivo de naranja @es
label: Culture d'oranges @fr
label: Orangenanbau @de
label: Апельсиновые рощи @ru
label: 橘園 @zh-hant
label: 橙林 @zh
label: 오렌지 재배업 @ko
label: ｵﾚﾝｼﾞ畑 @ja
definition: This segment includes companies that grow oranges.
notation: 121010131113
valid from: 2014-08-08
valid till: 2020-10-03

Strawberry Farming
type: BicsLevel6Segment
type: Classifier
type: NamedIndividual
is level6 segment of: Fruit Farming
is anachronous version of: http://data.ga-group.nl/ics/bics/12101010131114
is contemporary version of: http://data.ga-group.nl/ics/bics/121010131114
is replaced by: http://data.ga-group.nl/ics/bics/2020/12101010131114
is version of: http://data.ga-group.nl/ics/bics/12101010131114
is version of: http://data.ga-group.nl/ics/bics/121010131114
imported on: 2026-06-08T13:03:47.798Z
last refreshed on: 2026-06-08T13:03:47.798Z
source accessed on: 2019-12-03T20:05:01Z
source last accessed on: 2019-12-03T20:05:01Z
label: Coltivazione fragole @it
label: Cultivo de fresas @es
label: Cultivo de morango @pt
label: Culture de fraises @fr
label: Erdbeeranbau @de
label: Выращивание клубники @ru
label: いちご園 @ja
label: 草苺栽培 @zh-hant
label: 草莓种植 @zh
label: 딸기 재배업 @ko
definition: This segment includes companies that grow strawberries.
notation: 121010131114
valid from: 2014-08-08
valid till: 2020-10-03

Other Noncitrus Fruit Farm
type: BicsLevel6Segment
type: Classifier
type: Discontinued
type: NamedIndividual
is level6 segment of: Fruit Farming
is contemporary version of: http://data.ga-group.nl/ics/bics/121010131115
is version of: http://data.ga-group.nl/ics/bics/121010131115
imported on: 2026-06-08T13:03:47.798Z
last refreshed on: 2026-06-08T13:03:47.798Z
source accessed on: 2019-12-03T20:05:01Z
source last accessed on: 2019-12-03T20:05:01Z
label: Coltivazione di altra frutta (non agrumi) @it
label: Cultivo de otros frutales no cítricos @es
label: Cultivo e outras frutas não cítricas @pt
label: Culture d'autres fruits hors agrumes @fr
label: Sonstiger Anbau von nicht-Zitrusfrüchten @de
label: Выращивание проч. нецитрусовых фруктов @ru
label: その他非柑橘果樹作農業 @ja
label: 其他非柑橘水果种植 @zh
label: 其他非柑橘類栽培 @zh-hant
label: 기타 감류 과실 재배업 @ko
definition: This segment includes companies that grow non-citrus fruit not elsewhere classified.
notation: 121010131115
valid from: 2014-08-08
valid till: 2020-10-03

Fruit Farming
type: BicsLevel5Segment
type: Classifier
type: NamedIndividual
is level5 segment of: Food Crop Production
is anachronous version of: http://data.ga-group.nl/ics/bics/121010101311
is contemporary version of: http://data.ga-group.nl/ics/bics/1210101311
is replaced by: http://data.ga-group.nl/ics/bics/2020/121010101311
is version of: http://data.ga-group.nl/ics/bics/121010101311
is version of: http://data.ga-group.nl/ics/bics/1210101311
imported on: 2026-06-08T13:03:47.798Z
last refreshed on: 2026-06-08T13:03:47.798Z
source accessed on: 2019-12-03T20:05:01Z
source last accessed on: 2019-12-03T20:05:01Z
label: Coltivazione frutta @it
label: Cultivo de frutas @es
label: Culture de fruits @fr
label: Fruticultura @pt
label: Obstanbau @de
label: Выращивание фруктов @ru
label: 果物生産 @ja
label: 水果栽培 @zh-hant
label: 水果种植 @zh
label: 과일 재배업 @ko
definition: This segment includes companies that grow fruit.
notation: 1210101311
valid from: 2014-08-08
valid till: 2020-10-03

Corn Farming
type: BicsLevel6Segment
type: Classifier
type: NamedIndividual
is level6 segment of: Grain Farming
is anachronous version of: http://data.ga-group.nl/ics/bics/12101010131210
is contemporary version of: http://data.ga-group.nl/ics/bics/121010131210
is replaced by: http://data.ga-group.nl/ics/bics/2020/12101010131210
is version of: http://data.ga-group.nl/ics/bics/12101010131210
is version of: http://data.ga-group.nl/ics/bics/121010131210
imported on: 2026-06-08T13:03:47.798Z
last refreshed on: 2026-06-08T13:03:47.798Z
source accessed on: 2019-12-03T20:05:01Z
source last accessed on: 2019-12-03T20:05:01Z
label: Coltivazione di mais @it
label: Cultivo de maíz @es
label: Cultivo de milho @pt
label: Culture du maïs @fr
label: Maisanbau @de
label: Выращивание кукурузы @ru
label: 玉米栽培 @zh-hant
label: 玉米种植 @zh
label: 옥수수 재배업 @ko
label: ﾄｳﾓﾛｺｼ作農業 @ja
definition: This segment includes companies that grow corn or corn by-products.
notation: 121010131210
valid from: 2014-08-08
valid till: 2020-10-03

Rice Farming
type: BicsLevel6Segment
type: Classifier
type: NamedIndividual
is level6 segment of: Grain Farming
is anachronous version of: http://data.ga-group.nl/ics/bics/12101010131211
is contemporary version of: http://data.ga-group.nl/ics/bics/121010131211
is replaced by: http://data.ga-group.nl/ics/bics/2020/12101010131211
is version of: http://data.ga-group.nl/ics/bics/12101010131211
is version of: http://data.ga-group.nl/ics/bics/121010131211
imported on: 2026-06-08T13:03:47.798Z
last refreshed on: 2026-06-08T13:03:47.798Z
source accessed on: 2019-12-03T20:05:01Z
source last accessed on: 2019-12-03T20:05:01Z
label: Coltivazione di riso @it
label: Cultivo de arroz @es
label: Culture du riz @fr
label: Reisanbau @de
label: Выращивание риса @ru
label: 稻作栽培 @zh-hant
label: 稻类种植 @zh
label: 米作農業 @ja
label: 쌀 재배업 @ko
definition: This segment includes companies that grow rice or rice by-products.
notation: 121010131211
valid from: 2014-08-08
valid till: 2020-10-03

Wheat Farming
type: BicsLevel6Segment
type: Classifier
type: NamedIndividual
is level6 segment of: Grain Farming
is anachronous version of: http://data.ga-group.nl/ics/bics/12101010131212
is contemporary version of: http://data.ga-group.nl/ics/bics/121010131212
is replaced by: http://data.ga-group.nl/ics/bics/2020/12101010131212
is version of: http://data.ga-group.nl/ics/bics/12101010131212
is version of: http://data.ga-group.nl/ics/bics/121010131212
imported on: 2026-06-08T13:03:47.798Z
last refreshed on: 2026-06-08T13:03:47.798Z
source accessed on: 2019-12-03T20:05:01Z
source last accessed on: 2019-12-03T20:05:01Z
label: Coltivaz frumento @it
label: Cultivo de trigo @es
label: Culture du blé @fr
label: Weizenanbau @de
label: Выращивание пшеницы @ru
label: 小麥栽培 @zh-hant
label: 小麦种植 @zh
label: 麦作農業 @ja
label: 밀 재배업 @ko
definition: This segment includes companies that grow wheat or wheat by-products.
notation: 121010131212
valid from: 2014-08-08
valid till: 2020-10-03

Other Grain Farming
type: BicsLevel6Segment
type: Classifier
type: Discontinued
type: NamedIndividual
is level6 segment of: Grain Farming
is contemporary version of: http://data.ga-group.nl/ics/bics/121010131213
is version of: http://data.ga-group.nl/ics/bics/121010131213
imported on: 2026-06-08T13:03:47.798Z
last refreshed on: 2026-06-08T13:03:47.798Z
source accessed on: 2019-12-03T20:05:01Z
source last accessed on: 2019-12-03T20:05:01Z
label: Autres céréales @fr
label: Coltivaz altro grano @it
label: Cultivo de outros grãos @pt
label: Cultivo otros granos @es
label: Sonst. Getreideanbau @de
label: Выращивание проч. культур @ru
label: その他穀物農業 @ja
label: 其他穀物栽培 @zh-hant
label: 所有其他谷物种植 @zh
label: 기타 곡물 재배업 @ko
definition: This segment includes companies that grow other grains not elsewhere classified. Products include barley, broomcorn, buckwheat, milo, oats, rye and sorghum.
notation: 121010131213
valid from: 2014-08-08
valid till: 2020-10-03

Grain Farming
type: BicsLevel5Segment
type: Classifier
type: NamedIndividual
is level5 segment of: Food Crop Production
is anachronous version of: http://data.ga-group.nl/ics/bics/121010101312
is contemporary version of: http://data.ga-group.nl/ics/bics/1210101312
is replaced by: http://data.ga-group.nl/ics/bics/2020/121010101312
is version of: http://data.ga-group.nl/ics/bics/121010101312
is version of: http://data.ga-group.nl/ics/bics/1210101312
imported on: 2026-06-08T13:03:47.798Z
last refreshed on: 2026-06-08T13:03:47.798Z
source accessed on: 2019-12-03T20:05:01Z
source last accessed on: 2019-12-03T20:05:01Z
label: Coltivazione grano @it
label: Cultivo de grãos @pt
label: Cultivo de granos @es
label: Cultures céréalières @fr
label: Getreideanbau @de
label: Возделывание зерновых @ru
label: 榖物栽培 @zh-hant
label: 穀物生産 @ja
label: 谷物种植 @zh
label: 곡물 재배업 @ko
definition: This segment includes companies that grow grains, such as corn, wheat and soybeans.
notation: 1210101312
valid from: 2014-08-08
valid till: 2020-10-03

Mushroom Production
type: BicsLevel5Segment
type: Classifier
type: NamedIndividual
is level5 segment of: Food Crop Production
is anachronous version of: http://data.ga-group.nl/ics/bics/121010101313
is contemporary version of: http://data.ga-group.nl/ics/bics/1210101313
is replaced by: http://data.ga-group.nl/ics/bics/2020/121010101313
is version of: http://data.ga-group.nl/ics/bics/121010101313
is version of: http://data.ga-group.nl/ics/bics/1210101313
imported on: 2026-06-08T13:03:47.798Z
last refreshed on: 2026-06-08T13:03:47.798Z
source accessed on: 2019-12-03T20:05:01Z
source last accessed on: 2019-12-03T20:05:01Z
label: Coltivazione funghi @it
label: Culture champignons @fr
label: Pilzzucht @de
label: Produção de cogumelo @pt
label: Produc champiñones @es
label: Выращивание грибов @ru
label: きのこ類生産 @ja
label: 蘑菇生产 @zh
label: 蘑菇生產 @zh-hant
label: 버섯 재배업 @ko
definition: This segment includes companies that grow mushrooms in various environments.
notation: 1210101313
valid from: 2014-08-08
valid till: 2020-10-03

Palm Oil Farming
type: BicsLevel6Segment
type: Classifier
type: NamedIndividual
is level6 segment of: Oilseed Farming
is anachronous version of: http://data.ga-group.nl/ics/bics/12101010131410
is contemporary version of: http://data.ga-group.nl/ics/bics/121010131410
is replaced by: http://data.ga-group.nl/ics/bics/2020/12101010131410
is version of: http://data.ga-group.nl/ics/bics/12101010131410
is version of: http://data.ga-group.nl/ics/bics/121010131410
imported on: 2026-06-08T13:03:47.798Z
last refreshed on: 2026-06-08T13:03:47.798Z
source accessed on: 2019-12-03T20:05:01Z
source last accessed on: 2019-12-03T20:05:01Z
label: Aceite de palma @es
label: Coltivaz olio palma @it
label: Cultivo de óleo de palma @pt
label: Culture huile palme @fr
label: Palmölanbau @de
label: Производство пальм. масла @ru
label: 棕榈油种植 @zh
label: 棕櫚油栽培 @zh-hant
label: 팜유 재배업 @ko
label: ﾊﾟｰﾑ油生産 @ja
definition: This segment includes companies that grow palms for palm oil production.
notation: 121010131410
valid from: 2014-08-08
valid till: 2020-10-03

Soybean Farming
type: BicsLevel6Segment
type: Classifier
type: NamedIndividual
is level6 segment of: Oilseed Farming
is anachronous version of: http://data.ga-group.nl/ics/bics/12101010131411
is contemporary version of: http://data.ga-group.nl/ics/bics/121010131411
is replaced by: http://data.ga-group.nl/ics/bics/2020/12101010131411
is version of: http://data.ga-group.nl/ics/bics/12101010131411
is version of: http://data.ga-group.nl/ics/bics/121010131411
imported on: 2026-06-08T13:03:47.798Z
last refreshed on: 2026-06-08T13:03:47.798Z
source accessed on: 2019-12-03T20:05:01Z
source last accessed on: 2019-12-03T20:05:01Z
label: Coltivazione di soia @it
label: Cultivo de haba @es
label: Cultivo de semente de soja @pt
label: Culture du soja @fr
label: Sojabohnenanbau @de
label: Выращивание соевых бобов @ru
label: 大豆种植 @zh
label: 大豆農業 @ja
label: 黃豆栽培 @zh-hant
label: 대두 재배업 @ko
definition: This segment includes companies that grow soybeans or soybean by-products.
notation: 121010131411
valid from: 2014-08-08
valid till: 2020-10-03

Other Oilseed Farming
type: BicsLevel6Segment
type: Classifier
type: Discontinued
type: NamedIndividual
is level6 segment of: Oilseed Farming
is contemporary version of: http://data.ga-group.nl/ics/bics/121010131412
is version of: http://data.ga-group.nl/ics/bics/121010131412
imported on: 2026-06-08T13:03:47.798Z
last refreshed on: 2026-06-08T13:03:47.798Z
source accessed on: 2019-12-03T20:05:01Z
source last accessed on: 2019-12-03T20:05:01Z
label: Coltivaz altri semi oleosi @it
label: Cultivo de outros oleaginosos @pt
label: Culture d'autres plantes oléagineuses @fr
label: Otros cultivos de semillas oleaginosas @es
label: Sonstiger Ölsaatenanbau @de
label: Выращивание проч. масличных культур @ru
label: その他種子栽培 @ja
label: 其他油籽栽培 @zh-hant
label: 其他油籽种植 @zh
label: 기타 오일시드 재배업 @ko
definition: This segment includes companies that grow oilseed-producing plants not elsewhere classified. Plants include sunflowers, safflower, flax, cape, canola and sesame.
notation: 121010131412
valid from: 2014-08-08
valid till: 2020-10-03

Oilseed Farming
type: BicsLevel5Segment
type: Classifier
type: NamedIndividual
is level5 segment of: Food Crop Production
is anachronous version of: http://data.ga-group.nl/ics/bics/121010101314
is contemporary version of: http://data.ga-group.nl/ics/bics/1210101314
is replaced by: http://data.ga-group.nl/ics/bics/2020/121010101314
is version of: http://data.ga-group.nl/ics/bics/121010101314
is version of: http://data.ga-group.nl/ics/bics/1210101314
imported on: 2026-06-08T13:03:47.798Z
last refreshed on: 2026-06-08T13:03:47.798Z
source accessed on: 2019-12-03T20:05:01Z
source last accessed on: 2019-12-03T20:05:01Z
label: Agricultura oleaginosas @pt
label: Coltivazione di semi oleosi @it
label: Cultivo de semillas oleaginosas @es
label: Culture d'oléagineux @fr
label: Ölsaatenanbau @de
label: Возделывание маслиничных растений @ru
label: 油料種子生産 @ja
label: 油籽栽培 @zh-hant
label: 油籽种植 @zh
label: 오일시드 재배업 @ko
definition: This segment includes companies that grow oilseed-producing plants, such as sunflowers, safflower, flax, cape, canola and sesame.
notation: 1210101314
valid from: 2014-08-08
valid till: 2020-10-03

Sugarcane Farming
type: BicsLevel5Segment
type: Classifier
type: NamedIndividual
is level5 segment of: Food Crop Production
is anachronous version of: http://data.ga-group.nl/ics/bics/121010101315
is contemporary version of: http://data.ga-group.nl/ics/bics/1210101315
is replaced by: http://data.ga-group.nl/ics/bics/2020/121010101315
is version of: http://data.ga-group.nl/ics/bics/121010101315
is version of: http://data.ga-group.nl/ics/bics/1210101315
imported on: 2026-06-08T13:03:47.798Z
last refreshed on: 2026-06-08T13:03:47.798Z
source accessed on: 2019-12-03T20:05:01Z
source last accessed on: 2019-12-03T20:05:01Z
label: Anbau von Zuckerrohr @de
label: Canne à sucre @fr
label: Coltivaz canna zucch @it
label: Cultivo caña azúcar @es
label: Cultivo de cana-de-açúcar @pt
label: Выращивание сахарного тростника @ru
label: 甘蔗栽培 @zh-hant
label: 甘蔗种植 @zh
label: 사탕수수 재배업 @ko
label: ｻﾄｳｷﾋﾞ作農業 @ja
definition: This segment includes companies that grow sugarcane.
notation: 1210101315
valid from: 2014-08-08
valid till: 2020-10-03

Tree Nut Farming
type: BicsLevel5Segment
type: Classifier
type: NamedIndividual
is level5 segment of: Food Crop Production
is anachronous version of: http://data.ga-group.nl/ics/bics/121010101316
is contemporary version of: http://data.ga-group.nl/ics/bics/1210101316
is replaced by: http://data.ga-group.nl/ics/bics/2020/121010101316
is version of: http://data.ga-group.nl/ics/bics/121010101316
is version of: http://data.ga-group.nl/ics/bics/1210101316
imported on: 2026-06-08T13:03:47.798Z
last refreshed on: 2026-06-08T13:03:47.798Z
source accessed on: 2019-12-03T20:05:01Z
source last accessed on: 2019-12-03T20:05:01Z
label: Anbau von Baumnüssen @de
label: Coltivazione di noci @it
label: Cultivo de frutos de casca @pt
label: Cultivo frut nueces @es
label: Culture de noix @fr
label: Выращивание грецких орехов @ru
label: 堅果栽培 @zh-hant
label: 木の実作農業 @ja
label: 树生坚果种植 @zh
label: 견과나무 재배업 @ko
definition: This segment includes companies that grow tree nuts.
notation: 1210101316
valid from: 2014-08-08
valid till: 2020-10-03

Potato Farming
type: BicsLevel6Segment
type: Classifier
type: Discontinued
type: NamedIndividual
is level6 segment of: Vegetable Farming
is contemporary version of: http://data.ga-group.nl/ics/bics/121010131710
is version of: http://data.ga-group.nl/ics/bics/121010131710
imported on: 2026-06-08T13:03:47.798Z
last refreshed on: 2026-06-08T13:03:47.798Z
source accessed on: 2019-12-03T20:05:01Z
source last accessed on: 2019-12-03T20:05:01Z
label: Coltivazione patate @it
label: Cultivo de batata @pt
label: Cultivo de papa @es
label: Culture pommes terre @fr
label: Kartoffelanbau @de
label: Выращивание картофеля @ru
label: ばれいしょ作農業 @ja
label: 土豆种植 @zh
label: 馬鈴薯栽培 @zh-hant
label: 감자 재배업 @ko
definition: This segment includes companies that grow potatoes.
notation: 121010131710
valid from: 2014-08-08
valid till: 2020-10-03

Other Vegetable Farming
type: BicsLevel6Segment
type: Classifier
type: Discontinued
type: NamedIndividual
is level6 segment of: Vegetable Farming
is contemporary version of: http://data.ga-group.nl/ics/bics/121010131711
is version of: http://data.ga-group.nl/ics/bics/121010131711
imported on: 2026-06-08T13:03:47.798Z
last refreshed on: 2026-06-08T13:03:47.798Z
source accessed on: 2019-12-03T20:05:01Z
source last accessed on: 2019-12-03T20:05:01Z
label: Coltivazioni verdure @it
label: Cultivo de outros vegetais @pt
label: Culture d'autres léguments @fr
label: Otros cultivos de verduras @es
label: Sonstiger Gemüseanbau @de
label: Проч. выращивание овощей @ru
label: その他野菜栽培 @ja
label: 其他蔬菜栽培 @zh-hant
label: 其他蔬菜种植 @zh
label: 기타 채소 재배업 @ko
definition: This segment includes companies that grow various other vegetables not elsewhere classified.
notation: 121010131711
valid from: 2014-08-08
valid till: 2020-10-03

Vegetable Farming
type: BicsLevel5Segment
type: Classifier
type: NamedIndividual
is level5 segment of: Food Crop Production
is anachronous version of: http://data.ga-group.nl/ics/bics/121010101317
is contemporary version of: http://data.ga-group.nl/ics/bics/1210101317
is replaced by: http://data.ga-group.nl/ics/bics/2020/121010101317
is version of: http://data.ga-group.nl/ics/bics/121010101317
is version of: http://data.ga-group.nl/ics/bics/1210101317
imported on: 2026-06-08T13:03:47.798Z
last refreshed on: 2026-06-08T13:03:47.798Z
source accessed on: 2019-12-03T20:05:01Z
source last accessed on: 2019-12-03T20:05:01Z
label: Coltivazione verdure @it
label: Cultivo de vegetais @pt
label: Cultivo de verduras @es
label: Cultures maraîchères @fr
label: Gemüseanbau @de
label: Выращивание овощей @ru
label: 蔬菜栽培 @zh-hant
label: 蔬菜种植 @zh
label: 野菜生産 @ja
label: 야채 재배업 @ko
definition: This segment includes companies that grow vegetables.
notation: 1210101317
valid from: 2014-08-08
valid till: 2020-10-03

Support Services - Crop Prod
type: BicsLevel5Segment
type: Classifier
type: NamedIndividual
is level5 segment of: Food Crop Production
is anachronous version of: http://data.ga-group.nl/ics/bics/121010101318
is contemporary version of: http://data.ga-group.nl/ics/bics/1210101318
is replaced by: http://data.ga-group.nl/ics/bics/2020/121010101318
is version of: http://data.ga-group.nl/ics/bics/121010101318
is version of: http://data.ga-group.nl/ics/bics/1210101318
imported on: 2026-06-08T13:03:47.798Z
last refreshed on: 2026-06-08T13:03:47.798Z
source accessed on: 2019-12-03T20:05:01Z
source last accessed on: 2019-12-03T20:05:01Z
label: Serv de asistencia - prod de cosecha @es
label: Serv de soutien - Prod agricole @fr
label: Serviços de apoio-Prod agrícola @pt
label: Servizi supporto - Prod raccolto @it
label: Supportdienste - Pflanzenbau @de
label: Выращивание культур - вспомог. деятельность @ru
label: 支持服务-农作物生产 @zh
label: 穀物生産支援ｻｰﾋﾞｽ @ja
label: 農作物生產輔助業 @zh-hant
label: 지원 서비스 - 작물 생산 @ko
definition: This segment includes companies that support activities (either pre- or post-harvest) for crop production.
notation: 1210101318
valid from: 2014-08-08
valid till: 2020-10-03

Food Crop Production
type: BicsLevel4SubIndustry
type: Classifier
type: NamedIndividual
is sub industry of: Agricultural Producers
is anachronous version of: http://data.ga-group.nl/ics/bics/1210101013
is contemporary version of: http://data.ga-group.nl/ics/bics/12101013
is replaced by: http://data.ga-group.nl/ics/bics/2020/1210101013
is version of: http://data.ga-group.nl/ics/bics/1210101013
is version of: http://data.ga-group.nl/ics/bics/12101013
imported on: 2026-06-08T13:03:47.798Z
last refreshed on: 2026-06-08T13:03:47.798Z
source accessed on: 2019-12-03T20:05:01Z
source last accessed on: 2019-12-03T20:05:01Z
label: Coltivazione @it
label: Cultivos @es
label: Cultures vivrières @fr
label: Futterpflanzenprod. @de
label: Produção de culturas alimentares @pt
label: Производство продовольственных культур @ru
label: 粮食作物生产 @zh
label: 糧食作物生產 @zh-hant
label: 農作物生産 @ja
label: 식량작물 생산업 @ko
definition: This industry subgroup includes companies that produce crops for food consumption.
notation: 12101013
valid from: 2014-08-08
valid till: 2020-10-03

Fats & Oil Refining
type: BicsLevel6Segment
type: Classifier
type: NamedIndividual
is level6 segment of: Grain & Oilseed Milling
is anachronous version of: http://data.ga-group.nl/ics/bics/12101010141010
is contemporary version of: http://data.ga-group.nl/ics/bics/121010141010
is replaced by: http://data.ga-group.nl/ics/bics/2020/12101010141010
is version of: http://data.ga-group.nl/ics/bics/12101010141010
is version of: http://data.ga-group.nl/ics/bics/121010141010
imported on: 2026-06-08T13:03:47.798Z
last refreshed on: 2026-06-08T13:03:47.798Z
source accessed on: 2019-12-03T20:05:01Z
source last accessed on: 2019-12-03T20:05:01Z
label: Raff grassi e oli @it
label: Raff. Fette & Öle @de
label: Raffin graisse/huile @fr
label: Refin grasas aceites @es
label: Refinação de gordura e óleo @pt
label: Переработка жиров и масел @ru
label: 油脂及び油精製 @ja
label: 油脂精炼及加工 @zh
label: 油脂精煉及混合 @zh-hant
label: 지방&정제혼합제조 @ko
definition: This segment includes companies that refine cooking oils from purchased fats.
notation: 121010141010
valid from: 2014-08-08
valid till: 2020-10-03

Flour Milling
type: BicsLevel6Segment
type: Classifier
type: NamedIndividual
is level6 segment of: Grain & Oilseed Milling
is anachronous version of: http://data.ga-group.nl/ics/bics/12101010141011
is contemporary version of: http://data.ga-group.nl/ics/bics/121010141011
is replaced by: http://data.ga-group.nl/ics/bics/2020/12101010141011
is version of: http://data.ga-group.nl/ics/bics/12101010141011
is version of: http://data.ga-group.nl/ics/bics/121010141011
imported on: 2026-06-08T13:03:47.798Z
last refreshed on: 2026-06-08T13:03:47.798Z
source accessed on: 2019-12-03T20:05:01Z
source last accessed on: 2019-12-03T20:05:01Z
label: Macinatura di farina @it
label: Mehlverarbeitung @de
label: Minoterie de farine @fr
label: Moagem de trigo @pt
label: Molinería harina @es
label: Помол муки @ru
label: 磨粉 @zh-hant
label: 製粉 @ja
label: 面粉加工 @zh
label: 제분업 @ko
definition: This segment includes companies that mill grains into flour used in food products.
notation: 121010141011
valid from: 2014-08-08
valid till: 2020-10-03

Malt
type: BicsLevel6Segment
type: Classifier
type: NamedIndividual
is level6 segment of: Grain & Oilseed Milling
is anachronous version of: http://data.ga-group.nl/ics/bics/12101010141012
is contemporary version of: http://data.ga-group.nl/ics/bics/121010141012
is replaced by: http://data.ga-group.nl/ics/bics/2020/12101010141012
is version of: http://data.ga-group.nl/ics/bics/12101010141012
is version of: http://data.ga-group.nl/ics/bics/121010141012
imported on: 2026-06-08T13:03:47.798Z
last refreshed on: 2026-06-08T13:03:47.798Z
source accessed on: 2019-12-03T20:05:01Z
source last accessed on: 2019-12-03T20:05:01Z
label: Malta @es
label: Malte @pt
label: Malto @it
label: Malz @de
label: Солод @ru
label: 麥芽 @zh-hant
label: 麦芽 @ja
label: 맥아 @ko
definition: This segment includes companies that process grain into malt for wholesale to breweries and distilleries. The companies purchase barley or grow their own barley and use a multi-step process to dry, steep, germinate and kiln the barley into malt.
notation: 121010141012
valid from: 2014-08-08
valid till: 2020-10-03

Palm Oil Processing
type: BicsLevel6Segment
type: Classifier
type: NamedIndividual
is level6 segment of: Grain & Oilseed Milling
is anachronous version of: http://data.ga-group.nl/ics/bics/12101010141013
is contemporary version of: http://data.ga-group.nl/ics/bics/121010141013
is replaced by: http://data.ga-group.nl/ics/bics/2020/12101010141013
is version of: http://data.ga-group.nl/ics/bics/12101010141013
is version of: http://data.ga-group.nl/ics/bics/121010141013
imported on: 2026-06-08T13:03:47.798Z
last refreshed on: 2026-06-08T13:03:47.798Z
source accessed on: 2019-12-03T20:05:01Z
source last accessed on: 2019-12-03T20:05:01Z
label: Aceite de palma @es
label: Lavoraz olio palma @it
label: Palmölverarbeitung @de
label: Processamento de óleo de palma @pt
label: Traitmt huile palme @fr
label: Обработка пальм. масла @ru
label: 棕榈油加工处理 @zh
label: 棕櫚油加工處理 @zh-hant
label: 팜유 가공업 @ko
label: ﾊﾟｰﾑ油加工 @ja
definition: This segment includes companies that produce palm oil.
notation: 121010141013
valid from: 2014-08-08
valid till: 2020-10-03

Rice Milling
type: BicsLevel6Segment
type: Classifier
type: NamedIndividual
is level6 segment of: Grain & Oilseed Milling
is anachronous version of: http://data.ga-group.nl/ics/bics/12101010141014
is contemporary version of: http://data.ga-group.nl/ics/bics/121010141014
is replaced by: http://data.ga-group.nl/ics/bics/2020/12101010141014
is version of: http://data.ga-group.nl/ics/bics/12101010141014
is version of: http://data.ga-group.nl/ics/bics/121010141014
imported on: 2026-06-08T13:03:47.798Z
last refreshed on: 2026-06-08T13:03:47.798Z
source accessed on: 2019-12-03T20:05:01Z
source last accessed on: 2019-12-03T20:05:01Z
label: Macinatura di riso @it
label: Minoterie de riz @fr
label: Moagem de arroz @pt
label: Molinería de arroz @es
label: Reisverarbeitung @de
label: Шлифование риса @ru
label: 大米碾磨 @zh
label: 碾米 @zh-hant
label: 精米 @ja
label: 정미업 @ko
definition: This segment includes companies that mill rice, typically using a rice huller that separates the seed from the chaff.
notation: 121010141014
valid from: 2014-08-08
valid till: 2020-10-03

Soybean Processing
type: BicsLevel6Segment
type: Classifier
type: NamedIndividual
is level6 segment of: Grain & Oilseed Milling
is anachronous version of: http://data.ga-group.nl/ics/bics/12101010141015
is contemporary version of: http://data.ga-group.nl/ics/bics/121010141015
is replaced by: http://data.ga-group.nl/ics/bics/2020/12101010141015
is version of: http://data.ga-group.nl/ics/bics/12101010141015
is version of: http://data.ga-group.nl/ics/bics/121010141015
imported on: 2026-06-08T13:03:47.798Z
last refreshed on: 2026-06-08T13:03:47.798Z
source accessed on: 2019-12-03T20:05:01Z
source last accessed on: 2019-12-03T20:05:01Z
label: Lavorazione soia @it
label: Procesamiento haba @es
label: Processamento de soja @pt
label: Sojabohnenverarbeitg @de
label: Transformation soja @fr
label: Переработка соевых бобов (AON) @ru
label: 大豆加工 @ja
label: 大豆加工处理 @zh
label: 黃豆處理 @zh-hant
label: 대두 가공업 @ko
definition: This segment includes companies that process soybeans into tofu, oils, animal feed and other edible forms.
notation: 121010141015
valid from: 2014-08-08
valid till: 2020-10-03

Wet Corn Milling
type: BicsLevel6Segment
type: Classifier
type: NamedIndividual
is level6 segment of: Grain & Oilseed Milling
is anachronous version of: http://data.ga-group.nl/ics/bics/12101010141016
is contemporary version of: http://data.ga-group.nl/ics/bics/121010141016
is replaced by: http://data.ga-group.nl/ics/bics/2020/12101010141016
is version of: http://data.ga-group.nl/ics/bics/12101010141016
is version of: http://data.ga-group.nl/ics/bics/121010141016
imported on: 2026-06-08T13:03:47.798Z
last refreshed on: 2026-06-08T13:03:47.798Z
source accessed on: 2019-12-03T20:05:01Z
source last accessed on: 2019-12-03T20:05:01Z
label: Macin mais bagnato @it
label: Maisverarbeitung @de
label: Moagem de pasta de milho @pt
label: Molin maíz mojado @es
label: Mouture humide maïs @fr
label: Влажный помол кукурузы @ru
label: 玉米湿磨 @zh
label: 玉米濕式輾磨 @zh-hant
label: 옥수수가루 제조업 @ko
label: ﾄｳﾓﾛｺｼ粉製造業 @ja
definition: This segment includes companies that mill wet corn into corn flour.
notation: 121010141016
valid from: 2014-08-08
valid till: 2020-10-03

Other Oilseed Processing
type: BicsLevel6Segment
type: Classifier
type: Discontinued
type: NamedIndividual
is level6 segment of: Grain & Oilseed Milling
is contemporary version of: http://data.ga-group.nl/ics/bics/121010141017
is version of: http://data.ga-group.nl/ics/bics/121010141017
imported on: 2026-06-08T13:03:47.798Z
last refreshed on: 2026-06-08T13:03:47.798Z
source accessed on: 2019-12-03T20:05:01Z
source last accessed on: 2019-12-03T20:05:01Z
label: Lavoraz altri semi oleosi @it
label: Outros processamentos de sementes oleaginosas @pt
label: Procesamiento de otras semillas oleaginosas @es
label: Sonstige Verarbeitung von Ölsamen @de
label: Transformation d'autres plantes oléagineuses @fr
label: Переработка проч. масличных @ru
label: その他��料種子加工 @ja
label: 其他油籽加工 @zh
label: 其他油籽處理 @zh-hant
label: 기타 오일시드 가공업 @ko
definition: This segment includes companies that process grains, vegetables, and olives into oils used in cooking. Such oil includes canola oil, flaxseed oil and coconut oil, as well as margarines.
notation: 121010141017
valid from: 2014-08-08
valid till: 2020-10-03

Grain & Oilseed Milling
type: BicsLevel5Segment
type: Classifier
type: NamedIndividual
is level5 segment of: Sugar, Grain & Oilseed Mill
is anachronous version of: http://data.ga-group.nl/ics/bics/121010101410
is contemporary version of: http://data.ga-group.nl/ics/bics/1210101410
is replaced by: http://data.ga-group.nl/ics/bics/2020/121010101410
is version of: http://data.ga-group.nl/ics/bics/121010101410
is version of: http://data.ga-group.nl/ics/bics/1210101410
imported on: 2026-06-08T13:03:47.798Z
last refreshed on: 2026-06-08T13:03:47.798Z
source accessed on: 2019-12-03T20:05:01Z
source last accessed on: 2019-12-03T20:05:01Z
label: Macinatura di grano e semi oleosi @it
label: Moagem de oleaginosas e grãos @pt
label: Molienda de granos y de semillas oleaginosas @es
label: Mouture de céréales et de graines oléagineuses @fr
label: Verarbeitung von Korn und Ölsaat @de
label: Очистка и товарная переработка зерна и масличных семян @ru
label: 穀物及油籽輾磨 @zh-hant
label: 穀物･油料種子加工 @ja
label: 谷物及油籽碾磨 @zh
label: 곡물 & 채유종자 제분 @ko
definition: This segment includes companies that grind various grains and produce consumable oils from fruits and vegetables.
notation: 1210101410
valid from: 2014-08-08
valid till: 2020-10-03

Beet Sugar
type: BicsLevel6Segment
type: Classifier
type: NamedIndividual
is level6 segment of: Sugar
is anachronous version of: http://data.ga-group.nl/ics/bics/12101010141110
is contemporary version of: http://data.ga-group.nl/ics/bics/121010141110
is replaced by: http://data.ga-group.nl/ics/bics/2020/12101010141110
is version of: http://data.ga-group.nl/ics/bics/12101010141110
is version of: http://data.ga-group.nl/ics/bics/121010141110
imported on: 2026-06-08T13:03:47.798Z
last refreshed on: 2026-06-08T13:03:47.798Z
source accessed on: 2019-12-03T20:05:01Z
source last accessed on: 2019-12-03T20:05:01Z
label: Açúcar de beterraba @pt
label: Azúcar de remolacha @es
label: Barbabietole da zucchero @it
label: Rübenzucker @de
label: Sucre de betterave @fr
label: Сахарная свекла @ru
label: 甜菜糖 @zh
label: 점재당 @ko
label: ﾃﾝｻｲ @ja
definition: This segment includes companies that produce beet sugar.
notation: 121010141110
valid from: 2014-08-08
valid till: 2020-10-03

Cane Sugar Refining
type: BicsLevel6Segment
type: Classifier
type: NamedIndividual
is level6 segment of: Sugar
is anachronous version of: http://data.ga-group.nl/ics/bics/12101010141111
is contemporary version of: http://data.ga-group.nl/ics/bics/121010141111
is replaced by: http://data.ga-group.nl/ics/bics/2020/12101010141111
is version of: http://data.ga-group.nl/ics/bics/12101010141111
is version of: http://data.ga-group.nl/ics/bics/121010141111
imported on: 2026-06-08T13:03:47.798Z
last refreshed on: 2026-06-08T13:03:47.798Z
source accessed on: 2019-12-03T20:05:01Z
source last accessed on: 2019-12-03T20:05:01Z
label: Raffi. sucre canne @fr
label: Raffinaz canna zucch @it
label: Refinação da cana-de-açúcar @pt
label: Refinación de azúcar @es
label: Rohzuckerraffination @de
label: Переработка тростникового сахара @ru
label: 蔗糖提炼 @zh
label: 蔗糖精煉 @zh-hant
label: 사탕수수 정제업 @ko
label: ｻﾄｳｷﾋﾞ精製業 @ja
definition: This segment includes companies that produce sugar products from purchased raw cane sugar.
notation: 121010141111
valid from: 2014-08-08
valid till: 2020-10-03

Sugarcane Mills
type: BicsLevel6Segment
type: Classifier
type: NamedIndividual
is level6 segment of: Sugar
is anachronous version of: http://data.ga-group.nl/ics/bics/12101010141112
is contemporary version of: http://data.ga-group.nl/ics/bics/121010141112
is replaced by: http://data.ga-group.nl/ics/bics/2020/12101010141112
is version of: http://data.ga-group.nl/ics/bics/12101010141112
is version of: http://data.ga-group.nl/ics/bics/121010141112
imported on: 2026-06-08T13:03:47.798Z
last refreshed on: 2026-06-08T13:03:47.798Z
source accessed on: 2019-12-03T20:05:01Z
source last accessed on: 2019-12-03T20:05:01Z
label: Broyage canne sucre @fr
label: Fábricas de cana-de -açúcar @pt
label: Fabb canna zucchero @it
label: Mol caña de azúcar @es
label: Zuckerrohrverarbeitg @de
label: Заводы по обр. сах. тростника @ru
label: 甘蔗糖廠 @zh-hant
label: 蔗糖轧制机器 @zh
label: 사탕수수 제조업 @ko
label: ｻﾄｳｷﾋﾞ粉製造業 @ja
definition: This segment includes companies that produce sugar manufactured in their own sugarcane mills. Such sugar includes brown sugar, white sugar and molasses.
notation: 121010141112
valid from: 2014-08-08
valid till: 2020-10-03

Sugar
type: BicsLevel5Segment
type: Classifier
type: NamedIndividual
is level5 segment of: Sugar, Grain & Oilseed Mill
is anachronous version of: http://data.ga-group.nl/ics/bics/121010101411
is contemporary version of: http://data.ga-group.nl/ics/bics/1210101411
is replaced by: http://data.ga-group.nl/ics/bics/2020/121010101411
is version of: http://data.ga-group.nl/ics/bics/121010101411
is version of: http://data.ga-group.nl/ics/bics/1210101411
imported on: 2026-06-08T13:03:47.798Z
last refreshed on: 2026-06-08T13:03:47.798Z
source accessed on: 2019-12-03T20:05:01Z
source last accessed on: 2019-12-03T20:05:01Z
label: Açúcar @pt
label: Azúcar @es
label: Sucre @fr
label: Zucchero @it
label: Zucker @de
label: Сахар @ru
label: 砂糖 @ja
label: 糖 @zh
label: 설탕 @ko
definition: This segment includes companies that produce sugar in all forms.
notation: 1210101411
valid from: 2014-08-08
valid till: 2020-10-03

Sugar, Grain & Oilseed Mill
type: BicsLevel4SubIndustry
type: Classifier
type: NamedIndividual
is sub industry of: Agricultural Producers
is anachronous version of: http://data.ga-group.nl/ics/bics/1210101014
is contemporary version of: http://data.ga-group.nl/ics/bics/12101014
is replaced by: http://data.ga-group.nl/ics/bics/2020/1210101014
is version of: http://data.ga-group.nl/ics/bics/1210101014
is version of: http://data.ga-group.nl/ics/bics/12101014
imported on: 2026-06-08T13:03:47.798Z
last refreshed on: 2026-06-08T13:03:47.798Z
source accessed on: 2019-12-03T20:05:01Z
source last accessed on: 2019-12-03T20:05:01Z
label: Moinho de sementes oleaginosas, açúcar e grãos @pt
label: Molienda de azúcar, granos y semillas oleaginosas @es
label: Sucre, mouture céréales et oléagineuses @fr
label: Verarbeitung von Zucker, Getreide & Ölsaat @de
label: Zucch, macina grano e semi @it
label: Очистка и товарная переработка сахара, зерна и масличных семян @ru
label: 砂糖･穀物･油料種子加工 @ja
label: 糖、穀物及油籽輾磨 @zh-hant
label: 糖、谷物和油籽厂 @zh
label: 설탕, 곡물 & 채유종자가공 @ko
definition: This industry subgroup includes companies that produce sugar, grind various grains and produce consumable oils from fruits and vegetables.
notation: 12101014
valid from: 2014-08-08
valid till: 2020-10-03

Agricultural Producers
type: BicsLevel3Industry
type: Classifier
type: NamedIndividual
is industry of: Consumer Products
is anachronous version of: http://data.ga-group.nl/ics/bics/12101010
is contemporary version of: http://data.ga-group.nl/ics/bics/121010
is replaced by: http://data.ga-group.nl/ics/bics/2020/12101010
is version of: http://data.ga-group.nl/ics/bics/12101010
is version of: http://data.ga-group.nl/ics/bics/121010
imported on: 2026-06-08T13:03:47.798Z
last refreshed on: 2026-06-08T13:03:47.798Z
source accessed on: 2019-12-03T20:05:01Z
source last accessed on: 2019-12-03T20:05:01Z
label: LaWi-Erzeuger @de
label: Producteurs agricoles @fr
label: Productores agrícolas @es
label: Produtores agrícolas @pt
label: Produttori agricoli @it
label: Сельскохоз. продукты @ru
label: 农产品生产商 @zh
label: 農業生產者 @zh-hant
label: 農産物 @ja
label: 농산물 생산자 @ko
definition: This industry involves companies that grow crops like fruits, vegetables and grain. Also includes companies that raise, breed and process livestock, such as cattle and poultry, as well as fish or shellfish. Typically, these companies do not market or package their products for retail sales but are suppliers to food manufacturing companies and other commercial customers. Excludes crops not utilized for food consumption purposes, such as ornamental plants, tobacco, cotton or rubber trees.
notation: 121010
valid from: 2014-08-08
valid till: 2020-10-03

Baked Goods
type: BicsLevel5Segment
type: Classifier
type: NamedIndividual
is level5 segment of: Bread & Bakery Products
is anachronous version of: http://data.ga-group.nl/ics/bics/121010111010
is contemporary version of: http://data.ga-group.nl/ics/bics/1210111010
is replaced by: http://data.ga-group.nl/ics/bics/2020/121010111010
is version of: http://data.ga-group.nl/ics/bics/121010111010
is version of: http://data.ga-group.nl/ics/bics/1210111010
imported on: 2026-06-08T13:03:47.798Z
last refreshed on: 2026-06-08T13:03:47.798Z
source accessed on: 2019-12-03T20:05:01Z
source last accessed on: 2019-12-03T20:05:01Z
label: Backwaren @de
label: Podutos de pastelaria e doces @pt
label: Prodotti da forno @it
label: Productos de panadería @es
label: Produits de pâtisserie @fr
label: Хлебобулочные изделия @ru
label: 烘培製品 @zh-hant
label: 烘焙食品 @zh
label: 제빵제품 @ko
label: ﾍﾞｰｶﾘｰ @ja
definition: This segment includes companies that produce baked goods, such as bread, biscuits, croutons, doughnuts, pies and pastries.
notation: 1210111010
valid from: 2014-08-08
valid till: 2020-10-03

Dry Pasta
type: BicsLevel6Segment
type: Classifier
type: NamedIndividual
is level6 segment of: Flour Products (Non-Bread)
is anachronous version of: http://data.ga-group.nl/ics/bics/121010111110
is contemporary version of: http://data.ga-group.nl/ics/bics/121011101110
is replaced by: http://data.ga-group.nl/ics/bics/2020/121010111110
is version of: http://data.ga-group.nl/ics/bics/121010111110
is version of: http://data.ga-group.nl/ics/bics/121011101110
imported on: 2026-06-08T13:03:47.798Z
last refreshed on: 2026-06-08T13:03:47.798Z
source accessed on: 2019-12-03T20:05:01Z
source last accessed on: 2019-12-03T20:05:01Z
label: Massas secas @pt
label: Pâtes sèches @fr
label: Pasta asciutta @it
label: Pasta seca @es
label: Trockenpasta @de
label: Сух. макарон. изд. @ru
label: 乾燥ﾊﾟｽﾀ @ja
label: 干粉 @zh
label: 義大利乾麵 @zh-hant
label: 건조 파스타 @ko
definition: This segment includes companies that produce dry pasta, noodles and spaghetti.
notation: 121011101110
valid from: 2014-08-08
valid till: 2020-10-03

Flour Mixes & Dough
type: BicsLevel6Segment
type: Classifier
type: NamedIndividual
is level6 segment of: Flour Products (Non-Bread)
is anachronous version of: http://data.ga-group.nl/ics/bics/121010111410
is contemporary version of: http://data.ga-group.nl/ics/bics/121011101111
is replaced by: http://data.ga-group.nl/ics/bics/2020/121010111410
is version of: http://data.ga-group.nl/ics/bics/121010111410
is version of: http://data.ga-group.nl/ics/bics/121011101111
imported on: 2026-06-08T13:03:47.798Z
last refreshed on: 2026-06-08T13:03:47.798Z
source accessed on: 2019-12-03T20:05:01Z
source last accessed on: 2019-12-03T20:05:01Z
label: Farina miscelata e Pasta @it
label: Massas e misturas de farinhas @pt
label: Mehlmischungen & Teig @de
label: Mezclas de harina y masa @es
label: Pâtes et mélanges à base de farine @fr
label: Мучные смеси и тесто @ru
label: 混合麵粉及麵糰業 @zh-hant
label: 面粉混合物与面团 @zh
label: 혼합 밀가루 & 반죽 @ko
label: ﾐｯｸｽ粉･ﾊﾟﾝ生地製造 @ja
definition: This segment includes companies that produce, or mixes raw flour and dough.
notation: 121011101111
valid from: 2014-08-08
valid till: 2020-10-03

Noodles
type: BicsLevel6Segment
type: Classifier
type: NamedIndividual
is level6 segment of: Flour Products (Non-Bread)
is anachronous version of: http://data.ga-group.nl/ics/bics/121010111111
is contemporary version of: http://data.ga-group.nl/ics/bics/121011101112
is replaced by: http://data.ga-group.nl/ics/bics/2020/121010111111
is version of: http://data.ga-group.nl/ics/bics/121010111111
is version of: http://data.ga-group.nl/ics/bics/121011101112
imported on: 2026-06-08T13:03:47.798Z
last refreshed on: 2026-06-08T13:03:47.798Z
source accessed on: 2019-12-03T20:05:01Z
source last accessed on: 2019-12-03T20:05:01Z
label: Fideos @es
label: Macarrão @pt
label: Nouilles @fr
label: Nudeln @de
label: Pasta @it
label: Лапша @ru
label: めん類 @ja
label: 面条 @zh
label: 麵類 @zh-hant
label: 면류 @ko
definition: This segment includes companies that manufacture instant noodles.
notation: 121011101112
valid from: 2014-08-08
valid till: 2020-10-03

Tortilla
type: BicsLevel6Segment
type: Classifier
type: Discontinued
type: NamedIndividual
is level6 segment of: Flour Products (Non-Bread)
is contemporary version of: http://data.ga-group.nl/ics/bics/121011101113
is version of: http://data.ga-group.nl/ics/bics/121011101113
imported on: 2026-06-08T13:03:47.798Z
last refreshed on: 2026-06-08T13:03:47.798Z
source accessed on: 2019-12-03T20:05:01Z
source last accessed on: 2019-12-03T20:05:01Z
label: Tortillas @de
label: Тортилья @ru
label: 玉米薄餅 @zh-hant
label: 玉米薄饼 @zh
label: 토르티야 @ko
label: ﾄﾙﾃｨｰﾔ @ja
definition: This segment includes companies that produce tortillas from corn flour.
notation: 121011101113
valid from: 2014-08-08
valid till: 2020-10-03

Flour Products (Non-Bread)
type: BicsLevel5Segment
type: Classifier
type: NamedIndividual
is level5 segment of: Bread & Bakery Products
is anachronous version of: http://data.ga-group.nl/ics/bics/1210101111
is contemporary version of: http://data.ga-group.nl/ics/bics/1210111011
is replaced by: http://data.ga-group.nl/ics/bics/2020/1210101111
is version of: http://data.ga-group.nl/ics/bics/1210101111
is version of: http://data.ga-group.nl/ics/bics/1210111011
imported on: 2026-06-08T13:03:47.798Z
last refreshed on: 2026-06-08T13:03:47.798Z
source accessed on: 2019-12-03T20:05:01Z
source last accessed on: 2019-12-03T20:05:01Z
label: Farinacei (non-pane) @it
label: Mehlprodukte (außer Brot) @de
label: Productos de harina (no de pan) @es
label: Produits à base de farine (hors pain) @fr
label: Produtos de farinha (exceto pães) @pt
label: Мучные изделия (не хлеб) @ru
label: 小麦製品(ﾊﾟﾝを除く) @ja
label: 面粉制品(非面包) @zh
label: 麵粉製品(非麵包） @zh-hant
label: 밀가루 식품(빵 제외) @ko
definition: This segment includes companies that produce flour products other than bread.
notation: 1210111011
valid from: 2014-08-08
valid till: 2020-10-03

Frozen Cakes & Pastries
type: BicsLevel5Segment
type: Classifier
type: NamedIndividual
is level5 segment of: Bread & Bakery Products
is anachronous version of: http://data.ga-group.nl/ics/bics/121010111011
is contemporary version of: http://data.ga-group.nl/ics/bics/1210111012
is replaced by: http://data.ga-group.nl/ics/bics/2020/121010111011
is version of: http://data.ga-group.nl/ics/bics/121010111011
is version of: http://data.ga-group.nl/ics/bics/1210111012
imported on: 2026-06-08T13:03:47.798Z
last refreshed on: 2026-06-08T13:03:47.798Z
source accessed on: 2019-12-03T20:05:01Z
source last accessed on: 2019-12-03T20:05:01Z
label: Bolos congelados e doces @pt
label: Gâteaux et pâtisseries congelés @fr
label: Pasteles congelados y productos @es
label: Prod torte e paste surgelate @it
label: Tiefkühltorten & -backwaren @de
label: Замороженные торты и пирожные @ru
label: 冷冻蛋糕和甜点 @zh
label: 冷凍蛋糕及酥餅 @zh-hant
label: 冷凍ｹｰｷ･焼菓子 @ja
label: 냉동 케이크 및 페이스트리 @ko
definition: This segment includes companies that produce cakes, pastries and other baked goods that are frozen for mass distribution.
notation: 1210111012
valid from: 2014-08-08
valid till: 2020-10-03

Bread & Bakery Products
type: BicsLevel4SubIndustry
type: Classifier
type: NamedIndividual
is sub industry of: Packaged Food
is anachronous version of: http://data.ga-group.nl/ics/bics/1210101110
is contemporary version of: http://data.ga-group.nl/ics/bics/12101110
is replaced by: http://data.ga-group.nl/ics/bics/2020/1210101110
is version of: http://data.ga-group.nl/ics/bics/1210101110
is version of: http://data.ga-group.nl/ics/bics/12101110
imported on: 2026-06-08T13:03:47.798Z
last refreshed on: 2026-06-08T13:03:47.798Z
source accessed on: 2019-12-03T20:05:01Z
source last accessed on: 2019-12-03T20:05:01Z
label: Brot- & Backwaren @de
label: Pain et produits de boulangerie @fr
label: Pane e prodotti di panificio @it
label: Productos de pan y repostería @es
label: Produtos de panificadora e pães @pt
label: Хлеб и хлебобулочные изделия @ru
label: 面包与烘焙制品 @zh
label: 麵包及烘培製品 @zh-hant
label: 제빵제과 제품 @ko
label: ﾊﾟﾝ/ﾍﾞｰｶﾘｰ製品 @ja
definition: This industry subgroup includes companies that provide baked bread goods directly to consumers.
notation: 12101110
valid from: 2014-08-08
valid till: 2020-10-03

Flavoring Syrup & Concentrate
type: BicsLevel5Segment
type: Classifier
type: NamedIndividual
is level5 segment of: Condiments
is anachronous version of: http://data.ga-group.nl/ics/bics/121010111411
is contemporary version of: http://data.ga-group.nl/ics/bics/1210111110
is replaced by: http://data.ga-group.nl/ics/bics/2020/121010111411
is version of: http://data.ga-group.nl/ics/bics/121010111411
is version of: http://data.ga-group.nl/ics/bics/1210111110
imported on: 2026-06-08T13:03:47.798Z
last refreshed on: 2026-06-08T13:03:47.798Z
source accessed on: 2019-12-03T20:05:01Z
source last accessed on: 2019-12-03T20:05:01Z
label: Geschmackssirup & Konzentrate @de
label: Miel de sabores y concentrada @es
label: Sciroppi e concentrati @it
label: Sirops et concentrés aromatiques @fr
label: Xarope de sabor e concentrado @pt
label: Ароматические сиропы и концентраты @ru
label: 調味糖漿及濃縮汁 @zh-hant
label: 调味糖浆与原汁 @zh
label: 시럽 & 농축제품 @ko
label: ﾌﾚｰﾊﾞｰｼﾛｯﾌﾟ･濃縮飲料製造業 @ja
definition: This segment includes companies that produce syrup drink concentrates that are used in fountain drinks or soft drinks.
notation: 1210111110
valid from: 2014-08-08
valid till: 2020-10-03

Mayonnaise & Other Sauces
type: BicsLevel5Segment
type: Classifier
type: Discontinued
type: NamedIndividual
is level5 segment of: Condiments
is contemporary version of: http://data.ga-group.nl/ics/bics/1210111111
is version of: http://data.ga-group.nl/ics/bics/1210111111
imported on: 2026-06-08T13:03:47.798Z
last refreshed on: 2026-06-08T13:03:47.798Z
source accessed on: 2019-12-03T20:05:01Z
source last accessed on: 2019-12-03T20:05:01Z
label: Maionese e altre salse @it
label: Maionese e outros molhos @pt
label: Mayonesas y otras salsas @es
label: Mayonnaise & andere Soßen @de
label: Mayonnaise et autres sauces @fr
label: Майонез и другие соусы @ru
label: 沙拉酱与其他酱汁 @zh
label: 美乃滋及其他佐料 @zh-hant
label: 마요네스 & 기타 소스 @ko
label: ﾏﾖﾈｰｽﾞ･その他ｿｰｽ製造業 @ja
definition: This segment includes companies that produce mayonnaise, salad dressing, vinegar, mustard, soy sauce and other prepared sauces.
notation: 1210111111
valid from: 2014-08-08
valid till: 2020-10-03

Spice & Extract
type: BicsLevel5Segment
type: Classifier
type: NamedIndividual
is level5 segment of: Condiments
is anachronous version of: http://data.ga-group.nl/ics/bics/121010111412
is contemporary version of: http://data.ga-group.nl/ics/bics/1210111112
is replaced by: http://data.ga-group.nl/ics/bics/2020/121010111412
is version of: http://data.ga-group.nl/ics/bics/121010111412
is version of: http://data.ga-group.nl/ics/bics/1210111112
imported on: 2026-06-08T13:03:47.798Z
last refreshed on: 2026-06-08T13:03:47.798Z
source accessed on: 2019-12-03T20:05:01Z
source last accessed on: 2019-12-03T20:05:01Z
label: Especias/extrac @es
label: Extraits et épices @fr
label: Gewürze & Extrakte @de
label: Spezie ed estratti @it
label: Temperos e extratos @pt
label: Приправы и экстракты @ru
label: 香辛料与提取物 @zh
label: 香辛料･ｴｷｽ製造業 @ja
label: 香���與香精 @zh-hant
label: 향신료 & 추출물 @ko
definition: This segment includes companies that produce spices, salt and seasonings.
notation: 1210111112
valid from: 2014-08-08
valid till: 2020-10-03

Condiments
type: BicsLevel4SubIndustry
type: Classifier
type: NamedIndividual
is sub industry of: Packaged Food
is anachronous version of: http://data.ga-group.nl/ics/bics/1210101112
is contemporary version of: http://data.ga-group.nl/ics/bics/12101111
is replaced by: http://data.ga-group.nl/ics/bics/2020/1210101112
is version of: http://data.ga-group.nl/ics/bics/1210101112
is version of: http://data.ga-group.nl/ics/bics/12101111
imported on: 2026-06-08T13:03:47.798Z
last refreshed on: 2026-06-08T13:03:47.798Z
source accessed on: 2019-12-03T20:05:01Z
source last accessed on: 2019-12-03T20:05:01Z
label: Condimenti @it
label: Condimentos @es
label: Würzen @de
label: Приправы @ru
label: 調味品 @zh-hant
label: 调味品 @zh
label: 香辛料･その他食品製造 @ja
label: 조미료 @ko
definition: This industry subgroup includes companies that manufacture condiments.
notation: 12101111
valid from: 2014-08-08
valid till: 2020-10-03

Beurre
type: BicsLevel5Segment
type: Classifier
type: NamedIndividual
is level5 segment of: Dairy & Egg Products
is anachronous version of: http://data.ga-group.nl/ics/bics/121010111310
is contemporary version of: http://data.ga-group.nl/ics/bics/1210111210
is replaced by: http://data.ga-group.nl/ics/bics/2020/121010111310
is version of: http://data.ga-group.nl/ics/bics/121010111310
is version of: http://data.ga-group.nl/ics/bics/1210111210
imported on: 2026-06-08T13:03:47.798Z
last refreshed on: 2026-06-08T13:03:47.798Z
source accessed on: 2019-12-03T20:05:01Z
source last accessed on: 2019-12-03T20:05:01Z
label: Burro @it
label: Butter
label: Manteiga @pt
label: Mantequilla @es
label: Сливочное масло @ru
label: 奶油 @zh-hant
label: 黄油 @zh
label: 버터 @ko
label: ﾊﾞﾀｰ @ja
definition: This segment includes companies that produce butter. It does not include companies that produce margarine.
notation: 1210111210
valid from: 2014-08-08
valid till: 2020-10-03

Cheese
type: BicsLevel5Segment
type: Classifier
type: NamedIndividual
is level5 segment of: Dairy & Egg Products
is anachronous version of: http://data.ga-group.nl/ics/bics/121010111311
is contemporary version of: http://data.ga-group.nl/ics/bics/1210111211
is replaced by: http://data.ga-group.nl/ics/bics/2020/121010111311
is version of: http://data.ga-group.nl/ics/bics/121010111311
is version of: http://data.ga-group.nl/ics/bics/1210111211
imported on: 2026-06-08T13:03:47.798Z
last refreshed on: 2026-06-08T13:03:47.798Z
source accessed on: 2019-12-03T20:05:01Z
source last accessed on: 2019-12-03T20:05:01Z
label: Formaggio @it
label: Fromages @fr
label: Käse @de
label: Queijo @pt
label: Queso @es
label: Сыр @ru
label: 乳酪 @zh
label: 치즈 @ko
label: ﾁｰｽﾞ @ja
definition: This segment includes companies that produce all types of cheese.
notation: 1210111211
valid from: 2014-08-08
valid till: 2020-10-03

Dry & Condensed Dairy Products
type: BicsLevel5Segment
type: Classifier
type: NamedIndividual
is level5 segment of: Dairy & Egg Products
is anachronous version of: http://data.ga-group.nl/ics/bics/121010111312
is contemporary version of: http://data.ga-group.nl/ics/bics/1210111212
is replaced by: http://data.ga-group.nl/ics/bics/2020/121010111312
is version of: http://data.ga-group.nl/ics/bics/121010111312
is version of: http://data.ga-group.nl/ics/bics/1210111212
imported on: 2026-06-08T13:03:47.798Z
last refreshed on: 2026-06-08T13:03:47.798Z
source accessed on: 2019-12-03T20:05:01Z
source last accessed on: 2019-12-03T20:05:01Z
label: Latticini condensati e secchi @it
label: Productos de leche en polvo y condensada @es
label: Produits laitiers secs et condensés @fr
label: Produtos lácteos desidratados e condensados @pt
label: Trockene & kondensierte Milchprodukte @de
label: Сух. и сгущ. молочные продукты @ru
label: 乾燥、濃縮乳品 @zh-hant
label: 乾燥･濃縮乳製品 @ja
label: 干制、浓缩奶制品 @zh
label: 건조 & 농축 낙농제품 @ko
definition: This segment includes companies that produce dry and condensed dairy, such as powdered milk and dulce de leche.
notation: 1210111212
valid from: 2014-08-08
valid till: 2020-10-03

Eggs
type: BicsLevel5Segment
type: Classifier
type: NamedIndividual
is level5 segment of: Dairy & Egg Products
is anachronous version of: http://data.ga-group.nl/ics/bics/121010111313
is contemporary version of: http://data.ga-group.nl/ics/bics/1210111213
is replaced by: http://data.ga-group.nl/ics/bics/2020/121010111313
is version of: http://data.ga-group.nl/ics/bics/121010111313
is version of: http://data.ga-group.nl/ics/bics/1210111213
imported on: 2026-06-08T13:03:47.798Z
last refreshed on: 2026-06-08T13:03:47.798Z
source accessed on: 2019-12-03T20:05:01Z
source last accessed on: 2019-12-03T20:05:01Z
label: Eier @de
label: Huevos @es
label: Oeufs @fr
label: Ovoso @pt
label: Uova @it
label: Яйца @ru
label: 蛋 @zh-hant
label: 蛋类 @zh
label: 養鶏･鶏卵業 @ja
label: 계란집하업 @ko
definition: This segment includes companies that produce poultry eggs.
notation: 1210111213
valid from: 2014-08-08
valid till: 2020-10-03

Fluid Milk
type: BicsLevel5Segment
type: Classifier
type: NamedIndividual
is level5 segment of: Dairy & Egg Products
is anachronous version of: http://data.ga-group.nl/ics/bics/121010111314
is contemporary version of: http://data.ga-group.nl/ics/bics/1210111214
is replaced by: http://data.ga-group.nl/ics/bics/2020/121010111314
is version of: http://data.ga-group.nl/ics/bics/121010111314
is version of: http://data.ga-group.nl/ics/bics/1210111214
imported on: 2026-06-08T13:03:47.798Z
last refreshed on: 2026-06-08T13:03:47.798Z
source accessed on: 2019-12-03T20:05:01Z
source last accessed on: 2019-12-03T20:05:01Z
label: Flüssige Milch @de
label: Lait de consommation @fr
label: Latte liquido @it
label: Leche fluida @es
label: Leite fluido @pt
label: Жидкое молоко @ru
label: 乳製品 @ja
label: 液态牛奶 @zh
label: 液態乳品 @zh-hant
label: 액상시유 @ko
definition: This segment includes companies that produce milk, non-frozen yogurt, cream, buttermilk and cottage cheese. It does not include companies that produce soy-based products.
notation: 1210111214
valid from: 2014-08-08
valid till: 2020-10-03

Ice Cream
type: BicsLevel5Segment
type: Classifier
type: NamedIndividual
is level5 segment of: Dairy & Egg Products
is anachronous version of: http://data.ga-group.nl/ics/bics/121010111315
is contemporary version of: http://data.ga-group.nl/ics/bics/1210111215
is replaced by: http://data.ga-group.nl/ics/bics/2020/121010111315
is version of: http://data.ga-group.nl/ics/bics/121010111315
is version of: http://data.ga-group.nl/ics/bics/1210111215
imported on: 2026-06-08T13:03:47.798Z
last refreshed on: 2026-06-08T13:03:47.798Z
source accessed on: 2019-12-03T20:05:01Z
source last accessed on: 2019-12-03T20:05:01Z
label: Eiscreme @de
label: Gelato @it
label: Glaces @fr
label: Helados @es
label: Sorvete @pt
label: Мороженое @ru
label: 冰淇淋 @zh
label: 빙과류 @ko
label: ｱｲｽｸﾘｰﾑ @ja
definition: This segment includes companies that produce ice cream, sherbet, frozen yogurt, custard and any other frozen desserts.
notation: 1210111215
valid from: 2014-08-08
valid till: 2020-10-03

Dairy & Egg Products
type: BicsLevel4SubIndustry
type: Classifier
type: NamedIndividual
is sub industry of: Packaged Food
is anachronous version of: http://data.ga-group.nl/ics/bics/1210101113
is contemporary version of: http://data.ga-group.nl/ics/bics/12101112
is replaced by: http://data.ga-group.nl/ics/bics/2020/1210101113
is version of: http://data.ga-group.nl/ics/bics/1210101113
is version of: http://data.ga-group.nl/ics/bics/12101112
imported on: 2026-06-08T13:03:47.798Z
last refreshed on: 2026-06-08T13:03:47.798Z
source accessed on: 2019-12-03T20:05:01Z
source last accessed on: 2019-12-03T20:05:01Z
label: Aves de corral y huevos @es
label: Milch- & Eierprodukte @de
label: Prodotti uova lattiero-caseari @it
label: Produits laitiers et oeufs @fr
label: Produtos lácteos e ovos @pt
label: Молочные продукты и яйца @ru
label: 乳品及蛋品 @zh-hant
label: 乳製品 @ja
label: 奶制品与蛋类产品 @zh
label: 낙농 & 달걀 제품 @ko
definition: This industry subgroup includes companies that process dairy products.
notation: 12101112
valid from: 2014-08-08
valid till: 2020-10-03

Food Ingredients
type: BicsLevel4SubIndustry
type: Classifier
type: NamedIndividual
is sub industry of: Packaged Food
is anachronous version of: http://data.ga-group.nl/ics/bics/1210101114
is contemporary version of: http://data.ga-group.nl/ics/bics/12101113
is replaced by: http://data.ga-group.nl/ics/bics/2020/1210101114
is version of: http://data.ga-group.nl/ics/bics/1210101114
is version of: http://data.ga-group.nl/ics/bics/12101113
imported on: 2026-06-08T13:03:47.798Z
last refreshed on: 2026-06-08T13:03:47.798Z
source accessed on: 2019-12-03T20:05:01Z
source last accessed on: 2019-12-03T20:05:01Z
label: Ingrédients alimentaires @fr
label: Ingredientes de alimentos @es
label: Ingredientes para alimentos @pt
label: Ingredienti alimentari @it
label: Lebensmittelzutaten @de
label: Пищевые ингредиенты @ru
label: 食品原料 @zh-hant
label: 食品成分 @ja
label: 食品配料 @zh
label: 식품성분 @ko
definition: This industry subgroup includes companies that manufacture and produce basic food ingredients. Includes food ingredients (both natural and artificial), food additives (both natural and artificial) and color additives (both natural and artificial).
notation: 12101113
valid from: 2014-08-08
valid till: 2020-10-03

Fruit & Vegetable Canning
type: BicsLevel6Segment
type: Classifier
type: NamedIndividual
is level6 segment of: Canned Food
is anachronous version of: http://data.ga-group.nl/ics/bics/12101011151010
is contemporary version of: http://data.ga-group.nl/ics/bics/121011141010
is replaced by: http://data.ga-group.nl/ics/bics/2020/12101011151010
is version of: http://data.ga-group.nl/ics/bics/12101011151010
is version of: http://data.ga-group.nl/ics/bics/121011141010
imported on: 2026-06-08T13:03:47.798Z
last refreshed on: 2026-06-08T13:03:47.798Z
source accessed on: 2019-12-03T20:05:01Z
source last accessed on: 2019-12-03T20:05:01Z
label: Enlatado de fruta y verduras @es
label: Enlatados de vegetais e frutas @pt
label: Früchte- & Gemüsekonservierung @de
label: Inscatolamento frutta e verdura @it
label: Mise en conserve de fruits et légumes @fr
label: Консервирование фруктов и овощей @ru
label: 果物･野菜かん詰 @ja
label: 水果及蔬菜罐装 @zh
label: 蔬果罐裝 @zh-hant
label: 과일 & 채소 통조림 @ko
definition: This segment includes companies that can fruit and vegetable products.
notation: 121011141010
valid from: 2014-08-08
valid till: 2020-10-03

Specialty Canning
type: BicsLevel6Segment
type: Classifier
type: NamedIndividual
is level6 segment of: Canned Food
is anachronous version of: http://data.ga-group.nl/ics/bics/12101011151011
is contemporary version of: http://data.ga-group.nl/ics/bics/121011141011
is replaced by: http://data.ga-group.nl/ics/bics/2020/12101011151011
is version of: http://data.ga-group.nl/ics/bics/12101011151011
is version of: http://data.ga-group.nl/ics/bics/121011141011
imported on: 2026-06-08T13:03:47.798Z
last refreshed on: 2026-06-08T13:03:47.798Z
source accessed on: 2019-12-03T20:05:01Z
source last accessed on: 2019-12-03T20:05:01Z
label: Conservas de especialidades @pt
label: Conserve spécialités @fr
label: Enlatado especial @es
label: Inscat spec aliment @it
label: Spezialkonservierung @de
label: Консервирование деликатесов @ru
label: 特殊かん詰 @ja
label: 特殊罐装 @zh
label: 特殊食品罐裝 @zh-hant
label: 특수식품통조림제조 @ko
definition: This segment includes companies that can products, excluding fruits and vegetables.
notation: 121011141011
valid from: 2014-08-08
valid till: 2020-10-03

Canned Food
type: BicsLevel5Segment
type: Classifier
type: NamedIndividual
is level5 segment of: Frozen, Canned & Perish Food
is anachronous version of: http://data.ga-group.nl/ics/bics/121010111510
is contemporary version of: http://data.ga-group.nl/ics/bics/1210111410
is replaced by: http://data.ga-group.nl/ics/bics/2020/121010111510
is version of: http://data.ga-group.nl/ics/bics/121010111510
is version of: http://data.ga-group.nl/ics/bics/1210111410
imported on: 2026-06-08T13:03:47.798Z
last refreshed on: 2026-06-08T13:03:47.798Z
source accessed on: 2019-12-03T20:05:01Z
source last accessed on: 2019-12-03T20:05:01Z
label: Alimentos enlatados @es
label: Aliments en boîte @fr
label: Cibo in scatola @it
label: Konserven @de
label: Консервы @ru
label: 缶詰食品 @ja
label: 罐装食品 @zh
label: 罐裝食品業 @zh-hant
label: 통조림식품 @ko
definition: This segment includes companies that can fruits, vegetables and other food products excluding seafood.
notation: 1210111410
valid from: 2014-08-08
valid till: 2020-10-03

Dried & Dehydrated Food
type: BicsLevel5Segment
type: Classifier
type: NamedIndividual
is level5 segment of: Frozen, Canned & Perish Food
is anachronous version of: http://data.ga-group.nl/ics/bics/121010111511
is contemporary version of: http://data.ga-group.nl/ics/bics/1210111411
is replaced by: http://data.ga-group.nl/ics/bics/2020/121010111511
is version of: http://data.ga-group.nl/ics/bics/121010111511
is version of: http://data.ga-group.nl/ics/bics/1210111411
imported on: 2026-06-08T13:03:47.798Z
last refreshed on: 2026-06-08T13:03:47.798Z
source accessed on: 2019-12-03T20:05:01Z
source last accessed on: 2019-12-03T20:05:01Z
label: Alim secos y deshidratados @es
label: Alimenti secchi e disidratati @it
label: Alimentos secos e desidratados @pt
label: Aliments séchés et déshydratés @fr
label: Getrocknete & Trockennahrung @de
label: Сушен. прод. питания @ru
label: 乾燥及脫水食品 @zh-hant
label: 乾燥野菜 @ja
label: 干燥及脱水食品 @zh
label: 건조 & 탈수식품 @ko
definition: This segment includes companies that produce dried fruits, vegetables and other food products, such as dried figs, dates, apricots, raisins and prunes.
notation: 1210111411
valid from: 2014-08-08
valid till: 2020-10-03

Frozen Fruit, Juice & Vegetable
type: BicsLevel6Segment
type: Classifier
type: NamedIndividual
is level6 segment of: Frozen Food
is anachronous version of: http://data.ga-group.nl/ics/bics/12101011151210
is contemporary version of: http://data.ga-group.nl/ics/bics/121011141210
is replaced by: http://data.ga-group.nl/ics/bics/2020/12101011151210
is version of: http://data.ga-group.nl/ics/bics/12101011151210
is version of: http://data.ga-group.nl/ics/bics/121011141210
imported on: 2026-06-08T13:03:47.798Z
last refreshed on: 2026-06-08T13:03:47.798Z
source accessed on: 2019-12-03T20:05:01Z
source last accessed on: 2019-12-03T20:05:01Z
label: Fruits, jus et légumes congelés @fr
label: Fruta, jugo y verdura congelada @es
label: Frutas congeladas, sucos e vegetais @pt
label: Frutta, succhi e verdure surgelati @it
label: Gefrorene Früchte, Säfte & Gemüse @de
label: Замороженные фрукты, соки и овощи @ru
label: 冷冻水果、果汁及蔬菜 @zh
label: 冷凍果実/果汁/野菜 @ja
label: 冷凍水果/果汁/蔬菜 @zh-hant
label: 냉동과일, 주스 & 채소 @ko
definition: This segment includes companies that produce frozen fruit, vegetables and concentrated juices.
notation: 121011141210
valid from: 2014-08-08
valid till: 2020-10-03

Frozen Specialty Food
type: BicsLevel6Segment
type: Classifier
type: NamedIndividual
is level6 segment of: Frozen Food
is anachronous version of: http://data.ga-group.nl/ics/bics/12101011151211
is contemporary version of: http://data.ga-group.nl/ics/bics/121011141211
is replaced by: http://data.ga-group.nl/ics/bics/2020/12101011151211
is version of: http://data.ga-group.nl/ics/bics/12101011151211
is version of: http://data.ga-group.nl/ics/bics/121011141211
imported on: 2026-06-08T13:03:47.798Z
last refreshed on: 2026-06-08T13:03:47.798Z
source accessed on: 2019-12-03T20:05:01Z
source last accessed on: 2019-12-03T20:05:01Z
label: Aalimentos especializados congelados @pt
label: Alimentos congelados especiales @es
label: Gefrorene Delikatessen @de
label: Spécialités culinaires congelées @fr
label: Specialità alimentari surgelate @it
label: Замороженные деликатесные изделия @ru
label: 冷冻特色食品 @zh
label: 冷凍高級食品製造 @ja
label: 特殊冷凍食品 @zh-hant
label: 냉동 특수식품 @ko
definition: This segment includes companies that produce other frozen specialty foods, such as dinners, noodles and microwave dishes.
notation: 121011141211
valid from: 2014-08-08
valid till: 2020-10-03

Frozen Food
type: BicsLevel5Segment
type: Classifier
type: NamedIndividual
is level5 segment of: Frozen, Canned & Perish Food
is anachronous version of: http://data.ga-group.nl/ics/bics/121010111512
is contemporary version of: http://data.ga-group.nl/ics/bics/1210111412
is replaced by: http://data.ga-group.nl/ics/bics/2020/121010111512
is version of: http://data.ga-group.nl/ics/bics/121010111512
is version of: http://data.ga-group.nl/ics/bics/1210111412
imported on: 2026-06-08T13:03:47.798Z
last refreshed on: 2026-06-08T13:03:47.798Z
source accessed on: 2019-12-03T20:05:01Z
source last accessed on: 2019-12-03T20:05:01Z
label: Alimentari surgelate @it
label: Alimentos congelados @es
label: Aliments congelés @fr
label: Comida congelada @pt
label: Gefrierkost @de
label: Замороженные продукты питания @ru
label: 冷冻食品 @zh
label: 冷凍食品 @ja
label: 냉동식품 @ko
definition: This segment includes companies that produce frozen, packaged food products.
notation: 1210111412
valid from: 2014-08-08
valid till: 2020-10-03

Perishable Prepared Food
type: BicsLevel5Segment
type: Classifier
type: NamedIndividual
is level5 segment of: Frozen, Canned & Perish Food
is anachronous version of: http://data.ga-group.nl/ics/bics/121010111513
is contemporary version of: http://data.ga-group.nl/ics/bics/1210111413
is replaced by: http://data.ga-group.nl/ics/bics/2020/121010111513
is version of: http://data.ga-group.nl/ics/bics/121010111513
is version of: http://data.ga-group.nl/ics/bics/1210111413
imported on: 2026-06-08T13:03:47.798Z
last refreshed on: 2026-06-08T13:03:47.798Z
source accessed on: 2019-12-03T20:05:01Z
source last accessed on: 2019-12-03T20:05:01Z
label: Alimenti deperibili preparati @it
label: Alimento fresco consumo inmediato @es
label: Alimentos perecíveis @pt
label: Aliments préparés périssables @fr
label: Leicht verderbliche LM @de
label: Готовые скоропортящиеся пищевые продукты @ru
label: 新鮮調理食品 @zh-hant
label: 易腐调制食品 @zh
label: 調理済み生鮮食品製���業 @ja
label: 무방부제 가공식품 @ko
definition: This segment includes companies that prepare and package perishable foods, such as salads, pizza, macaroni and boxed lunches. This does not include companies that produce frozen or microwave meals.
notation: 1210111413
valid from: 2014-08-08
valid till: 2020-10-03

Fresh & Frozen Seafood Process
type: BicsLevel6Segment
type: Classifier
type: NamedIndividual
is level6 segment of: Seafood Products Prep & Pkg
is anachronous version of: http://data.ga-group.nl/ics/bics/12101011151410
is contemporary version of: http://data.ga-group.nl/ics/bics/121011141410
is replaced by: http://data.ga-group.nl/ics/bics/2020/12101011151410
is version of: http://data.ga-group.nl/ics/bics/12101011151410
is version of: http://data.ga-group.nl/ics/bics/121011141410
imported on: 2026-06-08T13:03:47.798Z
last refreshed on: 2026-06-08T13:03:47.798Z
source accessed on: 2019-12-03T20:05:01Z
source last accessed on: 2019-12-03T20:05:01Z
label: Elaboración de mariscos frescos y congelados @es
label: Lav frutti mare freschi e surgelati @it
label: Processamento de frutos do mar frescos e congelados @pt
label: Trait fruits de mer frais/congelés @fr
label: Verarbeitung von frischen & gefrorenen Meeresfrüchten @de
label: Переработка свежих и заморож. морепродуктов @ru
label: 新鮮及冷凍海產處理 @zh-hant
label: 新鲜及冷冻海鲜加工 @zh
label: 海鮮品･冷凍水産品加工 @ja
label: 신선 & 냉동수산물 가공업 @ko
definition: This segment includes companies that prepare and package fresh and frozen seafood products.
notation: 121011141410
valid from: 2014-08-08
valid till: 2020-10-03

Seafood Canning
type: BicsLevel6Segment
type: Classifier
type: NamedIndividual
is level6 segment of: Seafood Products Prep & Pkg
is anachronous version of: http://data.ga-group.nl/ics/bics/12101011151411
is contemporary version of: http://data.ga-group.nl/ics/bics/121011141411
is replaced by: http://data.ga-group.nl/ics/bics/2020/12101011151411
is version of: http://data.ga-group.nl/ics/bics/12101011151411
is version of: http://data.ga-group.nl/ics/bics/121011141411
imported on: 2026-06-08T13:03:47.798Z
last refreshed on: 2026-06-08T13:03:47.798Z
source accessed on: 2019-12-03T20:05:01Z
source last accessed on: 2019-12-03T20:05:01Z
label: Condit fruits de mer @fr
label: Conservas de frutos do mar @pt
label: Enlatado mariscos @es
label: Fischkonservierung @de
label: Inscatol frutti mare @it
label: Консервирование морепродуктов @ru
label: 水産品かん詰 @ja
label: 海產罐裝 @zh-hant
label: 海鲜罐装 @zh
label: 수산물통조림제조 @ko
definition: This segment includes companies that can purchased seafood products but are not involved in fishing or fish farming.
notation: 121011141411
valid from: 2014-08-08
valid till: 2020-10-03

Seafood Products Prep & Pkg
type: BicsLevel5Segment
type: Classifier
type: NamedIndividual
is level5 segment of: Frozen, Canned & Perish Food
is anachronous version of: http://data.ga-group.nl/ics/bics/121010111514
is contemporary version of: http://data.ga-group.nl/ics/bics/1210111414
is replaced by: http://data.ga-group.nl/ics/bics/2020/121010111514
is version of: http://data.ga-group.nl/ics/bics/121010111514
is version of: http://data.ga-group.nl/ics/bics/1210111414
imported on: 2026-06-08T13:03:47.798Z
last refreshed on: 2026-06-08T13:03:47.798Z
source accessed on: 2019-12-03T20:05:01Z
source last accessed on: 2019-12-03T20:05:01Z
label: Emb e prep produtos de frutos do mar @pt
label: Préparation et emball fruits de mer @fr
label: Prep e conf frutti di mare @it
label: Preparación y empaquetado de productos de mariscos @es
label: Vorbereitung & Verpackung von Meeresfrüchten @de
label: Приготовл. и упаковка морепродуктов @ru
label: 水産品加工･包装 @ja
label: 海產調理及包裝 @zh-hant
label: 海鲜产品调理与包装 @zh
label: 해산물제품 가공 & 포장 @ko
definition: This segment includes companies that prepare and package seafood, including fish and shellfish.
notation: 1210111414
valid from: 2014-08-08
valid till: 2020-10-03

Frozen, Canned & Perish Food
type: BicsLevel4SubIndustry
type: Classifier
type: NamedIndividual
is sub industry of: Packaged Food
is anachronous version of: http://data.ga-group.nl/ics/bics/1210101115
is contemporary version of: http://data.ga-group.nl/ics/bics/12101114
is replaced by: http://data.ga-group.nl/ics/bics/2020/1210101115
is version of: http://data.ga-group.nl/ics/bics/1210101115
is version of: http://data.ga-group.nl/ics/bics/12101114
imported on: 2026-06-08T13:03:47.798Z
last refreshed on: 2026-06-08T13:03:47.798Z
source accessed on: 2019-12-03T20:05:01Z
source last accessed on: 2019-12-03T20:05:01Z
label: Alimentari surgelati, in scatola e deperibili @it
label: Alimentos congelados, enlatados y perecederos @es
label: Alimentos perecíveis, enlatados e congelados @pt
label: Aliments congelés, en boîte et périssables @fr
label: Gefrorene, konservierte & verderbliche LM @de
label: Замороженные, консерв. и скоропортящ. продукты питания @ru
label: 冷冻、罐装及易腐食品 @zh
label: 冷凍、罐裝及生鮮產品 @zh-hant
label: 冷凍･缶詰･生鮮食品 @ja
label: 냉동, 통조림 & 무방부제 식품 @ko
definition: This industry subgroup includes companies that produce canned fruits, vegetables and other food products, excluding seafood.
notation: 12101114
valid from: 2014-08-08
valid till: 2020-10-03

Cured & Smoked Meat
type: BicsLevel5Segment
type: Classifier
type: NamedIndividual
is level5 segment of: Meat Products
is anachronous version of: http://data.ga-group.nl/ics/bics/121010111610
is contemporary version of: http://data.ga-group.nl/ics/bics/1210111510
is replaced by: http://data.ga-group.nl/ics/bics/2020/121010111610
is version of: http://data.ga-group.nl/ics/bics/121010111610
is version of: http://data.ga-group.nl/ics/bics/1210111510
imported on: 2026-06-08T13:03:47.798Z
last refreshed on: 2026-06-08T13:03:47.798Z
source accessed on: 2019-12-03T20:05:01Z
source last accessed on: 2019-12-03T20:05:01Z
label: Carne curada ahumada @es
label: Carne lavorata affum @it
label: Carnes curadas e defumadas @pt
label: Sülze & geräuchertes Fleisch @de
label: Viande salée et fumée @fr
label: Консервированное и копченое мясо @ru
label: 塩漬･燻製肉 @ja
label: 腌制及熏制肉品 @zh
label: 醃漬及煙燻肉品 @zh-hant
label: 염지 & 훈제육 @ko
definition: This segment includes companies that process cured and smoked meat, typically for use in sandwiches. Such meats include bacon, bologna, hams, pastrami and canned meats.
notation: 1210111510
valid from: 2014-08-08
valid till: 2020-10-03

Fresh Meat Products
type: BicsLevel5Segment
type: Classifier
type: NamedIndividual
is level5 segment of: Meat Products
is anachronous version of: http://data.ga-group.nl/ics/bics/121010111611
is contemporary version of: http://data.ga-group.nl/ics/bics/1210111511
is replaced by: http://data.ga-group.nl/ics/bics/2020/121010111611
is version of: http://data.ga-group.nl/ics/bics/121010111611
is version of: http://data.ga-group.nl/ics/bics/1210111511
imported on: 2026-06-08T13:03:47.798Z
last refreshed on: 2026-06-08T13:03:47.798Z
source accessed on: 2019-12-03T20:05:01Z
source last accessed on: 2019-12-03T20:05:01Z
label: Frischfleischprodukte @de
label: Prodotti carne fresca @it
label: Productos de carne fresca @es
label: Produits à base de viande fraîche @fr
label: Produtos carne fresca @pt
label: Продукты из свежего мяса @ru
label: 生鮮肉品 @zh-hant
label: 生鮮肉製品 @ja
label: 生鲜肉制品 @zh
label: 신선 육류제품 @ko
definition: This segment includes companies that produce and package fresh meat. These are the products produced from animal slaughtering and processing but have been packaged for retail sales.
notation: 1210111511
valid from: 2014-08-08
valid till: 2020-10-03

Meat Type Chicken Products
type: BicsLevel5Segment
type: Classifier
type: NamedIndividual
is level5 segment of: Meat Products
is anachronous version of: http://data.ga-group.nl/ics/bics/121010111612
is contemporary version of: http://data.ga-group.nl/ics/bics/1210111512
is replaced by: http://data.ga-group.nl/ics/bics/2020/121010111612
is version of: http://data.ga-group.nl/ics/bics/121010111612
is version of: http://data.ga-group.nl/ics/bics/1210111512
imported on: 2026-06-08T13:03:47.798Z
last refreshed on: 2026-06-08T13:03:47.798Z
source accessed on: 2019-12-03T20:05:01Z
source last accessed on: 2019-12-03T20:05:01Z
label: Derivati pollami @it
label: Fleischartige Hühnerprodukte @de
label: Productos de carne de pollo @es
label: Produits de volaille de type viande @fr
label: Produtos de carne de frango @pt
label: Мясная куриная продукция @ru
label: 肉用鶏生産 @ja
label: 雞肉類產品 @zh-hant
label: 鸡肉类产品 @zh
label: 육용종 양계 제품 @ko
definition: This segment includes companies that produce and package chicken meat products. These packaged chicken products are typically pre-prepared chicken dishes. Includes chicken nuggets, sauced chicken wings, cordon bleu, chicken kebabs and chicken patties.
notation: 1210111512
valid from: 2014-08-08
valid till: 2020-10-03

Meat Products
type: BicsLevel4SubIndustry
type: Classifier
type: NamedIndividual
is sub industry of: Packaged Food
is anachronous version of: http://data.ga-group.nl/ics/bics/1210101116
is contemporary version of: http://data.ga-group.nl/ics/bics/12101115
is replaced by: http://data.ga-group.nl/ics/bics/2020/1210101116
is version of: http://data.ga-group.nl/ics/bics/1210101116
is version of: http://data.ga-group.nl/ics/bics/12101115
imported on: 2026-06-08T13:03:47.798Z
last refreshed on: 2026-06-08T13:03:47.798Z
source accessed on: 2019-12-03T20:05:01Z
source last accessed on: 2019-12-03T20:05:01Z
label: Fleischprodukte @de
label: Prodotti a base carne @it
label: Productos de carne @es
label: Produits à base de viande @fr
label: Produtos de carne @pt
label: Мясные прод. @ru
label: 肉制品 @zh
label: 肉類產品 @zh-hant
label: 食肉製品 @ja
label: 육류제품 @ko
definition: This industry subgroup includes companies that produce packaged meat products.
notation: 12101115
valid from: 2014-08-08
valid till: 2020-10-03

Pet Food
type: BicsLevel4SubIndustry
type: Classifier
type: NamedIndividual
is sub industry of: Packaged Food
is anachronous version of: http://data.ga-group.nl/ics/bics/1210101117
is contemporary version of: http://data.ga-group.nl/ics/bics/12101116
is replaced by: http://data.ga-group.nl/ics/bics/2020/1210101117
is version of: http://data.ga-group.nl/ics/bics/1210101117
is version of: http://data.ga-group.nl/ics/bics/12101116
imported on: 2026-06-08T13:03:47.798Z
last refreshed on: 2026-06-08T13:03:47.798Z
source accessed on: 2019-12-03T20:05:01Z
source last accessed on: 2019-12-03T20:05:01Z
label: Alimentos para animais de estimação @pt
label: Alimentos para mascotas @es
label: Cibo per animali domestici @it
label: Heimtierfutter @de
label: Nourriture pour animaux @fr
label: Корм для животных @ru
label: 宠物食品 @zh
label: 寵物食品 @zh-hant
label: 애완동물식품 @ko
label: ﾍﾟｯﾄﾌｰﾄﾞ製造 @ja
definition: This industry subgroup includes companies that produce food consumed by household pets.
notation: 12101116
valid from: 2014-08-08
valid till: 2020-10-03

Chocolate Confectionery
type: BicsLevel6Segment
type: Classifier
type: NamedIndividual
is level6 segment of: Confectionery
is anachronous version of: http://data.ga-group.nl/ics/bics/12101011181010
is contemporary version of: http://data.ga-group.nl/ics/bics/121011171010
is replaced by: http://data.ga-group.nl/ics/bics/2020/12101011181010
is version of: http://data.ga-group.nl/ics/bics/12101011181010
is version of: http://data.ga-group.nl/ics/bics/121011171010
imported on: 2026-06-08T13:03:47.798Z
last refreshed on: 2026-06-08T13:03:47.798Z
source accessed on: 2019-12-03T20:05:01Z
source last accessed on: 2019-12-03T20:05:01Z
label: Confiseries en chocolat @fr
label: Confitería de chocolate @es
label: Doces de chocolate @pt
label: Pasticceria al cioccolato @it
label: Schokoladenkonfekt @de
label: Шоколадные изделия @ru
label: 巧克力及糖果 @zh-hant
label: 巧克力糖果 @zh
label: 초콜릿과자 @ko
label: ﾁｮｺﾚｰﾄ･菓子 @ja
definition: This segment includes companies that produce confectionary products, such as candies and other desserts primarily made of chocolate.
notation: 121011171010
valid from: 2014-08-08
valid till: 2020-10-03

Non-Chocolate Confection
type: BicsLevel6Segment
type: Classifier
type: NamedIndividual
is level6 segment of: Confectionery
is anachronous version of: http://data.ga-group.nl/ics/bics/12101011181011
is contemporary version of: http://data.ga-group.nl/ics/bics/121011171011
is replaced by: http://data.ga-group.nl/ics/bics/2020/12101011181011
is version of: http://data.ga-group.nl/ics/bics/12101011181011
is version of: http://data.ga-group.nl/ics/bics/121011171011
imported on: 2026-06-08T13:03:47.798Z
last refreshed on: 2026-06-08T13:03:47.798Z
source accessed on: 2019-12-03T20:05:01Z
source last accessed on: 2019-12-03T20:05:01Z
label: Confección no de chocolate @es
label: Confiseries non chocolatées @fr
label: Doces não de chocolate @pt
label: Konfekt (o. Schokolade) @de
label: Pasticceria non cioccolato @it
label: Производство нешоколадных кондитерских изделий @ru
label: 非巧克力糖果 @zh
label: 非ﾁｮｺﾚｰﾄ菓子 @ja
label: 초콜릿외과자 @ko
definition: This segment includes companies that produce confectionary products, such as candies and other desserts that are not primarily made of chocolate. Such products include chewing gum.
notation: 121011171011
valid from: 2014-08-08
valid till: 2020-10-03

Confectionery
type: BicsLevel5Segment
type: Classifier
type: NamedIndividual
is level5 segment of: Snack Food & Confectionary
is anachronous version of: http://data.ga-group.nl/ics/bics/121010111810
is contemporary version of: http://data.ga-group.nl/ics/bics/1210111710
is replaced by: http://data.ga-group.nl/ics/bics/2020/121010111810
is version of: http://data.ga-group.nl/ics/bics/121010111810
is version of: http://data.ga-group.nl/ics/bics/1210111710
imported on: 2026-06-08T13:03:47.798Z
last refreshed on: 2026-06-08T13:03:47.798Z
source accessed on: 2019-12-03T20:05:01Z
source last accessed on: 2019-12-03T20:05:01Z
label: Bolos e doces @pt
label: Confiseries @fr
label: Confitería @es
label: Dolciumi @it
label: Süßwaren @de
label: Кондитерские изделия @ru
label: 糖果 @zh
label: 菓子製造業 @ja
label: 제과 @ko
definition: This segment includes companies that produce confectionary products.
notation: 1210111710
valid from: 2014-08-08
valid till: 2020-10-03

Breakfast Cereal
type: BicsLevel6Segment
type: Classifier
type: NamedIndividual
is level6 segment of: Snack Food
is anachronous version of: http://data.ga-group.nl/ics/bics/12101011181110
is contemporary version of: http://data.ga-group.nl/ics/bics/121011171110
is replaced by: http://data.ga-group.nl/ics/bics/2020/12101011181110
is version of: http://data.ga-group.nl/ics/bics/12101011181110
is version of: http://data.ga-group.nl/ics/bics/121011171110
imported on: 2026-06-08T13:03:47.798Z
last refreshed on: 2026-06-08T13:03:47.798Z
source accessed on: 2019-12-03T20:05:01Z
source last accessed on: 2019-12-03T20:05:01Z
label: Céréales pour le petit déjeuner @fr
label: Cereal de café da manhã @pt
label: Cereales para el desayuno @es
label: Cereali prima colazione @it
label: Frühstückszerealien @de
label: Зерновые прдкт 'для завтрака' @ru
label: 早餐穀類食品 @zh-hant
label: 早餐谷类食品 @zh
label: 朝食用ｼﾘｱﾙ @ja
label: 식사용시리얼 @ko
definition: This segment includes companies that produce breakfast cereals, such as granola, oatmeal and corn-based cereals.
notation: 121011171110
valid from: 2014-08-08
valid till: 2020-10-03

Cookies & Crackers
type: BicsLevel6Segment
type: Classifier
type: NamedIndividual
is level6 segment of: Snack Food
is anachronous version of: http://data.ga-group.nl/ics/bics/12101011181111
is contemporary version of: http://data.ga-group.nl/ics/bics/121011171111
is replaced by: http://data.ga-group.nl/ics/bics/2020/12101011181111
is version of: http://data.ga-group.nl/ics/bics/12101011181111
is version of: http://data.ga-group.nl/ics/bics/121011171111
imported on: 2026-06-08T13:03:47.798Z
last refreshed on: 2026-06-08T13:03:47.798Z
source accessed on: 2019-12-03T20:05:01Z
source last accessed on: 2019-12-03T20:05:01Z
label: Biscoitos e bolachas @pt
label: Biscotti e cracker @it
label: Biscuits et crackers @fr
label: Galletas dulces y saladas @es
label: Gebäck & Cracker @de
label: Печенье и крекеры @ru
label: 曲奇与饼干 @zh
label: 餅乾 @zh-hant
label: 쿠키 & 크래커 @ko
label: ｸｯｷｰ､ｸﾗｯｶｰ @ja
definition: This segment includes companies that produce cookies and crackers.
notation: 121011171111
valid from: 2014-08-08
valid till: 2020-10-03

Roast Nuts & Peanut Butter
type: BicsLevel6Segment
type: Classifier
type: NamedIndividual
is level6 segment of: Snack Food
is anachronous version of: http://data.ga-group.nl/ics/bics/12101011181112
is contemporary version of: http://data.ga-group.nl/ics/bics/121011171112
is replaced by: http://data.ga-group.nl/ics/bics/2020/12101011181112
is version of: http://data.ga-group.nl/ics/bics/12101011181112
is version of: http://data.ga-group.nl/ics/bics/121011171112
imported on: 2026-06-08T13:03:47.798Z
last refreshed on: 2026-06-08T13:03:47.798Z
source accessed on: 2019-12-03T20:05:01Z
source last accessed on: 2019-12-03T20:05:01Z
label: Amendoim torrado e pasta de amendoim @pt
label: Geröstete Nüsse & Erdnussbutter @de
label: Noci tostate e burro di arachidi @it
label: Noix grillées et beurre de cacahuètes @fr
label: Nueces horneadas y crema de cacahuate @es
label: Жаренные орехи и арахисовое масло @ru
label: 烘烤坚果与花生酱 @zh
label: 烘烤核果及花生醬 @zh-hant
label: 구운 땅콩 & 땅콩버터 @ko
label: ﾛｰｽﾄﾅｯﾂ/ﾋﾟｰﾅｯﾂﾊﾞﾀｰ製造業 @ja
definition: This segment includes companies that roast and preserve nuts, nut foods or pastes like peanut butter.
notation: 121011171112
valid from: 2014-08-08
valid till: 2020-10-03

Other Snack Food
type: BicsLevel6Segment
type: Classifier
type: Discontinued
type: NamedIndividual
is level6 segment of: Snack Food
is contemporary version of: http://data.ga-group.nl/ics/bics/121011171113
is version of: http://data.ga-group.nl/ics/bics/121011171113
imported on: 2026-06-08T13:03:47.798Z
last refreshed on: 2026-06-08T13:03:47.798Z
source accessed on: 2019-12-03T20:05:01Z
source last accessed on: 2019-12-03T20:05:01Z
label: Altri stuzzichini @it
label: Autres aliments à grignoter @fr
label: Otros alimentos livianos @es
label: Outros petiscos @pt
label: Sonstige Snacks @de
label: Прочие снэки @ru
label: その他ｽﾅｯｸ食品製造 @ja
label: 其他休闲食品 @zh
label: 其它零食 @zh-hant
label: 기타 스낵류 @ko
definition: This segment includes companies that produce snack foods not elsewhere classified. Such foods include potato chips, corn chips and pretzels.
notation: 121011171113
valid from: 2014-08-08
valid till: 2020-10-03

Snack Food
type: BicsLevel5Segment
type: Classifier
type: NamedIndividual
is level5 segment of: Snack Food & Confectionary
is anachronous version of: http://data.ga-group.nl/ics/bics/121010111811
is contemporary version of: http://data.ga-group.nl/ics/bics/1210111711
is replaced by: http://data.ga-group.nl/ics/bics/2020/121010111811
is version of: http://data.ga-group.nl/ics/bics/121010111811
is version of: http://data.ga-group.nl/ics/bics/1210111711
imported on: 2026-06-08T13:03:47.798Z
last refreshed on: 2026-06-08T13:03:47.798Z
source accessed on: 2019-12-03T20:05:01Z
source last accessed on: 2019-12-03T20:05:01Z
label: Alimentos livianos @es
label: Aliments à grignoter @fr
label: Petiscos @pt
label: Snackartikel @de
label: Stuzzichini @it
label: Снэки @ru
label: 休闲食品 @zh
label: 零食 @zh-hant
label: 스낵류 @ko
label: ｽﾅｯｸ食品製造 @ja
definition: This segment includes companies that manufacture snack foods.
notation: 1210111711
valid from: 2014-08-08
valid till: 2020-10-03

Snack Food & Confectionary
type: BicsLevel4SubIndustry
type: Classifier
type: NamedIndividual
is sub industry of: Packaged Food
is anachronous version of: http://data.ga-group.nl/ics/bics/1210101118
is contemporary version of: http://data.ga-group.nl/ics/bics/12101117
is replaced by: http://data.ga-group.nl/ics/bics/2020/1210101118
is version of: http://data.ga-group.nl/ics/bics/1210101118
is version of: http://data.ga-group.nl/ics/bics/12101117
imported on: 2026-06-08T13:03:47.798Z
last refreshed on: 2026-06-08T13:03:47.798Z
source accessed on: 2019-12-03T20:05:01Z
source last accessed on: 2019-12-03T20:05:01Z
label: Alimentos livianos y confección @es
label: Aliments à grignoter et bonbons @fr
label: Knabberartikel & Süßwaren @de
label: Petiscos e bolos e doces @pt
label: Stuzzichini e dolci @it
label: Произв. снэков и сладостей @ru
label: 零食与糖果 @zh
label: 零食及糖果 @zh-hant
label: 스낵 & 제과 @ko
label: ｽﾅｯｸ食品･菓子 @ja
definition: This industry subgroup includes companies that produce snack foods and confectionary products.
notation: 12101117
valid from: 2014-08-08
valid till: 2020-10-03

Other Food
type: BicsLevel4SubIndustry
type: Classifier
type: Discontinued
type: NamedIndividual
is sub industry of: Packaged Food
is contemporary version of: http://data.ga-group.nl/ics/bics/12101118
is version of: http://data.ga-group.nl/ics/bics/12101118
imported on: 2026-06-08T13:03:47.798Z
last refreshed on: 2026-06-08T13:03:47.798Z
source accessed on: 2019-12-03T20:05:01Z
source last accessed on: 2019-12-03T20:05:01Z
label: Altri alimentari @it
label: Autres aliments @fr
label: Otros alimentos @es
label: Outros alimentos @pt
label: Sonst. Lebensmittel @de
label: Др. пищевые продукты @ru
label: その他食品製造業 @ja
label: 其他食品 @zh
label: 기타식품 @ko
definition: This industry subgroup includes companies that produce packaged food products not elsewhere classified.
notation: 12101118
valid from: 2014-08-08
valid till: 2020-10-03

Packaged Food
type: BicsLevel3Industry
type: Classifier
type: NamedIndividual
is industry of: Consumer Products
is anachronous version of: http://data.ga-group.nl/ics/bics/12101011
is contemporary version of: http://data.ga-group.nl/ics/bics/121011
is replaced by: http://data.ga-group.nl/ics/bics/2020/12101011
is version of: http://data.ga-group.nl/ics/bics/12101011
is version of: http://data.ga-group.nl/ics/bics/121011
imported on: 2026-06-08T13:03:47.798Z
last refreshed on: 2026-06-08T13:03:47.798Z
source accessed on: 2019-12-03T20:05:01Z
source last accessed on: 2019-12-03T20:05:01Z
label: Alimentos embalados @pt
label: Alimentos envasados @es
label: Aliments emballés @fr
label: Cibi confezionati @it
label: Verpackte Lebensmittel @de
label: Фасованные пищевые продукты @ru
label: 加工食品 @ja
label: 包装食品 @zh
label: 包裝食品製造業 @zh-hant
label: 포장 식품 @ko
definition: This industry includes companies that process and package foods like bread, dairy, frozen foods, snack foods and condiments for retail consumer consumption. It also includes packaged pet foods. Typically, these products are packaged and marketed for retail consumers and can be found on food retailer's shelves.
notation: 121011
valid from: 2014-08-08
valid till: 2020-10-03

Brewers
type: BicsLevel5Segment
type: Classifier
type: NamedIndividual
is level5 segment of: Alcoholic Beverages
is anachronous version of: http://data.ga-group.nl/ics/bics/1210111010
is contemporary version of: http://data.ga-group.nl/ics/bics/1210121010
is replaced by: http://data.ga-group.nl/ics/bics/2020/1210111010
is version of: http://data.ga-group.nl/ics/bics/1210111010
is version of: http://data.ga-group.nl/ics/bics/1210121010
imported on: 2026-06-08T13:03:47.798Z
last refreshed on: 2026-06-08T13:03:47.798Z
source accessed on: 2019-12-03T20:05:01Z
source last accessed on: 2019-12-03T20:05:01Z
label: Brasseries @fr
label: Brauer @de
label: Cerveceros @es
label: Cervejarias @pt
label: Fabbriche di birra @it
label: Пивоварни @ru
label: 啤酒厂 @zh
label: 醸造業 @ja
label: 釀酒商 @zh-hant
label: 양조업 @ko
definition: This segment includes companies that produce beer, malt liquor and non-alcoholic beer.
notation: 1210121010
valid from: 2014-08-08
valid till: 2020-10-03

Distillers
type: BicsLevel5Segment
type: Classifier
type: NamedIndividual
is level5 segment of: Alcoholic Beverages
is anachronous version of: http://data.ga-group.nl/ics/bics/1210111011
is contemporary version of: http://data.ga-group.nl/ics/bics/1210121011
is replaced by: http://data.ga-group.nl/ics/bics/2020/1210111011
is version of: http://data.ga-group.nl/ics/bics/1210111011
is version of: http://data.ga-group.nl/ics/bics/1210121011
imported on: 2026-06-08T13:03:47.798Z
last refreshed on: 2026-06-08T13:03:47.798Z
source accessed on: 2019-12-03T20:05:01Z
source last accessed on: 2019-12-03T20:05:01Z
label: Alambique @pt
label: Brenner @de
label: Destiladores @es
label: Distillerie @it
label: Distilleries @fr
label: Спиртоводочные заводы @ru
label: 蒸留酒製造業 @ja
label: 蒸餾酒 @zh-hant
label: 酿酒厂 @zh
label: 증류주 제조업 @ko
definition: This segment includes companies that produce distilled, potable, alcoholic beverages like bourbon, scotch and gin.
notation: 1210121011
valid from: 2014-08-08
valid till: 2020-10-03

Vintners
type: BicsLevel5Segment
type: Classifier
type: NamedIndividual
is level5 segment of: Alcoholic Beverages
is anachronous version of: http://data.ga-group.nl/ics/bics/1210111012
is contemporary version of: http://data.ga-group.nl/ics/bics/1210121012
is replaced by: http://data.ga-group.nl/ics/bics/2020/1210111012
is version of: http://data.ga-group.nl/ics/bics/1210111012
is version of: http://data.ga-group.nl/ics/bics/1210121012
imported on: 2026-06-08T13:03:47.798Z
last refreshed on: 2026-06-08T13:03:47.798Z
source accessed on: 2019-12-03T20:05:01Z
source last accessed on: 2019-12-03T20:05:01Z
label: Négociants en vin @fr
label: Vinificatori @it
label: Viticultores @es
label: Winzer @de
label: Винные заводы @ru
label: 葡萄酒商 @zh
label: 葡萄酒業 @zh-hant
label: 양조업 @ko
label: ﾜｲﾝ醸造業者 @ja
definition: This segment includes companies that produce wine, brandies and other fruit-based alcoholic drinks.
notation: 1210121012
valid from: 2014-08-08
valid till: 2020-10-03

Alcoholic Beverages
type: BicsLevel4SubIndustry
type: Classifier
type: NamedIndividual
is sub industry of: Beverages
is anachronous version of: http://data.ga-group.nl/ics/bics/12101110
is contemporary version of: http://data.ga-group.nl/ics/bics/12101210
is replaced by: http://data.ga-group.nl/ics/bics/2020/12101110
is version of: http://data.ga-group.nl/ics/bics/12101110
is version of: http://data.ga-group.nl/ics/bics/12101210
imported on: 2026-06-08T13:03:47.798Z
last refreshed on: 2026-06-08T13:03:47.798Z
source accessed on: 2019-12-03T20:05:01Z
source last accessed on: 2019-12-03T20:05:01Z
label: Alkoholische Getränke @de
label: Bebidas alcoólicas @pt
label: Bebidas alcohólicas @es
label: Bevande alcoliche @it
label: Boissons alcoolisées @fr
label: Алкогольные напитки @ru
label: 含酒精饮料 @zh
label: 酒精飲料 @zh-hant
label: 알콜음료 @ko
label: ｱﾙｺｰﾙ飲料 @ja
definition: This industry subgroup includes companies that brew beer, manufacture wine and brandies, and distill and mix liquors.
notation: 12101210
valid from: 2014-08-08
valid till: 2020-10-03

Coffee
type: BicsLevel6Segment
type: Classifier
type: NamedIndividual
is level6 segment of: Coffee & Tea
is anachronous version of: http://data.ga-group.nl/ics/bics/1210111110
is contemporary version of: http://data.ga-group.nl/ics/bics/121012111010
is replaced by: http://data.ga-group.nl/ics/bics/2020/1210111110
is version of: http://data.ga-group.nl/ics/bics/1210111110
is version of: http://data.ga-group.nl/ics/bics/121012111010
imported on: 2026-06-08T13:03:47.798Z
last refreshed on: 2026-06-08T13:03:47.798Z
source accessed on: 2019-12-03T20:05:01Z
source last accessed on: 2019-12-03T20:05:01Z
label: Café @es
label: Caffè @it
label: Kaffee @de
label: Кофе @ru
label: 咖啡 @zh
label: 커피 @ko
label: ｺｰﾋｰ製造 @ja
definition: This segment includes companies that manufacture and roast coffee.
notation: 121012111010
valid from: 2014-08-08
valid till: 2020-10-03

Tea
type: BicsLevel6Segment
type: Classifier
type: NamedIndividual
is level6 segment of: Coffee & Tea
is anachronous version of: http://data.ga-group.nl/ics/bics/1210111111
is contemporary version of: http://data.ga-group.nl/ics/bics/121012111011
is replaced by: http://data.ga-group.nl/ics/bics/2020/1210111111
is version of: http://data.ga-group.nl/ics/bics/1210111111
is version of: http://data.ga-group.nl/ics/bics/121012111011
imported on: 2026-06-08T13:03:47.798Z
last refreshed on: 2026-06-08T13:03:47.798Z
source accessed on: 2019-12-03T20:05:01Z
source last accessed on: 2019-12-03T20:05:01Z
label: Chá @pt
label: Tè @it
label: Té @es
label: Tee @de
label: Thé @fr
label: Чай @ru
label: 茶 @zh
label: 茶製造 @ja
label: 차류 @ko
definition: This segment includes companies that manufacture bagged teas, boxed teas and loose-leaf teas.
notation: 121012111011
valid from: 2014-08-08
valid till: 2020-10-03

Coffee & Tea
type: BicsLevel5Segment
type: Classifier
type: Discontinued
type: NamedIndividual
is level5 segment of: Non-Alcoholic Beverages
is contemporary version of: http://data.ga-group.nl/ics/bics/1210121110
is version of: http://data.ga-group.nl/ics/bics/1210121110
imported on: 2026-06-08T13:03:47.798Z
last refreshed on: 2026-06-08T13:03:47.798Z
source accessed on: 2019-12-03T20:05:01Z
source last accessed on: 2019-12-03T20:05:01Z
label: Café e chá @pt
label: Caffè e tè @it
label: Kaffee & Tee @de
label: Té y café @es
label: Thé et café @fr
label: Чай и кофе @ru
label: 咖啡与茶 @zh
label: 咖啡及茶 @zh-hant
label: 커피 & 차류 @ko
label: ｺｰﾋｰ･紅茶製造業 @ja
definition: This segment includes companies that produce coffee and tea products.
notation: 1210121110
valid from: 2014-08-08
valid till: 2020-10-03

Bottled Water
type: BicsLevel6Segment
type: Classifier
type: NamedIndividual
is level6 segment of: Soft Drink & Ice
is anachronous version of: http://data.ga-group.nl/ics/bics/1210111112
is contemporary version of: http://data.ga-group.nl/ics/bics/121012111110
is replaced by: http://data.ga-group.nl/ics/bics/2020/1210111112
is version of: http://data.ga-group.nl/ics/bics/1210111112
is version of: http://data.ga-group.nl/ics/bics/121012111110
imported on: 2026-06-08T13:03:47.798Z
last refreshed on: 2026-06-08T13:03:47.798Z
source accessed on: 2019-12-03T20:05:01Z
source last accessed on: 2019-12-03T20:05:01Z
label: Acqua imbottigliata @it
label: Agua embotellada @es
label: Eau en bouteille @fr
label: Tafelwasser @de
label: Água engarrafada @pt
label: Вода в бутылках @ru
label: びん詰飲料水製造業 @ja
label: 瓶装水 @zh
label: 罐裝水 @zh-hant
label: 생수 @ko
definition: This segment includes companies that manufacture bottled water.
notation: 121012111110
valid from: 2014-08-08
valid till: 2020-10-03

Ice
type: BicsLevel6Segment
type: Classifier
type: Discontinued
type: NamedIndividual
is level6 segment of: Soft Drink & Ice
is contemporary version of: http://data.ga-group.nl/ics/bics/121012111111
is version of: http://data.ga-group.nl/ics/bics/121012111111
imported on: 2026-06-08T13:03:47.798Z
last refreshed on: 2026-06-08T13:03:47.798Z
source accessed on: 2019-12-03T20:05:01Z
source last accessed on: 2019-12-03T20:05:01Z
label: Eis @de
label: Gelo @pt
label: Ghiaccio @it
label: Glace @fr
label: Лед @ru
label: 冰 @zh
label: 製氷業 @ja
label: 얼음 @ko
definition: This segment includes companies that manufacture ice.
notation: 121012111111
valid from: 2014-08-08
valid till: 2020-10-03

Soft Drink
type: BicsLevel6Segment
type: Classifier
type: NamedIndividual
is level6 segment of: Soft Drink & Ice
is anachronous version of: http://data.ga-group.nl/ics/bics/1210111113
is contemporary version of: http://data.ga-group.nl/ics/bics/121012111112
is replaced by: http://data.ga-group.nl/ics/bics/2020/1210111113
is version of: http://data.ga-group.nl/ics/bics/1210111113
is version of: http://data.ga-group.nl/ics/bics/121012111112
imported on: 2026-06-08T13:03:47.798Z
last refreshed on: 2026-06-08T13:03:47.798Z
source accessed on: 2019-12-03T20:05:01Z
source last accessed on: 2019-12-03T20:05:01Z
label: Bibite @it
label: Boissons gazeuses @fr
label: Erfrischungsgetränk @de
label: Refrescos @es
label: Refrigerantes @pt
label: Безалкогольные напитки @ru
label: 清涼飲料製造業 @ja
label: 软饮料 @zh
label: 非酒類飲料 @zh-hant
label: 청량음료 @ko
definition: This segment includes companies that manufacture soft drinks and juice beverages. Also known as soda, pop and carbonated beverage.
notation: 121012111112
valid from: 2014-08-08
valid till: 2020-10-03

Soft Drink & Ice
type: BicsLevel5Segment
type: Classifier
type: Discontinued
type: NamedIndividual
is level5 segment of: Non-Alcoholic Beverages
is contemporary version of: http://data.ga-group.nl/ics/bics/1210121111
is version of: http://data.ga-group.nl/ics/bics/1210121111
imported on: 2026-06-08T13:03:47.798Z
last refreshed on: 2026-06-08T13:03:47.798Z
source accessed on: 2019-12-03T20:05:01Z
source last accessed on: 2019-12-03T20:05:01Z
label: Bibite e ghiaccio @it
label: Boissons gazeuses et glace @fr
label: Erfrischungsgetränk & Eis @de
label: Refrescos y hielo @es
label: Refrigerante e gelo @pt
label: Безалкогольные напитки и лед @ru
label: 清涼飲料･氷製造 @ja
label: 软饮料与冰 @zh
label: 非酒類飲料及冰 @zh-hant
label: 청량음료 & 얼음 @ko
definition: This segment includes companies that manufacture soft drinks, bottled water and ice.
notation: 1210121111
valid from: 2014-08-08
valid till: 2020-10-03

Non-Alcoholic Beverages
type: BicsLevel4SubIndustry
type: Classifier
type: NamedIndividual
is sub industry of: Beverages
is anachronous version of: http://data.ga-group.nl/ics/bics/12101111
is contemporary version of: http://data.ga-group.nl/ics/bics/12101211
is replaced by: http://data.ga-group.nl/ics/bics/2020/12101111
is version of: http://data.ga-group.nl/ics/bics/12101111
is version of: http://data.ga-group.nl/ics/bics/12101211
imported on: 2026-06-08T13:03:47.798Z
last refreshed on: 2026-06-08T13:03:47.798Z
source accessed on: 2019-12-03T20:05:01Z
source last accessed on: 2019-12-03T20:05:01Z
label: Alkoholfreie Getränke @de
label: Bebidas não alcoólicas @pt
label: Bebidas no alcohólicas @es
label: Bevande non alcoliche @it
label: Boissons non alcoolisées @fr
label: Напитки - безалкогольные @ru
label: 非酒精飲料 @zh-hant
label: 非酒精饮料 @zh
label: 非ｱﾙｺｰﾙ飲料 @ja
label: 무알콜 음료 @ko
definition: This industry subgroup includes companies that manufacture non-alcoholic beverages as well as coffee and tea. Excludes dairy based beverages (see Dairy & Egg Products).
notation: 12101211
valid from: 2014-08-08
valid till: 2020-10-03

Beverages
type: BicsLevel3Industry
type: Classifier
type: NamedIndividual
is industry of: Consumer Products
is anachronous version of: http://data.ga-group.nl/ics/bics/121011
is contemporary version of: http://data.ga-group.nl/ics/bics/121012
is replaced by: http://data.ga-group.nl/ics/bics/2020/121011
is version of: http://data.ga-group.nl/ics/bics/121011
is version of: http://data.ga-group.nl/ics/bics/121012
imported on: 2026-06-08T13:03:47.798Z
last refreshed on: 2026-06-08T13:03:47.798Z
source accessed on: 2019-12-03T20:05:01Z
source last accessed on: 2019-12-03T20:05:01Z
label: Bebidas @es
label: Bevande @it
label: Boissons @fr
label: Getränke @de
label: Напитки @ru
label: 飲料 @ja
label: 饮料 @zh
label: 음료 @ko
definition: This industry includes companies that manufacture alcoholic beverages, non-alcoholic beverages, coffees and teas.
notation: 121012
valid from: 2014-08-08
valid till: 2020-10-03

Tobacco Farming
type: BicsLevel4SubIndustry
type: Classifier
type: NamedIndividual
is sub industry of: Tobacco
is anachronous version of: http://data.ga-group.nl/ics/bics/1210121010
is contemporary version of: http://data.ga-group.nl/ics/bics/12101310
is replaced by: http://data.ga-group.nl/ics/bics/2020/1210121010
is version of: http://data.ga-group.nl/ics/bics/1210121010
is version of: http://data.ga-group.nl/ics/bics/12101310
imported on: 2026-06-08T13:03:47.798Z
last refreshed on: 2026-06-08T13:03:47.798Z
source accessed on: 2019-12-03T20:05:01Z
source last accessed on: 2019-12-03T20:05:01Z
label: Anbau von Tabak @de
label: Coltivazione tabacco @it
label: Cultivo de tabaco @pt
label: Cultivo del tabaco @es
label: Culture du tabac @fr
label: Выращивание табака @ru
label: たばこ作農業 @ja
label: 烟叶种植 @zh
label: 菸草栽培 @zh-hant
label: 담배 재배업 @ko
definition: This industry subgroup includes companies that grow tobacco plants.
notation: 12101310
valid from: 2014-08-08
valid till: 2020-10-03

Tobacco Leaf
type: BicsLevel4SubIndustry
type: Classifier
type: NamedIndividual
is sub industry of: Tobacco
is anachronous version of: http://data.ga-group.nl/ics/bics/1210121011
is contemporary version of: http://data.ga-group.nl/ics/bics/12101311
is replaced by: http://data.ga-group.nl/ics/bics/2020/1210121011
is version of: http://data.ga-group.nl/ics/bics/1210121011
is version of: http://data.ga-group.nl/ics/bics/12101311
imported on: 2026-06-08T13:03:47.798Z
last refreshed on: 2026-06-08T13:03:47.798Z
source accessed on: 2019-12-03T20:05:01Z
source last accessed on: 2019-12-03T20:05:01Z
label: Feuilles de tabac @fr
label: Folha de tabaco @pt
label: Hoja de tabaco @es
label: Tabacco fogl @it
label: Tabakblatt @de
label: Листья табака @ru
label: たばこ葉 @ja
label: 烟叶 @zh
label: 菸葉 @zh-hant
label: 담배 잎 @ko
definition: This industry subgroup includes companies that process tobacco leaf from which other companies produce finished tobacco products.
notation: 12101311
valid from: 2014-08-08
valid till: 2020-10-03

Cigar
type: BicsLevel5Segment
type: Classifier
type: NamedIndividual
is level5 segment of: Tobacco Products
is anachronous version of: http://data.ga-group.nl/ics/bics/121012101210
is contemporary version of: http://data.ga-group.nl/ics/bics/1210131210
is replaced by: http://data.ga-group.nl/ics/bics/2020/121012101210
is version of: http://data.ga-group.nl/ics/bics/121012101210
is version of: http://data.ga-group.nl/ics/bics/1210131210
imported on: 2026-06-08T13:03:47.798Z
last refreshed on: 2026-06-08T13:03:47.798Z
source accessed on: 2019-12-03T20:05:01Z
source last accessed on: 2019-12-03T20:05:01Z
label: Cigares @fr
label: Prod charutos @pt
label: Puros @es
label: Sigari @it
label: Zigarren @de
label: Сигары @ru
label: 葉巻製造業 @ja
label: 雪茄 @zh
label: 시가 @ko
definition: This segment includes companies that manufacture cigars.
notation: 1210131210
valid from: 2014-08-08
valid till: 2020-10-03

Cigarette
type: BicsLevel5Segment
type: Classifier
type: NamedIndividual
is level5 segment of: Tobacco Products
is anachronous version of: http://data.ga-group.nl/ics/bics/121012101211
is contemporary version of: http://data.ga-group.nl/ics/bics/1210131211
is replaced by: http://data.ga-group.nl/ics/bics/2020/121012101211
is version of: http://data.ga-group.nl/ics/bics/121012101211
is version of: http://data.ga-group.nl/ics/bics/1210131211
imported on: 2026-06-08T13:03:47.798Z
last refreshed on: 2026-06-08T13:03:47.798Z
source accessed on: 2019-12-03T20:05:01Z
source last accessed on: 2019-12-03T20:05:01Z
label: Cigarettes @fr
label: Cigarrillos @es
label: Cigarros @pt
label: Sigarette @it
label: Zigaretten @de
label: Сигареты @ru
label: 卷烟 @zh
label: 紙巻たばこ製造業 @ja
label: 香菸 @zh-hant
label: 담배 @ko
definition: This segment includes companies that manufacture cigarettes.
notation: 1210131211
valid from: 2014-08-08
valid till: 2020-10-03

Smokeless Tobacco
type: BicsLevel5Segment
type: Classifier
type: NamedIndividual
is level5 segment of: Tobacco Products
is anachronous version of: http://data.ga-group.nl/ics/bics/121012101212
is contemporary version of: http://data.ga-group.nl/ics/bics/1210131212
is replaced by: http://data.ga-group.nl/ics/bics/2020/121012101212
is version of: http://data.ga-group.nl/ics/bics/121012101212
is version of: http://data.ga-group.nl/ics/bics/1210131212
imported on: 2026-06-08T13:03:47.798Z
last refreshed on: 2026-06-08T13:03:47.798Z
source accessed on: 2019-12-03T20:05:01Z
source last accessed on: 2019-12-03T20:05:01Z
label: Kautabak @de
label: Tabac sans fumée @fr
label: Tabacco non da fumo @it
label: Tabaco sem fumaça @pt
label: Tabaco sin combustión @es
label: Бездымный табак @ru
label: 无烟烟草 @zh
label: 無煙菸草 @zh-hant
label: 無煙ﾀﾊﾞｺ製造 @ja
label: 무연담배 @ko
definition: This segment includes companies that produce smokeless tobacco products.
notation: 1210131212
valid from: 2014-08-08
valid till: 2020-10-03

Tobacco Products
type: BicsLevel4SubIndustry
type: Classifier
type: NamedIndividual
is sub industry of: Tobacco
is anachronous version of: http://data.ga-group.nl/ics/bics/1210121012
is contemporary version of: http://data.ga-group.nl/ics/bics/12101312
is replaced by: http://data.ga-group.nl/ics/bics/2020/1210121012
is version of: http://data.ga-group.nl/ics/bics/1210121012
is version of: http://data.ga-group.nl/ics/bics/12101312
imported on: 2026-06-08T13:03:47.798Z
last refreshed on: 2026-06-08T13:03:47.798Z
source accessed on: 2019-12-03T20:05:01Z
source last accessed on: 2019-12-03T20:05:01Z
label: Prodotti del tabacco @it
label: Productos de tabaco @es
label: Produits du tabac @fr
label: Produtos de tabaco @pt
label: Tabakwaren @de
label: Табачные изделия @ru
label: たばこ製品製造 @ja
label: 烟草制品 @zh
label: 菸草品 @zh-hant
label: 담배제품 @ko
definition: This industry subgroup includes companies that produce finished consumer tobacco products.
notation: 12101312
valid from: 2014-08-08
valid till: 2020-10-03

Tobacco
type: BicsLevel3Industry
type: Classifier
type: NamedIndividual
is industry of: Consumer Products
is anachronous version of: http://data.ga-group.nl/ics/bics/12101210
is contemporary version of: http://data.ga-group.nl/ics/bics/121013
is replaced by: http://data.ga-group.nl/ics/bics/2020/12101210
is version of: http://data.ga-group.nl/ics/bics/12101210
is version of: http://data.ga-group.nl/ics/bics/121013
imported on: 2026-06-08T13:03:47.798Z
last refreshed on: 2026-06-08T13:03:47.798Z
source accessed on: 2019-12-03T20:05:01Z
source last accessed on: 2019-12-03T20:05:01Z
label: Tabac @fr
label: Tabacco @it
label: Tabaco @es
label: Tabakwaren @de
label: Табак @ru
label: たばこ @ja
label: 烟草 @zh
label: 菸草 @zh-hant
label: 담배 @ko
definition: This industry includes companies that process tobacco leaf and/or produce finished tobacco products.
notation: 121013
valid from: 2014-08-08
valid till: 2020-10-03

Electric Lamp Bulb & Parts
type: BicsLevel5Segment
type: Classifier
type: NamedIndividual
is level5 segment of: Home Products
is anachronous version of: http://data.ga-group.nl/ics/bics/1210131010
is contemporary version of: http://data.ga-group.nl/ics/bics/1210141010
is replaced by: http://data.ga-group.nl/ics/bics/2020/1210131010
is version of: http://data.ga-group.nl/ics/bics/1210131010
is version of: http://data.ga-group.nl/ics/bics/1210141010
imported on: 2026-06-08T13:03:47.798Z
last refreshed on: 2026-06-08T13:03:47.798Z
source accessed on: 2019-12-03T20:05:01Z
source last accessed on: 2019-12-03T20:05:01Z
label: Ampoule électriques et pièces @fr
label: Elektr. Lampen, Birnen & Teile @de
label: Focos y partes para lámparas @es
label: Lâmpadas e peças elétricas @pt
label: Lampadine elettriche e parti @it
label: Лампочки и з/части @ru
label: 电灯泡及零件 @zh
label: 電燈泡及其零件 @zh-hant
label: 電球･部品 @ja
label: 전기램프 전구 & 부품 @ko
definition: This segment includes companies that manufacture electric lamp bulbs and associated parts.
notation: 1210141010
valid from: 2014-08-08
valid till: 2020-10-03

Household Cleaning Products
type: BicsLevel5Segment
type: Classifier
type: NamedIndividual
is level5 segment of: Home Products
is anachronous version of: http://data.ga-group.nl/ics/bics/1210131011
is contemporary version of: http://data.ga-group.nl/ics/bics/1210141011
is replaced by: http://data.ga-group.nl/ics/bics/2020/1210131011
is version of: http://data.ga-group.nl/ics/bics/1210131011
is version of: http://data.ga-group.nl/ics/bics/1210141011
imported on: 2026-06-08T13:03:47.798Z
last refreshed on: 2026-06-08T13:03:47.798Z
source accessed on: 2019-12-03T20:05:01Z
source last accessed on: 2019-12-03T20:05:01Z
label: Articoli pulizia casa @it
label: Haushaltsreiniger @de
label: Productos domésticos de limpieza @es
label: Produits d'entretien ménager @fr
label: Produtos de limpeza domésticos @pt
label: Бытовые чистящие средства @ru
label: 家居清洁用品 @zh
label: 家庭清潔用品 @zh-hant
label: 家庭用ｸﾘｰﾆﾝｸﾞ製品 @ja
label: 가정용 청소용품 @ko
definition: This segment includes companies that manufacture household cleaning products, such as ammonia, bleaches, degreasers, disinfectants, polishes, fabric softeners, and bathroom cleaners.
notation: 1210141011
valid from: 2014-08-08
valid till: 2020-10-03

Household Batteries
type: BicsLevel5Segment
type: Classifier
type: NamedIndividual
is level5 segment of: Home Products
is anachronous version of: http://data.ga-group.nl/ics/bics/1210131012
is contemporary version of: http://data.ga-group.nl/ics/bics/1210141012
is replaced by: http://data.ga-group.nl/ics/bics/2020/1210131012
is version of: http://data.ga-group.nl/ics/bics/1210131012
is version of: http://data.ga-group.nl/ics/bics/1210141012
imported on: 2026-06-08T13:03:47.798Z
last refreshed on: 2026-06-08T13:03:47.798Z
source accessed on: 2019-12-03T20:05:01Z
source last accessed on: 2019-12-03T20:05:01Z
label: Baterías domésticas @es
label: Bateria doméstica @pt
label: Batterie uso domestico @it
label: Haushaltsbatterien @de
label: Piles à usage domestique @fr
label: Бытовые батареи @ru
label: 家庭用電池 @ja
label: 家用电池 @zh
label: 家用電池 @zh-hant
label: 가정용 전지 @ko
definition: This segment includes companies that manufacture disposable and rechargeable household batteries. Products include alkaline batteries, lithium batteries, watch batteries, and dry cell primary batteries (AAA, AA, C, D, 9V).
notation: 1210141012
valid from: 2014-08-08
valid till: 2020-10-03

Home Products
type: BicsLevel4SubIndustry
type: Classifier
type: NamedIndividual
is sub industry of: Household Products
is anachronous version of: http://data.ga-group.nl/ics/bics/12101310
is contemporary version of: http://data.ga-group.nl/ics/bics/12101410
is replaced by: http://data.ga-group.nl/ics/bics/2020/12101310
is version of: http://data.ga-group.nl/ics/bics/12101310
is version of: http://data.ga-group.nl/ics/bics/12101410
imported on: 2026-06-08T13:03:47.798Z
last refreshed on: 2026-06-08T13:03:47.798Z
source accessed on: 2019-12-03T20:05:01Z
source last accessed on: 2019-12-03T20:05:01Z
label: Prodotti per la casa @it
label: Productos para el hogar @es
label: Produits pour la maison @fr
label: Produkte fürs Haus @de
label: Produtos para o lar @pt
label: Товары для дома @ru
label: 家居產品 @zh-hant
label: 家庭用品 @zh
label: 家庭用品製造 @ja
label: 가정용품 @ko
definition: This industry subgroup includes companies that manufacture products that consumers typically use in their homes.
notation: 12101410
valid from: 2014-08-08
valid till: 2020-10-03

Cosmetics
type: BicsLevel5Segment
type: Classifier
type: NamedIndividual
is level5 segment of: Personal Care Products
is anachronous version of: http://data.ga-group.nl/ics/bics/1210131110
is contemporary version of: http://data.ga-group.nl/ics/bics/1210141110
is replaced by: http://data.ga-group.nl/ics/bics/2020/1210131110
is version of: http://data.ga-group.nl/ics/bics/1210131110
is version of: http://data.ga-group.nl/ics/bics/1210141110
imported on: 2026-06-08T13:03:47.798Z
last refreshed on: 2026-06-08T13:03:47.798Z
source accessed on: 2019-12-03T20:05:01Z
source last accessed on: 2019-12-03T20:05:01Z
label: Cosméticos @es
label: Cosmétiques @fr
label: Cosmetici @it
label: Kosmetika @de
label: Косметика @ru
label: 化妆品 @zh
label: 化妝品 @zh-hant
label: 化粧品 @ja
label: 화장품 @ko
definition: This segment includes companies that manufacture cosmetics.
notation: 1210141110
valid from: 2014-08-08
valid till: 2020-10-03

Razor & Razor Blade
type: BicsLevel5Segment
type: Classifier
type: NamedIndividual
is level5 segment of: Personal Care Products
is anachronous version of: http://data.ga-group.nl/ics/bics/1210131111
is contemporary version of: http://data.ga-group.nl/ics/bics/1210141111
is replaced by: http://data.ga-group.nl/ics/bics/2020/1210131111
is version of: http://data.ga-group.nl/ics/bics/1210131111
is version of: http://data.ga-group.nl/ics/bics/1210141111
imported on: 2026-06-08T13:03:47.798Z
last refreshed on: 2026-06-08T13:03:47.798Z
source accessed on: 2019-12-03T20:05:01Z
source last accessed on: 2019-12-03T20:05:01Z
label: Navalha e lâminas @pt
label: Rasierer & Rasierklingen @de
label: Rasoi e lame da rasoio @it
label: Rasoirs et lames de rasoir @fr
label: Rastrillos y hojas de rasurar @es
label: Бритвы и бритвенные лезвия @ru
label: かみそり及びかみそり刃 @ja
label: 刮胡刀及���片 @zh
label: 刮鬍器及刮鬍刀 @zh-hant
label: 면도기 & 면도칼 @ko
definition: This segment includes companies that manufacture razors and razor blades. Products include manual and electric razors.
notation: 1210141111
valid from: 2014-08-08
valid till: 2020-10-03

Sanitary Paper Products
type: BicsLevel5Segment
type: Classifier
type: NamedIndividual
is level5 segment of: Personal Care Products
is anachronous version of: http://data.ga-group.nl/ics/bics/1210131112
is contemporary version of: http://data.ga-group.nl/ics/bics/1210141112
is replaced by: http://data.ga-group.nl/ics/bics/2020/1210131112
is version of: http://data.ga-group.nl/ics/bics/1210131112
is version of: http://data.ga-group.nl/ics/bics/1210141112
imported on: 2026-06-08T13:03:47.798Z
last refreshed on: 2026-06-08T13:03:47.798Z
source accessed on: 2019-12-03T20:05:01Z
source last accessed on: 2019-12-03T20:05:01Z
label: Hygienepapierprodukte @de
label: Prodotti cartacei sanitari @it
label: Productos de papel sanitarios @es
label: Produits hygiéniques en papier @fr
label: Produtos de papel sanitário @pt
label: Санитарно-гигиенические изд. из бумаги @ru
label: 卫生纸制品 @zh
label: 衛生用紙 @zh-hant
label: 衛生紙製造業 @ja
label: 위생용 종이제품 @ko
definition: This segment includes companies that manufacture sanitary paper-based products. Such products include diapers, facial tissues, table napkins, toilet paper, paper towels, sanitary napkins, tampons and incontinent pads.
notation: 1210141112
valid from: 2014-08-08
valid till: 2020-10-03

Soap & Other Detergent
type: BicsLevel5Segment
type: Classifier
type: NamedIndividual
is level5 segment of: Personal Care Products
is anachronous version of: http://data.ga-group.nl/ics/bics/1210131113
is contemporary version of: http://data.ga-group.nl/ics/bics/1210141113
is replaced by: http://data.ga-group.nl/ics/bics/2020/1210131113
is version of: http://data.ga-group.nl/ics/bics/1210131113
is version of: http://data.ga-group.nl/ics/bics/1210141113
imported on: 2026-06-08T13:03:47.798Z
last refreshed on: 2026-06-08T13:03:47.798Z
source accessed on: 2019-12-03T20:05:01Z
source last accessed on: 2019-12-03T20:05:01Z
label: Jabones y otros detergentes @es
label: Sabonete e outros detergentes @pt
label: Sapone e altri detergenti @it
label: Savons et autres détergents @fr
label: Seifen & sonst. Waschmittel @de
label: Мыло и другие моющие средства @ru
label: 石鹸･その他洗剤 @ja
label: 肥皂与其他洗涤剂 @zh
label: 肥皂及其他清潔劑 @zh-hant
label: 비누 & 기타 세제 @ko
definition: This segment includes companies that manufacture soaps and detergents, such as bar soap, laundry detergent, dishwashing detergent and hand soap.
notation: 1210141113
valid from: 2014-08-08
valid till: 2020-10-03

Other Personal Care Products
type: BicsLevel5Segment
type: Classifier
type: Discontinued
type: NamedIndividual
is level5 segment of: Personal Care Products
is contemporary version of: http://data.ga-group.nl/ics/bics/1210141114
is version of: http://data.ga-group.nl/ics/bics/1210141114
imported on: 2026-06-08T13:03:47.798Z
last refreshed on: 2026-06-08T13:03:47.798Z
source accessed on: 2019-12-03T20:05:01Z
source last accessed on: 2019-12-03T20:05:01Z
label: Altri articoli cura personale @it
label: Autres produits de soins personnels @fr
label: Otros productos de cuidado personal @es
label: Outros produtos de cuidados pessoais @pt
label: Sonstige Körperpflegeprodukte @de
label: Прочие средства личной гигиены @ru
label: その他化粧品製造業 @ja
label: 其他个人护理产品 @zh
label: 其他個人護理產品 @zh-hant
label: 기타 개인관리용품 @ko
definition: This segment includes companies that manufacture other personal care products not elsewhere classified.
notation: 1210141114
valid from: 2014-08-08
valid till: 2020-10-03

Personal Care Products
type: BicsLevel4SubIndustry
type: Classifier
type: NamedIndividual
is sub industry of: Household Products
is anachronous version of: http://data.ga-group.nl/ics/bics/12101311
is contemporary version of: http://data.ga-group.nl/ics/bics/12101411
is replaced by: http://data.ga-group.nl/ics/bics/2020/12101311
is version of: http://data.ga-group.nl/ics/bics/12101311
is version of: http://data.ga-group.nl/ics/bics/12101411
imported on: 2026-06-08T13:03:47.798Z
last refreshed on: 2026-06-08T13:03:47.798Z
source accessed on: 2019-12-03T20:05:01Z
source last accessed on: 2019-12-03T20:05:01Z
label: Körperpflegeprodukte @de
label: Prodotti per la cura personale @it
label: Productos de higiene personal @es
label: Produits de soins personnels @fr
label: Produtos de cuidados pessoais @pt
label: Товары личной гигиены @ru
label: 个人护理产品 @zh
label: 個人保健用品 @zh-hant
label: 개인관리용품 @ko
label: ﾊﾟｰｿﾅﾙｹｱ用品 @ja
definition: This industry subgroup includes companies that manufacture personal hygiene products. Products include shaving preparations, hair care products, mouthwash, toothpaste, deodorant, baby powder and birth control products.
notation: 12101411
valid from: 2014-08-08
valid till: 2020-10-03

Household Products
type: BicsLevel3Industry
type: Classifier
type: NamedIndividual
is industry of: Consumer Products
is anachronous version of: http://data.ga-group.nl/ics/bics/121013
is contemporary version of: http://data.ga-group.nl/ics/bics/121014
is replaced by: http://data.ga-group.nl/ics/bics/2020/121013
is version of: http://data.ga-group.nl/ics/bics/121013
is version of: http://data.ga-group.nl/ics/bics/121014
imported on: 2026-06-08T13:03:47.798Z
last refreshed on: 2026-06-08T13:03:47.798Z
source accessed on: 2019-12-03T20:05:01Z
source last accessed on: 2019-12-03T20:05:01Z
label: Haushaltsprodukte @de
label: Prodotti per la casa @it
label: Productos domésticos @es
label: Produits ménagers @fr
label: Produtos domésticos @pt
label: Бытовые товары @ru
label: 家庭用品 @zh-hant
label: 家庭用品製造 @ja
label: 家用产品 @zh
label: 가정용품 @ko
definition: This industry includes companies that manufacture household cleaning products (including soaps, detergents, polishes, degreasers, bleaches, ammonia, disinfectants and bathroom cleaners) and office products.
notation: 121014
valid from: 2014-08-08
valid till: 2020-10-03

Other Consumer Products
type: BicsLevel3Industry
type: Classifier
type: Discontinued
type: NamedIndividual
is industry of: Consumer Products
is contemporary version of: http://data.ga-group.nl/ics/bics/121015
is version of: http://data.ga-group.nl/ics/bics/121015
imported on: 2026-06-08T13:03:47.798Z
last refreshed on: 2026-06-08T13:03:47.798Z
source accessed on: 2019-12-03T20:05:01Z
source last accessed on: 2019-12-03T20:05:01Z
label: Altri prodotti al consumo @it
label: Autres produits de consommation @fr
label: Otros productos de consumo @es
label: Outros produtos para consumo @pt
label: Sonst. Verbraucherprodukte @de
label: Другие потребит. товары @ru
label: その他消費者製品 @ja
label: 其他消費品 @zh-hant
label: 其他消费品 @zh
label: 기타소비자용품 @ko
definition: This industry includes companies that manufacture other consumer products not elsewhere classified.
notation: 121015
valid from: 2014-08-08
valid till: 2020-10-03

Consumer Products
type: BicsLevel2IndustryGroup
type: Classifier
type: NamedIndividual
is industry group of: Consumer Staples
is contemporary version of: http://data.ga-group.nl/ics/bics/1210
is replaced by: http://data.ga-group.nl/ics/bics/2020/1210
is version of: http://data.ga-group.nl/ics/bics/1210
imported on: 2026-06-08T13:03:47.798Z
last refreshed on: 2026-06-08T13:03:47.798Z
source accessed on: 2019-12-03T20:05:01Z
source last accessed on: 2019-12-03T20:05:01Z
label: Bens de consumo @pt
label: Konsumgüter @de
label: Prodotti al consumo @it
label: Productos del consumidor @es
label: Produits de consommation @fr
label: Потребительские товары @ru
label: 消費者產品 @zh-hant
label: 消費財 @ja
label: 消费品 @zh
label: 소비자 제품 @ko
definition: This industry group includes companies that manufacture noncyclical products for household consumer consumption. Includes food, beverage, tobacco and household products.
notation: 1210
valid from: 2014-08-08
valid till: 2020-10-03

Farm Supplies Wholesalers
type: BicsLevel4SubIndustry
type: Classifier
type: NamedIndividual
is sub industry of: Agricultural Products Whslrs
is anachronous version of: http://data.ga-group.nl/ics/bics/1211101010
is contemporary version of: http://data.ga-group.nl/ics/bics/12111010
is replaced by: http://data.ga-group.nl/ics/bics/2020/1211101010
is version of: http://data.ga-group.nl/ics/bics/1211101010
is version of: http://data.ga-group.nl/ics/bics/12111010
imported on: 2026-06-08T13:03:47.798Z
last refreshed on: 2026-06-08T13:03:47.798Z
source accessed on: 2019-12-03T20:05:01Z
source last accessed on: 2019-12-03T20:05:01Z
label: Atacadistas de suprimentos agrícolas @pt
label: GH für LaWi Betriebsmittel @de
label: Grossistes en fournitures agricoles @fr
label: Grossisti provviste per fattorie @it
label: Vta al por mayor de provisiones agrícola @es
label: Оптовая торговля - товары для с/х @ru
label: 农业用品批发商 @zh
label: 農業用品卸売業 @ja
label: 農業用品批發 @zh-hant
label: 농업용품 도매업 @ko
definition: This industry subgroup includes companies that wholesale and distribute farm and garden supplies.
notation: 12111010
valid from: 2014-08-08
valid till: 2020-10-03

Grain & Field Bean Whslrs
type: BicsLevel4SubIndustry
type: Classifier
type: NamedIndividual
is sub industry of: Agricultural Products Whslrs
is anachronous version of: http://data.ga-group.nl/ics/bics/1211101011
is contemporary version of: http://data.ga-group.nl/ics/bics/12111011
is replaced by: http://data.ga-group.nl/ics/bics/2020/1211101011
is version of: http://data.ga-group.nl/ics/bics/1211101011
is version of: http://data.ga-group.nl/ics/bics/12111011
imported on: 2026-06-08T13:03:47.798Z
last refreshed on: 2026-06-08T13:03:47.798Z
source accessed on: 2019-12-03T20:05:01Z
source last accessed on: 2019-12-03T20:05:01Z
label: Atac grãos e feijões @pt
label: Comercio al por mayor de granos @es
label: GH für Getreide & Feldbohnen @de
label: Gross céréales et fèveroles @fr
label: Grossisti grano e fagiolini @it
label: Опт. торговля - зерно и кормовые бобы @ru
label: 穀物卸売業 @ja
label: 穀類及豆類批發 @zh-hant
label: 谷物及豆类批发商 @zh
label: 곡물 & 종실용 콩 도매업 @ko
definition: This industry subgroup includes companies that wholesale and distribute grains and beans.
notation: 12111011
valid from: 2014-08-08
valid till: 2020-10-03

Livestock Wholesalers
type: BicsLevel4SubIndustry
type: Classifier
type: NamedIndividual
is sub industry of: Agricultural Products Whslrs
is anachronous version of: http://data.ga-group.nl/ics/bics/1211101012
is contemporary version of: http://data.ga-group.nl/ics/bics/12111012
is replaced by: http://data.ga-group.nl/ics/bics/2020/1211101012
is version of: http://data.ga-group.nl/ics/bics/1211101012
is version of: http://data.ga-group.nl/ics/bics/12111012
imported on: 2026-06-08T13:03:47.798Z
last refreshed on: 2026-06-08T13:03:47.798Z
source accessed on: 2019-12-03T20:05:01Z
source last accessed on: 2019-12-03T20:05:01Z
label: Atacadistas de gado @pt
label: Großhändler für Nutzvieh @de
label: Grossistes en bétail sur pied @fr
label: Grossisti bestiame @it
label: Vta al por mayor de ganadería @es
label: Оптовая торговля - живой скот @ru
label: 牲畜批發 @zh-hant
label: 畜産物卸売業 @ja
label: 畜类批发商 @zh
label: 축산물 도매업 @ko
definition: This industry subgroup includes companies that wholesale and distribute livestock.
notation: 12111012
valid from: 2014-08-08
valid till: 2020-10-03

Other Farm Raw Material Whslrs
type: BicsLevel4SubIndustry
type: Classifier
type: Discontinued
type: NamedIndividual
is sub industry of: Agricultural Products Whslrs
is contemporary version of: http://data.ga-group.nl/ics/bics/12111013
is version of: http://data.ga-group.nl/ics/bics/12111013
imported on: 2026-06-08T13:03:47.798Z
last refreshed on: 2026-06-08T13:03:47.798Z
source accessed on: 2019-12-03T20:05:01Z
source last accessed on: 2019-12-03T20:05:01Z
label: Comercio al por mayor de otros materiales crudos de productos agrícolas @es
label: GH für sonstige Rohstoffe für LaWi @de
label: Gross autres mat prem prod agricoles @fr
label: Grossisti altri prod agricoli di base @it
label: Outros atac matérias-primas para fazendas @pt
label: Опт. торговля - Прочее исходн. сырье для с/х @ru
label: その他農産物製品原料卸売業 @ja
label: 其他农业原料批发商 @zh
label: 其他農產品原料批發 @zh-hant
label: 기타 농산물 원재료 도매업 @ko
definition: This industry subgroup includes companies that wholesale and distribute other forms of product raw materials not elsewhere classified. Products include animal hair, cotton, cocoa beans, furs, horses, oilseeds, sugar and wool. Includes animal hair, cocoa beans, furs, horses, oilseeds, sugar and wool.
notation: 12111013
valid from: 2014-08-08
valid till: 2020-10-03

Agricultural Products Whslrs
type: BicsLevel3Industry
type: Classifier
type: NamedIndividual
is industry of: Distributors - Consumer Staples
is anachronous version of: http://data.ga-group.nl/ics/bics/12111010
is contemporary version of: http://data.ga-group.nl/ics/bics/121110
is replaced by: http://data.ga-group.nl/ics/bics/2020/12111010
is version of: http://data.ga-group.nl/ics/bics/12111010
is version of: http://data.ga-group.nl/ics/bics/121110
imported on: 2026-06-08T13:03:47.798Z
last refreshed on: 2026-06-08T13:03:47.798Z
source accessed on: 2019-12-03T20:05:01Z
source last accessed on: 2019-12-03T20:05:01Z
label: Atac produtos agrícolas @pt
label: GH für Agrarerzeugnisse @de
label: Gross produits agricoles @fr
label: Grossisti prodotti agricoli @it
label: Mayoristas prods agrícola @es
label: Опт. торговля - С/х продукты @ru
label: 农产品批发商 @zh
label: 農產品批發 @zh-hant
label: 農産物卸売 @ja
label: 농산물 도매업 @ko
definition: This industry includes companies that wholesale and distribute agricultural products, such as grains, beans, livestock, farm supplies and farm and garden machinery.
notation: 121110
valid from: 2014-08-08
valid till: 2020-10-03

Beer & Ale Wholesalers
type: BicsLevel4SubIndustry
type: Classifier
type: NamedIndividual
is sub industry of: Food Products Wholesalers
is anachronous version of: http://data.ga-group.nl/ics/bics/1211101110
is contemporary version of: http://data.ga-group.nl/ics/bics/12111110
is replaced by: http://data.ga-group.nl/ics/bics/2020/1211101110
is version of: http://data.ga-group.nl/ics/bics/1211101110
is version of: http://data.ga-group.nl/ics/bics/12111110
imported on: 2026-06-08T13:03:47.798Z
last refreshed on: 2026-06-08T13:03:47.798Z
source accessed on: 2019-12-03T20:05:01Z
source last accessed on: 2019-12-03T20:05:01Z
label: Atacadistas de cervejas @pt
label: Comercio al por mayor de cerveceros @es
label: Großhändler für Bier & Ale @de
label: Grossistes en bières et ales @fr
label: Grossisti birra e malto @it
label: Оптовая торговля - пиво и эль @ru
label: 啤酒与麦酒批发商 @zh
label: 啤酒及麥酒批發 @zh-hant
label: 맥주류 도매업 @ko
label: ﾋﾞｰﾙ･ｴｰﾙ卸売業 @ja
definition: This industry subgroup includes companies that wholesale and distribute beer and malt beverages.
notation: 12111110
valid from: 2014-08-08
valid till: 2020-10-03

Confectionery Wholesalers
type: BicsLevel4SubIndustry
type: Classifier
type: NamedIndividual
is sub industry of: Food Products Wholesalers
is anachronous version of: http://data.ga-group.nl/ics/bics/1211101111
is contemporary version of: http://data.ga-group.nl/ics/bics/12111111
is replaced by: http://data.ga-group.nl/ics/bics/2020/1211101111
is version of: http://data.ga-group.nl/ics/bics/1211101111
is version of: http://data.ga-group.nl/ics/bics/12111111
imported on: 2026-06-08T13:03:47.798Z
last refreshed on: 2026-06-08T13:03:47.798Z
source accessed on: 2019-12-03T20:05:01Z
source last accessed on: 2019-12-03T20:05:01Z
label: Atacadistas de produtos de confeitaria @pt
label: Großhändler für Süßwaren @de
label: Grossistes en confiseries @fr
label: Grossisti pasticcini @it
label: Mayoristas de confección @es
label: Опт. торговля - кондитерские изделия @ru
label: 糖果批发商 @zh
label: 糖果批發 @zh-hant
label: 菓子類卸売業 @ja
label: 제과 도매업 @ko
definition: This industry subgroup includes companies that wholesale and distribute confectionaries, nuts, chips and fountain syrups.
notation: 12111111
valid from: 2014-08-08
valid till: 2020-10-03

Dairy Prods Whslrs (ex Dry/Can)
type: BicsLevel4SubIndustry
type: Classifier
type: NamedIndividual
is sub industry of: Food Products Wholesalers
is anachronous version of: http://data.ga-group.nl/ics/bics/1211101112
is contemporary version of: http://data.ga-group.nl/ics/bics/12111112
is replaced by: http://data.ga-group.nl/ics/bics/2020/1211101112
is version of: http://data.ga-group.nl/ics/bics/1211101112
is version of: http://data.ga-group.nl/ics/bics/12111112
imported on: 2026-06-08T13:03:47.798Z
last refreshed on: 2026-06-08T13:03:47.798Z
source accessed on: 2019-12-03T20:05:01Z
source last accessed on: 2019-12-03T20:05:01Z
label: Atac prod lácteos (exc em pó/enlatado) @pt
label: Comercio al por mayor de lácteos (excepto secos o enlatados) @es
label: GH für Milchprod. exkl. getrocknet/in Dosen @de
label: Gross produits laitiers (h désyd/boîte) @fr
label: Grossisti latticini (escl secco/scat) @it
label: Опт. торговля - молочные продукты (кроме сухих и консервир.) @ru
label: 乳製品(乾貨或罐頭除外)批發 @zh-hant
label: 乳製品(粉･缶製品を除く)卸売業 @ja
label: 奶产品批发商(除干制与罐装） @zh
label: 유제품(건제 또는 캔류 외) 도매업 @ko
definition: This industry subgroup includes companies that wholesale and distribute dairy products, except for dried or canned dairy products.
notation: 12111112
valid from: 2014-08-08
valid till: 2020-10-03

Fish & Seafood Wholesalers
type: BicsLevel4SubIndustry
type: Classifier
type: NamedIndividual
is sub industry of: Food Products Wholesalers
is anachronous version of: http://data.ga-group.nl/ics/bics/1211101113
is contemporary version of: http://data.ga-group.nl/ics/bics/12111113
is replaced by: http://data.ga-group.nl/ics/bics/2020/1211101113
is version of: http://data.ga-group.nl/ics/bics/1211101113
is version of: http://data.ga-group.nl/ics/bics/12111113
imported on: 2026-06-08T13:03:47.798Z
last refreshed on: 2026-06-08T13:03:47.798Z
source accessed on: 2019-12-03T20:05:01Z
source last accessed on: 2019-12-03T20:05:01Z
label: Atacadistas de peixes e frutos do mar @pt
label: Comercio al por mayor de mariscos @es
label: Großhändler für Fisch & Meeresfrüchte @de
label: Grossistes en poissons et fruits de mer @fr
label: Grossisti pesce e frutti mare @it
label: Опт. торговля - рыба и морепродукты @ru
label: 水産物卸売業 @ja
label: 魚類及海鮮批發 @zh-hant
label: 鱼类与海鲜批发商 @zh
label: 수산물 도매업 @ko
definition: This industry subgroup includes companies that wholesale and distribute fish and other seafood.
notation: 12111113
valid from: 2014-08-08
valid till: 2020-10-03

Fresh Fruit & Vegetable Whslrs
type: BicsLevel4SubIndustry
type: Classifier
type: NamedIndividual
is sub industry of: Food Products Wholesalers
is anachronous version of: http://data.ga-group.nl/ics/bics/1211101114
is contemporary version of: http://data.ga-group.nl/ics/bics/12111114
is replaced by: http://data.ga-group.nl/ics/bics/2020/1211101114
is version of: http://data.ga-group.nl/ics/bics/1211101114
is version of: http://data.ga-group.nl/ics/bics/12111114
imported on: 2026-06-08T13:03:47.798Z
last refreshed on: 2026-06-08T13:03:47.798Z
source accessed on: 2019-12-03T20:05:01Z
source last accessed on: 2019-12-03T20:05:01Z
label: Atac vegetais e frutas frescas @pt
label: Comercio al por mayor de frutas y verduras frescas @es
label: GH für frisches Obst & Gemüse @de
label: Gross fruits et légumes frais @fr
label: Grossisti frutta e verdura fresca @it
label: Опт. торговля - свежие фрукты и овощи @ru
label: 新鮮水果及蔬菜批發 @zh-hant
label: 新鲜水果与蔬菜批发商 @zh
label: 青果･野菜卸売業 @ja
label: 신선과일 & 채소 도매업 @ko
definition: This industry subgroup includes companies that wholesale fresh fruit and vegetables to retailers.
notation: 12111114
valid from: 2014-08-08
valid till: 2020-10-03

General-Line Grocery Whslrs
type: BicsLevel4SubIndustry
type: Classifier
type: NamedIndividual
is sub industry of: Food Products Wholesalers
is anachronous version of: http://data.ga-group.nl/ics/bics/1211101115
is contemporary version of: http://data.ga-group.nl/ics/bics/12111115
is replaced by: http://data.ga-group.nl/ics/bics/2020/1211101115
is version of: http://data.ga-group.nl/ics/bics/1211101115
is version of: http://data.ga-group.nl/ics/bics/12111115
imported on: 2026-06-08T13:03:47.798Z
last refreshed on: 2026-06-08T13:03:47.798Z
source accessed on: 2019-12-03T20:05:01Z
source last accessed on: 2019-12-03T20:05:01Z
label: Atac de artigos de mercearia em geral @pt
label: Großhändler für allgemeine Lebensmittel @de
label: Gross produits d'épicerie généraux @fr
label: Grossisti alimentari @it
label: Vta abarrotes en general @es
label: Опт. торговля - смешанный ассортимент продуктов питания @ru
label: 一般食品卸売業 @ja
label: 百货批发商 @zh
label: 綜合性雜貨批發 @zh-hant
label: 일반식료품 도매업 @ko
definition: This industry subgroup includes companies that wholesale and distribute general groceries.
notation: 12111115
valid from: 2014-08-08
valid till: 2020-10-03

Meat Products Wholesalers
type: BicsLevel4SubIndustry
type: Classifier
type: NamedIndividual
is sub industry of: Food Products Wholesalers
is anachronous version of: http://data.ga-group.nl/ics/bics/1211101116
is contemporary version of: http://data.ga-group.nl/ics/bics/12111116
is replaced by: http://data.ga-group.nl/ics/bics/2020/1211101116
is version of: http://data.ga-group.nl/ics/bics/1211101116
is version of: http://data.ga-group.nl/ics/bics/12111116
imported on: 2026-06-08T13:03:47.798Z
last refreshed on: 2026-06-08T13:03:47.798Z
source accessed on: 2019-12-03T20:05:01Z
source last accessed on: 2019-12-03T20:05:01Z
label: Atacadistas de produtos de carne @pt
label: Großhändler für Fleischprodukte @de
label: Gross produits à base de viande @fr
label: Grossisti prodotti carne @it
label: Vta al p/mayor productos de carne @es
label: Оптовая торговля - мясные продукты @ru
label: 肉制品批发商 @zh
label: 肉類及肉類產品批發 @zh-hant
label: 食肉･食肉製品卸売業 @ja
label: 육류제품 도매업 @ko
definition: This industry subgroup includes companies that wholesale and distribute fresh meat and other meat products.
notation: 12111116
valid from: 2014-08-08
valid till: 2020-10-03

Packaged Frozen Food Whslrs
type: BicsLevel4SubIndustry
type: Classifier
type: NamedIndividual
is sub industry of: Food Products Wholesalers
is anachronous version of: http://data.ga-group.nl/ics/bics/1211101117
is contemporary version of: http://data.ga-group.nl/ics/bics/12111117
is replaced by: http://data.ga-group.nl/ics/bics/2020/1211101117
is version of: http://data.ga-group.nl/ics/bics/1211101117
is version of: http://data.ga-group.nl/ics/bics/12111117
imported on: 2026-06-08T13:03:47.798Z
last refreshed on: 2026-06-08T13:03:47.798Z
source accessed on: 2019-12-03T20:05:01Z
source last accessed on: 2019-12-03T20:05:01Z
label: Atacadistas de congelados embalados @pt
label: Comercio al por mayor de alimentos congelados en envase @es
label: Großhändler für Lebensmittel, gefroren & abgepackt @de
label: Gross aliments congelés emballés @fr
label: Grossisti di alimenti surgelati confezionati @it
label: Оптовая торговля - Упакованные замороженные продукты питания @ru
label: 冷凍包裝食品批發 @zh-hant
label: 冷凍調理食品卸売業 @ja
label: 包装冷冻食品批发商 @zh
label: 냉동포장식품 도매상업 @ko
definition: This industry subgroup includes companies that wholesale and distribute packaged frozen foods.
notation: 12111117
valid from: 2014-08-08
valid till: 2020-10-03

Poultry Products Wholesalers
type: BicsLevel4SubIndustry
type: Classifier
type: NamedIndividual
is sub industry of: Food Products Wholesalers
is anachronous version of: http://data.ga-group.nl/ics/bics/1211101118
is contemporary version of: http://data.ga-group.nl/ics/bics/12111118
is replaced by: http://data.ga-group.nl/ics/bics/2020/1211101118
is version of: http://data.ga-group.nl/ics/bics/1211101118
is version of: http://data.ga-group.nl/ics/bics/12111118
imported on: 2026-06-08T13:03:47.798Z
last refreshed on: 2026-06-08T13:03:47.798Z
source accessed on: 2019-12-03T20:05:01Z
source last accessed on: 2019-12-03T20:05:01Z
label: Atacadistas de produtos de aves @pt
label: Großhändler für Geflügelprodukte @de
label: Gross produits de volaille @fr
label: Grossisti prodotti avicoli @it
label: Vta al por mayor productos de aves @es
label: Опт. торговля - продукц. птицеводства @ru
label: 家きん･家きん製品卸売業 @ja
label: 家禽及家禽產品批發 @zh-hant
label: 禽类产品批发商 @zh
label: 가금류제품 도매업 @ko
definition: This industry subgroup includes companies that wholesale and distribute fresh poultry and poultry-based products.
notation: 12111118
valid from: 2014-08-08
valid till: 2020-10-03

Tobacco Products Wholesalers
type: BicsLevel4SubIndustry
type: Classifier
type: NamedIndividual
is sub industry of: Food Products Wholesalers
is anachronous version of: http://data.ga-group.nl/ics/bics/1211101119
is contemporary version of: http://data.ga-group.nl/ics/bics/12111119
is replaced by: http://data.ga-group.nl/ics/bics/2020/1211101119
is version of: http://data.ga-group.nl/ics/bics/1211101119
is version of: http://data.ga-group.nl/ics/bics/12111119
imported on: 2026-06-08T13:03:47.798Z
last refreshed on: 2026-06-08T13:03:47.798Z
source accessed on: 2019-12-03T20:05:01Z
source last accessed on: 2019-12-03T20:05:01Z
label: Atacadistas de produtos de tabacos @pt
label: Großhändler für Tabakwaren @de
label: Grossistes en produits du tabac @fr
label: Grossisti prodotti del tabacco @it
label: Vta al por mayor productos de tabaco @es
label: Опт. торговля - табачные изделия @ru
label: たばこ製品卸売業 @ja
label: 烟草制品批发商 @zh
label: 菸草製品批發 @zh-hant
label: 담배제품 도매업 @ko
definition: This industry subgroup includes companies that wholesale and distribute tobacco and other tobacco-based products.
notation: 12111119
valid from: 2014-08-08
valid till: 2020-10-03

Wine & Distilled Alcohol Whslrs
type: BicsLevel4SubIndustry
type: Classifier
type: NamedIndividual
is sub industry of: Food Products Wholesalers
is anachronous version of: http://data.ga-group.nl/ics/bics/1211101120
is contemporary version of: http://data.ga-group.nl/ics/bics/12111120
is replaced by: http://data.ga-group.nl/ics/bics/2020/1211101120
is version of: http://data.ga-group.nl/ics/bics/1211101120
is version of: http://data.ga-group.nl/ics/bics/12111120
imported on: 2026-06-08T13:03:47.798Z
last refreshed on: 2026-06-08T13:03:47.798Z
source accessed on: 2019-12-03T20:05:01Z
source last accessed on: 2019-12-03T20:05:01Z
label: Atac de bebidas alcoólicas destiladas e vinhos @pt
label: Comercio al por mayor de vino y bebidas de alcohol destilado @es
label: Großhändler für Wein & destillierten Alkohol @de
label: Gross vin et boissons alcool distill @fr
label: Grossisti vino e distillati @it
label: Опт. торговля - вино и спиртные напи��ки @ru
label: 葡萄酒及蒸餾酒精飲料批發 @zh-hant
label: 葡萄酒及蒸馏酒批发商 @zh
label: 와인 & 증류주 도매업 @ko
label: ﾜｲﾝ･蒸留酒卸売業 @ja
definition: This industry subgroup includes companies that wholesale and distribute wine and distilled alcoholic beverages.
notation: 12111120
valid from: 2014-08-08
valid till: 2020-10-03

Other Grocery Products Whslrs
type: BicsLevel4SubIndustry
type: Classifier
type: Discontinued
type: NamedIndividual
is sub industry of: Food Products Wholesalers
is contemporary version of: http://data.ga-group.nl/ics/bics/12111121
is version of: http://data.ga-group.nl/ics/bics/12111121
imported on: 2026-06-08T13:03:47.798Z
last refreshed on: 2026-06-08T13:03:47.798Z
source accessed on: 2019-12-03T20:05:01Z
source last accessed on: 2019-12-03T20:05:01Z
label: Großhändler für sonst. Lebensmittel @de
label: Gross autres produits d'alimentation @fr
label: Grossisti altri prod alimentari @it
label: Otros productos de comestibles al por mayor @es
label: Outros atac produtos de mercearias @pt
label: Опт. торговля - другие бакалейные товары @ru
label: その他食料品卸売業 @ja
label: 其他杂货产品批发商 @zh
label: 其他雜貨產品批發 @zh-hant
label: 기타식료품 도매업 @ko
definition: This industry subgroup includes companies that wholesale and distribute grocery products not elsewhere classified.
notation: 12111121
valid from: 2014-08-08
valid till: 2020-10-03

Food Products Wholesalers
type: BicsLevel3Industry
type: Classifier
type: NamedIndividual
is industry of: Distributors - Consumer Staples
is anachronous version of: http://data.ga-group.nl/ics/bics/12111011
is contemporary version of: http://data.ga-group.nl/ics/bics/121111
is replaced by: http://data.ga-group.nl/ics/bics/2020/12111011
is version of: http://data.ga-group.nl/ics/bics/12111011
is version of: http://data.ga-group.nl/ics/bics/121111
imported on: 2026-06-08T13:03:47.798Z
last refreshed on: 2026-06-08T13:03:47.798Z
source accessed on: 2019-12-03T20:05:01Z
source last accessed on: 2019-12-03T20:05:01Z
label: Atacadistas produtos alimentícios @pt
label: Großhändler für LM @de
label: Grossistes en produits alimentaires @fr
label: Grossisti prodotti alimentari @it
label: Mayoristas alimentos @es
label: Опт. торговля - продукты питания @ru
label: 食品卸売業 @ja
label: 食品批发商 @zh
label: 食品批發 @zh-hant
label: 식품 도매업 @ko
definition: This industry includes companies that wholesale, procure and deliver food products, such as fresh produce, dairy, meat and seafood. The may also wholesale general merchandise, health/beauty care products and tobacco products as well as assist with assortment planning and retail pricing support.
notation: 121111
valid from: 2014-08-08
valid till: 2020-10-03

Other Wholesalers - Staples
type: BicsLevel3Industry
type: Classifier
type: NamedIndividual
is industry of: Distributors - Consumer Staples
is anachronous version of: http://data.ga-group.nl/ics/bics/12111012
is contemporary version of: http://data.ga-group.nl/ics/bics/121112
is replaced by: http://data.ga-group.nl/ics/bics/2020/12111012
is version of: http://data.ga-group.nl/ics/bics/12111012
is version of: http://data.ga-group.nl/ics/bics/121112
imported on: 2026-06-08T13:03:47.798Z
last refreshed on: 2026-06-08T13:03:47.798Z
source accessed on: 2019-12-03T20:05:01Z
source last accessed on: 2019-12-03T20:05:01Z
label: Altri grossisti - Prima necessità @it
label: Autres gross - Conso essentielle @fr
label: Otros mayoristas - básico @es
label: Outros atacadistas - Básicos @pt
label: Sonstige GH - Basisgüter @de
label: Др. оптовики - основные товары @ru
label: その他卸売業ｰ生活必需品 @ja
label: 其他批發-核心消費 @zh-hant
label: 其他���发商-必需品 @zh
label: 기타도매업-생필품 @ko
definition: This industry includes companies that wholesale and distribute consumer staples not elsewhere classified.
notation: 121112
valid from: 2014-08-08
valid till: 2020-10-03

Distributors - Consumer Staples
type: BicsLevel2IndustryGroup
type: Classifier
type: NamedIndividual
is industry group of: Consumer Staples
is anachronous version of: http://data.ga-group.nl/ics/bics/121110
is contemporary version of: http://data.ga-group.nl/ics/bics/1211
is replaced by: http://data.ga-group.nl/ics/bics/2020/121110
is version of: http://data.ga-group.nl/ics/bics/121110
is version of: http://data.ga-group.nl/ics/bics/1211
imported on: 2026-06-08T13:03:47.798Z
last refreshed on: 2026-06-08T13:03:47.798Z
source accessed on: 2019-12-03T20:05:01Z
source last accessed on: 2019-12-03T20:05:01Z
label: Distribuidores - Bens de consumo básico @pt
label: Distribuidores - consumo básico @es
label: Distributeurs - Consommation essentielle @fr
label: Distributori - Beni di consumo @it
label: Vertrieb - Basisgüter @de
label: Дистрибьюторы - основные потребительские товары @ru
label: 分销商-必需消费品 @zh
label: 流通･卸売業-生活必需品 @ja
label: 經銷商-核心消費 @zh-hant
label: 유통업-필수소비재 @ko
definition: This industry group includes companies that wholesale and distribute other food- and agricultural- related products.
notation: 1211
valid from: 2014-08-08
valid till: 2020-10-03

Hypermarkets
type: BicsLevel5Segment
type: Classifier
type: NamedIndividual
is level5 segment of: Supermarkets
is anachronous version of: http://data.ga-group.nl/ics/bics/121111101010
is contemporary version of: http://data.ga-group.nl/ics/bics/1212101010
is replaced by: http://data.ga-group.nl/ics/bics/2020/121111101010
is version of: http://data.ga-group.nl/ics/bics/121111101010
is version of: http://data.ga-group.nl/ics/bics/1212101010
imported on: 2026-06-08T13:03:47.798Z
last refreshed on: 2026-06-08T13:03:47.798Z
source accessed on: 2019-12-03T20:05:01Z
source last accessed on: 2019-12-03T20:05:01Z
label: Hipermercados @es
label: Hypermärkte @de
label: Hypermarchés @fr
label: Ipermercati @it
label: Гипермаркет @ru
label: 大規模超級市場 @zh-hant
label: 超大型自助商场 @zh
label: 하이퍼마켓 @ko
label: ﾊｲﾊﾟｰﾏｰｹｯﾄ @ja
definition: This segment includes companies that operate very large food stores that also carry a wide selection of general merchandise.
notation: 1212101010
valid from: 2014-08-08
valid till: 2020-10-03

Superstores
type: BicsLevel5Segment
type: Classifier
type: Discontinued
type: NamedIndividual
is level5 segment of: Supermarkets
is contemporary version of: http://data.ga-group.nl/ics/bics/1212101011
is version of: http://data.ga-group.nl/ics/bics/1212101011
imported on: 2026-06-08T13:03:47.798Z
last refreshed on: 2026-06-08T13:03:47.798Z
source accessed on: 2019-12-03T20:05:01Z
source last accessed on: 2019-12-03T20:05:01Z
label: Großmarkt @de
label: Súpertiendas @es
label: Super lojas @pt
label: Supermagasins @fr
label: Supernegozi @it
label: Супермагазины @ru
label: 超级商场 @zh
label: 量販店 @zh-hant
label: 대형 매장 @ko
label: ｽｰﾊﾟｰｽﾄｱ @ja
definition: This segment includes companies that operate larger self-service food stores, which carry an enhanced range of packaged, fresh food and household products.
notation: 1212101011
valid from: 2014-08-08
valid till: 2020-10-03

Traditional Supermarkets
type: BicsLevel5Segment
type: Classifier
type: NamedIndividual
is level5 segment of: Supermarkets
is anachronous version of: http://data.ga-group.nl/ics/bics/121111101011
is contemporary version of: http://data.ga-group.nl/ics/bics/1212101012
is replaced by: http://data.ga-group.nl/ics/bics/2020/121111101011
is version of: http://data.ga-group.nl/ics/bics/121111101011
is version of: http://data.ga-group.nl/ics/bics/1212101012
imported on: 2026-06-08T13:03:47.798Z
last refreshed on: 2026-06-08T13:03:47.798Z
source accessed on: 2019-12-03T20:05:01Z
source last accessed on: 2019-12-03T20:05:01Z
label: Supermarchés traditionnels @fr
label: Supermercados tradicionais @pt
label: Supermercados tradicionales @es
label: Supermercati tradizionali @it
label: Traditionelle Supermärkte @de
label: Традиционные супермаркеты @ru
label: 传统超市 @zh
label: 傳統超市 @zh-hant
label: 従来型ｽｰﾊﾟｰ @ja
label: 기존 슈퍼마켓 @ko
definition: This segment includes companies that operate smaller self-service food stores, which carry a wide range of packaged, fresh food and household products.
notation: 1212101012
valid from: 2014-08-08
valid till: 2020-10-03

Fresh Format
type: BicsLevel5Segment
type: Classifier
type: Discontinued
type: NamedIndividual
is level5 segment of: Supermarkets
is contemporary version of: http://data.ga-group.nl/ics/bics/1212101013
is version of: http://data.ga-group.nl/ics/bics/1212101013
imported on: 2026-06-08T13:03:47.798Z
last refreshed on: 2026-06-08T13:03:47.798Z
source accessed on: 2019-12-03T20:05:01Z
source last accessed on: 2019-12-03T20:05:01Z
label: 'Fresh Format' @ru
label: Epicerie fine @fr
label: Formato fresco @pt
label: Formato nuevo @es
label: Freschi @it
label: Neues Format @de
label: 新鲜食品 @zh
label: 生鮮食品 @zh-hant
label: 신선식품점 @ko
label: ﾌﾚｯｼｭﾌｫｰﾏｯﾄ･ｽﾄｱ @ja
definition: This segment includes supermarkets that have a well above average proportion of fresh food, often at higher price points.
notation: 1212101013
valid from: 2014-08-08
valid till: 2020-10-03

Limited Assortment Stores
type: BicsLevel5Segment
type: Classifier
type: Discontinued
type: NamedIndividual
is level5 segment of: Supermarkets
is contemporary version of: http://data.ga-group.nl/ics/bics/1212101014
is version of: http://data.ga-group.nl/ics/bics/1212101014
imported on: 2026-06-08T13:03:47.798Z
last refreshed on: 2026-06-08T13:03:47.798Z
source accessed on: 2019-12-03T20:05:01Z
source last accessed on: 2019-12-03T20:05:01Z
label: Geschäfte mit begrenztem Sortiment @de
label: Lojas de variedade limitada @pt
label: Magasins à assortiment limité @fr
label: Negozi assortimento limitato @it
label: Tiendas con inventario limitado @es
label: Магазины с огранич. ассортим. @ru
label: 有限品种折扣店 @zh
label: 有限商品店 @zh-hant
label: 限定商品ﾃﾞｨｽｶｳﾝﾄ店 @ja
label: 한정상품매장 @ko
definition: This segment includes food stores restricted in size, service and variety to keep costs and prices low. Companies often sell a restricted selection of general merchandise at very low prices.
notation: 1212101014
valid from: 2014-08-08
valid till: 2020-10-03

Cash & Carry
type: BicsLevel5Segment
type: Classifier
type: Discontinued
type: NamedIndividual
is level5 segment of: Supermarkets
is contemporary version of: http://data.ga-group.nl/ics/bics/1212101015
is version of: http://data.ga-group.nl/ics/bics/1212101015
imported on: 2026-06-08T13:03:47.798Z
last refreshed on: 2026-06-08T13:03:47.798Z
source accessed on: 2019-12-03T20:05:01Z
source last accessed on: 2019-12-03T20:05:01Z
label: Cash e Carry @it
label: Payer-emporter @fr
label: Налич. мгзн без доставки @ru
label: 现购自运 @zh
label: 現購自運 @zh-hant
label: 現金小売業 @ja
label: 현금불 자배 @ko
definition: This segment includes companies that operate outlets in which access is restricted to certain classes of customers (usually those who have VAT registration) but where retail clients are a significant proportion of the trade.
notation: 1212101015
valid from: 2014-08-08
valid till: 2020-10-03

Supermarket - Online
type: BicsLevel5Segment
type: Classifier
type: NamedIndividual
is level5 segment of: Supermarkets
is anachronous version of: http://data.ga-group.nl/ics/bics/121111101012
is contemporary version of: http://data.ga-group.nl/ics/bics/1212101016
is replaced by: http://data.ga-group.nl/ics/bics/2020/121111101012
is version of: http://data.ga-group.nl/ics/bics/121111101012
is version of: http://data.ga-group.nl/ics/bics/1212101016
imported on: 2026-06-08T13:03:47.798Z
last refreshed on: 2026-06-08T13:03:47.798Z
source accessed on: 2019-12-03T20:05:01Z
source last accessed on: 2019-12-03T20:05:01Z
label: Supermarchés - En ligne @fr
label: Supermarkt - Online @de
label: Supermercado - en línea @es
label: Supermercado-Online @pt
label: Supermercato - Online @it
label: Супермаркет - Онлайн @ru
label: 超市 - 在线 @zh
label: 超市 - 線上 @zh-hant
label: 수퍼마켓 - 온라인 @ko
label: ｽｰﾊﾟｰﾏｰｹｯﾄ-ｵﾝﾗｲﾝ @ja
definition: This segment includes companies that operate an Internet site and distribution center as well as carry a wide range of packaged, fresh food and household products and delivery trucks.
notation: 1212101016
valid from: 2014-08-08
valid till: 2020-10-03

Supermarkets
type: BicsLevel4SubIndustry
type: Classifier
type: NamedIndividual
is sub industry of: Food & Drug Stores
is anachronous version of: http://data.ga-group.nl/ics/bics/1211111010
is contemporary version of: http://data.ga-group.nl/ics/bics/12121010
is replaced by: http://data.ga-group.nl/ics/bics/2020/1211111010
is version of: http://data.ga-group.nl/ics/bics/1211111010
is version of: http://data.ga-group.nl/ics/bics/12121010
imported on: 2026-06-08T13:03:47.798Z
last refreshed on: 2026-06-08T13:03:47.798Z
source accessed on: 2019-12-03T20:05:01Z
source last accessed on: 2019-12-03T20:05:01Z
label: Supermärkte @de
label: Supermarchés @fr
label: Supermercados @es
label: Supermercati @it
label: Супермаркеты @ru
label: 超市 @zh
label: 超級市場 @zh-hant
label: 슈퍼마켓 @ko
label: ｽｰﾊﾟｰﾏｰｹｯﾄ @ja
definition: This industry subgroup includes companies that operate self-service food stores, which carry a wide range of packaged, fresh food and household products.
notation: 12121010
valid from: 2014-08-08
valid till: 2020-10-03

Retail Bakeries
type: BicsLevel5Segment
type: Classifier
type: NamedIndividual
is level5 segment of: Specialty Food & Staples Stores
is anachronous version of: http://data.ga-group.nl/ics/bics/121111101110
is contemporary version of: http://data.ga-group.nl/ics/bics/1212101110
is replaced by: http://data.ga-group.nl/ics/bics/2020/121111101110
is version of: http://data.ga-group.nl/ics/bics/121111101110
is version of: http://data.ga-group.nl/ics/bics/1212101110
imported on: 2026-06-08T13:03:47.798Z
last refreshed on: 2026-06-08T13:03:47.798Z
source accessed on: 2019-12-03T20:05:01Z
source last accessed on: 2019-12-03T20:05:01Z
label: Boulangeries/Pâtisseries @fr
label: EH-Bäckereien @de
label: Padarias no varejo @pt
label: Panaderías al por menor @es
label: Panifici al dettaglio @it
label: Рознич. пекарни @ru
label: 小売ﾍﾞｰｶﾘｰ @ja
label: 零售糕點 @zh-hant
label: 零售面包店 @zh
label: 소매 제과점 @ko
definition: This segment includes companies that retail baked goods, such as bread, biscuits, croutons, doughnuts, pies and pastries.
notation: 1212101110
valid from: 2014-08-08
valid till: 2020-10-03

Beer, Wine & Liquor Stores
type: BicsLevel5Segment
type: Classifier
type: NamedIndividual
is level5 segment of: Specialty Food & Staples Stores
is anachronous version of: http://data.ga-group.nl/ics/bics/121111101111
is contemporary version of: http://data.ga-group.nl/ics/bics/1212101111
is replaced by: http://data.ga-group.nl/ics/bics/2020/121111101111
is version of: http://data.ga-group.nl/ics/bics/121111101111
is version of: http://data.ga-group.nl/ics/bics/1212101111
imported on: 2026-06-08T13:03:47.798Z
last refreshed on: 2026-06-08T13:03:47.798Z
source accessed on: 2019-12-03T20:05:01Z
source last accessed on: 2019-12-03T20:05:01Z
label: Bier-, Wein- &Spirituosenläden @de
label: Licorerías @es
label: Lojas de bebidas @pt
label: Magasins de bière, vin et spiritueux @fr
label: Negozi liquori, birra e vino @it
label: Магазины пива, вина и ликеро-водочной продукции @ru
label: 啤酒、葡���酒及酒類店 @zh-hant
label: 酒类商店 @zh
label: 맥주, 와인 & 주류 매장 @ko
label: ﾋﾞｰﾙ･ﾜｲﾝ･酒類小売 @ja
definition: This segment includes companies that retail packaged alcoholic beverages.
notation: 1212101111
valid from: 2014-08-08
valid till: 2020-10-03

Health & Natural Food Stores
type: BicsLevel5Segment
type: Classifier
type: NamedIndividual
is level5 segment of: Specialty Food & Staples Stores
is anachronous version of: http://data.ga-group.nl/ics/bics/121111101112
is contemporary version of: http://data.ga-group.nl/ics/bics/1212101112
is replaced by: http://data.ga-group.nl/ics/bics/2020/121111101112
is version of: http://data.ga-group.nl/ics/bics/121111101112
is version of: http://data.ga-group.nl/ics/bics/1212101112
imported on: 2026-06-08T13:03:47.798Z
last refreshed on: 2026-06-08T13:03:47.798Z
source accessed on: 2019-12-03T20:05:01Z
source last accessed on: 2019-12-03T20:05:01Z
label: Lojas de alimentos naturais e saúde @pt
label: Magasins d'aliments naturels et de santé @fr
label: Negozi alimentari naturali/biologici @it
label: Reformhaus & Bioläden @de
label: Tiendas de alimentos naturales y saludables @es
label: Мгзн товаров д/здоровья и натуральных пищевых продуктов @ru
label: 健康及天然食品商店 @zh-hant
label: 健康及天然食品店 @zh
label: 健康･自然食品小売 @ja
label: 건강 & 천연식품 매장 @ko
definition: This segment includes companies that retail foods considered to be healthy and/or derived from natural ingredients.
notation: 1212101112
valid from: 2014-08-08
valid till: 2020-10-03

Other Specialty Food Stores
type: BicsLevel5Segment
type: Classifier
type: Discontinued
type: NamedIndividual
is level5 segment of: Specialty Food & Staples Stores
is contemporary version of: http://data.ga-group.nl/ics/bics/1212101113
is version of: http://data.ga-group.nl/ics/bics/1212101113
imported on: 2026-06-08T13:03:47.798Z
last refreshed on: 2026-06-08T13:03:47.798Z
source accessed on: 2019-12-03T20:05:01Z
source last accessed on: 2019-12-03T20:05:01Z
label: Alle sonstigen Speziallebensmittelgeschäfte @de
label: Altri negozi alimentari specializzati @it
label: Todas as outras lojas de alimentos especializados @pt
label: Todas las otras tiendas especializadas @es
label: Tous les autres magasins d'alimentation spécialisée @fr
label: Все прочие специализированные продуктовые магазины @ru
label: その他高級食品小売業 @ja
label: 全部其他特色食品商店 @zh
label: 所有其他特殊食品店 @zh-hant
label: 전체 기타 전문식품 매장 @ko
definition: This segment includes companies that retail other product lines as their main business, such as meat or fish.
notation: 1212101113
valid from: 2014-08-08
valid till: 2020-10-03

Specialty Food & Staples Stores
type: BicsLevel4SubIndustry
type: Classifier
type: NamedIndividual
is sub industry of: Food & Drug Stores
is anachronous version of: http://data.ga-group.nl/ics/bics/1211111011
is contemporary version of: http://data.ga-group.nl/ics/bics/12121011
is replaced by: http://data.ga-group.nl/ics/bics/2020/1211111011
is version of: http://data.ga-group.nl/ics/bics/1211111011
is version of: http://data.ga-group.nl/ics/bics/12121011
imported on: 2026-06-08T13:03:47.798Z
last refreshed on: 2026-06-08T13:03:47.798Z
source accessed on: 2019-12-03T20:05:01Z
source last accessed on: 2019-12-03T20:05:01Z
label: Geschäfte für spezielle Nahrungsmittel & Basisgüter @de
label: Lojas alimentos especializados e básicos @pt
label: Magasins d'alimentation spécialisée et de première nécessité @fr
label: Negozi alimentari specializzati e prima necessità @it
label: Tiendas alim especial y cons básico @es
label: Мгзн осн. и спец. продуктов питания @ru
label: 特色食品及主食商店 @zh-hant
label: 特色食品及必需品商店 @zh
label: 高級食品店 @ja
label: 전문식품 & 생필품점 @ko
definition: This industry subgroup includes companies that retail primarily one type of food or beverage product.
notation: 12121011
valid from: 2014-08-08
valid till: 2020-10-03

Convenience Stores
type: BicsLevel4SubIndustry
type: Classifier
type: NamedIndividual
is sub industry of: Food & Drug Stores
is anachronous version of: http://data.ga-group.nl/ics/bics/1211111012
is contemporary version of: http://data.ga-group.nl/ics/bics/12121012
is replaced by: http://data.ga-group.nl/ics/bics/2020/1211111012
is version of: http://data.ga-group.nl/ics/bics/1211111012
is version of: http://data.ga-group.nl/ics/bics/12121012
imported on: 2026-06-08T13:03:47.798Z
last refreshed on: 2026-06-08T13:03:47.798Z
source accessed on: 2019-12-03T20:05:01Z
source last accessed on: 2019-12-03T20:05:01Z
label: Dépanneurs @fr
label: Lojas conven @pt
label: Mini-Märkte @de
label: Minimarket @it
label: Tiendas @es
label: Мини-маг. товаров повс. спроса @ru
label: 便利商店 @zh-hant
label: 便利店 @zh
label: 편의점 @ko
label: ｺﾝﾋﾞﾆｴﾝｽｽﾄｱ @ja
definition: This industry includes companies that retail a limited selection of groceries, beverages and tobacco. This segment includes company-owned and franchise revenue.
notation: 12121012
valid from: 2014-08-08
valid till: 2020-10-03

Pharmacy Drugstores
type: BicsLevel5Segment
type: Classifier
type: NamedIndividual
is level5 segment of: Pharmacies & Drug Stores
is anachronous version of: http://data.ga-group.nl/ics/bics/121111101310
is contemporary version of: http://data.ga-group.nl/ics/bics/1212101310
is replaced by: http://data.ga-group.nl/ics/bics/2020/121111101310
is version of: http://data.ga-group.nl/ics/bics/121111101310
is version of: http://data.ga-group.nl/ics/bics/1212101310
imported on: 2026-06-08T13:03:47.798Z
last refreshed on: 2026-06-08T13:03:47.798Z
source accessed on: 2019-12-03T20:05:01Z
source last accessed on: 2019-12-03T20:05:01Z
label: Drogerien für Pharmazeutika @de
label: Farmácias @pt
label: Farmacéuticas @es
label: Farmacie - Medicine @it
label: Pharmacies - Médicaments @fr
label: Аптеки @ru
label: 医药商店 @zh
label: 医薬品小売 @ja
label: 藥房藥局 @zh-hant
label: 의약품 취급 약국 @ko
definition: This segment includes companies that operate bricks-and-mortar and online stores and whose pharmacy revenue accounts for the majority of sales.
notation: 1212101310
valid from: 2014-08-08
valid till: 2020-10-03

Toiletry Drugstores
type: BicsLevel5Segment
type: Classifier
type: NamedIndividual
is level5 segment of: Pharmacies & Drug Stores
is anachronous version of: http://data.ga-group.nl/ics/bics/121111101311
is contemporary version of: http://data.ga-group.nl/ics/bics/1212101311
is replaced by: http://data.ga-group.nl/ics/bics/2020/121111101311
is version of: http://data.ga-group.nl/ics/bics/121111101311
is version of: http://data.ga-group.nl/ics/bics/1212101311
imported on: 2026-06-08T13:03:47.798Z
last refreshed on: 2026-06-08T13:03:47.798Z
source accessed on: 2019-12-03T20:05:01Z
source last accessed on: 2019-12-03T20:05:01Z
label: Drogarias higiene pessoal @pt
label: Drogerien für Toilettenartikel @de
label: Farmacéuticas higiene @es
label: Farmacie - Articoli per toletta @it
label: Pharmacies - Articles de toilette @fr
label: Аптечно-космет. мгзн @ru
label: 化妆卫浴用品店 @zh
label: 化粧品･医薬品小売 @ja
label: 美妝藥局 @zh-hant
label: 화장품 취급 약국 @ko
definition: This segment includes stores that sell toiletries and health care products, and often include a pharmacy but where pharmacy revenue is a small proportion of total sales.
notation: 1212101311
valid from: 2014-08-08
valid till: 2020-10-03

Pharmacies & Drug - Online
type: BicsLevel5Segment
type: Classifier
type: NamedIndividual
is level5 segment of: Pharmacies & Drug Stores
is anachronous version of: http://data.ga-group.nl/ics/bics/121111101312
is contemporary version of: http://data.ga-group.nl/ics/bics/1212101312
is replaced by: http://data.ga-group.nl/ics/bics/2020/121111101312
is version of: http://data.ga-group.nl/ics/bics/121111101312
is version of: http://data.ga-group.nl/ics/bics/1212101312
imported on: 2026-06-08T13:03:47.798Z
last refreshed on: 2026-06-08T13:03:47.798Z
source accessed on: 2019-12-03T20:05:01Z
source last accessed on: 2019-12-03T20:05:01Z
label: Apotheken & Drogerien - Online @de
label: Farmácias e drogarias - online @pt
label: Farmacias y medicinas - En línea @es
label: Farmacie e farmaci - online @it
label: Pharmacies et médicaments - en ligne @fr
label: Фармацевтич. и лекарств. препараты-Онлайн @ru
label: 医薬品-ｵﾝﾗｲﾝ @ja
label: 药店和药品 - 在线 @zh
label: 藥物-線上 @zh-hant
label: 약국 및 약품 - 온라인 @ko
definition: This segment includes pure-play Internet companies that retail prescription or non-prescription drugs and medicines on the Internet.
notation: 1212101312
valid from: 2014-08-08
valid till: 2020-10-03

Pharmacies & Drug Stores
type: BicsLevel4SubIndustry
type: Classifier
type: NamedIndividual
is sub industry of: Food & Drug Stores
is anachronous version of: http://data.ga-group.nl/ics/bics/1211111013
is contemporary version of: http://data.ga-group.nl/ics/bics/12121013
is replaced by: http://data.ga-group.nl/ics/bics/2020/1211111013
is version of: http://data.ga-group.nl/ics/bics/1211111013
is version of: http://data.ga-group.nl/ics/bics/12121013
imported on: 2026-06-08T13:03:47.798Z
last refreshed on: 2026-06-08T13:03:47.798Z
source accessed on: 2019-12-03T20:05:01Z
source last accessed on: 2019-12-03T20:05:01Z
label: Arzneimittelgeschäfte @de
label: Farmác e drogarias @pt
label: Farmacias @es
label: Farmacie @it
label: Pharmacies @fr
label: Аптеки и магазины лекарств. @ru
label: 药房与药店 @zh
label: 薬局 @ja
label: 藥品店 @zh-hant
label: 약품 및 약국 @ko
definition: This industry subgroup includes companies that retail prescription drugs and medications through brick-and-mortar and online stores.
notation: 12121013
valid from: 2014-08-08
valid till: 2020-10-03

Food & Drug Stores
type: BicsLevel3Industry
type: Classifier
type: NamedIndividual
is industry of: Retail - Consumer Staples
is anachronous version of: http://data.ga-group.nl/ics/bics/12111110
is contemporary version of: http://data.ga-group.nl/ics/bics/121210
is replaced by: http://data.ga-group.nl/ics/bics/2020/12111110
is version of: http://data.ga-group.nl/ics/bics/12111110
is version of: http://data.ga-group.nl/ics/bics/121210
imported on: 2026-06-08T13:03:47.798Z
last refreshed on: 2026-06-08T13:03:47.798Z
source accessed on: 2019-12-03T20:05:01Z
source last accessed on: 2019-12-03T20:05:01Z
label: LM-Geschäfte & Drogerien @de
label: Lojas de alimentos e drugstore @pt
label: Magasins d'alimentation et pharmacies @fr
label: Negozi alimentari e farmacie @it
label: Tiendas de alimentos y fármacos @es
label: Магазины продуктов питания и аптеки @ru
label: 食品及药品店 @zh
label: 食品･医薬品小売 @ja
label: 食品��藥品商店 @zh-hant
label: 식품 & 약품 매장 @ko
definition: The industry includes specialty food businesses and mixed retail businesses in which food or pharmaceuticals is the predominant category.
notation: 121210
valid from: 2014-08-08
valid till: 2020-10-03

SuperCenters
type: BicsLevel4SubIndustry
type: Classifier
type: NamedIndividual
is sub industry of: Mass Merchants
is anachronous version of: http://data.ga-group.nl/ics/bics/1211111110
is contemporary version of: http://data.ga-group.nl/ics/bics/12121110
is replaced by: http://data.ga-group.nl/ics/bics/2020/1211111110
is version of: http://data.ga-group.nl/ics/bics/1211111110
is version of: http://data.ga-group.nl/ics/bics/12121110
imported on: 2026-06-08T13:03:47.798Z
last refreshed on: 2026-06-08T13:03:47.798Z
source accessed on: 2019-12-03T20:05:01Z
source last accessed on: 2019-12-03T20:05:01Z
label: SúperCentros @es
label: Super centres @fr
label: SuperCentros @pt
label: Supercenter @de
label: Supercentri @it
label: Суперцентры @ru
label: 特大购物中心 @zh
label: 超級購物中心 @zh-hant
label: 대형쇼핑센터 @ko
label: ｽｰﾊﾟｰｾﾝﾀｰ @ja
definition: This industry subgroup includes companies that operate very large self-service stores that also carry a wide selection of general merchandise and food.
notation: 12121110
valid from: 2014-08-08
valid till: 2020-10-03

Warehouse Clubs
type: BicsLevel4SubIndustry
type: Classifier
type: NamedIndividual
is sub industry of: Mass Merchants
is anachronous version of: http://data.ga-group.nl/ics/bics/1211111111
is contemporary version of: http://data.ga-group.nl/ics/bics/12121111
is replaced by: http://data.ga-group.nl/ics/bics/2020/1211111111
is version of: http://data.ga-group.nl/ics/bics/1211111111
is version of: http://data.ga-group.nl/ics/bics/12121111
imported on: 2026-06-08T13:03:47.798Z
last refreshed on: 2026-06-08T13:03:47.798Z
source accessed on: 2019-12-03T20:05:01Z
source last accessed on: 2019-12-03T20:05:01Z
label: Club a grande sconto @it
label: Clubes almacén @es
label: Clubes de depósito @pt
label: Clubs, hypermarchés @fr
label: Grosshandelsmärkte @de
label: Склады @ru
label: 仓储式俱乐部 @zh
label: 会員制ﾃﾞｨｽｶｳﾝﾄ店 @ja
label: 倉儲式俱樂部 @zh-hant
label: 회원제할인마트 @ko
definition: This industry subgroup includes companies that usually sell a wide variety of merchandise, in which customers pay annual membership fees in order to shop. In addition, customers are required to buy large, wholesale quantities of the store's products. This can include Internet sales of brick-and-mortar stores.
notation: 12121111
valid from: 2014-08-08
valid till: 2020-10-03

Discount Stores
type: BicsLevel4SubIndustry
type: Classifier
type: NamedIndividual
is sub industry of: Mass Merchants
is anachronous version of: http://data.ga-group.nl/ics/bics/1211111112
is contemporary version of: http://data.ga-group.nl/ics/bics/12121112
is replaced by: http://data.ga-group.nl/ics/bics/2020/1211111112
is version of: http://data.ga-group.nl/ics/bics/1211111112
is version of: http://data.ga-group.nl/ics/bics/12121112
imported on: 2026-06-08T13:03:47.798Z
last refreshed on: 2026-06-08T13:03:47.798Z
source accessed on: 2019-12-03T20:05:01Z
source last accessed on: 2019-12-03T20:05:01Z
label: Discounter @de
label: Lojas de desconto @pt
label: Magasins à rabais @fr
label: Negozi di articoli scontati @it
label: Tiendas de descuento @es
label: Магазины уцененных товаров @ru
label: 折扣商店 @zh
label: 할인 매장 @ko
label: ﾃﾞｨｽｶｳﾝﾄ小売店 @ja
definition: This industry subgroup includes companies that sell a wide range of general merchandise at prices lower than those asked by traditional retail outlets.
notation: 12121112
valid from: 2014-08-08
valid till: 2020-10-03

Dollar Stores
type: BicsLevel4SubIndustry
type: Classifier
type: NamedIndividual
is sub industry of: Mass Merchants
is anachronous version of: http://data.ga-group.nl/ics/bics/1211111113
is contemporary version of: http://data.ga-group.nl/ics/bics/12121113
is replaced by: http://data.ga-group.nl/ics/bics/2020/1211111113
is version of: http://data.ga-group.nl/ics/bics/1211111113
is version of: http://data.ga-group.nl/ics/bics/12121113
imported on: 2026-06-08T13:03:47.798Z
last refreshed on: 2026-06-08T13:03:47.798Z
source accessed on: 2019-12-03T20:05:01Z
source last accessed on: 2019-12-03T20:05:01Z
label: Lojas de $1 dólar @pt
label: Magasins à un dollar @fr
label: Negozi ad un dollaro @it
label: Ramschläden @de
label: Tiendas de un dólar @es
label: Долларовые магазины @ru
label: 一元商店 @zh-hant
label: 一元店 @zh
label: 염가매장 @ko
label: ﾀﾞﾗｰｽﾄｱ @ja
definition: This segment includes companies that sell a wide range of general merchandise and food, usually at lower prices than conventional stores.
notation: 12121113
valid from: 2014-08-08
valid till: 2020-10-03

Mass Merchants
type: BicsLevel3Industry
type: Classifier
type: NamedIndividual
is industry of: Retail - Consumer Staples
is anachronous version of: http://data.ga-group.nl/ics/bics/12111111
is contemporary version of: http://data.ga-group.nl/ics/bics/121211
is replaced by: http://data.ga-group.nl/ics/bics/2020/12111111
is version of: http://data.ga-group.nl/ics/bics/12111111
is version of: http://data.ga-group.nl/ics/bics/121211
imported on: 2026-06-08T13:03:47.798Z
last refreshed on: 2026-06-08T13:03:47.798Z
source accessed on: 2019-12-03T20:05:01Z
source last accessed on: 2019-12-03T20:05:01Z
label: Comerc em massa @pt
label: Comerciantes masivos @es
label: Commerçants grand public @fr
label: Mass-Merchants @de
label: Negozianti di massa @it
label: Товары смеш. ассорт. @ru
label: 大型零售��� @zh
label: 大規模小売店 @ja
label: 量販店 @zh-hant
label: 대형 할인점 @ko
definition: This industry includes retail stores that carry a broad range of merchandise but where food is the largest single category.
notation: 121211
valid from: 2014-08-08
valid till: 2020-10-03

Other Specialty Retail - Staples
type: BicsLevel3Industry
type: Classifier
type: Discontinued
type: NamedIndividual
is industry of: Retail - Consumer Staples
is contemporary version of: http://data.ga-group.nl/ics/bics/121212
is version of: http://data.ga-group.nl/ics/bics/121212
imported on: 2026-06-08T13:03:47.798Z
last refreshed on: 2026-06-08T13:03:47.798Z
source accessed on: 2019-12-03T20:05:01Z
source last accessed on: 2019-12-03T20:05:01Z
label: Altri negozi specializzati - Prima necessità @it
label: Autres vente au détail spécialisée - Consomm essentielle @fr
label: Otro minorista especializado - básico @es
label: Outros varejistas de prod especializados - Básicos @pt
label: Sonst. Fachhandel - Basisgüter @de
label: Прочие спец. розничные магазины - основные товары @ru
label: その他特殊品小売-生活必需品 @ja
label: 其他專賣零售-核心 @zh-hant
label: 其他特种零售-必需品 @zh
label: 기타 전문 소매업-생필품 @ko
definition: This industry includes companies that retail other staple products not elsewhere classified.
notation: 121212
valid from: 2014-08-08
valid till: 2020-10-03

Retail - Consumer Staples
type: BicsLevel2IndustryGroup
type: Classifier
type: NamedIndividual
is industry group of: Consumer Staples
is anachronous version of: http://data.ga-group.nl/ics/bics/121111
is contemporary version of: http://data.ga-group.nl/ics/bics/1212
is replaced by: http://data.ga-group.nl/ics/bics/2020/121111
is version of: http://data.ga-group.nl/ics/bics/121111
is version of: http://data.ga-group.nl/ics/bics/1212
imported on: 2026-06-08T13:03:47.798Z
last refreshed on: 2026-06-08T13:03:47.798Z
source accessed on: 2019-12-03T20:05:01Z
source last accessed on: 2019-12-03T20:05:01Z
label: Al dettaglio - Beni consumo @it
label: Comercio al por menor - consumo básico @es
label: Einzelhandel - Basisgüter @de
label: Varejo - Consumo básico @pt
label: Vente au détail - Consommation essentielle @fr
label: Розничная торговля основными потребит. товарами @ru
label: 生活必需品小売 @ja
label: 零售-必需消费品 @zh
label: 零售-核心消費 @zh-hant
label: 소매업-필수소비재 @ko
definition: This industry group includes companies that retail consumer necessities products through storefront operations.
notation: 1212
valid from: 2014-08-08
valid till: 2020-10-03

Consumer Staples
type: BicsLevel1Sector
type: Classifier
type: NamedIndividual
is contemporary version of: http://data.ga-group.nl/ics/bics/12
is replaced by: http://data.ga-group.nl/ics/bics/2020/12
is version of: http://data.ga-group.nl/ics/bics/12
imported on: 2026-06-08T13:03:47.798Z
last refreshed on: 2026-06-08T13:03:47.798Z
source accessed on: 2019-12-03T20:05:01Z
source last accessed on: 2019-12-03T20:05:01Z
label: Basiskonsumgüter @de
label: Beni prima necessità @it
label: Consommation essentielle @fr
label: Consumo básico @es
label: Товары первой необходимости @ru
label: 必需消费品 @zh
label: 核心消費 @zh-hant
label: 生活必需品 @ja
label: 기본소비재 @ko
definition: This sector includes companies that produce, manufacture, distribute or retail consumer staple goods and services.
notation: 12
valid from: 2014-08-08
valid till: 2020-10-03

Integrated Oils
type: BicsLevel3Industry
type: Classifier
type: NamedIndividual
is industry of: Oil, Gas & Coal
is anachronous version of: http://data.ga-group.nl/ics/bics/13101010
is contemporary version of: http://data.ga-group.nl/ics/bics/131010
is replaced by: http://data.ga-group.nl/ics/bics/2020/13101010
is version of: http://data.ga-group.nl/ics/bics/13101010
is version of: http://data.ga-group.nl/ics/bics/131010
imported on: 2026-06-08T13:03:47.798Z
last refreshed on: 2026-06-08T13:03:47.798Z
source accessed on: 2019-12-03T20:05:01Z
source last accessed on: 2019-12-03T20:05:01Z
label: Aceites integrados @es
label: Integriertes Öl @de
label: Pétrolières intégrées @fr
label: Petr integrado @pt
label: Petrolio integrato @it
label: Интегрир. нефтяные компании @ru
label: 石油:総合 @ja
label: 綜合性石油業 @zh-hant
label: 综合石油 @zh
label: 통합 석유 @ko
definition: This industry includes companies that are considered integrated oil producers. These companies are involved in all aspects of the oil industry, from exploration and production to distribution and chemical production.
notation: 131010
valid from: 2014-08-08
valid till: 2020-10-03

Crude Oil Production
type: BicsLevel5Segment
type: Classifier
type: NamedIndividual
is level5 segment of: Crude Oil & Natural Gas E&P
is anachronous version of: http://data.ga-group.nl/ics/bics/131010111010
is contemporary version of: http://data.ga-group.nl/ics/bics/1310111010
is replaced by: http://data.ga-group.nl/ics/bics/2020/131010111010
is version of: http://data.ga-group.nl/ics/bics/131010111010
is version of: http://data.ga-group.nl/ics/bics/1310111010
imported on: 2026-06-08T13:03:47.798Z
last refreshed on: 2026-06-08T13:03:47.798Z
source accessed on: 2019-12-03T20:05:01Z
source last accessed on: 2019-12-03T20:05:01Z
label: Produção de petróleo bruto @pt
label: Producción de crudo @es
label: Production de pétrole @fr
label: Produzione di greggio @it
label: Rohölproduktion @de
label: Добыча сырой нефти @ru
label: 原油生产 @zh
label: 原油生産 @ja
label: 原油產量 @zh-hant
label: 원유 생산 @ko
definition: This segment includes companies that explore and develop crude oil deposits. Such deposits include those found on land and sea.
notation: 1310111010
valid from: 2014-08-08
valid till: 2020-10-03

Oil Sands Production
type: BicsLevel5Segment
type: Classifier
type: NamedIndividual
is level5 segment of: Crude Oil & Natural Gas E&P
is anachronous version of: http://data.ga-group.nl/ics/bics/131010111011
is contemporary version of: http://data.ga-group.nl/ics/bics/1310111011
is replaced by: http://data.ga-group.nl/ics/bics/2020/131010111011
is version of: http://data.ga-group.nl/ics/bics/131010111011
is version of: http://data.ga-group.nl/ics/bics/1310111011
imported on: 2026-06-08T13:03:47.798Z
last refreshed on: 2026-06-08T13:03:47.798Z
source accessed on: 2019-12-03T20:05:01Z
source last accessed on: 2019-12-03T20:05:01Z
label: Produção de areias petrolíferas @pt
label: Producción de arenas petrolíferas @es
label: Production de sables bitumeux @fr
label: Produzione sabbie petrolifere @it
label: Ölsandförderung @de
label: Добыча нефтеносного песка @ru
label: 油砂生产 @zh
label: 油砂產量 @zh-hant
label: 오일샌드 생산량 @ko
label: ｵｲﾙｻﾝﾄﾞ生産量 @ja
definition: This segment includes companies that explore for and develop oil sands deposits.
notation: 1310111011
valid from: 2014-08-08
valid till: 2020-10-03

Natural Gas Liquids Production
type: BicsLevel5Segment
type: Classifier
type: NamedIndividual
is level5 segment of: Crude Oil & Natural Gas E&P
is anachronous version of: http://data.ga-group.nl/ics/bics/131010111012
is contemporary version of: http://data.ga-group.nl/ics/bics/1310111012
is replaced by: http://data.ga-group.nl/ics/bics/2020/131010111012
is version of: http://data.ga-group.nl/ics/bics/131010111012
is version of: http://data.ga-group.nl/ics/bics/1310111012
imported on: 2026-06-08T13:03:47.798Z
last refreshed on: 2026-06-08T13:03:47.798Z
source accessed on: 2019-12-03T20:05:01Z
source last accessed on: 2019-12-03T20:05:01Z
label: Líquidos de gás natural @pt
label: Liquidi gas naturale @it
label: Producción de gas natural licuado @es
label: Production de liquides du gaz naturel @fr
label: Produktion von Erdgaskondensat @de
label: СПГ @ru
label: 天然气凝析液��产 @zh
label: 天然氣凝結油生產 @zh-hant
label: 天然ｶﾞｽ液生産 @ja
label: 액화천연가스 @ko
definition: This segment includes companies that produce natural gas liquids (NGLs).
notation: 1310111012
valid from: 2014-08-08
valid till: 2020-10-03

Natural Gas Production
type: BicsLevel5Segment
type: Classifier
type: NamedIndividual
is level5 segment of: Crude Oil & Natural Gas E&P
is anachronous version of: http://data.ga-group.nl/ics/bics/131010111013
is contemporary version of: http://data.ga-group.nl/ics/bics/1310111013
is replaced by: http://data.ga-group.nl/ics/bics/2020/131010111013
is version of: http://data.ga-group.nl/ics/bics/131010111013
is version of: http://data.ga-group.nl/ics/bics/1310111013
imported on: 2026-06-08T13:03:47.798Z
last refreshed on: 2026-06-08T13:03:47.798Z
source accessed on: 2019-12-03T20:05:01Z
source last accessed on: 2019-12-03T20:05:01Z
label: Erdgasproduktion @de
label: Produção de gás natural @pt
label: Producción de gas natural @es
label: Production de gaz naturel @fr
label: Produzione gas naturale @it
label: Добыча природного газа @ru
label: 天然气生产 @zh
label: 天然氣產量 @zh-hant
label: 天然ｶﾞｽ生産 @ja
label: 천연가스 생산 @ko
definition: This segment includes companies that explore and develop natural gas deposits.
notation: 1310111013
valid from: 2014-08-08
valid till: 2020-10-03

Negative Royalties
type: BicsLevel5Segment
type: Classifier
type: NamedIndividual
is level5 segment of: Crude Oil & Natural Gas E&P
is anachronous version of: http://data.ga-group.nl/ics/bics/131010111014
is contemporary version of: http://data.ga-group.nl/ics/bics/1310111014
is replaced by: http://data.ga-group.nl/ics/bics/2020/131010111014
is version of: http://data.ga-group.nl/ics/bics/131010111014
is version of: http://data.ga-group.nl/ics/bics/1310111014
imported on: 2026-06-08T13:03:47.798Z
last refreshed on: 2026-06-08T13:03:47.798Z
source accessed on: 2019-12-03T20:05:01Z
source last accessed on: 2019-12-03T20:05:01Z
label: Neg. Förderungsabg. @de
label: Regalías negativas @es
label: Rendite negative @it
label: Royalties négatifs @fr
label: Royalties negativos @pt
label: Отрицат. лицензион. сборы @ru
label: 負採礦權 - 能源 @zh-hant
label: 负特许使用权 @zh
label: 역방향로열티 @ko
label: ﾈｶﾞﾃｨﾌﾞ･ﾛｲﾔﾙﾃｨ @ja
definition: This segment includes companies that pay royalty fees to government bodies for the production of fossil fuels.
notation: 1310111014
valid from: 2014-08-08
valid till: 2020-10-03

Crude Oil & Natural Gas E&P
type: BicsLevel4SubIndustry
type: Classifier
type: NamedIndividual
is sub industry of: Exploration & Production
is anachronous version of: http://data.ga-group.nl/ics/bics/1310101110
is contemporary version of: http://data.ga-group.nl/ics/bics/13101110
is replaced by: http://data.ga-group.nl/ics/bics/2020/1310101110
is version of: http://data.ga-group.nl/ics/bics/1310101110
is version of: http://data.ga-group.nl/ics/bics/13101110
imported on: 2026-06-08T13:03:47.798Z
last refreshed on: 2026-06-08T13:03:47.798Z
source accessed on: 2019-12-03T20:05:01Z
source last accessed on: 2019-12-03T20:05:01Z
label: Crudo y gas natural E&P @es
label: E&P Rohöl & Erdgas @de
label: E&P de petróleo e gás natural @pt
label: E&P greggio e gas naturale @it
label: Explo/prod gaz naturel/pétrole @fr
label: Сыр. нефть и прир. газ, E&P @ru
label: 原油&天然ｶﾞｽ探査･生産 @ja
label: 原油及天然氣探勘與生產 @zh-hant
label: 原油和天然气勘探与生产 @zh
label: 원유& 천연가스 E&P @ko
definition: This industry subgroup includes companies that explore and develop deposits of crude oil and natural gas.
notation: 13101110
valid from: 2014-08-08
valid till: 2020-10-03

Oil & Natural Gas Mkt & Trading
type: BicsLevel4SubIndustry
type: Classifier
type: NamedIndividual
is sub industry of: Exploration & Production
is anachronous version of: http://data.ga-group.nl/ics/bics/1310101111
is contemporary version of: http://data.ga-group.nl/ics/bics/13101111
is replaced by: http://data.ga-group.nl/ics/bics/2020/1310101111
is version of: http://data.ga-group.nl/ics/bics/1310101111
is version of: http://data.ga-group.nl/ics/bics/13101111
imported on: 2026-06-08T13:03:47.798Z
last refreshed on: 2026-06-08T13:03:47.798Z
source accessed on: 2019-12-03T20:05:01Z
source last accessed on: 2019-12-03T20:05:01Z
label: Comercialización/operaciones de gas natural y petróleo @es
label: Mkt e negoc petróleo e gás natural @pt
label: Mkt e trading greggio e gas naturale @it
label: Mktg et négociation pétrole/gaz naturel @fr
label: Öl & Erdgas Mkt & Handel @de
label: Продажи нефти и ПГ @ru
label: 石油&天然ｶﾞｽ販売･取引 @ja
label: 石油与天然气营销与交易 @zh
label: 石油及天然氣行銷與交易 @zh-hant
label: 석유 & 천연가스 판매 & 거래 @ko
definition: This industry subgroup includes segments of exploration and production companies that market and resell third-party purchased crude oil and natural gas volumes.
notation: 13101111
valid from: 2014-08-08
valid till: 2020-10-03

Royalty Income - Oil & Gas
type: BicsLevel4SubIndustry
type: Classifier
type: NamedIndividual
is sub industry of: Exploration & Production
is anachronous version of: http://data.ga-group.nl/ics/bics/1310101112
is contemporary version of: http://data.ga-group.nl/ics/bics/13101112
is replaced by: http://data.ga-group.nl/ics/bics/2020/1310101112
is version of: http://data.ga-group.nl/ics/bics/1310101112
is version of: http://data.ga-group.nl/ics/bics/13101112
imported on: 2026-06-08T13:03:47.798Z
last refreshed on: 2026-06-08T13:03:47.798Z
source accessed on: 2019-12-03T20:05:01Z
source last accessed on: 2019-12-03T20:05:01Z
label: Ingreso de regalías - Petróleo y gas @es
label: Lizenzertrag - Erdöl & Erdgas @de
label: Redd concessione-Petr e gas @it
label: Renda de Royalties-Petróleo e gás @pt
label: Revenus de royalty - pétrole et gaz @fr
label: Нефть и газ - дхд от лиц. поступл. @ru
label: 權利金收入-油氣 @zh-hant
label: 特许权收入-石油和天然气 @zh
label: 로얄티수입 - 석유 & 가스 @ko
label: ﾛｲﾔﾙﾃｨ収益-石油ｶﾞｽ @ja
definition: This industry subgroup includes companies that receive royalties from energy properties, such as oil fields.
notation: 13101112
valid from: 2014-08-08
valid till: 2020-10-03

Exploration & Production
type: BicsLevel3Industry
type: Classifier
type: NamedIndividual
is industry of: Oil, Gas & Coal
is anachronous version of: http://data.ga-group.nl/ics/bics/13101011
is contemporary version of: http://data.ga-group.nl/ics/bics/131011
is replaced by: http://data.ga-group.nl/ics/bics/2020/13101011
is version of: http://data.ga-group.nl/ics/bics/13101011
is version of: http://data.ga-group.nl/ics/bics/131011
imported on: 2026-06-08T13:03:47.798Z
last refreshed on: 2026-06-08T13:03:47.798Z
source accessed on: 2019-12-03T20:05:01Z
source last accessed on: 2019-12-03T20:05:01Z
label: Esplorazione e produzione @it
label: Exploración y prod @es
label: Exploration & Produktion @de
label: Exploration/production @fr
label: Prod e Exploração @pt
label: Разведка и добыча @ru
label: 勘探及生产 @zh
label: 探勘及生產 @zh-hant
label: 探査･生産 @ja
label: 탐사 & 생산 @ko
definition: This industry includes companies that explore for, extract or produce energy products. Such products include crude oil, natural gas, liquefied natural gas and liquefied petroleum. This industry also includes royalties received from these energy properties.
notation: 131011
valid from: 2014-08-08
valid till: 2020-10-03

Crude Oil Pipelines & Storage
type: BicsLevel6Segment
type: Classifier
type: NamedIndividual
is level6 segment of: Oil Pipelines & Storage
is anachronous version of: http://data.ga-group.nl/ics/bics/13101012101010
is contemporary version of: http://data.ga-group.nl/ics/bics/131012101010
is replaced by: http://data.ga-group.nl/ics/bics/2020/13101012101010
is version of: http://data.ga-group.nl/ics/bics/13101012101010
is version of: http://data.ga-group.nl/ics/bics/131012101010
imported on: 2026-06-08T13:03:47.798Z
last refreshed on: 2026-06-08T13:03:47.798Z
source accessed on: 2019-12-03T20:05:01Z
source last accessed on: 2019-12-03T20:05:01Z
label: Almacenamiento de oleoductos de crudo @es
label: Oleodotti e stoccaggio greggio @it
label: Oleodutos de bruto e armazenagem @pt
label: Pipeline de pétrole brut et stockage @fr
label: Rohöl-Pipelines & -lagerung @de
label: Трубопроводы для сырой нефти и хранение @ru
label: 原油管線及儲存 @zh-hant
label: 原油管道与存储 @zh
label: 原油輸送 @ja
label: 원유 파이프라인 & 저장 @ko
definition: This segment includes companies that own and operate pipelines and terminal facilities for crude oil. These companies may realize revenue through toll transportation and storage services or through purchasing and reselling of the underlying products. These companies utilize their distribution network to link crude-oil production companies and refineries.
notation: 131012101010
valid from: 2014-08-08
valid till: 2020-10-03

Refined Products Pipelines & Sto
type: BicsLevel6Segment
type: Classifier
type: NamedIndividual
is level6 segment of: Oil Pipelines & Storage
is anachronous version of: http://data.ga-group.nl/ics/bics/13101012101011
is contemporary version of: http://data.ga-group.nl/ics/bics/131012101011
is replaced by: http://data.ga-group.nl/ics/bics/2020/13101012101011
is version of: http://data.ga-group.nl/ics/bics/13101012101011
is version of: http://data.ga-group.nl/ics/bics/131012101011
imported on: 2026-06-08T13:03:47.798Z
last refreshed on: 2026-06-08T13:03:47.798Z
source accessed on: 2019-12-03T20:05:01Z
source last accessed on: 2019-12-03T20:05:01Z
label: Ductos de productos refinados y sto @es
label: Dutos e arm de produtos refinados @pt
label: Oleodotti e stoccaggio prod raffinati @it
label: Pipelines prod raffinés/stockage @fr
label: Raffinierter Prod. Pipelines & Lagerung @de
label: Трубопровод д/ продуктов нефтеперераб. и хранение @ru
label: 精炼产品管道与存储 @zh
label: 精煉產品管線及儲存 @zh-hant
label: 精製品輸送 @ja
label: 정유제품 파이프라인 & 저장 @ko
definition: This segment includes companies that own and operate pipelines and terminal facilities for refined oil products. These companies may realize revenue through toll transportation and storage services or through purchasing and reselling of the underlying products. These companies utilize their distribution network to link refineries to their end users.
notation: 131012101011
valid from: 2014-08-08
valid till: 2020-10-03

Oil Pipelines & Storage
type: BicsLevel5Segment
type: Classifier
type: NamedIndividual
is level5 segment of: Oil & Liquid Rich Gas Pipelines
is anachronous version of: http://data.ga-group.nl/ics/bics/131010121010
is contemporary version of: http://data.ga-group.nl/ics/bics/1310121010
is replaced by: http://data.ga-group.nl/ics/bics/2020/131010121010
is version of: http://data.ga-group.nl/ics/bics/131010121010
is version of: http://data.ga-group.nl/ics/bics/1310121010
imported on: 2026-06-08T13:03:47.798Z
last refreshed on: 2026-06-08T13:03:47.798Z
source accessed on: 2019-12-03T20:05:01Z
source last accessed on: 2019-12-03T20:05:01Z
label: Condotte e scorte greggio @it
label: Oleoductos y almacenamiento @es
label: Oleodutos e armaz @pt
label: Pipelines de pétrole et stockage @fr
label: Öl-Pipelines & -lagerung @de
label: Нефтепроводы и хранилищи @ru
label: 石油管線及貯存 @zh-hant
label: 石油管道与存储 @zh
label: 石油ﾊﾟｲﾌﾟﾗｲﾝ･貯蔵 @ja
label: 석유 파이프라인 & 저장 @ko
definition: This segment includes companies that own and operate pipelines and terminal facilities for oil products. These companies may realize revenue through toll transportation and storage services or through purchasing and reselling of the underlying products.
notation: 1310121010
valid from: 2014-08-08
valid till: 2020-10-03

Nat Gas Gathering & Processing
type: BicsLevel6Segment
type: Classifier
type: NamedIndividual
is level6 segment of: NGL Pipelines & Services
is anachronous version of: http://data.ga-group.nl/ics/bics/13101012101110
is contemporary version of: http://data.ga-group.nl/ics/bics/131012101110
is replaced by: http://data.ga-group.nl/ics/bics/2020/13101012101110
is version of: http://data.ga-group.nl/ics/bics/13101012101110
is version of: http://data.ga-group.nl/ics/bics/131012101110
imported on: 2026-06-08T13:03:47.798Z
last refreshed on: 2026-06-08T13:03:47.798Z
source accessed on: 2019-12-03T20:05:01Z
source last accessed on: 2019-12-03T20:05:01Z
label: Captura y proceso gas natural @es
label: Collecte et traitement gaz nat @fr
label: Erdgaserfassung & -aufbereitung @de
label: Processamento e recolhimento de gás nat @pt
label: Raccolta e lavorazione gas nat @it
label: ПГ - сбор и переработка @ru
label: 天然气收集与加工 @zh
label: 天然氣收集及處理 @zh-hant
label: 天然ｶﾞｽ処理 @ja
label: 천연가스 수집 & 처리 @ko
definition: This segment includes companies that own and operates pipelines that transport raw natural gas from wellheads. Also includes companies that treat, process and finally separate raw natural gas into dry natural gas and natural gas liquids. These companies may realize revenue through toll transportation, processing and storage services or through purchasing, processing and reselling of the underlying products.
notation: 131012101110
valid from: 2014-08-08
valid till: 2020-10-03

NGL Fractionation & Marketing
type: BicsLevel6Segment
type: Classifier
type: NamedIndividual
is level6 segment of: NGL Pipelines & Services
is anachronous version of: http://data.ga-group.nl/ics/bics/13101012101111
is contemporary version of: http://data.ga-group.nl/ics/bics/131012101111
is replaced by: http://data.ga-group.nl/ics/bics/2020/13101012101111
is version of: http://data.ga-group.nl/ics/bics/13101012101111
is version of: http://data.ga-group.nl/ics/bics/131012101111
imported on: 2026-06-08T13:03:47.798Z
last refreshed on: 2026-06-08T13:03:47.798Z
source accessed on: 2019-12-03T20:05:01Z
source last accessed on: 2019-12-03T20:05:01Z
label: Fraccionamiento y comercialización GNL @es
label: Fracionamento e marketing de GNL @pt
label: Fractionnement LGN et marketing @fr
label: LGN Frazionamento e marketing @it
label: NGL Fraktionierung & Marketing @de
label: NGL 부분분리 & 판매 @ko
label: Фракционирование СПГ и маркетинг @ru
label: 天然气凝析液分馏与营销 @zh
label: 天然氣凝結油分餾及行銷 @zh-hant
label: 天然ｶﾞｽ液分留 @ja
definition: This segment includes companies that break natural gas liquids (NGLs) into different liquids, such as ethane, propane and butane.
notation: 131012101111
valid from: 2014-08-08
valid till: 2020-10-03

Nat Gas Liquids Pipelines
type: BicsLevel6Segment
type: Classifier
type: NamedIndividual
is level6 segment of: NGL Pipelines & Services
is anachronous version of: http://data.ga-group.nl/ics/bics/13101012101112
is contemporary version of: http://data.ga-group.nl/ics/bics/131012101112
is replaced by: http://data.ga-group.nl/ics/bics/2020/13101012101112
is version of: http://data.ga-group.nl/ics/bics/13101012101112
is version of: http://data.ga-group.nl/ics/bics/131012101112
imported on: 2026-06-08T13:03:47.798Z
last refreshed on: 2026-06-08T13:03:47.798Z
source accessed on: 2019-12-03T20:05:01Z
source last accessed on: 2019-12-03T20:05:01Z
label: Condotte liquidi gas nat @it
label: Ductos de gas natural licuado @es
label: Dutos de líquidos de gás nat @pt
label: Erdgaskondensat-Pipelines @de
label: Pipelines LGN @fr
label: Трубопроводы для СПГ @ru
label: 天然气凝析液管道 @zh
label: 天然氣凝結油管線 @zh-hant
label: 天然ｶﾞｽ液輸送 @ja
label: 천연가스액체 파이프라인 @ko
definition: This segment includes companies that own and operate pipelines for natural gas liquids. These companies may realize revenue through toll transportation and storage services or through purchasing and reselling of the underlying products. These companies utilize their distribution network to link raw natural gas processing plants to NGL fractionation plants.
notation: 131012101112
valid from: 2014-08-08
valid till: 2020-10-03

NGL Pipelines & Services
type: BicsLevel5Segment
type: Classifier
type: NamedIndividual
is level5 segment of: Oil & Liquid Rich Gas Pipelines
is anachronous version of: http://data.ga-group.nl/ics/bics/131010121011
is contemporary version of: http://data.ga-group.nl/ics/bics/1310121011
is replaced by: http://data.ga-group.nl/ics/bics/2020/131010121011
is version of: http://data.ga-group.nl/ics/bics/131010121011
is version of: http://data.ga-group.nl/ics/bics/1310121011
imported on: 2026-06-08T13:03:47.798Z
last refreshed on: 2026-06-08T13:03:47.798Z
source accessed on: 2019-12-03T20:05:01Z
source last accessed on: 2019-12-03T20:05:01Z
label: Condotte e servizi GNL @it
label: Gasoductos y servicios GNL @es
label: NGL Pipelines & Dienste @de
label: NGL 파이프라인 & 서비스 @ko
label: NGL管道与服务 @zh
label: NGLﾊﾟｲﾌﾟﾗｲﾝ&ｻｰﾋﾞｽ @ja
label: Oleodutos e serv LGN @pt
label: Pipelines et services GNL @fr
label: ГКЖ-Трубопроводы и услуги @ru
label: 天然氣凝結油管線及服務 @zh-hant
definition: This segment includes companies that transport, store and process raw natural gas and their NGL byproducts. These companies may realize revenue through toll transportation and storage services or through purchasing and reselling of the underlying products.
notation: 1310121011
valid from: 2014-08-08
valid till: 2020-10-03

Oil & Liquid Rich Gas Pipelines
type: BicsLevel4SubIndustry
type: Classifier
type: NamedIndividual
is sub industry of: Midstream - Oil & Gas
is anachronous version of: http://data.ga-group.nl/ics/bics/1310101210
is contemporary version of: http://data.ga-group.nl/ics/bics/13101210
is replaced by: http://data.ga-group.nl/ics/bics/2020/1310101210
is version of: http://data.ga-group.nl/ics/bics/1310101210
is version of: http://data.ga-group.nl/ics/bics/13101210
imported on: 2026-06-08T13:03:47.798Z
last refreshed on: 2026-06-08T13:03:47.798Z
source accessed on: 2019-12-03T20:05:01Z
source last accessed on: 2019-12-03T20:05:01Z
label: Ductos de petróleo y gas rico en líquidos @es
label: Gasdotti greggio e gas ricco liquidi @it
label: Oleodutos e gasodutos Liquid Rich @pt
label: Pipelines de gaz riche liquide/pétrole @fr
label: Öl & Flüssigkeiten Starkgas-Pipelines @de
label: Трубопроводы д/нефти и насыщ. жидкого газа @ru
label: 石油与天然气凝析液管道 @zh
label: 石油與含液天然氣管線 @zh-hant
label: 石油･濃厚ｶﾞ��液ﾊﾟｲﾌﾟﾗｲﾝ @ja
label: 석유 & 액체가스 파이프라인 @ko
definition: This industry subgroup includes companies that own and operate pipelines and terminal facilities for oil and liquid rich gas. Also includes companies that process liquid rich gas into final end products. These companies may realize revenue through toll transportation and storage services or through purchasing and reselling of the underlying products.
notation: 13101210
valid from: 2014-08-08
valid till: 2020-10-03

Dry Natural Gas Pipelines
type: BicsLevel4SubIndustry
type: Classifier
type: NamedIndividual
is sub industry of: Midstream - Oil & Gas
is anachronous version of: http://data.ga-group.nl/ics/bics/1310101211
is contemporary version of: http://data.ga-group.nl/ics/bics/13101211
is replaced by: http://data.ga-group.nl/ics/bics/2020/1310101211
is version of: http://data.ga-group.nl/ics/bics/1310101211
is version of: http://data.ga-group.nl/ics/bics/13101211
imported on: 2026-06-08T13:03:47.798Z
last refreshed on: 2026-06-08T13:03:47.798Z
source accessed on: 2019-12-03T20:05:01Z
source last accessed on: 2019-12-03T20:05:01Z
label: Dutos de gás natural seco @pt
label: Gasdotti gas naturale secco @it
label: Gasoductos seco @es
label: Pipelines de gaz naturel sec @fr
label: Trockenerdgas-Pipelines @de
label: Сухие газопроводы @ru
label: 天然氣運輸 @zh-hant
label: 天然ｶﾞｽ輸送 @ja
label: 干天然气管道 @zh
label: 건성천연가스 파이프���인 @ko
definition: This industry subgroup includes companies that own and operate pipelines for dry natural gas. These companies may realize revenue through toll transportation and storage services or through purchasing and reselling of the underlying products. These companies utilize their distribution network to link raw natural gas processing plants to utilities, liquefied natural gas (LNG) facilities and other end users.
notation: 13101211
valid from: 2014-08-08
valid till: 2020-10-03

LNG Liquefaction - Reg
type: BicsLevel6Segment
type: Classifier
type: Discontinued
type: NamedIndividual
is level6 segment of: LNG Liquefaction
is contemporary version of: http://data.ga-group.nl/ics/bics/131012121010
is version of: http://data.ga-group.nl/ics/bics/131012121010
imported on: 2026-06-08T13:03:47.798Z
last refreshed on: 2026-06-08T13:03:47.798Z
source accessed on: 2019-12-03T20:05:01Z
source last accessed on: 2019-12-03T20:05:01Z
label: LNG Liquefaktion - reg. @de
label: LNG液化-管制 @zh
label: LNG液化ﾀｰﾐﾅﾙ-規制 @ja
label: LNG액화-규제 @ko
label: Licuación de LNG - reg @es
label: Liquéfaction du GNL - Rég @fr
label: Liquefação GNL - Reg @pt
label: Liquefazione GNL - Reg @it
label: Разжижение СПГ - регулир. @ru
label: 液化天然氣液化-管制 @zh-hant
definition: This segment includes companies that own or operate facilities where natural gas is cooled to a liquid state (LNG) for shipping. Revenue at such facilities is regulated by independent (elected) or politically appointed regulators.
notation: 131012121010
valid from: 2014-08-08
valid till: 2020-10-03

LNG Liquefaction - Unreg
type: BicsLevel6Segment
type: Classifier
type: Discontinued
type: NamedIndividual
is level6 segment of: LNG Liquefaction
is contemporary version of: http://data.ga-group.nl/ics/bics/131012121011
is version of: http://data.ga-group.nl/ics/bics/131012121011
imported on: 2026-06-08T13:03:47.798Z
last refreshed on: 2026-06-08T13:03:47.798Z
source accessed on: 2019-12-03T20:05:01Z
source last accessed on: 2019-12-03T20:05:01Z
label: LNG Liquefaktion - nicht reg. @de
label: LNG液化-非管制 @zh
label: LNG液化ﾀｰﾐﾅ���-規制外 @ja
label: LNG액화-비규제 @ko
label: Licuación de LNG - no reg @es
label: Liquéfaction du GNL - Non rég @fr
label: Liquefação GNL - Não reg @pt
label: Liquefazione GNL - Non reg @it
label: Разжижение СПГ - нерегулир. @ru
label: 液化天然氣液化-非管制 @zh-hant
definition: This segment includes companies that own or operate facilities where natural gas is cooled to a liquid state (LNG) for shipping. Revenue at such facilities is unregulated or conducted through other merchant revenue arrangements.
notation: 131012121011
valid from: 2014-08-08
valid till: 2020-10-03

LNG Liquefaction
type: BicsLevel5Segment
type: Classifier
type: NamedIndividual
is level5 segment of: Liquefied Natural Gas (LNG)
is anachronous version of: http://data.ga-group.nl/ics/bics/131010121210
is contemporary version of: http://data.ga-group.nl/ics/bics/1310121210
is replaced by: http://data.ga-group.nl/ics/bics/2020/131010121210
is version of: http://data.ga-group.nl/ics/bics/131010121210
is version of: http://data.ga-group.nl/ics/bics/1310121210
imported on: 2026-06-08T13:03:47.798Z
last refreshed on: 2026-06-08T13:03:47.798Z
source accessed on: 2019-12-03T20:05:01Z
source last accessed on: 2019-12-03T20:05:01Z
label: LNG Liquefaktion @de
label: LNG液化ﾀｰﾐﾅﾙ @ja
label: LNG액화 @ko
label: Licuación de LNG @es
label: Liquéfaction du GNL @fr
label: Liquefação GNL @pt
label: Liquefazione GNL @it
label: Разжижение СПГ @ru
label: 液化天然气液化 @zh
label: 液化天然氣液化 @zh-hant
definition: This segment includes companies that own or operate facilities where liquefied natural gas (LNG) is cooled to a liquid state for shipping.
notation: 1310121210
valid from: 2014-08-08
valid till: 2020-10-03

LNG Regasification - Reg
type: BicsLevel6Segment
type: Classifier
type: Discontinued
type: NamedIndividual
is level6 segment of: LNG Regasification
is contemporary version of: http://data.ga-group.nl/ics/bics/131012121110
is version of: http://data.ga-group.nl/ics/bics/131012121110
imported on: 2026-06-08T13:03:47.798Z
last refreshed on: 2026-06-08T13:03:47.798Z
source accessed on: 2019-12-03T20:05:01Z
source last accessed on: 2019-12-03T20:05:01Z
label: LNG Regasifizierung - reg. @de
label: LNG再气化-管制 @zh
label: LNG再ｶﾞｽ化ﾀｰﾐﾅﾙ-規制 @ja
label: LNG재기화-규제 @ko
label: Regaseificação GNL - Reg @pt
label: Regasificación de GNL- reg @es
label: Regazéification du GNL - Rég @fr
label: Rigassificazione GNL - Reg @it
label: Регазификация СПГ - регулир. @ru
label: 液化天然氣再氣化-管制 @zh-hant
definition: This segment includes companies that own or operate facilities where liquefied natural gas (LNG) is heated back to methane in a gaseous state for distribution to the transmission network. Revenue at such facilities is regulated by independent (elected) or politically appointed regulators.
notation: 131012121110
valid from: 2014-08-08
valid till: 2020-10-03

LNG Regasification - Unreg
type: BicsLevel6Segment
type: Classifier
type: Discontinued
type: NamedIndividual
is level6 segment of: LNG Regasification
is contemporary version of: http://data.ga-group.nl/ics/bics/131012121111
is version of: http://data.ga-group.nl/ics/bics/131012121111
imported on: 2026-06-08T13:03:47.798Z
last refreshed on: 2026-06-08T13:03:47.798Z
source accessed on: 2019-12-03T20:05:01Z
source last accessed on: 2019-12-03T20:05:01Z
label: LNG Regasifizierung - nicht reg. @de
label: LNG再气化-非管制 @zh
label: LNG再ｶﾞｽ化ﾀｰﾐﾅﾙ-規制外 @ja
label: LNG재기화-비규제 @ko
label: Regaseificação GNL - Não reg @pt
label: Regasificación de GNL- no reg @es
label: Regazéification du GNL - Non rég @fr
label: Rigassificazione GNL - Non reg @it
label: Регазификация СПГ - нерегулир. @ru
label: 液化天然氣再氣化-非管制 @zh-hant
definition: This segment includes companies that own or operate facilities where liquefied natural gas (LNG) is heated back to methane in a gaseous state for distribution to the transmission network. Revenue at such facilities is unregulated or conducted through other merchant revenue arrangements.
notation: 131012121111
valid from: 2014-08-08
valid till: 2020-10-03

LNG Regasification
type: BicsLevel5Segment
type: Classifier
type: NamedIndividual
is level5 segment of: Liquefied Natural Gas (LNG)
is anachronous version of: http://data.ga-group.nl/ics/bics/131010121211
is contemporary version of: http://data.ga-group.nl/ics/bics/1310121211
is replaced by: http://data.ga-group.nl/ics/bics/2020/131010121211
is version of: http://data.ga-group.nl/ics/bics/131010121211
is version of: http://data.ga-group.nl/ics/bics/1310121211
imported on: 2026-06-08T13:03:47.798Z
last refreshed on: 2026-06-08T13:03:47.798Z
source accessed on: 2019-12-03T20:05:01Z
source last accessed on: 2019-12-03T20:05:01Z
label: LNG Regasifizierung @de
label: LNG再气化 @zh
label: LNG再ｶﾞｽ化ﾀｰﾐﾅﾙ @ja
label: LNG재기화 @ko
label: Regaseificação GNL @pt
label: Regasificación de GNL @es
label: Regazéification du GNL @fr
label: Rigassificazione GNL @it
label: Регазификация СПГ @ru
label: 液化天然氣再氣化 @zh-hant
definition: This segment includes companies that own or operate facilities where liquefied natural gas (LNG) is heated back to methane into a gaseous state for distribution to the transmission network.
notation: 1310121211
valid from: 2014-08-08
valid till: 2020-10-03

Liquefied Natural Gas (LNG)
type: BicsLevel4SubIndustry
type: Classifier
type: NamedIndividual
is sub industry of: Midstream - Oil & Gas
is anachronous version of: http://data.ga-group.nl/ics/bics/1310101212
is contemporary version of: http://data.ga-group.nl/ics/bics/13101212
is replaced by: http://data.ga-group.nl/ics/bics/2020/1310101212
is version of: http://data.ga-group.nl/ics/bics/1310101212
is version of: http://data.ga-group.nl/ics/bics/13101212
imported on: 2026-06-08T13:03:47.798Z
last refreshed on: 2026-06-08T13:03:47.798Z
source accessed on: 2019-12-03T20:05:01Z
source last accessed on: 2019-12-03T20:05:01Z
label: Flüssigerdgas (LNG) @de
label: Gás natural liquefeito (GNL) @pt
label: Gas natural licuado (GNL) @es
label: Gas naturale liquefatto (GNL) @it
label: Gaz naturel liquéfié (GNL) @fr
label: LNGｲﾝﾌﾗ運営業 @ja
label: Сжиженный природный газ (СПГ) @ru
label: 液化天然气(LNG) @zh
label: 液化天然氣(LNG) @zh-hant
label: 액화천연가스(LNG) @ko
definition: This industry subgroup includes companies that operate liquefied natural gas (LNG) infrastructure. LNG is methane (natural) gas, cryogenically cooled to ‒260 degrees F (‒162 degrees C), at which point the vapor condenses to a liquid suitable for waterborne transport.
notation: 13101212
valid from: 2014-08-08
valid till: 2020-10-03

Midstream - Oil & Gas
type: BicsLevel3Industry
type: Classifier
type: NamedIndividual
is industry of: Oil, Gas & Coal
is anachronous version of: http://data.ga-group.nl/ics/bics/13101012
is contemporary version of: http://data.ga-group.nl/ics/bics/131012
is replaced by: http://data.ga-group.nl/ics/bics/2020/13101012
is version of: http://data.ga-group.nl/ics/bics/13101012
is version of: http://data.ga-group.nl/ics/bics/131012
imported on: 2026-06-08T13:03:47.798Z
last refreshed on: 2026-06-08T13:03:47.798Z
source accessed on: 2019-12-03T20:05:01Z
source last accessed on: 2019-12-03T20:05:01Z
label: Midstream - Öl & Gas @de
label: Midstream-Greggio e gas @it
label: Midstream-Pétro/gaz nat @fr
label: Petr e gás integr @pt
label: Transporte - petróleo y gas @es
label: Нефть/Газ - Переработка @ru
label: 中游-油气 @zh
label: 中游石油及天然氣業 @zh-hant
label: 石油･ｶﾞｽ - ﾊﾟｲﾌﾟﾗｲﾝ @ja
label: 미드스트림-석유 & 가스 @ko
definition: This industry includes companies that transport oil, oil products and natural gas through pipelines. This segment also includes companies that operate bulk station terminals.
notation: 131012
valid from: 2014-08-08
valid till: 2020-10-03

Midstream - Oil & Gas MLP
type: BicsLevel3Industry
type: Classifier
type: Discontinued
type: NamedIndividual
is industry of: Oil, Gas & Coal
is contemporary version of: http://data.ga-group.nl/ics/bics/131013
is version of: http://data.ga-group.nl/ics/bics/131013
imported on: 2026-06-08T13:03:47.798Z
last refreshed on: 2026-06-08T13:03:47.798Z
source accessed on: 2019-12-03T20:05:01Z
source last accessed on: 2019-12-03T20:05:01Z
label: Midstream - Öl & Gas MLP @de
label: Midstream-MLP greggio e gas @it
label: Sect interm- Pétrole et gaz MLP @fr
label: Setor intermediário - MLP Petr e gás @pt
label: Transporte - pet y gas MLP @es
label: Транспорт. нефти и газа, MLP @ru
label: 中游-石油和天然气MLP @zh
label: 中游石油及天然氣有限合夥 @zh-hant
label: 미드스트림 - 석유 & 가스 MLP @ko
label: ﾊﾟｲﾌﾟﾗｲﾝ - 石油･ｶﾞｽMLP @ja
definition: This industry includes companies that transport oil, oil products and natural gas through pipelines. This segment also includes companies that operate bulk station terminals. The companies in this industry are organized as Master Limited Partnerships (MLP), which requires distributions to be made to limited partners.
notation: 131013
valid from: 2014-08-08
valid till: 2020-10-03

Gasoline
type: BicsLevel6Segment
type: Classifier
type: Discontinued
type: NamedIndividual
is level6 segment of: Light Refined Products
is contemporary version of: http://data.ga-group.nl/ics/bics/131014101010
is version of: http://data.ga-group.nl/ics/bics/131014101010
imported on: 2026-06-08T13:03:47.798Z
last refreshed on: 2026-06-08T13:03:47.798Z
source accessed on: 2019-12-03T20:05:01Z
source last accessed on: 2019-12-03T20:05:01Z
label: Benzin @de
label: Benzina @it
label: Essence @fr
label: Gasolina @es
label: Бензин @ru
label: 汽油 @zh
label: 휘발유 @ko
label: ｶﾞｿﾘﾝ･ﾌﾞﾚﾝﾄﾞ基材 @ja
definition: This segment includes companies that refine crude oil and other products into gasoline and blendstocks.
notation: 131014101010
valid from: 2014-08-08
valid till: 2020-10-03

Liquefied Petroleum Gas
type: BicsLevel6Segment
type: Classifier
type: Discontinued
type: NamedIndividual
is level6 segment of: Light Refined Products
is contemporary version of: http://data.ga-group.nl/ics/bics/131014101011
is version of: http://data.ga-group.nl/ics/bics/131014101011
imported on: 2026-06-08T13:03:47.798Z
last refreshed on: 2026-06-08T13:03:47.798Z
source accessed on: 2019-12-03T20:05:01Z
source last accessed on: 2019-12-03T20:05:01Z
label: Distribución directa de gas licuado embotellado @es
label: Gás de petróleo liquefeito @pt
label: Gas petrolio liquefatto @it
label: Gaz de pétrole liquéfiés @fr
label: Petroleumflüssiggas (LPG) @de
label: Сжиженный нефтяной газ @ru
label: 液化石油气 @zh
label: 液化石油氣 @zh-hant
label: 液化石油ｶﾞｽ(LPG)生産 @ja
label: 액화석유가스 @ko
definition: This segment includes companies that produce or extract liquefied petroleum gas (LPG) from crude oil. LPG is composed propane, butane or a combination of the two.
notation: 131014101011
valid from: 2014-08-08
valid till: 2020-10-03

Nafta
type: BicsLevel6Segment
type: Classifier
type: Discontinued
type: NamedIndividual
is level6 segment of: Light Refined Products
is contemporary version of: http://data.ga-group.nl/ics/bics/131014101012
is version of: http://data.ga-group.nl/ics/bics/131014101012
imported on: 2026-06-08T13:03:47.798Z
last refreshed on: 2026-06-08T13:03:47.798Z
source accessed on: 2019-12-03T20:05:01Z
source last accessed on: 2019-12-03T20:05:01Z
label: Naphta @fr
label: Naphtha
label: Лигроин @ru
label: 石脑油 @zh
label: 石腦油 @zh-hant
label: 나프타 @ko
label: ﾅﾌｻ @ja
definition: This segment includes companies that refine crude oil and other products into naphtha.
notation: 131014101012
valid from: 2014-08-08
valid till: 2020-10-03

Other Refined Products
type: BicsLevel6Segment
type: Classifier
type: Discontinued
type: NamedIndividual
is level6 segment of: Light Refined Products
is contemporary version of: http://data.ga-group.nl/ics/bics/131014101013
is version of: http://data.ga-group.nl/ics/bics/131014101013
imported on: 2026-06-08T13:03:47.798Z
last refreshed on: 2026-06-08T13:03:47.798Z
source accessed on: 2019-12-03T20:05:01Z
source last accessed on: 2019-12-03T20:05:01Z
label: Altri prodotti raffinati @it
label: Autres produits raffinés @fr
label: Otros productos refinados @es
label: Outros produtos refinados @pt
label: Sonstige raffinierte Prod. @de
label: Др. продукты нефтеперераб. @ru
label: その他精製品 @ja
label: 其他精炼产品 @zh
label: 其他精煉產品 @zh-hant
label: 기타 정제제품 @ko
definition: This segment includes companies that refine crude oil and other products into products not elsewhere classified.
notation: 131014101013
valid from: 2014-08-08
valid till: 2020-10-03

Light Refined Products
type: BicsLevel5Segment
type: Classifier
type: Discontinued
type: NamedIndividual
is level5 segment of: Petroleum Refining
is contemporary version of: http://data.ga-group.nl/ics/bics/1310141010
is version of: http://data.ga-group.nl/ics/bics/1310141010
imported on: 2026-06-08T13:03:47.798Z
last refreshed on: 2026-06-08T13:03:47.798Z
source accessed on: 2019-12-03T20:05:01Z
source last accessed on: 2019-12-03T20:05:01Z
label: Leichte Raffinerieerzeugnisse @de
label: Prodotti raffinati leggeri @it
label: Productos ligeros refinados @es
label: Produits raffinés légers @fr
label: Produtos refinados leves @pt
label: Легк. нефтепродукты @ru
label: 軽油精製品 @ja
label: 輕煉油產品 @zh-hant
label: 轻炼油产品 @zh
label: 경 정유 제품 @ko
definition: This segment includes companies that refine crude oil and other products into light refined distillates.
notation: 1310141010
valid from: 2014-08-08
valid till: 2020-10-03

Diésel
type: BicsLevel6Segment
type: Classifier
type: Discontinued
type: NamedIndividual
is level6 segment of: Medium Refined Products
is contemporary version of: http://data.ga-group.nl/ics/bics/131014101110
is version of: http://data.ga-group.nl/ics/bics/131014101110
imported on: 2026-06-08T13:03:47.798Z
last refreshed on: 2026-06-08T13:03:47.798Z
source accessed on: 2019-12-03T20:05:01Z
source last accessed on: 2019-12-03T20:05:01Z
label: Diesel
label: Дизельное топливо @ru
label: 柴油 @zh
label: 디젤유 @ko
label: ﾃﾞｨｰｾﾞﾙ&ﾋｰﾃｨﾝｸﾞｵｲﾙ @ja
definition: This segment includes companies that refine crude oil and other products into diesel fuel.
notation: 131014101110
valid from: 2014-08-08
valid till: 2020-10-03

Heating Oil
type: BicsLevel6Segment
type: Classifier
type: Discontinued
type: NamedIndividual
is level6 segment of: Medium Refined Products
is contemporary version of: http://data.ga-group.nl/ics/bics/131014101111
is version of: http://data.ga-group.nl/ics/bics/131014101111
imported on: 2026-06-08T13:03:47.798Z
last refreshed on: 2026-06-08T13:03:47.798Z
source accessed on: 2019-12-03T20:05:01Z
source last accessed on: 2019-12-03T20:05:01Z
label: Heizöl @de
label: Mazout domestique @fr
label: Olio riscaldamento @it
label: Petróleo para calefacción @es
label: Óleo de calefação @pt
label: Топ. мазут @ru
label: 取暖油 @zh
label: 熱燃油 @zh-hant
label: 난방유 @ko
label: ﾋｰﾃｨﾝｸﾞｵｲﾙ @ja
definition: This segment includes companies that refine crude oil and other products into heating oil.
notation: 131014101111
valid from: 2014-08-08
valid till: 2020-10-03

Jet Fuel & Kerosene
type: BicsLevel6Segment
type: Classifier
type: Discontinued
type: NamedIndividual
is level6 segment of: Medium Refined Products
is contemporary version of: http://data.ga-group.nl/ics/bics/131014101112
is version of: http://data.ga-group.nl/ics/bics/131014101112
imported on: 2026-06-08T13:03:47.798Z
last refreshed on: 2026-06-08T13:03:47.798Z
source accessed on: 2019-12-03T20:05:01Z
source last accessed on: 2019-12-03T20:05:01Z
label: Carburéacteur/kérosène @fr
label: Carburante aereo e cherosene @it
label: Combustível de avião e querosene @pt
label: Combustible y queroseno de jet @es
label: Düsentreibstoff & Kerosin @de
label: Реакт. топл. и керосин @ru
label: 航空燃料煤油 @zh-hant
label: 航空燃油与煤油 @zh
label: 제트유 & 등유 @ko
label: ｼﾞｪｯﾄ燃料油 @ja
definition: This segment includes companies that refine crude oil and other products into jet fuel.
notation: 131014101112
valid from: 2014-08-08
valid till: 2020-10-03

Medium Refined Products
type: BicsLevel5Segment
type: Classifier
type: Discontinued
type: NamedIndividual
is level5 segment of: Petroleum Refining
is contemporary version of: http://data.ga-group.nl/ics/bics/1310141011
is version of: http://data.ga-group.nl/ics/bics/1310141011
imported on: 2026-06-08T13:03:47.798Z
last refreshed on: 2026-06-08T13:03:47.798Z
source accessed on: 2019-12-03T20:05:01Z
source last accessed on: 2019-12-03T20:05:01Z
label: Mittel, raffinierte Produkte @de
label: Prod raffinés interméd @fr
label: Prodotti raffinati medi @it
label: Productos refinados medianos @es
label: Produtos refinados médios @pt
label: Продукты средн. нефтепереработки @ru
label: 中等精炼产品 @zh
label: 中精煉產品 @zh-hant
label: 精製留出油 @ja
label: 중질 정제제품 @ko
definition: This segment includes companies that refine crude oil and other products into medium refined distillates.
notation: 1310141011
valid from: 2014-08-08
valid till: 2020-10-03

Residual Fuel
type: BicsLevel6Segment
type: Classifier
type: Discontinued
type: NamedIndividual
is level6 segment of: Heavy Refined Products
is contemporary version of: http://data.ga-group.nl/ics/bics/131014101210
is version of: http://data.ga-group.nl/ics/bics/131014101210
imported on: 2026-06-08T13:03:47.798Z
last refreshed on: 2026-06-08T13:03:47.798Z
source accessed on: 2019-12-03T20:05:01Z
source last accessed on: 2019-12-03T20:05:01Z
label: Carburante residual @es
label: Carburante residuo @it
label: Combustível residual @pt
label: Fioul résiduel @fr
label: Marinedieselöl @de
label: Остаточное топливо @ru
label: 残油 @zh
label: 残油燃料(#6重油) @ja
label: 蒸餘油 @zh-hant
label: 중유 @ko
definition: This segment includes companies that refine crude oil and other products into residual fuel.
notation: 131014101210
valid from: 2014-08-08
valid till: 2020-10-03

Heavy Refined Products
type: BicsLevel5Segment
type: Classifier
type: Discontinued
type: NamedIndividual
is level5 segment of: Petroleum Refining
is contemporary version of: http://data.ga-group.nl/ics/bics/1310141012
is version of: http://data.ga-group.nl/ics/bics/1310141012
imported on: 2026-06-08T13:03:47.798Z
last refreshed on: 2026-06-08T13:03:47.798Z
source accessed on: 2019-12-03T20:05:01Z
source last accessed on: 2019-12-03T20:05:01Z
label: Prodotti raffinati pesanti @it
label: Productos de refinación pesada @es
label: Produits raffinés lourds @fr
label: Produtos refinados pesados @pt
label: Schwere Raffinerieerzeugnisse @de
label: Тяж. нефтепродукты @ru
label: 重油精製品 @ja
label: 重炼油产品 @zh
label: 重煉油產品 @zh-hant
label: 중 정유 제품 @ko
definition: This segment includes companies that refine crude oil and other products into heavy refined distillates. Excludes asphalt and tar (see Asphalt).
notation: 1310141012
valid from: 2014-08-08
valid till: 2020-10-03

Petroleum Refining
type: BicsLevel4SubIndustry
type: Classifier
type: NamedIndividual
is sub industry of: Refining & Marketing
is anachronous version of: http://data.ga-group.nl/ics/bics/1310101310
is contemporary version of: http://data.ga-group.nl/ics/bics/13101410
is replaced by: http://data.ga-group.nl/ics/bics/2020/1310101310
is version of: http://data.ga-group.nl/ics/bics/1310101310
is version of: http://data.ga-group.nl/ics/bics/13101410
imported on: 2026-06-08T13:03:47.798Z
last refreshed on: 2026-06-08T13:03:47.798Z
source accessed on: 2019-12-03T20:05:01Z
source last accessed on: 2019-12-03T20:05:01Z
label: Petroleumraffination @de
label: Raffinage de pétrole @fr
label: Raffinaz di petrolio @it
label: Refinación petróleo @es
label: Refinaria petróelo @pt
label: Нефтепереработка @ru
label: 石油提炼 @zh
label: 石油煉製 @zh-hant
label: 石油精製業 @ja
label: 석유정제 @ko
definition: This industry subgroup includes companies that refine crude oil feedstock and other products into various distillates. These companies own and operate oil refineries. Excludes petrochemicals (see Organic Base Chem & Interms).
notation: 13101410
valid from: 2014-08-08
valid till: 2020-10-03

Distillates - Owned Stations
type: BicsLevel7Segment
type: Classifier
type: Discontinued
type: NamedIndividual
is level7 segment of: Company Owned Stations
is contemporary version of: http://data.ga-group.nl/ics/bics/13101411101010
is version of: http://data.ga-group.nl/ics/bics/13101411101010
imported on: 2026-06-08T13:03:47.798Z
last refreshed on: 2026-06-08T13:03:47.798Z
source accessed on: 2019-12-03T20:05:01Z
source last accessed on: 2019-12-03T20:05:01Z
label: Destilados - Postos detidos @pt
label: Destilados - estaciones propias @es
label: Destillate - Unternehmenseigene Tankstellen @de
label: Distillati - Distributori proprietà @it
label: Distillats - Stations détenues @fr
label: Дистилляты - станции в собственности @ru
label: 留出油-自社所有給油所 @ja
label: 蒸餾油站 @zh-hant
label: 蒸馏油-自有油站 @zh
label: 증류유-직영주유소 @ko
definition: This segment includes revenue derived from the sale of distillates, such as diesel fuel, CNG, LPG, LNG and heating oil in company owned stations. Excludes revenue from gasoline sales (see Gasoline - Owned Stations).
notation: 13101411101010
valid from: 2014-08-08
valid till: 2020-10-03

Gasoline - Owned Stations
type: BicsLevel7Segment
type: Classifier
type: Discontinued
type: NamedIndividual
is level7 segment of: Company Owned Stations
is contemporary version of: http://data.ga-group.nl/ics/bics/13101411101011
is version of: http://data.ga-group.nl/ics/bics/13101411101011
imported on: 2026-06-08T13:03:47.798Z
last refreshed on: 2026-06-08T13:03:47.798Z
source accessed on: 2019-12-03T20:05:01Z
source last accessed on: 2019-12-03T20:05:01Z
label: Benzin - Unternehmenseigene Tankstellen @de
label: Benzina - Distributori proprietà @it
label: Essence - Stations détenues @fr
label: Gasolina - Postos detidos @pt
label: Gasolina - estaciones propias @es
label: Бензин - станции в собственности @ru
label: 汽油-自有油站 @zh
label: 汽油站 @zh-hant
label: 휘발유-직영주유소 @ko
label: ｶﾞｿﾘﾝ-自社所有給油所 @ja
definition: This segment includes revenue derived from the sale of gasoline and blendstocks in company owned stations.
notation: 13101411101011
valid from: 2014-08-08
valid till: 2020-10-03

Company Owned Stations
type: BicsLevel6Segment
type: Classifier
type: NamedIndividual
is level6 segment of: Petroleum Retailers
is anachronous version of: http://data.ga-group.nl/ics/bics/13101013111010
is contemporary version of: http://data.ga-group.nl/ics/bics/131014111010
is replaced by: http://data.ga-group.nl/ics/bics/2020/13101013111010
is version of: http://data.ga-group.nl/ics/bics/13101013111010
is version of: http://data.ga-group.nl/ics/bics/131014111010
imported on: 2026-06-08T13:03:47.798Z
last refreshed on: 2026-06-08T13:03:47.798Z
source accessed on: 2019-12-03T20:05:01Z
source last accessed on: 2019-12-03T20:05:01Z
label: Distributori benzina proprietà società @it
label: Gasolineras propias de la empresa @es
label: Postos propriedade da empresa @pt
label: Stations détenues par la société @fr
label: Unternehmenseigene Tankstellen @de
label: Станции в собственности компании @ru
label: 公司油站 @zh-hant
label: 公司自有加油站 @zh
label: 회사직영 주유소 @ko
label: ｶﾞｿﾘﾝｽﾀﾝﾄﾞ(元売系) @ja
definition: This segment includes companies that own and operate gas stations that are integrated with an oil and gas company. Typically, these would be retailing arms of integrated oil or petroleum refining companies.
notation: 131014111010
valid from: 2014-08-08
valid till: 2020-10-03

Distillates - Filling Stations
type: BicsLevel7Segment
type: Classifier
type: Discontinued
type: NamedIndividual
is level7 segment of: Filling Stations
is contemporary version of: http://data.ga-group.nl/ics/bics/13101411101110
is version of: http://data.ga-group.nl/ics/bics/13101411101110
imported on: 2026-06-08T13:03:47.798Z
last refreshed on: 2026-06-08T13:03:47.798Z
source accessed on: 2019-12-03T20:05:01Z
source last accessed on: 2019-12-03T20:05:01Z
label: Destilados - Postos de abastecimento @pt
label: Destilados - estaciones de servicio @es
label: Destillate - Abfüllstationen @de
label: Distillati - Distributori rifornimento @it
label: Distillats - Stations de remplissage @fr
label: Дистилляты - заправочные станции @ru
label: 留出燃料油販売 @ja
label: 蒸餾油-加油站 @zh-hant
label: 蒸馏油-加油站 @zh
label: 증류유-주유소 @ko
definition: This segment includes revenue derived from the sale of distillates, such as diesel fuel, CNG, LPG, LNG and heating oil in filling stations. Excludes revenue from gasoline sales (see Gasoline - Filling Stations).
notation: 13101411101110
valid from: 2014-08-08
valid till: 2020-10-03

Gasoline - Filling Stations
type: BicsLevel7Segment
type: Classifier
type: Discontinued
type: NamedIndividual
is level7 segment of: Filling Stations
is contemporary version of: http://data.ga-group.nl/ics/bics/13101411101111
is version of: http://data.ga-group.nl/ics/bics/13101411101111
imported on: 2026-06-08T13:03:47.798Z
last refreshed on: 2026-06-08T13:03:47.798Z
source accessed on: 2019-12-03T20:05:01Z
source last accessed on: 2019-12-03T20:05:01Z
label: Benzin - Abfüllstationen @de
label: Benzina - Distributori rifornimento @it
label: Essence - Stations-service @fr
label: Gasolina - Postos de abastecimento @pt
label: Gasolina - estaciones de servicio @es
label: Бензин - заправочные станции @ru
label: 汽油-加油站 @zh
label: 휘발유-주유소 @ko
label: ｶﾞｿﾘﾝ���ﾀﾝﾄﾞ @ja
definition: This segment includes revenue derived from the sale of gasoline and blendstocks in filling stations.
notation: 13101411101111
valid from: 2014-08-08
valid till: 2020-10-03

Filling Stations
type: BicsLevel6Segment
type: Classifier
type: NamedIndividual
is level6 segment of: Petroleum Retailers
is anachronous version of: http://data.ga-group.nl/ics/bics/13101013111011
is contemporary version of: http://data.ga-group.nl/ics/bics/131014111011
is replaced by: http://data.ga-group.nl/ics/bics/2020/13101013111011
is version of: http://data.ga-group.nl/ics/bics/13101013111011
is version of: http://data.ga-group.nl/ics/bics/131014111011
imported on: 2026-06-08T13:03:47.798Z
last refreshed on: 2026-06-08T13:03:47.798Z
source accessed on: 2019-12-03T20:05:01Z
source last accessed on: 2019-12-03T20:05:01Z
label: Abfüllstationen @de
label: Estações de serviço @pt
label: Estaciones de servicio @es
label: Stations service @fr
label: Stazioni di servizio @it
label: Заправочн. станции @ru
label: 加油站 @zh
label: 給油�� @ja
label: 주유소 @ko
definition: This segment includes companies that own and operate independent gas stations.
notation: 131014111011
valid from: 2014-08-08
valid till: 2020-10-03

Petroleum Retailers
type: BicsLevel5Segment
type: Classifier
type: NamedIndividual
is level5 segment of: Petroleum Marketing
is anachronous version of: http://data.ga-group.nl/ics/bics/131010131110
is contemporary version of: http://data.ga-group.nl/ics/bics/1310141110
is replaced by: http://data.ga-group.nl/ics/bics/2020/131010131110
is version of: http://data.ga-group.nl/ics/bics/131010131110
is version of: http://data.ga-group.nl/ics/bics/1310141110
imported on: 2026-06-08T13:03:47.798Z
last refreshed on: 2026-06-08T13:03:47.798Z
source accessed on: 2019-12-03T20:05:01Z
source last accessed on: 2019-12-03T20:05:01Z
label: Comercialização gasolina @pt
label: Comercio al por menor de petróleo @es
label: Détaillants en pétrole @fr
label: Kraftstoffhändler @de
label: Rivenditori petrolio @it
label: Розничные магазины нефтепродуктов @ru
label: 石油零售 @zh-hant
label: 石油零售商 @zh
label: 석유소매업 @ko
label: ｶﾞｿﾘﾝ販売 @ja
definition: This segment includes companies that sell and distribute gasoline products on the retail level.
notation: 1310141110
valid from: 2014-08-08
valid till: 2020-10-03

Distillates Wholesalers
type: BicsLevel6Segment
type: Classifier
type: Discontinued
type: NamedIndividual
is level6 segment of: Petroleum Wholesalers
is contemporary version of: http://data.ga-group.nl/ics/bics/131014111110
is version of: http://data.ga-group.nl/ics/bics/131014111110
imported on: 2026-06-08T13:03:47.798Z
last refreshed on: 2026-06-08T13:03:47.798Z
source accessed on: 2019-12-03T20:05:01Z
source last accessed on: 2019-12-03T20:05:01Z
label: Atacadistas de destilados @pt
label: Destillatgroßhändler @de
label: Grossistes de distillats @fr
label: Grossisti di distillati @it
label: Mayoristas de destilados @es
label: Оптовики дистиллятов @ru
label: 留出油卸売業 @ja
label: 蒸餾油批發商 @zh-hant
label: 蒸馏油批发商 @zh
label: 증류유 도매업 @ko
definition: This segment includes companies that wholesale and distribute distillates, such as diesel, LPG, naphtha, kerosene, jet fuel, residual fuel and heating oil.
notation: 131014111110
valid from: 2014-08-08
valid till: 2020-10-03

Gasoline Wholesalers
type: BicsLevel6Segment
type: Classifier
type: Discontinued
type: NamedIndividual
is level6 segment of: Petroleum Wholesalers
is contemporary version of: http://data.ga-group.nl/ics/bics/131014111111
is version of: http://data.ga-group.nl/ics/bics/131014111111
imported on: 2026-06-08T13:03:47.798Z
last refreshed on: 2026-06-08T13:03:47.798Z
source accessed on: 2019-12-03T20:05:01Z
source last accessed on: 2019-12-03T20:05:01Z
label: Atacadistas de gasolina @pt
label: Benzingroßhändler @de
label: Grossistes d'essence @fr
label: Grossisti di benzina @it
label: Mayoristas de gasolina @es
label: Оптовики бензина @ru
label: 汽油批发商 @zh
label: 汽油批發商 @zh-hant
label: 휘발유 도매업 @ko
label: ｶﾞｿﾘﾝ卸売業 @ja
definition: This segment includes companies that wholesale and distribute gasoline and blendstocks.
notation: 131014111111
valid from: 2014-08-08
valid till: 2020-10-03

Lubricant Wholesalers
type: BicsLevel6Segment
type: Classifier
type: Discontinued
type: NamedIndividual
is level6 segment of: Petroleum Wholesalers
is contemporary version of: http://data.ga-group.nl/ics/bics/131014111112
is version of: http://data.ga-group.nl/ics/bics/131014111112
imported on: 2026-06-08T13:03:47.798Z
last refreshed on: 2026-06-08T13:03:47.798Z
source accessed on: 2019-12-03T20:05:01Z
source last accessed on: 2019-12-03T20:05:01Z
label: Atacadistas de lubrificantes @pt
label: Grossistes de lubrifiants @fr
label: Grossisti di lubrificanti @it
label: Mayoristas de lubricantes @es
label: Schmierölgroßhändler @de
label: Оптовики смазоч. материа��ов @ru
label: 润滑剂批发商 @zh
label: 潤滑油卸売業 @ja
label: 潤滑油批發商 @zh-hant
label: 윤활유 도매업 @ko
definition: This segment includes companies that wholesale and distribute lubricants. Includes wholesaling of engine oil and transmission oil.
notation: 131014111112
valid from: 2014-08-08
valid till: 2020-10-03

Other Petroleum Wholesalers
type: BicsLevel6Segment
type: Classifier
type: Discontinued
type: NamedIndividual
is level6 segment of: Petroleum Wholesalers
is contemporary version of: http://data.ga-group.nl/ics/bics/131014111113
is version of: http://data.ga-group.nl/ics/bics/131014111113
imported on: 2026-06-08T13:03:47.798Z
last refreshed on: 2026-06-08T13:03:47.798Z
source accessed on: 2019-12-03T20:05:01Z
source last accessed on: 2019-12-03T20:05:01Z
label: Altri grossisti petrolio @it
label: Autres grossistes de pétrole @fr
label: Otros mayoristas de petróleo @es
label: Outros atacadistas de petróleo @pt
label: Sonstige Erdölgroßhändler @de
label: Оптовики проч. нефтепродуктов @ru
label: その他石油卸売業 @ja
label: 其他石油批发商 @zh
label: 其他石油批發商 @zh-hant
label: 기타 석유 도매업 @ko
definition: This segment includes companies that wholesale and distribute refined petroleum products not elsewhere classified.
notation: 131014111113
valid from: 2014-08-08
valid till: 2020-10-03

Petroleum Wholesalers
type: BicsLevel5Segment
type: Classifier
type: NamedIndividual
is level5 segment of: Petroleum Marketing
is anachronous version of: http://data.ga-group.nl/ics/bics/131010131111
is contemporary version of: http://data.ga-group.nl/ics/bics/1310141111
is replaced by: http://data.ga-group.nl/ics/bics/2020/131010131111
is version of: http://data.ga-group.nl/ics/bics/131010131111
is version of: http://data.ga-group.nl/ics/bics/1310141111
imported on: 2026-06-08T13:03:47.798Z
last refreshed on: 2026-06-08T13:03:47.798Z
source accessed on: 2019-12-03T20:05:01Z
source last accessed on: 2019-12-03T20:05:01Z
label: Atacadistas de petróleo @pt
label: Erdölgroßhändler @de
label: Grossistes de pétrole @fr
label: Grossisti di petrolio @it
label: Mayoristas de petróleo @es
label: Опт. продавцы продукции из нефти @ru
label: 石油卸売業 @ja
label: 石油批发商 @zh
label: 石油批發商 @zh-hant
label: 석유 도매업 @ko
definition: This segment includes companies that wholesale refined petroleum products.
notation: 1310141111
valid from: 2014-08-08
valid till: 2020-10-03

Petroleum Marketing
type: BicsLevel4SubIndustry
type: Classifier
type: NamedIndividual
is sub industry of: Refining & Marketing
is anachronous version of: http://data.ga-group.nl/ics/bics/1310101311
is contemporary version of: http://data.ga-group.nl/ics/bics/13101411
is replaced by: http://data.ga-group.nl/ics/bics/2020/1310101311
is version of: http://data.ga-group.nl/ics/bics/1310101311
is version of: http://data.ga-group.nl/ics/bics/13101411
imported on: 2026-06-08T13:03:47.798Z
last refreshed on: 2026-06-08T13:03:47.798Z
source accessed on: 2019-12-03T20:05:01Z
source last accessed on: 2019-12-03T20:05:01Z
label: Márketing petróleo @es
label: Marketing pétrolier @fr
label: Marketing petróleo @pt
label: Marketing petrolio @it
label: Petroleum-Marketing @de
label: Маркетинг нефтепродуктов @ru
label: 石油营销 @zh
label: 石油行銷 @zh-hant
label: 石油販売業 @ja
label: 석유판매 @ko
definition: This industry subgroup includes companies that sell and distribute petroleum products both on the wholesale and retail level.
notation: 13101411
valid from: 2014-08-08
valid till: 2020-10-03

Refining & Marketing
type: BicsLevel3Industry
type: Classifier
type: NamedIndividual
is industry of: Oil, Gas & Coal
is anachronous version of: http://data.ga-group.nl/ics/bics/13101013
is contemporary version of: http://data.ga-group.nl/ics/bics/131014
is replaced by: http://data.ga-group.nl/ics/bics/2020/13101013
is version of: http://data.ga-group.nl/ics/bics/13101013
is version of: http://data.ga-group.nl/ics/bics/131014
imported on: 2026-06-08T13:03:47.798Z
last refreshed on: 2026-06-08T13:03:47.798Z
source accessed on: 2019-12-03T20:05:01Z
source last accessed on: 2019-12-03T20:05:01Z
label: Raffinage/marketing @fr
label: Raffinaz e marketing @it
label: Raffinierung & Marketing @de
label: Refinación/márketing @es
label: Refinarias e mktg @pt
label: Нефтепереработка и маркетинг @ru
label: 提煉及行銷 @zh-hant
label: 精炼与营销 @zh
label: 精製･販売 @ja
label: 정제 & 마케팅 @ko
definition: This industry includes companies that use refining techniques to separate crude petroleum into distillate products, such as gasoline and kerosene. They also market these products downstream or sell them through wholesalers and retail gas stations.
notation: 131014
valid from: 2014-08-08
valid till: 2020-10-03

Drill Support
type: BicsLevel5Segment
type: Classifier
type: NamedIndividual
is level5 segment of: Drilling & Drilling Support
is anachronous version of: http://data.ga-group.nl/ics/bics/1310111012
is contemporary version of: http://data.ga-group.nl/ics/bics/1310151010
is replaced by: http://data.ga-group.nl/ics/bics/2020/1310111012
is version of: http://data.ga-group.nl/ics/bics/1310111012
is version of: http://data.ga-group.nl/ics/bics/1310151010
imported on: 2026-06-08T13:03:47.798Z
last refreshed on: 2026-06-08T13:03:47.798Z
source accessed on: 2019-12-03T20:05:01Z
source last accessed on: 2019-12-03T20:05:01Z
label: Apoyo perf @es
label: Suporte perfuraç @pt
label: Support für Bohrungen @de
label: Support forage @fr
label: Supporto triv @it
label: Обеспечение бурения @ru
label: 採掘支援 @ja
label: 鑽井支援 @zh-hant
label: 钻井支持 @zh
label: 시추 지원 @ko
definition: This segment includes companies that provide support services for drilling operations or manufacture specialized drilling equipment. Support services include supplying of oil country tubular goods, casing, drilling and completion fluids, and equipment to drilling platforms. Also includes services such as cementing, logging-while-drilling, specialty waste management, inspection and transportation services. Specialized drilling hardware and equipment includes drill bits, reamers and stabilizers.
notation: 1310151010
valid from: 2014-08-08
valid till: 2020-10-03

Offshore Drilling
type: BicsLevel5Segment
type: Classifier
type: NamedIndividual
is level5 segment of: Drilling & Drilling Support
is anachronous version of: http://data.ga-group.nl/ics/bics/1310111011
is contemporary version of: http://data.ga-group.nl/ics/bics/1310151011
is replaced by: http://data.ga-group.nl/ics/bics/2020/1310111011
is version of: http://data.ga-group.nl/ics/bics/1310111011
is version of: http://data.ga-group.nl/ics/bics/1310151011
imported on: 2026-06-08T13:03:47.798Z
last refreshed on: 2026-06-08T13:03:47.798Z
source accessed on: 2019-12-03T20:05:01Z
source last accessed on: 2019-12-03T20:05:01Z
label: Forage offshore @fr
label: Offshore-Bohrung @de
label: Perforación externa @es
label: Perfuração Offshore @pt
label: Trivellaz offshore @it
label: Шельфовое бурение @ru
label: 境外合约钻井 @zh
label: 海上採掘請負業 @ja
label: 海域鑽井 @zh-hant
label: 해저석유청부시추 @ko
definition: This segment includes companies that drill for oil and natural gas offshore on a contract basis. These companies own and operate various drilling rigs in order to provide these services for exploration and production companies.
notation: 1310151011
valid from: 2014-08-08
valid till: 2020-10-03

Onshore Drilling
type: BicsLevel5Segment
type: Classifier
type: NamedIndividual
is level5 segment of: Drilling & Drilling Support
is anachronous version of: http://data.ga-group.nl/ics/bics/1310111010
is contemporary version of: http://data.ga-group.nl/ics/bics/1310151012
is replaced by: http://data.ga-group.nl/ics/bics/2020/1310111010
is version of: http://data.ga-group.nl/ics/bics/1310111010
is version of: http://data.ga-group.nl/ics/bics/1310151012
imported on: 2026-06-08T13:03:47.798Z
last refreshed on: 2026-06-08T13:03:47.798Z
source accessed on: 2019-12-03T20:05:01Z
source last accessed on: 2019-12-03T20:05:01Z
label: Forage onshore @fr
label: Onshore-Bohrung @de
label: Perforación dom @es
label: Perfuração doméstica @pt
label: Trivellaz onshore @it
label: Наземное бурение @ru
label: 境內合約鑽井 @zh-hant
label: 沿��採掘請負業 @ja
label: 陆上钻井 @zh
label: 내륙석유청부시추 @ko
definition: This segment includes companies that drill for oil and natural gas onshore on a contract basis.
notation: 1310151012
valid from: 2014-08-08
valid till: 2020-10-03

Drilling & Drilling Support
type: BicsLevel4SubIndustry
type: Classifier
type: NamedIndividual
is sub industry of: Oil & Gas Services & Equip
is anachronous version of: http://data.ga-group.nl/ics/bics/13101110
is contemporary version of: http://data.ga-group.nl/ics/bics/13101510
is replaced by: http://data.ga-group.nl/ics/bics/2020/13101110
is version of: http://data.ga-group.nl/ics/bics/13101110
is version of: http://data.ga-group.nl/ics/bics/13101510
imported on: 2026-06-08T13:03:47.798Z
last refreshed on: 2026-06-08T13:03:47.798Z
source accessed on: 2019-12-03T20:05:01Z
source last accessed on: 2019-12-03T20:05:01Z
label: Bohrungen und Support für Bohrungen @de
label: Forage/Support de forage @fr
label: Perforación y apoyo @es
label: Perfur e sup perfuração @pt
label: Trivellazioni e supporto @it
label: Бурение и его обеспечение @ru
label: 採掘･採掘支援 @ja
label: 鑽井及鑽井支援 @zh-hant
label: 钻井与钻井支持 @zh
label: 시추 및 시추지원 @ko
definition: This industry subgroup includes companies that provide contract drilling services or provide support services for drilling operations and drilling platforms.
notation: 13101510
valid from: 2014-08-08
valid till: 2020-10-03

Diversified Oilfield Svcs
type: BicsLevel5Segment
type: Classifier
type: NamedIndividual
is level5 segment of: Oilfield Services & Equipment
is anachronous version of: http://data.ga-group.nl/ics/bics/1310111110
is contemporary version of: http://data.ga-group.nl/ics/bics/1310151110
is replaced by: http://data.ga-group.nl/ics/bics/2020/1310111110
is version of: http://data.ga-group.nl/ics/bics/1310111110
is version of: http://data.ga-group.nl/ics/bics/1310151110
imported on: 2026-06-08T13:03:47.798Z
last refreshed on: 2026-06-08T13:03:47.798Z
source accessed on: 2019-12-03T20:05:01Z
source last accessed on: 2019-12-03T20:05:01Z
label: Diversifizierte Ölfelddienste @de
label: Serv campi petroliferi diversificati @it
label: Serv de campo de petróleo diversificado @pt
label: Servc divers champs pétrolifères @fr
label: Servicios diversificados de yacimiento de petróleo @es
label: Диверсифиц. нефтепромысловые услуги @ru
label: 多元化油田服務 @zh-hant
label: 石油･ｶﾞｽ採掘 @ja
label: 综合油田服务 @zh
label: 다각화유전서비스 @ko
definition: This segment includes companies that provide a diversified portfolio of services and equipment to meet the needs of the exploration and production clients.
notation: 1310151110
valid from: 2014-08-08
valid till: 2020-10-03

Subsea Oilfield Services
type: BicsLevel5Segment
type: Classifier
type: NamedIndividual
is level5 segment of: Oilfield Services & Equipment
is anachronous version of: http://data.ga-group.nl/ics/bics/1310111111
is contemporary version of: http://data.ga-group.nl/ics/bics/1310151111
is replaced by: http://data.ga-group.nl/ics/bics/2020/1310111111
is version of: http://data.ga-group.nl/ics/bics/1310111111
is version of: http://data.ga-group.nl/ics/bics/1310151111
imported on: 2026-06-08T13:03:47.798Z
last refreshed on: 2026-06-08T13:03:47.798Z
source accessed on: 2019-12-03T20:05:01Z
source last accessed on: 2019-12-03T20:05:01Z
label: Serv campos petróleo submar @pt
label: Serv champs pétroliers sous-marins @fr
label: Serv petrolíferos submarinos @es
label: Servizi petroliferi subacquei @it
label: Untermeerische Ölfelddienste @de
label: Услуги в области подводн. нефтепромысла @ru
label: 海底油田服务 @zh
label: 海底油田服務 @zh-hant
label: 海底油田ｻｰﾋﾞｽ @ja
label: 해저 유전 서비스 @ko
definition: This segment includes companies that provide oilfield services in subsea applications. Includes underwater installation, inspection, repair and decommissioning services of subsea pipelines, wells and umbilicals.
notation: 1310151111
valid from: 2014-08-08
valid till: 2020-10-03

Seismic Surveying
type: BicsLevel5Segment
type: Classifier
type: NamedIndividual
is level5 segment of: Oilfield Services & Equipment
is anachronous version of: http://data.ga-group.nl/ics/bics/1310111112
is contemporary version of: http://data.ga-group.nl/ics/bics/1310151112
is replaced by: http://data.ga-group.nl/ics/bics/2020/1310111112
is version of: http://data.ga-group.nl/ics/bics/1310111112
is version of: http://data.ga-group.nl/ics/bics/1310151112
imported on: 2026-06-08T13:03:47.798Z
last refreshed on: 2026-06-08T13:03:47.798Z
source accessed on: 2019-12-03T20:05:01Z
source last accessed on: 2019-12-03T20:05:01Z
label: Agrimensura sísmica @es
label: Etude sismique @fr
label: Rilevazione sismico @it
label: Seismische Vermessg @de
label: Сейсморазведка @ru
label: 地質調査 -石油･ｶﾞｽ @ja
label: 地震勘测-油气 @zh
label: 油氣震測探勘 @zh-hant
label: 탄성파탐사 @ko
definition: This segment includes companies that survey oil and natural gas fields through seismic technology.
notation: 1310151112
valid from: 2014-08-08
valid till: 2020-10-03

Oilfield Services & Equipment
type: BicsLevel4SubIndustry
type: Classifier
type: NamedIndividual
is sub industry of: Oil & Gas Services & Equip
is anachronous version of: http://data.ga-group.nl/ics/bics/13101111
is contemporary version of: http://data.ga-group.nl/ics/bics/13101511
is replaced by: http://data.ga-group.nl/ics/bics/2020/13101111
is version of: http://data.ga-group.nl/ics/bics/13101111
is version of: http://data.ga-group.nl/ics/bics/13101511
imported on: 2026-06-08T13:03:47.798Z
last refreshed on: 2026-06-08T13:03:47.798Z
source accessed on: 2019-12-03T20:05:01Z
source last accessed on: 2019-12-03T20:05:01Z
label: Serv e app campi petroliferi @it
label: Serv y eq de yacimientos petrolíferos @es
label: Serviços e equipamento de campo de petróleo @pt
label: Services et équipements pour champs pétroliers @fr
label: Ölfelddienste & Equipment @de
label: Нефтепромысловые услуги и оборудование @ru
label: 油田服务与设备 @zh
label: 油田服務及設備製造 @zh-hant
label: 油田ｻｰﾋﾞｽ @ja
label: 유전 서비스 & 장비 @ko
definition: This industry subgroup includes companies that provide services or manufacture equipment for non-drilling applications. Includes services such as well servicing and maintenance, fluid handling, snubbing, coiled-tubing, pressure pumping, wire-line, artificial lift and production testing. Also includes suppliers or manufacturers of subsea, completion and surface equipment.
notation: 13101511
valid from: 2014-08-08
valid till: 2020-10-03

Oil & Gas Services & Equip
type: BicsLevel3Industry
type: Classifier
type: NamedIndividual
is industry of: Oil, Gas & Coal
is anachronous version of: http://data.ga-group.nl/ics/bics/131011
is contemporary version of: http://data.ga-group.nl/ics/bics/131015
is replaced by: http://data.ga-group.nl/ics/bics/2020/131011
is version of: http://data.ga-group.nl/ics/bics/131011
is version of: http://data.ga-group.nl/ics/bics/131015
imported on: 2026-06-08T13:03:47.798Z
last refreshed on: 2026-06-08T13:03:47.798Z
source accessed on: 2019-12-03T20:05:01Z
source last accessed on: 2019-12-03T20:05:01Z
label: Serv e app petrolio e gas @it
label: Serv e equip de petróleo e gás @pt
label: Serv et équip pétrole et gaz @fr
label: Servs y eq de petr/gas @es
label: Öl & Gas, Dienste & Equipm. @de
label: Нефть и газ: услуги и оборуд. @ru
label: 石油与��然气服务与设备 @zh
label: 石油及天然氣服務及設備 @zh-hant
label: 石油･ｶﾞｽｻｰﾋﾞｽ @ja
label: 석유 & 가스 서비스 & 장비 @ko
definition: This industry includes companies that specialize in providing support services or manufacture equipment for oil and natural gas exploration and production companies.
notation: 131015
valid from: 2014-08-08
valid till: 2020-10-03

Bitum Coal & Lignite Surface
type: BicsLevel6Segment
type: Classifier
type: NamedIndividual
is level6 segment of: Coal - Surface & Underground
is anachronous version of: http://data.ga-group.nl/ics/bics/181015141010
is contemporary version of: http://data.ga-group.nl/ics/bics/131016101010
is replaced by: http://data.ga-group.nl/ics/bics/2020/181015141010
is version of: http://data.ga-group.nl/ics/bics/131016101010
is version of: http://data.ga-group.nl/ics/bics/181015141010
imported on: 2026-06-08T13:03:47.798Z
last refreshed on: 2026-06-08T13:03:47.798Z
source accessed on: 2019-12-03T20:05:01Z
source last accessed on: 2019-12-03T20:05:01Z
label: Bitume carbone e lignite superficie @it
label: Carbón bitum y superficie lignito @es
label: Extr ciel ouvert lignite/charbon bitumineux @fr
label: Steinkohle- & Lignitbergbau @de
label: Superfície lignite e carvão betuminoso @pt
label: Камен. уголь и лигнит @ru
label: 瀝青炭･褐炭鉱業 @ja
label: 烟煤与褐煤地表 @zh
label: 露天煙煤及褐煤礦業 @zh-hant
label: 역청탄 & 갈탄 노천 @ko
definition: This segment includes companies that mine surface bituminous coal and lignite.
notation: 131016101010
valid from: 2014-08-08
valid till: 2020-10-03

Bituminous Coal Underground
type: BicsLevel6Segment
type: Classifier
type: NamedIndividual
is level6 segment of: Coal - Surface & Underground
is anachronous version of: http://data.ga-group.nl/ics/bics/181015141011
is contemporary version of: http://data.ga-group.nl/ics/bics/131016101011
is replaced by: http://data.ga-group.nl/ics/bics/2020/181015141011
is version of: http://data.ga-group.nl/ics/bics/131016101011
is version of: http://data.ga-group.nl/ics/bics/181015141011
imported on: 2026-06-08T13:03:47.798Z
last refreshed on: 2026-06-08T13:03:47.798Z
source accessed on: 2019-12-03T20:05:01Z
source last accessed on: 2019-12-03T20:05:01Z
label: Carbone bituminoso sotterraneo @it
label: Extr souterraine charbon bitumineux @fr
label: Mineração subterrânea de carvão betuminoso @pt
label: Steinkohlenbergbau @de
label: Subterráneo de carbón bituminoso @es
label: Каменный уголь (в недрах) @ru
label: 地底煙煤礦業 @zh-hant
label: 瀝青炭地下炭鉱業 @ja
label: 烟煤地下 @zh
label: 역청탄 지하 @ko
definition: This segment includes companies that mine underground bituminous coal.
notation: 131016101011
valid from: 2014-08-08
valid till: 2020-10-03

Coal - Surface & Underground
type: BicsLevel5Segment
type: Classifier
type: Discontinued
type: NamedIndividual
is level5 segment of: Coal Mining
is contemporary version of: http://data.ga-group.nl/ics/bics/1310161010
is version of: http://data.ga-group.nl/ics/bics/1310161010
imported on: 2026-06-08T13:03:47.798Z
last refreshed on: 2026-06-08T13:03:47.798Z
source accessed on: 2019-12-03T20:05:01Z
source last accessed on: 2019-12-03T20:05:01Z
label: Carbón - superficie y subterráneo @es
label: Carbone - Superficie e sotterraneo @it
label: Carvão - Superfície e subterrâneo @pt
label: Charbon - ciel ouvert/sous-terrain @fr
label: Kohle - Tage- & Untertagebau @de
label: Уголь на поверхн. и под землей @ru
label: 煤-露天及地底 @zh-hant
label: 煤炭-地表与地下 @zh
label: 露天･地下石炭採掘 @ja
label: 석탄 - 노천 & 지하 @ko
definition: This segment includes companies that mine surface and underground coal.
notation: 1310161010
valid from: 2014-08-08
valid till: 2020-10-03

Coal Mining
type: BicsLevel4SubIndustry
type: Classifier
type: NamedIndividual
is sub industry of: Coal Operations
is anachronous version of: http://data.ga-group.nl/ics/bics/1810151410
is contemporary version of: http://data.ga-group.nl/ics/bics/13101610
is replaced by: http://data.ga-group.nl/ics/bics/2020/1810151410
is version of: http://data.ga-group.nl/ics/bics/13101610
is version of: http://data.ga-group.nl/ics/bics/1810151410
imported on: 2026-06-08T13:03:47.798Z
last refreshed on: 2026-06-08T13:03:47.798Z
source accessed on: 2019-12-03T20:05:01Z
source last accessed on: 2019-12-03T20:05:01Z
label: Estrazione carbone @it
label: Extração de carvão @pt
label: Kohleabbau @de
label: Mine de charbon @fr
label: Minería de carbón @es
label: Добыча угля @ru
label: 煤矿开采 @zh
label: 煤礦業 @zh-hant
label: 石炭採鉱業 @ja
label: 석탄광업 @ko
definition: This industry subgroup includes companies that mine coal for energy production purposes. Also known as thermal coal or steam coal. Excludes companies that mine or process coal for use as steel production ingredients (see Metallurgical Coal).
notation: 13101610
valid from: 2014-08-08
valid till: 2020-10-03

Anthracite Mining
type: BicsLevel5Segment
type: Classifier
type: Discontinued
type: NamedIndividual
is level5 segment of: Other Petroleum & Coal Prods
is contemporary version of: http://data.ga-group.nl/ics/bics/1310161110
is version of: http://data.ga-group.nl/ics/bics/1310161110
imported on: 2026-06-08T13:03:47.798Z
last refreshed on: 2026-06-08T13:03:47.798Z
source accessed on: 2019-12-03T20:05:01Z
source last accessed on: 2019-12-03T20:05:01Z
label: Anthrazitbergbau @de
label: Estrazione antracite @it
label: Extração de antracite @pt
label: Extract. anthracite @fr
label: Minería de antracita @es
label: Добыча антрацита @ru
label: 无烟煤开采 @zh
label: 無煙炭鉱業 @ja
label: 無煙煤礦業 @zh-hant
label: 무연탄 광업 @ko
definition: This segment includes companies that mine anthracite.
notation: 1310161110
valid from: 2014-08-08
valid till: 2020-10-03

Other Petroleum & Coal Prods
type: BicsLevel4SubIndustry
type: Classifier
type: Discontinued
type: NamedIndividual
is sub industry of: Coal Operations
is contemporary version of: http://data.ga-group.nl/ics/bics/13101611
is version of: http://data.ga-group.nl/ics/bics/13101611
imported on: 2026-06-08T13:03:47.798Z
last refreshed on: 2026-06-08T13:03:47.798Z
source accessed on: 2019-12-03T20:05:01Z
source last accessed on: 2019-12-03T20:05:01Z
label: Altri prod petroliferi e carbone @it
label: Autres produits du pétrole et du charbon @fr
label: Otros prods petróleo y carbón @es
label: Outros prod de carvão e petróleo @pt
label: Sonstige Petroleum- & Kohleprodukte @de
label: Пр. нефте- и угольная продукция @ru
label: その他全石油製品･石炭製品製造 @ja
label: 其他石油与煤炭产品 @zh
label: 其他石油及煤製品 @zh-hant
label: 기타 석유 & 석탄제품 @ko
definition: This industry subgroup includes companies that manufacture all other petroleum and coal products not elsewhere classified.
notation: 13101611
valid from: 2014-08-08
valid till: 2020-10-03

Coal Operations
type: BicsLevel3Industry
type: Classifier
type: NamedIndividual
is industry of: Oil, Gas & Coal
is anachronous version of: http://data.ga-group.nl/ics/bics/18101514
is contemporary version of: http://data.ga-group.nl/ics/bics/131016
is replaced by: http://data.ga-group.nl/ics/bics/2020/18101514
is version of: http://data.ga-group.nl/ics/bics/131016
is version of: http://data.ga-group.nl/ics/bics/18101514
imported on: 2026-06-08T13:03:47.798Z
last refreshed on: 2026-06-08T13:03:47.798Z
source accessed on: 2019-12-03T20:05:01Z
source last accessed on: 2019-12-03T20:05:01Z
label: Activ charbon @fr
label: Carbone @it
label: Kohlearbeiten @de
label: Operações carvão @pt
label: Operaciones carbón @es
label: Добыча угля @ru
label: 煤炭业务 @zh
label: 煤礦業務 @zh-hant
label: 石炭事業 @ja
label: 석탄 영업 @ko
definition: This industry includes companies that conduct coal operations. Activities include coal mining and coal products manufacturing.
notation: 131016
valid from: 2014-08-08
valid till: 2020-10-03

Oil, Gas & Coal
type: BicsLevel2IndustryGroup
type: Classifier
type: NamedIndividual
is industry group of: Energy
is contemporary version of: http://data.ga-group.nl/ics/bics/1310
is replaced by: http://data.ga-group.nl/ics/bics/2020/1310
is version of: http://data.ga-group.nl/ics/bics/1310
imported on: 2026-06-08T13:03:47.798Z
last refreshed on: 2026-06-08T13:03:47.798Z
source accessed on: 2019-12-03T20:05:01Z
source last accessed on: 2019-12-03T20:05:01Z
label: Greggio, gas e carbone @it
label: Pétrole, gaz et charbon @fr
label: Petróleo, gás e carvão @pt
label: Petróleo, gas y carbón @es
label: Öl, Gas & Kohle @de
label: Нефть, газ и уголь @ru
label: 油、氣及煤 @zh-hant
label: 石油、天然气和煤 @zh
label: 석유, 가스 & 석탄 @ko
label: ��油､ｶﾞｽ､石炭 @ja
definition: This industry group includes companies that are involved in the traditional energy complex, which includes upstream, midstream or downstream operations, and/or are involved in the creations of biofuels.
notation: 1310
valid from: 2014-08-08
valid till: 2020-10-03

Biodiesel Feedstock Suppliers
type: BicsLevel5Segment
type: Classifier
type: Discontinued
type: NamedIndividual
is level5 segment of: Biofuel Feedstock Suppliers
is contemporary version of: http://data.ga-group.nl/ics/bics/1311101010
is version of: http://data.ga-group.nl/ics/bics/1311101010
imported on: 2026-06-08T13:03:47.798Z
last refreshed on: 2026-06-08T13:03:47.798Z
source accessed on: 2019-12-03T20:05:01Z
source last accessed on: 2019-12-03T20:05:01Z
label: Biodiesel Einsatzstofflieferant @de
label: Fornecedores de matéria-prima para biodiesel @pt
label: Fornitori prod intermedi biodiesel @it
label: Fournisseurs de stock d'alimentation de biodiesel @fr
label: Proveedores de piensos de biodiésel @es
label: Поставщики сырья для производства биодизеля @ru
label: 生化柴油進料供應商 @zh-hant
label: 生物柴油原料供应商 @zh
label: 바이오디젤 원료 공급업체 @ko
label: ﾊﾞｲｵﾃﾞｨｰｾﾞﾙ原料ｻﾌﾟﾗｲﾔｰ @ja
definition: This segment includes companies that produce the raw material feedstock for biodiesel production.
notation: 1311101010
valid from: 2014-08-08
valid till: 2020-10-03

Ethanol Feedstock Suppliers
type: BicsLevel5Segment
type: Classifier
type: Discontinued
type: NamedIndividual
is level5 segment of: Biofuel Feedstock Suppliers
is contemporary version of: http://data.ga-group.nl/ics/bics/1311101011
is version of: http://data.ga-group.nl/ics/bics/1311101011
imported on: 2026-06-08T13:03:47.798Z
last refreshed on: 2026-06-08T13:03:47.798Z
source accessed on: 2019-12-03T20:05:01Z
source last accessed on: 2019-12-03T20:05:01Z
label: Ausgangsmateriallieferant - Ethanol @de
label: Fornecedores de matéria-prima para etanol @pt
label: Fornitori prod interm etanolo @it
label: Fournisseurs d'éthanol @fr
label: Proveedores de piensos de etanol @es
label: Поставщики сырья для произв-ва этила @ru
label: 乙醇原料供应商 @zh
label: 乙醇進料供應商 @zh-hant
label: 에탄올 공급원료 공급업체 @ko
label: ｴﾀﾉｰﾙ原料ｻﾌﾟﾗｲﾔｰ @ja
definition: This segment includes companies that produce the raw material feedstock for ethanol production.
notation: 1311101011
valid from: 2014-08-08
valid till: 2020-10-03

Biofuel Feedstock Suppliers
type: BicsLevel4SubIndustry
type: Classifier
type: NamedIndividual
is sub industry of: Biofuels
is anachronous version of: http://data.ga-group.nl/ics/bics/1311101010
is contemporary version of: http://data.ga-group.nl/ics/bics/13111010
is replaced by: http://data.ga-group.nl/ics/bics/2020/1311101010
is version of: http://data.ga-group.nl/ics/bics/1311101010
is version of: http://data.ga-group.nl/ics/bics/13111010
imported on: 2026-06-08T13:03:47.798Z
last refreshed on: 2026-06-08T13:03:47.798Z
source accessed on: 2019-12-03T20:05:01Z
source last accessed on: 2019-12-03T20:05:01Z
label: Ausgangsmateriallieferant - Biokraftstoff @de
label: Fornecedores de matéria-prima para biocombustível @pt
label: Fornitori prod interm biofuel @it
label: Fournisseurs de biocarburant @fr
label: Proveedores de piensos de biocarburante @es
label: Поставщики сырья для произв-ва биотоплива @ru
label: 生化燃料進料供應商 @zh-hant
label: 生物燃料原料供应商 @zh
label: 바이오연료 공급원료 공급업체 @ko
label: ﾊﾞｲｵ燃料原料ｻﾌﾟﾗｲﾔｰ @ja
definition: This industry subgroup includes companies that produce the raw material feedstock for biofuel production.
notation: 13111010
valid from: 2014-08-08
valid till: 2020-10-03

Gasification - FT Synthesis
type: BicsLevel5Segment
type: Classifier
type: Discontinued
type: NamedIndividual
is level5 segment of: Diesel Substitutes
is contemporary version of: http://data.ga-group.nl/ics/bics/1311101110
is version of: http://data.ga-group.nl/ics/bics/1311101110
imported on: 2026-06-08T13:03:47.798Z
last refreshed on: 2026-06-08T13:03:47.798Z
source accessed on: 2019-12-03T20:05:01Z
source last accessed on: 2019-12-03T20:05:01Z
label: Gaseificação - síntese FT @pt
label: Gasificación - Síntesis FT @es
label: Gassificazione - sintesi FT @it
label: Gazéification - Synthèse FT @fr
label: Vergasung - FT-Synthese @de
label: Газификация - Синтез Фишера-Тропша @ru
label: 气化 - FT合成 @zh
label: 氣化-FT合成 @zh-hant
label: 가스화 - FT 합성 @ko
label: ｶﾞｽ化-FT合成 @ja
definition: This segment includes companies that produce biodiesel utilizing a gasification process.
notation: 1311101110
valid from: 2014-08-08
valid till: 2020-10-03

Hydrotreatment
type: BicsLevel5Segment
type: Classifier
type: Discontinued
type: NamedIndividual
is level5 segment of: Diesel Substitutes
is contemporary version of: http://data.ga-group.nl/ics/bics/1311101111
is version of: http://data.ga-group.nl/ics/bics/1311101111
imported on: 2026-06-08T13:03:47.798Z
last refreshed on: 2026-06-08T13:03:47.798Z
source accessed on: 2019-12-03T20:05:01Z
source last accessed on: 2019-12-03T20:05:01Z
label: Hidro-tratamento @pt
label: Hydroraffinage @fr
label: Tratamiento hidráulico @es
label: Trattamento idrico @it
label: Wasserdruckbehandlung @de
label: Гидропереработка @ru
label: 加氢 @zh
label: 氫化處理 @zh-hant
label: 水素化処理 @ja
label: 수소화처리 @ko
definition: This segment includes companies that produce biodiesel utilizing a hydrotreatment process.
notation: 1311101111
valid from: 2014-08-08
valid till: 2020-10-03

Transesterification
type: BicsLevel5Segment
type: Classifier
type: Discontinued
type: NamedIndividual
is level5 segment of: Diesel Substitutes
is contemporary version of: http://data.ga-group.nl/ics/bics/1311101112
is version of: http://data.ga-group.nl/ics/bics/1311101112
imported on: 2026-06-08T13:03:47.798Z
last refreshed on: 2026-06-08T13:03:47.798Z
source accessed on: 2019-12-03T20:05:01Z
source last accessed on: 2019-12-03T20:05:01Z
label: Transestérification @fr
label: Transesterificação @pt
label: Transesterificación @es
label: Transesterificazione @it
label: Umesterung @de
label: Переэтерификация @ru
label: 轉酯化 @zh-hant
label: 转酯基作用 @zh
label: 에스테르 교환반응 @ko
label: ｴｽﾃﾙ交換 @ja
definition: This segment includes companies that produce biodiesel utilizing a transesterification process.
notation: 1311101112
valid from: 2014-08-08
valid till: 2020-10-03

Diesel Substitutes
type: BicsLevel4SubIndustry
type: Classifier
type: NamedIndividual
is sub industry of: Biofuels
is anachronous version of: http://data.ga-group.nl/ics/bics/1311101011
is contemporary version of: http://data.ga-group.nl/ics/bics/13111011
is replaced by: http://data.ga-group.nl/ics/bics/2020/1311101011
is version of: http://data.ga-group.nl/ics/bics/1311101011
is version of: http://data.ga-group.nl/ics/bics/13111011
imported on: 2026-06-08T13:03:47.798Z
last refreshed on: 2026-06-08T13:03:47.798Z
source accessed on: 2019-12-03T20:05:01Z
source last accessed on: 2019-12-03T20:05:01Z
label: Dieselersatz @de
label: Substitutos do diesel @pt
label: Substituts de diesel @fr
label: Succedanei diesel @it
label: Sustitutos de diesel @es
label: Заменители дизеля @ru
label: 柴油代用品 @zh-hant
label: 柴油替代品 @zh
label: 디젤유 대체품 @ko
label: ﾃﾞｨｰｾﾞﾙ代替物 @ja
definition: This industry subgroup includes companies that produce biodiesel. Biodiesel is a fossil fuel substitute created from vegetable oil or animal fats. Biodiesel usually contains a percentage of traditional diesel fuel.
notation: 13111011
valid from: 2014-08-08
valid till: 2020-10-03

Enzymatic Hydrolysis
type: BicsLevel5Segment
type: Classifier
type: Discontinued
type: NamedIndividual
is level5 segment of: Gasoline Substitutes
is contemporary version of: http://data.ga-group.nl/ics/bics/1311101210
is version of: http://data.ga-group.nl/ics/bics/1311101210
imported on: 2026-06-08T13:03:47.798Z
last refreshed on: 2026-06-08T13:03:47.798Z
source accessed on: 2019-12-03T20:05:01Z
source last accessed on: 2019-12-03T20:05:01Z
label: Enzymatische Hydrolyse @de
label: Hidrólise enzimática @pt
label: Hidrólisis enzimática @es
label: Hydrolyse enzymatique @fr
label: Idrolisi enzimatica @it
label: Ферментативный гидролиз @ru
label: 酵素加水分解 @ja
label: 酵素水解 @zh-hant
label: 酶法水解 @zh
label: 효소 가수분해 @ko
definition: This segment includes companies that produce ethanol utilizing an enzymatic hydrolysis process.
notation: 1311101210
valid from: 2014-08-08
valid till: 2020-10-03

Gasification Fermentation
type: BicsLevel5Segment
type: Classifier
type: Discontinued
type: NamedIndividual
is level5 segment of: Gasoline Substitutes
is contemporary version of: http://data.ga-group.nl/ics/bics/1311101211
is version of: http://data.ga-group.nl/ics/bics/1311101211
imported on: 2026-06-08T13:03:47.798Z
last refreshed on: 2026-06-08T13:03:47.798Z
source accessed on: 2019-12-03T20:05:01Z
source last accessed on: 2019-12-03T20:05:01Z
label: Fermentação de gaseificação @pt
label: Fermentación de gasificación @es
label: Gassificazione fermentaz @it
label: Gazéification Fermentation @fr
label: Vergasung - Fermentation @de
label: Газификация топлива/ферментация @ru
label: 气化发酵 @zh
label: 汽化發酵 @zh-hant
label: 가스화 발효 @ko
label: ｶﾞｽ化発酵 @ja
definition: This segment includes companies that produce ethanol utilizing a gasification fermentation process.
notation: 1311101211
valid from: 2014-08-08
valid till: 2020-10-03

Starch & Sugar Fermentation
type: BicsLevel5Segment
type: Classifier
type: Discontinued
type: NamedIndividual
is level5 segment of: Gasoline Substitutes
is contemporary version of: http://data.ga-group.nl/ics/bics/1311101212
is version of: http://data.ga-group.nl/ics/bics/1311101212
imported on: 2026-06-08T13:03:47.798Z
last refreshed on: 2026-06-08T13:03:47.798Z
source accessed on: 2019-12-03T20:05:01Z
source last accessed on: 2019-12-03T20:05:01Z
label: Fermentação de açúcar e amido @pt
label: Fermentación de almidón y azúcar @es
label: Fermentation de sucre et amidon @fr
label: Fermentazione zucchero e amido @it
label: Stärke & Zuckergärung @de
label: Ферментация крахмала и сахар @ru
label: 淀粉与糖发酵 @zh
label: 澱粉及糖醱酵 @zh-hant
label: 전분 & 설탕 발효 @ko
label: ｽﾀｰﾁ/糖発酵 @ja
definition: This segment includes companies that produce ethanol utilizing a starch/sugar fermentation process.
notation: 1311101212
valid from: 2014-08-08
valid till: 2020-10-03

Gasoline Substitutes
type: BicsLevel4SubIndustry
type: Classifier
type: NamedIndividual
is sub industry of: Biofuels
is anachronous version of: http://data.ga-group.nl/ics/bics/1311101012
is contemporary version of: http://data.ga-group.nl/ics/bics/13111012
is replaced by: http://data.ga-group.nl/ics/bics/2020/1311101012
is version of: http://data.ga-group.nl/ics/bics/1311101012
is version of: http://data.ga-group.nl/ics/bics/13111012
imported on: 2026-06-08T13:03:47.798Z
last refreshed on: 2026-06-08T13:03:47.798Z
source accessed on: 2019-12-03T20:05:01Z
source last accessed on: 2019-12-03T20:05:01Z
label: Benzinersatz @de
label: Substitutos da gasolina @pt
label: Substituts d'essence @fr
label: Succedanei benzina @it
label: Sustitutos de gasolina @es
label: Заменители бензина @ru
label: 汽油代用品 @zh-hant
label: 汽油替代品 @zh
label: 휘발유 대체품 @ko
label: ｶﾞｿﾘﾝ代替物 @ja
definition: This industry subgroup includes companies that produce ethanol. Ethanol is a fuel additive typically made from corn or sugar that reduces carbon emissions and lowers the amount of fossil fuels needed.
notation: 13111012
valid from: 2014-08-08
valid till: 2020-10-03

Biofuels
type: BicsLevel3Industry
type: Classifier
type: NamedIndividual
is industry of: Renewable Energy
is anachronous version of: http://data.ga-group.nl/ics/bics/13111010
is contemporary version of: http://data.ga-group.nl/ics/bics/131110
is replaced by: http://data.ga-group.nl/ics/bics/2020/13111010
is version of: http://data.ga-group.nl/ics/bics/13111010
is version of: http://data.ga-group.nl/ics/bics/131110
imported on: 2026-06-08T13:03:47.798Z
last refreshed on: 2026-06-08T13:03:47.798Z
source accessed on: 2019-12-03T20:05:01Z
source last accessed on: 2019-12-03T20:05:01Z
label: Biocarburantes @es
label: Biocarburants @fr
label: Biocombustíveis @pt
label: Biofuel @it
label: Biokraftstoff @de
label: Биотопливо @ru
label: 生物燃料 @zh
label: 生質燃料 @zh-hant
label: 바이오연료 @ko
label: ﾊﾞｲｵ燃料 @ja
definition: This industry includes companies that produce ethanol and or biodiesel.
notation: 131110
valid from: 2014-08-08
valid till: 2020-10-03

Monocrystalline Silicon
type: BicsLevel6Segment
type: Classifier
type: Discontinued
type: NamedIndividual
is level6 segment of: Polysilicon
is contemporary version of: http://data.ga-group.nl/ics/bics/131111101010
is version of: http://data.ga-group.nl/ics/bics/131111101010
imported on: 2026-06-08T13:03:47.798Z
last refreshed on: 2026-06-08T13:03:47.798Z
source accessed on: 2019-12-03T20:05:01Z
source last accessed on: 2019-12-03T20:05:01Z
label: Lingotes de silício mono cristalino @pt
label: Lingotes de silicio monocristalino @es
label: Lingotti silicio monocristallino @it
label: Monokristallines Silizium @de
label: Silicium monocristallin @fr
label: Слитки монокристаллического кремния @ru
label: 单晶硅铸锭 @zh
label: 単結晶ｼﾘｺﾝｲﾝｺﾞｯﾄ @ja
label: 單晶矽錠 @zh-hant
label: 단결정 실리콘괴 @ko
definition: This segment includes companies that manufacture monocrystalline silicon ingots for the solar energy industry.
notation: 131111101010
valid from: 2014-08-08
valid till: 2020-10-03

Multicrystalline Silicon
type: BicsLevel6Segment
type: Classifier
type: Discontinued
type: NamedIndividual
is level6 segment of: Polysilicon
is contemporary version of: http://data.ga-group.nl/ics/bics/131111101011
is version of: http://data.ga-group.nl/ics/bics/131111101011
imported on: 2026-06-08T13:03:47.798Z
last refreshed on: 2026-06-08T13:03:47.798Z
source accessed on: 2019-12-03T20:05:01Z
source last accessed on: 2019-12-03T20:05:01Z
label: Lingotes de silício multi-cristalino @pt
label: Lingotes de silicio multicristalino @es
label: Lingotti silicio multicristallino @it
label: Multikristallines Silizium @de
label: Silicium multicristallin @fr
label: Слитки поликристаллического кремния @ru
label: 多晶矽錠 @zh-hant
label: 多晶硅铸锭 @zh
label: 多結晶ｼﾘｺﾝｲﾝｺﾞｯﾄ @ja
label: 다결정 실리콘괴 @ko
definition: This segment includes companies involved in the manufacturing of multicrystalline silicon ingots for the solar energy industry.
notation: 131111101011
valid from: 2014-08-08
valid till: 2020-10-03

Polysilicon Solar Grade
type: BicsLevel6Segment
type: Classifier
type: Discontinued
type: NamedIndividual
is level6 segment of: Polysilicon
is contemporary version of: http://data.ga-group.nl/ics/bics/131111101012
is version of: http://data.ga-group.nl/ics/bics/131111101012
imported on: 2026-06-08T13:03:47.798Z
last refreshed on: 2026-06-08T13:03:47.798Z
source accessed on: 2019-12-03T20:05:01Z
source last accessed on: 2019-12-03T20:05:01Z
label: Grade solar poli-silício @pt
label: Grado solar polisilicio @es
label: Polisilicio livello solare @it
label: Polysilicium de qualité solaire @fr
label: Polysilizium, Solartechnik @de
label: Поликремний солнечного качества @ru
label: 多晶硅-太阳能级 @zh
label: 太陽能多晶矽 @zh-hant
label: 폴리실리콘 태양전지급 @ko
label: ﾎﾟﾘｼﾘｺﾝ 太陽電池用 @ja
definition: This segment includes companies that manufacture solar-grade polysilicon for the solar energy industry.
notation: 131111101012
valid from: 2014-08-08
valid till: 2020-10-03

Polysilicon Upgrd Metallurgical
type: BicsLevel6Segment
type: Classifier
type: Discontinued
type: NamedIndividual
is level6 segment of: Polysilicon
is contemporary version of: http://data.ga-group.nl/ics/bics/131111101013
is version of: http://data.ga-group.nl/ics/bics/131111101013
imported on: 2026-06-08T13:03:47.798Z
last refreshed on: 2026-06-08T13:03:47.798Z
source accessed on: 2019-12-03T20:05:01Z
source last accessed on: 2019-12-03T20:05:01Z
label: Metalúrgica aprim poli-silício @pt
label: Metallurgico aggiornato polisilicio @it
label: Polisilicio mejorado metalúrgico @es
label: Polysilicium de qualité métallurgique @fr
label: Polysilizium, Upgrade metallurgisch @de
label: Металлург. поликремний глубокой очистки @ru
label: 多晶矽高級冶金 @zh-hant
label: 多晶硅高纯冶金 @zh
label: 폴리실리콘 고순도 금속 @ko
label: ﾎﾟﾘｼﾘｺﾝ 改良冶金 @ja
definition: This segment includes companies that manufacture upgraded metallurgical polysilicon for the solar energy industry.
notation: 131111101013
valid from: 2014-08-08
valid till: 2020-10-03

Silane
type: BicsLevel6Segment
type: Classifier
type: Discontinued
type: NamedIndividual
is level6 segment of: Polysilicon
is contemporary version of: http://data.ga-group.nl/ics/bics/131111101014
is version of: http://data.ga-group.nl/ics/bics/131111101014
imported on: 2026-06-08T13:03:47.798Z
last refreshed on: 2026-06-08T13:03:47.798Z
source accessed on: 2019-12-03T20:05:01Z
source last accessed on: 2019-12-03T20:05:01Z
label: Silan @de
label: Silano @es
label: Кремневодород @ru
label: 矽烷 @zh-hant
label: 硅烷 @zh
label: 실레인 @ko
label: ｼﾗﾝ @ja
definition: This segment includes companies that manufacture silane for the solar energy industry.
notation: 131111101014
valid from: 2014-08-08
valid till: 2020-10-03

Polysilicon
type: BicsLevel5Segment
type: Classifier
type: NamedIndividual
is level5 segment of: Solar Energy Equipment
is anachronous version of: http://data.ga-group.nl/ics/bics/131110111010
is contemporary version of: http://data.ga-group.nl/ics/bics/1311111010
is replaced by: http://data.ga-group.nl/ics/bics/2020/131110111010
is version of: http://data.ga-group.nl/ics/bics/131110111010
is version of: http://data.ga-group.nl/ics/bics/1311111010
imported on: 2026-06-08T13:03:47.798Z
last refreshed on: 2026-06-08T13:03:47.798Z
source accessed on: 2019-12-03T20:05:01Z
source last accessed on: 2019-12-03T20:05:01Z
label: Polisilicio @es
label: Polissilícios @pt
label: Polysilicium @fr
label: Polysilikon @de
label: Silicio policristallino @it
label: Поликремний @ru
label: 多晶矽 @zh-hant
label: 多晶硅 @zh
label: 폴리실리콘 @ko
label: ﾎﾟﾘｼﾘｺﾝ @ja
definition: This segment includes companies that manufacture polysilicon feedstock for the solar energy industry.
notation: 1311111010
valid from: 2014-08-08
valid till: 2020-10-03

PV Cells CPV
type: BicsLevel6Segment
type: Classifier
type: Discontinued
type: NamedIndividual
is level6 segment of: PV Cells
is contemporary version of: http://data.ga-group.nl/ics/bics/131111101110
is version of: http://data.ga-group.nl/ics/bics/131111101110
imported on: 2026-06-08T13:03:47.798Z
last refreshed on: 2026-06-08T13:03:47.798Z
source accessed on: 2019-12-03T20:05:01Z
source last accessed on: 2019-12-03T20:05:01Z
label: CPV células PV @pt
label: Celle fotovoltaiche CPV @it
label: Cellules photovoltaïques CPV @fr
label: PV Pilas CPV @es
label: PV 셀 CPV @ko
label: PV-Zellen CPV @de
label: PV電池CPV @zh-hant
label: PVｾﾙCPV @ja
label: Фотогальванические ячейки: CPV @ru
label: 光伏电池CPV @zh
definition: This segment includes companies that manufacture concentrated photovoltaic (CPV) solar cells.
notation: 131111101110
valid from: 2014-08-08
valid till: 2020-10-03

PV Cells Crystalline Silicon
type: BicsLevel6Segment
type: Classifier
type: Discontinued
type: NamedIndividual
is level6 segment of: PV Cells
is contemporary version of: http://data.ga-group.nl/ics/bics/131111101111
is version of: http://data.ga-group.nl/ics/bics/131111101111
imported on: 2026-06-08T13:03:47.798Z
last refreshed on: 2026-06-08T13:03:47.798Z
source accessed on: 2019-12-03T20:05:01Z
source last accessed on: 2019-12-03T20:05:01Z
label: Cell PV silicio cristallino @it
label: Cellules photovoltaïques de silicium cristallin @fr
label: PV Pilas de silicio cristalino @es
label: PV 셀 결정성 실리콘 @ko
label: PV-Zellen, Silizium @de
label: PV電池 結晶ｼﾘｺﾝ @ja
label: PV電池-結晶矽 @zh-hant
label: Silício cristalino para pilhas PV @pt
label: Фотогальванические ячейки: кристаллич. кремниевые @ru
label: 光伏电池晶硅 @zh
definition: This segment includes companies that manufacture crystalline silicon solar cells.
notation: 131111101111
valid from: 2014-08-08
valid till: 2020-10-03

PV Cells Gallium Arsenide
type: BicsLevel6Segment
type: Classifier
type: Discontinued
type: NamedIndividual
is level6 segment of: PV Cells
is contemporary version of: http://data.ga-group.nl/ics/bics/131111101112
is version of: http://data.ga-group.nl/ics/bics/131111101112
imported on: 2026-06-08T13:03:47.798Z
last refreshed on: 2026-06-08T13:03:47.798Z
source accessed on: 2019-12-03T20:05:01Z
source last accessed on: 2019-12-03T20:05:01Z
label: Arsenieto de gálio para pilhas PV @pt
label: Cell PV gallio arsenico @it
label: Cellules photovoltaïques à l'arséniure de gallium @fr
label: PV Pilas de arseniuro de galio @es
label: PV 셀 갈륨 비소 @ko
label: PV-Zellen, Galliumarsenid @de
label: PV電池 ｶﾞﾘｳﾑﾋ素 @ja
label: PV電池-砷化鎵 @zh-hant
label: Фотогальванические ячейки: арсенид галлия @ru
label: 光伏电池砷化镓 @zh
definition: This segment includes companies that manufacture gallium arsenide solar cells.
notation: 131111101112
valid from: 2014-08-08
valid till: 2020-10-03

PV Cells Nanostructured & Dyed
type: BicsLevel6Segment
type: Classifier
type: Discontinued
type: NamedIndividual
is level6 segment of: PV Cells
is contemporary version of: http://data.ga-group.nl/ics/bics/131111101113
is version of: http://data.ga-group.nl/ics/bics/131111101113
imported on: 2026-06-08T13:03:47.798Z
last refreshed on: 2026-06-08T13:03:47.798Z
source accessed on: 2019-12-03T20:05:01Z
source last accessed on: 2019-12-03T20:05:01Z
label: Celle FV nanostrutturate e tinte @it
label: Cellules photovoltaïques nanostructurées et teintes @fr
label: PV Pilas nanoestructuradas y teñidas @es
label: PV 셀 나노구조& 염료 @ko
label: PV-Zellen, Nano-strukturiert & gefärbt @de
label: PV電池 ﾅﾉ構造&染色 @ja
label: PV電池-奈米結構及染色 @zh-hant
label: Pilhas PV nano-estruturadas e tingidas @pt
label: Фотогальванич. ячейки: наноструктурные и окрашенные @ru
label: 光伏电池纳米染料敏化 @zh
definition: This segment includes companies that manufacture nanostructured or dye-based solar cells.
notation: 131111101113
valid from: 2014-08-08
valid till: 2020-10-03

PV Cells Other
type: BicsLevel6Segment
type: Classifier
type: Discontinued
type: NamedIndividual
is level6 segment of: PV Cells
is contemporary version of: http://data.ga-group.nl/ics/bics/131111101114
is version of: http://data.ga-group.nl/ics/bics/131111101114
imported on: 2026-06-08T13:03:47.798Z
last refreshed on: 2026-06-08T13:03:47.798Z
source accessed on: 2019-12-03T20:05:01Z
source last accessed on: 2019-12-03T20:05:01Z
label: Autres cellules photovoltaïques @fr
label: Cell fotov altro @it
label: Otras PV Pilas @es
label: Outras células PV @pt
label: PV 셀 기타 @ko
label: PV-Zellen, sonstige @de
label: PV電池 その他 @ja
label: PV電池-其他 @zh-hant
label: Фотогальванические ячейки: прочие @ru
label: 光伏电池其他 @zh
definition: This segment includes companies that manufacture other forms of solar cells not elsewhere classified.
notation: 131111101114
valid from: 2014-08-08
valid till: 2020-10-03

PV Cells
type: BicsLevel5Segment
type: Classifier
type: NamedIndividual
is level5 segment of: Solar Energy Equipment
is anachronous version of: http://data.ga-group.nl/ics/bics/131110111011
is contemporary version of: http://data.ga-group.nl/ics/bics/1311111011
is replaced by: http://data.ga-group.nl/ics/bics/2020/131110111011
is version of: http://data.ga-group.nl/ics/bics/131110111011
is version of: http://data.ga-group.nl/ics/bics/1311111011
imported on: 2026-06-08T13:03:47.798Z
last refreshed on: 2026-06-08T13:03:47.798Z
source accessed on: 2019-12-03T20:05:01Z
source last accessed on: 2019-12-03T20:05:01Z
label: Células PV @pt
label: Cell fotov @it
label: Cellules photovoltaïques @fr
label: PV Pilas @es
label: PV 셀 @ko
label: PV-Zellen @de
label: PV電池 @zh-hant
label: PVｾﾙ @ja
label: Фотогальванические ячейки @ru
label: 光伏电池 @zh
definition: This segment includes companies that manufacture solar cells and other photovoltaic equipment. Such equipment can include solar cells, solar modules and related components.
notation: 1311111011
valid from: 2014-08-08
valid till: 2020-10-03

PV Modules Crystal Silicon
type: BicsLevel6Segment
type: Classifier
type: Discontinued
type: NamedIndividual
is level6 segment of: PV Modules
is contemporary version of: http://data.ga-group.nl/ics/bics/131111101210
is version of: http://data.ga-group.nl/ics/bics/131111101210
imported on: 2026-06-08T13:03:47.798Z
last refreshed on: 2026-06-08T13:03:47.798Z
source accessed on: 2019-12-03T20:05:01Z
source last accessed on: 2019-12-03T20:05:01Z
label: Mod fotov silicio cristallino @it
label: Modules photovoltaïques à silicium cristallin @fr
label: PV Módulos de silicio cristalino @es
label: PV 모듈 결정성 실리콘 @ko
label: PV-Module, kristallines Silizium @de
label: PV模組-結晶矽 @zh-hant
label: PVﾓｼﾞｭｰﾙ 結晶ｼﾘｺﾝ @ja
label: Silício cristalino para módulos PV @pt
label: Фотогальванические модули: кристаллич. кремний @ru
label: 光伏组件晶硅 @zh
definition: This segment includes companies that manufacture crystalline silicon photovoltaic (PV) solar modules.
notation: 131111101210
valid from: 2014-08-08
valid till: 2020-10-03

PV Modules Gallium Arsenide
type: BicsLevel6Segment
type: Classifier
type: Discontinued
type: NamedIndividual
is level6 segment of: PV Modules
is contemporary version of: http://data.ga-group.nl/ics/bics/131111101211
is version of: http://data.ga-group.nl/ics/bics/131111101211
imported on: 2026-06-08T13:03:47.798Z
last refreshed on: 2026-06-08T13:03:47.798Z
source accessed on: 2019-12-03T20:05:01Z
source last accessed on: 2019-12-03T20:05:01Z
label: Arsenieto de gálio para módulos PV @pt
label: Modules photovoltaïques à l'arséniure de gallium @fr
label: Moduli fotovoltaici gallio arsenico @it
label: PV Módulos de arseniuro de galio @es
label: PV 모듈 갈륨 비소 @ko
label: PV-Modul Galliumarsenid @de
label: PV模組砷化鎵 @zh-hant
label: PVﾓｼﾞｭｰﾙ･ｶﾞﾘｳﾑﾋ素 @ja
label: Фотогальванические модули: арсенид галлия @ru
label: 光伏组件砷化镓 @zh
definition: This segment includes companies that manufacture gallium arsenide photovoltaic (PV) solar modules.
notation: 131111101211
valid from: 2014-08-08
valid till: 2020-10-03

PV Modules Nanostruct & Dyed
type: BicsLevel6Segment
type: Classifier
type: Discontinued
type: NamedIndividual
is level6 segment of: PV Modules
is contemporary version of: http://data.ga-group.nl/ics/bics/131111101212
is version of: http://data.ga-group.nl/ics/bics/131111101212
imported on: 2026-06-08T13:03:47.798Z
last refreshed on: 2026-06-08T13:03:47.798Z
source accessed on: 2019-12-03T20:05:01Z
source last accessed on: 2019-12-03T20:05:01Z
label: Celle FV nanostrutturate e tinte @it
label: Módulos PV nano-estruturado e tingido @pt
label: Modules photovoltaïques nanostructurés et teints @fr
label: PV Módulos nanoestructurados y teñidos @es
label: PV 모듈 나노구조 & 염료 @ko
label: PV-Module Nano-strukturiert & gefärbt @de
label: PV模組-奈米結構及染色 @zh-hant
label: PVﾓｼﾞｭｰﾙ ﾅﾉ構造&染色 @ja
label: Фотогальванические модули наностр. и окрашенные @ru
label: 光伏组件纳米染料敏化 @zh
definition: This segment includes companies that manufacture nanostructured or dye-based photovoltaic (PV) solar modules.
notation: 131111101212
valid from: 2014-08-08
valid till: 2020-10-03

PV Modules Other
type: BicsLevel6Segment
type: Classifier
type: Discontinued
type: NamedIndividual
is level6 segment of: PV Modules
is contemporary version of: http://data.ga-group.nl/ics/bics/131111101213
is version of: http://data.ga-group.nl/ics/bics/131111101213
imported on: 2026-06-08T13:03:47.798Z
last refreshed on: 2026-06-08T13:03:47.798Z
source accessed on: 2019-12-03T20:05:01Z
source last accessed on: 2019-12-03T20:05:01Z
label: Autres modules photovoltaïques @fr
label: Mod fotov altro @it
label: Otros PV Módulos @es
label: Outros módulos PV @pt
label: PV 모듈 기타 @ko
label: PV-Module - sonstige @de
label: PV模組-其他 @zh-hant
label: PVﾓｼﾞｭｰﾙ その他 @ja
label: Фотогальванические модули: прочие @ru
label: 光伏组件其他 @zh
definition: This segment includes companies that manufacture other forms of photovoltaic (PV) solar modules not elsewhere classified.
notation: 131111101213
valid from: 2014-08-08
valid till: 2020-10-03

PV Modules
type: BicsLevel5Segment
type: Classifier
type: NamedIndividual
is level5 segment of: Solar Energy Equipment
is anachronous version of: http://data.ga-group.nl/ics/bics/131110111012
is contemporary version of: http://data.ga-group.nl/ics/bics/1311111012
is replaced by: http://data.ga-group.nl/ics/bics/2020/131110111012
is version of: http://data.ga-group.nl/ics/bics/131110111012
is version of: http://data.ga-group.nl/ics/bics/1311111012
imported on: 2026-06-08T13:03:47.798Z
last refreshed on: 2026-06-08T13:03:47.798Z
source accessed on: 2019-12-03T20:05:01Z
source last accessed on: 2019-12-03T20:05:01Z
label: Módulos PV @pt
label: Modules photovoltaïques @fr
label: Moduli fotovoltaici @it
label: PV Módulos @es
label: PV 모듈 @ko
label: PV-Module @de
label: PV模組 @zh-hant
label: PVﾓｼﾞｭｰﾙ @ja
label: Фотогальванические модули @ru
label: 光伏组件 @zh
definition: This segment includes companies that manufacture photovoltaic solar modules.
notation: 1311111012
valid from: 2014-08-08
valid till: 2020-10-03

PV Wafers
type: BicsLevel5Segment
type: Classifier
type: NamedIndividual
is level5 segment of: Solar Energy Equipment
is anachronous version of: http://data.ga-group.nl/ics/bics/131110111013
is contemporary version of: http://data.ga-group.nl/ics/bics/1311111013
is replaced by: http://data.ga-group.nl/ics/bics/2020/131110111013
is version of: http://data.ga-group.nl/ics/bics/131110111013
is version of: http://data.ga-group.nl/ics/bics/1311111013
imported on: 2026-06-08T13:03:47.798Z
last refreshed on: 2026-06-08T13:03:47.798Z
source accessed on: 2019-12-03T20:05:01Z
source last accessed on: 2019-12-03T20:05:01Z
label: Circuiti fotovolt @it
label: Gaufrettes photovoltaïques @fr
label: PV Obleas @es
label: PV 웨이퍼 @ko
label: PV-Scheiben @de
label: PV晶圓 @zh-hant
label: PVｳｴﾊｰ @ja
label: Фотогальванические пластины @ru
label: 光伏晶片 @zh
definition: This segment includes companies that manufacture wafers used in the creation of solar cells or modules.
notation: 1311111013
valid from: 2014-08-08
valid till: 2020-10-03

Solar Inverters
type: BicsLevel5Segment
type: Classifier
type: NamedIndividual
is level5 segment of: Solar Energy Equipment
is anachronous version of: http://data.ga-group.nl/ics/bics/131110111014
is contemporary version of: http://data.ga-group.nl/ics/bics/1311111014
is replaced by: http://data.ga-group.nl/ics/bics/2020/131110111014
is version of: http://data.ga-group.nl/ics/bics/131110111014
is version of: http://data.ga-group.nl/ics/bics/1311111014
imported on: 2026-06-08T13:03:47.798Z
last refreshed on: 2026-06-08T13:03:47.798Z
source accessed on: 2019-12-03T20:05:01Z
source last accessed on: 2019-12-03T20:05:01Z
label: Inversores solares @pt
label: Invertitori solari @it
label: Onduleurs solaires @fr
label: Solarwechselrichter @de
label: Transformador solar @es
label: Инверторы солнечной энергии @ru
label: 太阳能逆变器 @zh
label: 太陽光ｲﾝﾊﾞｰﾀｰ @ja
label: 太陽能變頻器 @zh-hant
label: 태양열 변환기 @ko
definition: This segment includes companies that manufacture inverter equipment for the Solar Energy industry.
notation: 1311111014
valid from: 2014-08-08
valid till: 2020-10-03

STEG Fresnel Linear Reflector
type: BicsLevel6Segment
type: Classifier
type: Discontinued
type: NamedIndividual
is level6 segment of: Solar Thermal Elec Gen Equip
is contemporary version of: http://data.ga-group.nl/ics/bics/131111101510
is version of: http://data.ga-group.nl/ics/bics/131111101510
imported on: 2026-06-08T13:03:47.798Z
last refreshed on: 2026-06-08T13:03:47.798Z
source accessed on: 2019-12-03T20:05:01Z
source last accessed on: 2019-12-03T20:05:01Z
label: Réflecteurs linéaires de Fresnel STEG @fr
label: Refletor linear Fresnel STEG @pt
label: STEG - Linearer Fresnelspiegel @de
label: STEG - Прожектор с линзой Френеля @ru
label: STEG Fresnel Reflector lineal @es
label: STEG Riflettore lineare Fresnel @it
label: STEG 프레넬 선형 반사기 @ko
label: STEG-線性菲涅爾反射 @zh-hant
label: STEG-线性菲涅耳聚光 @zh
label: 太陽熱発電 ﾌﾚﾈﾙ線形反射 @ja
definition: This segment includes companies that manufacture Fresnel Linear Reflectors for solar thermal electricity generation (STEG) equipment.
notation: 131111101510
valid from: 2014-08-08
valid till: 2020-10-03

STEG Parabolic Dish
type: BicsLevel6Segment
type: Classifier
type: Discontinued
type: NamedIndividual
is level6 segment of: Solar Thermal Elec Gen Equip
is contemporary version of: http://data.ga-group.nl/ics/bics/131111101511
is version of: http://data.ga-group.nl/ics/bics/131111101511
imported on: 2026-06-08T13:03:47.798Z
last refreshed on: 2026-06-08T13:03:47.798Z
source accessed on: 2019-12-03T20:05:01Z
source last accessed on: 2019-12-03T20:05:01Z
label: Antena parabólica STEG @pt
label: Assiette parabolique STEG @fr
label: STEG - Параболическая антенна @ru
label: STEG Antena parabólica @es
label: STEG Dischi parabolici @it
label: STEG 파라볼릭 디시 @ko
label: STEG, Parabolspiegel @de
label: STEG-拋物面碟盤 @zh-hant
label: STRG-抛物反射器 @zh
label: 太陽熱発電 ﾃﾞｨｯｼｭ式 @ja
definition: This segment includes companies that manufacture parabolic dishes for solar thermal electricity generation (STEG) equipment.
notation: 131111101511
valid from: 2014-08-08
valid till: 2020-10-03

STEG Parabolic Trough
type: BicsLevel6Segment
type: Classifier
type: Discontinued
type: NamedIndividual
is level6 segment of: Solar Thermal Elec Gen Equip
is contemporary version of: http://data.ga-group.nl/ics/bics/131111101512
is version of: http://data.ga-group.nl/ics/bics/131111101512
imported on: 2026-06-08T13:03:47.798Z
last refreshed on: 2026-06-08T13:03:47.798Z
source accessed on: 2019-12-03T20:05:01Z
source last accessed on: 2019-12-03T20:05:01Z
label: Fluxo parabólico STEG @pt
label: Miroir parabolique STEG @fr
label: STEG - Parabolrinne @de
label: STEG - Параболоцилиндр @ru
label: STEG Cilindro parabólico @es
label: STEG Parabolici @it
label: STEG 파라볼릭 트로프 @ko
label: STEG-拋物面槽式 @zh-hant
label: STRG-拋物面槽式 @zh
label: 太陽熱発電 ﾄﾗﾌ式 @ja
definition: This segment includes companies that manufacture parabolic troughs for solar thermal electricity generation (STEG) equipment.
notation: 131111101512
valid from: 2014-08-08
valid till: 2020-10-03

STEG Solar Chimney
type: BicsLevel6Segment
type: Classifier
type: Discontinued
type: NamedIndividual
is level6 segment of: Solar Thermal Elec Gen Equip
is contemporary version of: http://data.ga-group.nl/ics/bics/131111101513
is version of: http://data.ga-group.nl/ics/bics/131111101513
imported on: 2026-06-08T13:03:47.798Z
last refreshed on: 2026-06-08T13:03:47.798Z
source accessed on: 2019-12-03T20:05:01Z
source last accessed on: 2019-12-03T20:05:01Z
label: Chaminé solar STEG @pt
label: Cheminées solaires STEG @fr
label: STEG - Солнечная вытяжная труба @ru
label: STEG Camini solari @it
label: STEG Chimenea solar @es
label: STEG 태양 굴뚝 @ko
label: STEG, Aufwind @de
label: STEG-太陽能煙囪 @zh-hant
label: STRG-太阳能烟囱 @zh
label: 太陽熱発電 太陽煙突 @ja
definition: This segment includes companies that manufacture solar chimneys for solar thermal electricity generation (STEG) equipment.
notation: 131111101513
valid from: 2014-08-08
valid till: 2020-10-03

STEG Tower & Heliostat
type: BicsLevel6Segment
type: Classifier
type: Discontinued
type: NamedIndividual
is level6 segment of: Solar Thermal Elec Gen Equip
is contemporary version of: http://data.ga-group.nl/ics/bics/131111101514
is version of: http://data.ga-group.nl/ics/bics/131111101514
imported on: 2026-06-08T13:03:47.798Z
last refreshed on: 2026-06-08T13:03:47.798Z
source accessed on: 2019-12-03T20:05:01Z
source last accessed on: 2019-12-03T20:05:01Z
label: STEG - Башня и гелиостат @ru
label: STEG Torre e eliostato @it
label: STEG Torre y Heliostat @es
label: STEG 타워 및 반사경 @ko
label: STEG, Turm & Heliostate @de
label: STEG-塔及定日鏡 @zh-hant
label: STRG-塔式及定日镜 @zh
label: Torre STEG e helióstato @pt
label: Tours et héliostats STEG @fr
label: 太陽熱発電 ﾀﾜｰ&ﾍﾘｵｽﾀｯﾄ @ja
definition: This segment includes companies that manufacture towers and heliostats for solar thermal electricity generation equipment.
notation: 131111101514
valid from: 2014-08-08
valid till: 2020-10-03

STEG Other
type: BicsLevel6Segment
type: Classifier
type: Discontinued
type: NamedIndividual
is level6 segment of: Solar Thermal Elec Gen Equip
is contemporary version of: http://data.ga-group.nl/ics/bics/131111101515
is version of: http://data.ga-group.nl/ics/bics/131111101515
imported on: 2026-06-08T13:03:47.798Z
last refreshed on: 2026-06-08T13:03:47.798Z
source accessed on: 2019-12-03T20:05:01Z
source last accessed on: 2019-12-03T20:05:01Z
label: Altro STEG @it
label: Autres STEG @fr
label: Outros STEG @pt
label: STEG - Прочее @ru
label: STEG - sonstige @de
label: STEG Otro @es
label: STEG 기타 @ko
label: STEG-其他 @zh-hant
label: STRG-其他 @zh
label: 太陽熱発電 その他 @ja
definition: This segment includes companies that manufacture other components for solar thermal electricity generation (STEG) equipment.
notation: 131111101515
valid from: 2014-08-08
valid till: 2020-10-03

Solar Thermal Elec Gen Equip
type: BicsLevel5Segment
type: Classifier
type: NamedIndividual
is level5 segment of: Solar Energy Equipment
is anachronous version of: http://data.ga-group.nl/ics/bics/131110111015
is contemporary version of: http://data.ga-group.nl/ics/bics/1311111015
is replaced by: http://data.ga-group.nl/ics/bics/2020/131110111015
is version of: http://data.ga-group.nl/ics/bics/131110111015
is version of: http://data.ga-group.nl/ics/bics/1311111015
imported on: 2026-06-08T13:03:47.798Z
last refreshed on: 2026-06-08T13:03:47.798Z
source accessed on: 2019-12-03T20:05:01Z
source last accessed on: 2019-12-03T20:05:01Z
label: Equip génér élec solaire thermique @fr
label: Equipaggiamenti generaz energia elettr solare @it
label: Equipamento de geração de eletricidade termo solar @pt
label: Equipo de generación eléctrica solar termal @es
label: Solartherm. Stromerz. Equip. @de
label: Оборудование для выработки гелиотеплоэнергии @ru
label: 太阳能光热发电设备 @zh
label: 太陽光発電装置 @ja
label: 太陽熱能發電設備 @zh-hant
label: 태양열 전기생산 장비 @ko
definition: This segment includes companies that manufacture solar thermal electricity generation equipment.
notation: 1311111015
valid from: 2014-08-08
valid till: 2020-10-03

PV Thin Film Non-Silicon Modules
type: BicsLevel6Segment
type: Classifier
type: Discontinued
type: NamedIndividual
is level6 segment of: Thin Film Modules
is contemporary version of: http://data.ga-group.nl/ics/bics/131111101610
is version of: http://data.ga-group.nl/ics/bics/131111101610
imported on: 2026-06-08T13:03:47.798Z
last refreshed on: 2026-06-08T13:03:47.798Z
source accessed on: 2019-12-03T20:05:01Z
source last accessed on: 2019-12-03T20:05:01Z
label: Módulos não silicone para películas finas PV @pt
label: Modules photovoltaïques couches minces non silicium @fr
label: Moduli fotovoltaici pellicola non silicio @it
label: PV Módulos de no silicio de filme delgado @es
label: PV 박막 비실리콘 모듈 @ko
label: PV, Dünnfilme, Nicht-Silikonmodelle @de
label: PV薄膜 非ｼﾘｺﾝ系ﾓｼﾞｭｰﾙ @ja
label: PV薄膜-非矽模組 @zh-hant
label: Фотогальванические тонкопленочные некремниевые модули @ru
label: 光伏发电薄膜非硅组件 @zh
definition: This segment includes companies that manufacture photovoltaic (PV) solar thin film non-silicon modules.
notation: 131111101610
valid from: 2014-08-08
valid till: 2020-10-03

PV Thin Film Silicon Modules
type: BicsLevel6Segment
type: Classifier
type: Discontinued
type: NamedIndividual
is level6 segment of: Thin Film Modules
is contemporary version of: http://data.ga-group.nl/ics/bics/131111101611
is version of: http://data.ga-group.nl/ics/bics/131111101611
imported on: 2026-06-08T13:03:47.798Z
last refreshed on: 2026-06-08T13:03:47.798Z
source accessed on: 2019-12-03T20:05:01Z
source last accessed on: 2019-12-03T20:05:01Z
label: Módulos de silício de película fina PV @pt
label: Mod fotov pellicola silicio @it
label: Modules photovoltaïque couche mince de silicium @fr
label: PV Módulos de silicio de filme delgado @es
label: PV 박막 실리콘 모듈 @ko
label: PV, Dünnfilme, Silikonmodelle @de
label: PV薄膜 ｼﾘｺﾝ系ﾓｼﾞｭｰﾙ @ja
label: PV薄膜-矽模組 @zh-hant
label: Фотогальванические тонкопленочные кремниевые модули @ru
label: 光伏发电薄膜硅组件 @zh
definition: This segment includes companies that manufacture photovoltaic (PV) solar thin film silicon modules.
notation: 131111101611
valid from: 2014-08-08
valid till: 2020-10-03

PV Thin Film Other
type: BicsLevel6Segment
type: Classifier
type: Discontinued
type: NamedIndividual
is level6 segment of: Thin Film Modules
is contemporary version of: http://data.ga-group.nl/ics/bics/131111101612
is version of: http://data.ga-group.nl/ics/bics/131111101612
imported on: 2026-06-08T13:03:47.798Z
last refreshed on: 2026-06-08T13:03:47.798Z
source accessed on: 2019-12-03T20:05:01Z
source last accessed on: 2019-12-03T20:05:01Z
label: Autres dispositifs photovoltaïques sur couche mince @fr
label: Fotovoltaici pellicola altro @it
label: Otrio PV de filme delgado @es
label: Outras películas finas de PV @pt
label: PV 박막 기타 @ko
label: PV, sonstige Dünnfilme @de
label: PV薄膜 その他 @ja
label: PV薄膜-其他 @zh-hant
label: Фотогальванические тонкопленочные прочие @ru
label: 光伏发电薄膜其他 @zh
definition: This segment includes companies that manufacture other forms of photovoltaic (PV) solar thin film modules not elsewhere classified.
notation: 131111101612
valid from: 2014-08-08
valid till: 2020-10-03

Thin Film Modules
type: BicsLevel5Segment
type: Classifier
type: NamedIndividual
is level5 segment of: Solar Energy Equipment
is anachronous version of: http://data.ga-group.nl/ics/bics/131110111016
is contemporary version of: http://data.ga-group.nl/ics/bics/1311111016
is replaced by: http://data.ga-group.nl/ics/bics/2020/131110111016
is version of: http://data.ga-group.nl/ics/bics/131110111016
is version of: http://data.ga-group.nl/ics/bics/1311111016
imported on: 2026-06-08T13:03:47.798Z
last refreshed on: 2026-06-08T13:03:47.798Z
source accessed on: 2019-12-03T20:05:01Z
source last accessed on: 2019-12-03T20:05:01Z
label: Dünnfilmmodule @de
label: Módulos de filme fino @es
label: Módulos públicos de película fina @pt
label: Modules couche mince @fr
label: Moduli pellicola sottile @it
label: Тонкопленочные модули @ru
label: 薄膜模組 @zh-hant
label: 薄膜组件 @zh
label: 薄膜ﾓｼﾞｭｰﾙ @ja
label: 박막 모듈 @ko
definition: This segment includes companies that manufacture photovoltaic solar thin film modules.
notation: 1311111016
valid from: 2014-08-08
valid till: 2020-10-03

Other Solar Energy Components
type: BicsLevel5Segment
type: Classifier
type: Discontinued
type: NamedIndividual
is level5 segment of: Solar Energy Equipment
is contemporary version of: http://data.ga-group.nl/ics/bics/1311111017
is version of: http://data.ga-group.nl/ics/bics/1311111017
imported on: 2026-06-08T13:03:47.798Z
last refreshed on: 2026-06-08T13:03:47.798Z
source accessed on: 2019-12-03T20:05:01Z
source last accessed on: 2019-12-03T20:05:01Z
label: Altri componenti energia solare @it
label: Autres composants d'énergie solaire @fr
label: Otros componentes de energía solar @es
label: Outros componentes de energia solar @pt
label: Sonstige Solarenergiekomponenten @de
label: Прочие компоненты солнечной энергии @ru
label: その他太陽ｴﾈﾙｷﾞｰ部品 @ja
label: 其他太阳能组件 @zh
label: 其他太陽能組成 @zh-hant
label: 기타 태양에너지 부품 @ko
definition: This segment includes companies that manufacture other solar energy equipment not elsewhere classified. This includes equipment, such as mirrors, tracking devices and inverters for the solar energy industry.
notation: 1311111017
valid from: 2014-08-08
valid till: 2020-10-03

Solar Energy Equipment
type: BicsLevel4SubIndustry
type: Classifier
type: NamedIndividual
is sub industry of: Renewable Energy Equipment
is anachronous version of: http://data.ga-group.nl/ics/bics/1311101110
is contemporary version of: http://data.ga-group.nl/ics/bics/13111110
is replaced by: http://data.ga-group.nl/ics/bics/2020/1311101110
is version of: http://data.ga-group.nl/ics/bics/1311101110
is version of: http://data.ga-group.nl/ics/bics/13111110
imported on: 2026-06-08T13:03:47.798Z
last refreshed on: 2026-06-08T13:03:47.798Z
source accessed on: 2019-12-03T20:05:01Z
source last accessed on: 2019-12-03T20:05:01Z
label: Apparecchiature energia solare @it
label: Equipamento de energia solar @pt
label: Equipements énergie solaire @fr
label: Equipo de energía solar @es
label: Solarenergie-Equipment @de
label: Оборудование д/солнечной энергии @ru
label: 太阳能设备 @zh
label: 太陽能設備 @zh-hant
label: 太陽ｴﾈﾙｷﾞｰ @ja
label: 태양에너지 @ko
definition: This industry subgroup includes companies that manufacture solar energy equipment, such as polysilicon feedstock, thin film, modules, concentrated photovoltaics, crystalline silicon wafers, cells, modules and related equipment.
notation: 13111110
valid from: 2014-08-08
valid till: 2020-10-03

Wind Turbine Offshore
type: BicsLevel6Segment
type: Classifier
type: Discontinued
type: NamedIndividual
is level6 segment of: Wind Turbines
is contemporary version of: http://data.ga-group.nl/ics/bics/131111111010
is version of: http://data.ga-group.nl/ics/bics/131111111010
imported on: 2026-06-08T13:03:47.798Z
last refreshed on: 2026-06-08T13:03:47.798Z
source accessed on: 2019-12-03T20:05:01Z
source last accessed on: 2019-12-03T20:05:01Z
label: Turbina eólica offshore @pt
label: Turbina externa de viento @es
label: Turbine eoliche Offshore @it
label: Turbines éoliennes offshore @fr
label: Windturbine, Offshore @de
label: Ветряные турбины в шельфовой зоне @ru
label: 風力渦輪-離岸 @zh-hant
label: 風力発電 洋上 @ja
label: 风力机海上 @zh
label: 풍력터빈 해상 @ko
definition: This segment includes companies that manufacture integrated wind-power generation machinery for use in offshore locations.
notation: 131111111010
valid from: 2014-08-08
valid till: 2020-10-03

Wind Turbine Onshore - Lg Scale
type: BicsLevel7Segment
type: Classifier
type: Discontinued
type: NamedIndividual
is level7 segment of: Wind Turbine Onshore
is contemporary version of: http://data.ga-group.nl/ics/bics/13111111101110
is version of: http://data.ga-group.nl/ics/bics/13111111101110
imported on: 2026-06-08T13:03:47.798Z
last refreshed on: 2026-06-08T13:03:47.798Z
source accessed on: 2019-12-03T20:05:01Z
source last accessed on: 2019-12-03T20:05:01Z
label: Turb éol onshore - Grande échelle @fr
label: Turbina eólica doméstica - Grnd escala @pt
label: Turbina interna de viento - gran escala @es
label: Turbine eoliche onshore - Scala grande @it
label: Windturbine, Onshore - Großer Maßstab @de
label: Ветряные турбины на берегу - крупн. @ru
label: 風力渦輪-岸上-大型 @zh-hant
label: 風力発電 陸上-大型 @ja
label: 风机陆上-大型 @zh
label: 풍력터빈 육상 - 대형 @ko
definition: This segment includes companies that manufacture large-scale, integrated wind-power generation machinery used in onshore locations.
notation: 13111111101110
valid from: 2014-08-08
valid till: 2020-10-03

Wind Turb Onshore - Lg 2 Blade
type: BicsLevel7Segment
type: Classifier
type: Discontinued
type: NamedIndividual
is level7 segment of: Wind Turbine Onshore
is contemporary version of: http://data.ga-group.nl/ics/bics/13111111101111
is version of: http://data.ga-group.nl/ics/bics/13111111101111
imported on: 2026-06-08T13:03:47.798Z
last refreshed on: 2026-06-08T13:03:47.798Z
source accessed on: 2019-12-03T20:05:01Z
source last accessed on: 2019-12-03T20:05:01Z
label: Turb éol onshore - Grande échelle, 2 pales @fr
label: Turbina eólica doméstica - Grnd 2 lâminas @pt
label: Turbina interna de viento - dos aspas grandes @es
label: Turbine eoliche onshore - 2 pale @it
label: Windturbine, Onshore - Gr. 2: Rotorblätter @de
label: Оншорн. ветряные турбины - крупн., двулопастные @ru
label: 風力渦輪-岸上-大型雙葉片 @zh-hant
label: 風力発電 陸上-大型2枚ﾌﾞﾚｰﾄﾞ @ja
label: 风机陆上-大型双叶 @zh
label: 풍력터빈 육상 - 대형 2 블레이드 @ko
definition: This segment includes companies that manufacture large-scale, two-blade, integrated wind-power generation machinery used in onshore locations.
notation: 13111111101111
valid from: 2014-08-08
valid till: 2020-10-03

Wind Turb Onsh - Lg Vert Axis
type: BicsLevel7Segment
type: Classifier
type: Discontinued
type: NamedIndividual
is level7 segment of: Wind Turbine Onshore
is contemporary version of: http://data.ga-group.nl/ics/bics/13111111101112
is version of: http://data.ga-group.nl/ics/bics/13111111101112
imported on: 2026-06-08T13:03:47.798Z
last refreshed on: 2026-06-08T13:03:47.798Z
source accessed on: 2019-12-03T20:05:01Z
source last accessed on: 2019-12-03T20:05:01Z
label: Turb éol onsh - Grande éch, axe vertic @fr
label: Turbina eólica dom - eixo vert grd esc @pt
label: Turbina interna de viento - gran escala de eje vertical @es
label: Turbine eoliche onshore - Asse vert @it
label: Windturbine, Onsh. sonst. - Gr. Vert. Achse @de
label: Оншорн. ветряные турбины - крупн. с вертик. осью @ru
label: 風力渦輪-岸上-大型垂直軸 @zh-hant
label: 風力発電 陸上-大型垂直軸 @ja
label: 风机陆上-大型立轴 @zh
label: 풍력터빈 육상 - 대형 수직축 @ko
definition: This segment includes companies that manufacture large-scale, vertical-axis, integrated wind power generation machinery used in onshore locations.
notation: 13111111101112
valid from: 2014-08-08
valid till: 2020-10-03

Wind Turb Onshore - Micro Scale
type: BicsLevel7Segment
type: Classifier
type: Discontinued
type: NamedIndividual
is level7 segment of: Wind Turbine Onshore
is contemporary version of: http://data.ga-group.nl/ics/bics/13111111101113
is version of: http://data.ga-group.nl/ics/bics/13111111101113
imported on: 2026-06-08T13:03:47.798Z
last refreshed on: 2026-06-08T13:03:47.798Z
source accessed on: 2019-12-03T20:05:01Z
source last accessed on: 2019-12-03T20:05:01Z
label: Turb éol onshore - Micro échelle @fr
label: Turbina eólica doméstica - micro escala @pt
label: Turbina interna de viento - escala micro @es
label: Turbine eoliche onshore - Scala micro @it
label: Windturbine, Onshore - Mikromaßstab @de
label: Оншорн. ветряные турбины - малые @ru
label: 風力渦輪-岸上-微型 @zh-hant
label: 風力発電 陸上-小型 @ja
label: 风机陆上-微型 @zh
label: 풍력터빈 육상 - ���형 @ko
definition: This segment includes companies that manufacture micro-scale, integrated wind power generation machinery used in onshore locations.
notation: 13111111101113
valid from: 2014-08-08
valid till: 2020-10-03

Wind Turbine Onshore
type: BicsLevel6Segment
type: Classifier
type: Discontinued
type: NamedIndividual
is level6 segment of: Wind Turbines
is contemporary version of: http://data.ga-group.nl/ics/bics/131111111011
is version of: http://data.ga-group.nl/ics/bics/131111111011
imported on: 2026-06-08T13:03:47.798Z
last refreshed on: 2026-06-08T13:03:47.798Z
source accessed on: 2019-12-03T20:05:01Z
source last accessed on: 2019-12-03T20:05:01Z
label: Turbina eólica doméstica @pt
label: Turbina interna de viento @es
label: Turbine eoliche onshore @it
label: Turbines éoliennes onshore @fr
label: Windturbine, Onshore @de
label: Ветряные турбины на берегу @ru
label: 風力渦輪-岸上 @zh-hant
label: 風力発電 陸上 @ja
label: 风力机-陆上 @zh
label: 풍력터빈 육상 @ko
definition: This segment includes companies that manufacture integrated wind-power generation machinery for use in onshore locations.
notation: 131111111011
valid from: 2014-08-08
valid till: 2020-10-03

Wind Turbines
type: BicsLevel5Segment
type: Classifier
type: NamedIndividual
is level5 segment of: Wind Energy Equipment
is anachronous version of: http://data.ga-group.nl/ics/bics/131110111110
is contemporary version of: http://data.ga-group.nl/ics/bics/1311111110
is replaced by: http://data.ga-group.nl/ics/bics/2020/131110111110
is version of: http://data.ga-group.nl/ics/bics/131110111110
is version of: http://data.ga-group.nl/ics/bics/1311111110
imported on: 2026-06-08T13:03:47.798Z
last refreshed on: 2026-06-08T13:03:47.798Z
source accessed on: 2019-12-03T20:05:01Z
source last accessed on: 2019-12-03T20:05:01Z
label: Turbina eólica @pt
label: Turbinas eólicas @es
label: Turbine eoliche @it
label: Turbines éoliennes @fr
label: Windturbinen @de
label: Ветряная турбины @ru
label: 風力渦輪機 @zh-hant
label: 風力ﾀｰﾋﾞﾝ製造 @ja
label: 风机 @zh
label: 풍력터빈 @ko
definition: This segment includes companies that manufacture wind-power generation machinery.
notation: 1311111110
valid from: 2014-08-08
valid till: 2020-10-03

Wind Turbine Bearings
type: BicsLevel6Segment
type: Classifier
type: Discontinued
type: NamedIndividual
is level6 segment of: Wind Turbine Components
is contemporary version of: http://data.ga-group.nl/ics/bics/131111111110
is version of: http://data.ga-group.nl/ics/bics/131111111110
imported on: 2026-06-08T13:03:47.798Z
last refreshed on: 2026-06-08T13:03:47.798Z
source accessed on: 2019-12-03T20:05:01Z
source last accessed on: 2019-12-03T20:05:01Z
label: Cojinetes de turbina de viento @es
label: Rolamentos para turbina eólica @pt
label: Roulements de turbines éoliennes @fr
label: Supporti turbine eoliche @it
label: Windturbine, Lager @de
label: Ветряные турбины - Подшипники @ru
label: 風力渦輪-���承 @zh-hant
label: 風力発電 ﾍﾞｱﾘﾝｸﾞ @ja
label: 风力机轴承 @zh
label: 풍력터빈 베어링 @ko
definition: This segment includes companies that manufacture bearings for the wind energy industry.
notation: 131111111110
valid from: 2014-08-08
valid till: 2020-10-03

Wind Turbine Blades
type: BicsLevel6Segment
type: Classifier
type: Discontinued
type: NamedIndividual
is level6 segment of: Wind Turbine Components
is contemporary version of: http://data.ga-group.nl/ics/bics/131111111111
is version of: http://data.ga-group.nl/ics/bics/131111111111
imported on: 2026-06-08T13:03:47.798Z
last refreshed on: 2026-06-08T13:03:47.798Z
source accessed on: 2019-12-03T20:05:01Z
source last accessed on: 2019-12-03T20:05:01Z
label: Aspas de turbina de viento @es
label: Pás para turbina eólica @pt
label: Pale turbine eoliche @it
label: Pales de turbines éoliennes @fr
label: Windturbine, Rotorblätter @de
label: Ветряные турбины - Лопасти @ru
label: 風力渦輪-葉片 @zh-hant
label: 風力発電 ﾌﾞﾚｰﾄﾞ @ja
label: 风力机叶片 @zh
label: 풍력터빈 블레이드 @ko
definition: This segment includes companies that manufacture blades for the wind energy industry.
notation: 131111111111
valid from: 2014-08-08
valid till: 2020-10-03

Wind Turbine Gearboxes
type: BicsLevel6Segment
type: Classifier
type: Discontinued
type: NamedIndividual
is level6 segment of: Wind Turbine Components
is contemporary version of: http://data.ga-group.nl/ics/bics/131111111112
is version of: http://data.ga-group.nl/ics/bics/131111111112
imported on: 2026-06-08T13:03:47.798Z
last refreshed on: 2026-06-08T13:03:47.798Z
source accessed on: 2019-12-03T20:05:01Z
source last accessed on: 2019-12-03T20:05:01Z
label: Caixas de velocidade para turbina eólica @pt
label: Cajas de transmisión de turbina de viento @es
label: Engrenages de turbines éoliennes @fr
label: Trasmissione turbine eoliche @it
label: Windturbinengetriebe @de
label: Ветряные турбины - Редукторы @ru
label: 風力渦輪-齒輪箱 @zh-hant
label: 風力発電 ｷﾞｱﾎﾞｯｸｽ @ja
label: 风力机齿轮箱 @zh
label: 풍력터빈 증속기 @ko
definition: This segment includes companies that manufacture gearboxes for the wind energy industry.
notation: 131111111112
valid from: 2014-08-08
valid till: 2020-10-03

Wind Turbine Generators
type: BicsLevel6Segment
type: Classifier
type: Discontinued
type: NamedIndividual
is level6 segment of: Wind Turbine Components
is contemporary version of: http://data.ga-group.nl/ics/bics/131111111113
is version of: http://data.ga-group.nl/ics/bics/131111111113
imported on: 2026-06-08T13:03:47.798Z
last refreshed on: 2026-06-08T13:03:47.798Z
source accessed on: 2019-12-03T20:05:01Z
source last accessed on: 2019-12-03T20:05:01Z
label: Générateurs de turbines éoliennes @fr
label: Generadores de turbina de viento @es
label: Generatori turbine eoliche @it
label: Geradores de turbina eólica @pt
label: Windturbinengeneratoren @de
label: Ветряные турбины - Генераторы @ru
label: 風力渦輪-發電機 @zh-hant
label: 風力発電 発電機 @ja
label: 风力机发电机 @zh
label: 풍력터빈 발전기 @ko
definition: This segment includes companies that manufacture generators for the wind energy industry.
notation: 131111111113
valid from: 2014-08-08
valid till: 2020-10-03

Wind Turbine Pitch
type: BicsLevel6Segment
type: Classifier
type: Discontinued
type: NamedIndividual
is level6 segment of: Wind Turbine Components
is contemporary version of: http://data.ga-group.nl/ics/bics/131111111114
is version of: http://data.ga-group.nl/ics/bics/131111111114
imported on: 2026-06-08T13:03:47.798Z
last refreshed on: 2026-06-08T13:03:47.798Z
source accessed on: 2019-12-03T20:05:01Z
source last accessed on: 2019-12-03T20:05:01Z
label: Altezza turbine eoliche @it
label: Nível da turbina eólica @pt
label: Nivel de turbina eólica @es
label: Pas d'aube de turbines éoliennes @fr
label: Windenergieturbine, Pitch @de
label: Ветряные турбины - Вращение @ru
label: 風力渦輪-螺距 @zh-hant
label: 風力発電 ﾋﾟｯﾁ @ja
label: 风力机桨距 @zh
label: 풍력터빈 피치 @ko
definition: This segment includes companies that manufacture pitch systems for the wind energy industry.
notation: 131111111114
valid from: 2014-08-08
valid till: 2020-10-03

Wind Turbine Tower Foundation
type: BicsLevel6Segment
type: Classifier
type: Discontinued
type: NamedIndividual
is level6 segment of: Wind Turbine Components
is contemporary version of: http://data.ga-group.nl/ics/bics/131111111115
is version of: http://data.ga-group.nl/ics/bics/131111111115
imported on: 2026-06-08T13:03:47.798Z
last refreshed on: 2026-06-08T13:03:47.798Z
source accessed on: 2019-12-03T20:05:01Z
source last accessed on: 2019-12-03T20:05:01Z
label: Cimientos de la turbina eólica @es
label: Fondamenta torri turbine eoliche @it
label: Fondations de tours de turbines éoliennes @fr
label: Fundação da torre de turbina eólica @pt
label: Windturbine, Turmfundament @de
label: Ветряные турбины - башенные фундаменты @ru
label: 風力渦輪-塔架系統 @zh-hant
label: 風力発電 ﾀﾜｰ基礎 @ja
label: 风机发电塔基础 @zh
label: 풍력터빈 타워 기초 @ko
definition: This segment includes companies that manufacture tower foundations for the wind energy industry.
notation: 131111111115
valid from: 2014-08-08
valid till: 2020-10-03

Wind Turbine Towers
type: BicsLevel6Segment
type: Classifier
type: Discontinued
type: NamedIndividual
is level6 segment of: Wind Turbine Components
is contemporary version of: http://data.ga-group.nl/ics/bics/131111111116
is version of: http://data.ga-group.nl/ics/bics/131111111116
imported on: 2026-06-08T13:03:47.798Z
last refreshed on: 2026-06-08T13:03:47.798Z
source accessed on: 2019-12-03T20:05:01Z
source last accessed on: 2019-12-03T20:05:01Z
label: Torres de turbina eólica @es
label: Torri turbine eoliche @it
label: Tours de turbines éoliennes @fr
label: Windturbinentürme @de
label: Ветряные турбины - Башня @ru
label: 風力渦輪塔 @zh-hant
label: 風力発電ﾀﾜｰ @ja
label: 风力机发电塔 @zh
label: 풍력터빈 타워 @ko
definition: This segment includes companies that manufacture towers for the wind energy industry.
notation: 131111111116
valid from: 2014-08-08
valid till: 2020-10-03

Other Wind Turbine Components
type: BicsLevel6Segment
type: Classifier
type: Discontinued
type: NamedIndividual
is level6 segment of: Wind Turbine Components
is contemporary version of: http://data.ga-group.nl/ics/bics/131111111117
is version of: http://data.ga-group.nl/ics/bics/131111111117
imported on: 2026-06-08T13:03:47.798Z
last refreshed on: 2026-06-08T13:03:47.798Z
source accessed on: 2019-12-03T20:05:01Z
source last accessed on: 2019-12-03T20:05:01Z
label: Altri componenti turbine eoliche @it
label: Autres composants de turbines éoliennes @fr
label: Otros componentes de turbinas de viento @es
label: Outros componentes turbina eólica @pt
label: Sonstige Windturbinenkomponenten @de
label: Пр. компоненты ветряной турбины @ru
label: その他風力発電部品 @ja
label: 其他風力渦輪組成 @zh-hant
label: 其他风机组件 @zh
label: 기타 풍력터빈부품 @ko
definition: This segment includes companies that manufacture other components for the wind energy industry not elsewhere classified.
notation: 131111111117
valid from: 2014-08-08
valid till: 2020-10-03

Wind Turbine Components
type: BicsLevel5Segment
type: Classifier
type: NamedIndividual
is level5 segment of: Wind Energy Equipment
is anachronous version of: http://data.ga-group.nl/ics/bics/131110111111
is contemporary version of: http://data.ga-group.nl/ics/bics/1311111111
is replaced by: http://data.ga-group.nl/ics/bics/2020/131110111111
is version of: http://data.ga-group.nl/ics/bics/131110111111
is version of: http://data.ga-group.nl/ics/bics/1311111111
imported on: 2026-06-08T13:03:47.798Z
last refreshed on: 2026-06-08T13:03:47.798Z
source accessed on: 2019-12-03T20:05:01Z
source last accessed on: 2019-12-03T20:05:01Z
label: Componentes de turbinas de viento @es
label: Componentes turbina eólica @pt
label: Componenti turbine eoliche @it
label: Composants de turbines éoliennes @fr
label: Windturbinenkomponenten @de
label: Компоненты ветротурбины @ru
label: 風力渦輪機組件 @zh-hant
label: 風力ﾀｰﾋﾞﾝ･ｺﾝﾎﾟｰﾈﾝﾄ @ja
label: 风力机组件 @zh
label: 풍력터빈부품 @ko
definition: This segment includes companies that manufacture components for the wind energy industry, such as bearings, blades, gearboxes, generators, pitch systems, towers and tower foundations.
notation: 1311111111
valid from: 2014-08-08
valid till: 2020-10-03

Wind Energy Equipment
type: BicsLevel4SubIndustry
type: Classifier
type: NamedIndividual
is sub industry of: Renewable Energy Equipment
is anachronous version of: http://data.ga-group.nl/ics/bics/1311101111
is contemporary version of: http://data.ga-group.nl/ics/bics/13111111
is replaced by: http://data.ga-group.nl/ics/bics/2020/1311101111
is version of: http://data.ga-group.nl/ics/bics/1311101111
is version of: http://data.ga-group.nl/ics/bics/13111111
imported on: 2026-06-08T13:03:47.798Z
last refreshed on: 2026-06-08T13:03:47.798Z
source accessed on: 2019-12-03T20:05:01Z
source last accessed on: 2019-12-03T20:05:01Z
label: Apparecchiatura energia eolica @it
label: Equipamento para energia eólica @pt
label: Equipements pour énergie éolienne @fr
label: Equipo de energía eólica @es
label: Windenergie, Equipment @de
label: Оборудование для ветровой энергии @ru
label: 風力能源 @zh-hant
label: 風力ｴﾈﾙｷﾞｰ @ja
label: 风能设备 @zh
label: 풍력에너지 장비 @ko
definition: This industry subgroup includes companies that manufacture wind energy equipment, such as wind-power generation machinery, towers and components.
notation: 13111111
valid from: 2014-08-08
valid till: 2020-10-03

Geothermal Equipment
type: BicsLevel5Segment
type: Classifier
type: Discontinued
type: NamedIndividual
is level5 segment of: Geothermal Energy Equipment
is contemporary version of: http://data.ga-group.nl/ics/bics/1311111210
is version of: http://data.ga-group.nl/ics/bics/1311111210
imported on: 2026-06-08T13:03:47.798Z
last refreshed on: 2026-06-08T13:03:47.798Z
source accessed on: 2019-12-03T20:05:01Z
source last accessed on: 2019-12-03T20:05:01Z
label: Equipaggiamenti geotermici @it
label: Equipamento geotérmico @pt
label: Equipements géothermiques @fr
label: Equipo geotermal @es
label: Geothermisches Equipment @de
label: Геотермальное оборудование @ru
label: 地热设备 @zh
label: 地熱設備 @ja
label: 지열 장비 @ko
definition: This segment includes companies that manufacture geothermal energy equipment.
notation: 1311111210
valid from: 2014-08-08
valid till: 2020-10-03

Thermoelectric Generators
type: BicsLevel5Segment
type: Classifier
type: Discontinued
type: NamedIndividual
is level5 segment of: Geothermal Energy Equipment
is contemporary version of: http://data.ga-group.nl/ics/bics/1311111211
is version of: http://data.ga-group.nl/ics/bics/1311111211
imported on: 2026-06-08T13:03:47.798Z
last refreshed on: 2026-06-08T13:03:47.798Z
source accessed on: 2019-12-03T20:05:01Z
source last accessed on: 2019-12-03T20:05:01Z
label: Générateurs thermoélectriques @fr
label: Generadores termoeléctricos @es
label: Generatori termoelettrici @it
label: Geradores termo-elétricos @pt
label: Thermoelektrische Generatoren @de
label: Термоэлектрические генераторы @ru
label: 热电发电机 @zh
label: 熱電発電機 @ja
label: 熱電發電機 @zh-hant
label: 열전기 발전기 @ko
definition: This segment includes companies that manufacture thermoelectric generators for geothermal energy production.
notation: 1311111211
valid from: 2014-08-08
valid till: 2020-10-03

Other Geothermal Energy Cmpnts
type: BicsLevel5Segment
type: Classifier
type: Discontinued
type: NamedIndividual
is level5 segment of: Geothermal Energy Equipment
is contemporary version of: http://data.ga-group.nl/ics/bics/1311111212
is version of: http://data.ga-group.nl/ics/bics/1311111212
imported on: 2026-06-08T13:03:47.798Z
last refreshed on: 2026-06-08T13:03:47.798Z
source accessed on: 2019-12-03T20:05:01Z
source last accessed on: 2019-12-03T20:05:01Z
label: Altri comp energia geotermica @it
label: Autres compos énergie géothermique @fr
label: Otros componentes de energía geotérmica @es
label: Outros comp energia geotérmica @pt
label: Sonstige geotherm. Energiekomponenten @de
label: Прочие гидротермальные кмпнт @ru
label: その他地熱ｴﾈﾙｷﾞｰ部品 @ja
label: 其他地热能源装置 @zh
label: 其他地熱能源組成 @zh-hant
label: 기타 지열에너지 부품 @ko
definition: This segment includes companies that manufacture other geothermal energy components not elsewhere classified.
notation: 1311111212
valid from: 2014-08-08
valid till: 2020-10-03

Geothermal Energy Equipment
type: BicsLevel4SubIndustry
type: Classifier
type: NamedIndividual
is sub industry of: Renewable Energy Equipment
is anachronous version of: http://data.ga-group.nl/ics/bics/1311101112
is contemporary version of: http://data.ga-group.nl/ics/bics/13111112
is replaced by: http://data.ga-group.nl/ics/bics/2020/1311101112
is version of: http://data.ga-group.nl/ics/bics/1311101112
is version of: http://data.ga-group.nl/ics/bics/13111112
imported on: 2026-06-08T13:03:47.798Z
last refreshed on: 2026-06-08T13:03:47.798Z
source accessed on: 2019-12-03T20:05:01Z
source last accessed on: 2019-12-03T20:05:01Z
label: Equipagg energia geotermica @it
label: Equipamento de energia geotérmica @pt
label: Equipements énergie géothermique @fr
label: Equipo de energía geotermal @es
label: Geothermisches Energie-Equipment @de
label: Геотермальная энергия-Оборуд��вание @ru
label: 地热能源设备 @zh
label: 地熱能源設備 @zh-hant
label: 地熱ｴﾈﾙｷﾞｰ設備 @ja
label: 지열에너지 장비 @ko
definition: This industry subgroup includes companies that manufacture equipment used in geothermal energy production. This includes geothermal equipment, thermoelectric generators and other geothermal energy components.
notation: 13111112
valid from: 2014-08-08
valid till: 2020-10-03

Hydro Energy Micro Turbines
type: BicsLevel5Segment
type: Classifier
type: Discontinued
type: NamedIndividual
is level5 segment of: Hydro Energy Equipment
is contemporary version of: http://data.ga-group.nl/ics/bics/1311111310
is version of: http://data.ga-group.nl/ics/bics/1311111310
imported on: 2026-06-08T13:03:47.798Z
last refreshed on: 2026-06-08T13:03:47.798Z
source accessed on: 2019-12-03T20:05:01Z
source last accessed on: 2019-12-03T20:05:01Z
label: Micro turbine idroenergia @it
label: Micro turbines hydro-électricité @fr
label: Turbinas Micro de hidroenergia @pt
label: Turbinas micro de energía hidráulica @es
label: Wasserkraft - Mikroturbinen @de
label: Гидроэнергия-Микротурбины @ru
label: 水力能源-微型涡轮 @zh
label: 水力能源微型渦輪 @zh-hant
label: 水力ｴﾈﾙｷﾞｰ 小型ﾀｰﾋﾞﾝ @ja
label: 수력 에너지 마이크로 터빈 @ko
definition: This segment includes companies that manufacture hydro energy microturbine equipment used in hydroelectric dams.
notation: 1311111310
valid from: 2014-08-08
valid till: 2020-10-03

Hydro Energy Pico Turbines
type: BicsLevel5Segment
type: Classifier
type: Discontinued
type: NamedIndividual
is level5 segment of: Hydro Energy Equipment
is contemporary version of: http://data.ga-group.nl/ics/bics/1311111311
is version of: http://data.ga-group.nl/ics/bics/1311111311
imported on: 2026-06-08T13:03:47.798Z
last refreshed on: 2026-06-08T13:03:47.798Z
source accessed on: 2019-12-03T20:05:01Z
source last accessed on: 2019-12-03T20:05:01Z
label: Pico turbine idroenergia @it
label: Pico turbines hydro-électricité @fr
label: Turbinas Pico de energía hidráulica @es
label: Turbinas Pico de hidroenergia @pt
label: Wasserkraft - Picoturbinen @de
label: Гидроэнергия-Pico Turbines @ru
label: 水力能源-微微型涡轮 @zh
label: 水力能源超微渦輪 @zh-hant
label: 水力ｴﾈﾙｷﾞｰ 超小型ﾀｰﾋﾞﾝ @ja
label: 수력 에너지 피코 터빈 @ko
definition: This segment includes companies that manufacture hydro energy pico turbine equipment used in hydroelectric dams.
notation: 1311111311
valid from: 2014-08-08
valid till: 2020-10-03

Hydro Energy Turbines
type: BicsLevel5Segment
type: Classifier
type: Discontinued
type: NamedIndividual
is level5 segment of: Hydro Energy Equipment
is contemporary version of: http://data.ga-group.nl/ics/bics/1311111312
is version of: http://data.ga-group.nl/ics/bics/1311111312
imported on: 2026-06-08T13:03:47.798Z
last refreshed on: 2026-06-08T13:03:47.798Z
source accessed on: 2019-12-03T20:05:01Z
source last accessed on: 2019-12-03T20:05:01Z
label: Turbinas de energía hidráulica @es
label: Turbinas de hidroenergia @pt
label: Turbine idroenergia @it
label: Turbines hydro-électriques @fr
label: Wasserkraft - Turbinen @de
label: Гидроэнергия-Турбины @ru
label: 水力能源涡轮 @zh
label: 水力能源渦輪 @zh-hant
label: 水力ｴﾈﾙｷﾞｰ ﾀｰﾋﾞﾝ @ja
label: 수력에너지 터빈 @ko
definition: This segment includes companies that manufacture hydro energy turbine equipment used in hydroelectric dams.
notation: 1311111312
valid from: 2014-08-08
valid till: 2020-10-03

Other Hydro Energy Components
type: BicsLevel5Segment
type: Classifier
type: Discontinued
type: NamedIndividual
is level5 segment of: Hydro Energy Equipment
is contemporary version of: http://data.ga-group.nl/ics/bics/1311111313
is version of: http://data.ga-group.nl/ics/bics/1311111313
imported on: 2026-06-08T13:03:47.798Z
last refreshed on: 2026-06-08T13:03:47.798Z
source accessed on: 2019-12-03T20:05:01Z
source last accessed on: 2019-12-03T20:05:01Z
label: Altri componenti energia idroelettrica @it
label: Autres composants hydro-électricité @fr
label: Otros componentes de energía hidráulica @es
label: Outros componentes de hidroenergia @pt
label: Sonstige Wasserkraftkomponenten @de
label: Прочие гидроэнерг. компоненты @ru
label: その他水力ｴﾈﾙｷﾞｰ部品 @ja
label: 其他水力能源組成 @zh-hant
label: 其他水力能源装置 @zh
label: 기타 수력 부품 @ko
definition: This segment includes companies that manufacture other hydro energy components not elsewhere classified.
notation: 1311111313
valid from: 2014-08-08
valid till: 2020-10-03

Hydro Energy Equipment
type: BicsLevel4SubIndustry
type: Classifier
type: NamedIndividual
is sub industry of: Renewable Energy Equipment
is anachronous version of: http://data.ga-group.nl/ics/bics/1311101113
is contemporary version of: http://data.ga-group.nl/ics/bics/13111113
is replaced by: http://data.ga-group.nl/ics/bics/2020/1311101113
is version of: http://data.ga-group.nl/ics/bics/1311101113
is version of: http://data.ga-group.nl/ics/bics/13111113
imported on: 2026-06-08T13:03:47.798Z
last refreshed on: 2026-06-08T13:03:47.798Z
source accessed on: 2019-12-03T20:05:01Z
source last accessed on: 2019-12-03T20:05:01Z
label: Equipaggiam idroenergia @it
label: Equipamento de hidroenergia @pt
label: Equipements pour hydro-électricité @fr
label: Equipo de energía hidráulica @es
label: Wasserkraft - Equipment @de
label: Гидроэнергия-Оборудование @ru
label: 水力能源設備 @zh-hant
label: 水力能源设备 @zh
label: 水力ｴﾈﾙｷﾞｰ 設備 @ja
label: 수력에너지 장비 @ko
definition: This industry subgroup includes companies that manufacture hydro energy equipment used in hydroelectric dams.
notation: 13111113
valid from: 2014-08-08
valid till: 2020-10-03

Ocean Thermal Convertors
type: BicsLevel5Segment
type: Classifier
type: Discontinued
type: NamedIndividual
is level5 segment of: Marine Energy Equipment
is contemporary version of: http://data.ga-group.nl/ics/bics/1311111410
is version of: http://data.ga-group.nl/ics/bics/1311111410
imported on: 2026-06-08T13:03:47.798Z
last refreshed on: 2026-06-08T13:03:47.798Z
source accessed on: 2019-12-03T20:05:01Z
source last accessed on: 2019-12-03T20:05:01Z
label: Conversores térmicos marítimo @pt
label: Convertidor termal oceánico @es
label: Convertisseurs de l'énergie thermique des océans @fr
label: Convertitori termici oceanici @it
label: Ozean-Thermokonverter @de
label: Преобразователь термальной энергии океана @ru
label: 海洋热能转换器 @zh
label: 海洋熱変換器 @ja
label: 海洋熱能轉能機 @zh-hant
label: 해양열 변환장치 @ko
definition: This segment includes companies that manufacture ocean thermal convertors.
notation: 1311111410
valid from: 2014-08-08
valid till: 2020-10-03

Tidal Stream Turbines
type: BicsLevel5Segment
type: Classifier
type: Discontinued
type: NamedIndividual
is level5 segment of: Marine Energy Equipment
is contemporary version of: http://data.ga-group.nl/ics/bics/1311111411
is version of: http://data.ga-group.nl/ics/bics/1311111411
imported on: 2026-06-08T13:03:47.798Z
last refreshed on: 2026-06-08T13:03:47.798Z
source accessed on: 2019-12-03T20:05:01Z
source last accessed on: 2019-12-03T20:05:01Z
label: Gezeitenkraftturbinen @de
label: Turbina de olas del mar @es
label: Turbinas de corrente marítima @pt
label: Turbine flusso marea @it
label: Turbines énergie marémotrice @fr
label: Турбины приливной энергии @ru
label: 潮汐流发电涡轮 @zh
label: 潮汐流渦輪 @zh-hant
label: 潮流ﾀｰﾋﾞﾝ @ja
label: 조류 터빈 @ko
definition: This segment includes companies that manufacture tidal stream turbine equipment.
notation: 1311111411
valid from: 2014-08-08
valid till: 2020-10-03

Wave Convertors
type: BicsLevel5Segment
type: Classifier
type: Discontinued
type: NamedIndividual
is level5 segment of: Marine Energy Equipment
is contemporary version of: http://data.ga-group.nl/ics/bics/1311111412
is version of: http://data.ga-group.nl/ics/bics/1311111412
imported on: 2026-06-08T13:03:47.798Z
last refreshed on: 2026-06-08T13:03:47.798Z
source accessed on: 2019-12-03T20:05:01Z
source last accessed on: 2019-12-03T20:05:01Z
label: Conversores de ondas @pt
label: Convertidores de olas @es
label: Convertisseurs de vagues @fr
label: Convertitori d'onda @it
label: Wellenkonverter @de
label: Конвертеры волн @ru
label: 波変換器 @ja
label: 波浪轉能機 @zh-hant
label: 波浪转换器 @zh
label: 파력 변환장치 @ko
definition: This segment includes companies that manufacture wave convertor equipment.
notation: 1311111412
valid from: 2014-08-08
valid till: 2020-10-03

Other Marine Energy Components
type: BicsLevel5Segment
type: Classifier
type: Discontinued
type: NamedIndividual
is level5 segment of: Marine Energy Equipment
is contemporary version of: http://data.ga-group.nl/ics/bics/1311111413
is version of: http://data.ga-group.nl/ics/bics/1311111413
imported on: 2026-06-08T13:03:47.798Z
last refreshed on: 2026-06-08T13:03:47.798Z
source accessed on: 2019-12-03T20:05:01Z
source last accessed on: 2019-12-03T20:05:01Z
label: Altri componenti energia marina @it
label: Autres composants d'énergie maritime @fr
label: Otros componentes de energía marina @es
label: Outros componentes de energia marítima @pt
label: Sonstige maritime Energiekomponenten @de
label: Прочие компоненты морской энергии @ru
label: その他海洋ｴﾈﾙｷﾞｰ部品 @ja
label: 其他海洋能源組成 @zh-hant
label: 其他海洋能源装置 @zh
label: 기타 해양에너지 부품 @ko
definition: This segment includes companies that manufacture other marine energy equipment components not elsewhere classified.
notation: 1311111413
valid from: 2014-08-08
valid till: 2020-10-03

Marine Energy Equipment
type: BicsLevel4SubIndustry
type: Classifier
type: NamedIndividual
is sub industry of: Renewable Energy Equipment
is anachronous version of: http://data.ga-group.nl/ics/bics/1311101114
is contemporary version of: http://data.ga-group.nl/ics/bics/13111114
is replaced by: http://data.ga-group.nl/ics/bics/2020/1311101114
is version of: http://data.ga-group.nl/ics/bics/1311101114
is version of: http://data.ga-group.nl/ics/bics/13111114
imported on: 2026-06-08T13:03:47.798Z
last refreshed on: 2026-06-08T13:03:47.798Z
source accessed on: 2019-12-03T20:05:01Z
source last accessed on: 2019-12-03T20:05:01Z
label: Equipagg energia marina @it
label: Equipamento de energia marítima @pt
label: Equipements d'énergie maritime @fr
label: Equipo de energía marina @es
label: Maritime Energie - Equipment @de
label: Морская энергия-Оборудование @ru
label: 海洋能源設備 @zh-hant
label: 海洋能源设备 @zh
label: 海洋ｴﾈﾙｷﾞｰ設備 @ja
label: 해양 에너지 장비 @ko
definition: This industry subgroup includes companies that manufacture marine energy equipment, such as ocean thermal convertors, wave energy convertors, tidal stream turbines and other marine energy equipment components.
notation: 13111114
valid from: 2014-08-08
valid till: 2020-10-03

Lithium-based Batteries
type: BicsLevel6Segment
type: Classifier
type: Discontinued
type: NamedIndividual
is level6 segment of: Industrial Batteries
is contemporary version of: http://data.ga-group.nl/ics/bics/131111151010
is version of: http://data.ga-group.nl/ics/bics/131111151010
imported on: 2026-06-08T13:03:47.798Z
last refreshed on: 2026-06-08T13:03:47.798Z
source accessed on: 2019-12-03T20:05:01Z
source last accessed on: 2019-12-03T20:05:01Z
label: Batterie base litio @it
label: Batteries à base de lithium @fr
label: Lithium-basierte Batterien @de
label: Pilas de litio @es
label: Pilhas a base de lítio @pt
label: Батареи на основе лития @ru
label: 鋰類電池 @zh-hant
label: 锂基电池 @zh
label: 리튬-기반 배터리 @ko
label: ﾘﾁｳﾑ電池 @ja
definition: This segment includes companies that manufacture industrial-scale energy storage lithium-based batteries.
notation: 131111151010
valid from: 2014-08-08
valid till: 2020-10-03

Nickel-based Batteries
type: BicsLevel6Segment
type: Classifier
type: Discontinued
type: NamedIndividual
is level6 segment of: Industrial Batteries
is contemporary version of: http://data.ga-group.nl/ics/bics/131111151011
is version of: http://data.ga-group.nl/ics/bics/131111151011
imported on: 2026-06-08T13:03:47.798Z
last refreshed on: 2026-06-08T13:03:47.798Z
source accessed on: 2019-12-03T20:05:01Z
source last accessed on: 2019-12-03T20:05:01Z
label: Batterie base nichel @it
label: Batteries à base de nickel @fr
label: Nickel-basierte Batterien @de
label: Pilas de níquel @es
label: Pilhas a base de níquel @pt
label: Батареи на основе никеля @ru
label: 鎳系電池 @zh-hant
label: 镍基电池 @zh
label: 니켈-기반 배터리 @ko
label: ﾆｯｹﾙ電池 @ja
definition: This segment includes companies that manufacture industrial-scale energy storage nickel-based batteries.
notation: 131111151011
valid from: 2014-08-08
valid till: 2020-10-03

Sodium-based Batteries
type: BicsLevel6Segment
type: Classifier
type: Discontinued
type: NamedIndividual
is level6 segment of: Industrial Batteries
is contemporary version of: http://data.ga-group.nl/ics/bics/131111151012
is version of: http://data.ga-group.nl/ics/bics/131111151012
imported on: 2026-06-08T13:03:47.798Z
last refreshed on: 2026-06-08T13:03:47.798Z
source accessed on: 2019-12-03T20:05:01Z
source last accessed on: 2019-12-03T20:05:01Z
label: Batterie base sodio @it
label: Batteries à base de sodium @fr
label: Natrium-basierte Batterien @de
label: Pilas de sodio @es
label: Pilhas a base de sódio @pt
label: Батареи на основе натрия @ru
label: 钠基电池 @zh
label: 鹽類電池 @zh-hant
label: 나트륨-기반 배터리 @ko
label: ﾅﾄﾘｳﾑ電池 @ja
definition: This segment includes companies that manufacture industrial-scale energy storage sodium-based batteries.
notation: 131111151012
valid from: 2014-08-08
valid till: 2020-10-03

Industrial Batteries
type: BicsLevel5Segment
type: Classifier
type: NamedIndividual
is level5 segment of: Fuel Cells & Industrial Batteries
is anachronous version of: http://data.ga-group.nl/ics/bics/131110111512
is contemporary version of: http://data.ga-group.nl/ics/bics/1311111510
is replaced by: http://data.ga-group.nl/ics/bics/2020/131110111512
is version of: http://data.ga-group.nl/ics/bics/131110111512
is version of: http://data.ga-group.nl/ics/bics/1311111510
imported on: 2026-06-08T13:03:47.798Z
last refreshed on: 2026-06-08T13:03:47.798Z
source accessed on: 2019-12-03T20:05:01Z
source last accessed on: 2019-12-03T20:05:01Z
label: Batterie industriali @it
label: Batteries industrielles @fr
label: Industriebatterien @de
label: Pilas industriales @es
label: Pilhas industriais @pt
label: Индустр. батареи @ru
label: 工业电池 @zh
label: 工業用電池 @zh-hant
label: 産業用電池 @ja
label: 산업용 배터리 @ko
definition: This segment includes companies that manufacture industrial-scale energy storage batteries.
notation: 1311111510
valid from: 2014-08-08
valid till: 2020-10-03

Flow Batteries
type: BicsLevel5Segment
type: Classifier
type: Discontinued
type: NamedIndividual
is level5 segment of: Fuel Cells & Industrial Batteries
is contemporary version of: http://data.ga-group.nl/ics/bics/1311111511
is version of: http://data.ga-group.nl/ics/bics/1311111511
imported on: 2026-06-08T13:03:47.798Z
last refreshed on: 2026-06-08T13:03:47.798Z
source accessed on: 2019-12-03T20:05:01Z
source last accessed on: 2019-12-03T20:05:01Z
label: Batteries à flux @fr
label: Durchflussbatterien @de
label: Flusso batterie @it
label: Pilas de flujo @es
label: Pilhas de circulação @pt
label: Батареи с жидким электролитом @ru
label: 液流电池 @zh
label: 液流電池 @zh-hant
label: 흐름전지 @ko
label: ﾌﾛｰ電池 @ja
definition: This segment includes companies that manufacture industrial-scale energy storage flow batteries.
notation: 1311111511
valid from: 2014-08-08
valid till: 2020-10-03

Flywheels
type: BicsLevel5Segment
type: Classifier
type: Discontinued
type: NamedIndividual
is level5 segment of: Fuel Cells & Industrial Batteries
is contemporary version of: http://data.ga-group.nl/ics/bics/1311111512
is version of: http://data.ga-group.nl/ics/bics/1311111512
imported on: 2026-06-08T13:03:47.798Z
last refreshed on: 2026-06-08T13:03:47.798Z
source accessed on: 2019-12-03T20:05:01Z
source last accessed on: 2019-12-03T20:05:01Z
label: Schwungräder @de
label: Volani @it
label: Volantes @es
label: Volants @fr
label: Маховик @ru
label: 飛輪 @zh-hant
label: 飞轮 @zh
label: 플라이휠 @ko
label: ﾌﾗｲﾎｲｰﾙ @ja
definition: This segment includes companies that manufacture industrial-scale energy storage flywheels.
notation: 1311111512
valid from: 2014-08-08
valid till: 2020-10-03

Fuel Cell Alkaline
type: BicsLevel6Segment
type: Classifier
type: Discontinued
type: NamedIndividual
is level6 segment of: Fuel Cells
is contemporary version of: http://data.ga-group.nl/ics/bics/131111151310
is version of: http://data.ga-group.nl/ics/bics/131111151310
imported on: 2026-06-08T13:03:47.798Z
last refreshed on: 2026-06-08T13:03:47.798Z
source accessed on: 2019-12-03T20:05:01Z
source last accessed on: 2019-12-03T20:05:01Z
label: Brennstoffzellen, alkalisch @de
label: Célula de combustível alcalina @pt
label: Pila alcalina de carburante @es
label: Pila comb alcalina @it
label: Piles à combustible alcalines @fr
label: Топливный элемент - Щелочной @ru
label: 燃料电池-碱性 @zh
label: 燃料電池 ｱﾙｶﾘ @ja
label: 燃料電池鹼性 @zh-hant
label: 연료전지 알칼리형 @ko
definition: This segment includes companies that manufacture alkaline-based fuel cell equipment. Alkaline fuel cells use an alkaline electrolyte, such as potassium hydroxide.
notation: 131111151310
valid from: 2014-08-08
valid till: 2020-10-03

Fuel Cell Bio
type: BicsLevel6Segment
type: Classifier
type: Discontinued
type: NamedIndividual
is level6 segment of: Fuel Cells
is contemporary version of: http://data.ga-group.nl/ics/bics/131111151311
is version of: http://data.ga-group.nl/ics/bics/131111151311
imported on: 2026-06-08T13:03:47.798Z
last refreshed on: 2026-06-08T13:03:47.798Z
source accessed on: 2019-12-03T20:05:01Z
source last accessed on: 2019-12-03T20:05:01Z
label: Bio célula de combustível @pt
label: Brennstoffzellen, Bio @de
label: Pila bio de carburante @es
label: Pila comb @it
label: Piles à combustible bio @fr
label: Топливный элемент - Биологический @ru
label: 燃料电池-生物 @zh
label: 燃料電池 ﾊﾞｲｵ @ja
label: 燃料電池生物 @zh-hant
label: 연료전지 바이오 @ko
definition: This segment includes companies that manufacture biofuel cell equipment. Fuel cells can run on a variety of fuels, including ones produced directly from biofuels. Instead of catalysts, bio fuel cells use enzymes to break down the fuel into constituent parts during the electrochemical process.
notation: 131111151311
valid from: 2014-08-08
valid till: 2020-10-03

Fuel Cell Direct Methanol
type: BicsLevel6Segment
type: Classifier
type: Discontinued
type: NamedIndividual
is level6 segment of: Fuel Cells
is contemporary version of: http://data.ga-group.nl/ics/bics/131111151312
is version of: http://data.ga-group.nl/ics/bics/131111151312
imported on: 2026-06-08T13:03:47.798Z
last refreshed on: 2026-06-08T13:03:47.798Z
source accessed on: 2019-12-03T20:05:01Z
source last accessed on: 2019-12-03T20:05:01Z
label: Brennstoffzellen, Direktmethanol @de
label: Metano directo de pila de carburante @es
label: Metanol direto para célula de combustível @pt
label: Pila comb metanolo dirett @it
label: Piles à combustible au méthanol direct @fr
label: Топливный элемент - Метанол @ru
label: 燃料电池-直接甲醇 @zh
label: 燃料電池 直接ﾒﾀﾉｰﾙ @ja
label: 燃料電池直接甲醇 @zh-hant
label: 연료전지 직접 메탄올 @ko
definition: This segment includes companies that manufacture direct methanol fuel cells. These are whole fuel-cell systems that use methanol as an input in lieu of hydrogen.
notation: 131111151312
valid from: 2014-08-08
valid till: 2020-10-03

Fuel Cell Metal Air
type: BicsLevel6Segment
type: Classifier
type: Discontinued
type: NamedIndividual
is level6 segment of: Fuel Cells
is contemporary version of: http://data.ga-group.nl/ics/bics/131111151313
is version of: http://data.ga-group.nl/ics/bics/131111151313
imported on: 2026-06-08T13:03:47.798Z
last refreshed on: 2026-06-08T13:03:47.798Z
source accessed on: 2019-12-03T20:05:01Z
source last accessed on: 2019-12-03T20:05:01Z
label: Aire metálico de pila de carburante @es
label: Brennstoffzellen, Metall-Luft @de
label: Metal Air para célula de combustível @pt
label: Pila comb metallo aria @it
label: Piles à combustible métal air @fr
label: Топливный элемент - Воздушно-металлический @ru
label: 燃料电池-金属空气 @zh
label: 燃料電池 金属空気 @ja
label: 燃料電池金屬空氣 @zh-hant
label: 연료전지 금속 공기 @ko
definition: This segment includes companies that manufacture metal air fuel cells. These are fuel cells that utilize the reaction of air and metal, such as aluminum or zinc.
notation: 131111151313
valid from: 2014-08-08
valid till: 2020-10-03

Fuel Cell Molten Carbonate
type: BicsLevel6Segment
type: Classifier
type: Discontinued
type: NamedIndividual
is level6 segment of: Fuel Cells
is contemporary version of: http://data.ga-group.nl/ics/bics/131111151314
is version of: http://data.ga-group.nl/ics/bics/131111151314
imported on: 2026-06-08T13:03:47.798Z
last refreshed on: 2026-06-08T13:03:47.798Z
source accessed on: 2019-12-03T20:05:01Z
source last accessed on: 2019-12-03T20:05:01Z
label: Brennstoffzellen, geschmolzenes Karbonat @de
label: Carbonato fundido para célula de combustível @pt
label: Pila combust carbonati fusi @it
label: Pilas de combustible de carbonato líquido @es
label: Piles à combustible au carbonate fondu @fr
label: Топливный элемент - Расплавленный карбонат @ru
label: 燃料电池-熔融碳酸盐 @zh
label: 燃料電池 溶融炭酸塩 @ja
label: 燃料電池碳酸鹽 @zh-hant
label: 연료전지 용융탄산염 @ko
definition: This segment includes companies that manufacture molten carbonate fuel cells. These are high-temperature fuel cells designed for large industrial applications that are based on a molten carbonate electrolyte.
notation: 131111151314
valid from: 2014-08-08
valid till: 2020-10-03

Fuel Cell PEM
type: BicsLevel6Segment
type: Classifier
type: Discontinued
type: NamedIndividual
is level6 segment of: Fuel Cells
is contemporary version of: http://data.ga-group.nl/ics/bics/131111151315
is version of: http://data.ga-group.nl/ics/bics/131111151315
imported on: 2026-06-08T13:03:47.798Z
last refreshed on: 2026-06-08T13:03:47.798Z
source accessed on: 2019-12-03T20:05:01Z
source last accessed on: 2019-12-03T20:05:01Z
label: Brennstoffzellen, PEM @de
label: PEM de pilas de carburante @es
label: PEM para célula de combustível @pt
label: Pila combust PEM @it
label: Piles à combustible PEM @fr
label: Топливный элемент - PEM @ru
label: 燃料电池-PEM @zh
label: 燃料電池 PEM @ja
label: 燃料電池質子交換膜 @zh-hant
label: 연료전지 PEM @ko
definition: This segment includes companies that manufacture proton exchange membrane (PEM) fuel cells.
notation: 131111151315
valid from: 2014-08-08
valid till: 2020-10-03

Fuel Cell PEM - Micro
type: BicsLevel6Segment
type: Classifier
type: Discontinued
type: NamedIndividual
is level6 segment of: Fuel Cells
is contemporary version of: http://data.ga-group.nl/ics/bics/131111151316
is version of: http://data.ga-group.nl/ics/bics/131111151316
imported on: 2026-06-08T13:03:47.798Z
last refreshed on: 2026-06-08T13:03:47.798Z
source accessed on: 2019-12-03T20:05:01Z
source last accessed on: 2019-12-03T20:05:01Z
label: Brennstoffzellen, PEM - Mikro @de
label: Celle combustibile PEM - Micro @it
label: PEM célula combustível - Micro @pt
label: PEM-micro de pilas de carburante @es
label: Piles à combustible PEM - Micro @fr
label: Топливный элемент - PEM-микро @ru
label: 燃料电池PEM-微型 @zh
label: 燃料電池 PEMﾏｲｸﾛ @ja
label: 燃料電池微型質子交換膜(PEM) @zh-hant
label: 연료전지 PEM-소형 @ko
definition: This segment includes companies that manufacture small-scale proton exchange membrane (PEM) fuel cells.
notation: 131111151316
valid from: 2014-08-08
valid till: 2020-10-03

Fuel Cell Phosphoric Acid
type: BicsLevel6Segment
type: Classifier
type: Discontinued
type: NamedIndividual
is level6 segment of: Fuel Cells
is contemporary version of: http://data.ga-group.nl/ics/bics/131111151317
is version of: http://data.ga-group.nl/ics/bics/131111151317
imported on: 2026-06-08T13:03:47.798Z
last refreshed on: 2026-06-08T13:03:47.798Z
source accessed on: 2019-12-03T20:05:01Z
source last accessed on: 2019-12-03T20:05:01Z
label: Brennstoffzellen, Phosphorsäure @de
label: Pila combust acido fosforico @it
label: Piles à combustible à l'acide phosphorique @fr
label: Ácido fosfórico de pilas de carburante @es
label: Ácido fosfórico para célula de combustível @pt
label: Т��пливный элемент - Фосфорная кислота @ru
label: 燃料电池-磷酸 @zh
label: 燃料電池 ﾘﾝ酸 @ja
label: 燃料電池磷酸 @zh-hant
label: 연료전지 인산형 @ko
definition: This segment includes companies that manufacture phosphoric acid‒based fuel cells.
notation: 131111151317
valid from: 2014-08-08
valid till: 2020-10-03

Fuel Cell Regenerative
type: BicsLevel6Segment
type: Classifier
type: Discontinued
type: NamedIndividual
is level6 segment of: Fuel Cells
is contemporary version of: http://data.ga-group.nl/ics/bics/131111151318
is version of: http://data.ga-group.nl/ics/bics/131111151318
imported on: 2026-06-08T13:03:47.798Z
last refreshed on: 2026-06-08T13:03:47.798Z
source accessed on: 2019-12-03T20:05:01Z
source last accessed on: 2019-12-03T20:05:01Z
label: Brennstoffzellen, regenerativ @de
label: Célula de combustível regenerativo @pt
label: Pila combust rigenerativa @it
label: Pilas de carburante regenerativas @es
label: Piles à combustible regénératives @fr
label: Топливный элемент - Регенеративный @ru
label: 燃料电池-再生 @zh
label: 燃料電池 蓄熱 @ja
label: 燃料電池再生式 @zh-hant
label: 연료전지 재생 @ko
definition: This segment includes companies that manufacture regenerative fuel cells. These are systems that can be run to consume hydrogen and produce electricity and water, or in reverse, consuming electricity and electrolyzing water to produce hydrogen.
notation: 131111151318
valid from: 2014-08-08
valid till: 2020-10-03

Fuel Cell Sodium Borohydride
type: BicsLevel6Segment
type: Classifier
type: Discontinued
type: NamedIndividual
is level6 segment of: Fuel Cells
is contemporary version of: http://data.ga-group.nl/ics/bics/131111151319
is version of: http://data.ga-group.nl/ics/bics/131111151319
imported on: 2026-06-08T13:03:47.798Z
last refreshed on: 2026-06-08T13:03:47.798Z
source accessed on: 2019-12-03T20:05:01Z
source last accessed on: 2019-12-03T20:05:01Z
label: Boro-hidreto de sódio para célula de combustível @pt
label: Brennstoffzellen, Natriumborhydrid @de
label: Pila boroidruro di sodio @it
label: Pilas de carburante de boro hidrato de sodio @es
label: Piles à combustible au borohydrure de sodium @fr
label: Топливный элемент - Борогидрит натрия @ru
label: 燃料电池-硼氢化钠 @zh
label: 燃料電池 水酸化ﾎｳ素ﾅﾄﾘｳﾑ @ja
label: 燃料電池硼氫化鈉 @zh-hant
label: 연료전지 수소화붕소나트륨 @ko
definition: This segment includes companies that manufacture sodium borohydride fuel cells.
notation: 131111151319
valid from: 2014-08-08
valid till: 2020-10-03

Fuel Cell Solid Oxide
type: BicsLevel6Segment
type: Classifier
type: Discontinued
type: NamedIndividual
is level6 segment of: Fuel Cells
is contemporary version of: http://data.ga-group.nl/ics/bics/131111151320
is version of: http://data.ga-group.nl/ics/bics/131111151320
imported on: 2026-06-08T13:03:47.798Z
last refreshed on: 2026-06-08T13:03:47.798Z
source accessed on: 2019-12-03T20:05:01Z
source last accessed on: 2019-12-03T20:05:01Z
label: Brennstoffzellen, Festoxid @de
label: Pila ossido solid @it
label: Pilas de carburante de óxido sólido @es
label: Piles à combustible à oxyde solide @fr
label: Óxido sólido para célula de combustível @pt
label: Топливный элемент - Твердый диоксид кремния @ru
label: 燃料电池-固体氧化物 @zh
label: 燃料電池 固体酸化物 @ja
label: 燃料電池固態氧化物 @zh-hant
label: 연료전지 고체산화물 @ko
definition: This segment includes companies that manufacture solid oxide fuel cells. These use a ceramic electrolyte instead of a liquid or membrane and operate at temperatures of up to 1,000 degrees Centigrade.
notation: 131111151320
valid from: 2014-08-08
valid till: 2020-10-03

Fuel Cell Urea to Energy
type: BicsLevel6Segment
type: Classifier
type: Discontinued
type: NamedIndividual
is level6 segment of: Fuel Cells
is contemporary version of: http://data.ga-group.nl/ics/bics/131111151321
is version of: http://data.ga-group.nl/ics/bics/131111151321
imported on: 2026-06-08T13:03:47.798Z
last refreshed on: 2026-06-08T13:03:47.798Z
source accessed on: 2019-12-03T20:05:01Z
source last accessed on: 2019-12-03T20:05:01Z
label: Brennstoffzellen, Urea zu Energie @de
label: Pila urea a energia @it
label: Pilas de carburante de urea a energía @es
label: Piles à combustible à l'urée @fr
label: Ureia de célula de combustível para energia @pt
label: Топливный элемент - Мочевина в энергию @ru
label: 燃料电池-尿素转能源 @zh
label: 燃料電池 尿素ｴﾈﾙｷﾞｰ @ja
label: 燃料電池尿素至能源 @zh-hant
label: 연료전지 에너지 요소 @ko
definition: This segment includes companies that manufacture urea-based fuel cells.
notation: 131111151321
valid from: 2014-08-08
valid till: 2020-10-03

Fuel Cell Other
type: BicsLevel6Segment
type: Classifier
type: Discontinued
type: NamedIndividual
is level6 segment of: Fuel Cells
is contemporary version of: http://data.ga-group.nl/ics/bics/131111151322
is version of: http://data.ga-group.nl/ics/bics/131111151322
imported on: 2026-06-08T13:03:47.798Z
last refreshed on: 2026-06-08T13:03:47.798Z
source accessed on: 2019-12-03T20:05:01Z
source last accessed on: 2019-12-03T20:05:01Z
label: Altre Pile @it
label: Autres piles à combustible @fr
label: Brennstoffzellen, sonstige @de
label: Otras pilas de carburante @es
label: Outra célula de combustível @pt
label: Топливный элемент-Прочее @ru
label: 燃料电池-其他 @zh
label: 燃料電池 その他 @ja
label: 燃料電池其他 @zh-hant
label: 연료전지 기타 @ko
definition: This segment includes companies that manufacture other types of fuel cells that are based on less common electrolytes or principles.
notation: 131111151322
valid from: 2014-08-08
valid till: 2020-10-03

Fuel Cells
type: BicsLevel5Segment
type: Classifier
type: NamedIndividual
is level5 segment of: Fuel Cells & Industrial Batteries
is anachronous version of: http://data.ga-group.nl/ics/bics/131110111510
is contemporary version of: http://data.ga-group.nl/ics/bics/1311111513
is replaced by: http://data.ga-group.nl/ics/bics/2020/131110111510
is version of: http://data.ga-group.nl/ics/bics/131110111510
is version of: http://data.ga-group.nl/ics/bics/1311111513
imported on: 2026-06-08T13:03:47.798Z
last refreshed on: 2026-06-08T13:03:47.798Z
source accessed on: 2019-12-03T20:05:01Z
source last accessed on: 2019-12-03T20:05:01Z
label: Brennstoffzellen @de
label: Células de combustível @pt
label: Pila a combustibile @it
label: Pilas de carburante @es
label: Piles à combustible @fr
label: Топливные элементы @ru
label: 燃料電池 @ja
label: 电动汽车电池 @zh
label: 연료전지 @ko
definition: This segment includes companies that manufacture fuel cell equipment that is primarily for industrial- or utility-scale purposes.
notation: 1311111513
valid from: 2014-08-08
valid till: 2020-10-03

Fuel Cells & Industrial Batteries
type: BicsLevel4SubIndustry
type: Classifier
type: Discontinued
type: NamedIndividual
is sub industry of: Renewable Energy Equipment
is contemporary version of: http://data.ga-group.nl/ics/bics/13111115
is version of: http://data.ga-group.nl/ics/bics/13111115
imported on: 2026-06-08T13:03:47.798Z
last refreshed on: 2026-06-08T13:03:47.798Z
source accessed on: 2019-12-03T20:05:01Z
source last accessed on: 2019-12-03T20:05:01Z
label: Brennstoffzellen & Industriebatterien @de
label: Célula comb e baterias industriais @pt
label: Celdas de combustible/pilas ind @es
label: Celle combustibile e batterie indus @it
label: Piles à combustible et batteries industrielles @fr
label: Топл. элементы и промышл. аккумуляторы @ru
label: 燃料电池与工业电池 @zh
label: 燃料電池及工業電池 @zh-hant
label: 燃料電池･産業用電池 @ja
label: 연료전지 & 산업용 배터리 @ko
definition: This industry subgroup includes companies that manufacture fuel cells and energy storage equipment that is primarily for industrial or utility-scale purposes. Equipment includes batteries, flow batteries, flywheels and fuel cells.
notation: 13111115
valid from: 2014-08-08
valid till: 2020-10-03

Communication Networks
type: BicsLevel5Segment
type: Classifier
type: Discontinued
type: NamedIndividual
is level5 segment of: Smart Grid Equipment
is contemporary version of: http://data.ga-group.nl/ics/bics/1311111610
is version of: http://data.ga-group.nl/ics/bics/1311111610
imported on: 2026-06-08T13:03:47.798Z
last refreshed on: 2026-06-08T13:03:47.798Z
source accessed on: 2019-12-03T20:05:01Z
source last accessed on: 2019-12-03T20:05:01Z
label: Kommunikationsnetze @de
label: Réseaux de communication @fr
label: Redes de comunicação @pt
label: Redes de comunicación @es
label: Reti di comunicazione @it
label: Коммуникационные сети @ru
label: 通信ﾈｯﾄﾜｰｸ @ja
label: 通訊網路 @zh-hant
label: 通讯网络 @zh
label: 통신 네트워크 @ko
definition: This segment includes companies that manufacture communication network smart grid equipment.
notation: 1311111610
valid from: 2014-08-08
valid till: 2020-10-03

Demand Response Systems
type: BicsLevel5Segment
type: Classifier
type: Discontinued
type: NamedIndividual
is level5 segment of: Smart Grid Equipment
is contemporary version of: http://data.ga-group.nl/ics/bics/1311111611
is version of: http://data.ga-group.nl/ics/bics/1311111611
imported on: 2026-06-08T13:03:47.798Z
last refreshed on: 2026-06-08T13:03:47.798Z
source accessed on: 2019-12-03T20:05:01Z
source last accessed on: 2019-12-03T20:05:01Z
label: Demand-Response-Systeme @de
label: Sistemas de resposta à demanda @pt
label: Sistemas de respuesta a demanda @es
label: Sistemi risposta domanda @it
label: Systèmes de réponse à la demande @fr
label: Системы управления спросом @ru
label: 需求响应系统 @zh
label: 需要対応ｼｽﾃﾑ @ja
label: 需量反應系統 @zh-hant
label: 수요반응 시스템 @ko
definition: This segment includes companies that manufacture demand response smart grid equipment.
notation: 1311111611
valid from: 2014-08-08
valid till: 2020-10-03

Energy Management Systems
type: BicsLevel5Segment
type: Classifier
type: Discontinued
type: NamedIndividual
is level5 segment of: Smart Grid Equipment
is contemporary version of: http://data.ga-group.nl/ics/bics/1311111612
is version of: http://data.ga-group.nl/ics/bics/1311111612
imported on: 2026-06-08T13:03:47.798Z
last refreshed on: 2026-06-08T13:03:47.798Z
source accessed on: 2019-12-03T20:05:01Z
source last accessed on: 2019-12-03T20:05:01Z
label: Energie-Managementsysteme @de
label: Sistemas de gerenciamento de energia @pt
label: Sistemas de gestión de energía @es
label: Sistemi gestione energia @it
label: Systèmes de gestion d'énergie @fr
label: Системы управления энергией @ru
label: 能源管理系統 @zh-hant
label: 能源管理系统 @zh
label: 에너지 관리 시스템 @ko
label: ｴﾈﾙｷﾞｰ管理ｼｽﾃﾑ @ja
definition: This segment includes companies that manufacture energy management smart grid equipment.
notation: 1311111612
valid from: 2014-08-08
valid till: 2020-10-03

Grid Sensors & Controllers
type: BicsLevel5Segment
type: Classifier
type: Discontinued
type: NamedIndividual
is level5 segment of: Smart Grid Equipment
is contemporary version of: http://data.ga-group.nl/ics/bics/1311111613
is version of: http://data.ga-group.nl/ics/bics/1311111613
imported on: 2026-06-08T13:03:47.798Z
last refreshed on: 2026-06-08T13:03:47.798Z
source accessed on: 2019-12-03T20:05:01Z
source last accessed on: 2019-12-03T20:05:01Z
label: Netzsensoren & Steuerungen @de
label: Senseurs et contrôleurs de réseaux @fr
label: Sensores de rede e controladores @pt
label: Sensores y controladores de rejilla @es
label: Sensori rete e controller @it
label: Сенсоры и контрольные датчики сети @ru
label: 栅极传感器与控制器 @zh
label: 電網感應器及控制器 @zh-hant
label: 그리드 센서 및 제어장치 @ko
label: ｸﾞﾘｯﾄﾞ用ｾﾝｻｰ&ｺﾝﾄﾛｰﾗｰ @ja
definition: This segment includes companies that manufacture grid sensors and controller smart grid equipment.
notation: 1311111613
valid from: 2014-08-08
valid till: 2020-10-03

Smart Grid Meter Software
type: BicsLevel5Segment
type: Classifier
type: Discontinued
type: NamedIndividual
is level5 segment of: Smart Grid Equipment
is contemporary version of: http://data.ga-group.nl/ics/bics/1311111614
is version of: http://data.ga-group.nl/ics/bics/1311111614
imported on: 2026-06-08T13:03:47.798Z
last refreshed on: 2026-06-08T13:03:47.798Z
source accessed on: 2019-12-03T20:05:01Z
source last accessed on: 2019-12-03T20:05:01Z
label: Intelligenter Stromnetzzähler - Software @de
label: Logiciel de métrique de réseau intelligent @fr
label: Software de medidor de la red inteligente @es
label: Software do medidor de rede inteligente @pt
label: Прогр. обеспечение для 'умной сети' счетчиков @ru
label: 智慧電表軟體 @zh-hant
label: 智能电网电表软件 @zh
label: 스마트그리드 미터 소프트웨어 @ko
label: ｽﾏｰﾄｸﾞﾘｯﾄﾞ･ﾒｰﾀｰ装置 @ja
definition: This segment includes companies that manufacture meter software for smart grid equipment.
notation: 1311111614
valid from: 2014-08-08
valid till: 2020-10-03

Smart Meters
type: BicsLevel5Segment
type: Classifier
type: Discontinued
type: NamedIndividual
is level5 segment of: Smart Grid Equipment
is contemporary version of: http://data.ga-group.nl/ics/bics/1311111615
is version of: http://data.ga-group.nl/ics/bics/1311111615
imported on: 2026-06-08T13:03:47.798Z
last refreshed on: 2026-06-08T13:03:47.798Z
source accessed on: 2019-12-03T20:05:01Z
source last accessed on: 2019-12-03T20:05:01Z
label: 'Умные' счетчики @ru
label: Compteurs intelligents @fr
label: Intelligente Zähler @de
label: Medidores inteligentes @es
label: 智慧電表 @zh-hant
label: 智能电表 @zh
label: 스마트 미터 @ko
label: ｽﾏｰﾄﾒｰﾀｰ @ja
definition: This segment includes companies that manufacture smart meters for smart grid equipment.
notation: 1311111615
valid from: 2014-08-08
valid till: 2020-10-03

Smart Grid Equipment
type: BicsLevel4SubIndustry
type: Classifier
type: NamedIndividual
is sub industry of: Renewable Energy Equipment
is anachronous version of: http://data.ga-group.nl/ics/bics/131110111511
is contemporary version of: http://data.ga-group.nl/ics/bics/13111116
is replaced by: http://data.ga-group.nl/ics/bics/2020/131110111511
is version of: http://data.ga-group.nl/ics/bics/131110111511
is version of: http://data.ga-group.nl/ics/bics/13111116
imported on: 2026-06-08T13:03:47.798Z
last refreshed on: 2026-06-08T13:03:47.798Z
source accessed on: 2019-12-03T20:05:01Z
source last accessed on: 2019-12-03T20:05:01Z
label: Equipagg smart grid @it
label: Equipamento de rede inteligente @pt
label: Equipements de réseaux intelligents @fr
label: Equipo de la red inteligente @es
label: Intelligente Stromnetzgeräte @de
label: Оборудование 'умной сети' @ru
label: 智慧電網設備 @zh-hant
label: 智能电网设备 @zh
label: 스마트그리드 장비 @ko
label: ｽﾏｰﾄｸﾞﾘｯﾄﾞ設備 @ja
definition: This industry subgroup includes companies that manufacture smart grid equipment.
notation: 13111116
valid from: 2014-08-08
valid till: 2020-10-03

CCS Equipment
type: BicsLevel4SubIndustry
type: Classifier
type: Discontinued
type: NamedIndividual
is sub industry of: Renewable Energy Equipment
is contemporary version of: http://data.ga-group.nl/ics/bics/13111117
is version of: http://data.ga-group.nl/ics/bics/13111117
imported on: 2026-06-08T13:03:47.798Z
last refreshed on: 2026-06-08T13:03:47.798Z
source accessed on: 2019-12-03T20:05:01Z
source last accessed on: 2019-12-03T20:05:01Z
label: CCS Equipo @es
label: CCS 设备 @zh
label: CCS 장비 @ko
label: CCS-Equipment @de
label: CCS装置 @ja
label: CCS設備 @zh-hant
label: Equipagg CCS @it
label: Equipamento CCS @pt
label: Equipements CSC @fr
label: Оборудование УХУ @ru
definition: This industry subgroup includes companies that manufacture carbon capture and storage equipment.
notation: 13111117
valid from: 2014-08-08
valid till: 2020-10-03

Other Renewable Energy Equip
type: BicsLevel4SubIndustry
type: Classifier
type: NamedIndividual
is sub industry of: Renewable Energy Equipment
is anachronous version of: http://data.ga-group.nl/ics/bics/1311101115
is contemporary version of: http://data.ga-group.nl/ics/bics/13111118
is replaced by: http://data.ga-group.nl/ics/bics/2020/1311101115
is version of: http://data.ga-group.nl/ics/bics/1311101115
is version of: http://data.ga-group.nl/ics/bics/13111118
imported on: 2026-06-08T13:03:47.798Z
last refreshed on: 2026-06-08T13:03:47.798Z
source accessed on: 2019-12-03T20:05:01Z
source last accessed on: 2019-12-03T20:05:01Z
label: Altre app energia rinnovabile @it
label: Equip autres énergies renouvelables @fr
label: Otro equipo de energía renovable @es
label: Outros equip de energia renovável @pt
label: Sonstige Erneuerbare Energie Equip. @de
label: Оборуд. для других возобновл. источников энергии @ru
label: その他再生可能ｴﾈﾙｷﾞｰ装置製造 @ja
label: 其他再生能源設��� @zh-hant
label: 其他可再生能源设备 @zh
label: 기타 신재생에너지 장비 @ko
definition: This industry subgroup includes companies that manufacture alternative energy generation machinery, excluding wind-power machinery, solar cells and fuel cells. It also includes equipment used for geothermal and wave power.
notation: 13111118
valid from: 2014-08-08
valid till: 2020-10-03

Renewable Energy Equipment
type: BicsLevel3Industry
type: Classifier
type: NamedIndividual
is industry of: Renewable Energy
is anachronous version of: http://data.ga-group.nl/ics/bics/13111011
is contemporary version of: http://data.ga-group.nl/ics/bics/131111
is replaced by: http://data.ga-group.nl/ics/bics/2020/13111011
is version of: http://data.ga-group.nl/ics/bics/13111011
is version of: http://data.ga-group.nl/ics/bics/131111
imported on: 2026-06-08T13:03:47.798Z
last refreshed on: 2026-06-08T13:03:47.798Z
source accessed on: 2019-12-03T20:05:01Z
source last accessed on: 2019-12-03T20:05:01Z
label: App energia rinnovabile @it
label: Eq energía renov @es
label: Equip energ renov @pt
label: Equipements énergie renouvelable @fr
label: Erneuerbare Energiegeräte @de
label: Оборуд. возобновл. энергии @ru
label: 再生可能ｴﾈﾙｷﾞｰ機器 @ja
label: 可再生能源設備 @zh-hant
label: 可再生能源设备 @zh
label: 재생에너지 장비 @ko
definition: This industry includes companies that manufacture alternative energy generation machinery, such as wind-power machinery, solar cells, fuel cells and other alternative energy machinery. This segment can include research and development revenue.
notation: 131111
valid from: 2014-08-08
valid till: 2020-10-03

Biomass Plant Construction
type: BicsLevel5Segment
type: Classifier
type: NamedIndividual
is level5 segment of: Development & Construction
is anachronous version of: http://data.ga-group.nl/ics/bics/131110121010
is contemporary version of: http://data.ga-group.nl/ics/bics/1311121010
is replaced by: http://data.ga-group.nl/ics/bics/2020/131110121010
is version of: http://data.ga-group.nl/ics/bics/131110121010
is version of: http://data.ga-group.nl/ics/bics/1311121010
imported on: 2026-06-08T13:03:47.798Z
last refreshed on: 2026-06-08T13:03:47.798Z
source accessed on: 2019-12-03T20:05:01Z
source last accessed on: 2019-12-03T20:05:01Z
label: Biomasse, Anlagenbau @de
label: Construção de planta biomassa @pt
label: Construcción de plantas de biomasa @es
label: Construction d'usine biomasse @fr
label: Costruz impianti biomassa @it
label: Строительство электростанции, работающ. на биомассе @ru
label: 生物质能发电厂建设 @zh
label: 生質能廠建造 @zh-hant
label: 바이오매스 발전소 건설 @ko
label: ﾊﾞｲｵﾏｽﾌﾟﾗﾝﾄ建設 @ja
definition: This segment includes companies that develop, build and manage biomass energy projects.
notation: 1311121010
valid from: 2014-08-08
valid till: 2020-10-03

Solar Plant Construction
type: BicsLevel5Segment
type: Classifier
type: NamedIndividual
is level5 segment of: Development & Construction
is anachronous version of: http://data.ga-group.nl/ics/bics/131110121011
is contemporary version of: http://data.ga-group.nl/ics/bics/1311121011
is replaced by: http://data.ga-group.nl/ics/bics/2020/131110121011
is version of: http://data.ga-group.nl/ics/bics/131110121011
is version of: http://data.ga-group.nl/ics/bics/1311121011
imported on: 2026-06-08T13:03:47.798Z
last refreshed on: 2026-06-08T13:03:47.798Z
source accessed on: 2019-12-03T20:05:01Z
source last accessed on: 2019-12-03T20:05:01Z
label: Construção de planta solar @pt
label: Construcción de plantas solares @es
label: Construction d'usine solaire @fr
label: Costruz impianti solari @it
label: Solaranlage, Bau @de
label: Строительство солнечной электростанции @ru
label: 太阳能发电厂建设 @zh
label: 太陽光ﾌﾟﾗﾝﾄ建設 @ja
label: 太陽能廠建造 @zh-hant
label: 태양열 발전소 건설 @ko
definition: This segment includes companies that develop, build and manage solar energy projects.
notation: 1311121011
valid from: 2014-08-08
valid till: 2020-10-03

Wind Farm Construction
type: BicsLevel5Segment
type: Classifier
type: NamedIndividual
is level5 segment of: Development & Construction
is anachronous version of: http://data.ga-group.nl/ics/bics/131110121012
is contemporary version of: http://data.ga-group.nl/ics/bics/1311121012
is replaced by: http://data.ga-group.nl/ics/bics/2020/131110121012
is version of: http://data.ga-group.nl/ics/bics/131110121012
is version of: http://data.ga-group.nl/ics/bics/1311121012
imported on: 2026-06-08T13:03:47.798Z
last refreshed on: 2026-06-08T13:03:47.798Z
source accessed on: 2019-12-03T20:05:01Z
source last accessed on: 2019-12-03T20:05:01Z
label: Construção de fazenda eólica @pt
label: Construcción de plantas de viento @es
label: Construction de parc éolien @fr
label: Costruz impianti eolici @it
label: Windpark, Bau @de
label: Строительство ветроэлектростанции @ru
label: 風力発電所建設 @ja
label: 風力電廠建造 @zh-hant
label: 风力发电厂建设 @zh
label: 풍력단지 건설 @ko
definition: This segment includes companies that develop, build and manage wind energy projects.
notation: 1311121012
valid from: 2014-08-08
valid till: 2020-10-03

Other Renew Energy Plant Const
type: BicsLevel5Segment
type: Classifier
type: Discontinued
type: NamedIndividual
is level5 segment of: Development & Construction
is contemporary version of: http://data.ga-group.nl/ics/bics/1311121013
is version of: http://data.ga-group.nl/ics/bics/1311121013
imported on: 2026-06-08T13:03:47.798Z
last refreshed on: 2026-06-08T13:03:47.798Z
source accessed on: 2019-12-03T20:05:01Z
source last accessed on: 2019-12-03T20:05:01Z
label: Construct autres usines énergie renouv @fr
label: Costruz altri impianti energia rinnovabile @it
label: Otra construcción de planta de energía renovable @es
label: Outras conste usina de energia renovável @pt
label: Sonstige Erneuerbare Energie Anlagenbau @de
label: Строит. электростанц с пр. возобновл. источниками @ru
label: その他再生可能ｴﾈﾙｷﾞｰ工場建設 @ja
label: 其他再生能源廠建造 @zh-hant
label: 其他可再生能源厂建设 @zh
label: 기타 신재생에너지 플랜트 건설 @ko
definition: This segment includes companies that develop, build and manage renewable energy projects not elsewhere classified.
notation: 1311121013
valid from: 2014-08-08
valid till: 2020-10-03

Development & Construction
type: BicsLevel4SubIndustry
type: Classifier
type: NamedIndividual
is sub industry of: Renewable Energy Project Dev
is anachronous version of: http://data.ga-group.nl/ics/bics/1311101210
is contemporary version of: http://data.ga-group.nl/ics/bics/13111210
is replaced by: http://data.ga-group.nl/ics/bics/2020/1311101210
is version of: http://data.ga-group.nl/ics/bics/1311101210
is version of: http://data.ga-group.nl/ics/bics/13111210
imported on: 2026-06-08T13:03:47.798Z
last refreshed on: 2026-06-08T13:03:47.798Z
source accessed on: 2019-12-03T20:05:01Z
source last accessed on: 2019-12-03T20:05:01Z
label: Développement et construction @fr
label: Desarrollo y producción @es
label: Desenvolvimento e construção @pt
label: Erschließung & Bau @de
label: Sviluppo e costruzioni @it
label: Разработка и строительство @ru
label: 开发与建设 @zh
label: 開発･建設 @ja
label: 開發及建造 @zh-hant
label: 개발 & 건설 @ko
definition: This industry subgroup includes companies that develop, build and manage renewable energy projects.
notation: 13111210
valid from: 2014-08-08
valid till: 2020-10-03

Operations & Maintenance
type: BicsLevel4SubIndustry
type: Classifier
type: NamedIndividual
is sub industry of: Renewable Energy Project Dev
is anachronous version of: http://data.ga-group.nl/ics/bics/1311101211
is contemporary version of: http://data.ga-group.nl/ics/bics/13111211
is replaced by: http://data.ga-group.nl/ics/bics/2020/1311101211
is version of: http://data.ga-group.nl/ics/bics/1311101211
is version of: http://data.ga-group.nl/ics/bics/13111211
imported on: 2026-06-08T13:03:47.798Z
last refreshed on: 2026-06-08T13:03:47.798Z
source accessed on: 2019-12-03T20:05:01Z
source last accessed on: 2019-12-03T20:05:01Z
label: Betrieb & Wartung @de
label: Opérations et maintenance @fr
label: Operações e manutenção @pt
label: Operaciones y mantenimiento @es
label: Operazioni e manutenzione @it
label: Эксплуатация и обслуживание @ru
label: 營運及維護 @zh-hant
label: 经营与维修 @zh
label: 運用･保守 @ja
label: 운영 & 관리 @ko
definition: This industry subgroup includes companies that provide operations and maintenance services for renewable energy projects.
notation: 13111211
valid from: 2014-08-08
valid till: 2020-10-03

Special Maint & Construction
type: BicsLevel4SubIndustry
type: Classifier
type: Discontinued
type: NamedIndividual
is sub industry of: Renewable Energy Project Dev
is contemporary version of: http://data.ga-group.nl/ics/bics/13111212
is version of: http://data.ga-group.nl/ics/bics/13111212
imported on: 2026-06-08T13:03:47.798Z
last refreshed on: 2026-06-08T13:03:47.798Z
source accessed on: 2019-12-03T20:05:01Z
source last accessed on: 2019-12-03T20:05:01Z
label: Construção e manutenção especializada @pt
label: Maintenance spécialisée et construction @fr
label: Mantenimiento y construcción especializados @es
label: Manutenzione speciale e costruzione @it
label: Spezialisierte Wartung & Bau @de
label: Специализированное обслуживание и строительство @ru
label: 专业维护与建设 @zh
label: 特殊保��･建設 @ja
label: 特殊維護及建造 @zh-hant
label: 전문 관리 & 건설 @ko
definition: This industry subgroup includes companies that provide specialist operations, maintenance and construction services for renewable energy projects.
notation: 13111212
valid from: 2014-08-08
valid till: 2020-10-03

Renewable Energy Project Dev
type: BicsLevel3Industry
type: Classifier
type: NamedIndividual
is industry of: Renewable Energy
is anachronous version of: http://data.ga-group.nl/ics/bics/13111012
is contemporary version of: http://data.ga-group.nl/ics/bics/131112
is replaced by: http://data.ga-group.nl/ics/bics/2020/13111012
is version of: http://data.ga-group.nl/ics/bics/13111012
is version of: http://data.ga-group.nl/ics/bics/131112
imported on: 2026-06-08T13:03:47.798Z
last refreshed on: 2026-06-08T13:03:47.798Z
source accessed on: 2019-12-03T20:05:01Z
source last accessed on: 2019-12-03T20:05:01Z
label: Const proj energ renov @pt
label: Constr proy energía renov @es
label: Erneuerb. Energie-Projektentwickler @de
label: Imprendit progetti energie rinnovabili @it
label: Promoteurs projets d'énergie renouv @fr
label: Девелоперы проектов возобн. энергии @ru
label: 再生可能ｴﾈﾙｷﾞｰ･ﾌﾟﾛｼﾞｪｸﾄ開発 @ja
label: 再生能源專案開發商 @zh-hant
label: 可再生能源项目开发商 @zh
label: 재생에너지 프로젝트 개발자 @ko
definition: This industry includes companies that develop, build and manage renewable energy projects. It also includes companies that provide operations and maintenance services.
notation: 131112
valid from: 2014-08-08
valid till: 2020-10-03

Renewable Energy
type: BicsLevel2IndustryGroup
type: Classifier
type: NamedIndividual
is industry group of: Energy
is anachronous version of: http://data.ga-group.nl/ics/bics/131110
is contemporary version of: http://data.ga-group.nl/ics/bics/1311
is replaced by: http://data.ga-group.nl/ics/bics/2020/131110
is version of: http://data.ga-group.nl/ics/bics/131110
is version of: http://data.ga-group.nl/ics/bics/1311
imported on: 2026-06-08T13:03:47.798Z
last refreshed on: 2026-06-08T13:03:47.798Z
source accessed on: 2019-12-03T20:05:01Z
source last accessed on: 2019-12-03T20:05:01Z
label: Energía renovable @es
label: Energia renovável @pt
label: Energie renouvelable @fr
label: Energie rinnovabili @it
label: Erneuerbare Energie @de
label: Возобновляемая энергия @ru
label: 再生可能ｴﾈﾙｷﾞｰ @ja
label: 再生能源 @zh-hant
label: 可再生能源 @zh
label: 재생에너지 @ko
definition: This industry group includes companies involved in the production of energy from renewable sources, such as wind, solar, biomass, geothermal, hydroelectric, wave, tidal and fuel cells. Industries include alternative energy equipment manufacturers, alternative energy power plant developers and alternative energy utilities.
notation: 1311
valid from: 2014-08-08
valid till: 2020-10-03

Energy
type: BicsLevel1Sector
type: Classifier
type: NamedIndividual
is contemporary version of: http://data.ga-group.nl/ics/bics/13
is replaced by: http://data.ga-group.nl/ics/bics/2020/13
is version of: http://data.ga-group.nl/ics/bics/13
imported on: 2026-06-08T13:03:47.798Z
last refreshed on: 2026-06-08T13:03:47.798Z
source accessed on: 2019-12-03T20:05:01Z
source last accessed on: 2019-12-03T20:05:01Z
label: Energía @es
label: Energia @it
label: Energie @de
label: Энергия @ru
label: 能源 @zh
label: 에너지 @ko
label: ｴﾈﾙｷﾞｰ @ja
definition: This sector includes companies that are involved in energy and renewable energy.
notation: 13
valid from: 2014-08-08
valid till: 2020-10-03

BDC
type: BicsLevel4SubIndustry
type: Classifier
type: NamedIndividual
is sub industry of: Investment Companies
is anachronous version of: http://data.ga-group.nl/ics/bics/1411101011
is contemporary version of: http://data.ga-group.nl/ics/bics/14101010
is replaced by: http://data.ga-group.nl/ics/bics/2020/1411101011
is version of: http://data.ga-group.nl/ics/bics/14101010
is version of: http://data.ga-group.nl/ics/bics/1411101011
imported on: 2026-06-08T13:03:47.798Z
last refreshed on: 2026-06-08T13:03:47.798Z
source accessed on: 2019-12-03T20:05:01Z
source last accessed on: 2019-12-03T20:05:01Z
label: BDC及び投資会社 @ja
label: BDCs
label: Sté développ commercial @fr
definition: This industry subgroup includes business development companies (BDCs). A BDC operates in the private equity business and helps provide capital and management to early-stage and mature private and small public companies in the initial stage of their development.
notation: 14101010
valid from: 2014-08-08
valid till: 2020-10-03

Capital Pools
type: BicsLevel4SubIndustry
type: Classifier
type: Discontinued
type: NamedIndividual
is sub industry of: Investment Companies
is contemporary version of: http://data.ga-group.nl/ics/bics/14101011
is version of: http://data.ga-group.nl/ics/bics/14101011
imported on: 2026-06-08T13:03:47.798Z
last refreshed on: 2026-06-08T13:03:47.798Z
source accessed on: 2019-12-03T20:05:01Z
source last accessed on: 2019-12-03T20:05:01Z
label: Consorziamento capitali @it
label: Grupos de capital @pt
label: Kapital-Pools @de
label: Pools de capital @es
label: Pools de capitaux @fr
label: Пулы капитала @ru
label: 資本集合 @zh-hant
label: 资本联营 @zh
label: 캐피털 풀 @ko
label: ｷｬﾋﾟﾀﾙ･ﾌﾟｰﾙ @ja
definition: This industry subgroup includes companies that operate as a capital pool. A capital pool is a financing tool for emerging companies that pairs an eligible private company with a public capital pool company to take the private company public.
notation: 14101011
valid from: 2014-08-08
valid till: 2020-10-03

Investment Comps - Resources
type: BicsLevel4SubIndustry
type: Classifier
type: Discontinued
type: NamedIndividual
is sub industry of: Investment Companies
is contemporary version of: http://data.ga-group.nl/ics/bics/14101012
is version of: http://data.ga-group.nl/ics/bics/14101012
imported on: 2026-06-08T13:03:47.798Z
last refreshed on: 2026-06-08T13:03:47.798Z
source accessed on: 2019-12-03T20:05:01Z
source last accessed on: 2019-12-03T20:05:01Z
label: Empresas de inversión-Recursos @es
label: Empresas de investimentos - recursos @pt
label: Investmentfirmen - Ressourcen @de
label: Sociétés d'investissement-Ressources @fr
label: Società d'investimento-risorse @it
label: Инвестиционные компании - Ресурсы @ru
label: 投資会社-資源 @ja
label: 投资公司-资源 @zh
label: 投��公司-資源 @zh-hant
label: 투자기업-재원 @ko
definition: This industry subgroup includes companies that invest in natural resources for investment purposes.
notation: 14101012
valid from: 2014-08-08
valid till: 2020-10-03

Investment Holding Companies
type: BicsLevel4SubIndustry
type: Classifier
type: NamedIndividual
is sub industry of: Investment Companies
is anachronous version of: http://data.ga-group.nl/ics/bics/1411101010
is contemporary version of: http://data.ga-group.nl/ics/bics/14101013
is replaced by: http://data.ga-group.nl/ics/bics/2020/1411101010
is version of: http://data.ga-group.nl/ics/bics/14101013
is version of: http://data.ga-group.nl/ics/bics/1411101010
imported on: 2026-06-08T13:03:47.798Z
last refreshed on: 2026-06-08T13:03:47.798Z
source accessed on: 2019-12-03T20:05:01Z
source last accessed on: 2019-12-03T20:05:01Z
label: Compañías de inversión de tenencias @es
label: Empresas holding de investimento @pt
label: Holding d'investimento @it
label: Investmentholdinggesellschaften @de
label: Sociétés de portefeuille @fr
label: Инвестиц. холдинговые компании @ru
label: 投資会社 @ja
label: 投資控股公司 @zh-hant
label: 投资控股公司 @zh
label: 투자지주회사 @ko
definition: This industry subgroup includes companies that hold securities of other companies for investment purposes.
notation: 14101013
valid from: 2014-08-08
valid till: 2020-10-03

SPAC
type: BicsLevel4SubIndustry
type: Classifier
type: NamedIndividual
is sub industry of: Investment Companies
is anachronous version of: http://data.ga-group.nl/ics/bics/1411101012
is contemporary version of: http://data.ga-group.nl/ics/bics/14101014
is replaced by: http://data.ga-group.nl/ics/bics/2020/1411101012
is version of: http://data.ga-group.nl/ics/bics/14101014
is version of: http://data.ga-group.nl/ics/bics/1411101012
imported on: 2026-06-08T13:03:47.798Z
last refreshed on: 2026-06-08T13:03:47.798Z
source accessed on: 2019-12-03T20:05:01Z
source last accessed on: 2019-12-03T20:05:01Z
label: Спец. ��омпании по целевым слияниям и поглощениям @ru
label: 特殊目的收购公司 @zh
definition: This industry subgroup includes companies that operate as a Special Purpose Acquisition Company (SPAC). SPACs are blank shell or blank-check companies that have no business operations but go public with the intention of merging or acquiring a company with the proceeds of the IPO.
notation: 14101014
valid from: 2014-08-08
valid till: 2020-10-03

Investment Companies
type: BicsLevel3Industry
type: Classifier
type: NamedIndividual
is industry of: Asset Management
is anachronous version of: http://data.ga-group.nl/ics/bics/14111010
is contemporary version of: http://data.ga-group.nl/ics/bics/141010
is replaced by: http://data.ga-group.nl/ics/bics/2020/14111010
is version of: http://data.ga-group.nl/ics/bics/141010
is version of: http://data.ga-group.nl/ics/bics/14111010
imported on: 2026-06-08T13:03:47.798Z
last refreshed on: 2026-06-08T13:03:47.798Z
source accessed on: 2019-12-03T20:05:01Z
source last accessed on: 2019-12-03T20:05:01Z
label: Compañías de inversión @es
label: Empresas de investimento @pt
label: Investmentfirmen @de
label: SPAC･その他金融手段 @ja
label: Sociétés d'investissement @fr
label: Società d'investimento @it
label: Инвестиционные компании @ru
label: 投資公司 @zh-hant
label: 投资公司 @zh
label: 투자기업 @ko
definition: This industry includes companies that have elected to be treated as a regulated investment company and provide debt and equity financing to firms in its portfolio. This segment also includes special purpose acquisition (SPAC) or blank-check companies set up in order to serve as a vehicle for the acquisition of an operating business.
notation: 141010
valid from: 2014-08-08
valid till: 2020-10-03

Equities
type: BicsLevel4SubIndustry
type: Classifier
type: NamedIndividual
is sub industry of: Investment Management
is anachronous version of: http://data.ga-group.nl/ics/bics/1411101110
is contemporary version of: http://data.ga-group.nl/ics/bics/14101110
is replaced by: http://data.ga-group.nl/ics/bics/2020/1411101110
is version of: http://data.ga-group.nl/ics/bics/14101110
is version of: http://data.ga-group.nl/ics/bics/1411101110
imported on: 2026-06-08T13:03:47.798Z
last refreshed on: 2026-06-08T13:03:47.798Z
source accessed on: 2019-12-03T20:05:01Z
source last accessed on: 2019-12-03T20:05:01Z
label: Ações @pt
label: Acciones @es
label: Actions @fr
label: Aktien @de
label: Azioni @it
label: Акции @ru
label: 株式 @ja
label: 股票 @zh
label: 주식 @ko
definition: This industry subgroup includes companies that provide traditional investment management services for individual and institutional investors by investing in equities.
notation: 14101110
valid from: 2014-08-08
valid till: 2020-10-03

Fixed Income
type: BicsLevel4SubIndustry
type: Classifier
type: NamedIndividual
is sub industry of: Investment Management
is anachronous version of: http://data.ga-group.nl/ics/bics/1411101111
is contemporary version of: http://data.ga-group.nl/ics/bics/14101111
is replaced by: http://data.ga-group.nl/ics/bics/2020/1411101111
is version of: http://data.ga-group.nl/ics/bics/14101111
is version of: http://data.ga-group.nl/ics/bics/1411101111
imported on: 2026-06-08T13:03:47.798Z
last refreshed on: 2026-06-08T13:03:47.798Z
source accessed on: 2019-12-03T20:05:01Z
source last accessed on: 2019-12-03T20:05:01Z
label: Festverzinsliche @de
label: Obligataire @fr
label: Reddito Fisso @it
label: Renda fixa @pt
label: Renta Fija @es
label: Фиксированный доход @ru
label: 债券 @zh
label: 債券 @ja
label: 固定收益 @zh-hant
label: 채권 @ko
definition: This industry subgroup includes companies that provide traditional investment management services for individual and institutional investors by investing in fixed income investments. Types of fixed income investments are corporate bonds, government bonds, municipal bonds, asset-backed securities and agency bonds.
notation: 14101111
valid from: 2014-08-08
valid till: 2020-10-03

Directional Investments
type: BicsLevel5Segment
type: Classifier
type: Discontinued
type: NamedIndividual
is level5 segment of: Hedge Fund Investments
is contemporary version of: http://data.ga-group.nl/ics/bics/1410111210
is version of: http://data.ga-group.nl/ics/bics/1410111210
imported on: 2026-06-08T13:03:47.798Z
last refreshed on: 2026-06-08T13:03:47.798Z
source accessed on: 2019-12-03T20:05:01Z
source last accessed on: 2019-12-03T20:05:01Z
label: Direktionale Investitionen @de
label: Inversiones direccionales @es
label: Investimenti direzionali @it
label: Investimentos direcionais @pt
label: Investissements directionnels @fr
label: Направленные инвестиции @ru
label: 导向型投资 @zh
label: 方向性投資 @ja
label: 趨向投資 @zh-hant
label: 방향성 투자 @ko
definition: This segment includes companies that provide hedge fund investments that employ a directional investment strategy. Such a strategy is any trading or investment strategy that makes a net long or short position in a market. Types of directional hedge funds are long/short equity, emerging markets, sector funds and quantitative.
notation: 1410111210
valid from: 2014-08-08
valid till: 2020-10-03

Event-driven Investments
type: BicsLevel5Segment
type: Classifier
type: Discontinued
type: NamedIndividual
is level5 segment of: Hedge Fund Investments
is contemporary version of: http://data.ga-group.nl/ics/bics/1410111211
is version of: http://data.ga-group.nl/ics/bics/1410111211
imported on: 2026-06-08T13:03:47.798Z
last refreshed on: 2026-06-08T13:03:47.798Z
source accessed on: 2019-12-03T20:05:01Z
source last accessed on: 2019-12-03T20:05:01Z
label: Ereignisgesteuerte Investitionen @de
label: Inversiones por evento @es
label: Investim orientati agli eventi @it
label: Investimentos acionados por eventos @pt
label: Investissements menés par évènements @fr
label: Инвестиции на основе событий @ru
label: 事件導向投資 @zh-hant
label: 事件驱动型投资 @zh
label: 이벤트 추구형 투자 @ko
label: ｲﾍﾞﾝﾄ駆動投資 @ja
definition: This segment includes companies that provide hedge fund investments that employ an event-driven investment strategy. Such a strategy is any trading or investment strategy that exploits pricing inefficiencies caused by anticipated specific corporate events. Types of event-driven hedge funds are distressed debt, merger arbitrage, credit arbitrage and activist funds that take large positions in companies to be active in management.
notation: 1410111211
valid from: 2014-08-08
valid till: 2020-10-03

Global Macro Investments
type: BicsLevel5Segment
type: Classifier
type: Discontinued
type: NamedIndividual
is level5 segment of: Hedge Fund Investments
is contemporary version of: http://data.ga-group.nl/ics/bics/1410111212
is version of: http://data.ga-group.nl/ics/bics/1410111212
imported on: 2026-06-08T13:03:47.798Z
last refreshed on: 2026-06-08T13:03:47.798Z
source accessed on: 2019-12-03T20:05:01Z
source last accessed on: 2019-12-03T20:05:01Z
label: Globale Makroinvestitionen @de
label: Inversiones macro globales @es
label: Investimenti macro globali @it
label: Investimentos macro globais @pt
label: Macro investissements mondiaux @fr
label: Инвестиции по глобальным макроэконом. факторам @ru
label: 全球宏观投资 @zh
label: 全球總體投資 @zh-hant
label: 글로벌 매크로 투자 @ko
label: ｸﾞﾛｰﾊﾞﾙﾏｸﾛ投資 @ja
definition: This segment includes companies that provide hedge fund investments that employ a global macro investment strategy. Such a strategy is investing around the world using broad macroeconomic factors that forecast interest rate trends, business cycles, government policies, political changes and other broad systemic factors.
notation: 1410111212
valid from: 2014-08-08
valid till: 2020-10-03

Managed Futures Investments
type: BicsLevel5Segment
type: Classifier
type: Discontinued
type: NamedIndividual
is level5 segment of: Hedge Fund Investments
is contemporary version of: http://data.ga-group.nl/ics/bics/1410111213
is version of: http://data.ga-group.nl/ics/bics/1410111213
imported on: 2026-06-08T13:03:47.798Z
last refreshed on: 2026-06-08T13:03:47.798Z
source accessed on: 2019-12-03T20:05:01Z
source last accessed on: 2019-12-03T20:05:01Z
label: Inversiones gestionadas de futuros @es
label: Investimenti futures gestiti @it
label: Investimentos de futuros gerenciados @pt
label: Investissements de futures gérés @fr
label: Verwaltete Futures-Investitionen @de
label: Управляемые фьючерсные инвестиции @ru
label: 管理式期货投资 @zh
label: 管理期貨投資 @zh-hant
label: 관리선물 투자 @ko
label: ﾏﾈｰｼﾞﾄﾞ･ﾌｭｰﾁｬｰｽﾞ投資 @ja
definition: This segment includes companies that focus on providing hedge fund investments that employ a managed futures investment strategy. Such a strategy uses a proprietary system or discretionary method that involves going long or short in futures contracts in commodities, such as metals, grains, soft commodities and bond futures, as well as currencies and equity indices.
notation: 1410111213
valid from: 2014-08-08
valid till: 2020-10-03

Relative Value Investments
type: BicsLevel5Segment
type: Classifier
type: Discontinued
type: NamedIndividual
is level5 segment of: Hedge Fund Investments
is contemporary version of: http://data.ga-group.nl/ics/bics/1410111214
is version of: http://data.ga-group.nl/ics/bics/1410111214
imported on: 2026-06-08T13:03:47.798Z
last refreshed on: 2026-06-08T13:03:47.798Z
source accessed on: 2019-12-03T20:05:01Z
source last accessed on: 2019-12-03T20:05:01Z
label: Inversiones de valor relativo @es
label: Investimenti valore relativo @it
label: Investimentos de valor relativo @pt
label: Investissements valeur relative @fr
label: Relativer Wert-Investitionen @de
label: Инвестиции в относительную стоимость @ru
label: 相对价值投资 @zh
label: 相對價值投資 @zh-hant
label: 상대가치 투자 @ko
label: ﾚﾗﾃｨﾌﾞﾊﾞﾘｭｰ投資 @ja
definition: This segment includes companies that provide hedge fund investments that employ a relative value investment strategy. Such a strategy exploits pricing inefficiencies between assets that are mispriced. Types of relative value hedge funds are fixed income arbitrage, equity arbitrage, convertible arbitrage and volatility arbitrage.
notation: 1410111214
valid from: 2014-08-08
valid till: 2020-10-03

Hedge Fund Investments
type: BicsLevel4SubIndustry
type: Classifier
type: NamedIndividual
is sub industry of: Investment Management
is anachronous version of: http://data.ga-group.nl/ics/bics/1411101112
is contemporary version of: http://data.ga-group.nl/ics/bics/14101112
is replaced by: http://data.ga-group.nl/ics/bics/2020/1411101112
is version of: http://data.ga-group.nl/ics/bics/14101112
is version of: http://data.ga-group.nl/ics/bics/1411101112
imported on: 2026-06-08T13:03:47.798Z
last refreshed on: 2026-06-08T13:03:47.798Z
source accessed on: 2019-12-03T20:05:01Z
source last accessed on: 2019-12-03T20:05:01Z
label: Hedgefonds-Investitionen @de
label: Inversiones de fondos de cobertura @es
label: Investimenti hedge fund @it
label: Investimentos de fundos hedge @pt
label: Investissements fonds de couverture @fr
label: Инвестиции хедж-фондов @ru
label: 对冲基金投资 @zh
label: 對沖基金投資 @zh-hant
label: 헤지펀드 투자 @ko
label: ﾍｯｼﾞﾌｧﾝﾄﾞ投資 @ja
definition: This industry subgroup includes companies that provide investment management services for individual and institutional investors by investing in a diverse range of assets, such as equities, bonds and commodities. Hedge funds employ a variety of investment strategies to maintain a hedged portfolio designed to protect investors from downturns in the market and maximize returns in upward markets.
notation: 14101112
valid from: 2014-08-08
valid till: 2020-10-03

Mixed Asset
type: BicsLevel4SubIndustry
type: Classifier
type: NamedIndividual
is sub industry of: Investment Management
is anachronous version of: http://data.ga-group.nl/ics/bics/1411101113
is contemporary version of: http://data.ga-group.nl/ics/bics/14101113
is replaced by: http://data.ga-group.nl/ics/bics/2020/1411101113
is version of: http://data.ga-group.nl/ics/bics/14101113
is version of: http://data.ga-group.nl/ics/bics/1411101113
imported on: 2026-06-08T13:03:47.798Z
last refreshed on: 2026-06-08T13:03:47.798Z
source accessed on: 2019-12-03T20:05:01Z
source last accessed on: 2019-12-03T20:05:01Z
label: Actifs mixtes @fr
label: Activo mixto @es
label: Asset misti @it
label: Ativo misto @pt
label: Gemischte Anlagen @de
label: Смешанные активы @ru
label: 混合資產 @zh-hant
label: 混合資産 @ja
label: 混合资产 @zh
label: 혼합형 자산 @ko
definition: This industry subgroup includes companies that provide traditional investment management services for individual and institutional investors by investing in a mixed asset portfolio. A mixed asset fund invests in a mix of bonds and equities to spread the investment risk.
notation: 14101113
valid from: 2014-08-08
valid till: 2020-10-03

Investment Management
type: BicsLevel3Industry
type: Classifier
type: NamedIndividual
is industry of: Asset Management
is anachronous version of: http://data.ga-group.nl/ics/bics/14111011
is contemporary version of: http://data.ga-group.nl/ics/bics/141011
is replaced by: http://data.ga-group.nl/ics/bics/2020/14111011
is version of: http://data.ga-group.nl/ics/bics/141011
is version of: http://data.ga-group.nl/ics/bics/14111011
imported on: 2026-06-08T13:03:47.798Z
last refreshed on: 2026-06-08T13:03:47.798Z
source accessed on: 2019-12-03T20:05:01Z
source last accessed on: 2019-12-03T20:05:01Z
label: Gerenc invest @pt
label: Gestión inversión @es
label: Gestion d'investissements @fr
label: Gestione investimento @it
label: Investmentmanagement @de
label: Управление инвестиц. @ru
label: 投資管理 @ja
label: 投资管理 @zh
label: 투자관리 @ko
definition: This industry includes companies that provide traditional investment management services for individual and institutional investors. Major asset classes include equities, fixed income, mixed asset and hedge funds.
notation: 141011
valid from: 2014-08-08
valid till: 2020-10-03

Co-Investments
type: BicsLevel4SubIndustry
type: Classifier
type: NamedIndividual
is sub industry of: Capital privado
is anachronous version of: http://data.ga-group.nl/ics/bics/1411101210
is contemporary version of: http://data.ga-group.nl/ics/bics/14101210
is replaced by: http://data.ga-group.nl/ics/bics/2020/1411101210
is version of: http://data.ga-group.nl/ics/bics/14101210
is version of: http://data.ga-group.nl/ics/bics/1411101210
imported on: 2026-06-08T13:03:47.798Z
last refreshed on: 2026-06-08T13:03:47.798Z
source accessed on: 2019-12-03T20:05:01Z
source last accessed on: 2019-12-03T20:05:01Z
label: Co-Investimentos @pt
label: Co-Investitionen @de
label: Co-investimenti @it
label: Co-investissements @fr
label: Coinversiones @es
label: Со-инвестиции @ru
label: 共同投資 @ja
label: 合作投資 @zh-hant
label: 联合投资 @zh
label: 공동투자 @ko
definition: This industry subgroup includes companies that invest in a co-investment asset class of private equity financial sponsors. An equity co-investment is a minority investment in an operating company alongside a financial sponsor or other private equity investor in a leveraged buyout, recapitalization or growth capital transaction.
notation: 14101210
valid from: 2014-08-08
valid till: 2020-10-03

Debt Investments
type: BicsLevel4SubIndustry
type: Classifier
type: NamedIndividual
is sub industry of: Capital privado
is anachronous version of: http://data.ga-group.nl/ics/bics/1411101211
is contemporary version of: http://data.ga-group.nl/ics/bics/14101211
is replaced by: http://data.ga-group.nl/ics/bics/2020/1411101211
is version of: http://data.ga-group.nl/ics/bics/14101211
is version of: http://data.ga-group.nl/ics/bics/1411101211
imported on: 2026-06-08T13:03:47.798Z
last refreshed on: 2026-06-08T13:03:47.798Z
source accessed on: 2019-12-03T20:05:01Z
source last accessed on: 2019-12-03T20:05:01Z
label: Emprunts de capitaux @fr
label: Inversiones de deuda @es
label: Investimenti debito @it
label: Investimentos de dívida @pt
label: Schulden, Investitionen @de
label: Долговые инвестиции @ru
label: 债务投资 @zh
label: 債務投資 @zh-hant
label: 特殊状況投資 @ja
label: 채권투자 @ko
definition: This industry subgroup includes companies that invest in a special situation asset class of private equity financial sponsors. A special situation investment refers to investments in equity or debt securities of financially stressed companies. Special situation strategies involve an investment that will provide rescue financing to companies undergoing operational or financial challenges.
notation: 14101211
valid from: 2014-08-08
valid till: 2020-10-03

Fund of Funds
type: BicsLevel4SubIndustry
type: Classifier
type: NamedIndividual
is sub industry of: Capital privado
is anachronous version of: http://data.ga-group.nl/ics/bics/1411101212
is contemporary version of: http://data.ga-group.nl/ics/bics/14101212
is replaced by: http://data.ga-group.nl/ics/bics/2020/1411101212
is version of: http://data.ga-group.nl/ics/bics/14101212
is version of: http://data.ga-group.nl/ics/bics/1411101212
imported on: 2026-06-08T13:03:47.798Z
last refreshed on: 2026-06-08T13:03:47.798Z
source accessed on: 2019-12-03T20:05:01Z
source last accessed on: 2019-12-03T20:05:01Z
label: Dachfonds @de
label: Fondo de fondos @es
label: Fondo di fondi @it
label: Fonds de fonds @fr
label: Fundo de fundos @pt
label: Фонд фондов @ru
label: 組合型基金 @zh-hant
label: 综合基金 @zh
label: 재간접펀드 @ko
label: ﾌｧﾝﾄﾞｵﾌﾞﾌｧﾝｽﾞ @ja
definition: This industry subgroup includes companies that operate a fund of funds investment strategy. A fund of funds holds a portfolio composed of investments in other fund types and does not hold direct investments.
notation: 14101212
valid from: 2014-08-08
valid till: 2020-10-03

Growth Capital
type: BicsLevel4SubIndustry
type: Classifier
type: NamedIndividual
is sub industry of: Capital privado
is anachronous version of: http://data.ga-group.nl/ics/bics/1411101213
is contemporary version of: http://data.ga-group.nl/ics/bics/14101213
is replaced by: http://data.ga-group.nl/ics/bics/2020/1411101213
is version of: http://data.ga-group.nl/ics/bics/14101213
is version of: http://data.ga-group.nl/ics/bics/1411101213
imported on: 2026-06-08T13:03:47.798Z
last refreshed on: 2026-06-08T13:03:47.798Z
source accessed on: 2019-12-03T20:05:01Z
source last accessed on: 2019-12-03T20:05:01Z
label: Capital crescimento @pt
label: Capital de crec @es
label: Capital de croiss @fr
label: Capitale crescita @it
label: Kapitalzuwachs @de
label: Рост капитала @ru
label: 成長型資本 @zh-hant
label: 成長資本 @ja
label: 成长型资本 @zh
label: 성장 자본 @ko
definition: This industry subgroup includes companies that provide growth capital investments. Typically, these are minority investments that are provided to companies that are more mature in their life-cycle development with positive cash flow. These investments may be utilized for facility expansions, product development or equipment.
notation: 14101213
valid from: 2014-08-08
valid till: 2020-10-03

Leveraged Buyout
type: BicsLevel4SubIndustry
type: Classifier
type: NamedIndividual
is sub industry of: Capital privado
is anachronous version of: http://data.ga-group.nl/ics/bics/1411101214
is contemporary version of: http://data.ga-group.nl/ics/bics/14101214
is replaced by: http://data.ga-group.nl/ics/bics/2020/1411101214
is version of: http://data.ga-group.nl/ics/bics/14101214
is version of: http://data.ga-group.nl/ics/bics/1411101214
imported on: 2026-06-08T13:03:47.798Z
last refreshed on: 2026-06-08T13:03:47.798Z
source accessed on: 2019-12-03T20:05:01Z
source last accessed on: 2019-12-03T20:05:01Z
label: Acquisition par emprunt @fr
label: Compra alavancada @pt
label: Inversiones apalancadas @es
label: Leverage-Buyout @de
label: Выкуп с привлеч. заемных средств @ru
label: 杠杆收购 @zh
label: 融資收購 @zh-hant
label: 차입매수 @ko
label: ﾚﾊﾞﾚｯｼﾞﾄﾞ･ﾊﾞｲｱｳﾄ投資 @ja
definition: This industry subgroup includes companies that invest in a leveraged buyout asset class of private equity financial sponsors. A leveraged buyout occurs when a financial sponsor acquires a controlling interest in a company's equity and a significant percentage of the purchase price is financed through leverage.
notation: 14101214
valid from: 2014-08-08
valid till: 2020-10-03

Real Assets Investments
type: BicsLevel4SubIndustry
type: Classifier
type: NamedIndividual
is sub industry of: Capital privado
is anachronous version of: http://data.ga-group.nl/ics/bics/1411101215
is contemporary version of: http://data.ga-group.nl/ics/bics/14101215
is replaced by: http://data.ga-group.nl/ics/bics/2020/1411101215
is version of: http://data.ga-group.nl/ics/bics/14101215
is version of: http://data.ga-group.nl/ics/bics/1411101215
imported on: 2026-06-08T13:03:47.798Z
last refreshed on: 2026-06-08T13:03:47.798Z
source accessed on: 2019-12-03T20:05:01Z
source last accessed on: 2019-12-03T20:05:01Z
label: Inversiones inmobiliarias @es
label: Investimenti attivi reali @it
label: Investimentos em ativos reais @pt
label: Investissements en immobilisations @fr
label: Liegenschaften, Investitionen @de
label: Инвестиц. в реальные активы @ru
label: 实际资产投资 @zh
label: 實質資產投資 @zh-hant
label: 실물자산투자 @ko
label: ｲﾝﾌﾗ投資 @ja
definition: This industry subgroup includes companies that invest in an infrastructure asset class of private equity financial sponsors. An infrastructure investment includes transportation, water and waste, and natural resources investments.
notation: 14101215
valid from: 2014-08-08
valid till: 2020-10-03

Real Estate Investments
type: BicsLevel4SubIndustry
type: Classifier
type: NamedIndividual
is sub industry of: Capital privado
is anachronous version of: http://data.ga-group.nl/ics/bics/1411101216
is contemporary version of: http://data.ga-group.nl/ics/bics/14101216
is replaced by: http://data.ga-group.nl/ics/bics/2020/1411101216
is version of: http://data.ga-group.nl/ics/bics/14101216
is version of: http://data.ga-group.nl/ics/bics/1411101216
imported on: 2026-06-08T13:03:47.798Z
last refreshed on: 2026-06-08T13:03:47.798Z
source accessed on: 2019-12-03T20:05:01Z
source last accessed on: 2019-12-03T20:05:01Z
label: Immobilieninvestitionen @de
label: Inversiones inmobiliarias @es
label: Investim immobiliari @it
label: Investimentos imobiliários @pt
label: Investissements immobiliers @fr
label: Инвестиции в недвижимость @ru
label: 不動產投資 @zh-hant
label: 不動産投資 @ja
label: 房地产投资 @zh
label: 부동산 투자 @ko
definition: This industry subgroup includes companies that invest in a real estate asset class of private equity financial sponsors. A real estate investment consists of equity and debt investments in property that involves an active management strategy.
notation: 14101216
valid from: 2014-08-08
valid till: 2020-10-03

Secondary Transactions
type: BicsLevel4SubIndustry
type: Classifier
type: NamedIndividual
is sub industry of: Capital privado
is anachronous version of: http://data.ga-group.nl/ics/bics/1411101217
is contemporary version of: http://data.ga-group.nl/ics/bics/14101217
is replaced by: http://data.ga-group.nl/ics/bics/2020/1411101217
is version of: http://data.ga-group.nl/ics/bics/14101217
is version of: http://data.ga-group.nl/ics/bics/1411101217
imported on: 2026-06-08T13:03:47.798Z
last refreshed on: 2026-06-08T13:03:47.798Z
source accessed on: 2019-12-03T20:05:01Z
source last accessed on: 2019-12-03T20:05:01Z
label: Sekundäre Transaktionen @de
label: Transacciones secundarias @es
label: Transactions secondaires @fr
label: Transazioni secondarie @it
label: Ttransações secundárias @pt
label: Вторичные транзакции @ru
label: 二级市场交易 @zh
label: 次級交易 @zh-hant
label: 유통시장거래 @ko
label: ｾｶﾝﾀﾞﾘ取引投資 @ja
definition: This industry subgroup includes companies that invest in a secondary transaction asset class of private equity financial sponsors. A secondary transaction investment consists of buying and selling of preexisting investor commitments to private equity and other alternative investment funds. Types of secondary transaction investments are the sale of a limited partnership interest and the sale of a direct interest.
notation: 14101217
valid from: 2014-08-08
valid till: 2020-10-03

Capital de risco
type: BicsLevel4SubIndustry
type: Classifier
type: NamedIndividual
is sub industry of: Capital privado
is anachronous version of: http://data.ga-group.nl/ics/bics/1411101218
is contemporary version of: http://data.ga-group.nl/ics/bics/14101218
is replaced by: http://data.ga-group.nl/ics/bics/2020/1411101218
is version of: http://data.ga-group.nl/ics/bics/14101218
is version of: http://data.ga-group.nl/ics/bics/1411101218
imported on: 2026-06-08T13:03:47.798Z
last refreshed on: 2026-06-08T13:03:47.798Z
source accessed on: 2019-12-03T20:05:01Z
source last accessed on: 2019-12-03T20:05:01Z
label: Capital riesgo @es
label: Capitale di rischio @it
label: Venture Capital
label: Венчурный капитал @ru
label: 創投 @zh-hant
label: 风险资本 @zh
label: 벤처캐피털 @ko
label: ﾍﾞﾝﾁｬｰｷｬﾋﾟﾀﾙ投資 @ja
definition: This industry subgroup includes companies that provide venture capital investments. Such investments are provided to early-stage, high-potential, high-risk, growth startup companies.
notation: 14101218
valid from: 2014-08-08
valid till: 2020-10-03

Capital privado
type: BicsLevel3Industry
type: Classifier
type: NamedIndividual
is industry of: Asset Management
is anachronous version of: http://data.ga-group.nl/ics/bics/14111012
is contemporary version of: http://data.ga-group.nl/ics/bics/141012
is replaced by: http://data.ga-group.nl/ics/bics/2020/14111012
is version of: http://data.ga-group.nl/ics/bics/141012
is version of: http://data.ga-group.nl/ics/bics/14111012
imported on: 2026-06-08T13:03:47.798Z
last refreshed on: 2026-06-08T13:03:47.798Z
source accessed on: 2019-12-03T20:05:01Z
source last accessed on: 2019-12-03T20:05:01Z
label: Private Equity
label: Private equity @it
label: Частн. капитал @ru
label: 私募股权 @zh
label: 私募股權 @zh-hant
label: 사모 @ko
label: ﾌﾟﾗｲﾍﾞｰﾄｴｸｲﾃｨ投資 @ja
definition: This industry includes companies that are a type of private equity investment firm, particularly those private equity firms that engage in leveraged buyout (LBO) transactions. Financial sponsors rarely manage a company directly and are most active on issues relating to a company's capital structure and balance sheet and strategic initiatives, such as mergers and acquisitions.
notation: 141012
valid from: 2014-08-08
valid till: 2020-10-03

Financial Plan & Invst Advisory
type: BicsLevel4SubIndustry
type: Classifier
type: NamedIndividual
is sub industry of: Wealth Management
is anachronous version of: http://data.ga-group.nl/ics/bics/1411101310
is contemporary version of: http://data.ga-group.nl/ics/bics/14101310
is replaced by: http://data.ga-group.nl/ics/bics/2020/1411101310
is version of: http://data.ga-group.nl/ics/bics/14101310
is version of: http://data.ga-group.nl/ics/bics/1411101310
imported on: 2026-06-08T13:03:47.798Z
last refreshed on: 2026-06-08T13:03:47.798Z
source accessed on: 2019-12-03T20:05:01Z
source last accessed on: 2019-12-03T20:05:01Z
label: Asesoría de planeación financiera e inversión @es
label: Conseils placmt et planif financière @fr
label: Consultor de invest e plan financeiro @pt
label: Finanzplanung & InvestBeratung @de
label: Piano finanziario e consulenza invest @it
label: Фин. планирование и инвест. консультации @ru
label: 理財規劃及投資顧問 @zh-hant
label: 财务规划与投资顾问 @zh
label: 재무설계 & 투자자문 @ko
label: ﾌｧｲ��ﾝｼｬﾙﾌﾟﾗﾆﾝｸﾞ･投資ｱﾄﾞﾊﾞｲｽ @ja
definition: This industry subgroup includes companies that provide financial planning and investment advice to clients on a fee basis but do not have authority to execute trades. Financial planning involves creating and preserving personal wealth, retirement planning, and tax- and estate-planning services.
notation: 14101310
valid from: 2014-08-08
valid till: 2020-10-03

Private Banking
type: BicsLevel4SubIndustry
type: Classifier
type: NamedIndividual
is sub industry of: Wealth Management
is anachronous version of: http://data.ga-group.nl/ics/bics/1411101311
is contemporary version of: http://data.ga-group.nl/ics/bics/14101311
is replaced by: http://data.ga-group.nl/ics/bics/2020/1411101311
is version of: http://data.ga-group.nl/ics/bics/14101311
is version of: http://data.ga-group.nl/ics/bics/1411101311
imported on: 2026-06-08T13:03:47.798Z
last refreshed on: 2026-06-08T13:03:47.798Z
source accessed on: 2019-12-03T20:05:01Z
source last accessed on: 2019-12-03T20:05:01Z
label: Banca privada @es
label: Banco priv @pt
label: Banque privée @fr
label: Privatbankwesen @de
label: Частные банковские услуги @ru
label: 私人銀行 @zh-hant
label: 私人银行 @zh
label: 프라이빗 뱅킹(PB) @ko
label: ﾌﾟﾗｲﾍﾞｰﾄ･ﾊﾞﾝｷﾝｸﾞ @ja
definition: This industry subgroup includes commercial banks that provide personalized wealth management services to high net worth individuals.
notation: 14101311
valid from: 2014-08-08
valid till: 2020-10-03

Retail Securities Brokerage
type: BicsLevel4SubIndustry
type: Classifier
type: NamedIndividual
is sub industry of: Wealth Management
is anachronous version of: http://data.ga-group.nl/ics/bics/1411101312
is contemporary version of: http://data.ga-group.nl/ics/bics/14101312
is replaced by: http://data.ga-group.nl/ics/bics/2020/1411101312
is version of: http://data.ga-group.nl/ics/bics/14101312
is version of: http://data.ga-group.nl/ics/bics/1411101312
imported on: 2026-06-08T13:03:47.798Z
last refreshed on: 2026-06-08T13:03:47.798Z
source accessed on: 2019-12-03T20:05:01Z
source last accessed on: 2019-12-03T20:05:01Z
label: Brokeraggio di titoli - Retail @it
label: Corretaje de valores al por menor @es
label: Corretora de ativos no varejo @pt
label: Courtage de titres (détail) @fr
label: Retail Brokerage für Wertpapiere @de
label: Розничные брокерские операции с ЦБ @ru
label: 個人投資家向け証券仲介 @ja
label: 零售證券經紀 @zh-hant
label: 零售证券经纪 @zh
label: 소매증권 중개업 @ko
definition: This industry subgroup includes companies that provide securities brokerage services to retail investors. Retail investors are individuals who buy or sell securities for their personal account.
notation: 14101312
valid from: 2014-08-08
valid till: 2020-10-03

Wealth Management
type: BicsLevel3Industry
type: Classifier
type: NamedIndividual
is industry of: Asset Management
is anachronous version of: http://data.ga-group.nl/ics/bics/14111013
is contemporary version of: http://data.ga-group.nl/ics/bics/141013
is replaced by: http://data.ga-group.nl/ics/bics/2020/14111013
is version of: http://data.ga-group.nl/ics/bics/141013
is version of: http://data.ga-group.nl/ics/bics/14111013
imported on: 2026-06-08T13:03:47.798Z
last refreshed on: 2026-06-08T13:03:47.798Z
source accessed on: 2019-12-03T20:05:01Z
source last accessed on: 2019-12-03T20:05:01Z
label: Administração bens @pt
label: Gestión patrimonio @es
label: Gestion de fortune @fr
label: Gestione patrimonio @it
label: Vermögensverwaltung @de
label: Управл. состоянием @ru
label: 財富管理 @zh-hant
label: 财富管理 @zh
label: 재산관리 @ko
label: ｳｪﾙｽ･ﾏﾈｼﾞﾒﾝﾄ @ja
definition: This industry includes companies that manage investment portfolios, such as private banking, trust, retail securities brokerage, and financial planning and investment advisory services.
notation: 141013
valid from: 2014-08-08
valid till: 2020-10-03

Asset Management
type: BicsLevel2IndustryGroup
type: Classifier
type: NamedIndividual
is industry group of: Financials
is anachronous version of: http://data.ga-group.nl/ics/bics/141110
is contemporary version of: http://data.ga-group.nl/ics/bics/1410
is replaced by: http://data.ga-group.nl/ics/bics/2020/141110
is version of: http://data.ga-group.nl/ics/bics/1410
is version of: http://data.ga-group.nl/ics/bics/141110
imported on: 2026-06-08T13:03:47.798Z
last refreshed on: 2026-06-08T13:03:47.798Z
source accessed on: 2019-12-03T20:05:01Z
source last accessed on: 2019-12-03T20:05:01Z
label: Gerenc ativo @pt
label: Gestión de activos @es
label: Gestion actifs @fr
label: Vermögensverwaltung @de
label: Управление активами @ru
label: 資產管理 @zh-hant
label: 資産管理 @ja
label: 资产管理 @zh
label: 자산 운용 @ko
definition: This industry group includes companies that manage investment portfolios, such as investment companies, investment management companies, private equity firms and wealth management companies.
notation: 1410
valid from: 2014-08-08
valid till: 2020-10-03

Diversified Banks
type: BicsLevel3Industry
type: Classifier
type: NamedIndividual
is industry of: Banking
is anachronous version of: http://data.ga-group.nl/ics/bics/14101010
is contemporary version of: http://data.ga-group.nl/ics/bics/141110
is replaced by: http://data.ga-group.nl/ics/bics/2020/14101010
is version of: http://data.ga-group.nl/ics/bics/14101010
is version of: http://data.ga-group.nl/ics/bics/141110
imported on: 2026-06-08T13:03:47.798Z
last refreshed on: 2026-06-08T13:03:47.798Z
source accessed on: 2019-12-03T20:05:01Z
source last accessed on: 2019-12-03T20:05:01Z
label: Banche diversificate @it
label: Bancos divers @pt
label: Bancos diversif @es
label: Banqes diversifiées @fr
label: Div. Banken @de
label: Многоотрасл. банки @ru
label: 多元化銀行 @zh-hant
label: 総合銀行 @ja
label: 综合性银行 @zh
label: 다각화은행 @ko
definition: This industry includes companies that have multinational bank operations with significant investment banking operations.
notation: 141110
valid from: 2014-08-08
valid till: 2020-10-03

Corporate Banking
type: BicsLevel4SubIndustry
type: Classifier
type: NamedIndividual
is sub industry of: Banks
is anachronous version of: http://data.ga-group.nl/ics/bics/1410101110
is contemporary version of: http://data.ga-group.nl/ics/bics/14111110
is replaced by: http://data.ga-group.nl/ics/bics/2020/1410101110
is version of: http://data.ga-group.nl/ics/bics/1410101110
is version of: http://data.ga-group.nl/ics/bics/14111110
imported on: 2026-06-08T13:03:47.798Z
last refreshed on: 2026-06-08T13:03:47.798Z
source accessed on: 2019-12-03T20:05:01Z
source last accessed on: 2019-12-03T20:05:01Z
label: Banca corporativa @es
label: Bancos corporativos @pt
label: Banques d'affaires @fr
label: Firmenkundengschäft der Banken @de
label: Корп. банк. услуги @ru
label: 企業金融 @zh-hant
label: 公司银行 @zh
label: 기업금융 @ko
label: ｺｰﾎﾟﾚｰﾄﾊﾞﾝｷﾝｸﾞ @ja
definition: This industry subgroup includes companies that accept deposits and make loans to corporations and large businesses.
notation: 14111110
valid from: 2014-08-08
valid till: 2020-10-03

Retail Banking
type: BicsLevel4SubIndustry
type: Classifier
type: NamedIndividual
is sub industry of: Banks
is anachronous version of: http://data.ga-group.nl/ics/bics/1410101111
is contemporary version of: http://data.ga-group.nl/ics/bics/14111111
is replaced by: http://data.ga-group.nl/ics/bics/2020/1410101111
is version of: http://data.ga-group.nl/ics/bics/1410101111
is version of: http://data.ga-group.nl/ics/bics/14111111
imported on: 2026-06-08T13:03:47.798Z
last refreshed on: 2026-06-08T13:03:47.798Z
source accessed on: 2019-12-03T20:05:01Z
source last accessed on: 2019-12-03T20:05:01Z
label: Banc-varej @pt
label: Banca al por menor @es
label: Banq détail @fr
label: Privatbankwesen @de
label: Розничные банковские услуги @ru
label: 零售銀行 @zh-hant
label: 零售银行 @zh
label: 소매금융업 @ko
label: ﾘﾃｰﾙ銀行 @ja
definition: This industry subgroup includes companies that accept deposits and make loans to retail (individual) customers.
notation: 14111111
valid from: 2014-08-08
valid till: 2020-10-03

Banks
type: BicsLevel3Industry
type: Classifier
type: NamedIndividual
is industry of: Banking
is anachronous version of: http://data.ga-group.nl/ics/bics/14101011
is contemporary version of: http://data.ga-group.nl/ics/bics/141111
is replaced by: http://data.ga-group.nl/ics/bics/2020/14101011
is version of: http://data.ga-group.nl/ics/bics/14101011
is version of: http://data.ga-group.nl/ics/bics/141111
imported on: 2026-06-08T13:03:47.798Z
last refreshed on: 2026-06-08T13:03:47.798Z
source accessed on: 2019-12-03T20:05:01Z
source last accessed on: 2019-12-03T20:05:01Z
label: Banche @it
label: Banco regional @pt
label: Bancos @es
label: Banken @de
label: Banques @fr
label: Банки @ru
label: 銀行 @ja
label: 银行 @zh
label: 은행 @ko
definition: This industry includes companies that accept deposits and make loans.
notation: 141111
valid from: 2014-08-08
valid till: 2020-10-03

Banking
type: BicsLevel2IndustryGroup
type: Classifier
type: NamedIndividual
is industry group of: Financials
is anachronous version of: http://data.ga-group.nl/ics/bics/141010
is contemporary version of: http://data.ga-group.nl/ics/bics/1411
is replaced by: http://data.ga-group.nl/ics/bics/2020/141010
is version of: http://data.ga-group.nl/ics/bics/141010
is version of: http://data.ga-group.nl/ics/bics/1411
imported on: 2026-06-08T13:03:47.798Z
last refreshed on: 2026-06-08T13:03:47.798Z
source accessed on: 2019-12-03T20:05:01Z
source last accessed on: 2019-12-03T20:05:01Z
label: Banca @es
label: Banche @it
label: Bancos @pt
label: Bankwesen @de
label: Banques @fr
label: Банки @ru
label: 銀行 @ja
label: 银行业 @zh
label: 은행 @ko
definition: This industry group includes companies that accept deposits and make loans to corporations and individuals through either a commercial banking or savings bank structure.
notation: 1411
valid from: 2014-08-08
valid till: 2020-10-03

General Equip Finance & Leasing
type: BicsLevel5Segment
type: Classifier
type: NamedIndividual
is level5 segment of: Comml Equip Finance & Leasing
is anachronous version of: http://data.ga-group.nl/ics/bics/141111101010
is contemporary version of: http://data.ga-group.nl/ics/bics/1412101010
is replaced by: http://data.ga-group.nl/ics/bics/2020/141111101010
is version of: http://data.ga-group.nl/ics/bics/141111101010
is version of: http://data.ga-group.nl/ics/bics/1412101010
imported on: 2026-06-08T13:03:47.798Z
last refreshed on: 2026-06-08T13:03:47.798Z
source accessed on: 2019-12-03T20:05:01Z
source last accessed on: 2019-12-03T20:05:01Z
label: App generale finanz e leasing @it
label: Fin/crédit-bail équipement gén @fr
label: Financiamento e leasing de equip em geral @pt
label: Financiamiento y arrendamiento de equipo en general @es
label: Finanzierung & Leasing von allg. Equip. @de
label: Аренда и лизинг оборуд. общ. назначения @ru
label: 一般設備機器 金融･ﾘｰｽ @ja
label: 一般設備融資及租賃 @zh-hant
label: 通用设备融资与租赁 @zh
label: 일반장비 금융 & 리스 @ko
definition: This segment includes companies that finance or lease general equipment. In such a situation, a contractual agreement is established and usually reached through a dealer.
notation: 1412101010
valid from: 2014-08-08
valid till: 2020-10-03

Ind Equip Finance & Leasing
type: BicsLevel5Segment
type: Classifier
type: NamedIndividual
is level5 segment of: Comml Equip Finance & Leasing
is anachronous version of: http://data.ga-group.nl/ics/bics/141111101011
is contemporary version of: http://data.ga-group.nl/ics/bics/1412101011
is replaced by: http://data.ga-group.nl/ics/bics/2020/141111101011
is version of: http://data.ga-group.nl/ics/bics/141111101011
is version of: http://data.ga-group.nl/ics/bics/1412101011
imported on: 2026-06-08T13:03:47.798Z
last refreshed on: 2026-06-08T13:03:47.798Z
source accessed on: 2019-12-03T20:05:01Z
source last accessed on: 2019-12-03T20:05:01Z
label: App industriale finanz e leasing @it
label: Fin/crédit-bail équipement ind @fr
label: Financiamento e leasing de equip ind @pt
label: Financiamiento y arrendamiento de equipo ind @es
label: Finanzierung & Leasing von ind. Equip. @de
label: Аренда и лизинг пром. оборуд. @ru
label: 工业设备融资与租赁 @zh
label: 工業設備融資及租賃 @zh-hant
label: 産業用設備機器 ﾘｰｽ @ja
label: 산업용장비 금융 & 리스 @ko
definition: This segment includes companies that finance or lease industrial equipment. In such a situation, a contractual agreement is established and usually reached through a dealer.
notation: 1412101011
valid from: 2014-08-08
valid till: 2020-10-03

Machinery Finance & Leasing
type: BicsLevel5Segment
type: Classifier
type: NamedIndividual
is level5 segment of: Comml Equip Finance & Leasing
is anachronous version of: http://data.ga-group.nl/ics/bics/141111101012
is contemporary version of: http://data.ga-group.nl/ics/bics/1412101012
is replaced by: http://data.ga-group.nl/ics/bics/2020/141111101012
is version of: http://data.ga-group.nl/ics/bics/141111101012
is version of: http://data.ga-group.nl/ics/bics/1412101012
imported on: 2026-06-08T13:03:47.798Z
last refreshed on: 2026-06-08T13:03:47.798Z
source accessed on: 2019-12-03T20:05:01Z
source last accessed on: 2019-12-03T20:05:01Z
label: Finance et crédit-bail de machinerie @fr
label: Financiamento e arrendamento de maquinário @pt
label: Financiamiento y arrendamiento de maquinaria @es
label: Finanz macchinari e leasing @it
label: Maschinenfinanzierung & Leasing @de
label: Финансиривание и лизинг машин. оборудования @ru
label: 机械融资租赁 @zh
label: 機械 金融･ﾘｰｽ @ja
label: 機械融資及租賃 @zh-hant
label: 기계류 금융 & 리스 @ko
definition: This segment includes companies that finance or lease machinery not elsewhere classified. In such a situation, a contractual agreement is established and usually reached through a dealer.
notation: 1412101012
valid from: 2014-08-08
valid till: 2020-10-03

Comml Equip Finance & Leasing
type: BicsLevel4SubIndustry
type: Classifier
type: NamedIndividual
is sub industry of: Commercial Finance
is anachronous version of: http://data.ga-group.nl/ics/bics/1411111010
is contemporary version of: http://data.ga-group.nl/ics/bics/14121010
is replaced by: http://data.ga-group.nl/ics/bics/2020/1411111010
is version of: http://data.ga-group.nl/ics/bics/1411111010
is version of: http://data.ga-group.nl/ics/bics/14121010
imported on: 2026-06-08T13:03:47.798Z
last refreshed on: 2026-06-08T13:03:47.798Z
source accessed on: 2019-12-03T20:05:01Z
source last accessed on: 2019-12-03T20:05:01Z
label: App comm finanz e leasing @it
label: Financ/crédit-bail équipement comm @fr
label: Financiamento e leasing de equip comerc @pt
label: Financiamiento y arrendamiento de equipo comercial @es
label: Finanzierung & Leasing von gewerbl. Equip. @de
label: Аренда и лизинг коммерч. оборуд. @ru
label: 商业设备融资与租赁 @zh
label: 商業設備金融･ﾘｰｽ @ja
label: 商用設備融資及租賃 @zh-hant
label: 상업용장비 금융 & 리스 @ko
definition: This industry subgroup includes companies that finance or lease light commercial and machinery and equipment, such as office and computer equipment.
notation: 14121010
valid from: 2014-08-08
valid till: 2020-10-03

Aircraft Finance & Leasing
type: BicsLevel5Segment
type: Classifier
type: NamedIndividual
is level5 segment of: Transp Equip Finance & Leasing
is anachronous version of: http://data.ga-group.nl/ics/bics/141111101110
is contemporary version of: http://data.ga-group.nl/ics/bics/1412101110
is replaced by: http://data.ga-group.nl/ics/bics/2020/141111101110
is version of: http://data.ga-group.nl/ics/bics/141111101110
is version of: http://data.ga-group.nl/ics/bics/1412101110
imported on: 2026-06-08T13:03:47.798Z
last refreshed on: 2026-06-08T13:03:47.798Z
source accessed on: 2019-12-03T20:05:01Z
source last accessed on: 2019-12-03T20:05:01Z
label: Finance et crédit-bail d'avions @fr
label: Financiamento e arrendamento de aeronave @pt
label: Financiamiento y arrendamiento de aviones @es
label: Finanz e noleggio aerei @it
label: Flugzeugfinanzierung & -Leasing @de
label: Аренда и лизинг самолетов @ru
label: 航空機金融･ﾘｰｽ @ja
label: 飛機融資及租賃 @zh-hant
label: 飞机融资租赁 @zh
label: 항공기 금융 & 리스 @ko
definition: This segment includes companies that finance or lease aircraft.
notation: 1412101110
valid from: 2014-08-08
valid till: 2020-10-03

Commercial Veh Fin & Leasing
type: BicsLevel5Segment
type: Classifier
type: NamedIndividual
is level5 segment of: Transp Equip Finance & Leasing
is anachronous version of: http://data.ga-group.nl/ics/bics/141111101111
is contemporary version of: http://data.ga-group.nl/ics/bics/1412101111
is replaced by: http://data.ga-group.nl/ics/bics/2020/141111101111
is version of: http://data.ga-group.nl/ics/bics/141111101111
is version of: http://data.ga-group.nl/ics/bics/1412101111
imported on: 2026-06-08T13:03:47.798Z
last refreshed on: 2026-06-08T13:03:47.798Z
source accessed on: 2019-12-03T20:05:01Z
source last accessed on: 2019-12-03T20:05:01Z
label: Finance et crédit-bail de véhicules commerciaux @fr
label: Financiamento e arrendamento de veículos comerciais @pt
label: Financiamiento y arrendamiento de vehículos comerciales @es
label: Finanz e leasing veicoli commerciali @it
label: Nutzfahrzeugfinanzierung & Leasing @de
label: Финансиривание и лизинг коммерч. автомобилей @ru
label: 商業用自動車 金融･ﾘｰｽ @ja
label: 商用車融資及租賃 @zh-hant
label: 商用车辆融资与租赁 @zh
label: 상업용 차량 금융 & 리스 @ko
definition: This segment includes companies that finance or lease commercial vehicles. In such a situation, a contractual agreement is established and usually reached through a dealer.
notation: 1412101111
valid from: 2014-08-08
valid till: 2020-10-03

Railroad Car Finance & Leasing
type: BicsLevel5Segment
type: Classifier
type: NamedIndividual
is level5 segment of: Transp Equip Finance & Leasing
is anachronous version of: http://data.ga-group.nl/ics/bics/141111101112
is contemporary version of: http://data.ga-group.nl/ics/bics/1412101112
is replaced by: http://data.ga-group.nl/ics/bics/2020/141111101112
is version of: http://data.ga-group.nl/ics/bics/141111101112
is version of: http://data.ga-group.nl/ics/bics/1412101112
imported on: 2026-06-08T13:03:47.798Z
last refreshed on: 2026-06-08T13:03:47.798Z
source accessed on: 2019-12-03T20:05:01Z
source last accessed on: 2019-12-03T20:05:01Z
label: Finance et crédit-bail pour wagons @fr
label: Financiamento e leasing de vagão de trem @pt
label: Financiamiento y arrendamiento de trenes @es
label: Finanzierung & Leasing von Eisenbahnwaggons @de
label: Vagoni finanz e leasing @it
label: Аренда и лизинг ж/д вагонов @ru
label: 火車車廂融資及租賃 @zh-hant
label: 火车车厢融资与租赁 @zh
label: 鉄道車両金融･ﾘｰｽ @ja
label: 철도차량 금융 & 리스 @ko
definition: This segment includes companies that finance or lease railroad cars.
notation: 1412101112
valid from: 2014-08-08
valid till: 2020-10-03

Ship & Boat Finance & Leasing
type: BicsLevel5Segment
type: Classifier
type: NamedIndividual
is level5 segment of: Transp Equip Finance & Leasing
is anachronous version of: http://data.ga-group.nl/ics/bics/141111101113
is contemporary version of: http://data.ga-group.nl/ics/bics/1412101113
is replaced by: http://data.ga-group.nl/ics/bics/2020/141111101113
is version of: http://data.ga-group.nl/ics/bics/141111101113
is version of: http://data.ga-group.nl/ics/bics/1412101113
imported on: 2026-06-08T13:03:47.798Z
last refreshed on: 2026-06-08T13:03:47.798Z
source accessed on: 2019-12-03T20:05:01Z
source last accessed on: 2019-12-03T20:05:01Z
label: Finance et crédit bail pour navires et bateaux @fr
label: Financiamento e leasing de navios e barcos @pt
label: Financiamiento y arrendamiento de barcos @es
label: Finanzierung & Leasing von Schiffen & Booten @de
label: Navi e barche finanz e leasing @it
label: Аренда и лизинг кораблей и судов @ru
label: 船只融资与租赁 @zh
label: 船舶融資及租賃 @zh-hant
label: 船舶金融･ﾘｰｽ @ja
label: 배 및 보트 금융 & 리스 @ko
definition: This segment includes companies that rent or lease boats and ships.
notation: 1412101113
valid from: 2014-08-08
valid till: 2020-10-03

Transp Equip Finance & Leasing
type: BicsLevel4SubIndustry
type: Classifier
type: NamedIndividual
is sub industry of: Commercial Finance
is anachronous version of: http://data.ga-group.nl/ics/bics/1411111011
is contemporary version of: http://data.ga-group.nl/ics/bics/14121011
is replaced by: http://data.ga-group.nl/ics/bics/2020/1411111011
is version of: http://data.ga-group.nl/ics/bics/1411111011
is version of: http://data.ga-group.nl/ics/bics/14121011
imported on: 2026-06-08T13:03:47.798Z
last refreshed on: 2026-06-08T13:03:47.798Z
source accessed on: 2019-12-03T20:05:01Z
source last accessed on: 2019-12-03T20:05:01Z
label: App trasp finanz e leasing @it
label: Fin/crédit-bail équipement transp @fr
label: Financiamento e leasing equip transp @pt
label: Financiamiento y arrendamiento de equipo de transporte @es
label: Finanzierung & Leasing von TranspEinr. @de
label: Аренда и лизинг транспор. оборуд. @ru
label: 輸送用機器金融･ﾘｰｽ @ja
label: 运输设备融资与租赁 @zh
label: 運輸設備融資及租賃 @zh-hant
label: 운송장비 금융 & 리스 @ko
definition: This industry subgroup includes companies that provide loans for purchase or contracts permitting the use of non-roadway transportation like aircraft, railroad cars and ocean vessels.
notation: 14121011
valid from: 2014-08-08
valid till: 2020-10-03

Commercial Finance
type: BicsLevel3Industry
type: Classifier
type: NamedIndividual
is industry of: Specialty Finance
is anachronous version of: http://data.ga-group.nl/ics/bics/14111110
is contemporary version of: http://data.ga-group.nl/ics/bics/141210
is replaced by: http://data.ga-group.nl/ics/bics/2020/14111110
is version of: http://data.ga-group.nl/ics/bics/14111110
is version of: http://data.ga-group.nl/ics/bics/141210
imported on: 2026-06-08T13:03:47.798Z
last refreshed on: 2026-06-08T13:03:47.798Z
source accessed on: 2019-12-03T20:05:01Z
source last accessed on: 2019-12-03T20:05:01Z
label: Finan comerc @pt
label: Finan comerciales @es
label: Finance commerciale @fr
label: Finanza commerciale @it
label: Kundenkreditbank @de
label: Коммерч. финанс. @ru
label: 商业金融 @zh
label: 商業金融 @ja
label: 상업금융 @ko
definition: This industry includes companies that provide loans and other financing to businesses. This industry includes commercial and industrial leasing, and transportation equipment leasing.
notation: 141210
valid from: 2014-08-08
valid till: 2020-10-03

Auto Finance
type: BicsLevel4SubIndustry
type: Classifier
type: NamedIndividual
is sub industry of: Consumer Finance
is anachronous version of: http://data.ga-group.nl/ics/bics/1411111110
is contemporary version of: http://data.ga-group.nl/ics/bics/14121110
is replaced by: http://data.ga-group.nl/ics/bics/2020/1411111110
is version of: http://data.ga-group.nl/ics/bics/1411111110
is version of: http://data.ga-group.nl/ics/bics/14121110
imported on: 2026-06-08T13:03:47.798Z
last refreshed on: 2026-06-08T13:03:47.798Z
source accessed on: 2019-12-03T20:05:01Z
source last accessed on: 2019-12-03T20:05:01Z
label: Auto finance @fr
label: Auto-Finanz. @de
label: Finan auto @pt
label: Finanz auto @it
label: Finanzas de autos @es
label: Финансирование приобрет. автомобилей @ru
label: 汽車融資 @zh-hant
label: 汽车金融 @zh
label: 自動車金融 @ja
label: 자동차금융 @ko
definition: This industry subgroup includes companies that originate, service and/or collect auto loans to consumers.
notation: 14121110
valid from: 2014-08-08
valid till: 2020-10-03

Consumer Microlending
type: BicsLevel4SubIndustry
type: Classifier
type: NamedIndividual
is sub industry of: Consumer Finance
is anachronous version of: http://data.ga-group.nl/ics/bics/1411111111
is contemporary version of: http://data.ga-group.nl/ics/bics/14121111
is replaced by: http://data.ga-group.nl/ics/bics/2020/1411111111
is version of: http://data.ga-group.nl/ics/bics/1411111111
is version of: http://data.ga-group.nl/ics/bics/14121111
imported on: 2026-06-08T13:03:47.798Z
last refreshed on: 2026-06-08T13:03:47.798Z
source accessed on: 2019-12-03T20:05:01Z
source last accessed on: 2019-12-03T20:05:01Z
label: Micro-empréstimos ao consumidor @pt
label: Microcrédit à la consommation @fr
label: Micropréstamos al consumidor @es
label: Microprestito consumatore @it
label: Verbraucher-Microlending @de
label: Потребительские микрокредиты @ru
label: 消費性小額貸款 @zh-hant
label: 消費者向け小口融資 @ja
label: 消费性小额贷款 @zh
label: 소비자 소액대출 @ko
definition: This industry subgroup includes companies that provide small amount lending to consumers. Such lending includes payday loans and pawn shop loans. These loans often are made to consumers who have limited access to credit, are short term in duration, have fixed fees and have easy and fast processing.
notation: 14121111
valid from: 2014-08-08
valid till: 2020-10-03

Credit Card Issuing
type: BicsLevel5Segment
type: Classifier
type: NamedIndividual
is level5 segment of: Credit & Debit
is anachronous version of: http://data.ga-group.nl/ics/bics/1411111112
is contemporary version of: http://data.ga-group.nl/ics/bics/1412111210
is replaced by: http://data.ga-group.nl/ics/bics/2020/1411111112
is version of: http://data.ga-group.nl/ics/bics/1411111112
is version of: http://data.ga-group.nl/ics/bics/1412111210
imported on: 2026-06-08T13:03:47.798Z
last refreshed on: 2026-06-08T13:03:47.798Z
source accessed on: 2019-12-03T20:05:01Z
source last accessed on: 2019-12-03T20:05:01Z
label: Emisión tarjet créd @es
label: Emiss carte credito @it
label: Emiss cartes crédit @fr
label: Emissão de cartão de crédito @pt
label: Kreditkartenausstllg @de
label: Выпуск кредитных карт @ru
label: 信用卡发放 @zh
label: 信用卡發行 @zh-hant
label: 신용카드발급업 @ko
label: ｸﾚｼﾞｯﾄｶｰﾄﾞ発行業 @ja
definition: This segment includes companies that issue credit cards.
notation: 1412111210
valid from: 2014-08-08
valid till: 2020-10-03

Financial Transaction Proc Svcs
type: BicsLevel5Segment
type: Classifier
type: NamedIndividual
is level5 segment of: Credit & Debit
is anachronous version of: http://data.ga-group.nl/ics/bics/1411111311
is anachronous version of: http://data.ga-group.nl/ics/bics/1911111210
is contemporary version of: http://data.ga-group.nl/ics/bics/1412111211
is replaced by: http://data.ga-group.nl/ics/bics/2020/1911111210
is version of: http://data.ga-group.nl/ics/bics/1411111311
is version of: http://data.ga-group.nl/ics/bics/1412111211
is version of: http://data.ga-group.nl/ics/bics/1911111210
imported on: 2026-06-08T13:03:47.798Z
last refreshed on: 2026-06-08T13:03:47.798Z
source accessed on: 2019-12-03T20:05:01Z
source last accessed on: 2019-12-03T20:05:01Z
label: Finanztransaktionen Verarbeitungsdienste @de
label: Serv proc de transações financeiras @pt
label: Serv proc transazioni finanziarie @it
label: Serv traitement transac financières @fr
label: Servicios de procesamiento de transacciones financieras @es
label: Услг по обработк. финансовых транзакций @ru
label: 資金決済処理ｻｰﾋﾞｽ @ja
label: 金融交易处理服务 @zh
label: 金融交易處理服務 @zh-hant
label: 금융거래 처리서비스 @ko
definition: This segment includes companies that provide financial transaction processing services, such as electronic payment processing.
notation: 1412111211
valid from: 2014-08-08
valid till: 2020-10-03

Payment Services
type: BicsLevel5Segment
type: Classifier
type: Discontinued
type: NamedIndividual
is level5 segment of: Credit & Debit
is contemporary version of: http://data.ga-group.nl/ics/bics/1412111212
is version of: http://data.ga-group.nl/ics/bics/1412111212
imported on: 2026-06-08T13:03:47.798Z
last refreshed on: 2026-06-08T13:03:47.798Z
source accessed on: 2019-12-03T20:05:01Z
source last accessed on: 2019-12-03T20:05:01Z
label: Serv pgmto @pt
label: Services paiement @fr
label: Servicios de pago @es
label: Servizi pagamento @it
label: Zahlungsdienste @de
label: Услуги по оплате @ru
label: 付款服務 @zh-hant
label: 支付服务 @zh
label: 支払ｻｰﾋﾞｽ @ja
label: 지급서비스업 @ko
definition: This segment includes companies that provide payment services.
notation: 1412111212
valid from: 2014-08-08
valid till: 2020-10-03

Credit & Debit
type: BicsLevel4SubIndustry
type: Classifier
type: Discontinued
type: NamedIndividual
is sub industry of: Consumer Finance
is contemporary version of: http://data.ga-group.nl/ics/bics/14121112
is version of: http://data.ga-group.nl/ics/bics/14121112
imported on: 2026-06-08T13:03:47.798Z
last refreshed on: 2026-06-08T13:03:47.798Z
source accessed on: 2019-12-03T20:05:01Z
source last accessed on: 2019-12-03T20:05:01Z
label: Crédit et débit @fr
label: Crédito e Débito @pt
label: Crédito y débito @es
label: Credito e debito @it
label: Kredit & Debit @de
label: Кредит и дебет @ru
label: 信用及轉帳卡 @zh-hant
label: 借贷 @zh
label: 신용카드 & 직불카드 @ko
label: ｸﾚｼﾞｯﾄ･ﾃﾞﾋﾞｯﾄｶｰﾄﾞ @ja
definition: This industry subgroup includes companies that issue credit and debit cards, or provide financial transaction or payment services.
notation: 14121112
valid from: 2014-08-08
valid till: 2020-10-03

Student Lending
type: BicsLevel4SubIndustry
type: Classifier
type: NamedIndividual
is sub industry of: Consumer Finance
is anachronous version of: http://data.ga-group.nl/ics/bics/1411111113
is contemporary version of: http://data.ga-group.nl/ics/bics/14121113
is replaced by: http://data.ga-group.nl/ics/bics/2020/1411111113
is version of: http://data.ga-group.nl/ics/bics/1411111113
is version of: http://data.ga-group.nl/ics/bics/14121113
imported on: 2026-06-08T13:03:47.798Z
last refreshed on: 2026-06-08T13:03:47.798Z
source accessed on: 2019-12-03T20:05:01Z
source last accessed on: 2019-12-03T20:05:01Z
label: Empr estud @pt
label: Préstamos estudiantiles @es
label: Prêts étudiants @fr
label: Prestiti studenti @it
label: Studentendarlehen @de
label: Студенческое кредитование @ru
label: 学生贷款 @zh
label: 学生ﾛｰﾝ @ja
label: 學生貸款 @zh-hant
label: 학자대출업 @ko
definition: This industry subgroup includes companies that originate, service and/or collect student loans to consumers for educational purposes.
notation: 14121113
valid from: 2014-08-08
valid till: 2020-10-03

Consumer Finance
type: BicsLevel3Industry
type: Classifier
type: NamedIndividual
is industry of: Specialty Finance
is anachronous version of: http://data.ga-group.nl/ics/bics/14111111
is contemporary version of: http://data.ga-group.nl/ics/bics/141211
is replaced by: http://data.ga-group.nl/ics/bics/2020/14111111
is version of: http://data.ga-group.nl/ics/bics/14111111
is version of: http://data.ga-group.nl/ics/bics/141211
imported on: 2026-06-08T13:03:47.798Z
last refreshed on: 2026-06-08T13:03:47.798Z
source accessed on: 2019-12-03T20:05:01Z
source last accessed on: 2019-12-03T20:05:01Z
label: Crédit à la conso @fr
label: Credito al consumo @it
label: Finan cons @pt
label: Finan de consumo @es
label: Privatkundengeschäft @de
label: Потреб. кредиты @ru
label: 消費者金融 @ja
label: 消費金融 @zh-hant
label: 消费金融 @zh
label: 소비자금융 @ko
definition: This industry includes companies that provide loans to consumers. Consumer loans include auto loans, consumer microlending, credit and debit, and student loans.
notation: 141211
valid from: 2014-08-08
valid till: 2020-10-03

Mortgage Lenders
type: BicsLevel4SubIndustry
type: Classifier
type: NamedIndividual
is sub industry of: Mortgage Finance
is anachronous version of: http://data.ga-group.nl/ics/bics/1411111210
is contemporary version of: http://data.ga-group.nl/ics/bics/14121210
is replaced by: http://data.ga-group.nl/ics/bics/2020/1411111210
is version of: http://data.ga-group.nl/ics/bics/1411111210
is version of: http://data.ga-group.nl/ics/bics/14121210
imported on: 2026-06-08T13:03:47.798Z
last refreshed on: 2026-06-08T13:03:47.798Z
source accessed on: 2019-12-03T20:05:01Z
source last accessed on: 2019-12-03T20:05:01Z
label: Conc hipot @pt
label: Hypothekengeber @de
label: Prêteurs hypo @fr
label: Prestamistas hipotecarios @es
label: Prestatori ipoteche @it
label: Ипотечный кредитор @ru
label: 抵押貸款貸方 @zh-hant
label: 抵押贷款机构 @zh
label: 모기지대출업 @ko
label: ﾓｰｹﾞｰｼﾞ融資 @ja
definition: This industry subgroup includes companies that provide home financing services, such as mortgages and home equity loans.
notation: 14121210
valid from: 2014-08-08
valid till: 2020-10-03

Mortgage Loan Brokers
type: BicsLevel4SubIndustry
type: Classifier
type: NamedIndividual
is sub industry of: Mortgage Finance
is anachronous version of: http://data.ga-group.nl/ics/bics/1411111211
is contemporary version of: http://data.ga-group.nl/ics/bics/14121211
is replaced by: http://data.ga-group.nl/ics/bics/2020/1411111211
is version of: http://data.ga-group.nl/ics/bics/1411111211
is version of: http://data.ga-group.nl/ics/bics/14121211
imported on: 2026-06-08T13:03:47.798Z
last refreshed on: 2026-06-08T13:03:47.798Z
source accessed on: 2019-12-03T20:05:01Z
source last accessed on: 2019-12-03T20:05:01Z
label: Brokers de préstamos hipotecarios @es
label: Corretoras de empréstimos hipotecários @pt
label: Courtiers en prêts hypothécaires @fr
label: Hypothekenmakler @de
label: Mediatori prestiti ipotecari @it
label: Брокеры ипотечного кредита @ru
label: 抵押貸款經紀商 @zh-hant
label: 抵押贷款经纪人 @zh
label: 모기지 대출 브로커 @ko
label: ﾓｰｹﾞｰｼﾞﾛｰﾝ仲介 @ja
definition: This industry subgroup includes companies that arrange home loans between borrowers and lenders on a commission or fee basis.
notation: 14121211
valid from: 2014-08-08
valid till: 2020-10-03

Mortgage Services
type: BicsLevel4SubIndustry
type: Classifier
type: NamedIndividual
is sub industry of: Mortgage Finance
is anachronous version of: http://data.ga-group.nl/ics/bics/1411111212
is contemporary version of: http://data.ga-group.nl/ics/bics/14121212
is replaced by: http://data.ga-group.nl/ics/bics/2020/1411111212
is version of: http://data.ga-group.nl/ics/bics/1411111212
is version of: http://data.ga-group.nl/ics/bics/14121212
imported on: 2026-06-08T13:03:47.798Z
last refreshed on: 2026-06-08T13:03:47.798Z
source accessed on: 2019-12-03T20:05:01Z
source last accessed on: 2019-12-03T20:05:01Z
label: Hypothekendienste @de
label: Serv hipotecarios @es
label: Serviços hipotecários @pt
label: Servizi ipotecari @it
label: Srv prêt hypothéc @fr
label: Обслуживание ипотек @ru
label: 抵押貸款服務 @zh-hant
label: 抵押贷款服务 @zh
label: 모기지 서비스 @ko
label: ﾓｰｹﾞｰｼﾞｻｰﾋﾞｽ @ja
definition: This industry subgroup includes companies that provide mortgage services other than mortgage lending or mortgage brokerage services.
notation: 14121212
valid from: 2014-08-08
valid till: 2020-10-03

Mortgage Insurance Premiums
type: BicsLevel5Segment
type: Classifier
type: NamedIndividual
is level5 segment of: Mortgage Insurance
is anachronous version of: http://data.ga-group.nl/ics/bics/141111121310
is contemporary version of: http://data.ga-group.nl/ics/bics/1412121310
is replaced by: http://data.ga-group.nl/ics/bics/2020/141111121310
is version of: http://data.ga-group.nl/ics/bics/141111121310
is version of: http://data.ga-group.nl/ics/bics/1412121310
imported on: 2026-06-08T13:03:47.798Z
last refreshed on: 2026-06-08T13:03:47.798Z
source accessed on: 2019-12-03T20:05:01Z
source last accessed on: 2019-12-03T20:05:01Z
label: Prêmio de seguro hipotecário @pt
label: Premi assicurazione ipotecaria @it
label: Primas hipotecarias de seguros @es
label: Primes pour assurance hypothécaire @fr
label: Versicherungsbeiträge von Hypotheken @de
label: Ипотечное страхование - премии @ru
label: 保険料収入 - ﾓｰｹﾞｰｼﾞ @ja
label: 抵押貸款保險保費 @zh-hant
label: 抵押贷款保险保费 @zh
label: 모기지보험 보험료 @ko
definition: This segment includes premium revenue generated from mortgage insurance business.
notation: 1412121310
valid from: 2014-08-08
valid till: 2020-10-03

Investment Income - Mortg Ins
type: BicsLevel6Segment
type: Classifier
type: NamedIndividual
is level6 segment of: Mortgage Insurance Non-Prem
is anachronous version of: http://data.ga-group.nl/ics/bics/14111112131110
is contemporary version of: http://data.ga-group.nl/ics/bics/141212131110
is replaced by: http://data.ga-group.nl/ics/bics/2020/14111112131110
is version of: http://data.ga-group.nl/ics/bics/14111112131110
is version of: http://data.ga-group.nl/ics/bics/141212131110
imported on: 2026-06-08T13:03:47.798Z
last refreshed on: 2026-06-08T13:03:47.798Z
source accessed on: 2019-12-03T20:05:01Z
source last accessed on: 2019-12-03T20:05:01Z
label: Ingreso de inversión - seg hipot @es
label: Investitionsertrag - HypVers. @de
label: Produit financier - Assurance prêts hypo @fr
label: Receita de investimentos - Seg hipot @pt
label: Reddito investimento - Assic ipot @it
label: Инвестиционный доход - ипотечн. страх. @ru
label: 投資収益-ﾓｰｹﾞｰｼﾞ保険 @ja
label: 投資收入 - 抵押貸款保險 @zh-hant
label: 投资收入-抵押贷款保险 @zh
label: 투자수익-모기지보험 @ko
definition: This segment includes investment income generated from mortgage insurance business.
notation: 141212131110
valid from: 2014-08-08
valid till: 2020-10-03

Realized Gain/Loss - Mortg Ins
type: BicsLevel6Segment
type: Classifier
type: NamedIndividual
is level6 segment of: Mortgage Insurance Non-Prem
is anachronous version of: http://data.ga-group.nl/ics/bics/14111112131111
is contemporary version of: http://data.ga-group.nl/ics/bics/141212131111
is replaced by: http://data.ga-group.nl/ics/bics/2020/14111112131111
is version of: http://data.ga-group.nl/ics/bics/14111112131111
is version of: http://data.ga-group.nl/ics/bics/141212131111
imported on: 2026-06-08T13:03:47.798Z
last refreshed on: 2026-06-08T13:03:47.798Z
source accessed on: 2019-12-03T20:05:01Z
source last accessed on: 2019-12-03T20:05:01Z
label: Beneficio/Pérdida realizada - seguro hipotecario @es
label: Gains/Pertes réalisés - Assur prêts hypo @fr
label: Ganhos/perdas realizados - Seg hipot @pt
label: P/P realizzati - Assic ipot @it
label: Realisierter G/V - HypVers. @de
label: Реализованная прибыль/убытки - ипотечн. страх. @ru
label: 実現損益-ﾓｰｹﾞｰｼﾞ保険 @ja
label: 已实现损益-抵押贷款保险 @zh
label: 已實現損益 - 抵押貸款保險 @zh-hant
label: 실현손익-모기지보험 @ko
definition: This segment includes realized gains/losses generated from mortgage insurance business.
notation: 141212131111
valid from: 2014-08-08
valid till: 2020-10-03

Other Income - Mortgage Ins
type: BicsLevel6Segment
type: Classifier
type: NamedIndividual
is level6 segment of: Mortgage Insurance Non-Prem
is anachronous version of: http://data.ga-group.nl/ics/bics/14111112131112
is contemporary version of: http://data.ga-group.nl/ics/bics/141212131112
is replaced by: http://data.ga-group.nl/ics/bics/2020/14111112131112
is version of: http://data.ga-group.nl/ics/bics/14111112131112
is version of: http://data.ga-group.nl/ics/bics/141212131112
imported on: 2026-06-08T13:03:47.798Z
last refreshed on: 2026-06-08T13:03:47.798Z
source accessed on: 2019-12-03T20:05:01Z
source last accessed on: 2019-12-03T20:05:01Z
label: Altro reddito - assicurazione ipotecaria @it
label: Autres revenus - Assurance prêts hypothécaires @fr
label: Otro ingreso - Seguro hipotecario @es
label: Outras receitas - seguro de hipotecas @pt
label: Sonstiger Ertrag - Hypothekenversicherung @de
label: Прочие доход - Ипотечное страхование @ru
label: その他収益-ﾓｰｹﾞｰｼﾞ保険 @ja
label: 其他收入 - 抵押貸款保險 @zh-hant
label: 其他收入-抵押贷款保险 @zh
label: 기타 수익 - 모기지 보험 @ko
definition: This segment includes other income generated from mortgage insurance business.
notation: 141212131112
valid from: 2014-08-08
valid till: 2020-10-03

Mortgage Insurance Non-Prem
type: BicsLevel5Segment
type: Classifier
type: NamedIndividual
is level5 segment of: Mortgage Insurance
is anachronous version of: http://data.ga-group.nl/ics/bics/141111121311
is contemporary version of: http://data.ga-group.nl/ics/bics/1412121311
is replaced by: http://data.ga-group.nl/ics/bics/2020/141111121311
is version of: http://data.ga-group.nl/ics/bics/141111121311
is version of: http://data.ga-group.nl/ics/bics/1412121311
imported on: 2026-06-08T13:03:47.798Z
last refreshed on: 2026-06-08T13:03:47.798Z
source accessed on: 2019-12-03T20:05:01Z
source last accessed on: 2019-12-03T20:05:01Z
label: Hypothekenversicherung, nicht Beiträge @de
label: Não prêmio de seguro hipotecário @pt
label: Non premi assic ipotecaria @it
label: Rev assur prêts hypo hors primes @fr
label: Seguro hipotecario sin prima @es
label: Ипотечное страхование - неприм. @ru
label: 保険料外収入 - ﾓｰｹﾞｰｼﾞ @ja
label: 抵押貸款保險非保費收入 @zh-hant
label: 抵押贷款保险非保费 @zh
label: 모기지보험 보험료외 @ko
definition: This segment includes total non-premium revenue generated from mortgage insurance business.
notation: 1412121311
valid from: 2014-08-08
valid till: 2020-10-03

Mortgage Insurance
type: BicsLevel4SubIndustry
type: Classifier
type: NamedIndividual
is sub industry of: Mortgage Finance
is anachronous version of: http://data.ga-group.nl/ics/bics/1411111213
is contemporary version of: http://data.ga-group.nl/ics/bics/14121213
is replaced by: http://data.ga-group.nl/ics/bics/2020/1411111213
is version of: http://data.ga-group.nl/ics/bics/1411111213
is version of: http://data.ga-group.nl/ics/bics/14121213
imported on: 2026-06-08T13:03:47.798Z
last refreshed on: 2026-06-08T13:03:47.798Z
source accessed on: 2019-12-03T20:05:01Z
source last accessed on: 2019-12-03T20:05:01Z
label: Assicurazioni ipot @it
label: Assurance hypo @fr
label: Hypothekenversicherung @de
label: Seguro hipot @pt
label: Seguros hipotecarios @es
label: Страхование ипотеки @ru
label: 抵押貸款保險 @zh-hant
label: 抵押贷款保险 @zh
label: 모기지 보험 @ko
label: ﾓｰｹﾞｰｼﾞ保険 @ja
definition: This industry subgroup includes companies that provide insurance to cover losses from defaults on mortgage loans. Also known as private mortgage insurance (PMI).
notation: 14121213
valid from: 2014-08-08
valid till: 2020-10-03

Direct Title Insurance Premiums
type: BicsLevel5Segment
type: Classifier
type: NamedIndividual
is level5 segment of: Title Insurance
is anachronous version of: http://data.ga-group.nl/ics/bics/141111121410
is contemporary version of: http://data.ga-group.nl/ics/bics/1412121410
is replaced by: http://data.ga-group.nl/ics/bics/2020/141111121410
is version of: http://data.ga-group.nl/ics/bics/141111121410
is version of: http://data.ga-group.nl/ics/bics/1412121410
imported on: 2026-06-08T13:03:47.798Z
last refreshed on: 2026-06-08T13:03:47.798Z
source accessed on: 2019-12-03T20:05:01Z
source last accessed on: 2019-12-03T20:05:01Z
label: Direkte Rechtstitelversicherung, Beiträge @de
label: Prêmios de seguro de título direto @pt
label: Premi assicurazione title diretta @it
label: Primas de seguro título directo @es
label: Primes pour assurance directe de titres de propriété @fr
label: Прямое страхование титула - премии @ru
label: 保険料-不動産権原保険 @ja
label: 直接产权保险保费 @zh
label: 直接產權保險保費 @zh-hant
label: 권원보험 보험료 @ko
definition: This segment includes premium revenue generated from direct title business.
notation: 1412121410
valid from: 2014-08-08
valid till: 2020-10-03

Investment Inc - Direct Title Ins
type: BicsLevel6Segment
type: Classifier
type: NamedIndividual
is level6 segment of: Direct Title Insurance Non-Prem
is anachronous version of: http://data.ga-group.nl/ics/bics/14111112141110
is contemporary version of: http://data.ga-group.nl/ics/bics/141212141110
is replaced by: http://data.ga-group.nl/ics/bics/2020/14111112141110
is version of: http://data.ga-group.nl/ics/bics/14111112141110
is version of: http://data.ga-group.nl/ics/bics/141212141110
imported on: 2026-06-08T13:03:47.798Z
last refreshed on: 2026-06-08T13:03:47.798Z
source accessed on: 2019-12-03T20:05:01Z
source last accessed on: 2019-12-03T20:05:01Z
label: Ingreso de inversión - seguro directo de título @es
label: Investitionsertr. - Direkte Rechtstitelvers. @de
label: Prod financier - Assur directe titres de propriété @fr
label: Redd investimento - Assic title diretta @it
label: Renda investimentos - Seg título direto @pt
label: Инвестиц. доход - прямое страхов. титула @ru
label: 投資収益-不動産権原保険 @ja
label: 投資收入 - 直接產權保險 @zh-hant
label: 投资收入-直接产权保险 @zh
label: 투자수익-권원보험 @ko
definition: This segment includes investment income generated from direct title business.
notation: 141212141110
valid from: 2014-08-08
valid till: 2020-10-03

Realized G/L - Direct Title Ins
type: BicsLevel6Segment
type: Classifier
type: NamedIndividual
is level6 segment of: Direct Title Insurance Non-Prem
is anachronous version of: http://data.ga-group.nl/ics/bics/14111112141111
is contemporary version of: http://data.ga-group.nl/ics/bics/141212141111
is replaced by: http://data.ga-group.nl/ics/bics/2020/14111112141111
is version of: http://data.ga-group.nl/ics/bics/14111112141111
is version of: http://data.ga-group.nl/ics/bics/141212141111
imported on: 2026-06-08T13:03:47.798Z
last refreshed on: 2026-06-08T13:03:47.798Z
source accessed on: 2019-12-03T20:05:01Z
source last accessed on: 2019-12-03T20:05:01Z
label: G/P réalisés - Assur directe titres de propriété @fr
label: P/G realizados - Seg título direto @pt
label: P/G realizados - Seguro directo de título @es
label: P/P realizzati - Assic title diretta @it
label: Real. G/V - Direkte Rechtstitelvers. @de
label: Реализованные П/У - прямое страхов. титула @ru
label: 実現損益 -不動産権原保険 @ja
label: 已实现损益-直接产权保险 @zh
label: 已實現損益 - 直接產權保險 @zh-hant
label: 실현손익-권원보험 @ko
definition: This segment includes realized gains/losses generated from direct title business.
notation: 141212141111
valid from: 2014-08-08
valid till: 2020-10-03

Other Income - Direct Title Ins
type: BicsLevel6Segment
type: Classifier
type: NamedIndividual
is level6 segment of: Direct Title Insurance Non-Prem
is anachronous version of: http://data.ga-group.nl/ics/bics/14111112141112
is contemporary version of: http://data.ga-group.nl/ics/bics/141212141112
is replaced by: http://data.ga-group.nl/ics/bics/2020/14111112141112
is version of: http://data.ga-group.nl/ics/bics/14111112141112
is version of: http://data.ga-group.nl/ics/bics/141212141112
imported on: 2026-06-08T13:03:47.798Z
last refreshed on: 2026-06-08T13:03:47.798Z
source accessed on: 2019-12-03T20:05:01Z
source last accessed on: 2019-12-03T20:05:01Z
label: Altro reddito - Assic title diretta @it
label: Autres rev - Assur directe titres de propriété @fr
label: Otro ingreso - seguro directo título @es
label: Outras rendas - Seg título direto @pt
label: Sonst. Ertrag - Direkte Rechtstitelvers. @de
label: Пр. доход - прямое страхование титула @ru
label: その他収益-不動産権原保険 @ja
label: 其他收入 - 直接產權保險 @zh-hant
label: 其他收入-直接产权保险 @zh
label: 기타수익-권원보험 @ko
definition: This segment includes other income generated from direct title business.
notation: 141212141112
valid from: 2014-08-08
valid till: 2020-10-03

Direct Title Insurance Non-Prem
type: BicsLevel5Segment
type: Classifier
type: NamedIndividual
is level5 segment of: Title Insurance
is anachronous version of: http://data.ga-group.nl/ics/bics/141111121411
is contemporary version of: http://data.ga-group.nl/ics/bics/1412121411
is replaced by: http://data.ga-group.nl/ics/bics/2020/141111121411
is version of: http://data.ga-group.nl/ics/bics/141111121411
is version of: http://data.ga-group.nl/ics/bics/1412121411
imported on: 2026-06-08T13:03:47.798Z
last refreshed on: 2026-06-08T13:03:47.798Z
source accessed on: 2019-12-03T20:05:01Z
source last accessed on: 2019-12-03T20:05:01Z
label: Assurance directe titres de propriété hors primes @fr
label: Direkte Rechtstitelversicherung, nicht Beiträge @de
label: Não prêmio de seguro título direto @pt
label: Non premi assicurazione title diretta @it
label: Seguro título directo sin prima @es
label: Прямое страхование титула- неприм. @ru
label: 保険料外収益-不動産権原保険 @ja
label: 直接产权保险非保费 @zh
label: 直接產權保險非保費收入 @zh-hant
label: 권원보험 보험료외 @ko
definition: This segment includes total non-premium revenue generated from direct title business.
notation: 1412121411
valid from: 2014-08-08
valid till: 2020-10-03

Title Insurance
type: BicsLevel4SubIndustry
type: Classifier
type: NamedIndividual
is sub industry of: Mortgage Finance
is anachronous version of: http://data.ga-group.nl/ics/bics/1411111214
is contemporary version of: http://data.ga-group.nl/ics/bics/14121214
is replaced by: http://data.ga-group.nl/ics/bics/2020/1411111214
is version of: http://data.ga-group.nl/ics/bics/1411111214
is version of: http://data.ga-group.nl/ics/bics/14121214
imported on: 2026-06-08T13:03:47.798Z
last refreshed on: 2026-06-08T13:03:47.798Z
source accessed on: 2019-12-03T20:05:01Z
source last accessed on: 2019-12-03T20:05:01Z
label: Assurance tit proprio @fr
label: Rechtstitelversicherung @de
label: Seg título @pt
label: Seguros título @es
label: Страхование правового титула @ru
label: 产权保险 @zh
label: 権原保険 @ja
label: 產權保險 @zh-hant
label: 권원보험 @ko
definition: This industry subgroup includes companies that directly underwrite title insurance policies.
notation: 14121214
valid from: 2014-08-08
valid till: 2020-10-03

Commercial Mortgage - REIT
type: BicsLevel5Segment
type: Classifier
type: NamedIndividual
is level5 segment of: Mortgage REIT
is anachronous version of: http://data.ga-group.nl/ics/bics/141111121510
is contemporary version of: http://data.ga-group.nl/ics/bics/1412121510
is replaced by: http://data.ga-group.nl/ics/bics/2020/141111121510
is version of: http://data.ga-group.nl/ics/bics/141111121510
is version of: http://data.ga-group.nl/ics/bics/1412121510
imported on: 2026-06-08T13:03:47.798Z
last refreshed on: 2026-06-08T13:03:47.798Z
source accessed on: 2019-12-03T20:05:01Z
source last accessed on: 2019-12-03T20:05:01Z
label: Gewerbehypothek - REIT @de
label: Hipoteca comercial - REIT @es
label: Ipoteche commerciali - REIT @it
label: Prêts hypothécaires commerciaux - REIT @fr
label: Коммерческая ипотека - REIT @ru
label: 商业抵押贷款 - REIT @zh
label: 商業不動産ﾓｰｹﾞｰｼﾞ @ja
label: 商���抵押貸款 - REIT @zh-hant
label: 상업용 모기지 - 리츠(REIT) @ko
definition: This segment includes real estate investment trusts (REITs) that invest in commercial mortgage securities.
notation: 1412121510
valid from: 2014-08-08
valid till: 2020-10-03

Residential Mortgage - REIT
type: BicsLevel5Segment
type: Classifier
type: NamedIndividual
is level5 segment of: Mortgage REIT
is anachronous version of: http://data.ga-group.nl/ics/bics/141111121511
is contemporary version of: http://data.ga-group.nl/ics/bics/1412121511
is replaced by: http://data.ga-group.nl/ics/bics/2020/141111121511
is version of: http://data.ga-group.nl/ics/bics/141111121511
is version of: http://data.ga-group.nl/ics/bics/1412121511
imported on: 2026-06-08T13:03:47.798Z
last refreshed on: 2026-06-08T13:03:47.798Z
source accessed on: 2019-12-03T20:05:01Z
source last accessed on: 2019-12-03T20:05:01Z
label: Hipoteca residencial - REIT @es
label: Ipoteche residenziali - REIT @it
label: Prêts hypothécaires résidentiels - REIT @fr
label: Wohnhypothek - REIT @de
label: Жилая ипотека - REIT @ru
label: 住宅不動産ﾓｰｹﾞｰｼﾞ @ja
label: 住宅抵押貸款 - REIT @zh-hant
label: 住宅抵押贷款 - REIT @zh
label: 주거용 모기지 - 리츠(REIT) @ko
definition: This segment includes real estate investment trusts (REITs) that invest in residential mortgage securities.
notation: 1412121511
valid from: 2014-08-08
valid till: 2020-10-03

Mortgage REIT
type: BicsLevel4SubIndustry
type: Classifier
type: NamedIndividual
is sub industry of: Mortgage Finance
is anachronous version of: http://data.ga-group.nl/ics/bics/1411111215
is contemporary version of: http://data.ga-group.nl/ics/bics/14121215
is replaced by: http://data.ga-group.nl/ics/bics/2020/1411111215
is version of: http://data.ga-group.nl/ics/bics/1411111215
is version of: http://data.ga-group.nl/ics/bics/14121215
imported on: 2026-06-08T13:03:47.798Z
last refreshed on: 2026-06-08T13:03:47.798Z
source accessed on: 2019-12-03T20:05:01Z
source last accessed on: 2019-12-03T20:05:01Z
label: Hypotheken-REITs @de
label: REIT hipotecario @es
label: REIT hipotecas @pt
label: REIT ipoteche @it
label: REIT prêts hypothécaires @fr
label: Ипотечные REIT @ru
label: 抵押貸款REIT @zh-hant
label: 抵押贷款REIT @zh
label: 모기지 리츠(REIT) @ko
label: ﾓｰｹﾞｰｼﾞREIT @ja
definition: This industry subgroup includes companies that invest in real estate loans and related securities, and meet the criteria necessary to be eligible for real estate investment trust (REIT) tax status.
notation: 14121215
valid from: 2014-08-08
valid till: 2020-10-03

Mortgage Finance
type: BicsLevel3Industry
type: Classifier
type: NamedIndividual
is industry of: Specialty Finance
is anachronous version of: http://data.ga-group.nl/ics/bics/14111112
is contemporary version of: http://data.ga-group.nl/ics/bics/141212
is replaced by: http://data.ga-group.nl/ics/bics/2020/14111112
is version of: http://data.ga-group.nl/ics/bics/14111112
is version of: http://data.ga-group.nl/ics/bics/141212
imported on: 2026-06-08T13:03:47.798Z
last refreshed on: 2026-06-08T13:03:47.798Z
source accessed on: 2019-12-03T20:05:01Z
source last accessed on: 2019-12-03T20:05:01Z
label: Finan hipotecas @es
label: Finanças hipotec @pt
label: Finanza ipoteche @it
label: Hypothekenfinanz @de
label: Prêts hypothécaires @fr
label: Ипотеч. финансир. @ru
label: 住宅金融 @ja
label: 抵押貸款金融 @zh-hant
label: 抵押金融 @zh
label: 모기지금융 @ko
definition: This industry includes companies that provide mortgage financing services. Such companies include mortgage lenders, mortgage bankers, mortgage real estate investment trusts (REITs), mortgage loan brokers, mortgage insurers and title insurers.
notation: 141212
valid from: 2014-08-08
valid till: 2020-10-03

Corporate Banking - Islamic
type: BicsLevel4SubIndustry
type: Classifier
type: Discontinued
type: NamedIndividual
is sub industry of: Islamic Banking
is contemporary version of: http://data.ga-group.nl/ics/bics/14121310
is version of: http://data.ga-group.nl/ics/bics/14121310
imported on: 2026-06-08T13:03:47.798Z
last refreshed on: 2026-06-08T13:03:47.798Z
source accessed on: 2019-12-03T20:05:01Z
source last accessed on: 2019-12-03T20:05:01Z
label: Banca corporativa - Islámica @es
label: Banca privata - islamica @it
label: Banques d'affaires - Islamique @fr
label: Firmenkundengschäft der Banken - Islamisch @de
label: Serviços bancários corporativos - islâmico @pt
label: Корпоративные банки - Исламские @ru
label: 企業金融 - 伊斯蘭 @zh-hant
label: 公司银行 - 伊斯兰 @zh
label: 기업은행 - 이슬람 @ko
label: ｺｰﾎﾟﾚｰﾄﾊﾞﾝｷﾝｸﾞ-ｲｽﾗﾑ @ja
definition: This industry subgroup includes companies that accept deposits and make loans to corporations and large businesses based on profit participation (non-interest base) in compliance with Shariah law.
notation: 14121310
valid from: 2014-08-08
valid till: 2020-10-03

Investment Banking - Islamic
type: BicsLevel4SubIndustry
type: Classifier
type: Discontinued
type: NamedIndividual
is sub industry of: Islamic Banking
is contemporary version of: http://data.ga-group.nl/ics/bics/14121311
is version of: http://data.ga-group.nl/ics/bics/14121311
imported on: 2026-06-08T13:03:47.798Z
last refreshed on: 2026-06-08T13:03:47.798Z
source accessed on: 2019-12-03T20:05:01Z
source last accessed on: 2019-12-03T20:05:01Z
label: Anlagebankgeschäft - Islamisch @de
label: Banca d'investimento - islamica @it
label: Banca de inversión - Islámica @es
label: Banques d'investissement - Islamique @fr
label: Serviços bancários de investimentos - islâmico @pt
label: Инвестиционные банки - Исламские @ru
label: 投資銀行 - 伊斯蘭 @zh-hant
label: 投资银行 - 伊斯兰 @zh
label: 투자은행 - 이슬람 @ko
label: ｲﾝﾍﾞｽﾄﾒﾝﾄﾊﾞﾝｷﾝｸﾞ-ｲｽﾗﾑ @ja
definition: This industry subgroup includes companies that provide financial advisory and securities underwriting services on a fee basis in compliance with Islamic law, such as Wikala, Ju'ala, Kifala, Ijarah, Istisna, Mudarabah, Special Mudarabah, and Musharakah.
notation: 14121311
valid from: 2014-08-08
valid till: 2020-10-03

Portfolio Management - Islamic
type: BicsLevel4SubIndustry
type: Classifier
type: Discontinued
type: NamedIndividual
is sub industry of: Islamic Banking
is contemporary version of: http://data.ga-group.nl/ics/bics/14121312
is version of: http://data.ga-group.nl/ics/bics/14121312
imported on: 2026-06-08T13:03:47.798Z
last refreshed on: 2026-06-08T13:03:47.798Z
source accessed on: 2019-12-03T20:05:01Z
source last accessed on: 2019-12-03T20:05:01Z
label: Administração de carteira - Islâmico @pt
label: Gestión de cartera - Islámica @es
label: Gestion de portefeuille - Islamique @fr
label: Gestione portafoglio - Islamico @it
label: Portfolio-Management - Islamisch @de
label: Управление портфелем - исламское @ru
label: 投資組合管理 - 伊斯蘭 @zh-hant
label: 投资组合管理-伊斯兰 @zh
label: 포���폴리오운용-이슬람 @ko
label: ﾎﾟｰﾄﾌｫﾘｵ管理-ｲｽﾗﾑ @ja
definition: This industry subgroup includes companies that manage investment portfolios on a commission or fee basis in compliance with Islamic law, such as Wikala, Ju'ala and Kifala.
notation: 14121312
valid from: 2014-08-08
valid till: 2020-10-03

Private Comml Banking - Islamic
type: BicsLevel4SubIndustry
type: Classifier
type: Discontinued
type: NamedIndividual
is sub industry of: Islamic Banking
is contemporary version of: http://data.ga-group.nl/ics/bics/14121313
is version of: http://data.ga-group.nl/ics/bics/14121313
imported on: 2026-06-08T13:03:47.798Z
last refreshed on: 2026-06-08T13:03:47.798Z
source accessed on: 2019-12-03T20:05:01Z
source last accessed on: 2019-12-03T20:05:01Z
label: Banca privada comercial - islámica @es
label: Banche comm private - Islamiche @it
label: Banco com privado - Islâmico @pt
label: Banque comm privée - Islamique @fr
label: Privates Geschäftsbankwesen - Islamisch @de
label: Частные коммерч. банки - исламские @ru
label: 私人商业银行-伊斯兰 @zh
label: 私人商業銀行-伊斯蘭 @zh-hant
label: 민간 일반은행업-이슬람 @ko
label: ﾌﾟﾗｲﾍﾞｰﾄ･ｺﾏｰｼｬﾙ･ﾊﾞﾝｷﾝｸﾞ-ｲｽﾗﾑ系 @ja
definition: This industry subgroup includes commercial banks that provide personalized wealth management services to high net worth individuals (equity partnership) in compliance with Shariah law.
notation: 14121313
valid from: 2014-08-08
valid till: 2020-10-03

Retail Comml Banking - Islamic
type: BicsLevel4SubIndustry
type: Classifier
type: Discontinued
type: NamedIndividual
is sub industry of: Islamic Banking
is contemporary version of: http://data.ga-group.nl/ics/bics/14121314
is version of: http://data.ga-group.nl/ics/bics/14121314
imported on: 2026-06-08T13:03:47.798Z
last refreshed on: 2026-06-08T13:03:47.798Z
source accessed on: 2019-12-03T20:05:01Z
source last accessed on: 2019-12-03T20:05:01Z
label: Banca comercial al por menor - islámica @es
label: Banche comm al dettaglio - Islamiche @it
label: Banque commerc détail - Islamique @fr
label: Retail-Geschäftsbankwesen - Islamisch @de
label: Serviços bancários com varejo - Islâmico @pt
label: Розничные коммерч. банки - исламские @ru
label: 零售商业银行-伊斯兰 @zh
label: 零售商業銀行 - 伊斯蘭 @zh-hant
label: 소매 일반은행업-이슬람 @ko
label: ﾘﾃｰﾙﾊﾞﾝｷﾝｸﾞ-ｲｽﾗﾑ @ja
definition: This industry subgroup includes companies that accept deposits and make loans to retail (individual) customers based on profit participation (non-interest base) in compliance with Shariah law.
notation: 14121314
valid from: 2014-08-08
valid till: 2020-10-03

Sec & Cmdty Banking - Islamic
type: BicsLevel4SubIndustry
type: Classifier
type: Discontinued
type: NamedIndividual
is sub industry of: Islamic Banking
is contemporary version of: http://data.ga-group.nl/ics/bics/14121315
is version of: http://data.ga-group.nl/ics/bics/14121315
imported on: 2026-06-08T13:03:47.798Z
last refreshed on: 2026-06-08T13:03:47.798Z
source accessed on: 2019-12-03T20:05:01Z
source last accessed on: 2019-12-03T20:05:01Z
label: Atividades bancários ativ e cmdty - Islâmico @pt
label: Banca valores y materias primas - Islámicas @es
label: Banche tit e cmdty - Islamiche @it
label: Crtge titres/mat prem - Islamique @fr
label: WP & ROhstoffe Bankwesen - Islamisch @de
label: Ценные бмг и сырьевые товары - исламские @ru
label: 証券･商品先物仲介-ｲｽﾗﾑ @ja
label: 證券及商品經紀 - 伊��蘭 @zh-hant
label: 证券与商品银行-伊斯兰 @zh
label: 증권 & 상품 은행업-이슬람 @ko
definition: This industry subgroup includes companies that buy and sell securities or commodities contracts on a commission or fee basis in compliance with Islamic law, such as Wikala, Ju'ala and Kifala.
notation: 14121315
valid from: 2014-08-08
valid till: 2020-10-03

Trading & Investment - Islamic
type: BicsLevel4SubIndustry
type: Classifier
type: Discontinued
type: NamedIndividual
is sub industry of: Islamic Banking
is contemporary version of: http://data.ga-group.nl/ics/bics/14121316
is version of: http://data.ga-group.nl/ics/bics/14121316
imported on: 2026-06-08T13:03:47.798Z
last refreshed on: 2026-06-08T13:03:47.798Z
source accessed on: 2019-12-03T20:05:01Z
source last accessed on: 2019-12-03T20:05:01Z
label: Handel & Investitionen - Islamisch @de
label: Négociation et investissement - Islamique @fr
label: Negociação e investimento - Islâmico @pt
label: Operaciones e inversión -islámicas @es
label: Trading e investimento - Islamica @it
label: Торговля и инвестиции - исламские @ru
label: 交易与投资-伊斯兰 @zh
label: 交易及投資 - 伊斯蘭 @zh-hant
label: 取引及びﾌﾟﾘﾝｼﾊﾟﾙｲﾝﾍﾞｽﾄﾒﾝﾄ業-ｲｽﾗﾑ @ja
label: 트레이딩 & 투자-이슬람 @ko
definition: This industry subgroup includes companies that buy and sell equities, floating income (Sukuk), currencies, commodities and related securities for client-driven and proprietary trading.
notation: 14121316
valid from: 2014-08-08
valid till: 2020-10-03

Islamic Banking
type: BicsLevel3Industry
type: Classifier
type: NamedIndividual
is industry of: Specialty Finance
is anachronous version of: http://data.ga-group.nl/ics/bics/1410101112
is contemporary version of: http://data.ga-group.nl/ics/bics/141213
is replaced by: http://data.ga-group.nl/ics/bics/2020/1410101112
is version of: http://data.ga-group.nl/ics/bics/1410101112
is version of: http://data.ga-group.nl/ics/bics/141213
imported on: 2026-06-08T13:03:47.798Z
last refreshed on: 2026-06-08T13:03:47.798Z
source accessed on: 2019-12-03T20:05:01Z
source last accessed on: 2019-12-03T20:05:01Z
label: Banca islámica @es
label: Banca islamica @it
label: Banco islâmico @pt
label: Banque islamique @fr
label: Islam. Bankwesen @de
label: Банк. система-Исламск. @ru
label: 伊斯兰银行 @zh
label: 伊斯蘭銀行 @zh-hant
label: 이슬람 은행업 @ko
label: ｲｽﾗﾑ銀行業 @ja
definition: This industry includes companies that provide loans and other financing to businesses in compliance with Shariah law. Such loans cannot charge interest. Instead, the loan is structured using discounts, sale or lease, profit participation, or repurchase agreements.
notation: 141213
valid from: 2014-08-08
valid till: 2020-10-03

Corp, Treasury & Investments
type: BicsLevel4SubIndustry
type: Classifier
type: Discontinued
type: NamedIndividual
is sub industry of: Other Financial Services
is contemporary version of: http://data.ga-group.nl/ics/bics/14121410
is version of: http://data.ga-group.nl/ics/bics/14121410
imported on: 2026-06-08T13:03:47.798Z
last refreshed on: 2026-06-08T13:03:47.798Z
source accessed on: 2019-12-03T20:05:01Z
source last accessed on: 2019-12-03T20:05:01Z
label: Corporação, tesouro e investimentos @pt
label: Corporate, Tesoro e investimenti @it
label: Corporate, Trésor et investissements @fr
label: Corporate, Treasury und Investitionen @de
label: Corporativos, letras e inversiones @es
label: Корпор., фин. -казнач. отдел и инвестиции @ru
label: 企業財務･投資 @ja
label: 公司债、国债与投资 @zh
label: 公司財務及投資 @zh-hant
label: 회사채, 국채 & 투자 @ko
definition: This industry subgroup includes companies that act as principals (excluding investment banks) in the buying or selling of securities for their own portfolios. This includes the internal investment activities of a bank.
notation: 14121410
valid from: 2014-08-08
valid till: 2020-10-03

Receivables Collection & Mgmt
type: BicsLevel4SubIndustry
type: Classifier
type: Discontinued
type: NamedIndividual
is sub industry of: Other Financial Services
is contemporary version of: http://data.ga-group.nl/ics/bics/14121411
is version of: http://data.ga-group.nl/ics/bics/14121411
imported on: 2026-06-08T13:03:47.798Z
last refreshed on: 2026-06-08T13:03:47.798Z
source accessed on: 2019-12-03T20:05:01Z
source last accessed on: 2019-12-03T20:05:01Z
label: Coleta e gest de contas a receber @pt
label: Einziehung & Verwaltung von Ford. @de
label: Gestion et recouvrement des comptes fournisseurs @fr
label: Raccolta e gestione crediti @it
label: Recolección y gestión de cuentas por cobrar @es
label: Сбор и управление дебиторской здлжн @ru
label: 債権回収･管理 @ja
label: 应收账款代收与管理 @zh
label: 應收帳款代收及管理 @zh-hant
label: 미수채권 추심 & 관리 @ko
definition: This industry subgroup includes companies that collect payments for claims and remit collected payments to their clients.
notation: 14121411
valid from: 2014-08-08
valid till: 2020-10-03

Misc. Financial Services
type: BicsLevel4SubIndustry
type: Classifier
type: Discontinued
type: NamedIndividual
is sub industry of: Other Financial Services
is contemporary version of: http://data.ga-group.nl/ics/bics/14121412
is version of: http://data.ga-group.nl/ics/bics/14121412
imported on: 2026-06-08T13:03:47.798Z
last refreshed on: 2026-06-08T13:03:47.798Z
source accessed on: 2019-12-03T20:05:01Z
source last accessed on: 2019-12-03T20:05:01Z
label: Serv financiers divers @fr
label: Serviços financeiros div @pt
label: Servizi finanziari vari @it
label: Sonstige Finanzdienstleistungen @de
label: Varios Servicios financieros @es
label: Разл. фин услуги @ru
label: その他金融ｻｰﾋﾞｽ @ja
label: 其他金融服务 @zh
label: 其他金融服務 @zh-hant
label: 기타 금융서비스 @ko
definition: This industry subgroup includes companies that provide miscellaneous financial services activities not elsewhere classified.
notation: 14121412
valid from: 2014-08-08
valid till: 2020-10-03

Other Financial Services
type: BicsLevel3Industry
type: Classifier
type: NamedIndividual
is industry of: Specialty Finance
is anachronous version of: http://data.ga-group.nl/ics/bics/14111113
is contemporary version of: http://data.ga-group.nl/ics/bics/141214
is replaced by: http://data.ga-group.nl/ics/bics/2020/14111113
is version of: http://data.ga-group.nl/ics/bics/14111113
is version of: http://data.ga-group.nl/ics/bics/141214
imported on: 2026-06-08T13:03:47.798Z
last refreshed on: 2026-06-08T13:03:47.798Z
source accessed on: 2019-12-03T20:05:01Z
source last accessed on: 2019-12-03T20:05:01Z
label: Altri servizi finanziari @it
label: Autres serv financiers @fr
label: Otros servs financ @es
label: Outros serv financ @pt
label: Sonst. Finanzdienste @de
label: Прочие фин. услуги @ru
label: その他金融ｻｰﾋﾞｽ @ja
label: 其他金融服务 @zh
label: 其他金融服務 @zh-hant
label: 기타 금융 서비스 @ko
definition: This industry includes companies that provide other types of financial services, such as corporate, treasury, receivable collections and other financial vehicles.
notation: 141214
valid from: 2014-08-08
valid till: 2020-10-03

Specialty Finance
type: BicsLevel2IndustryGroup
type: Classifier
type: NamedIndividual
is industry group of: Financials
is anachronous version of: http://data.ga-group.nl/ics/bics/141111
is contemporary version of: http://data.ga-group.nl/ics/bics/1412
is replaced by: http://data.ga-group.nl/ics/bics/2020/141111
is version of: http://data.ga-group.nl/ics/bics/141111
is version of: http://data.ga-group.nl/ics/bics/1412
imported on: 2026-06-08T13:03:47.798Z
last refreshed on: 2026-06-08T13:03:47.798Z
source accessed on: 2019-12-03T20:05:01Z
source last accessed on: 2019-12-03T20:05:01Z
label: Finan-espec @pt
label: Finance spécialisée @fr
label: Finanza specializzata @it
label: Finanzas especiales @es
label: Sonderfinanzierung @de
label: Специальные финансовые услуги @ru
label: 特殊金融 @ja
label: 特种金融 @zh
label: 전문금융 @ko
definition: This industry group includes companies that provide specialized lending and financing services. Such specialty finance services include consumer and commercial lending, Islamic banking, mortgage finance, auto/equipment financing, credit card services and other financial services.
notation: 1412
valid from: 2014-08-08
valid till: 2020-10-03

Financial Advisory Services
type: BicsLevel5Segment
type: Classifier
type: NamedIndividual
is level5 segment of: Investment Banking
is anachronous version of: http://data.ga-group.nl/ics/bics/141112101010
is contemporary version of: http://data.ga-group.nl/ics/bics/1413101010
is replaced by: http://data.ga-group.nl/ics/bics/2020/141112101010
is version of: http://data.ga-group.nl/ics/bics/141112101010
is version of: http://data.ga-group.nl/ics/bics/1413101010
imported on: 2026-06-08T13:03:47.798Z
last refreshed on: 2026-06-08T13:03:47.798Z
source accessed on: 2019-12-03T20:05:01Z
source last accessed on: 2019-12-03T20:05:01Z
label: Finanzdienstleistungen @de
label: Servi��os de consultoria financeira @pt
label: Services de conseils financiers @fr
label: Servicios de asesoría financiera @es
label: Servizi di consulenza finanziaria @it
label: Финансово-консультационные услуги @ru
label: 財務顧問服務 @zh-hant
label: 財務顧問ｻｰﾋﾞｽ @ja
label: 财务顾问服务 @zh
label: 재무자문 서비스 @ko
definition: This segment includes companies in the investment banking industry that provide advice on corporate financial matters, including restructuring, merger and acquisitions, financial valuations and litigation.
notation: 1413101010
valid from: 2014-08-08
valid till: 2020-10-03

Debt Underwriting Services
type: BicsLevel6Segment
type: Classifier
type: NamedIndividual
is level6 segment of: Underwriting Services
is anachronous version of: http://data.ga-group.nl/ics/bics/14111210101110
is contemporary version of: http://data.ga-group.nl/ics/bics/141310101110
is replaced by: http://data.ga-group.nl/ics/bics/2020/14111210101110
is version of: http://data.ga-group.nl/ics/bics/14111210101110
is version of: http://data.ga-group.nl/ics/bics/141310101110
imported on: 2026-06-08T13:03:47.798Z
last refreshed on: 2026-06-08T13:03:47.798Z
source accessed on: 2019-12-03T20:05:01Z
source last accessed on: 2019-12-03T20:05:01Z
label: Serviços de subscrição da dívida @pt
label: Services d'émission d'obligations @fr
label: Servicios de colocación de deuda @es
label: Servizi di sottoscrizione debito @it
label: Underwriting-Service: Schulden @de
label: Услуги андеррайтинга долга @ru
label: 债券承销服务 @zh
label: 債券引受ｻｰﾋﾞｽ @ja
label: 債務承銷服務 @zh-hant
label: 채권 주관 서비스 @ko
definition: This segment includes companies in the investment banking industry that provide access to capital through the sale of debt securities.
notation: 141310101110
valid from: 2014-08-08
valid till: 2020-10-03

Equity Underwriting Services
type: BicsLevel6Segment
type: Classifier
type: NamedIndividual
is level6 segment of: Underwriting Services
is anachronous version of: http://data.ga-group.nl/ics/bics/14111210101111
is contemporary version of: http://data.ga-group.nl/ics/bics/141310101111
is replaced by: http://data.ga-group.nl/ics/bics/2020/14111210101111
is version of: http://data.ga-group.nl/ics/bics/14111210101111
is version of: http://data.ga-group.nl/ics/bics/141310101111
imported on: 2026-06-08T13:03:47.798Z
last refreshed on: 2026-06-08T13:03:47.798Z
source accessed on: 2019-12-03T20:05:01Z
source last accessed on: 2019-12-03T20:05:01Z
label: Serviços de subscrição de ações @pt
label: Services d'émission d'actions @fr
label: Servicios de colocación de acciones @es
label: Servizi di sottoscrizione azioni @it
label: Underwriting-Service: Aktien @de
label: Услуги андеррайтинга акций @ru
label: 株式引受ｻｰﾋﾞｽ @ja
label: 股票承銷服務 @zh-hant
label: 股票承销服务 @zh
label: 주식 인수 서비스 @ko
definition: This segment includes companies in the investment banking industry that provide access to capital through the sale of equity securities.
notation: 141310101111
valid from: 2014-08-08
valid till: 2020-10-03

Underwriting Services
type: BicsLevel5Segment
type: Classifier
type: NamedIndividual
is level5 segment of: Investment Banking
is anachronous version of: http://data.ga-group.nl/ics/bics/141112101011
is contemporary version of: http://data.ga-group.nl/ics/bics/1413101011
is replaced by: http://data.ga-group.nl/ics/bics/2020/141112101011
is version of: http://data.ga-group.nl/ics/bics/141112101011
is version of: http://data.ga-group.nl/ics/bics/1413101011
imported on: 2026-06-08T13:03:47.798Z
last refreshed on: 2026-06-08T13:03:47.798Z
source accessed on: 2019-12-03T20:05:01Z
source last accessed on: 2019-12-03T20:05:01Z
label: Serviços de subscrição @pt
label: Services d'émission @fr
label: Servicios de colocación @es
label: Servizi di sottoscrizione @it
label: Underwriting-Service @de
label: Услуги андеррайтинга @ru
label: 引受業 @ja
label: 承銷服務 @zh-hant
label: 承销服务 @zh
label: 주관사 서비스 @ko
definition: This segment includes companies in the investment banking industry that provide access to capital through the sale of debt and equity securities.
notation: 1413101011
valid from: 2014-08-08
valid till: 2020-10-03

Investment Banking
type: BicsLevel4SubIndustry
type: Classifier
type: NamedIndividual
is sub industry of: Brokeraggio istituzionale
is anachronous version of: http://data.ga-group.nl/ics/bics/1411121010
is contemporary version of: http://data.ga-group.nl/ics/bics/14131010
is replaced by: http://data.ga-group.nl/ics/bics/2020/1411121010
is version of: http://data.ga-group.nl/ics/bics/1411121010
is version of: http://data.ga-group.nl/ics/bics/14131010
imported on: 2026-06-08T13:03:47.798Z
last refreshed on: 2026-06-08T13:03:47.798Z
source accessed on: 2019-12-03T20:05:01Z
source last accessed on: 2019-12-03T20:05:01Z
label: Banca inversiones @es
label: Banche investimento @it
label: Banco de Investimento @pt
label: Banque d'affaires @fr
label: Investmentbanking @de
label: Инвестиционные банки @ru
label: 投資銀行業 @ja
label: 投資銀行活動 @zh-hant
label: 投资银行业务活动 @zh
label: 투자은행 영업 @ko
definition: This industry subgroup includes companies that provide financial advisory and securities underwriting services on a fee basis.
notation: 14131010
valid from: 2014-08-08
valid till: 2020-10-03

Commodities Brokerage
type: BicsLevel5Segment
type: Classifier
type: NamedIndividual
is level5 segment of: Security & Commodity Brokerage
is anachronous version of: http://data.ga-group.nl/ics/bics/141112101110
is contemporary version of: http://data.ga-group.nl/ics/bics/1413101110
is replaced by: http://data.ga-group.nl/ics/bics/2020/141112101110
is version of: http://data.ga-group.nl/ics/bics/141112101110
is version of: http://data.ga-group.nl/ics/bics/1413101110
imported on: 2026-06-08T13:03:47.798Z
last refreshed on: 2026-06-08T13:03:47.798Z
source accessed on: 2019-12-03T20:05:01Z
source last accessed on: 2019-12-03T20:05:01Z
label: Brokeraggio commodity @it
label: Corretagem de commodities @pt
label: Corretaje de materias primas @es
label: Courtage en matières premières @fr
label: Rohstoffmakler @de
label: Брокерские операции с сырьевыми товарами @ru
label: 商品先物仲介 @ja
label: 商品經紀 @zh-hant
label: 商品经纪公司 @zh
label: 상품 중개업 @ko
definition: This segment includes companies that buy and sell commodity contracts and options on a commission or fee basis.
notation: 1413101110
valid from: 2014-08-08
valid till: 2020-10-03

Instl Securities Brokerage
type: BicsLevel5Segment
type: Classifier
type: NamedIndividual
is level5 segment of: Security & Commodity Brokerage
is anachronous version of: http://data.ga-group.nl/ics/bics/141112101111
is contemporary version of: http://data.ga-group.nl/ics/bics/1413101111
is replaced by: http://data.ga-group.nl/ics/bics/2020/141112101111
is version of: http://data.ga-group.nl/ics/bics/141112101111
is version of: http://data.ga-group.nl/ics/bics/1413101111
imported on: 2026-06-08T13:03:47.798Z
last refreshed on: 2026-06-08T13:03:47.798Z
source accessed on: 2019-12-03T20:05:01Z
source last accessed on: 2019-12-03T20:05:01Z
label: Activité de courtage institutionnel @fr
label: Brokeraggio di titoli istituzionali @it
label: Corretagem de ativos institucionais @pt
label: Corretaje institucional de valores @es
label: Maklergesellschaft für institutionelle Wertpapiere @de
label: Институциональные брокерские операции с ЦБ @ru
label: 机构证券经纪 @zh
label: 機構證券經紀 @zh-hant
label: 機関投資家向け証券仲介 @ja
label: 기관 증권 중개업 @ko
definition: This segment includes companies that buy and sell securities for institutional investors on a commission or fee basis.
notation: 1413101111
valid from: 2014-08-08
valid till: 2020-10-03

Security & Commodity Brokerage
type: BicsLevel4SubIndustry
type: Classifier
type: NamedIndividual
is sub industry of: Brokeraggio istituzionale
is anachronous version of: http://data.ga-group.nl/ics/bics/1411121011
is contemporary version of: http://data.ga-group.nl/ics/bics/14131011
is replaced by: http://data.ga-group.nl/ics/bics/2020/1411121011
is version of: http://data.ga-group.nl/ics/bics/1411121011
is version of: http://data.ga-group.nl/ics/bics/14131011
imported on: 2026-06-08T13:03:47.798Z
last refreshed on: 2026-06-08T13:03:47.798Z
source accessed on: 2019-12-03T20:05:01Z
source last accessed on: 2019-12-03T20:05:01Z
label: Actividades de corretaje de valores y materias primas @es
label: Brokeraggio titoli e commodity @it
label: Corretagem de commodities e ativos @pt
label: Courtage en titres et mat prem @fr
label: Wertpapier- & Commodity-Brokerage @de
label: Ценные бмг и сырьевые товары @ru
label: 証券･商品先物仲介 @ja
label: 證券及商品經紀 @zh-hant
label: 证券与商品经纪 @zh
label: 증권 & 상품 중개업 @ko
definition: This industry subgroup includes companies that buy and sell securities or commodities contracts and options on a commission or fee basis.
notation: 14131011
valid from: 2014-08-08
valid till: 2020-10-03

Equities Trading
type: BicsLevel5Segment
type: Classifier
type: NamedIndividual
is level5 segment of: Trading & Principal Investment
is anachronous version of: http://data.ga-group.nl/ics/bics/141112101210
is contemporary version of: http://data.ga-group.nl/ics/bics/1413101210
is replaced by: http://data.ga-group.nl/ics/bics/2020/141112101210
is version of: http://data.ga-group.nl/ics/bics/141112101210
is version of: http://data.ga-group.nl/ics/bics/1413101210
imported on: 2026-06-08T13:03:47.798Z
last refreshed on: 2026-06-08T13:03:47.798Z
source accessed on: 2019-12-03T20:05:01Z
source last accessed on: 2019-12-03T20:05:01Z
label: Aktienhandel @de
label: Négociation d'actions @fr
label: Negociação de ações @pt
label: Operaciones de acciones @es
label: Trading azioni @it
label: Торговля акциями @ru
label: 株式取引業 @ja
label: 股票交易 @zh
label: 주식 트레이딩 @ko
definition: This segment includes companies that buy and sell equity securities for market-making, and provide specialist activities, in addition to trading their own principal investments.
notation: 1413101210
valid from: 2014-08-08
valid till: 2020-10-03

Commodities Contract Dealing
type: BicsLevel6Segment
type: Classifier
type: NamedIndividual
is level6 segment of: Fixed Income, Crncy & Cmdty
is anachronous version of: http://data.ga-group.nl/ics/bics/141112101211
is contemporary version of: http://data.ga-group.nl/ics/bics/141310121110
is replaced by: http://data.ga-group.nl/ics/bics/2020/141112101211
is version of: http://data.ga-group.nl/ics/bics/141112101211
is version of: http://data.ga-group.nl/ics/bics/141310121110
imported on: 2026-06-08T13:03:47.798Z
last refreshed on: 2026-06-08T13:03:47.798Z
source accessed on: 2019-12-03T20:05:01Z
source last accessed on: 2019-12-03T20:05:01Z
label: Négociation de contrats de commodities @fr
label: Negociação contratual de commodities @pt
label: Negociación de contratos de materias primas @es
label: Operaz contratti materie prime @it
label: Rohstoffkontrakthandel @de
label: Дилерская деательность с сырьевыми контрактами @ru
label: 商品先物取引業 @ja
label: 商品合約交易 @zh-hant
label: 商品合约经纪 @zh
label: 상품 계약 거래 @ko
definition: This segment includes companies that buy and sell commodities and commodity-related securities for client-driven and proprietary trading.
notation: 141310121110
valid from: 2014-08-08
valid till: 2020-10-03

Currencies Trading
type: BicsLevel6Segment
type: Classifier
type: NamedIndividual
is level6 segment of: Fixed Income, Crncy & Cmdty
is anachronous version of: http://data.ga-group.nl/ics/bics/141112101212
is contemporary version of: http://data.ga-group.nl/ics/bics/141310121111
is replaced by: http://data.ga-group.nl/ics/bics/2020/141112101212
is version of: http://data.ga-group.nl/ics/bics/141112101212
is version of: http://data.ga-group.nl/ics/bics/141310121111
imported on: 2026-06-08T13:03:47.798Z
last refreshed on: 2026-06-08T13:03:47.798Z
source accessed on: 2019-12-03T20:05:01Z
source last accessed on: 2019-12-03T20:05:01Z
label: Devisenhandel @de
label: Negociação de moedas @pt
label: Operaciones divisas @es
label: Trading de devises @fr
label: Trading delle valute @it
label: Торговля валютой @ru
label: 外匯交易 @zh-hant
label: 外国為替取引 @ja
label: 外汇交易 @zh
label: 통화 트레이딩 @ko
definition: This segment includes companies that buy and sell currencies in the cash and derivatives markets for client-driven and proprietary trading.
notation: 141310121111
valid from: 2014-08-08
valid till: 2020-10-03

Fixed Income Trading
type: BicsLevel6Segment
type: Classifier
type: NamedIndividual
is level6 segment of: Fixed Income, Crncy & Cmdty
is anachronous version of: http://data.ga-group.nl/ics/bics/141112101213
is contemporary version of: http://data.ga-group.nl/ics/bics/141310121112
is replaced by: http://data.ga-group.nl/ics/bics/2020/141112101213
is version of: http://data.ga-group.nl/ics/bics/141112101213
is version of: http://data.ga-group.nl/ics/bics/141310121112
imported on: 2026-06-08T13:03:47.798Z
last refreshed on: 2026-06-08T13:03:47.798Z
source accessed on: 2019-12-03T20:05:01Z
source last accessed on: 2019-12-03T20:05:01Z
label: Negociação de renda fixa @pt
label: Operación renta fija @es
label: Rentenhandel @de
label: Trading obligataire @fr
label: Trading redd fisso @it
label: Торги фикс. доходом @ru
label: 债券交易 @zh
label: 債券取引 @ja
label: 固定收益-交易 @zh-hant
label: 채권매매 @ko
definition: This segment includes companies that buy and sell fixed income securities and other interest rate products for client-driven and proprietary trading.
notation: 141310121112
valid from: 2014-08-08
valid till: 2020-10-03

Fixed Income, Crncy & Cmdty
type: BicsLevel5Segment
type: Classifier
type: Discontinued
type: NamedIndividual
is level5 segment of: Trading & Principal Investment
is contemporary version of: http://data.ga-group.nl/ics/bics/1413101211
is version of: http://data.ga-group.nl/ics/bics/1413101211
imported on: 2026-06-08T13:03:47.798Z
last refreshed on: 2026-06-08T13:03:47.798Z
source accessed on: 2019-12-03T20:05:01Z
source last accessed on: 2019-12-03T20:05:01Z
label: Festverzinsliche, Währung & Rohstoffe @de
label: Obligataire, dev et mat prem @fr
label: Reddito fisso, valute e Cmdty @it
label: Renda fixa, md e cmdty @pt
label: Renta fija, divisas y materias primas @es
label: Фикс. доход, влт и сырьев. твр @ru
label: 债券、货币与商品 @zh
label: 債券･通貨･商品先物 @ja
label: 固定收益、貨幣及商品 @zh-hant
label: 채권, 통화 & 상품 @ko
definition: This segment includes companies that buy and sell fixed income, currencies and commodities and related securities for client-driven and proprietary trading.
notation: 1413101211
valid from: 2014-08-08
valid till: 2020-10-03

Other Trading Activities
type: BicsLevel5Segment
type: Classifier
type: Discontinued
type: NamedIndividual
is level5 segment of: Trading & Principal Investment
is contemporary version of: http://data.ga-group.nl/ics/bics/1413101212
is version of: http://data.ga-group.nl/ics/bics/1413101212
imported on: 2026-06-08T13:03:47.798Z
last refreshed on: 2026-06-08T13:03:47.798Z
source accessed on: 2019-12-03T20:05:01Z
source last accessed on: 2019-12-03T20:05:01Z
label: Altre attività di trading @it
label: Autres activités de négociation @fr
label: Otras actividades de operaciones @es
label: Outras atividades de negociação @pt
label: Sonstige Handelsgeschäfte @de
label: Прочая торговая деятельность @ru
label: その他取引業 @ja
label: 其他交易活动 @zh
label: 其他交易活動 @zh-hant
label: 기타 거래활동 @ko
definition: This segment includes companies that buy and sell financial instruments not elsewhere classified.
notation: 1413101212
valid from: 2014-08-08
valid till: 2020-10-03

Trading & Principal Investment
type: BicsLevel4SubIndustry
type: Classifier
type: NamedIndividual
is sub industry of: Brokeraggio istituzionale
is anachronous version of: http://data.ga-group.nl/ics/bics/1411121012
is contemporary version of: http://data.ga-group.nl/ics/bics/14131012
is replaced by: http://data.ga-group.nl/ics/bics/2020/1411121012
is version of: http://data.ga-group.nl/ics/bics/1411121012
is version of: http://data.ga-group.nl/ics/bics/14131012
imported on: 2026-06-08T13:03:47.798Z
last refreshed on: 2026-06-08T13:03:47.798Z
source accessed on: 2019-12-03T20:05:01Z
source last accessed on: 2019-12-03T20:05:01Z
label: Handel & Kapitalinvestitionen @de
label: Inversión de operaciones y principal @es
label: Investimento principal e negociação @pt
label: Négociation et investissement de capital @fr
label: Trading e investimento capitale @it
label: Торговля и инвестиции @ru
label: 交易与本金投资 @zh
label: 交易及自營投資 @zh-hant
label: 取引及びﾌﾟﾘﾝｼﾊﾟﾙｲﾝﾍﾞｽﾄﾒﾝﾄ業 @ja
label: 트레이딩 & 자기자본투자 @ko
definition: This industry subgroup includes companies that buy and sell equities, fixed income, currencies, commodities and related securities for client-driven and proprietary trading.
notation: 14131012
valid from: 2014-08-08
valid till: 2020-10-03

Brokeraggio istituzionale
type: BicsLevel3Industry
type: Classifier
type: NamedIndividual
is industry of: Institutional Financial Svcs
is anachronous version of: http://data.ga-group.nl/ics/bics/14111210
is contemporary version of: http://data.ga-group.nl/ics/bics/141310
is replaced by: http://data.ga-group.nl/ics/bics/2020/14111210
is version of: http://data.ga-group.nl/ics/bics/14111210
is version of: http://data.ga-group.nl/ics/bics/141310
imported on: 2026-06-08T13:03:47.798Z
last refreshed on: 2026-06-08T13:03:47.798Z
source accessed on: 2019-12-03T20:05:01Z
source last accessed on: 2019-12-03T20:05:01Z
label: Corret inst @pt
label: Corretaje instit @es
label: Courtage institutionnel @fr
label: Institutional Brokerage
label: Институц. брок. услуги @ru
label: 机构经纪商 @zh
label: 機構經紀 @zh-hant
label: 機関投資家向け証券仲介 @ja
label: 기관 중개업 @ko
definition: This industry includes companies that provide brokerage services to institutional investors. Institutional investors buy or sell securities on behalf of organizations, such as banks, insurance companies, hedge funds, pension funds and mutual funds.
notation: 141310
valid from: 2014-08-08
valid till: 2020-10-03

Asset & Investment Servicing
type: BicsLevel4SubIndustry
type: Classifier
type: NamedIndividual
is sub industry of: Instl Trust, Fiduciary & Custody
is anachronous version of: http://data.ga-group.nl/ics/bics/1411121110
is contemporary version of: http://data.ga-group.nl/ics/bics/14131110
is replaced by: http://data.ga-group.nl/ics/bics/2020/1411121110
is version of: http://data.ga-group.nl/ics/bics/1411121110
is version of: http://data.ga-group.nl/ics/bics/14131110
imported on: 2026-06-08T13:03:47.798Z
last refreshed on: 2026-06-08T13:03:47.798Z
source accessed on: 2019-12-03T20:05:01Z
source last accessed on: 2019-12-03T20:05:01Z
label: Administration d'actifs et placements @fr
label: Asset- & Investitionsdienstleistungen @de
label: Serv attivi e investimenti @it
label: Serviços de investimentos e ativos @pt
label: Servicio de activos e inversiones @es
label: Обслуж. активов и инвестиций @ru
label: 資產及投資服務 @zh-hant
label: 資産･投資ｻｰﾋﾞｼﾝｸﾞ @ja
label: 资产与投资服务 @zh
label: 자산 & 투자서비스 @ko
definition: This industry subgroup includes companies that provide investment and other asset services on a fee basis.
notation: 14131110
valid from: 2014-08-08
valid till: 2020-10-03

Execution & Clearing Services
type: BicsLevel4SubIndustry
type: Classifier
type: NamedIndividual
is sub industry of: Instl Trust, Fiduciary & Custody
is anachronous version of: http://data.ga-group.nl/ics/bics/1411121111
is contemporary version of: http://data.ga-group.nl/ics/bics/14131111
is replaced by: http://data.ga-group.nl/ics/bics/2020/1411121111
is version of: http://data.ga-group.nl/ics/bics/1411121111
is version of: http://data.ga-group.nl/ics/bics/14131111
imported on: 2026-06-08T13:03:47.798Z
last refreshed on: 2026-06-08T13:03:47.798Z
source accessed on: 2019-12-03T20:05:01Z
source last accessed on: 2019-12-03T20:05:01Z
label: Ausführungs- & Clearing-Services @de
label: Serviços de compensação e execução @pt
label: Services d'exécution et de compensation @fr
label: Servicios de ejecución y compensación @es
label: Servizi compensazione ed esecuzione @it
label: Клир. усл. и услуги исполн. @ru
label: 執行及清算服務 @zh-hant
label: 執行･清算ｻｰﾋﾞｽ @ja
label: 执行与清算服务 @zh
label: 체결 & 청산서비스 @ko
definition: This industry subgroup includes companies that provide trade execution and clearance services on a fee basis.
notation: 14131111
valid from: 2014-08-08
valid till: 2020-10-03

Issuer Services
type: BicsLevel4SubIndustry
type: Classifier
type: NamedIndividual
is sub industry of: Instl Trust, Fiduciary & Custody
is anachronous version of: http://data.ga-group.nl/ics/bics/1411121112
is contemporary version of: http://data.ga-group.nl/ics/bics/14131112
is replaced by: http://data.ga-group.nl/ics/bics/2020/1411121112
is version of: http://data.ga-group.nl/ics/bics/1411121112
is version of: http://data.ga-group.nl/ics/bics/14131112
imported on: 2026-06-08T13:03:47.798Z
last refreshed on: 2026-06-08T13:03:47.798Z
source accessed on: 2019-12-03T20:05:01Z
source last accessed on: 2019-12-03T20:05:01Z
label: Emittentendienste @de
label: Serviços do emissor @pt
label: Services d'émetteurs @fr
label: Servicios de emisor @es
label: Servizi emissione @it
label: Услуги эмитента @ru
label: 发行人服务 @zh
label: 発行体ｻｰﾋﾞｽ @ja
label: 發行人服務 @zh-hant
label: 발행사 서비스 @ko
definition: This industry subgroup includes companies that provide securities issuance and related services on a fee basis.
notation: 14131112
valid from: 2014-08-08
valid till: 2020-10-03

Transaction Services
type: BicsLevel4SubIndustry
type: Classifier
type: NamedIndividual
is sub industry of: Instl Trust, Fiduciary & Custody
is anachronous version of: http://data.ga-group.nl/ics/bics/1411121113
is contemporary version of: http://data.ga-group.nl/ics/bics/14131113
is replaced by: http://data.ga-group.nl/ics/bics/2020/1411121113
is version of: http://data.ga-group.nl/ics/bics/1411121113
is version of: http://data.ga-group.nl/ics/bics/14131113
imported on: 2026-06-08T13:03:47.798Z
last refreshed on: 2026-06-08T13:03:47.798Z
source accessed on: 2019-12-03T20:05:01Z
source last accessed on: 2019-12-03T20:05:01Z
label: Serviços de transação @pt
label: Services de transactions @fr
label: Servicios de transaccuiones @es
label: Servizi transazioni @it
label: Transaktionsdienste @de
label: Услуги обработки финансовых транзакций @ru
label: 交易服务 @zh
label: 交易服務 @zh-hant
label: 取���事務処理ｻｰﾋﾞｽ @ja
label: 거래처리 서비스 @ko
definition: This industry subgroup includes companies that provide cash management, funds transfer or liquidity management services on a fee basis.
notation: 14131113
valid from: 2014-08-08
valid till: 2020-10-03

Instl Trust, Fiduciary & Custody
type: BicsLevel3Industry
type: Classifier
type: NamedIndividual
is industry of: Institutional Financial Svcs
is anachronous version of: http://data.ga-group.nl/ics/bics/14111211
is contemporary version of: http://data.ga-group.nl/ics/bics/141311
is replaced by: http://data.ga-group.nl/ics/bics/2020/14111211
is version of: http://data.ga-group.nl/ics/bics/14111211
is version of: http://data.ga-group.nl/ics/bics/141311
imported on: 2026-06-08T13:03:47.798Z
last refreshed on: 2026-06-08T13:03:47.798Z
source accessed on: 2019-12-03T20:05:01Z
source last accessed on: 2019-12-03T20:05:01Z
label: Ativ cust, fiduc e truste inst @pt
label: Fideicomisos, fiduciarios y custodios inst @es
label: Fiduciari ist e custodia @it
label: Inst. Trust, Treuhand & Verwahrung @de
label: Trust, fiducie, garde - Instit @fr
label: Инст. траст., фидуц. и попеч. деят. @ru
label: 机构信托、信托与托管 @zh
label: 機構信託活動 @zh-hant
label: 機関���資家向け信託･受託･保管業 @ja
label: 기관 신탁, 수탁 & 보관업 @ko
definition: This industry includes companies that are authorized to hold assets in trust and provide services for registering securities and transferring ownership.
notation: 141311
valid from: 2014-08-08
valid till: 2020-10-03

Security & Cmdty Exchanges
type: BicsLevel3Industry
type: Classifier
type: NamedIndividual
is industry of: Institutional Financial Svcs
is anachronous version of: http://data.ga-group.nl/ics/bics/14111212
is contemporary version of: http://data.ga-group.nl/ics/bics/141312
is replaced by: http://data.ga-group.nl/ics/bics/2020/14111212
is version of: http://data.ga-group.nl/ics/bics/14111212
is version of: http://data.ga-group.nl/ics/bics/141312
imported on: 2026-06-08T13:03:47.798Z
last refreshed on: 2026-06-08T13:03:47.798Z
source accessed on: 2019-12-03T20:05:01Z
source last accessed on: 2019-12-03T20:05:01Z
label: Bolsas cmdty e ativos @pt
label: Bolsas val/mat pr @es
label: Borse azioni/commodity @it
label: Bourses de valeurs/mat prem @fr
label: WP- & Rohstoffbörsen @de
label: Фондовые и товарные биржи @ru
label: 証券･商品先物取引 @ja
label: 證券及商品交易所 @zh-hant
label: 证券与商品交易所 @zh
label: 증권 & 상품 거래소 @ko
definition: This industry includes firms that operate a marketplace for the buying and selling of securities, commodities or other financial instruments.
notation: 141312
valid from: 2014-08-08
valid till: 2020-10-03

Institutional Financial Svcs
type: BicsLevel2IndustryGroup
type: Classifier
type: NamedIndividual
is industry group of: Financials
is anachronous version of: http://data.ga-group.nl/ics/bics/141112
is contemporary version of: http://data.ga-group.nl/ics/bics/1413
is replaced by: http://data.ga-group.nl/ics/bics/2020/141112
is version of: http://data.ga-group.nl/ics/bics/141112
is version of: http://data.ga-group.nl/ics/bics/1413
imported on: 2026-06-08T13:03:47.798Z
last refreshed on: 2026-06-08T13:03:47.798Z
source accessed on: 2019-12-03T20:05:01Z
source last accessed on: 2019-12-03T20:05:01Z
label: Institutionelle Finanzdienstleistungen @de
label: Serv financeiros institucionais @pt
label: Serv financiers institut @fr
label: Serv finanziari istituzionali @it
label: Servicios financieros institucionales @es
label: Институц. финансовые услуги @ru
label: 机构金融服务 @zh
label: 機構金融服務 @zh-hant
label: 機関投資家向け金融ｻｰﾋﾞｽ @ja
label: 기관 금융서비스 @ko
definition: This industry group includes companies that provide investment banking and institutional brokerage services or are involved in the buying and selling of equities, fixed income, currencies, commodities and related securities for client-driven and proprietary trading.
notation: 1413
valid from: 2014-08-08
valid till: 2020-10-03

Protection Prods Premiums
type: BicsLevel5Segment
type: Classifier
type: NamedIndividual
is level5 segment of: Life Insurance Premiums
is anachronous version of: http://data.ga-group.nl/ics/bics/141210101010
is contemporary version of: http://data.ga-group.nl/ics/bics/1414101010
is replaced by: http://data.ga-group.nl/ics/bics/2020/141210101010
is version of: http://data.ga-group.nl/ics/bics/141210101010
is version of: http://data.ga-group.nl/ics/bics/1414101010
imported on: 2026-06-08T13:03:47.798Z
last refreshed on: 2026-06-08T13:03:47.798Z
source accessed on: 2019-12-03T20:05:01Z
source last accessed on: 2019-12-03T20:05:01Z
label: Prêmios de prod proteção @pt
label: Premi prod protezione @it
label: Primas de productos de protección @es
label: Primes prod protection @fr
label: Schutzprod., Beiträge @de
label: Продукты защиты - премии @ru
label: 保护产品保费 @zh
label: 保障商品ｰ保険料 @ja
label: 保障型產品保費 @zh-hant
label: 보장형상품 보험료 @ko
definition: This segment includes premium income generated from life insurance protection products, including individual and group life, accidental death, and disability policies.
notation: 1414101010
valid from: 2014-08-08
valid till: 2020-10-03

Saving & Retire Prods Premiums
type: BicsLevel5Segment
type: Classifier
type: NamedIndividual
is level5 segment of: Life Insurance Premiums
is anachronous version of: http://data.ga-group.nl/ics/bics/141210101011
is contemporary version of: http://data.ga-group.nl/ics/bics/1414101011
is replaced by: http://data.ga-group.nl/ics/bics/2020/141210101011
is version of: http://data.ga-group.nl/ics/bics/141210101011
is version of: http://data.ga-group.nl/ics/bics/1414101011
imported on: 2026-06-08T13:03:47.798Z
last refreshed on: 2026-06-08T13:03:47.798Z
source accessed on: 2019-12-03T20:05:01Z
source last accessed on: 2019-12-03T20:05:01Z
label: Prêmios prod aposentadoria e poupança @pt
label: Premi prod risparmio e pensione @it
label: Primas de ahorros y productos de jubilación @es
label: Prime prod épargne et retraite @fr
label: Spar- & Ruhestandsbeiträge @de
label: Сберегат. и пенс. прод. - премии @ru
label: 储蓄与退休产品保费 @zh
label: 儲蓄及退休產品保費 @zh-hant
label: 預金･退職後資金商品-ﾌﾟﾚﾐｱﾑ @ja
label: 저축 & 퇴직상품 보험료 @ko
definition: This segment includes premium income generated from life insurance savings and retirement products, including individual and group fixed and variable annuities.
notation: 1414101011
valid from: 2014-08-08
valid till: 2020-10-03

Life Insurance Premiums
type: BicsLevel4SubIndustry
type: Classifier
type: NamedIndividual
is sub industry of: Life Insurance
is anachronous version of: http://data.ga-group.nl/ics/bics/1412101010
is contemporary version of: http://data.ga-group.nl/ics/bics/14141010
is replaced by: http://data.ga-group.nl/ics/bics/2020/1412101010
is version of: http://data.ga-group.nl/ics/bics/1412101010
is version of: http://data.ga-group.nl/ics/bics/14141010
imported on: 2026-06-08T13:03:47.798Z
last refreshed on: 2026-06-08T13:03:47.798Z
source accessed on: 2019-12-03T20:05:01Z
source last accessed on: 2019-12-03T20:05:01Z
label: Lebensversicherungsbeiträge @de
label: Prêmios de seguro de vida @pt
label: Premi assicurazione vita @it
label: Primas de seguros de vida @es
label: Primes pour assurance-vie @fr
label: Страхование жизни - премии @ru
label: 人壽保險保費 @zh-hant
label: 寿险保费 @zh
label: 生命保険-保険料 @ja
label: 생명보험보험료 @ko
definition: This industry subgroup includes premium income generated from life insurance products, including life, accidental death, disability and annuities.
notation: 14141010
valid from: 2014-08-08
valid till: 2020-10-03

Fees & Other Income - Life Ins
type: BicsLevel5Segment
type: Classifier
type: NamedIndividual
is level5 segment of: Life Insurance Non-Premium
is anachronous version of: http://data.ga-group.nl/ics/bics/141210101114
is contemporary version of: http://data.ga-group.nl/ics/bics/1414101110
is replaced by: http://data.ga-group.nl/ics/bics/2020/141210101114
is version of: http://data.ga-group.nl/ics/bics/141210101114
is version of: http://data.ga-group.nl/ics/bics/1414101110
imported on: 2026-06-08T13:03:47.798Z
last refreshed on: 2026-06-08T13:03:47.798Z
source accessed on: 2019-12-03T20:05:01Z
source last accessed on: 2019-12-03T20:05:01Z
label: Commissioni e altro reddito - Assic vita @it
label: Frais et autres revenus - Assur-vie @fr
label: Gebühren & sonstige Einkünfte - Lebensvers. @de
label: Tarifas y otro ingreso - seguro de vida @es
label: Taxas e outras receitas - Seg vida @pt
label: Сборы и прочий доход - страх. жизни @ru
label: 手数料･その他収益-生命保険 @ja
label: 手续费与其他收入-寿险 @zh
label: 費用及其他收入 - 人壽保險 @zh-hant
label: 수수료 & 기타 수익-생보 @ko
definition: This segment includes other income generated from direct life business.
notation: 1414101110
valid from: 2014-08-08
valid till: 2020-10-03

Investment Income - Life Ins
type: BicsLevel5Segment
type: Classifier
type: NamedIndividual
is level5 segment of: Life Insurance Non-Premium
is anachronous version of: http://data.ga-group.nl/ics/bics/141210101110
is contemporary version of: http://data.ga-group.nl/ics/bics/1414101111
is replaced by: http://data.ga-group.nl/ics/bics/2020/141210101110
is version of: http://data.ga-group.nl/ics/bics/141210101110
is version of: http://data.ga-group.nl/ics/bics/1414101111
imported on: 2026-06-08T13:03:47.798Z
last refreshed on: 2026-06-08T13:03:47.798Z
source accessed on: 2019-12-03T20:05:01Z
source last accessed on: 2019-12-03T20:05:01Z
label: Ingreso de inversión - seg vida @es
label: Investitionsertrag - LV @de
label: Produit financier - Assur-vie @fr
label: Reddito investimento - Assic vita @it
label: Renda de investimento - Seg vida @pt
label: Инвест. доход - страх. жизни @ru
label: 投資収益ｰ生命保険 @ja
label: 投資收入-壽險 @zh-hant
label: 投资收入-寿险 @zh
label: 투자수익-생보 @ko
definition: This segment includes investment income generated from direct life business.
notation: 1414101111
valid from: 2014-08-08
valid till: 2020-10-03

Fees & Other Inc - Protect Prods
type: BicsLevel6Segment
type: Classifier
type: NamedIndividual
is level6 segment of: Protect Prods Non-Premium
is anachronous version of: http://data.ga-group.nl/ics/bics/14121010111112
is contemporary version of: http://data.ga-group.nl/ics/bics/141410111210
is replaced by: http://data.ga-group.nl/ics/bics/2020/14121010111112
is version of: http://data.ga-group.nl/ics/bics/14121010111112
is version of: http://data.ga-group.nl/ics/bics/141410111210
imported on: 2026-06-08T13:03:47.798Z
last refreshed on: 2026-06-08T13:03:47.798Z
source accessed on: 2019-12-03T20:05:01Z
source last accessed on: 2019-12-03T20:05:01Z
label: Frais et autres rev - Prod protection @fr
label: Gebühren & sonst. Eink.- Schutzprod. @de
label: Tarifas y otro ingreso - productos de protección @es
label: Tariffe e altro redd - Prod protezione @it
label: Taxas e outras rec - Prod proteção @pt
label: Сборы и пр. дхд - прод. защиты @ru
label: 手数料･その他収益-保障商品 @ja
label: 手续费与其他收入-保护产品 @zh
label: 費用及其他收入 - 保障型產品 @zh-hant
label: 수수료 & 기타수익-보장형상품 @ko
definition: This segment includes fees and other non-premium income generated from life insurance protection products, including individual and group life, accidental death, and disability policies.
notation: 141410111210
valid from: 2014-08-08
valid till: 2020-10-03

Invst Inc - Protection Prods
type: BicsLevel6Segment
type: Classifier
type: NamedIndividual
is level6 segment of: Protect Prods Non-Premium
is anachronous version of: http://data.ga-group.nl/ics/bics/14121010111110
is contemporary version of: http://data.ga-group.nl/ics/bics/141410111211
is replaced by: http://data.ga-group.nl/ics/bics/2020/14121010111110
is version of: http://data.ga-group.nl/ics/bics/14121010111110
is version of: http://data.ga-group.nl/ics/bics/141410111211
imported on: 2026-06-08T13:03:47.798Z
last refreshed on: 2026-06-08T13:03:47.798Z
source accessed on: 2019-12-03T20:05:01Z
source last accessed on: 2019-12-03T20:05:01Z
label: Ingreso de inversión - Productos de protección @es
label: Investitionsertrag - Schutzprodukte @de
label: Produit financier - Produits de protection @fr
label: Receita de investimentos - produtos de proteção @pt
label: Redd investimenti - prodotti di protezione @it
label: Инвестиционный доход - Продукты защиты @ru
label: 投資収益-保障商品 @ja
label: 投資收入 - 保障型產品 @zh-hant
label: 投资收入-保护产品 @zh
label: 투자수익 - 보상형 상품 @ko
definition: This segment includes investment income generated from life insurance protection products, including individual and group life, accidental death, and disability policies.
notation: 141410111211
valid from: 2014-08-08
valid till: 2020-10-03

Realized G/L - Protection Prods
type: BicsLevel6Segment
type: Classifier
type: NamedIndividual
is level6 segment of: Protect Prods Non-Premium
is anachronous version of: http://data.ga-group.nl/ics/bics/14121010111111
is contemporary version of: http://data.ga-group.nl/ics/bics/141410111212
is replaced by: http://data.ga-group.nl/ics/bics/2020/14121010111111
is version of: http://data.ga-group.nl/ics/bics/14121010111111
is version of: http://data.ga-group.nl/ics/bics/141410111212
imported on: 2026-06-08T13:03:47.798Z
last refreshed on: 2026-06-08T13:03:47.798Z
source accessed on: 2019-12-03T20:05:01Z
source last accessed on: 2019-12-03T20:05:01Z
label: G/P realizados - Prod proteção @pt
label: P/G realizados - productos de protección @es
label: P/P - Prod protection @fr
label: P/P realizzati - Prod protezione @it
label: Real. G/V - Schutzprod. @de
label: Реализ. П/У - прод. защиты @ru
label: 実現損益-保障商品 @ja
label: 已实现损益-保护产品 @zh
label: 已實現損益 - 保障型產品 @zh-hant
label: 실현손익-보장형상품 @ko
definition: This segment includes realized gains/losses generated from life insurance protection products, including individual and group life, accidental death, and disability policies.
notation: 141410111212
valid from: 2014-08-08
valid till: 2020-10-03

Protect Prods Non-Premium
type: BicsLevel5Segment
type: Classifier
type: NamedIndividual
is level5 segment of: Life Insurance Non-Premium
is anachronous version of: http://data.ga-group.nl/ics/bics/141210101111
is contemporary version of: http://data.ga-group.nl/ics/bics/1414101112
is replaced by: http://data.ga-group.nl/ics/bics/2020/141210101111
is version of: http://data.ga-group.nl/ics/bics/141210101111
is version of: http://data.ga-group.nl/ics/bics/1414101112
imported on: 2026-06-08T13:03:47.798Z
last refreshed on: 2026-06-08T13:03:47.798Z
source accessed on: 2019-12-03T20:05:01Z
source last accessed on: 2019-12-03T20:05:01Z
label: Não prêmio prod proteção @pt
label: Non premi prod protezione @it
label: Prod de protection h primes @fr
label: Productos de protección sin prima @es
label: Schutzprod., nicht Beiträge @de
label: Прод. защиты - непрем. доход @ru
label: 保护产品非保费 @zh
label: 保障商品-非保険料収益 @ja
label: 保障型產品非保費 @zh-hant
label: 보장형상품 보험료외 @ko
definition: This segment includes non-premium income generated from life insurance protection products, including individual and group life, accidental death, and disability policies.
notation: 1414101112
valid from: 2014-08-08
valid till: 2020-10-03

Realized G/L - Life Insurance
type: BicsLevel5Segment
type: Classifier
type: NamedIndividual
is level5 segment of: Life Insurance Non-Premium
is anachronous version of: http://data.ga-group.nl/ics/bics/141210101112
is contemporary version of: http://data.ga-group.nl/ics/bics/1414101113
is replaced by: http://data.ga-group.nl/ics/bics/2020/141210101112
is version of: http://data.ga-group.nl/ics/bics/141210101112
is version of: http://data.ga-group.nl/ics/bics/1414101113
imported on: 2026-06-08T13:03:47.798Z
last refreshed on: 2026-06-08T13:03:47.798Z
source accessed on: 2019-12-03T20:05:01Z
source last accessed on: 2019-12-03T20:05:01Z
label: G/P realizados - Seguro de vida @pt
label: P/G realizados - seguro de vida @es
label: P/P réalisés - Assur-vie @fr
label: P/P realizzati - Assicurazione vita @it
label: Realisierter G/V - LV @de
label: Реализ. П/У - страх. жизни @ru
label: 実現損益-生命保険 @ja
label: 已实现损益-寿险 @zh
label: 已實現損益 - 人壽保險 @zh-hant
label: 실현손익-생명보험 @ko
definition: This segment includes realized gains/losses generated from direct life business.
notation: 1414101113
valid from: 2014-08-08
valid till: 2020-10-03

Fees & Other Income - Life Invst
type: BicsLevel6Segment
type: Classifier
type: NamedIndividual
is level6 segment of: Saving & Retire Prods Non-Prem
is anachronous version of: http://data.ga-group.nl/ics/bics/14121010111312
is contemporary version of: http://data.ga-group.nl/ics/bics/141410111410
is replaced by: http://data.ga-group.nl/ics/bics/2020/14121010111312
is version of: http://data.ga-group.nl/ics/bics/14121010111312
is version of: http://data.ga-group.nl/ics/bics/141410111410
imported on: 2026-06-08T13:03:47.798Z
last refreshed on: 2026-06-08T13:03:47.798Z
source accessed on: 2019-12-03T20:05:01Z
source last accessed on: 2019-12-03T20:05:01Z
label: Commissioni e altro reddito - Invst vita @it
label: Frais et autres rev - Investiss vie @fr
label: Gebühren & sonstiger Ertrag - LV Inv. @de
label: Tarifas y otro ingreso - productos de inversión de vida @es
label: Taxas e outras receitas - Inv de vida @pt
label: Сборы и пр. дхд - инвест. страх. жизни @ru
label: 手数料･その他収益-投資型生命保険商品 @ja
label: 手续费与其他收入-寿险投资 @zh
label: 費用及其他收入 - 人壽投資產品 @zh-hant
label: 수수료 & 기타 수익 -생명 투자 @ko
definition: This segment includes fees and other non-premium income generated from life insurance savings and retirement products, including individual and group fixed and variable annuities.
notation: 141410111410
valid from: 2014-08-08
valid till: 2020-10-03

Investment Income - Life Invst
type: BicsLevel6Segment
type: Classifier
type: NamedIndividual
is level6 segment of: Saving & Retire Prods Non-Prem
is anachronous version of: http://data.ga-group.nl/ics/bics/14121010111310
is contemporary version of: http://data.ga-group.nl/ics/bics/141410111411
is replaced by: http://data.ga-group.nl/ics/bics/2020/14121010111310
is version of: http://data.ga-group.nl/ics/bics/14121010111310
is version of: http://data.ga-group.nl/ics/bics/141410111411
imported on: 2026-06-08T13:03:47.798Z
last refreshed on: 2026-06-08T13:03:47.798Z
source accessed on: 2019-12-03T20:05:01Z
source last accessed on: 2019-12-03T20:05:01Z
label: Ingreso de inversión - vida @es
label: Investitionsertrag - LV Inv. @de
label: Produit financier - Investiss vie @fr
label: Receita de investimentos - Inv vida @pt
label: Reddito investimento - Invst vita @it
label: Сборы и пр. дхд - нв. стр. жизни @ru
label: 投資収益-投資型生命保険商品 @ja
label: 投資收入 - 人壽投資產品 @zh-hant
label: 投资收入-寿险投资 @zh
label: 투자수익-생명 투자 @ko
definition: This segment includes investment income generated from life insurance savings and retirement products, including individual and group fixed and variable annuities.
notation: 141410111411
valid from: 2014-08-08
valid till: 2020-10-03

Realized G/L - Life Investment
type: BicsLevel6Segment
type: Classifier
type: NamedIndividual
is level6 segment of: Saving & Retire Prods Non-Prem
is anachronous version of: http://data.ga-group.nl/ics/bics/14121010111311
is contemporary version of: http://data.ga-group.nl/ics/bics/141410111412
is replaced by: http://data.ga-group.nl/ics/bics/2020/14121010111311
is version of: http://data.ga-group.nl/ics/bics/14121010111311
is version of: http://data.ga-group.nl/ics/bics/141410111412
imported on: 2026-06-08T13:03:47.798Z
last refreshed on: 2026-06-08T13:03:47.798Z
source accessed on: 2019-12-03T20:05:01Z
source last accessed on: 2019-12-03T20:05:01Z
label: G/P realizados - Investimentos de vida @pt
label: P/G realizados - inversión de vida @es
label: P/P réalisés - Investiss vie @fr
label: P/P realizzati - Investimento vita @it
label: Realisierter G/V - LV Inv. @de
label: Реализ. П/У - страх. жизни @ru
label: 実現損益-投資型生命保険商品 @ja
label: 已实现损益-寿险投资 @zh
label: 已實現損益 - 人壽投資產品 @zh-hant
label: 실현손익 - 생명 투자 @ko
definition: This segment includes realized gains/losses generated from life insurance savings and retirement products, including individual and group fixed and variable annuities.
notation: 141410111412
valid from: 2014-08-08
valid till: 2020-10-03

Saving & Retire Prods Non-Prem
type: BicsLevel5Segment
type: Classifier
type: NamedIndividual
is level5 segment of: Life Insurance Non-Premium
is anachronous version of: http://data.ga-group.nl/ics/bics/141210101113
is contemporary version of: http://data.ga-group.nl/ics/bics/1414101114
is replaced by: http://data.ga-group.nl/ics/bics/2020/141210101113
is version of: http://data.ga-group.nl/ics/bics/141210101113
is version of: http://data.ga-group.nl/ics/bics/1414101114
imported on: 2026-06-08T13:03:47.798Z
last refreshed on: 2026-06-08T13:03:47.798Z
source accessed on: 2019-12-03T20:05:01Z
source last accessed on: 2019-12-03T20:05:01Z
label: Não prêm prod aposentadoria e poupança @pt
label: Non prem prod risparmio e pensione @it
label: Prod épargne et retraite h primes @fr
label: Sin primas de ahorros y productos de jubilación @es
label: Spar- & Ruhestandsprod., nicht Beiträge @de
label: Сберегат. и пенс. прод. - непрем. @ru
label: 储蓄与退休产品非保费 @zh
label: 儲蓄及退休產品非保費收入 @zh-hant
label: 預金･退職後資金商品-保険料外収益 @ja
label: 저축 & 퇴직상품 보험료외 @ko
definition: This segment includes non-premium income generated from life insurance savings and retirement products, including individual and group fixed and variable annuities.
notation: 1414101114
valid from: 2014-08-08
valid till: 2020-10-03

Life Insurance Non-Premium
type: BicsLevel4SubIndustry
type: Classifier
type: NamedIndividual
is sub industry of: Life Insurance
is anachronous version of: http://data.ga-group.nl/ics/bics/1412101011
is contemporary version of: http://data.ga-group.nl/ics/bics/14141011
is replaced by: http://data.ga-group.nl/ics/bics/2020/1412101011
is version of: http://data.ga-group.nl/ics/bics/1412101011
is version of: http://data.ga-group.nl/ics/bics/14141011
imported on: 2026-06-08T13:03:47.798Z
last refreshed on: 2026-06-08T13:03:47.798Z
source accessed on: 2019-12-03T20:05:01Z
source last accessed on: 2019-12-03T20:05:01Z
label: Assurance-vie hors prime @fr
label: Lebensversicherung, nicht Beiträge @de
label: Mão prêmio seguro de vida @pt
label: Non premi assicurazione vita @it
label: Seguros de vida sin prima @es
label: Страх. жизни - непрем. доход @ru
label: 人壽保險非保費收入 @zh-hant
label: 寿险非保费 @zh
label: 生命保険-保険料外収益 @ja
label: 생명보험 보험료외 @ko
definition: This industry subgroup includes total non-premium revenue generated from direct life business.
notation: 14141011
valid from: 2014-08-08
valid till: 2020-10-03

Life Insurance
type: BicsLevel3Industry
type: Classifier
type: NamedIndividual
is industry of: Insurance
is anachronous version of: http://data.ga-group.nl/ics/bics/14121010
is contemporary version of: http://data.ga-group.nl/ics/bics/141410
is replaced by: http://data.ga-group.nl/ics/bics/2020/14121010
is version of: http://data.ga-group.nl/ics/bics/14121010
is version of: http://data.ga-group.nl/ics/bics/141410
imported on: 2026-06-08T13:03:47.798Z
last refreshed on: 2026-06-08T13:03:47.798Z
source accessed on: 2019-12-03T20:05:01Z
source last accessed on: 2019-12-03T20:05:01Z
label: Assicuraz vita @it
label: Assurance-vie @fr
label: Lebensversicherung @de
label: Seguro de vida @pt
label: Seguros de vida @es
label: Страхование жизни @ru
label: 人壽保險 @zh-hant
label: 人寿保险 @zh
label: 生命保険業 @ja
label: 생명보험 @ko
definition: This industry includes companies that directly underwrite life insurance policies, such as life, accidental death, disability and annuities (pensions).
notation: 141410
valid from: 2014-08-08
valid till: 2020-10-03

Commercial Auto Premiums
type: BicsLevel6Segment
type: Classifier
type: NamedIndividual
is level6 segment of: P&C Commercial Lines
is anachronous version of: http://data.ga-group.nl/ics/bics/14121011101010
is contemporary version of: http://data.ga-group.nl/ics/bics/141411101010
is replaced by: http://data.ga-group.nl/ics/bics/2020/14121011101010
is version of: http://data.ga-group.nl/ics/bics/14121011101010
is version of: http://data.ga-group.nl/ics/bics/141411101010
imported on: 2026-06-08T13:03:47.798Z
last refreshed on: 2026-06-08T13:03:47.798Z
source accessed on: 2019-12-03T20:05:01Z
source last accessed on: 2019-12-03T20:05:01Z
label: Beiträge - Geschäftswagen @de
label: Prêmios de auto comercial @pt
label: Premi auto commerciali @it
label: Primas auto comercial @es
label: Primes assur auto commerciale @fr
label: Коммерч. автомобили - премии @ru
label: 保険料-商用車 @ja
label: 商业汽车保险保费 @zh
label: 商業汽車險保費 @zh-hant
label: 상업용 자동차 보험료 @ko
definition: This segment includes premium revenue generated from commercial lines. Such lines include workers’ compensation, commercial auto, commercial multi-peril, surety and fidelity, liability and other commercial lines of business.
notation: 141411101010
valid from: 2014-08-08
valid till: 2020-10-03

Comml Prop & Multi-Peril Prem
type: BicsLevel6Segment
type: Classifier
type: NamedIndividual
is level6 segment of: P&C Commercial Lines
is anachronous version of: http://data.ga-group.nl/ics/bics/14121011101011
is contemporary version of: http://data.ga-group.nl/ics/bics/141411101011
is replaced by: http://data.ga-group.nl/ics/bics/2020/14121011101011
is version of: http://data.ga-group.nl/ics/bics/14121011101011
is version of: http://data.ga-group.nl/ics/bics/141411101011
imported on: 2026-06-08T13:03:47.798Z
last refreshed on: 2026-06-08T13:03:47.798Z
source accessed on: 2019-12-03T20:05:01Z
source last accessed on: 2019-12-03T20:05:01Z
label: Beiträge - Gew. Immobilien & Mehrgefahren @de
label: Prêm prop com e multi-riscos @pt
label: Prem prop comm e multiper @it
label: Primas propiedad com y multi peligro @es
label: Primes assur comm prop/multi-risque @fr
label: Ком. собств/Многориск. премии @ru
label: 保険料-商業不動産･企業総合 @ja
label: 商业���地产与多重保险保费 @zh
label: 商業產物及綜合險保費 @zh-hant
label: 상업용 부동산 & 다중위험 보험료 @ko
definition: This segment includes premium revenue generated from commercial property, commercial multi-peril, fire and allied lines, inland marine, theft, earthquake and umbrella lines of business.
notation: 141411101011
valid from: 2014-08-08
valid till: 2020-10-03

Financial Guarantee Premiums
type: BicsLevel6Segment
type: Classifier
type: NamedIndividual
is level6 segment of: P&C Commercial Lines
is anachronous version of: http://data.ga-group.nl/ics/bics/14121011101012
is contemporary version of: http://data.ga-group.nl/ics/bics/141411101012
is replaced by: http://data.ga-group.nl/ics/bics/2020/14121011101012
is version of: http://data.ga-group.nl/ics/bics/14121011101012
is version of: http://data.ga-group.nl/ics/bics/141411101012
imported on: 2026-06-08T13:03:47.798Z
last refreshed on: 2026-06-08T13:03:47.798Z
source accessed on: 2019-12-03T20:05:01Z
source last accessed on: 2019-12-03T20:05:01Z
label: Beiträge - Finanz. Garantie @de
label: Prêmios de garantia financeira @pt
label: Premi garanzia finanziaria @it
label: Primas de garantía financiera @es
label: Primes pour garantie financière @fr
label: Финансовые гарантии - премии @ru
label: 保険料 - 金融保証 @ja
label: 金融保證險保費 @zh-hant
label: 金融担保险保费 @zh
label: 금융보증 보험료 @ko
definition: This segment includes premium revenue generated from financial guarantee lines of business.
notation: 141411101012
valid from: 2014-08-08
valid till: 2020-10-03

Liability Premiums
type: BicsLevel6Segment
type: Classifier
type: NamedIndividual
is level6 segment of: P&C Commercial Lines
is anachronous version of: http://data.ga-group.nl/ics/bics/14121011101013
is contemporary version of: http://data.ga-group.nl/ics/bics/141411101013
is replaced by: http://data.ga-group.nl/ics/bics/2020/14121011101013
is version of: http://data.ga-group.nl/ics/bics/14121011101013
is version of: http://data.ga-group.nl/ics/bics/141411101013
imported on: 2026-06-08T13:03:47.798Z
last refreshed on: 2026-06-08T13:03:47.798Z
source accessed on: 2019-12-03T20:05:01Z
source last accessed on: 2019-12-03T20:05:01Z
label: Beiträge - Verbindlichkeiten @de
label: Prêmios de passivo @pt
label: Premi responsabilità @it
label: Primas de pasivo @es
label: Primes pour responsabilité civile @fr
label: Премии - обязательства @ru
label: 保険料-負債 @ja
label: 責任險保費 @zh-hant
label: 责任保险保费 @zh
label: 책임보험 보험료 @ko
definition: This segment includes premium revenue generated from commercial liability lines of business, such as fraud, general liability, medical malpractice, professional or product liability, environmental liability, director’s and officer’s liability, aviation, boiler and machinery, and ocean marine.
notation: 141411101013
valid from: 2014-08-08
valid till: 2020-10-03

Surety & Fidelity Premiums
type: BicsLevel6Segment
type: Classifier
type: NamedIndividual
is level6 segment of: P&C Commercial Lines
is anachronous version of: http://data.ga-group.nl/ics/bics/14121011101014
is contemporary version of: http://data.ga-group.nl/ics/bics/141411101014
is replaced by: http://data.ga-group.nl/ics/bics/2020/14121011101014
is version of: http://data.ga-group.nl/ics/bics/14121011101014
is version of: http://data.ga-group.nl/ics/bics/141411101014
imported on: 2026-06-08T13:03:47.798Z
last refreshed on: 2026-06-08T13:03:47.798Z
source accessed on: 2019-12-03T20:05:01Z
source last accessed on: 2019-12-03T20:05:01Z
label: Beiträge - Kaution & Sicherheitsleistung @de
label: Prêmios de fidelidade e garantia @pt
label: Premi cauzione e fideiussione @it
label: Primas de garantía y fidelidad @es
label: Primes pour détournement et vol @fr
label: Гарантии и поручительства - премии @ru
label: 保证与忠诚保险保费 @zh
label: 保険料-身元保証･信用 @ja
label: 確實保證及誠實險保費 @zh-hant
label: 신원 & 보증 보험료 @ko
definition: This segment includes premium revenue generated from surety and fidelitly bond insurance.
notation: 141411101014
valid from: 2014-08-08
valid till: 2020-10-03

Workers Compensation Premiums
type: BicsLevel6Segment
type: Classifier
type: NamedIndividual
is level6 segment of: P&C Commercial Lines
is anachronous version of: http://data.ga-group.nl/ics/bics/14121011101015
is contemporary version of: http://data.ga-group.nl/ics/bics/141411101015
is replaced by: http://data.ga-group.nl/ics/bics/2020/14121011101015
is version of: http://data.ga-group.nl/ics/bics/14121011101015
is version of: http://data.ga-group.nl/ics/bics/141411101015
imported on: 2026-06-08T13:03:47.798Z
last refreshed on: 2026-06-08T13:03:47.798Z
source accessed on: 2019-12-03T20:05:01Z
source last accessed on: 2019-12-03T20:05:01Z
label: Beiträge - Arbeitsunfallversicherung @de
label: Prêmios de indenização trabalhista @pt
label: Premi infortuni sul lavoro @it
label: Primas de compensación de trabajadores @es
label: Primes pour rémunération des employés @fr
label: Компенсации работникам - премии @ru
label: 保険料-労働者災害補償 @ja
label: 勞工賠償險保費 @zh-hant
label: 工人薪酬保险保费 @zh
label: 산재보험 보험료 @ko
definition: This segment includes premium revenue generated from workers compensation insurance.
notation: 141411101015
valid from: 2014-08-08
valid till: 2020-10-03

Other Commercial Premiums
type: BicsLevel6Segment
type: Classifier
type: NamedIndividual
is level6 segment of: P&C Commercial Lines
is anachronous version of: http://data.ga-group.nl/ics/bics/14121011101016
is contemporary version of: http://data.ga-group.nl/ics/bics/141411101016
is replaced by: http://data.ga-group.nl/ics/bics/2020/14121011101016
is version of: http://data.ga-group.nl/ics/bics/14121011101016
is version of: http://data.ga-group.nl/ics/bics/141411101016
imported on: 2026-06-08T13:03:47.798Z
last refreshed on: 2026-06-08T13:03:47.798Z
source accessed on: 2019-12-03T20:05:01Z
source last accessed on: 2019-12-03T20:05:01Z
label: Altri premi commerciali @it
label: Autres primes commerciales @fr
label: Beiträge - Sonstige gewerblich @de
label: Otras primas comerciales @es
label: Outros prêmios comerciais @pt
label: Прочие коммерческие премии @ru
label: 保険料-その他商業 @ja
label: 其他商业保险保费 @zh
label: 其他商業險保費 @zh-hant
label: 기타 상업용 보험료 @ko
definition: This segment includes revenue generated from other commercial lines of business, such as terrorism, unidentified specialty lines, and other casualty lines not elsewhere classified.
notation: 141411101016
valid from: 2014-08-08
valid till: 2020-10-03

P&C Commercial Lines
type: BicsLevel5Segment
type: Classifier
type: NamedIndividual
is level5 segment of: P&C Insurance Premiums
is anachronous version of: http://data.ga-group.nl/ics/bics/141210111010
is contemporary version of: http://data.ga-group.nl/ics/bics/1414111010
is replaced by: http://data.ga-group.nl/ics/bics/2020/141210111010
is version of: http://data.ga-group.nl/ics/bics/141210111010
is version of: http://data.ga-group.nl/ics/bics/1414111010
imported on: 2026-06-08T13:03:47.798Z
last refreshed on: 2026-06-08T13:03:47.798Z
source accessed on: 2019-12-03T20:05:01Z
source last accessed on: 2019-12-03T20:05:01Z
label: Assur IARD commerciale @fr
label: Gewerbliche S&U-Versicherung @de
label: Líneas comerciales PyC @es
label: Linhas comerciais P&C @pt
label: P&C Linee commerciali @it
label: P&C 기업성보험 @ko
label: P&C商业保险 @zh
label: Коммерческое страхование (имущ/отв) @ru
label: 損保 企業保険 @ja
label: 產物意外商業保險 @zh-hant
definition: This segment includes premium revenue generated from commercial lines of insurance, such as workers compensation, commercial auto, commercial multi-peril, surety and fidelity, liability and other commercial lines of business.
notation: 1414111010
valid from: 2014-08-08
valid till: 2020-10-03

Homeowners Premiums
type: BicsLevel6Segment
type: Classifier
type: NamedIndividual
is level6 segment of: P&C Personal Lines
is anachronous version of: http://data.ga-group.nl/ics/bics/14121011101110
is contemporary version of: http://data.ga-group.nl/ics/bics/141411101110
is replaced by: http://data.ga-group.nl/ics/bics/2020/14121011101110
is version of: http://data.ga-group.nl/ics/bics/14121011101110
is version of: http://data.ga-group.nl/ics/bics/141411101110
imported on: 2026-06-08T13:03:47.798Z
last refreshed on: 2026-06-08T13:03:47.798Z
source accessed on: 2019-12-03T20:05:01Z
source last accessed on: 2019-12-03T20:05:01Z
label: Beiträge - Hauseigentümer @de
label: Prêmios de proprietários de casa @pt
label: Premi proprietari case @it
label: Primas domésticas @es
label: Primes pour habitation @fr
label: Домовладельцы - премии @ru
label: 业主保险保费 @zh
label: 保険料-住宅 @ja
label: 自有住宅險保費 @zh-hant
label: 주택보유자 보험료 @ko
definition: This segment includes premium revenue generated from coverage of residential dwellings and farms.
notation: 141411101110
valid from: 2014-08-08
valid till: 2020-10-03

Personal Auto Premiums
type: BicsLevel6Segment
type: Classifier
type: NamedIndividual
is level6 segment of: P&C Personal Lines
is anachronous version of: http://data.ga-group.nl/ics/bics/14121011101111
is contemporary version of: http://data.ga-group.nl/ics/bics/141411101111
is replaced by: http://data.ga-group.nl/ics/bics/2020/14121011101111
is version of: http://data.ga-group.nl/ics/bics/14121011101111
is version of: http://data.ga-group.nl/ics/bics/141411101111
imported on: 2026-06-08T13:03:47.798Z
last refreshed on: 2026-06-08T13:03:47.798Z
source accessed on: 2019-12-03T20:05:01Z
source last accessed on: 2019-12-03T20:05:01Z
label: Beiträge - Privatwagen @de
label: Prêmios de autos pessoais @pt
label: Premi auto personali @it
label: Primas personales de auto @es
label: Primes pour voitures particulières @fr
label: Персональн. автомобили - премии @ru
label: 个人汽车保险保费 @zh
label: 保険料-個人向け自動車 @ja
label: 個人車險保費 @zh-hant
label: 개인자동차보험료 @ko
definition: This segment includes premium revenue generated from coverage of all auto physical damage claims and personal auto liability for both standard and non-standard drivers.
notation: 141411101111
valid from: 2014-08-08
valid till: 2020-10-03

Other Personal Premiums
type: BicsLevel6Segment
type: Classifier
type: NamedIndividual
is level6 segment of: P&C Personal Lines
is anachronous version of: http://data.ga-group.nl/ics/bics/14121011101112
is contemporary version of: http://data.ga-group.nl/ics/bics/141411101112
is replaced by: http://data.ga-group.nl/ics/bics/2020/14121011101112
is version of: http://data.ga-group.nl/ics/bics/14121011101112
is version of: http://data.ga-group.nl/ics/bics/141411101112
imported on: 2026-06-08T13:03:47.798Z
last refreshed on: 2026-06-08T13:03:47.798Z
source accessed on: 2019-12-03T20:05:01Z
source last accessed on: 2019-12-03T20:05:01Z
label: Altri premi personali @it
label: Autres primes personnelles @fr
label: Otras primas personales @es
label: Outros prêmios pessoais @pt
label: Sonstige private Beiträge @de
label: Прочие персональные премии @ru
label: 保険料-その他個人 @ja
label: 其他个人保险保费 @zh
label: 其他個人險保費 @zh-hant
label: 기타개인보험료 @ko
definition: This segment includes premium revenue generated from other personal lines of business not elsewhere classified.
notation: 141411101112
valid from: 2014-08-08
valid till: 2020-10-03

P&C Personal Lines
type: BicsLevel5Segment
type: Classifier
type: NamedIndividual
is level5 segment of: P&C Insurance Premiums
is anachronous version of: http://data.ga-group.nl/ics/bics/141210111011
is contemporary version of: http://data.ga-group.nl/ics/bics/1414111011
is replaced by: http://data.ga-group.nl/ics/bics/2020/141210111011
is version of: http://data.ga-group.nl/ics/bics/141210111011
is version of: http://data.ga-group.nl/ics/bics/1414111011
imported on: 2026-06-08T13:03:47.798Z
last refreshed on: 2026-06-08T13:03:47.798Z
source accessed on: 2019-12-03T20:05:01Z
source last accessed on: 2019-12-03T20:05:01Z
label: IARD pour particuliers @fr
label: Líneas personales PyC @es
label: Linhas pessoais P&C @pt
label: P&C Linee personali @it
label: P&C 가계성보험 @ko
label: P&C个人保险 @zh
label: Private S&U-Versicherung @de
label: Частное страхование (Имущ/отв) @ru
label: 損保 個人保険 @ja
label: 產物及意外個人保險 @zh-hant
definition: This segment includes premium revenue generated from personal lines of insurance, such as home, personal auto and other personal lines of business.
notation: 1414111011
valid from: 2014-08-08
valid till: 2020-10-03

P&C Insurance Premiums
type: BicsLevel4SubIndustry
type: Classifier
type: NamedIndividual
is sub industry of: P&C Insurance
is anachronous version of: http://data.ga-group.nl/ics/bics/1412101110
is contemporary version of: http://data.ga-group.nl/ics/bics/14141110
is replaced by: http://data.ga-group.nl/ics/bics/2020/1412101110
is version of: http://data.ga-group.nl/ics/bics/1412101110
is version of: http://data.ga-group.nl/ics/bics/14141110
imported on: 2026-06-08T13:03:47.798Z
last refreshed on: 2026-06-08T13:03:47.798Z
source accessed on: 2019-12-03T20:05:01Z
source last accessed on: 2019-12-03T20:05:01Z
label: P&C 보험 보험료 @ko
label: Prêmios de seguro P&C @pt
label: Premi assicurazione P&C @it
label: Primas de seguro PyC @es
label: Primes assur IARD @fr
label: S&U-Versicherungsbeiträge @de
label: Страх. собств. и ущ. - премии @ru
label: 損害保険ｰ保険料 @ja
label: 產物意外險保費 @zh-hant
label: 财产与意外保险保费 @zh
definition: This industry subgroup includes companies that directly underwrite property and casualty insurance policies. Insurance types include automobile, property damage, casualty, theft, fire, malpractice, marine, workers' compensation and homeowners insurance.
notation: 14141110
valid from: 2014-08-08
valid till: 2020-10-03

Fees & Other Income - P&C
type: BicsLevel5Segment
type: Classifier
type: NamedIndividual
is level5 segment of: P&C Insurance Non-Premium
is anachronous version of: http://data.ga-group.nl/ics/bics/141210111112
is contemporary version of: http://data.ga-group.nl/ics/bics/1414111110
is replaced by: http://data.ga-group.nl/ics/bics/2020/141210111112
is version of: http://data.ga-group.nl/ics/bics/141210111112
is version of: http://data.ga-group.nl/ics/bics/1414111110
imported on: 2026-06-08T13:03:47.798Z
last refreshed on: 2026-06-08T13:03:47.798Z
source accessed on: 2019-12-03T20:05:01Z
source last accessed on: 2019-12-03T20:05:01Z
label: Frais et autres revenus - IARD @fr
label: Gebühren & sonstiger Ertrag - S&U @de
label: Tarifas y otro ingreso - P&C @es
label: Tasse e altro reddito - P&C @it
label: Taxas e outras rendas - P&C @pt
label: Сборы и др. доход (собств./ущерб) @ru
label: 手数料､その他収益ｰ損害保険 @ja
label: 費用及其他收入-產物意外險 @zh-hant
label: 费用与其他收入- P&C @zh
label: 수수료 & 기타수익-P&C @ko
definition: This segment includes other income generated from direct property and casualty business.
notation: 1414111110
valid from: 2014-08-08
valid till: 2020-10-03

Investment Income - P&C
type: BicsLevel5Segment
type: Classifier
type: NamedIndividual
is level5 segment of: P&C Insurance Non-Premium
is anachronous version of: http://data.ga-group.nl/ics/bics/141210111110
is contemporary version of: http://data.ga-group.nl/ics/bics/1414111111
is replaced by: http://data.ga-group.nl/ics/bics/2020/141210111110
is version of: http://data.ga-group.nl/ics/bics/141210111110
is version of: http://data.ga-group.nl/ics/bics/1414111111
imported on: 2026-06-08T13:03:47.798Z
last refreshed on: 2026-06-08T13:03:47.798Z
source accessed on: 2019-12-03T20:05:01Z
source last accessed on: 2019-12-03T20:05:01Z
label: Ingreso de inversión - P&C @es
label: Investitionsertrag - S&U @de
label: Produit financier - IARD @fr
label: Redd investimenti - P&C @it
label: Renda de investimento - P&C @pt
label: Инвестиц. доход-Собств./ущерб @ru
label: 投資損益－損害保険 @ja
label: 投资收入- P&C @zh
label: 投���收入-產物意外險 @zh-hant
label: 투자수익-P&C @ko
definition: This segment includes investment income generated from direct property and casualty business.
notation: 1414111111
valid from: 2014-08-08
valid till: 2020-10-03

Realized Gains/Losses - P&C
type: BicsLevel5Segment
type: Classifier
type: NamedIndividual
is level5 segment of: P&C Insurance Non-Premium
is anachronous version of: http://data.ga-group.nl/ics/bics/141210111111
is contemporary version of: http://data.ga-group.nl/ics/bics/1414111112
is replaced by: http://data.ga-group.nl/ics/bics/2020/141210111111
is version of: http://data.ga-group.nl/ics/bics/141210111111
is version of: http://data.ga-group.nl/ics/bics/1414111112
imported on: 2026-06-08T13:03:47.798Z
last refreshed on: 2026-06-08T13:03:47.798Z
source accessed on: 2019-12-03T20:05:01Z
source last accessed on: 2019-12-03T20:05:01Z
label: Beneficios/pérdidas realizadas - P&C @es
label: Ganhos/Perdas - P&C @pt
label: P/P réalisés - IARD @fr
label: Profitti/perdite realizz - P&C @it
label: Realisierte Gewinne/Verluste - S&U @de
label: Реализов. прибыль/убытки-Собств./ущерб @ru
label: 実現損益－損害保険 @ja
label: 已实现损益-P&C @zh
label: 已實現損益-產物意外險 @zh-hant
label: 실현 이익/손실-P&C @ko
definition: This segment includes realized gains/losses generated from direct property and casualty business.
notation: 1414111112
valid from: 2014-08-08
valid till: 2020-10-03

P&C Insurance Non-Premium
type: BicsLevel4SubIndustry
type: Classifier
type: NamedIndividual
is sub industry of: P&C Insurance
is anachronous version of: http://data.ga-group.nl/ics/bics/1412101111
is contemporary version of: http://data.ga-group.nl/ics/bics/14141111
is replaced by: http://data.ga-group.nl/ics/bics/2020/1412101111
is version of: http://data.ga-group.nl/ics/bics/1412101111
is version of: http://data.ga-group.nl/ics/bics/14141111
imported on: 2026-06-08T13:03:47.798Z
last refreshed on: 2026-06-08T13:03:47.798Z
source accessed on: 2019-12-03T20:05:01Z
source last accessed on: 2019-12-03T20:05:01Z
label: Não prêmio de seguro P&C @pt
label: No primas de seguro PyC @es
label: Non premi assicurazione P&C @it
label: P&C 보험 보험료외 @ko
label: Rev IARD h primes @fr
label: S&U-Versicherung - Nicht-Beiträge @de
label: Страх. собств. и ущ. - непрем. дхд @ru
label: 損保 - 保険料外収入 @ja
label: 產物意外險非保費收入 @zh-hant
label: 财产与意外保险非保费 @zh
definition: This industry subgroup includes total non-premium revenue generated from direct property and casualty business.
notation: 14141111
valid from: 2014-08-08
valid till: 2020-10-03

P&C Insurance
type: BicsLevel3Industry
type: Classifier
type: NamedIndividual
is industry of: Insurance
is anachronous version of: http://data.ga-group.nl/ics/bics/14121011
is contemporary version of: http://data.ga-group.nl/ics/bics/141411
is replaced by: http://data.ga-group.nl/ics/bics/2020/14121011
is version of: http://data.ga-group.nl/ics/bics/14121011
is version of: http://data.ga-group.nl/ics/bics/141411
imported on: 2026-06-08T13:03:47.798Z
last refreshed on: 2026-06-08T13:03:47.798Z
source accessed on: 2019-12-03T20:05:01Z
source last accessed on: 2019-12-03T20:05:01Z
label: Assicurazione P&C @it
label: Assur IARD @fr
label: P&C 보험 @ko
label: Reaseguro PyC @es
label: S&U-Versicherung @de
label: Seguro P&C @pt
label: Страх. собств. и ущерба @ru
label: 損害保険 @ja
label: 產物及意外保險 @zh-hant
label: 财产与意外保险 @zh
definition: This industry includes companies that directly underwrite property and casualty insurance policies, such as automobile, property damage, casualty, theft, fire, malpractice, marine, workers' compensation and homeowners insurance.
notation: 141411
valid from: 2014-08-08
valid till: 2020-10-03

Life Reinsurance Premiums
type: BicsLevel5Segment
type: Classifier
type: NamedIndividual
is level5 segment of: Life Reinsurance
is anachronous version of: http://data.ga-group.nl/ics/bics/141210131010
is contemporary version of: http://data.ga-group.nl/ics/bics/1414121010
is replaced by: http://data.ga-group.nl/ics/bics/2020/141210131010
is version of: http://data.ga-group.nl/ics/bics/141210131010
is version of: http://data.ga-group.nl/ics/bics/1414121010
imported on: 2026-06-08T13:03:47.798Z
last refreshed on: 2026-06-08T13:03:47.798Z
source accessed on: 2019-12-03T20:05:01Z
source last accessed on: 2019-12-03T20:05:01Z
label: Beiträge - Lebensrückversicherung @de
label: Prêmios de resseguro de vida @pt
label: Premi riassicurazione vita @it
label: Primas de reaseguros de vida @es
label: Primes pour réassurance-vie @fr
label: Перестрахование жизни - премии @ru
label: 人壽再保險保費 @zh-hant
label: 人寿再保险保费 @zh
label: 保険料収入 - 生命再保険 @ja
label: 생명 재보험 보험료 @ko
definition: This segment includes premium revenue generated from life reinsurance business.
notation: 1414121010
valid from: 2014-08-08
valid till: 2020-10-03

Investment Income - Life Re
type: BicsLevel6Segment
type: Classifier
type: NamedIndividual
is level6 segment of: Life Reinsurance Non-Premium
is anachronous version of: http://data.ga-group.nl/ics/bics/14121013101110
is contemporary version of: http://data.ga-group.nl/ics/bics/141412101110
is replaced by: http://data.ga-group.nl/ics/bics/2020/14121013101110
is version of: http://data.ga-group.nl/ics/bics/14121013101110
is version of: http://data.ga-group.nl/ics/bics/141412101110
imported on: 2026-06-08T13:03:47.798Z
last refreshed on: 2026-06-08T13:03:47.798Z
source accessed on: 2019-12-03T20:05:01Z
source last accessed on: 2019-12-03T20:05:01Z
label: Ingreso de inversión - seg de vida @es
label: Investitionsertrag - LV Rück @de
label: Produit financier - Réassur-vie @fr
label: Reddito investimento - Riassic vita @it
label: Renda de investimento - Re vida @pt
label: Инвест. доход - перестр. жизни @ru
label: 投資収益-生命再保険 @ja
label: 投資收入 - 人壽再保險 @zh-hant
label: 投资收入-人寿再保险 @zh
label: 투자수익-생명재보험 @ko
definition: This segment includes investment-generated income from life reinsurance business.
notation: 141412101110
valid from: 2014-08-08
valid till: 2020-10-03

Realized G/L - Life Reinsurance
type: BicsLevel6Segment
type: Classifier
type: NamedIndividual
is level6 segment of: Life Reinsurance Non-Premium
is anachronous version of: http://data.ga-group.nl/ics/bics/14121013101111
is contemporary version of: http://data.ga-group.nl/ics/bics/141412101111
is replaced by: http://data.ga-group.nl/ics/bics/2020/14121013101111
is version of: http://data.ga-group.nl/ics/bics/14121013101111
is version of: http://data.ga-group.nl/ics/bics/141412101111
imported on: 2026-06-08T13:03:47.798Z
last refreshed on: 2026-06-08T13:03:47.798Z
source accessed on: 2019-12-03T20:05:01Z
source last accessed on: 2019-12-03T20:05:01Z
label: G/P realizados - Resseguro de vida @pt
label: P/G realizados - reaseguro de vida @es
label: P/P réalisés - Réassur-vie @fr
label: P/P realizzati - Riassic vita @it
label: Realisierte G/V - LV Rück @de
label: Реализ. П/У - перестрах. жизни @ru
label: 実現損益-生命再保険 @ja
label: 已实现损益-人寿再保险 @zh
label: 已實現損益 - 人壽再保險 @zh-hant
label: 실현손익-생명재보험 @ko
definition: This segment includes realized gains/losses generated from life reinsurance business.
notation: 141412101111
valid from: 2014-08-08
valid till: 2020-10-03

Other Income - Life Reinsurance
type: BicsLevel6Segment
type: Classifier
type: NamedIndividual
is level6 segment of: Life Reinsurance Non-Premium
is anachronous version of: http://data.ga-group.nl/ics/bics/14121013101112
is contemporary version of: http://data.ga-group.nl/ics/bics/141412101112
is replaced by: http://data.ga-group.nl/ics/bics/2020/14121013101112
is version of: http://data.ga-group.nl/ics/bics/14121013101112
is version of: http://data.ga-group.nl/ics/bics/141412101112
imported on: 2026-06-08T13:03:47.798Z
last refreshed on: 2026-06-08T13:03:47.798Z
source accessed on: 2019-12-03T20:05:01Z
source last accessed on: 2019-12-03T20:05:01Z
label: Altro reddito - Riassicurazione vita @it
label: Autres revenus - Réassurance-vie @fr
label: Otro ingreso - reaseguro de vida @es
label: Outras receitas - Resseguro de vida @pt
label: Sonstige Erträge - Lebensrückversicherung @de
label: Прочий доход - перестрах. жизни @ru
label: その他収益-生命再保険 @ja
label: 其他收入 - 人壽再保險 @zh-hant
label: 其他收入-人寿再保险 @zh
label: 기타수익 - 생명재보험 @ko
definition: This segment includes other income generated from life reinsurance business.
notation: 141412101112
valid from: 2014-08-08
valid till: 2020-10-03

Life Reinsurance Non-Premium
type: BicsLevel5Segment
type: Classifier
type: NamedIndividual
is level5 segment of: Life Reinsurance
is anachronous version of: http://data.ga-group.nl/ics/bics/141210131011
is contemporary version of: http://data.ga-group.nl/ics/bics/1414121011
is replaced by: http://data.ga-group.nl/ics/bics/2020/141210131011
is version of: http://data.ga-group.nl/ics/bics/141210131011
is version of: http://data.ga-group.nl/ics/bics/1414121011
imported on: 2026-06-08T13:03:47.798Z
last refreshed on: 2026-06-08T13:03:47.798Z
source accessed on: 2019-12-03T20:05:01Z
source last accessed on: 2019-12-03T20:05:01Z
label: Lebensrückversicherung - Nicht-Beiträge @de
label: Não prêmio de resseguro de vida @pt
label: Non premi riassicurazione vita @it
label: Réassurance-vie h primes @fr
label: Reaseguros de vida sin prima @es
label: Перестр. жизни - непрем. дхд @ru
label: 人壽再保險非保費收入 @zh-hant
label: 人寿再保险非保费 @zh
label: 保険料外収益-生命再保険 @ja
label: 생명 재보험 보험료외 @ko
definition: This segment includes total non-premium revenue generated from life reinsurance business.
notation: 1414121011
valid from: 2014-08-08
valid till: 2020-10-03

Life Reinsurance
type: BicsLevel4SubIndustry
type: Classifier
type: NamedIndividual
is sub industry of: Reinsurance
is anachronous version of: http://data.ga-group.nl/ics/bics/1412101310
is contemporary version of: http://data.ga-group.nl/ics/bics/14141210
is replaced by: http://data.ga-group.nl/ics/bics/2020/1412101310
is version of: http://data.ga-group.nl/ics/bics/1412101310
is version of: http://data.ga-group.nl/ics/bics/14141210
imported on: 2026-06-08T13:03:47.798Z
last refreshed on: 2026-06-08T13:03:47.798Z
source accessed on: 2019-12-03T20:05:01Z
source last accessed on: 2019-12-03T20:05:01Z
label: Comp réassurance vie @fr
label: Rückversicherung LV @de
label: Reaseguradoras vida @es
label: Resseguro de vida @pt
label: Riassicurazione vita @it
label: Перестрахование жизни @ru
label: 人壽再保險業者 @zh-hant
label: 人寿再保险承保人 @zh
label: 生命再保険 @ja
label: 생명 재보험업 @ko
definition: This industry subgroup includes companies that underwrite reinsurance for life insurance policies. Insurance types include life, accidental death, disability and annuities (pensions).
notation: 14141210
valid from: 2014-08-08
valid till: 2020-10-03

Specialty Lines Premiums
type: BicsLevel7Segment
type: Classifier
type: Discontinued
type: NamedIndividual
is level7 segment of: Casualty Lines Premiums
is contemporary version of: http://data.ga-group.nl/ics/bics/14141211101010
is version of: http://data.ga-group.nl/ics/bics/14141211101010
imported on: 2026-06-08T13:03:47.798Z
last refreshed on: 2026-06-08T13:03:47.798Z
source accessed on: 2019-12-03T20:05:01Z
source last accessed on: 2019-12-03T20:05:01Z
label: Beiträge - Sonderversicherungen @de
label: Prêmios de linhas de especialidades @pt
label: Premi linee speciali @it
label: Primas de líneas especializadas @es
label: Primes pour lignes spéciales @fr
label: Спец. линии - премии @ru
label: 特别险种保费 @zh
label: 特殊保険 @ja
label: 特殊險保費 @zh-hant
label: 전문보험 보험료 @ko
definition: This segment includes premium revenue generated from all reinsurance lines of business designated as specialty lines.
notation: 14141211101010
valid from: 2014-08-08
valid till: 2020-10-03

Other Casualty Lines Premiums
type: BicsLevel7Segment
type: Classifier
type: Discontinued
type: NamedIndividual
is level7 segment of: Casualty Lines Premiums
is contemporary version of: http://data.ga-group.nl/ics/bics/14141211101011
is version of: http://data.ga-group.nl/ics/bics/14141211101011
imported on: 2026-06-08T13:03:47.798Z
last refreshed on: 2026-06-08T13:03:47.798Z
source accessed on: 2019-12-03T20:05:01Z
source last accessed on: 2019-12-03T20:05:01Z
label: Beiträge - Sonstige Haftpflichtversicherungen @de
label: Otras primas de líneas de daños @es
label: Prêmios de outras linhas de acidentes @pt
label: Premi linee altri sinistri @it
label: Primes pour autres sinistres @fr
label: Прочие линии ущерба - премии @ru
label: その他災害保険 @ja
label: 其他意外险种保费 @zh
label: 其他意外險保費 @zh-hant
label: 기타 상해보험 보험료 @ko
definition: This segment includes premium revenue generated from all casualty reinsurance lines of business not elsewhere classified.
notation: 14141211101011
valid from: 2014-08-08
valid till: 2020-10-03

Casualty Lines Premiums
type: BicsLevel6Segment
type: Classifier
type: NamedIndividual
is level6 segment of: P&C Reinsurance Premiums
is anachronous version of: http://data.ga-group.nl/ics/bics/14121013111010
is contemporary version of: http://data.ga-group.nl/ics/bics/141412111010
is replaced by: http://data.ga-group.nl/ics/bics/2020/14121013111010
is version of: http://data.ga-group.nl/ics/bics/14121013111010
is version of: http://data.ga-group.nl/ics/bics/141412111010
imported on: 2026-06-08T13:03:47.798Z
last refreshed on: 2026-06-08T13:03:47.798Z
source accessed on: 2019-12-03T20:05:01Z
source last accessed on: 2019-12-03T20:05:01Z
label: Beiträge - Unfallversicherungen @de
label: Prêmios de linhas de acidentes @pt
label: Premi linee sinistri @it
label: Primas de líneas de daños @es
label: Primes pour sinistres @fr
label: Линии ущерба - премии @ru
label: 保険料-災害保険 @ja
label: 意外险种保费 @zh
label: 意外險保費 @zh-hant
label: 상해보험 보험료 @ko
definition: This segment includes premium revenue generated from all casualty reinsurance, including specialty coverage and all other casualty lines, including all liability lines of business.
notation: 141412111010
valid from: 2014-08-08
valid till: 2020-10-03

Catastrophe Coverage Premiums
type: BicsLevel7Segment
type: Classifier
type: Discontinued
type: NamedIndividual
is level7 segment of: Property Lines Premiums
is contemporary version of: http://data.ga-group.nl/ics/bics/14141211101110
is version of: http://data.ga-group.nl/ics/bics/14141211101110
imported on: 2026-06-08T13:03:47.798Z
last refreshed on: 2026-06-08T13:03:47.798Z
source accessed on: 2019-12-03T20:05:01Z
source last accessed on: 2019-12-03T20:05:01Z
label: Beiträge - Katastrophendeckung @de
label: Prêmio de cobertura contra catástrofes @pt
label: Premi copertura catastrofe @it
label: Primas cobertura de catástrofe @es
label: Primes pour catastrophes @fr
label: Покрытие убытков от катастроф - премии @ru
label: 保険料-大災害ｶﾊﾞﾚｯｼﾞ @ja
label: 巨災給付範圍保費 @zh-hant
label: 巨灾保障险保费 @zh
label: 재해보험 보험료 @ko
definition: This segment includes premium revenue generated from property catastrophe reinsurance business.
notation: 14141211101110
valid from: 2014-08-08
valid till: 2020-10-03

Other Property Coverage Prem
type: BicsLevel7Segment
type: Classifier
type: Discontinued
type: NamedIndividual
is level7 segment of: Property Lines Premiums
is contemporary version of: http://data.ga-group.nl/ics/bics/14141211101111
is version of: http://data.ga-group.nl/ics/bics/14141211101111
imported on: 2026-06-08T13:03:47.798Z
last refreshed on: 2026-06-08T13:03:47.798Z
source accessed on: 2019-12-03T20:05:01Z
source last accessed on: 2019-12-03T20:05:01Z
label: Beiträge - Sonstige Sachversicherungsdeckung @de
label: Otra prima de cobertura de propiedad @es
label: Prêm outras coberturas imobiliárias @pt
label: Premi altra copertura proprietà @it
label: Primes autre couverture relative aux pptés @fr
label: Проч. покр. ущерба недвиж. - премии @ru
label: 保険料-その他不動産ｶﾊﾞﾚｯｼﾞ @ja
label: 其他產物給��範圍保費 @zh-hant
label: 其他财产保障险保费 @zh
label: 기타 손해보험 보험료 @ko
definition: This segment includes premium revenue generated from property reinsurance not elsewhere classified.
notation: 14141211101111
valid from: 2014-08-08
valid till: 2020-10-03

Property Lines Premiums
type: BicsLevel6Segment
type: Classifier
type: NamedIndividual
is level6 segment of: P&C Reinsurance Premiums
is anachronous version of: http://data.ga-group.nl/ics/bics/14121013111011
is contemporary version of: http://data.ga-group.nl/ics/bics/141412111011
is replaced by: http://data.ga-group.nl/ics/bics/2020/14121013111011
is version of: http://data.ga-group.nl/ics/bics/14121013111011
is version of: http://data.ga-group.nl/ics/bics/141412111011
imported on: 2026-06-08T13:03:47.798Z
last refreshed on: 2026-06-08T13:03:47.798Z
source accessed on: 2019-12-03T20:05:01Z
source last accessed on: 2019-12-03T20:05:01Z
label: Beiträge - Sachversicherungen @de
label: Prêmios de linhas de imóveis @pt
label: Premi linee proprietà @it
label: Primas de líneas de propiedad @es
label: Primes pour propriétés @fr
label: Границы землевл��дения - премии @ru
label: 保険料-不動産保険 @ja
label: 產險保費 @zh-hant
label: 财产险种保费 @zh
label: 손해보험 보험료 @ko
definition: This segment includes premium revenue generated from all property reinsurance, including catastrophe coverage and business not specified as catastrophe reinsurance.
notation: 141412111011
valid from: 2014-08-08
valid till: 2020-10-03

P&C Reinsurance Premiums
type: BicsLevel5Segment
type: Classifier
type: NamedIndividual
is level5 segment of: P&C Reinsurance
is anachronous version of: http://data.ga-group.nl/ics/bics/141210131110
is contemporary version of: http://data.ga-group.nl/ics/bics/1414121110
is replaced by: http://data.ga-group.nl/ics/bics/2020/141210131110
is version of: http://data.ga-group.nl/ics/bics/141210131110
is version of: http://data.ga-group.nl/ics/bics/1414121110
imported on: 2026-06-08T13:03:47.798Z
last refreshed on: 2026-06-08T13:03:47.798Z
source accessed on: 2019-12-03T20:05:01Z
source last accessed on: 2019-12-03T20:05:01Z
label: Beiträge - S&U-Rückversicherung @de
label: P&C 재보험 보험료 @ko
label: Prêmios de resseguro P&C @pt
label: Premi riassicurazione P&C @it
label: Primas de reaseguro PyC @es
label: Primes réassurance IARD @fr
label: Перестрах. собств. и ущ. - премии @ru
label: 損害再保険ｰ保険料 @ja
label: 產物意外再保險保費 @zh-hant
label: 财产与意外再保险保费 @zh
definition: This segment includes premium revenue generated from property and casualty reinsurance business.
notation: 1414121110
valid from: 2014-08-08
valid till: 2020-10-03

Investment Income - P&C Re
type: BicsLevel6Segment
type: Classifier
type: NamedIndividual
is level6 segment of: P&C Reinsurance Non-Premium
is anachronous version of: http://data.ga-group.nl/ics/bics/14121013111110
is contemporary version of: http://data.ga-group.nl/ics/bics/141412111110
is replaced by: http://data.ga-group.nl/ics/bics/2020/14121013111110
is version of: http://data.ga-group.nl/ics/bics/14121013111110
is version of: http://data.ga-group.nl/ics/bics/141412111110
imported on: 2026-06-08T13:03:47.798Z
last refreshed on: 2026-06-08T13:03:47.798Z
source accessed on: 2019-12-03T20:05:01Z
source last accessed on: 2019-12-03T20:05:01Z
label: Ingreso de inversión - daños re @es
label: Investitionsertrag - S&U Rück @de
label: Produit financier - Réass IARD @fr
label: Receita de investimentos - Re P&C @pt
label: Reddito investimento - Riassic P&C @it
label: Инвест. доход - перестр. жизни @ru
label: 投資収益-損害再保険 @ja
label: 投資收入 - 產物意外再保險 @zh-hant
label: 投资收入-财产与意外再保险 @zh
label: 투자수익 - P&C 재보험 @ko
definition: This segment includes investment income generated from property and casualty reinsurance business.
notation: 141412111110
valid from: 2014-08-08
valid till: 2020-10-03

Realized G/L - P&C Reinsurance
type: BicsLevel6Segment
type: Classifier
type: NamedIndividual
is level6 segment of: P&C Reinsurance Non-Premium
is anachronous version of: http://data.ga-group.nl/ics/bics/14121013111111
is contemporary version of: http://data.ga-group.nl/ics/bics/141412111111
is replaced by: http://data.ga-group.nl/ics/bics/2020/14121013111111
is version of: http://data.ga-group.nl/ics/bics/14121013111111
is version of: http://data.ga-group.nl/ics/bics/141412111111
imported on: 2026-06-08T13:03:47.798Z
last refreshed on: 2026-06-08T13:03:47.798Z
source accessed on: 2019-12-03T20:05:01Z
source last accessed on: 2019-12-03T20:05:01Z
label: G/P realizados - Resseguro P&C @pt
label: P/G realizados - reaseguro de daños @es
label: P/P réalisés - Réassurance IARD @fr
label: P/P realizzati - Riassicurazione P&C @it
label: Realisierte GuV - S&U Rück @de
label: Реализ. П/У - перестрах. СиУ @ru
label: 実現損益-損害再保険 @ja
label: 已实现损益-财产与意外再保险 @zh
label: 已實現損益 - 產物意外再保險 @zh-hant
label: 실현손익 - P&C 재보험 @ko
definition: This segment includes realized gains/losses generated from property and casualty reinsurance business.
notation: 141412111111
valid from: 2014-08-08
valid till: 2020-10-03

Other Income - P&C Reinsurance
type: BicsLevel6Segment
type: Classifier
type: NamedIndividual
is level6 segment of: P&C Reinsurance Non-Premium
is anachronous version of: http://data.ga-group.nl/ics/bics/14121013111112
is contemporary version of: http://data.ga-group.nl/ics/bics/141412111112
is replaced by: http://data.ga-group.nl/ics/bics/2020/14121013111112
is version of: http://data.ga-group.nl/ics/bics/14121013111112
is version of: http://data.ga-group.nl/ics/bics/141412111112
imported on: 2026-06-08T13:03:47.798Z
last refreshed on: 2026-06-08T13:03:47.798Z
source accessed on: 2019-12-03T20:05:01Z
source last accessed on: 2019-12-03T20:05:01Z
label: Altro reddito - Riassic P&C @it
label: Autres rev - Réass IARD @fr
label: Otro ingreso - reaseguro de daños @es
label: Outras receitas - Resseguro P&C @pt
label: Sonstige Erträge - S&U-Rückversicherung @de
label: Прочий доход - перестр. СиУ @ru
label: その他収益-損害再保険 @ja
label: 其他收入 - 產物意外再保險 @zh-hant
label: 其他收入-财产与意外再保险 @zh
label: 기타수익 - P&C 재보험 @ko
definition: This segment includes other income generated from property and casualty reinsurance business.
notation: 141412111112
valid from: 2014-08-08
valid till: 2020-10-03

P&C Reinsurance Non-Premium
type: BicsLevel5Segment
type: Classifier
type: NamedIndividual
is level5 segment of: P&C Reinsurance
is anachronous version of: http://data.ga-group.nl/ics/bics/141210131111
is contemporary version of: http://data.ga-group.nl/ics/bics/1414121111
is replaced by: http://data.ga-group.nl/ics/bics/2020/141210131111
is version of: http://data.ga-group.nl/ics/bics/141210131111
is version of: http://data.ga-group.nl/ics/bics/1414121111
imported on: 2026-06-08T13:03:47.798Z
last refreshed on: 2026-06-08T13:03:47.798Z
source accessed on: 2019-12-03T20:05:01Z
source last accessed on: 2019-12-03T20:05:01Z
label: Não prêmio de resseguro P&C @pt
label: No primas de reaseguro PyC @es
label: Non premi riassicurazione P&C @it
label: P&C 재보험 보험료외 @ko
label: Réassurance IARD hors prime @fr
label: S&U-Rückversicherung - Nicht-Beiträge @de
label: Перестрах. собств. и ущ. - непрем. дхд @ru
label: 損害再保険ｰ非保険料 @ja
label: 產物意外再保險非保費收入 @zh-hant
label: 财产与意外再保险非保费 @zh
definition: This segment includes total non-premium revenue generated from property and casualty reinsurance business.
notation: 1414121111
valid from: 2014-08-08
valid till: 2020-10-03

P&C Reinsurance
type: BicsLevel4SubIndustry
type: Classifier
type: NamedIndividual
is sub industry of: Reinsurance
is anachronous version of: http://data.ga-group.nl/ics/bics/1412101311
is contemporary version of: http://data.ga-group.nl/ics/bics/14141211
is replaced by: http://data.ga-group.nl/ics/bics/2020/1412101311
is version of: http://data.ga-group.nl/ics/bics/1412101311
is version of: http://data.ga-group.nl/ics/bics/14141211
imported on: 2026-06-08T13:03:47.798Z
last refreshed on: 2026-06-08T13:03:47.798Z
source accessed on: 2019-12-03T20:05:01Z
source last accessed on: 2019-12-03T20:05:01Z
label: P&C Riassicurazione @it
label: P&C 재보험 @ko
label: P&C再保险 @zh
label: Réassurance IARD @fr
label: Reaseguro PyC @es
label: Resseguro P&C @pt
label: S&U-Rückversicherung @de
label: Перестрахование собственности и ущерба @ru
label: 損害再保険 @ja
label: 產物意外再保險 @zh-hant
definition: This industry subgroup includes companies that underwrite reinsurance for property and casualty insurance policies. Insurance types include automobile, property damage, casualty, theft, fire, malpractice, marine, workers' compensation and homeowners insurance.
notation: 14141211
valid from: 2014-08-08
valid till: 2020-10-03

Reinsurance
type: BicsLevel3Industry
type: Classifier
type: NamedIndividual
is industry of: Insurance
is anachronous version of: http://data.ga-group.nl/ics/bics/14121013
is contemporary version of: http://data.ga-group.nl/ics/bics/141412
is replaced by: http://data.ga-group.nl/ics/bics/2020/14121013
is version of: http://data.ga-group.nl/ics/bics/14121013
is version of: http://data.ga-group.nl/ics/bics/141412
imported on: 2026-06-08T13:03:47.798Z
last refreshed on: 2026-06-08T13:03:47.798Z
source accessed on: 2019-12-03T20:05:01Z
source last accessed on: 2019-12-03T20:05:01Z
label: Réassurance @fr
label: Rückversicherung @de
label: Reaseguro @es
label: Resseguro @pt
label: Riassicurazioni @it
label: Перестрахование @ru
label: 再保 @zh-hant
label: 再保险 @zh
label: 再保険 @ja
label: 재보험 @ko
definition: This industry includes companies that underwrite reinsurance for life, health and medical, property and casualty, title, and other insurance policies.
notation: 141412
valid from: 2014-08-08
valid till: 2020-10-03

Insurance Brokers
type: BicsLevel3Industry
type: Classifier
type: NamedIndividual
is industry of: Insurance
is anachronous version of: http://data.ga-group.nl/ics/bics/14121014
is contemporary version of: http://data.ga-group.nl/ics/bics/141413
is replaced by: http://data.ga-group.nl/ics/bics/2020/14121014
is version of: http://data.ga-group.nl/ics/bics/14121014
is version of: http://data.ga-group.nl/ics/bics/141413
imported on: 2026-06-08T13:03:47.798Z
last refreshed on: 2026-06-08T13:03:47.798Z
source accessed on: 2019-12-03T20:05:01Z
source last accessed on: 2019-12-03T20:05:01Z
label: Broker assicurazione @it
label: Brokers de seguros @es
label: Courtiers assurance @fr
label: Seguradoras @pt
label: VersichMakler @de
label: Страховые агенты @ru
label: 保险经纪 @zh
label: 保険ﾌﾞﾛｰｶｰ業 @ja
label: 保險經紀 @zh-hant
label: 보험대리점 @ko
definition: This industry includes companies that act as insurance intermediaries that sell insurance policies and other insurance-related products like annuities.
notation: 141413
valid from: 2014-08-08
valid till: 2020-10-03

Claims Adjusting
type: BicsLevel4SubIndustry
type: Classifier
type: Discontinued
type: NamedIndividual
is sub industry of: Insurance Services & Other
is contemporary version of: http://data.ga-group.nl/ics/bics/14141410
is version of: http://data.ga-group.nl/ics/bics/14141410
imported on: 2026-06-08T13:03:47.798Z
last refreshed on: 2026-06-08T13:03:47.798Z
source accessed on: 2019-12-03T20:05:01Z
source last accessed on: 2019-12-03T20:05:01Z
label: Ajuste de reclamos @es
label: Avaliação do pedido de seguro @pt
label: Experts en sinistres @fr
label: Limitaz reclami @it
label: Schadensanpassung @de
label: Урегулирование страховых исков @ru
label: 保険請求調整 @ja
label: 核保理賠 @zh-hant
label: 索赔调整 @zh
label: 조정 청구 @ko
definition: This industry subgroup includes companies that offer claims adjusting services, such as insurance claims investigation services.
notation: 14141410
valid from: 2014-08-08
valid till: 2020-10-03

Insurance Related Svcs - Other
type: BicsLevel4SubIndustry
type: Classifier
type: Discontinued
type: NamedIndividual
is sub industry of: Insurance Services & Other
is contemporary version of: http://data.ga-group.nl/ics/bics/14141411
is version of: http://data.ga-group.nl/ics/bics/14141411
imported on: 2026-06-08T13:03:47.798Z
last refreshed on: 2026-06-08T13:03:47.798Z
source accessed on: 2019-12-03T20:05:01Z
source last accessed on: 2019-12-03T20:05:01Z
label: Serv associati assicurazione - Altro @it
label: Serv liés à l'assurance - Autres @fr
label: Serv relacionados a seguros - Outros @pt
label: Servicios relacionadas con seguros - otros @es
label: Versicherungsbezogene Dienstl. - Sonstige @de
label: Услуги страхования - прочие @ru
label: 保险相关服务-其他 @zh
label: 保険関連ｻｰﾋﾞｽ-その他 @ja
label: 保險相關服務 - 其他 @zh-hant
label: 보험 관련 서비스 - 기타 @ko
definition: This industry subgroup includes companies that offer other insurance related services not elsewhere classified, such as actuarial services, loss prevention services, insurance exchanges, advisory services, consulting services and insurance reporting services.
notation: 14141411
valid from: 2014-08-08
valid till: 2020-10-03

Other Insurance Premiums
type: BicsLevel4SubIndustry
type: Classifier
type: Discontinued
type: NamedIndividual
is sub industry of: Insurance Services & Other
is contemporary version of: http://data.ga-group.nl/ics/bics/14141412
is version of: http://data.ga-group.nl/ics/bics/14141412
imported on: 2026-06-08T13:03:47.798Z
last refreshed on: 2026-06-08T13:03:47.798Z
source accessed on: 2019-12-03T20:05:01Z
source last accessed on: 2019-12-03T20:05:01Z
label: Autres primes d'assurance @fr
label: Beiträge - Sonstige Versicherung @de
label: Otras primas de seguros @es
label: Outros prêmios de seguro @pt
label: Premi altri assicuratori @it
label: Прочие страх. премии @ru
label: 保険料収益-その他保険会社 @ja
label: 其他保险保费 @zh
label: 其他保險保費 @zh-hant
label: 기타 보험 보험료 @ko
definition: This industry subgroup includes premium revenue generated from other direct insurance business.
notation: 14141412
valid from: 2014-08-08
valid till: 2020-10-03

Investment Inc - Other Insurance
type: BicsLevel5Segment
type: Classifier
type: Discontinued
type: NamedIndividual
is level5 segment of: Other Insurance Non-Premium
is contemporary version of: http://data.ga-group.nl/ics/bics/1414141310
is version of: http://data.ga-group.nl/ics/bics/1414141310
imported on: 2026-06-08T13:03:47.798Z
last refreshed on: 2026-06-08T13:03:47.798Z
source accessed on: 2019-12-03T20:05:01Z
source last accessed on: 2019-12-03T20:05:01Z
label: Ingreso de inversión - otro seguro @es
label: Investitionsertrag - Sonstige Versicherung @de
label: Prod financier - Autres cies d'assurance @fr
label: Rec investimentos- Outros seguros @pt
label: Redd investimento - Altri assicuratori @it
label: Инвест. доход - др. страх. комп. @ru
label: 投資収益-その他保険会社 @ja
label: 投資收入 - 其他保險 @zh-hant
label: 投资收入-其他保险 @zh
label: 투자수익 - 기타 보험 @ko
definition: This segment includes investment income generated from other direct insurance business.
notation: 1414141310
valid from: 2014-08-08
valid till: 2020-10-03

Realized G/L - Other Insurance
type: BicsLevel5Segment
type: Classifier
type: Discontinued
type: NamedIndividual
is level5 segment of: Other Insurance Non-Premium
is contemporary version of: http://data.ga-group.nl/ics/bics/1414141311
is version of: http://data.ga-group.nl/ics/bics/1414141311
imported on: 2026-06-08T13:03:47.798Z
last refreshed on: 2026-06-08T13:03:47.798Z
source accessed on: 2019-12-03T20:05:01Z
source last accessed on: 2019-12-03T20:05:01Z
label: G/P realizados - Outros seguros @pt
label: P/G realizados - otros seguros @es
label: P/P rRealizzati - Altre assicurazioni @it
label: P/P réalisés - Autres cies d'assurance @fr
label: Realisierte G/V - Sonstige Versicherung @de
label: Реализ. П/У - др. страх. компании @ru
label: 実現損益-その他保険会社 @ja
label: 已实现损益-其他保险 @zh
label: 已實現損益 - 其他保險 @zh-hant
label: 실현손익 - 기타 보험 @ko
definition: This segment includes realized gains/losses generated from other direct insurance business.
notation: 1414141311
valid from: 2014-08-08
valid till: 2020-10-03

Other Income - Other Insurance
type: BicsLevel5Segment
type: Classifier
type: Discontinued
type: NamedIndividual
is level5 segment of: Other Insurance Non-Premium
is contemporary version of: http://data.ga-group.nl/ics/bics/1414141312
is version of: http://data.ga-group.nl/ics/bics/1414141312
imported on: 2026-06-08T13:03:47.798Z
last refreshed on: 2026-06-08T13:03:47.798Z
source accessed on: 2019-12-03T20:05:01Z
source last accessed on: 2019-12-03T20:05:01Z
label: Altro reddito - Altri assicuratori @it
label: Autres rev - Autres cies d'assurance @fr
label: Otro ingreso - otro seguro @es
label: Outras receitas - Outros seguros @pt
label: Sonstiger Ertrag - Sonstige Versicherung @de
label: Прочий доход - др. страх. @ru
label: その他収益-その他保険会社 @ja
label: 其他收入 - 其他保險 @zh-hant
label: 其他收入-其他保险 @zh
label: 기타수익 - 기타 보험 @ko
definition: This segment includes other income generated from other direct insurance business.
notation: 1414141312
valid from: 2014-08-08
valid till: 2020-10-03

Other Insurance Non-Premium
type: BicsLevel4SubIndustry
type: Classifier
type: Discontinued
type: NamedIndividual
is sub industry of: Insurance Services & Other
is contemporary version of: http://data.ga-group.nl/ics/bics/14141413
is version of: http://data.ga-group.nl/ics/bics/14141413
imported on: 2026-06-08T13:03:47.798Z
last refreshed on: 2026-06-08T13:03:47.798Z
source accessed on: 2019-12-03T20:05:01Z
source last accessed on: 2019-12-03T20:05:01Z
label: Autres services d'assurance hors prime @fr
label: Nicht-Beiträge - Sonstige Versicherung @de
label: Non premi altri assicuratori @it
label: Otro seguro sin prima @es
label: Outros não prêmio de seguro @pt
label: Прочее страхование - непрем. дхд @ru
label: 其他保险非保费 @zh
label: 其他保險非保費收入 @zh-hant
label: 非保険料収益-その他保険会社 @ja
label: 기타 보험 보험료외 @ko
definition: This industry subgroup includes total non-premium revenue generated from other direct insurance business.
notation: 14141413
valid from: 2014-08-08
valid till: 2020-10-03

Self Insurance Funds
type: BicsLevel4SubIndustry
type: Classifier
type: Discontinued
type: NamedIndividual
is sub industry of: Insurance Services & Other
is contemporary version of: http://data.ga-group.nl/ics/bics/14141414
is version of: http://data.ga-group.nl/ics/bics/14141414
imported on: 2026-06-08T13:03:47.798Z
last refreshed on: 2026-06-08T13:03:47.798Z
source accessed on: 2019-12-03T20:05:01Z
source last accessed on: 2019-12-03T20:05:01Z
label: Fondi assic privata @it
label: Fondos de seguros propios @es
label: Fonds d'auto-assurance @fr
label: Fundos de seguros automáticos @pt
label: Selbstversicherungsfonds @de
label: Фонды самострахования @ru
label: その他保険基金 @ja
label: 自保基金 @zh
label: 自我保險基金 @zh-hant
label: 자기보험 기금 @ko
definition: This industry subgroup includes self-insurance funds.
notation: 14141414
valid from: 2014-08-08
valid till: 2020-10-03

Third Party Admin of Insurance
type: BicsLevel4SubIndustry
type: Classifier
type: Discontinued
type: NamedIndividual
is sub industry of: Insurance Services & Other
is contemporary version of: http://data.ga-group.nl/ics/bics/14141415
is version of: http://data.ga-group.nl/ics/bics/14141415
imported on: 2026-06-08T13:03:47.798Z
last refreshed on: 2026-06-08T13:03:47.798Z
source accessed on: 2019-12-03T20:05:01Z
source last accessed on: 2019-12-03T20:05:01Z
label: Admin d'assur par tierce partie @fr
label: Admin terceirizada de seguros @pt
label: Ammin terzi assicurazione @it
label: Drittanbieterverw. von Versicherungen @de
label: Gestión por terceros de seguros @es
label: Независимое администр. страхования @ru
label: 保险第三方管理 @zh
label: 保険第三者管理機関 @ja
label: 第三方保險管理 @zh-hant
label: 제 3자 보험 관리 @ko
definition: This industry subgroup includes companies that offer third-party administration of insurance and pension plans, such as claims processing.
notation: 14141415
valid from: 2014-08-08
valid till: 2020-10-03

Insurance Services & Other
type: BicsLevel3Industry
type: Classifier
type: Discontinued
type: NamedIndividual
is industry of: Insurance
is contemporary version of: http://data.ga-group.nl/ics/bics/141414
is version of: http://data.ga-group.nl/ics/bics/141414
imported on: 2026-06-08T13:03:47.798Z
last refreshed on: 2026-06-08T13:03:47.798Z
source accessed on: 2019-12-03T20:05:01Z
source last accessed on: 2019-12-03T20:05:01Z
label: Altri servizi di assicurazione @it
label: Serv d'assurance/autres @fr
label: Serv seg e outros @pt
label: Serv seguros/otros @es
label: VersichDienste & sonst. @de
label: Услуги страхов. и прочее @ru
label: 保险服务及其他 @zh
label: 保険ｻｰﾋﾞｽ･その他 @ja
label: 保險服務及其他 @zh-hant
label: 보험 서비스 & 기타 @ko
definition: This industry includes companies that provide insurance-related services, such as claims adjusting, third-party administration of insurance plans, actuarial services, loss prevention services, insurance exchanges, claims processing and self-insurance funds.
notation: 141414
valid from: 2014-08-08
valid till: 2020-10-03

Islamic Health Ins Premiums
type: BicsLevel5Segment
type: Classifier
type: NamedIndividual
is level5 segment of: Health Insurance - Islamic
is anachronous version of: http://data.ga-group.nl/ics/bics/141210121010
is contemporary version of: http://data.ga-group.nl/ics/bics/1414151010
is replaced by: http://data.ga-group.nl/ics/bics/2020/141210121010
is version of: http://data.ga-group.nl/ics/bics/141210121010
is version of: http://data.ga-group.nl/ics/bics/1414151010
imported on: 2026-06-08T13:03:47.798Z
last refreshed on: 2026-06-08T13:03:47.798Z
source accessed on: 2019-12-03T20:05:01Z
source last accessed on: 2019-12-03T20:05:01Z
label: Beiträge - Islamische KV @de
label: Prêmios de seg saúde islâmicos @pt
label: Premi assic medica islamica @it
label: Primas islámicas de seg de salud @es
label: Primes assur santé islamique @fr
label: Исламское мед. страх. - премии @ru
label: 伊斯兰健康保险保费 @zh
label: 伊斯蘭健康險保費 @zh-hant
label: 保険料-健保-ｲｽﾗﾑ @ja
label: 이슬람 건강보험 보험료 @ko
definition: This segment includes premium revenue generated from direct health business in compliance with Islamic law.
notation: 1414151010
valid from: 2014-08-08
valid till: 2020-10-03

Invst Inc - Islamic Health Ins
type: BicsLevel6Segment
type: Classifier
type: NamedIndividual
is level6 segment of: Islamic Health Non-Premium
is anachronous version of: http://data.ga-group.nl/ics/bics/14121012101110
is contemporary version of: http://data.ga-group.nl/ics/bics/141415101110
is replaced by: http://data.ga-group.nl/ics/bics/2020/14121012101110
is version of: http://data.ga-group.nl/ics/bics/14121012101110
is version of: http://data.ga-group.nl/ics/bics/141415101110
imported on: 2026-06-08T13:03:47.798Z
last refreshed on: 2026-06-08T13:03:47.798Z
source accessed on: 2019-12-03T20:05:01Z
source last accessed on: 2019-12-03T20:05:01Z
label: Ingreso de inversión - seguro de vida islámico @es
label: Investitionsertrag - Islamische KV @de
label: Prod financ - Ass santé islamique @fr
label: Redd invest - Assic medica islamica @it
label: Renda de inv - Seg saúde islâmico @pt
label: Инвест. доход - ислам. мед. страхование @ru
label: 投資収益-健保(ｲｽﾗﾑ) @ja
label: 投資收入 - 伊斯蘭健康險 @zh-hant
label: 投资收入-伊斯兰健康保险 @zh
label: 투자수익 - 이슬람 건강보험 @ko
definition: This segment includes investment income generated from direct health business in compliance with Islamic law.
notation: 141415101110
valid from: 2014-08-08
valid till: 2020-10-03

Realized G/L - Islamic Health
type: BicsLevel6Segment
type: Classifier
type: NamedIndividual
is level6 segment of: Islamic Health Non-Premium
is anachronous version of: http://data.ga-group.nl/ics/bics/14121012101111
is contemporary version of: http://data.ga-group.nl/ics/bics/141415101111
is replaced by: http://data.ga-group.nl/ics/bics/2020/14121012101111
is version of: http://data.ga-group.nl/ics/bics/14121012101111
is version of: http://data.ga-group.nl/ics/bics/141415101111
imported on: 2026-06-08T13:03:47.798Z
last refreshed on: 2026-06-08T13:03:47.798Z
source accessed on: 2019-12-03T20:05:01Z
source last accessed on: 2019-12-03T20:05:01Z
label: G/P realizados - Saúde islâmico @pt
label: P/G realizados - sanidad islámico @es
label: P/P réalisés - Ass santé islamique @fr
label: P/P realizzati - Medica islamica @it
label: Realisierte G/V - Islamische KV @de
label: Реализ. П/У - исл. мед. страх. @ru
label: 実現損益-健保-ｲｽﾗﾑ @ja
label: 已实现损益-伊斯兰健康保险 @zh
label: 已實現損益 - 伊斯蘭健康險 @zh-hant
label: 실현손익 - 이슬람 건강 @ko
definition: This segment includes realized gains/losses generated from direct health business in compliance with Islamic law.
notation: 141415101111
valid from: 2014-08-08
valid till: 2020-10-03

Other Income - Islamic Health
type: BicsLevel6Segment
type: Classifier
type: NamedIndividual
is level6 segment of: Islamic Health Non-Premium
is anachronous version of: http://data.ga-group.nl/ics/bics/14121012101112
is contemporary version of: http://data.ga-group.nl/ics/bics/141415101112
is replaced by: http://data.ga-group.nl/ics/bics/2020/14121012101112
is version of: http://data.ga-group.nl/ics/bics/14121012101112
is version of: http://data.ga-group.nl/ics/bics/141415101112
imported on: 2026-06-08T13:03:47.798Z
last refreshed on: 2026-06-08T13:03:47.798Z
source accessed on: 2019-12-03T20:05:01Z
source last accessed on: 2019-12-03T20:05:01Z
label: Altro reddito - Medica islamica @it
label: Autres rev- Ass santé islamique @fr
label: Otro ingreso - sanidad islámica @es
label: Outra renda - Saúde islâmico @pt
label: Sonstiger Ertrag - Islamische KV @de
label: Прочий доход - ислам. мед. страх. @ru
label: 他収益-健保-ｲｽﾗﾑ @ja
label: 其他收入 - 伊斯蘭健康險 @zh-hant
label: 其他收入-伊斯兰健康保险 @zh
label: 기타수익 - 이슬람 건강 @ko
definition: This segment includes other income generated from direct health business in compliance with Islamic law.
notation: 141415101112
valid from: 2014-08-08
valid till: 2020-10-03

Islamic Health Non-Premium
type: BicsLevel5Segment
type: Classifier
type: NamedIndividual
is level5 segment of: Health Insurance - Islamic
is anachronous version of: http://data.ga-group.nl/ics/bics/141210121011
is contemporary version of: http://data.ga-group.nl/ics/bics/1414151011
is replaced by: http://data.ga-group.nl/ics/bics/2020/141210121011
is version of: http://data.ga-group.nl/ics/bics/141210121011
is version of: http://data.ga-group.nl/ics/bics/1414151011
imported on: 2026-06-08T13:03:47.798Z
last refreshed on: 2026-06-08T13:03:47.798Z
source accessed on: 2019-12-03T20:05:01Z
source last accessed on: 2019-12-03T20:05:01Z
label: Não prêmio de saúde islâmicos @pt
label: Nicht-Beiträge - Islamische KV @de
label: Non premi assic medica islamica @it
label: Rev santé islamique h primes @fr
label: Sanidad islámica sin prima @es
label: Исламское мед. страх. - непрем. дхд @ru
label: 伊斯兰健康保险非保费 @zh
label: 伊��蘭健康險非保費收入 @zh-hant
label: 非保険料収益-健保(ｲｽﾗﾑ) @ja
label: 이슬람 건강 보험료외 @ko
definition: This segment includes total non-premium revenue generated from direct health business in compliance with Islamic law.
notation: 1414151011
valid from: 2014-08-08
valid till: 2020-10-03

Health Insurance - Islamic
type: BicsLevel4SubIndustry
type: Classifier
type: NamedIndividual
is sub industry of: Islamic Insurance Carriers
is anachronous version of: http://data.ga-group.nl/ics/bics/1412101210
is contemporary version of: http://data.ga-group.nl/ics/bics/14141510
is replaced by: http://data.ga-group.nl/ics/bics/2020/1412101210
is version of: http://data.ga-group.nl/ics/bics/1412101210
is version of: http://data.ga-group.nl/ics/bics/14141510
imported on: 2026-06-08T13:03:47.798Z
last refreshed on: 2026-06-08T13:03:47.798Z
source accessed on: 2019-12-03T20:05:01Z
source last accessed on: 2019-12-03T20:05:01Z
label: Assic med-Islamica @it
label: Assu santé islamique @fr
label: KV - Islamisch @de
label: Seg saúde - Islâmico @pt
label: Seguro médico - Islam @es
label: Страхование жизни (Исламские) @ru
label: 伊斯蘭健康保險 @zh-hant
label: 健康保险 - 伊斯兰 @zh
label: 健康保険会社-ｲｽﾗﾑ @ja
label: 건강보험업-이슬람 @ko
definition: This industry subgroup includes companies that directly underwrite health insurance policies in compliance with Islamic law. Such policies include both health and medical insurance.
notation: 14141510
valid from: 2014-08-08
valid till: 2020-10-03

Islamic Life Ins Premiums
type: BicsLevel5Segment
type: Classifier
type: NamedIndividual
is level5 segment of: Life Insurance - Islamic
is anachronous version of: http://data.ga-group.nl/ics/bics/141210121110
is contemporary version of: http://data.ga-group.nl/ics/bics/1414151110
is replaced by: http://data.ga-group.nl/ics/bics/2020/141210121110
is version of: http://data.ga-group.nl/ics/bics/141210121110
is version of: http://data.ga-group.nl/ics/bics/1414151110
imported on: 2026-06-08T13:03:47.798Z
last refreshed on: 2026-06-08T13:03:47.798Z
source accessed on: 2019-12-03T20:05:01Z
source last accessed on: 2019-12-03T20:05:01Z
label: Beiträge - Islamische LV @de
label: Prêmios de seg vida islâmicos @pt
label: Premi assic vita islamica @it
label: Primas islámicas de seg de vida @es
label: Primes assur vie islamique @fr
label: Исламское страх. жизни - премии @ru
label: 伊斯兰寿险保费 @zh
label: 伊斯蘭壽險保費 @zh-hant
label: 保険料収入-ｲｽﾗﾑ系生命保険 @ja
label: 이슬람 생명보험 보험료 @ko
definition: This segment includes premium revenue generated from direct life business in compliance with Islamic law.
notation: 1414151110
valid from: 2014-08-08
valid till: 2020-10-03

Invst Income - Islamic Life Ins
type: BicsLevel6Segment
type: Classifier
type: NamedIndividual
is level6 segment of: Islamic Life Ins Non-Premium
is anachronous version of: http://data.ga-group.nl/ics/bics/14121012111110
is contemporary version of: http://data.ga-group.nl/ics/bics/141415111110
is replaced by: http://data.ga-group.nl/ics/bics/2020/14121012111110
is version of: http://data.ga-group.nl/ics/bics/14121012111110
is version of: http://data.ga-group.nl/ics/bics/141415111110
imported on: 2026-06-08T13:03:47.798Z
last refreshed on: 2026-06-08T13:03:47.798Z
source accessed on: 2019-12-03T20:05:01Z
source last accessed on: 2019-12-03T20:05:01Z
label: Ingreso - seguro de vida islámico @es
label: Investitionsertrag - Islamische LV @de
label: Prod financ - Assur-vie islamique @fr
label: Rec invest - Seg vida islâmico @pt
label: Reddito invst - Assic vita islamica @it
label: Инвестиц. доход - ислам. страх. жизни @ru
label: 投資収益-ｲｽﾗﾑ生命保険 @ja
label: 投資收入 - 伊斯蘭人壽保險 @zh-hant
label: 投资收入-伊斯兰人寿保险 @zh
label: 투자수익 - 이슬람 생명 보험 @ko
definition: This segment includes investment income generated from direct life business in compliance with Islamic law.
notation: 141415111110
valid from: 2014-08-08
valid till: 2020-10-03

Realized G/L - Islamic Life Ins
type: BicsLevel6Segment
type: Classifier
type: NamedIndividual
is level6 segment of: Islamic Life Ins Non-Premium
is anachronous version of: http://data.ga-group.nl/ics/bics/14121012111111
is contemporary version of: http://data.ga-group.nl/ics/bics/141415111111
is replaced by: http://data.ga-group.nl/ics/bics/2020/14121012111111
is version of: http://data.ga-group.nl/ics/bics/14121012111111
is version of: http://data.ga-group.nl/ics/bics/141415111111
imported on: 2026-06-08T13:03:47.798Z
last refreshed on: 2026-06-08T13:03:47.798Z
source accessed on: 2019-12-03T20:05:01Z
source last accessed on: 2019-12-03T20:05:01Z
label: G/P realizados - Seg vida islâmico @pt
label: P/G realizados - seguro islámico de vida @es
label: P/P réalisés - Assur-vie islamique @fr
label: P/P realizzati - Assic vita islamica @it
label: Realisierte G/V - Islamische LV @de
label: Реализ. П/У - исл. страх. жизни @ru
label: 実現損益-ｲｽﾗﾑ生命保険 @ja
label: 已实现损益-伊斯兰人寿保险 @zh
label: 已實現損益 - 伊斯蘭人壽保險 @zh-hant
label: 실현손익 - 이슬람 생명 보험 @ko
definition: This segment includes realized gains/losses generated from direct life business in compliance with Islamic law.
notation: 141415111111
valid from: 2014-08-08
valid till: 2020-10-03

Other Income - Islamic Life Ins
type: BicsLevel6Segment
type: Classifier
type: NamedIndividual
is level6 segment of: Islamic Life Ins Non-Premium
is anachronous version of: http://data.ga-group.nl/ics/bics/14121012111112
is contemporary version of: http://data.ga-group.nl/ics/bics/141415111112
is replaced by: http://data.ga-group.nl/ics/bics/2020/14121012111112
is version of: http://data.ga-group.nl/ics/bics/14121012111112
is version of: http://data.ga-group.nl/ics/bics/141415111112
imported on: 2026-06-08T13:03:47.798Z
last refreshed on: 2026-06-08T13:03:47.798Z
source accessed on: 2019-12-03T20:05:01Z
source last accessed on: 2019-12-03T20:05:01Z
label: Altro reddito - Assic vita islamica @it
label: Autres rev - Assur-vie islamique @fr
label: Otro ingreso - seguro de vida islámico @es
label: Outras receitas - Seg vida islâmico @pt
label: Sonstiger Ertrag - Islamische LV @de
label: Проч. доход - ислам. страх. жизни @ru
label: その他収益-ｲｽﾗﾑ生命保険 @ja
label: 其他收入 - 伊斯蘭人壽保險 @zh-hant
label: 其他收入-伊斯兰人寿保险 @zh
label: 기타수익 - 이슬람 생명 보험 @ko
definition: This segment includes other income generated from direct life business in compliance with Islamic law.
notation: 141415111112
valid from: 2014-08-08
valid till: 2020-10-03

Islamic Life Ins Non-Premium
type: BicsLevel5Segment
type: Classifier
type: NamedIndividual
is level5 segment of: Life Insurance - Islamic
is anachronous version of: http://data.ga-group.nl/ics/bics/141210121111
is contemporary version of: http://data.ga-group.nl/ics/bics/1414151111
is replaced by: http://data.ga-group.nl/ics/bics/2020/141210121111
is version of: http://data.ga-group.nl/ics/bics/141210121111
is version of: http://data.ga-group.nl/ics/bics/1414151111
imported on: 2026-06-08T13:03:47.798Z
last refreshed on: 2026-06-08T13:03:47.798Z
source accessed on: 2019-12-03T20:05:01Z
source last accessed on: 2019-12-03T20:05:01Z
label: Assur vie islamique h primes @fr
label: Não prêmio seg vida islâmicos @pt
label: Nicht-Beiträge - Islamische LV @de
label: Non premi assic vita islamica @it
label: Seg de vida islámico sin prima @es
label: Исламское страх. жизни - непремиальн. @ru
label: 伊斯兰寿险非保费 @zh
label: 伊斯蘭壽險非保費收入 @zh-hant
label: 非保険料収益-ｲｽﾗﾑ生命保険 @ja
label: 이슬람 생명보험 보험료외 @ko
definition: This segment includes total non-premium revenue generated from direct life business in compliance with Islamic law.
notation: 1414151111
valid from: 2014-08-08
valid till: 2020-10-03

Life Insurance - Islamic
type: BicsLevel4SubIndustry
type: Classifier
type: NamedIndividual
is sub industry of: Islamic Insurance Carriers
is anachronous version of: http://data.ga-group.nl/ics/bics/1412101211
is contemporary version of: http://data.ga-group.nl/ics/bics/14141511
is replaced by: http://data.ga-group.nl/ics/bics/2020/1412101211
is version of: http://data.ga-group.nl/ics/bics/1412101211
is version of: http://data.ga-group.nl/ics/bics/14141511
imported on: 2026-06-08T13:03:47.798Z
last refreshed on: 2026-06-08T13:03:47.798Z
source accessed on: 2019-12-03T20:05:01Z
source last accessed on: 2019-12-03T20:05:01Z
label: Assicuraz vita - islamico @it
label: Assurance vie - Islamique @fr
label: Lebensversicherung - Islamisch @de
label: Seguro de vida - Islámico @es
label: Seguro de vida - islâmico @pt
label: Страхование жизни - Исламское @ru
label: 人壽保險 - 伊斯蘭 @zh-hant
label: 人寿保险- 伊斯兰 @zh
label: 生命保険-ｲｽﾗﾑ @ja
label: 생명 보험 - 이슬람 @ko
definition: This industry subgroup includes companies that directly underwrite life insurance policies in compliance with Islamic law. Insurance types include life, accidental death, disability and annuities (pensions).
notation: 14141511
valid from: 2014-08-08
valid till: 2020-10-03

Islamic P&C Ins Premiums
type: BicsLevel5Segment
type: Classifier
type: NamedIndividual
is level5 segment of: P&C Insurance - Islamic
is anachronous version of: http://data.ga-group.nl/ics/bics/141210121210
is contemporary version of: http://data.ga-group.nl/ics/bics/1414151210
is replaced by: http://data.ga-group.nl/ics/bics/2020/141210121210
is version of: http://data.ga-group.nl/ics/bics/141210121210
is version of: http://data.ga-group.nl/ics/bics/1414151210
imported on: 2026-06-08T13:03:47.798Z
last refreshed on: 2026-06-08T13:03:47.798Z
source accessed on: 2019-12-03T20:05:01Z
source last accessed on: 2019-12-03T20:05:01Z
label: Beiträge - Islamische S&U @de
label: Prêmios de seg P&C islâmicos @pt
label: Premi assic P&C islamica @it
label: Primas islámicas de seg daños @es
label: Primes assur IARD islamique @fr
label: Исламск. страхование СиУ - премии @ru
label: 伊斯兰财产与意外保险保费 @zh
label: 伊斯蘭產物意外險保費 @zh-hant
label: 保険料収益-ｲｽﾗﾑ損害保険 @ja
label: 이슬람 P&C 보험 보험료 @ko
definition: This segment includes premium revenue generated from direct property and casualty business in compliance with Islamic law.
notation: 1414151210
valid from: 2014-08-08
valid till: 2020-10-03

Invst Income - Islamic P&C Ins
type: BicsLevel6Segment
type: Classifier
type: NamedIndividual
is level6 segment of: Islamic P&C Ins Non-Premium
is anachronous version of: http://data.ga-group.nl/ics/bics/14121012121110
is contemporary version of: http://data.ga-group.nl/ics/bics/141415121110
is replaced by: http://data.ga-group.nl/ics/bics/2020/14121012121110
is version of: http://data.ga-group.nl/ics/bics/14121012121110
is version of: http://data.ga-group.nl/ics/bics/141415121110
imported on: 2026-06-08T13:03:47.798Z
last refreshed on: 2026-06-08T13:03:47.798Z
source accessed on: 2019-12-03T20:05:01Z
source last accessed on: 2019-12-03T20:05:01Z
label: Ingreso - seguro islámico de daños @es
label: Investitionsertrag - Islamische S&U-Versicherung @de
label: Prod financ - Assur IARD islamique @fr
label: Rec invest - Seg P&C islâmico @pt
label: Redd invest - Assic P&C islamica @it
label: Инвестиц. доход - ислам. страх. СиУ @ru
label: 投資収益-ｲｽﾗﾑ損害保険 @ja
label: 投資收入 - 伊斯蘭產物意外險 @zh-hant
label: 投资收入-伊斯兰财产与意外保险 @zh
label: 투자수익 - 이슬람 P&C 보험 @ko
definition: This segment includes investment income generated from direct property and casualty business in compliance with Islamic law.
notation: 141415121110
valid from: 2014-08-08
valid till: 2020-10-03

Realized G/L - Islamic P&C Ins
type: BicsLevel6Segment
type: Classifier
type: NamedIndividual
is level6 segment of: Islamic P&C Ins Non-Premium
is anachronous version of: http://data.ga-group.nl/ics/bics/14121012121111
is contemporary version of: http://data.ga-group.nl/ics/bics/141415121111
is replaced by: http://data.ga-group.nl/ics/bics/2020/14121012121111
is version of: http://data.ga-group.nl/ics/bics/14121012121111
is version of: http://data.ga-group.nl/ics/bics/141415121111
imported on: 2026-06-08T13:03:47.798Z
last refreshed on: 2026-06-08T13:03:47.798Z
source accessed on: 2019-12-03T20:05:01Z
source last accessed on: 2019-12-03T20:05:01Z
label: G/P realizados - Seg P&C islâmico @pt
label: P/G realizados - seguro islámico de daños @es
label: P/P réalisés - Assur IARD islamique @fr
label: P/P realizzati - Assic P&C islamica @it
label: Realisierte G/V - Islamische S&U-Versicherung @de
label: Реализ. П/У - исл. страх. СиУ @ru
label: 実現損益-ｲｽﾗﾑ損害保険 @ja
label: 已实现损益-伊斯兰财产与意外保险 @zh
label: 已實現損益 - 伊斯蘭產物意外險 @zh-hant
label: 실현손익 - 이슬람 P&C 보험 @ko
definition: This segment includes realized gains/losses generated from direct property and casualty business in compliance with Islamic law.
notation: 141415121111
valid from: 2014-08-08
valid till: 2020-10-03

Other Income - Islamic P&C Ins
type: BicsLevel6Segment
type: Classifier
type: NamedIndividual
is level6 segment of: Islamic P&C Ins Non-Premium
is anachronous version of: http://data.ga-group.nl/ics/bics/14121012121112
is contemporary version of: http://data.ga-group.nl/ics/bics/141415121112
is replaced by: http://data.ga-group.nl/ics/bics/2020/14121012121112
is version of: http://data.ga-group.nl/ics/bics/14121012121112
is version of: http://data.ga-group.nl/ics/bics/141415121112
imported on: 2026-06-08T13:03:47.798Z
last refreshed on: 2026-06-08T13:03:47.798Z
source accessed on: 2019-12-03T20:05:01Z
source last accessed on: 2019-12-03T20:05:01Z
label: Altro reddito - Assic P&C islamica @it
label: Autres rev- Assur IARD islamique @fr
label: Otro ingreso - seguro islámico de daños @es
label: Outras receitas - Seg P&C islâmico @pt
label: Sonstiger Ertrag - Islamische S&U-Versicherung @de
label: Пр. доход - ислам. страх. СиУ @ru
label: その他収益-ｲｽﾗﾑ損害保険 @ja
label: 其他收入 - 伊斯蘭產物意外險 @zh-hant
label: 其他收入-伊斯兰财产与意外保险 @zh
label: 기타수익 - 이슬람 P&C 보험 @ko
definition: This segment includes other income generated from direct property and casualty business in compliance with Islamic law.
notation: 141415121112
valid from: 2014-08-08
valid till: 2020-10-03

Islamic P&C Ins Non-Premium
type: BicsLevel5Segment
type: Classifier
type: NamedIndividual
is level5 segment of: P&C Insurance - Islamic
is anachronous version of: http://data.ga-group.nl/ics/bics/141210121211
is contemporary version of: http://data.ga-group.nl/ics/bics/1414151211
is replaced by: http://data.ga-group.nl/ics/bics/2020/141210121211
is version of: http://data.ga-group.nl/ics/bics/141210121211
is version of: http://data.ga-group.nl/ics/bics/1414151211
imported on: 2026-06-08T13:03:47.798Z
last refreshed on: 2026-06-08T13:03:47.798Z
source accessed on: 2019-12-03T20:05:01Z
source last accessed on: 2019-12-03T20:05:01Z
label: Assur IARD islamique h primes @fr
label: Não prêmios de seg P&C islâmicos @pt
label: Nicht-Beiträge - Islamische S&U-Versicherung @de
label: Non premi assic P&C islamica @it
label: Seg de daños islámico sin prima @es
label: Исламск. страхование СиУ - непремиальн. @ru
label: 伊斯兰财产与意外保险非保费 @zh
label: 伊斯蘭產物意外險非保費收入 @zh-hant
label: 非保険料収益-ｲｽﾗﾑ損害保険 @ja
label: 이슬람 P&C 보험 보험료외 @ko
definition: This segment includes total non-premium revenue generated from direct property and casualty business in compliance with Islamic law.
notation: 1414151211
valid from: 2014-08-08
valid till: 2020-10-03

P&C Insurance - Islamic
type: BicsLevel4SubIndustry
type: Classifier
type: NamedIndividual
is sub industry of: Islamic Insurance Carriers
is anachronous version of: http://data.ga-group.nl/ics/bics/1412101212
is contemporary version of: http://data.ga-group.nl/ics/bics/14141512
is replaced by: http://data.ga-group.nl/ics/bics/2020/1412101212
is version of: http://data.ga-group.nl/ics/bics/1412101212
is version of: http://data.ga-group.nl/ics/bics/14141512
imported on: 2026-06-08T13:03:47.798Z
last refreshed on: 2026-06-08T13:03:47.798Z
source accessed on: 2019-12-03T20:05:01Z
source last accessed on: 2019-12-03T20:05:01Z
label: Assicurazione P&C - Islamica @it
label: Assur IARD - Islamique @fr
label: Islamische S&U-Versicherung @de
label: P&C 보험 - 이슬람 @ko
label: Seguro P&C - Islâmico @pt
label: Seguro de propiedad y daños - Islámico @es
label: Страхование СиУ - исламское @ru
label: 不動産･損害保険-ｲｽﾗﾑ @ja
label: 產物意外險 - 伊斯蘭 @zh-hant
label: 财产与意外保险-伊斯兰 @zh
definition: This industry subgroup includes companies that directly underwrite property and casualty insurance policies in compliance with Islamic law. Insurance types include automobile, property damage, casualty, theft, fire, malpractice, marine, workers' compensation and homeowners insurance.
notation: 14141512
valid from: 2014-08-08
valid till: 2020-10-03

Islamic Reinsurance Premiums
type: BicsLevel5Segment
type: Classifier
type: Discontinued
type: NamedIndividual
is level5 segment of: Reinsurance - Islamic
is contemporary version of: http://data.ga-group.nl/ics/bics/1414151310
is version of: http://data.ga-group.nl/ics/bics/1414151310
imported on: 2026-06-08T13:03:47.798Z
last refreshed on: 2026-06-08T13:03:47.798Z
source accessed on: 2019-12-03T20:05:01Z
source last accessed on: 2019-12-03T20:05:01Z
label: Beiträge - Islamische S&U-Rück @de
label: Prêmios de resseguro islâmico @pt
label: Premi riassicurazione islamica @it
label: Primas islámicas de reaseguros @es
label: Primes pour réassurance islamique @fr
label: Исламское перестр. - премии @ru
label: 伊斯兰再保险保费 @zh
label: 伊斯蘭再保險保費 @zh-hant
label: 保険料収益-ｲｽﾗﾑ再保険 @ja
label: 이슬람 재보험 보험료 @ko
definition: This segment includes premium revenue generated from life, health and medical, and property and casualty reinsurance business in compliance with Islamic law.
notation: 1414151310
valid from: 2014-08-08
valid till: 2020-10-03

Investment Income - Islamic Re
type: BicsLevel6Segment
type: Classifier
type: Discontinued
type: NamedIndividual
is level6 segment of: Islamic Reinsurance Non-Prem
is contemporary version of: http://data.ga-group.nl/ics/bics/141415131110
is version of: http://data.ga-group.nl/ics/bics/141415131110
imported on: 2026-06-08T13:03:47.798Z
last refreshed on: 2026-06-08T13:03:47.798Z
source accessed on: 2019-12-03T20:05:01Z
source last accessed on: 2019-12-03T20:05:01Z
label: Ingreso de inversión - reaseguro islámico @es
label: Investitionsertrag - Islamische Rück @de
label: Produit financier - Réassur islamique @fr
label: Rec inv - Re islâmico @pt
label: Reddito investimento - Riassic islamica @it
label: Инвест. доход - ислам. перестрах. @ru
label: 投資収益-ｲｽﾗﾑ再保険 @ja
label: 投資收入 - 伊斯蘭再保險 @zh-hant
label: 投资收入-伊斯兰再保险 @zh
label: 투자수익 - 이슬람 재보험 @ko
definition: This segment includes investment income generated from life, health and medical, and property and casualty reinsurance business in compliance with Islamic law.
notation: 141415131110
valid from: 2014-08-08
valid till: 2020-10-03

Realized G/L - Islamic Re
type: BicsLevel6Segment
type: Classifier
type: Discontinued
type: NamedIndividual
is level6 segment of: Islamic Reinsurance Non-Prem
is contemporary version of: http://data.ga-group.nl/ics/bics/141415131111
is version of: http://data.ga-group.nl/ics/bics/141415131111
imported on: 2026-06-08T13:03:47.798Z
last refreshed on: 2026-06-08T13:03:47.798Z
source accessed on: 2019-12-03T20:05:01Z
source last accessed on: 2019-12-03T20:05:01Z
label: G/P realizados - Re islâmico @pt
label: P/G realizados - re islámico @es
label: P/P réalisés - Réass islamique @fr
label: P/P realizzati - Riassic islamica @it
label: Realisierte G/V - Islamische Rück @de
label: Реализ. П/У - исл. перестрах. @ru
label: 実現損益-ｲｽﾗﾑ再保険 @ja
label: 已实现损益-伊斯兰再保险 @zh
label: 已實現損益 - 伊斯蘭再保險 @zh-hant
label: 실현손익 - 이슬람 재보험 @ko
definition: This segment includes realized gains/losses generated from life, health and medical, and property and casualty reinsurance business in compliance with Islamic law.
notation: 141415131111
valid from: 2014-08-08
valid till: 2020-10-03

Other Income - Islamic Re
type: BicsLevel6Segment
type: Classifier
type: Discontinued
type: NamedIndividual
is level6 segment of: Islamic Reinsurance Non-Prem
is contemporary version of: http://data.ga-group.nl/ics/bics/141415131112
is version of: http://data.ga-group.nl/ics/bics/141415131112
imported on: 2026-06-08T13:03:47.798Z
last refreshed on: 2026-06-08T13:03:47.798Z
source accessed on: 2019-12-03T20:05:01Z
source last accessed on: 2019-12-03T20:05:01Z
label: Altro reddito - Riassic islamica @it
label: Autres rev - Réass islamique @fr
label: Otro ingreso - reaseguro islámico @es
label: Outras receitas - Re islâmico @pt
label: Sonstiger Ertrag - Islamische Rück @de
label: Прочий доход - исламское перестр. @ru
label: その他収益-ｲｽﾗﾑ再保険 @ja
label: 其他收入 - 伊斯蘭再保險 @zh-hant
label: 其他收入-伊斯兰再保险 @zh
label: 기타수익 - 이슬람 재보험 @ko
definition: This segment includes other income generated from life, health and medical, and property and casualty reinsurance business in compliance with Islamic law.
notation: 141415131112
valid from: 2014-08-08
valid till: 2020-10-03

Islamic Reinsurance Non-Prem
type: BicsLevel5Segment
type: Classifier
type: Discontinued
type: NamedIndividual
is level5 segment of: Reinsurance - Islamic
is contemporary version of: http://data.ga-group.nl/ics/bics/1414151311
is version of: http://data.ga-group.nl/ics/bics/1414151311
imported on: 2026-06-08T13:03:47.798Z
last refreshed on: 2026-06-08T13:03:47.798Z
source accessed on: 2019-12-03T20:05:01Z
source last accessed on: 2019-12-03T20:05:01Z
label: Não prêmio de resseguro islâmico @pt
label: Nicht-Beiträge - Islamische Rück @de
label: Non premi riassicurazione islamica @it
label: Réassurance islamique h primes @fr
label: Reaseguros islámico sin prima @es
label: Исламское перестр. - непремиальн. @ru
label: 伊斯兰再保险非保费 @zh
label: 伊斯蘭再保險非保費收入 @zh-hant
label: 非保険料収益-ｲｽﾗﾑ再保険 @ja
label: 이슬람 재보험 보험료외 @ko
definition: This segment includes total non-premium revenue generated from life, health and medical, and property and casualty reinsurance business in compliance with Islamic law.
notation: 1414151311
valid from: 2014-08-08
valid till: 2020-10-03

Reinsurance - Islamic
type: BicsLevel4SubIndustry
type: Classifier
type: Discontinued
type: NamedIndividual
is sub industry of: Islamic Insurance Carriers
is contemporary version of: http://data.ga-group.nl/ics/bics/14141513
is version of: http://data.ga-group.nl/ics/bics/14141513
imported on: 2026-06-08T13:03:47.798Z
last refreshed on: 2026-06-08T13:03:47.798Z
source accessed on: 2019-12-03T20:05:01Z
source last accessed on: 2019-12-03T20:05:01Z
label: Réassurance - Islamique @fr
label: Rückversicherung - Islamisch @de
label: Reaseguro - Islámico @es
label: Resseguro - islâmico @pt
label: Riassicuraz - islamico @it
label: Перестрахование - Исламское @ru
label: 再保险 - 伊斯兰 @zh
label: 再保険-ｲｽﾗﾑ @ja
label: 再保險 - 伊斯蘭 @zh-hant
label: 재보험 - 이슬람 @ko
definition: This industry subgroup includes companies that underwrite reinsurance for life, health and medical, property and casualty, and other insurance policies in compliance with Islamic law.
notation: 14141513
valid from: 2014-08-08
valid till: 2020-10-03

Islamic Insurance Carriers
type: BicsLevel3Industry
type: Classifier
type: NamedIndividual
is industry of: Insurance
is anachronous version of: http://data.ga-group.nl/ics/bics/14121012
is contemporary version of: http://data.ga-group.nl/ics/bics/141415
is replaced by: http://data.ga-group.nl/ics/bics/2020/14121012
is version of: http://data.ga-group.nl/ics/bics/14121012
is version of: http://data.ga-group.nl/ics/bics/141415
imported on: 2026-06-08T13:03:47.798Z
last refreshed on: 2026-06-08T13:03:47.798Z
source accessed on: 2019-12-03T20:05:01Z
source last accessed on: 2019-12-03T20:05:01Z
label: Asegurad islámicas @es
label: Cies d'assurance islamique @fr
label: Emp seg islâmicos @pt
label: Isl. Versicherungsträger @de
label: Società islamiche di assicurazione @it
label: Исламские страх. компании @ru
label: 伊斯兰保险业 @zh
label: 伊斯蘭保險業 @zh-hant
label: 이슬람 보험회사 @ko
label: ｲｽﾗﾑ保険業 @ja
definition: This industry includes companies that underwrite life, health and medical, property and casualty, and related insurance lines, either directly or as a reinsurer; companies that provide insurance related services, such as claims adjusting, administrative and advisory services; and insurance agencies and brokers. Such companies operate in compliance with Islamic law.
notation: 141415
valid from: 2014-08-08
valid till: 2020-10-03

Insurance
type: BicsLevel2IndustryGroup
type: Classifier
type: NamedIndividual
is industry group of: Financials
is anachronous version of: http://data.ga-group.nl/ics/bics/1412
is contemporary version of: http://data.ga-group.nl/ics/bics/1414
is replaced by: http://data.ga-group.nl/ics/bics/2020/1412
is version of: http://data.ga-group.nl/ics/bics/1412
is version of: http://data.ga-group.nl/ics/bics/1414
imported on: 2026-06-08T13:03:47.798Z
last refreshed on: 2026-06-08T13:03:47.798Z
source accessed on: 2019-12-03T20:05:01Z
source last accessed on: 2019-12-03T20:05:01Z
label: Assicurazione @it
label: Assurance @fr
label: Seguros @es
label: Versicherung @de
label: Страховые компании @ru
label: 保险 @zh
label: 保険 @ja
label: 保險 @zh-hant
label: 보험 @ko
definition: This industry group includes companies that underwrite life, health and medical, property and casualty, and related insurance lines, either directly or as a reinsurer; companies that provide insurance-related services, such as claims adjusting, administrative and advisory services; and insurance agencies and brokers.
notation: 1414
valid from: 2014-08-08
valid till: 2020-10-03

Hospital Owners & Developers
type: BicsLevel5Segment
type: Classifier
type: Discontinued
type: NamedIndividual
is level5 segment of: Health Care Owners & Develop
is contemporary version of: http://data.ga-group.nl/ics/bics/1415101010
is version of: http://data.ga-group.nl/ics/bics/1415101010
imported on: 2026-06-08T13:03:47.798Z
last refreshed on: 2026-06-08T13:03:47.798Z
source accessed on: 2019-12-03T20:05:01Z
source last accessed on: 2019-12-03T20:05:01Z
label: Krankenhaus - Inh. & Erschl. @de
label: Ospedali Prop e sviluppo @it
label: Propietarios y des hospital @es
label: Propr e prom de hospitais @pt
label: Propriétaires et développeurs - hôpitaux @fr
label: Больницы - Владельцы и девелоперы @ru
label: 医院业主与开发商 @zh
label: 病院所有･管理 @ja
label: 醫院所有人及開發者 @zh-hant
label: 병원 소유자 & 개발자 @ko
definition: This segment includes non-REIT owners and developers of hospitals.
notation: 1415101010
valid from: 2014-08-08
valid till: 2020-10-03

Medical Office Own & Develop
type: BicsLevel5Segment
type: Classifier
type: Discontinued
type: NamedIndividual
is level5 segment of: Health Care Owners & Develop
is contemporary version of: http://data.ga-group.nl/ics/bics/1415101011
is version of: http://data.ga-group.nl/ics/bics/1415101011
imported on: 2026-06-08T13:03:47.798Z
last refreshed on: 2026-06-08T13:03:47.798Z
source accessed on: 2019-12-03T20:05:01Z
source last accessed on: 2019-12-03T20:05:01Z
label: Arztpraxen - Inh. & Erschl. @de
label: Propietarios y des oficina médica @es
label: Propr e prom de escritórios médicos @pt
label: Propriétaires et prom - cabinets médicaux @fr
label: Studi medici Prop e sviluppo @it
label: Медицинские офисы - Владельцы и девелоперы @ru
label: 医疗办公业者与开发 @zh
label: 診療所所有･管理 @ja
label: 醫療辦公室持有及開發 @zh-hant
label: 진료소 소유자 & 개발자 @ko
definition: This segment includes non-REIT owners and developers of medical office buildings. These medical offices primarily house health care tenants, such as general and specialty physician practices, as well as health care testing service providers.
notation: 1415101011
valid from: 2014-08-08
valid till: 2020-10-03

Senior Housing Own & Develop
type: BicsLevel5Segment
type: Classifier
type: Discontinued
type: NamedIndividual
is level5 segment of: Health Care Owners & Develop
is contemporary version of: http://data.ga-group.nl/ics/bics/1415101012
is version of: http://data.ga-group.nl/ics/bics/1415101012
imported on: 2026-06-08T13:03:47.798Z
last refreshed on: 2026-06-08T13:03:47.798Z
source accessed on: 2019-12-03T20:05:01Z
source last accessed on: 2019-12-03T20:05:01Z
label: Prop y des vivi adultos mayores @es
label: Propr e imprenditori abitazioni anziani @it
label: Propriétaires/promoteurs - logements personnes âgées @fr
label: Propriedades e empreend de lar de idosos @pt
label: Seniorenwohnanlagen, Eigent. & Entw. @de
label: Владельцы и застр. домов для престар. @ru
label: 老年公寓业主与开发商 @zh
label: 高齡住宅持有者及開發者 @zh-hant
label: 高齢者用住宅-不動産運用ｻｰﾋﾞｽ @ja
label: 고령자용 주택 소유자 & 개발자 @ko
definition: This segment includes non-REIT owners and developers of senior housing, such as retirement living communities and assisted living facilities.
notation: 1415101012
valid from: 2014-08-08
valid till: 2020-10-03

Skilled Nursing Owners & Dev
type: BicsLevel5Segment
type: Classifier
type: Discontinued
type: NamedIndividual
is level5 segment of: Health Care Owners & Develop
is contemporary version of: http://data.ga-group.nl/ics/bics/1415101013
is version of: http://data.ga-group.nl/ics/bics/1415101013
imported on: 2026-06-08T13:03:47.798Z
last refreshed on: 2026-06-08T13:03:47.798Z
source accessed on: 2019-12-03T20:05:01Z
source last accessed on: 2019-12-03T20:05:01Z
label: Ausgebildete Krankenpflege - Inh. & Erschl. @de
label: Infermiere specializzate Prop e sviluppo @it
label: Propietarios y des enfermería esp @es
label: Propr e prom de enfermagem qualificada @pt
label: Propriétaires et prom - soins infirmiers de pointe @fr
label: Высококвалиф. уход - Владельцы и девелоперы @ru
label: 技術性護理所有人及開發 @zh-hant
label: 熟练护理业主与开发 @zh
label: 看護施設所有･管理 @ja
label: 전문 간호 소유자 & 개발자 @ko
definition: This segment includes non-REIT owners and developers of nursing homes.
notation: 1415101013
valid from: 2014-08-08
valid till: 2020-10-03

Health Care Owners & Develop
type: BicsLevel4SubIndustry
type: Classifier
type: NamedIndividual
is sub industry of: Real Estate Owners & Developers
is anachronous version of: http://data.ga-group.nl/ics/bics/15101011
is contemporary version of: http://data.ga-group.nl/ics/bics/14151010
is replaced by: http://data.ga-group.nl/ics/bics/2020/15101011
is version of: http://data.ga-group.nl/ics/bics/14151010
is version of: http://data.ga-group.nl/ics/bics/15101011
imported on: 2026-06-08T13:03:47.798Z
last refreshed on: 2026-06-08T13:03:47.798Z
source accessed on: 2019-12-03T20:05:01Z
source last accessed on: 2019-12-03T20:05:01Z
label: Gesundheitswesen, Eigentümer & -erschließer @de
label: Propietarios y descubridores de salud @es
label: Propriétaires et promoteurs de soins de santé @fr
label: Proprietà sanitarie e imprenditori @it
label: Proprietários e empreendedores de saúde @pt
label: Владельцы и девелоперы объектов здравоохранения @ru
label: 医疗保健物业业主与开发商 @zh
label: 醫療保健擁有者及開發者 @zh-hant
label: 헬스케어 소유자 & 개발자 @ko
label: ﾍﾙｽｹｱ施設所有･管理 @ja
definition: This industry subgroup includes non-REIT owners and developers of health care properties.
notation: 14151010
valid from: 2014-08-08
valid till: 2020-10-03

Hotel Owners & Developers
type: BicsLevel4SubIndustry
type: Classifier
type: NamedIndividual
is sub industry of: Real Estate Owners & Developers
is anachronous version of: http://data.ga-group.nl/ics/bics/15101012
is contemporary version of: http://data.ga-group.nl/ics/bics/14151011
is replaced by: http://data.ga-group.nl/ics/bics/2020/15101012
is version of: http://data.ga-group.nl/ics/bics/14151011
is version of: http://data.ga-group.nl/ics/bics/15101012
imported on: 2026-06-08T13:03:47.798Z
last refreshed on: 2026-06-08T13:03:47.798Z
source accessed on: 2019-12-03T20:05:01Z
source last accessed on: 2019-12-03T20:05:01Z
label: Construtores e proprietários de hotéis @pt
label: Hoteleigentümer & -erschließer @de
label: Propietarios y constructoras de hoteles @es
label: Propriétaires et promoteurs d'hôtels @fr
label: Proprietà alberghi e imprendit @it
label: Владельцы и девелоперы гостиниц @ru
label: 飯店持有者及開發者 @zh-hant
label: 호텔 소유자 & 개발자 @ko
label: ﾎﾃﾙ所有･管理 @ja
label: ��店业主与开发商 @zh
definition: This industry subgroup includes non-REIT owners and developers of hotel/lodging properties.
notation: 14151011
valid from: 2014-08-08
valid till: 2020-10-03

Apartment Owners & Develop
type: BicsLevel5Segment
type: Classifier
type: NamedIndividual
is level5 segment of: Housing Owners & Developers
is anachronous version of: http://data.ga-group.nl/ics/bics/1510101310
is contemporary version of: http://data.ga-group.nl/ics/bics/1415101210
is replaced by: http://data.ga-group.nl/ics/bics/2020/1510101310
is version of: http://data.ga-group.nl/ics/bics/1415101210
is version of: http://data.ga-group.nl/ics/bics/1510101310
imported on: 2026-06-08T13:03:47.798Z
last refreshed on: 2026-06-08T13:03:47.798Z
source accessed on: 2019-12-03T20:05:01Z
source last accessed on: 2019-12-03T20:05:01Z
label: Apartamento propio y des @es
label: Appartements, Eigent. & Entw. @de
label: Propriétaires/promoteurs - appart @fr
label: Proprietários e empreend de apartamento @pt
label: Proprietari e imprenditori appartamenti @it
label: Владельцы и застройщики квартир @ru
label: 公寓业主与开发商 @zh
label: 公寓持有者及開發者 @zh-hant
label: 集合ｱﾊﾟｰﾄ-不動産運営･ｻｰﾋﾞｽ @ja
label: 아파트 소유자 & 개발자 @ko
definition: This segment includes non-REIT owners and developers of apartments. Such apartments include affordable and non-affordable units.
notation: 1415101210
valid from: 2014-08-08
valid till: 2020-10-03

Mfgd Housing Owners & Develop
type: BicsLevel5Segment
type: Classifier
type: NamedIndividual
is level5 segment of: Housing Owners & Developers
is anachronous version of: http://data.ga-group.nl/ics/bics/1510101311
is contemporary version of: http://data.ga-group.nl/ics/bics/1415101211
is replaced by: http://data.ga-group.nl/ics/bics/2020/1510101311
is version of: http://data.ga-group.nl/ics/bics/1415101211
is version of: http://data.ga-group.nl/ics/bics/1510101311
imported on: 2026-06-08T13:03:47.798Z
last refreshed on: 2026-06-08T13:03:47.798Z
source accessed on: 2019-12-03T20:05:01Z
source last accessed on: 2019-12-03T20:05:01Z
label: Fertighäuser, Eigent. & Entw. @de
label: Propr e imprenditori case fabbricate @it
label: Propriétaires/promoteurs - maisons pré-fab @fr
label: Proprietários e empreend casas fabr @pt
label: Viviendas fabricadas prop y des @es
label: Влад. и застр. сборных домов @ru
label: 組合住宅持有者及開發者 @zh-hant
label: 预制房业主与开发商 @zh
label: 조립주택 소유자 & 개발자 @ko
label: ﾌﾟﾚﾊﾌﾞ住宅-不動産運用ｻｰﾋﾞｽ @ja
definition: This segment includes non-REIT owners and developers of pad sites and mobile/manufactured homes. This also includes companies that operate resort communities. Such communities are areas where you bring RVs and pay a fee to rent the ground space/pad site.
notation: 1415101211
valid from: 2014-08-08
valid till: 2020-10-03

Military Housing Own & Develop
type: BicsLevel5Segment
type: Classifier
type: Discontinued
type: NamedIndividual
is level5 segment of: Housing Owners & Developers
is contemporary version of: http://data.ga-group.nl/ics/bics/1415101212
is version of: http://data.ga-group.nl/ics/bics/1415101212
imported on: 2026-06-08T13:03:47.798Z
last refreshed on: 2026-06-08T13:03:47.798Z
source accessed on: 2019-12-03T20:05:01Z
source last accessed on: 2019-12-03T20:05:01Z
label: Armeewohnungen, Eigent. & Entw. @de
label: Propr e imprenditori abitazioni militari @it
label: Propriétaires/promoteurs - logements pour militaires @fr
label: Proprietários e empreend de casas para militares @pt
label: Viviendas militares prop y des @es
label: Владельцы и застр. военного жилья @ru
label: 军事住宅业主与开发商 @zh
label: 軍用住宅-不動産運用ｻｰﾋﾞｽ @ja
label: 軍用住宅持有者及開發者 @zh-hant
label: 군인주택 소유자 & 개발자 @ko
definition: This segment includes non-REIT owners and developers of housing expressly for military personnel.
notation: 1415101212
valid from: 2014-08-08
valid till: 2020-10-03

Student Housing Own & Develop
type: BicsLevel5Segment
type: Classifier
type: NamedIndividual
is level5 segment of: Housing Owners & Developers
is anachronous version of: http://data.ga-group.nl/ics/bics/1510101312
is contemporary version of: http://data.ga-group.nl/ics/bics/1415101213
is replaced by: http://data.ga-group.nl/ics/bics/2020/1510101312
is version of: http://data.ga-group.nl/ics/bics/1415101213
is version of: http://data.ga-group.nl/ics/bics/1510101312
imported on: 2026-06-08T13:03:47.798Z
last refreshed on: 2026-06-08T13:03:47.798Z
source accessed on: 2019-12-03T20:05:01Z
source last accessed on: 2019-12-03T20:05:01Z
label: Propriétaires/promoteurs - logements pour étudiants @fr
label: Proprietários e empreend de casas para estudantes @pt
label: Proprietari e imprenditori case studente @it
label: Studentenwohnungen, Eigent. & Entw. @de
label: Viviendas de estudiantes propias y desarrolladas @es
label: Влад. и застр. жилья для студентов @ru
label: 学生住宅业主与开发商 @zh
label: 学生用住宅-不動産運用ｻｰﾋﾞｽ @ja
label: 學生住宅持有者及開發者 @zh-hant
label: 학생용 주택 소유자 & 개발자 @ko
definition: This segment includes non-REIT owners and developers of student housing. Such housing is any for-rent housing that is available to students only.
notation: 1415101213
valid from: 2014-08-08
valid till: 2020-10-03

Housing Owners & Developers
type: BicsLevel4SubIndustry
type: Classifier
type: NamedIndividual
is sub industry of: Real Estate Owners & Developers
is anachronous version of: http://data.ga-group.nl/ics/bics/15101013
is contemporary version of: http://data.ga-group.nl/ics/bics/14151012
is replaced by: http://data.ga-group.nl/ics/bics/2020/15101013
is version of: http://data.ga-group.nl/ics/bics/14151012
is version of: http://data.ga-group.nl/ics/bics/15101013
imported on: 2026-06-08T13:03:47.798Z
last refreshed on: 2026-06-08T13:03:47.798Z
source accessed on: 2019-12-03T20:05:01Z
source last accessed on: 2019-12-03T20:05:01Z
label: Propietarios y constructoras de viviendas @es
label: Propriétaires et promoteurs - logements @fr
label: Proprietários e empreend de casas @pt
label: Proprietari e imprenditori residenziali @it
label: Wohnanlagen, Eigent. & Entw. @de
label: Владельцы и застройщики домов @ru
label: 住宅持有者及開發者 @zh-hant
label: 房屋业主与开发商 @zh
label: 集合住宅所有・開発 @ja
label: 주택 소유자 & 개발자 @ko
definition: This industry subgroup includes non-REIT owners and developers of housing facilities.
notation: 14151012
valid from: 2014-08-08
valid till: 2020-10-03

Bulk Warehouse Own & Develop
type: BicsLevel5Segment
type: Classifier
type: NamedIndividual
is level5 segment of: Industrial Owners & Developers
is anachronous version of: http://data.ga-group.nl/ics/bics/1510101410
is contemporary version of: http://data.ga-group.nl/ics/bics/1415101310
is replaced by: http://data.ga-group.nl/ics/bics/2020/1510101410
is version of: http://data.ga-group.nl/ics/bics/1415101310
is version of: http://data.ga-group.nl/ics/bics/1510101410
imported on: 2026-06-08T13:03:47.798Z
last refreshed on: 2026-06-08T13:03:47.798Z
source accessed on: 2019-12-03T20:05:01Z
source last accessed on: 2019-12-03T20:05:01Z
label: Almacén másico propia y des @es
label: Bulk-Lagerhallen, Eigent. & Entw. @de
label: Propr e imprenditori magazzini grandi @it
label: Propriétaires/promoteurs - entrepôts de vrac @fr
label: Proprietários e empreend de armazém a granel @pt
label: Владельцы и застройщики крупных складов @ru
label: 散裝倉庫持有者及開發者 @zh-hant
label: 散货仓库业主与开发商 @zh
label: 대량 창고 소유자 & 개발자 @ko
label: ﾊﾞﾙｸ倉庫-不動産運用ｻｰﾋﾞｽ @ja
definition: This segment includes non-REIT owners and developers of high-ceiling industrial properties used for distribution, warehousing and manufacturing.
notation: 1415101310
valid from: 2014-08-08
valid till: 2020-10-03

Flex Industrial Own & Develop
type: BicsLevel5Segment
type: Classifier
type: NamedIndividual
is level5 segment of: Industrial Owners & Developers
is anachronous version of: http://data.ga-group.nl/ics/bics/1510101411
is contemporary version of: http://data.ga-group.nl/ics/bics/1415101311
is replaced by: http://data.ga-group.nl/ics/bics/2020/1510101411
is version of: http://data.ga-group.nl/ics/bics/1415101311
is version of: http://data.ga-group.nl/ics/bics/1510101411
imported on: 2026-06-08T13:03:47.798Z
last refreshed on: 2026-06-08T13:03:47.798Z
source accessed on: 2019-12-03T20:05:01Z
source last accessed on: 2019-12-03T20:05:01Z
label: Flex Industrial prop y desarrollada @es
label: Flex-Industrie, Eigent. & Entw. @de
label: Propri e imprenditori industriale flex @it
label: Propriétaires/promoteurs - complexes ind adaptables @fr
label: Proprietários e empreend industrial flex @pt
label: Влад. и застр. объект. смеш. пром. @ru
label: 彈性工業不動產持有者及開發者 @zh-hant
label: 灵活产业业主与开发商 @zh
label: 전환 산업용 소유자 & 개발자 @ko
label: ｵﾌｨｽ兼倉庫-不動産運用ｻｰﾋﾞｽ @ja
definition: This segment includes non-REIT owners and developers of flex space. Such space is versatile one- or two-floor structure with ceiling heights up to 16 feet and with some loading door/dock option. Such space can easily be fitted out for office, light manufacturing, R&D and storage, all under the same roof and in the same unit.
notation: 1415101311
valid from: 2014-08-08
valid till: 2020-10-03

Temp Control Logist Own & Dev
type: BicsLevel5Segment
type: Classifier
type: NamedIndividual
is level5 segment of: Industrial Owners & Developers
is anachronous version of: http://data.ga-group.nl/ics/bics/1510101412
is contemporary version of: http://data.ga-group.nl/ics/bics/1415101312
is replaced by: http://data.ga-group.nl/ics/bics/2020/1510101412
is version of: http://data.ga-group.nl/ics/bics/1415101312
is version of: http://data.ga-group.nl/ics/bics/1510101412
imported on: 2026-06-08T13:03:47.798Z
last refreshed on: 2026-06-08T13:03:47.798Z
source accessed on: 2019-12-03T20:05:01Z
source last accessed on: 2019-12-03T20:05:01Z
label: Logística controlada p/ temp propio y des @es
label: Prop e empr de logística de controle temp @pt
label: Propr e imprenditori logist temp contr @it
label: Propriétaires/promoteurs log temp contrôlée @fr
label: Temperaturkontr. Logistik, Eigent. & Entw. @de
label: Владельцы и застр. терм. логистики @ru
label: 控温物流业主与开发商 @zh
label: 温度管理輸送-不動産運用ｻｰﾋﾞｽ @ja
label: 溫控物流持有者及開發者 @zh-hant
label: 온도 제어 물류 소유자 & 개발자 @ko
definition: This segment includes non-REIT owners and developers of temperature-controlled industrial, warehouse or distribution facilities. Such facilities are equipped to accommodate temperature adjustment, refrigeration and/or freezing.
notation: 1415101312
valid from: 2014-08-08
valid till: 2020-10-03

Industrial Owners & Developers
type: BicsLevel4SubIndustry
type: Classifier
type: NamedIndividual
is sub industry of: Real Estate Owners & Developers
is anachronous version of: http://data.ga-group.nl/ics/bics/15101014
is contemporary version of: http://data.ga-group.nl/ics/bics/14151013
is replaced by: http://data.ga-group.nl/ics/bics/2020/15101014
is version of: http://data.ga-group.nl/ics/bics/14151013
is version of: http://data.ga-group.nl/ics/bics/15101014
imported on: 2026-06-08T13:03:47.798Z
last refreshed on: 2026-06-08T13:03:47.798Z
source accessed on: 2019-12-03T20:05:01Z
source last accessed on: 2019-12-03T20:05:01Z
label: Industrie, Eigentümer & Entwickler @de
label: Propietarios y desarrolladores ind @es
label: Propriétaires et promoteurs industriels @fr
label: Proprietários e empreend industriais @pt
label: Proprietari e imprenditori industriali @it
label: Влад. и застр. промышл. объектов @ru
label: 工业业主与开发商 @zh
label: 工業不動產持有者及開發者 @zh-hant
label: 工業地所有･管理 @ja
label: 산업용 소유자 & 개발자 @ko
definition: This industry subgroup includes non-REIT owners and developers of industrial properties, such as warehouse, distribution, temperature-controlled logistics, and flex space.
notation: 14151013
valid from: 2014-08-08
valid till: 2020-10-03

Multi Asset Class Own & Develop
type: BicsLevel4SubIndustry
type: Classifier
type: NamedIndividual
is sub industry of: Real Estate Owners & Developers
is anachronous version of: http://data.ga-group.nl/ics/bics/15101010
is contemporary version of: http://data.ga-group.nl/ics/bics/14151014
is replaced by: http://data.ga-group.nl/ics/bics/2020/15101010
is version of: http://data.ga-group.nl/ics/bics/14151014
is version of: http://data.ga-group.nl/ics/bics/15101010
imported on: 2026-06-08T13:03:47.798Z
last refreshed on: 2026-06-08T13:03:47.798Z
source accessed on: 2019-12-03T20:05:01Z
source last accessed on: 2019-12-03T20:05:01Z
label: Multiassetklassen, Eigent. & Entw. @de
label: Prop e empr de classe de multi ativos @pt
label: Prop y constr varias clases de activo @es
label: Propr e imprenditori classe multi asset @it
label: Propriétaires/promoteurs - multi-actifs @fr
label: Владельцы и застр. неск. классов активов @ru
label: 多种资产类别业主与开发商 @zh
label: 多重資產類別不動產持有者及開發者 @zh-hant
label: 複合資産所有･管理 @ja
label: 복합 자산군 소유자 & 개발자 @ko
definition: This industry subgroup includes non-REIT owners and developers multiple property types. Typically, these companies would construct multiple property types within the scope of a single development project.
notation: 14151014
valid from: 2014-08-08
valid till: 2020-10-03

CBD Office Own & Developers
type: BicsLevel5Segment
type: Classifier
type: NamedIndividual
is level5 segment of: Office Owners & Developers
is anachronous version of: http://data.ga-group.nl/ics/bics/1510101510
is contemporary version of: http://data.ga-group.nl/ics/bics/1415101510
is replaced by: http://data.ga-group.nl/ics/bics/2020/1510101510
is version of: http://data.ga-group.nl/ics/bics/1415101510
is version of: http://data.ga-group.nl/ics/bics/1510101510
imported on: 2026-06-08T13:03:47.798Z
last refreshed on: 2026-06-08T13:03:47.798Z
source accessed on: 2019-12-03T20:05:01Z
source last accessed on: 2019-12-03T20:05:01Z
label: CBD 사무실 소유자 & 개발자 @ko
label: CBD oficinas propia y constructoras @es
label: CBD-Büros, Eigent. & Entw. @de
label: CBD办公楼业主与开发商 @zh
label: CBDｵﾌｨｽ-不動産運用ｻｰﾋﾞｽ @ja
label: Propriétaires/promoteurs - quartier d'affaires @fr
label: Proprietários e empreend escritório CBD @pt
label: Proprietari e imprenditori uffici CBD @it
label: Владельцы и застр. офисов в CBD @ru
label: 中心商業區辦公室持有者及開發者 @zh-hant
definition: This segment includes non-REIT owners and developers of office buildings in central business districts (CBDs). Outside of the U.S., if the office is not identified as being in a CBD, the number of stories in the building will be used to determine whether it is CBD (greater than 5+ stories) or suburban (less than 5 stories).
notation: 1415101510
valid from: 2014-08-08
valid till: 2020-10-03

Suburban Office Own & Develop
type: BicsLevel5Segment
type: Classifier
type: NamedIndividual
is level5 segment of: Office Owners & Developers
is anachronous version of: http://data.ga-group.nl/ics/bics/1510101511
is contemporary version of: http://data.ga-group.nl/ics/bics/1415101511
is replaced by: http://data.ga-group.nl/ics/bics/2020/1510101511
is version of: http://data.ga-group.nl/ics/bics/1415101511
is version of: http://data.ga-group.nl/ics/bics/1510101511
imported on: 2026-06-08T13:03:47.798Z
last refreshed on: 2026-06-08T13:03:47.798Z
source accessed on: 2019-12-03T20:05:01Z
source last accessed on: 2019-12-03T20:05:01Z
label: Oficinas afueras de la ciudad propias y desarrolladas @es
label: Propriétaires/promoteurs - bureaux en banlieue @fr
label: Proprietários e empreend escritórios urbanos @pt
label: Proprietari e imprenditori uffici sobborghi @it
label: Vorstadtbüros, Eigent. & Entw. @de
label: Владельцы и застр. офисов в пригороде @ru
label: 医疗办公楼业主与开发商 @zh
label: 近郊辦公室持有者及開發者 @zh-hant
label: 郊外ｵﾌｨｽ-不動産運用ｻｰﾋﾞｽ @ja
label: 교외 사무실 소유자 & 개발자 @ko
definition: This segment includes non-REIT owners and developers of office buildings in the suburbs. Outside of the U.S., if the office is not identified as being in a CBD, the number of stories in the building will be used to determine whether it is CBD (greater than 5+ stories) or suburban (less than 5 stories).
notation: 1415101511
valid from: 2014-08-08
valid till: 2020-10-03

Office Owners & Developers
type: BicsLevel4SubIndustry
type: Classifier
type: NamedIndividual
is sub industry of: Real Estate Owners & Developers
is anachronous version of: http://data.ga-group.nl/ics/bics/15101015
is contemporary version of: http://data.ga-group.nl/ics/bics/14151015
is replaced by: http://data.ga-group.nl/ics/bics/2020/15101015
is version of: http://data.ga-group.nl/ics/bics/14151015
is version of: http://data.ga-group.nl/ics/bics/15101015
imported on: 2026-06-08T13:03:47.798Z
last refreshed on: 2026-06-08T13:03:47.798Z
source accessed on: 2019-12-03T20:05:01Z
source last accessed on: 2019-12-03T20:05:01Z
label: Büroeigentümer & -erschließer @de
label: Construtores e proprietários de escritórios @pt
label: Propietarios y constructoras de oficinas @es
label: Propriétaires et promoteurs de bureaux @fr
label: Proprietà uffici e imprenditori @it
label: Владельцы и девелоперы офисных объектов @ru
label: 办公楼业主与开发商 @zh
label: 辦公室持有者及開發者 @zh-hant
label: 사무실 소유자 & 개발자 @ko
label: ｵﾌｨｽ所有･管理 @ja
definition: This industry subgroup includes non-REIT owners and developers of office buildings.
notation: 14151015
valid from: 2014-08-08
valid till: 2020-10-03

Parking Owners & Developers
type: BicsLevel4SubIndustry
type: Classifier
type: Discontinued
type: NamedIndividual
is sub industry of: Real Estate Owners & Developers
is contemporary version of: http://data.ga-group.nl/ics/bics/14151016
is version of: http://data.ga-group.nl/ics/bics/14151016
imported on: 2026-06-08T13:03:47.798Z
last refreshed on: 2026-06-08T13:03:47.798Z
source accessed on: 2019-12-03T20:05:01Z
source last accessed on: 2019-12-03T20:05:01Z
label: Construtores e proprietários de estacionamento @pt
label: Parkhauseigentümer & -erschließer @de
label: Propietarios y constructoras de estacionamientos @es
label: Propr parcheggi e imprenditori @it
label: Propriétaires et promoteurs de stationnements @fr
label: Владельцы и девелоперы стоянок для автомашин @ru
label: 停車場持有者及開發者 @zh-hant
label: 停车场业主与开发商 @zh
label: 駐車場所有･管理 @ja
label: 주차장 소유자 & 개발자 @ko
definition: This industry subgroup includes non-REIT owners and developers of parking lots/garages.
notation: 14151016
valid from: 2014-08-08
valid till: 2020-10-03

Regional Malls Own & Develop
type: BicsLevel5Segment
type: Classifier
type: NamedIndividual
is level5 segment of: Retail Owners & Developers
is anachronous version of: http://data.ga-group.nl/ics/bics/1510101610
is contemporary version of: http://data.ga-group.nl/ics/bics/1415101710
is replaced by: http://data.ga-group.nl/ics/bics/2020/1510101610
is version of: http://data.ga-group.nl/ics/bics/1415101710
is version of: http://data.ga-group.nl/ics/bics/1510101610
imported on: 2026-06-08T13:03:47.798Z
last refreshed on: 2026-06-08T13:03:47.798Z
source accessed on: 2019-12-03T20:05:01Z
source last accessed on: 2019-12-03T20:05:01Z
label: Propietarios y constructoras centros comerciales regionales @es
label: Propr e imprenditori centri comm reg @it
label: Propriétaires/promoteurs - centres comm régionaux @fr
label: Proprietários e empreend de shopping regional @pt
label: Regionale Einkaufszentrums, Eigent. & Entw. @de
label: Владельцы и застр. регион. торг. центров @ru
label: 地区购物商城业主与开发商 @zh
label: 地區購物中心持有者及開發者 @zh-hant
label: 地方ｼｮｯﾋﾟﾝｸﾞｾﾝﾀｰ-不動産運用ｻｰﾋﾞｽ @ja
label: 지역쇼핑몰 소유자 & 개발자 @ko
definition: This segment includes non-REIT owners and developers of mall space.
notation: 1415101710
valid from: 2014-08-08
valid till: 2020-10-03

Shopping Center Own & Develop
type: BicsLevel5Segment
type: Classifier
type: NamedIndividual
is level5 segment of: Retail Owners & Developers
is anachronous version of: http://data.ga-group.nl/ics/bics/1510101611
is contemporary version of: http://data.ga-group.nl/ics/bics/1415101711
is replaced by: http://data.ga-group.nl/ics/bics/2020/1510101611
is version of: http://data.ga-group.nl/ics/bics/1415101711
is version of: http://data.ga-group.nl/ics/bics/1510101611
imported on: 2026-06-08T13:03:47.798Z
last refreshed on: 2026-06-08T13:03:47.798Z
source accessed on: 2019-12-03T20:05:01Z
source last accessed on: 2019-12-03T20:05:01Z
label: Propietarios y constructoras centro comercial @es
label: Propriétaires/promoteurs - zones de mag @fr
label: Proprietários e empreend de shopping center @pt
label: Proprietari e imprenditori centri comm @it
label: Shoppingcenter, Eigent. & Entw. @de
label: Владельцы и застр. торговых центров @ru
label: 購物中心持有者及開發者 @zh-hant
label: 购物中心业主与开发商 @zh
label: 쇼핑센터 소유자 & 개발자 @ko
label: ｼｮｯﾋ��ﾝｸﾞｾﾝﾀｰ-不動産運用ｻｰﾋﾞｽ @ja
definition: This segment includes non-REIT owners and developers of shopping centers, community or lifestyle centers. Such centers are also known as strip centers or power centers.
notation: 1415101711
valid from: 2014-08-08
valid till: 2020-10-03

Single Tenant Own & Develop
type: BicsLevel5Segment
type: Classifier
type: NamedIndividual
is level5 segment of: Retail Owners & Developers
is anachronous version of: http://data.ga-group.nl/ics/bics/1510101612
is contemporary version of: http://data.ga-group.nl/ics/bics/1415101712
is replaced by: http://data.ga-group.nl/ics/bics/2020/1510101612
is version of: http://data.ga-group.nl/ics/bics/1415101712
is version of: http://data.ga-group.nl/ics/bics/1510101612
imported on: 2026-06-08T13:03:47.798Z
last refreshed on: 2026-06-08T13:03:47.798Z
source accessed on: 2019-12-03T20:05:01Z
source last accessed on: 2019-12-03T20:05:01Z
label: Einzelmieter, Eigent. & Entw. @de
label: Propia y desarrollada - un inquilino @es
label: Propriétaires/promoteurs - locataire unique @fr
label: Proprietários e empreend de único inquilino @pt
label: Proprietari e imprenditori locatario unico @it
label: Единол. аренд., владельцы и застр. @ru
label: 单一租户业主与开发商 @zh
label: 単一ﾃﾅﾝﾄ-不動産運用ｻｰﾋﾞｽ @ja
label: 單一租客不動產持有者及開發者 @zh-hant
label: 단일 입주자 소유자 & 개발자 @ko
definition: This segment includes non-REIT owners and developers of outparcel buildings, such as gas station sites or stand-alone restaurant buildings.
notation: 1415101712
valid from: 2014-08-08
valid till: 2020-10-03

Retail Owners & Developers
type: BicsLevel4SubIndustry
type: Classifier
type: NamedIndividual
is sub industry of: Real Estate Owners & Developers
is anachronous version of: http://data.ga-group.nl/ics/bics/15101016
is contemporary version of: http://data.ga-group.nl/ics/bics/14151017
is replaced by: http://data.ga-group.nl/ics/bics/2020/15101016
is version of: http://data.ga-group.nl/ics/bics/14151017
is version of: http://data.ga-group.nl/ics/bics/15101016
imported on: 2026-06-08T13:03:47.798Z
last refreshed on: 2026-06-08T13:03:47.798Z
source accessed on: 2019-12-03T20:05:01Z
source last accessed on: 2019-12-03T20:05:01Z
label: Construtores e proprietários de varejo @pt
label: Einzelhandel, Eigentümer & -erschließer @de
label: Propietarios y constructoras al por menor @es
label: Propr al dettaglio e imprend @it
label: Propriétaires et promoteurs de distribution @fr
label: Владельцы и девелоперы розничных объектов @ru
label: 小売店所有･管理 @ja
label: 零售地产业主与开发��� @zh
label: 零售持有者及開發者 @zh-hant
label: 소매 소유자 & 개발자 @ko
definition: This industry subgroup includes non-REIT owners and developers of retail real estate, such as outlet space, strip centers, malls and single-tenant entities.
notation: 14151017
valid from: 2014-08-08
valid till: 2020-10-03

Self-Storage Owners & Develop
type: BicsLevel4SubIndustry
type: Classifier
type: NamedIndividual
is sub industry of: Real Estate Owners & Developers
is anachronous version of: http://data.ga-group.nl/ics/bics/15101017
is contemporary version of: http://data.ga-group.nl/ics/bics/14151018
is replaced by: http://data.ga-group.nl/ics/bics/2020/15101017
is version of: http://data.ga-group.nl/ics/bics/14151018
is version of: http://data.ga-group.nl/ics/bics/15101017
imported on: 2026-06-08T13:03:47.798Z
last refreshed on: 2026-06-08T13:03:47.798Z
source accessed on: 2019-12-03T20:05:01Z
source last accessed on: 2019-12-03T20:05:01Z
label: Propietarios y constructoras de almacenamiento @es
label: Propriétaires et promoteurs - libre-service @fr
label: Proprietários e empreend armazenagem própria @pt
label: Proprietari e imprenditori Self-Storage @it
label: Selbstlager, Eigent. & Entw. @de
label: Владельцы и застр. камер хранения @ru
label: 自助仓库业主与开发商 @zh
label: 自助倉儲持有者及開發者 @zh-hant
label: 자가창고 소유자 & 개발자 @ko
label: ﾄﾗﾝｸﾙｰﾑ所有･管理 @ja
definition: This industry subgroup includes non-REIT owners and developers of self-storage units/properties.
notation: 14151018
valid from: 2014-08-08
valid till: 2020-10-03

Life Science Owners & Develop
type: BicsLevel5Segment
type: Classifier
type: Discontinued
type: NamedIndividual
is level5 segment of: Specialty & Other Own & Develop
is contemporary version of: http://data.ga-group.nl/ics/bics/1415101910
is version of: http://data.ga-group.nl/ics/bics/1415101910
imported on: 2026-06-08T13:03:47.798Z
last refreshed on: 2026-06-08T13:03:47.798Z
source accessed on: 2019-12-03T20:05:01Z
source last accessed on: 2019-12-03T20:05:01Z
label: Gesundheitsbez. Gebäude, Eigent. & Entw. @de
label: Propietarios y des biología @es
label: Propri e imprenditori scienze della vita @it
label: Propriétaires/promoteurs - sc de la vie @fr
label: Proprietários e empreend ciências da vida @pt
label: Биологические науки - Владельцы и застр. @ru
label: 生命科学业主与开发商 @zh
label: 生命科学所有･管理 @ja
label: 生命科學不動產持有者及開���者 @zh-hant
label: 생명과학 소유자 & 개발자 @ko
definition: This segment includes non-REIT non-REIT owners and developers of office and laboratory properties that are leased to life science‒related tenants, such as pharmaceutical companies, research institutions and government agencies.
notation: 1415101910
valid from: 2014-08-08
valid till: 2020-10-03

Specialty & Other Own & Develop
type: BicsLevel4SubIndustry
type: Classifier
type: NamedIndividual
is sub industry of: Real Estate Owners & Developers
is anachronous version of: http://data.ga-group.nl/ics/bics/15101018
is contemporary version of: http://data.ga-group.nl/ics/bics/14151019
is replaced by: http://data.ga-group.nl/ics/bics/2020/15101018
is version of: http://data.ga-group.nl/ics/bics/14151019
is version of: http://data.ga-group.nl/ics/bics/15101018
imported on: 2026-06-08T13:03:47.798Z
last refreshed on: 2026-06-08T13:03:47.798Z
source accessed on: 2019-12-03T20:05:01Z
source last accessed on: 2019-12-03T20:05:01Z
label: Propietarios y constructoras especializadas y otros @es
label: Propriétaires/promoteurs - spécialisés et autres @fr
label: Proprietários e empreend especialidades e outros @pt
label: Proprietari e imprenditori speciali e altro @it
label: Spezial- & Sonstige Gebäude, Eigent. & Entw. @de
label: Владельцы и застр. спец. и проч. объектов @ru
label: 其他房地產持有者及開發者 @zh-hant
label: 特殊及其他业主与开发商 @zh
label: 特殊･その他物件所有･管理 @ja
label: 전문 & 기타 소유자 & 개발자 @ko
definition: This industry subgroup includes non-REIT owners and developers of specialty and other properties not elsewhere classified. Such property includes master planned communities, data centers, and life science/research and development facilities.
notation: 14151019
valid from: 2014-08-08
valid till: 2020-10-03

Real Estate Owners & Developers
type: BicsLevel3Industry
type: Classifier
type: NamedIndividual
is industry of: Real Estate
is anachronous version of: http://data.ga-group.nl/ics/bics/151010
is contemporary version of: http://data.ga-group.nl/ics/bics/141510
is replaced by: http://data.ga-group.nl/ics/bics/2020/151010
is version of: http://data.ga-group.nl/ics/bics/141510
is version of: http://data.ga-group.nl/ics/bics/151010
imported on: 2026-06-08T13:03:47.798Z
last refreshed on: 2026-06-08T13:03:47.798Z
source accessed on: 2019-12-03T20:05:01Z
source last accessed on: 2019-12-03T20:05:01Z
label: Immobilien, Eigent. & Entw. @de
label: Propietarios y constructoras de inmobiliario @es
label: Propriétaires et promoteurs immobiliers @fr
label: Proprietários e empreendedores de imóveis @pt
label: Proprietari e imprenditori immobiliari @it
label: Владельцы и застройщики недвиж. @ru
label: 不動產持有者及開發者 @zh-hant
label: 不動産運営･管理 @ja
label: 房地产业主与开发商 @zh
label: 부동산 소유자 & 개발자 @ko
definition: This industry group includes companies that are involved with real estate, such as companies that own and develop real estate . Sectors include office, retail, housing, healthcare, hotel, industrial, self-storage and specialty. Such companies are not structured as real estate investment trusts (REITs).
notation: 141510
valid from: 2014-08-08
valid till: 2020-10-03

Hospital REIT
type: BicsLevel5Segment
type: Classifier
type: NamedIndividual
is level5 segment of: Health Care REIT
is anachronous version of: http://data.ga-group.nl/ics/bics/1510111110
is contemporary version of: http://data.ga-group.nl/ics/bics/1415111010
is replaced by: http://data.ga-group.nl/ics/bics/2020/1510111110
is version of: http://data.ga-group.nl/ics/bics/1415111010
is version of: http://data.ga-group.nl/ics/bics/1510111110
imported on: 2026-06-08T13:03:47.798Z
last refreshed on: 2026-06-08T13:03:47.798Z
source accessed on: 2019-12-03T20:05:01Z
source last accessed on: 2019-12-03T20:05:01Z
label: Krankenhaus - REIT @de
label: REIT - Hôpitaux @fr
label: REIT Ospedali @it
label: Больницы - REIT @ru
label: 医院REIT @zh
label: 病院 - REIT @ja
label: 醫院REIT @zh-hant
label: 병원 리츠 @ko
definition: This segment includes real estate investment trusts (REITs) that own and develop hospitals.
notation: 1415111010
valid from: 2014-08-08
valid till: 2020-10-03

Medical Office REIT
type: BicsLevel5Segment
type: Classifier
type: NamedIndividual
is level5 segment of: Health Care REIT
is anachronous version of: http://data.ga-group.nl/ics/bics/1510111111
is contemporary version of: http://data.ga-group.nl/ics/bics/1415111011
is replaced by: http://data.ga-group.nl/ics/bics/2020/1510111111
is version of: http://data.ga-group.nl/ics/bics/1415111011
is version of: http://data.ga-group.nl/ics/bics/1510111111
imported on: 2026-06-08T13:03:47.798Z
last refreshed on: 2026-06-08T13:03:47.798Z
source accessed on: 2019-12-03T20:05:01Z
source last accessed on: 2019-12-03T20:05:01Z
label: Arztpraxen - REIT @de
label: Escritório médico REIT @pt
label: Oficina médica REIT @es
label: REIT - Cabinets médicaux @fr
label: REIT Uffici sanitari @it
label: Медицинские офисы - REIT @ru
label: 医疗办公楼REIT @zh
label: 診療所 - REIT @ja
label: 醫療辦公室REIT @zh-hant
label: 진료소 리츠 @ko
definition: This segment includes real estate investment trusts (REITs) that own and develop medical office buildings. These medical offices primarily house health care tenants, such as general and specialty physician practices, as well as health care testing service providers.
notation: 1415111011
valid from: 2014-08-08
valid till: 2020-10-03

Senior Housing REIT
type: BicsLevel5Segment
type: Classifier
type: NamedIndividual
is level5 segment of: Health Care REIT
is anachronous version of: http://data.ga-group.nl/ics/bics/1510111112
is contemporary version of: http://data.ga-group.nl/ics/bics/1415111012
is replaced by: http://data.ga-group.nl/ics/bics/2020/1510111112
is version of: http://data.ga-group.nl/ics/bics/1415111012
is version of: http://data.ga-group.nl/ics/bics/1510111112
imported on: 2026-06-08T13:03:47.798Z
last refreshed on: 2026-06-08T13:03:47.798Z
source accessed on: 2019-12-03T20:05:01Z
source last accessed on: 2019-12-03T20:05:01Z
label: Casas para idosos REIT @pt
label: REIT - Logements pour personnes âgées @fr
label: REIT Case di riposo @it
label: Seniorenwohnanlagen - REIT @de
label: Viviendas de jubilados REIT @es
label: Жилье для людей пенс. возраста - REIT @ru
label: 老年公寓REIT @zh
label: 高齡住宅REIT @zh-hant
label: 高齢者用住宅-REIT @ja
label: 고령자용 주택 리츠 @ko
definition: This segment includes real estate investment trusts (REITs) that own and develop senior housing, such as retirement living communities and assisted living facilities.
notation: 1415111012
valid from: 2014-08-08
valid till: 2020-10-03

Skilled Nursing REIT
type: BicsLevel5Segment
type: Classifier
type: NamedIndividual
is level5 segment of: Health Care REIT
is anachronous version of: http://data.ga-group.nl/ics/bics/1510111113
is contemporary version of: http://data.ga-group.nl/ics/bics/1415111013
is replaced by: http://data.ga-group.nl/ics/bics/2020/1510111113
is version of: http://data.ga-group.nl/ics/bics/1415111013
is version of: http://data.ga-group.nl/ics/bics/1510111113
imported on: 2026-06-08T13:03:47.798Z
last refreshed on: 2026-06-08T13:03:47.798Z
source accessed on: 2019-12-03T20:05:01Z
source last accessed on: 2019-12-03T20:05:01Z
label: Ausgebildete Krankenpflege - REIT @de
label: Enfermagem qualificada REIT @pt
label: Enfermería especializada REIT @es
label: REIT - Soins infirmiers professionnels @fr
label: REIT Assist infermieristica qualif @it
label: Высококвалиф. уход - REIT @ru
label: 專業護理照護REIT @zh-hant
label: 熟练护理REIT @zh
label: 看護施設 - REIT @ja
label: 전문 간호 리츠 @ko
definition: This segment includes real estate investment trusts (REITs) that own and develop nursing homes.
notation: 1415111013
valid from: 2014-08-08
valid till: 2020-10-03

Health Care REIT
type: BicsLevel4SubIndustry
type: Classifier
type: NamedIndividual
is sub industry of: REIT
is anachronous version of: http://data.ga-group.nl/ics/bics/15101111
is contemporary version of: http://data.ga-group.nl/ics/bics/14151110
is replaced by: http://data.ga-group.nl/ics/bics/2020/15101111
is version of: http://data.ga-group.nl/ics/bics/14151110
is version of: http://data.ga-group.nl/ics/bics/15101111
imported on: 2026-06-08T13:03:47.798Z
last refreshed on: 2026-06-08T13:03:47.798Z
source accessed on: 2019-12-03T20:05:01Z
source last accessed on: 2019-12-03T20:05:01Z
label: Gesundheitswesen REIT @de
label: REIT de salud @es
label: REIT sanità @it
label: REIT soins de santé @fr
label: Saúde REIT @pt
label: Здравоохранение - REIT @ru
label: 保健REIT @zh
label: 醫療保健REIT @zh-hant
label: 헬스케어 리츠(REIT) @ko
label: ﾍﾙｽｹｱ施設REIT @ja
definition: This industry subgroup includes real estate investment trusts (REITs) that own and develop health care properties.
notation: 14151110
valid from: 2014-08-08
valid till: 2020-10-03

Hotel REIT
type: BicsLevel4SubIndustry
type: Classifier
type: NamedIndividual
is sub industry of: REIT
is anachronous version of: http://data.ga-group.nl/ics/bics/15101112
is contemporary version of: http://data.ga-group.nl/ics/bics/14151111
is replaced by: http://data.ga-group.nl/ics/bics/2020/15101112
is version of: http://data.ga-group.nl/ics/bics/14151111
is version of: http://data.ga-group.nl/ics/bics/15101112
imported on: 2026-06-08T13:03:47.798Z
last refreshed on: 2026-06-08T13:03:47.798Z
source accessed on: 2019-12-03T20:05:01Z
source last accessed on: 2019-12-03T20:05:01Z
label: Hotel - REIT @de
label: REIT Alberghi @it
label: REIT hôteliers @fr
label: Гостиницы - REIT @ru
label: 酒店REIT @zh
label: 飯店所有權REIT @zh-hant
label: 호텔 리츠 @ko
label: ﾎﾃﾙ所有権REIT @ja
definition: This industry subgroup includes real estate investment trusts (REITs) that own and develop hotel/resort properties.
notation: 14151111
valid from: 2014-08-08
valid till: 2020-10-03

Apartment REIT
type: BicsLevel5Segment
type: Classifier
type: NamedIndividual
is level5 segment of: Housing REIT
is anachronous version of: http://data.ga-group.nl/ics/bics/1510111310
is contemporary version of: http://data.ga-group.nl/ics/bics/1415111210
is replaced by: http://data.ga-group.nl/ics/bics/2020/1510111310
is version of: http://data.ga-group.nl/ics/bics/1415111210
is version of: http://data.ga-group.nl/ics/bics/1510111310
imported on: 2026-06-08T13:03:47.798Z
last refreshed on: 2026-06-08T13:03:47.798Z
source accessed on: 2019-12-03T20:05:01Z
source last accessed on: 2019-12-03T20:05:01Z
label: Apartamento REIT @es
label: Appartments - REIT @de
label: REIT - Appartements @fr
label: REIT Appartamenti @it
label: Квартиры - REIT @ru
label: 公寓REIT @zh
label: 多世帯住宅 - REIT @ja
label: 아파트 리츠 @ko
definition: This segment includes real estate investment trusts (REITs) that own and develop apartments. Such apartments include affordable and non-affordable units, which typically are buildings with 5+ units.
notation: 1415111210
valid from: 2014-08-08
valid till: 2020-10-03

Single Family Housing REIT
type: BicsLevel5Segment
type: Classifier
type: NamedIndividual
is level5 segment of: Housing REIT
is anachronous version of: http://data.ga-group.nl/ics/bics/1510111311
is contemporary version of: http://data.ga-group.nl/ics/bics/1415111211
is replaced by: http://data.ga-group.nl/ics/bics/2020/1510111311
is version of: http://data.ga-group.nl/ics/bics/1415111211
is version of: http://data.ga-group.nl/ics/bics/1510111311
imported on: 2026-06-08T13:03:47.798Z
last refreshed on: 2026-06-08T13:03:47.798Z
source accessed on: 2019-12-03T20:05:01Z
source last accessed on: 2019-12-03T20:05:01Z
label: Einfamilienhäuser - REIT @de
label: Moradia unifamiliar REIT @pt
label: REIT - Maisons individuelles @fr
label: REIT Case unifamiliari @it
label: Viviendas unifamiliares REIT @es
label: Дома на одну семью - REIT @ru
label: 一世帯住宅 - REIT @ja
label: 單戶住宅REIT @zh-hant
label: 独栋住宅REIT @zh
label: 단독주택 리츠 @ko
definition: This segment includes real estate investment trusts (REITs) that own and develop single family homes.
notation: 1415111211
valid from: 2014-08-08
valid till: 2020-10-03

Manufactured Housing REIT
type: BicsLevel5Segment
type: Classifier
type: NamedIndividual
is level5 segment of: Housing REIT
is anachronous version of: http://data.ga-group.nl/ics/bics/1510111312
is contemporary version of: http://data.ga-group.nl/ics/bics/1415111212
is replaced by: http://data.ga-group.nl/ics/bics/2020/1510111312
is version of: http://data.ga-group.nl/ics/bics/1415111212
is version of: http://data.ga-group.nl/ics/bics/1510111312
imported on: 2026-06-08T13:03:47.798Z
last refreshed on: 2026-06-08T13:03:47.798Z
source accessed on: 2019-12-03T20:05:01Z
source last accessed on: 2019-12-03T20:05:01Z
label: Casas pré-fabricadas REIT @pt
label: Fertighäuser - REIT @de
label: REIT - Maisons pré-fabriquées @fr
label: REIT Case prefabbricate @it
label: Viviendas fabricadas REIT @es
label: Сборные дома - REIT @ru
label: 組合住宅REIT @zh-hant
label: 预制房REIT @zh
label: 조립주택 리츠 @ko
label: ﾌﾟﾚﾊﾌﾞ住宅-REIT @ja
definition: This segment includes real estate investment trusts (REITs) that own and develop pad sites and mobile/manufactured homes. This also includes REITs that operate resort communities. Such communities are areas where you bring RVs and pay a fee to rent the ground space/pad site.
notation: 1415111212
valid from: 2014-08-08
valid till: 2020-10-03

Military Housing REIT
type: BicsLevel5Segment
type: Classifier
type: Discontinued
type: NamedIndividual
is level5 segment of: Housing REIT
is contemporary version of: http://data.ga-group.nl/ics/bics/1415111213
is version of: http://data.ga-group.nl/ics/bics/1415111213
imported on: 2026-06-08T13:03:47.798Z
last refreshed on: 2026-06-08T13:03:47.798Z
source accessed on: 2019-12-03T20:05:01Z
source last accessed on: 2019-12-03T20:05:01Z
label: Armeewohnungen - REIT @de
label: Casas para uso militar REIT @pt
label: REIT - Logements pour militaires @fr
label: REIT Abitazioni militari @it
label: Viviendas militares REIT @es
label: Военное жилье - REIT @ru
label: 多户住宅REIT @zh
label: 軍用住宅-REIT @ja
label: 軍用住宅REIT @zh-hant
label: 군인용 주택 리츠 @ko
definition: This segment includes real estate investment trusts (REITs) that own and develop housing expressly to military personnel.
notation: 1415111213
valid from: 2014-08-08
valid till: 2020-10-03

Student Housing REIT
type: BicsLevel5Segment
type: Classifier
type: NamedIndividual
is level5 segment of: Housing REIT
is anachronous version of: http://data.ga-group.nl/ics/bics/1510111313
is contemporary version of: http://data.ga-group.nl/ics/bics/1415111214
is replaced by: http://data.ga-group.nl/ics/bics/2020/1510111313
is version of: http://data.ga-group.nl/ics/bics/1415111214
is version of: http://data.ga-group.nl/ics/bics/1510111313
imported on: 2026-06-08T13:03:47.798Z
last refreshed on: 2026-06-08T13:03:47.798Z
source accessed on: 2019-12-03T20:05:01Z
source last accessed on: 2019-12-03T20:05:01Z
label: Casas para estudantes REIT @pt
label: REIT - Logements pour étudiants @fr
label: REIT Case dello studente @it
label: Studentenwohnungen - REIT @de
label: Viviendas de estudiantes REIT @es
label: Студенческое жилье - REIT @ru
label: 学生住宅REIT @zh
label: 学生用住宅-REIT @ja
label: 學生住宅REIT @zh-hant
label: 학생용 주택 리츠 @ko
definition: This segment includes real estate investment trusts (REITs) that own and develop student housing. Such housing is any for-rent housing that is available only to students.
notation: 1415111214
valid from: 2014-08-08
valid till: 2020-10-03

Housing REIT
type: BicsLevel4SubIndustry
type: Classifier
type: NamedIndividual
is sub industry of: REIT
is anachronous version of: http://data.ga-group.nl/ics/bics/15101113
is contemporary version of: http://data.ga-group.nl/ics/bics/14151112
is replaced by: http://data.ga-group.nl/ics/bics/2020/15101113
is version of: http://data.ga-group.nl/ics/bics/14151112
is version of: http://data.ga-group.nl/ics/bics/15101113
imported on: 2026-06-08T13:03:47.798Z
last refreshed on: 2026-06-08T13:03:47.798Z
source accessed on: 2019-12-03T20:05:01Z
source last accessed on: 2019-12-03T20:05:01Z
label: Habitações REIT @pt
label: REIT - Logements @fr
label: REIT Abitazioni @it
label: Viviendas REIT @es
label: Wohnanlagen - REIT @de
label: Жилье - REIT @ru
label: 住宅REIT @ja
label: 주택 리츠 @ko
definition: This industry subgroup includes real estate investment trusts (REITs) that own and develop housing facilities.
notation: 14151112
valid from: 2014-08-08
valid till: 2020-10-03

Bulk Warehouse REIT
type: BicsLevel5Segment
type: Classifier
type: NamedIndividual
is level5 segment of: Industrial REIT
is anachronous version of: http://data.ga-group.nl/ics/bics/1510111410
is contemporary version of: http://data.ga-group.nl/ics/bics/1415111310
is replaced by: http://data.ga-group.nl/ics/bics/2020/1510111410
is version of: http://data.ga-group.nl/ics/bics/1415111310
is version of: http://data.ga-group.nl/ics/bics/1510111410
imported on: 2026-06-08T13:03:47.798Z
last refreshed on: 2026-06-08T13:03:47.798Z
source accessed on: 2019-12-03T20:05:01Z
source last accessed on: 2019-12-03T20:05:01Z
label: Almacén másico REIT @es
label: Armazém a granel REIT @pt
label: Bulk-Lagerhallen - REIT @de
label: REIT - Entrepôt de vrac @fr
label: REIT Magazzini grandi @it
label: Крупные склады - REIT @ru
label: 散裝倉庫REIT @zh-hant
label: 散货仓库REIT @zh
label: 대량 창고 리츠 @ko
label: ﾊﾞﾙｸ倉庫-REIT @ja
definition: This segment includes real estate investment trusts (REITs) that own and develop high-ceiling industrial properties used for distribution, warehousing and manufacturing.
notation: 1415111310
valid from: 2014-08-08
valid till: 2020-10-03

Flex Industrial REIT
type: BicsLevel5Segment
type: Classifier
type: NamedIndividual
is level5 segment of: Industrial REIT
is anachronous version of: http://data.ga-group.nl/ics/bics/1510111411
is contemporary version of: http://data.ga-group.nl/ics/bics/1415111311
is replaced by: http://data.ga-group.nl/ics/bics/2020/1510111411
is version of: http://data.ga-group.nl/ics/bics/1415111311
is version of: http://data.ga-group.nl/ics/bics/1510111411
imported on: 2026-06-08T13:03:47.798Z
last refreshed on: 2026-06-08T13:03:47.798Z
source accessed on: 2019-12-03T20:05:01Z
source last accessed on: 2019-12-03T20:05:01Z
label: Flex industrial REIT @pt
label: Flex-Industrie - REIT @de
label: REIT - Complexes indus adaptables @fr
label: REIT Industriali flex @it
label: Смешанная промышл. - REIT @ru
label: 彈性工業REIT @zh-hant
label: 灵活产业REIT @zh
label: 전환 산업용 리츠 @ko
label: ｵﾌｨｽ兼倉庫-REIT @ja
definition: This segment includes real estate investment trusts (REITS) that own and develop flex space. Such space is versatile one- or two-floor structures with ceiling heights up to 16 feet and with some loading door/dock options. Such space can easily be fitted out for office, light manufacturing, R&D and storage all under the same roof and in the same unit.
notation: 1415111311
valid from: 2014-08-08
valid till: 2020-10-03

Temp Control Logistics REIT
type: BicsLevel5Segment
type: Classifier
type: NamedIndividual
is level5 segment of: Industrial REIT
is anachronous version of: http://data.ga-group.nl/ics/bics/1510111412
is contemporary version of: http://data.ga-group.nl/ics/bics/1415111312
is replaced by: http://data.ga-group.nl/ics/bics/2020/1510111412
is version of: http://data.ga-group.nl/ics/bics/1415111312
is version of: http://data.ga-group.nl/ics/bics/1510111412
imported on: 2026-06-08T13:03:47.798Z
last refreshed on: 2026-06-08T13:03:47.798Z
source accessed on: 2019-12-03T20:05:01Z
source last accessed on: 2019-12-03T20:05:01Z
label: Logística controlada p/ temp - REIT @es
label: Logística temp contrl REIT @pt
label: REIT - Logistique temp contrôlée @fr
label: REIT Logistica controllo temp @it
label: Temperaturkontroll. Logistik - REIT @de
label: Терморегулируемая логистика - REIT @ru
label: 控温物流REIT @zh
label: 温度制御ﾛｼﾞｽﾃｨｸｽ-REIT @ja
label: 溫控物流REIT @zh-hant
label: 온도 제어 물류 리츠 @ko
definition: This segment includes real estate investment trusts (REITs) that own and develop industrial properties, such as warehouse, distribution, temperature-controlled logistics, and flex space. Such facilities are equipped to accommodate temperature adjustment, refrigeration and/or freezing.
notation: 1415111312
valid from: 2014-08-08
valid till: 2020-10-03

Industrial REIT
type: BicsLevel4SubIndustry
type: Classifier
type: NamedIndividual
is sub industry of: REIT
is anachronous version of: http://data.ga-group.nl/ics/bics/15101114
is contemporary version of: http://data.ga-group.nl/ics/bics/14151113
is replaced by: http://data.ga-group.nl/ics/bics/2020/15101114
is version of: http://data.ga-group.nl/ics/bics/14151113
is version of: http://data.ga-group.nl/ics/bics/15101114
imported on: 2026-06-08T13:03:47.798Z
last refreshed on: 2026-06-08T13:03:47.798Z
source accessed on: 2019-12-03T20:05:01Z
source last accessed on: 2019-12-03T20:05:01Z
label: Industrie - REIT @de
label: REIT - Industriels @fr
label: REIT Industriali @it
label: промышл. - REIT @ru
label: 工业REIT @zh
label: 工業-REIT @ja
label: 工業REIT @zh-hant
label: 산업용 리츠 @ko
definition: This industry subgroup includes real estate investment trusts (REITs) that own and develop temperature-controlled storage space. Typically, these companies will disclose whether the space is temperature-controlled.
notation: 14151113
valid from: 2014-08-08
valid till: 2020-10-03

Multi Asset Class REIT
type: BicsLevel4SubIndustry
type: Classifier
type: NamedIndividual
is sub industry of: REIT
is anachronous version of: http://data.ga-group.nl/ics/bics/15101110
is contemporary version of: http://data.ga-group.nl/ics/bics/14151114
is replaced by: http://data.ga-group.nl/ics/bics/2020/15101110
is version of: http://data.ga-group.nl/ics/bics/14151114
is version of: http://data.ga-group.nl/ics/bics/15101110
imported on: 2026-06-08T13:03:47.798Z
last refreshed on: 2026-06-08T13:03:47.798Z
source accessed on: 2019-12-03T20:05:01Z
source last accessed on: 2019-12-03T20:05:01Z
label: Classe de multi-ativo REIT @pt
label: Multiassetklassen REIT @de
label: REIT actifs multiples @fr
label: REIT de multiclases de activos @es
label: REIT possess attivi multicl @it
label: Множеств. классы активов - REIT @ru
label: 多种资产类别 REIT @zh
label: 多重資產類別 REIT @zh-hant
label: 複合資産REIT @ja
label: 복합자산 등급 리츠(REIT) @ko
definition: This industry subgroup includes real estate investment trusts (REITs) that own and develop multiple types of property. Typically, these companies would construct multiple property types within the scope of a single development project.
notation: 14151114
valid from: 2014-08-08
valid till: 2020-10-03

CBD Office REIT
type: BicsLevel5Segment
type: Classifier
type: NamedIndividual
is level5 segment of: Office REIT
is anachronous version of: http://data.ga-group.nl/ics/bics/1510111510
is contemporary version of: http://data.ga-group.nl/ics/bics/1415111510
is replaced by: http://data.ga-group.nl/ics/bics/2020/1510111510
is version of: http://data.ga-group.nl/ics/bics/1415111510
is version of: http://data.ga-group.nl/ics/bics/1510111510
imported on: 2026-06-08T13:03:47.798Z
last refreshed on: 2026-06-08T13:03:47.798Z
source accessed on: 2019-12-03T20:05:01Z
source last accessed on: 2019-12-03T20:05:01Z
label: CBD Oficina REIT @es
label: CBD 사무실 리츠 @ko
label: CBD-Büros - REIT @de
label: CBD办公楼REIT @zh
label: CBDｵﾌｨｽ-REIT @ja
label: Escritório CBD REIT @pt
label: REIT - Bur quartier des affaires @fr
label: REIT Uffici CBD @it
label: Офис в деловом центре - REIT @ru
label: 中心商業區辦公室REIT @zh-hant
definition: This segment includes real estate investment trusts (REITs) that own and develop office buildings in central business districts (CBDs). Outside of the U.S., if the office is not identified as being in a CBD, the number of stories in the building will be used to determine whether it is CBD (greater than 5+ stories) or suburban (less than 5 stories).
notation: 1415111510
valid from: 2014-08-08
valid till: 2020-10-03

Suburban Office REIT
type: BicsLevel5Segment
type: Classifier
type: NamedIndividual
is level5 segment of: Office REIT
is anachronous version of: http://data.ga-group.nl/ics/bics/1510111511
is contemporary version of: http://data.ga-group.nl/ics/bics/1415111511
is replaced by: http://data.ga-group.nl/ics/bics/2020/1510111511
is version of: http://data.ga-group.nl/ics/bics/1415111511
is version of: http://data.ga-group.nl/ics/bics/1510111511
imported on: 2026-06-08T13:03:47.798Z
last refreshed on: 2026-06-08T13:03:47.798Z
source accessed on: 2019-12-03T20:05:01Z
source last accessed on: 2019-12-03T20:05:01Z
label: Escritório suburbano REIT @pt
label: Oficina afueras de la ciudad REIT @es
label: REIT - Bureaux en banlieue @fr
label: REIT Uffici sobborghi @it
label: Vorstadtbüros - REIT @de
label: Пригородный офис - REIT @ru
label: 近郊辦公室REIT @zh-hant
label: 郊区办公楼REIT @zh
label: 郊外ｵﾌｨｽREIT @ja
label: 교외 사무실 리츠 @ko
definition: This segment includes real estate investment trusts (REITs) that own and develop office buildings in the suburbs. Outside of the U.S., if the office is not identified as being in the suburbs, the number of stories in the building will be used to determine whether it is CBD (greater than 5+ stories) or suburban (less than 5 stories).
notation: 1415111511
valid from: 2014-08-08
valid till: 2020-10-03

Office REIT
type: BicsLevel4SubIndustry
type: Classifier
type: NamedIndividual
is sub industry of: REIT
is anachronous version of: http://data.ga-group.nl/ics/bics/15101115
is contemporary version of: http://data.ga-group.nl/ics/bics/14151115
is replaced by: http://data.ga-group.nl/ics/bics/2020/15101115
is version of: http://data.ga-group.nl/ics/bics/14151115
is version of: http://data.ga-group.nl/ics/bics/15101115
imported on: 2026-06-08T13:03:47.798Z
last refreshed on: 2026-06-08T13:03:47.798Z
source accessed on: 2019-12-03T20:05:01Z
source last accessed on: 2019-12-03T20:05:01Z
label: Büro-REITs @de
label: Escritório REIT @pt
label: REIT Bureaux @fr
label: REIT de oficinas @es
label: REIT uffici @it
label: Офисные REITs @ru
label: 办公楼REIT @zh
label: 辦公室不動產投資信託 @zh-hant
label: 사무실 리츠(REIT) @ko
label: ｵﾌｨｽREIT @ja
definition: This industry subgroup includes real estate investment trusts (REITs) that own and develop office buildings in either central business districts or the suburbs.
notation: 14151115
valid from: 2014-08-08
valid till: 2020-10-03

Parking REIT
type: BicsLevel4SubIndustry
type: Classifier
type: Discontinued
type: NamedIndividual
is sub industry of: REIT
is contemporary version of: http://data.ga-group.nl/ics/bics/14151116
is version of: http://data.ga-group.nl/ics/bics/14151116
imported on: 2026-06-08T13:03:47.798Z
last refreshed on: 2026-06-08T13:03:47.798Z
source accessed on: 2019-12-03T20:05:01Z
source last accessed on: 2019-12-03T20:05:01Z
label: Estacionamento REIT @pt
label: Parkhaus REIT @de
label: REIT de estacionamientos @es
label: REIT parcheggi @it
label: REIT stationnements @fr
label: Стоянки ав��омобилей - REIT @ru
label: 停車場 REIT @zh-hant
label: 停车场 REIT @zh
label: 駐車場REIT @ja
label: 주차장 리츠(REIT) @ko
definition: This industry subgroup includes real estate investment trusts (REITs) that own and develop parking lots/garages.
notation: 14151116
valid from: 2014-08-08
valid till: 2020-10-03

Regional Mall REIT
type: BicsLevel5Segment
type: Classifier
type: NamedIndividual
is level5 segment of: Retail REIT
is anachronous version of: http://data.ga-group.nl/ics/bics/1510111610
is contemporary version of: http://data.ga-group.nl/ics/bics/1415111710
is replaced by: http://data.ga-group.nl/ics/bics/2020/1510111610
is version of: http://data.ga-group.nl/ics/bics/1415111710
is version of: http://data.ga-group.nl/ics/bics/1510111610
imported on: 2026-06-08T13:03:47.798Z
last refreshed on: 2026-06-08T13:03:47.798Z
source accessed on: 2019-12-03T20:05:01Z
source last accessed on: 2019-12-03T20:05:01Z
label: Centro comerciais regionais REIT @pt
label: Centros comerciales REIT @es
label: REIT -Centres commerciaux régionaux @fr
label: REIT Centri commerciali regionali @it
label: Regionale Einkauszentren - REIT @de
label: Региональные торговые центры - REIT @ru
label: 地区购物商城REIT @zh
label: 地區購物中心REIT @zh-hant
label: 地方ｼｮｯﾋﾟﾝｸﾞｾﾝﾀｰREIT @ja
label: 지역쇼핑몰 리츠 @ko
definition: This segment includes real estate investment trusts (REITs) that own and develop mall space.
notation: 1415111710
valid from: 2014-08-08
valid till: 2020-10-03

Shopping Center REIT
type: BicsLevel5Segment
type: Classifier
type: NamedIndividual
is level5 segment of: Retail REIT
is anachronous version of: http://data.ga-group.nl/ics/bics/1510111611
is contemporary version of: http://data.ga-group.nl/ics/bics/1415111711
is replaced by: http://data.ga-group.nl/ics/bics/2020/1510111611
is version of: http://data.ga-group.nl/ics/bics/1415111711
is version of: http://data.ga-group.nl/ics/bics/1510111611
imported on: 2026-06-08T13:03:47.798Z
last refreshed on: 2026-06-08T13:03:47.798Z
source accessed on: 2019-12-03T20:05:01Z
source last accessed on: 2019-12-03T20:05:01Z
label: Centro comercial REIT @es
label: REIT - Zones de magasins @fr
label: REIT Centri commerciali @it
label: Shopping Centers REIT @pt
label: Shoppingcenter - REIT @de
label: Торговые центры - REIT @ru
label: 購物中心REIT @zh-hant
label: 购物中心REIT @zh
label: 쇼핑센터 리츠 @ko
label: ｼｮｯﾋﾟﾝｸﾞｾﾝﾀｰREIT @ja
definition: This segment includes real estate investment trusts (REITs) that own and develop shopping centers, community or lifestyle centers. Such centers are also known as strip centers or power centers.
notation: 1415111711
valid from: 2014-08-08
valid till: 2020-10-03

Single Tenant REIT
type: BicsLevel5Segment
type: Classifier
type: NamedIndividual
is level5 segment of: Retail REIT
is anachronous version of: http://data.ga-group.nl/ics/bics/1510111612
is contemporary version of: http://data.ga-group.nl/ics/bics/1415111712
is replaced by: http://data.ga-group.nl/ics/bics/2020/1510111612
is version of: http://data.ga-group.nl/ics/bics/1415111712
is version of: http://data.ga-group.nl/ics/bics/1510111612
imported on: 2026-06-08T13:03:47.798Z
last refreshed on: 2026-06-08T13:03:47.798Z
source accessed on: 2019-12-03T20:05:01Z
source last accessed on: 2019-12-03T20:05:01Z
label: Einzelmieter - REIT @de
label: REIT - Locataire unique @fr
label: REIT Locatario unico @it
label: Un inquilino REIT @es
label: Único inquilino REIT @pt
label: Один съемщик - REIT @ru
label: 单一租户REIT @zh
label: 単一ﾃﾅﾝﾄREIT @ja
label: 單一租客REIT @zh-hant
label: 단일입주자 리츠 @ko
definition: This segment includes real estate investment trusts (REITs) that own and develop outparcel buildings, such as gas station sites or stand-alone restaurant buildings.
notation: 1415111712
valid from: 2014-08-08
valid till: 2020-10-03

Retail REIT
type: BicsLevel4SubIndustry
type: Classifier
type: NamedIndividual
is sub industry of: REIT
is anachronous version of: http://data.ga-group.nl/ics/bics/15101116
is contemporary version of: http://data.ga-group.nl/ics/bics/14151117
is replaced by: http://data.ga-group.nl/ics/bics/2020/15101116
is version of: http://data.ga-group.nl/ics/bics/14151117
is version of: http://data.ga-group.nl/ics/bics/15101116
imported on: 2026-06-08T13:03:47.798Z
last refreshed on: 2026-06-08T13:03:47.798Z
source accessed on: 2019-12-03T20:05:01Z
source last accessed on: 2019-12-03T20:05:01Z
label: Einzelhandel-REITs @de
label: REIT Distribution @fr
label: REIT al por menor @es
label: REIT negozi @it
label: Varejo REIT @pt
label: Розничные REIT @ru
label: 店舗REIT @ja
label: 零售REIT @zh
label: 零售不動產投資信託 @zh-hant
label: 소매 리츠(REIT) @ko
definition: This industry subgroup includes real estate investment trusts (REITS) that own and develop retail real estate, such as outlet space, strip centers, malls and single-tenant entities).
notation: 14151117
valid from: 2014-08-08
valid till: 2020-10-03

Self-storage REIT
type: BicsLevel4SubIndustry
type: Classifier
type: NamedIndividual
is sub industry of: REIT
is anachronous version of: http://data.ga-group.nl/ics/bics/15101117
is contemporary version of: http://data.ga-group.nl/ics/bics/14151118
is replaced by: http://data.ga-group.nl/ics/bics/2020/15101117
is version of: http://data.ga-group.nl/ics/bics/14151118
is version of: http://data.ga-group.nl/ics/bics/15101117
imported on: 2026-06-08T13:03:47.798Z
last refreshed on: 2026-06-08T13:03:47.798Z
source accessed on: 2019-12-03T20:05:01Z
source last accessed on: 2019-12-03T20:05:01Z
label: Auto armazenamento REIT @pt
label: Minilager REIT @de
label: REIT de almacenamiento propio @es
label: REIT entreposage libre-service @fr
label: REIT self-storage @it
label: Камеры хранения - REIT @ru
label: 自助仓库 REIT @zh
label: 自助倉儲 REIT @zh-hant
label: 자가창고 리츠(REIT) @ko
label: ﾄﾗﾝｸﾙｰﾑREIT @ja
definition: This industry subgroup includes real estate investment trusts (REITs) that own and develop self-storage units/properties.
notation: 14151118
valid from: 2014-08-08
valid till: 2020-10-03

Life Science REIT
type: BicsLevel5Segment
type: Classifier
type: Discontinued
type: NamedIndividual
is level5 segment of: Specialty & Other REIT
is contemporary version of: http://data.ga-group.nl/ics/bics/1415111910
is version of: http://data.ga-group.nl/ics/bics/1415111910
imported on: 2026-06-08T13:03:47.798Z
last refreshed on: 2026-06-08T13:03:47.798Z
source accessed on: 2019-12-03T20:05:01Z
source last accessed on: 2019-12-03T20:05:01Z
label: Biología REIT @es
label: Biowissenschaft - REIT @de
label: Ciências da vida REIT @pt
label: REIT - Sciences de la vie @fr
label: REIT Scienze della vita @it
label: Биологические науки - REIT @ru
label: 生命科学REIT @ja
label: 生命科學REIT @zh-hant
label: 생명과학 리츠 @ko
definition: This segment includes real estate investment trusts (REITs) that own and develop office and laboratory properties that lease to life science‒related tenants, such as pharmaceutical companies, research institutions and government agencies.
notation: 1415111910
valid from: 2014-08-08
valid till: 2020-10-03

Specialty & Other REIT
type: BicsLevel4SubIndustry
type: Classifier
type: NamedIndividual
is sub industry of: REIT
is anachronous version of: http://data.ga-group.nl/ics/bics/15101122
is contemporary version of: http://data.ga-group.nl/ics/bics/14151119
is replaced by: http://data.ga-group.nl/ics/bics/2020/15101122
is version of: http://data.ga-group.nl/ics/bics/14151119
is version of: http://data.ga-group.nl/ics/bics/15101122
imported on: 2026-06-08T13:03:47.798Z
last refreshed on: 2026-06-08T13:03:47.798Z
source accessed on: 2019-12-03T20:05:01Z
source last accessed on: 2019-12-03T20:05:01Z
label: Especializados y otro REIT @es
label: Outros REIT e especialização @pt
label: REIT - Spécialités et autres @fr
label: REIT speciali e altri @it
label: Spezielle & Sonstige - REIT @de
label: Специализированные и прочие REIT @ru
label: 特殊与其他REIT特殊与其他REIT @zh
label: 特殊及其他REIT @zh-hant
label: 特殊･その他物件REIT @ja
label: 전문 & 기타 리츠(REIT) @ko
definition: This industry subgroup includes real estate investment trusts (REITs) that own and develop specialty and other properties not elsewhere classified. Such property includes master planned communities (MPCs), data centers, and life science/research & development facilities.
notation: 14151119
valid from: 2014-08-08
valid till: 2020-10-03

REIT
type: BicsLevel3Industry
type: Classifier
type: NamedIndividual
is industry of: Real Estate
is anachronous version of: http://data.ga-group.nl/ics/bics/151011
is contemporary version of: http://data.ga-group.nl/ics/bics/141511
is replaced by: http://data.ga-group.nl/ics/bics/2020/151011
is version of: http://data.ga-group.nl/ics/bics/141511
is version of: http://data.ga-group.nl/ics/bics/151011
imported on: 2026-06-08T13:03:47.798Z
last refreshed on: 2026-06-08T13:03:47.798Z
source accessed on: 2019-12-03T20:05:01Z
source last accessed on: 2019-12-03T20:05:01Z
label: 不動產投資信託 @zh-hant
label: 리츠 @ko
definition: This industry includes real estate investment trusts (REITs). REITS own and develop income-producing real estate and real estate mortgages. Sectors include office, retail, housing, healthcare, hotel, industrial, self-storage and specialty. To be considered a REIT, a company must have most of its assets and income tied to real estate and must distribute at least 90% of it taxable income as dividends to shareholders.
notation: 141511
valid from: 2014-08-08
valid till: 2020-10-03

Comml Real Estate Info Svcs
type: BicsLevel4SubIndustry
type: Classifier
type: Discontinued
type: NamedIndividual
is sub industry of: Real Estate Services
is contemporary version of: http://data.ga-group.nl/ics/bics/14151210
is version of: http://data.ga-group.nl/ics/bics/14151210
imported on: 2026-06-08T13:03:47.798Z
last refreshed on: 2026-06-08T13:03:47.798Z
source accessed on: 2019-12-03T20:05:01Z
source last accessed on: 2019-12-03T20:05:01Z
label: GewImmoInfoDienste @de
label: Serv info immobili comm @it
label: Serv info immobilier commercial @fr
label: Serv info imobiliário comercial @pt
label: Svcs de info inmob comercial @es
label: Информ. услуги по коммерч. недвиж. @ru
label: 商业房地产信息服务 @zh
label: 商業不動產資訊服務 @zh-hant
label: 商業不動産情報ｻｰﾋﾞｽ @ja
label: 상업용 부동산 정보 서비스 @ko
definition: This industry subgroup includes companies that provide data, market research and information/technology products and services to the real estate community.
notation: 14151210
valid from: 2014-08-08
valid till: 2020-10-03

Commercial Property Mgmt
type: BicsLevel5Segment
type: Classifier
type: NamedIndividual
is level5 segment of: Property Management
is anachronous version of: http://data.ga-group.nl/ics/bics/151012101010
is contemporary version of: http://data.ga-group.nl/ics/bics/1415121110
is replaced by: http://data.ga-group.nl/ics/bics/2020/151012101010
is version of: http://data.ga-group.nl/ics/bics/1415121110
is version of: http://data.ga-group.nl/ics/bics/151012101010
imported on: 2026-06-08T13:03:47.798Z
last refreshed on: 2026-06-08T13:03:47.798Z
source accessed on: 2019-12-03T20:05:01Z
source last accessed on: 2019-12-03T20:05:01Z
label: Administração de propriedades comerciais @pt
label: Gestión de propiedad comercial @es
label: Gestion de propriétés commerciales @fr
label: Gestione proprietà commerciali @it
label: Immobilienverwaltung - gewerblich @de
label: Управление коммерческой недвижимостью @ru
label: 商业物业管理 @zh
label: 商業不動產管理 @zh-hant
label: 商業不動産管理 @ja
label: 상업용 부동산 관리 @ko
definition: This segment includes companies that provide management services for commercial property. Such property includes all property types other than any type under multi-housing. Excludes senior housing facilities (see Senior Housing Operators).
notation: 1415121110
valid from: 2014-08-08
valid till: 2020-10-03

Residential Property Mgmt
type: BicsLevel5Segment
type: Classifier
type: NamedIndividual
is level5 segment of: Property Management
is anachronous version of: http://data.ga-group.nl/ics/bics/151012101011
is contemporary version of: http://data.ga-group.nl/ics/bics/1415121111
is replaced by: http://data.ga-group.nl/ics/bics/2020/151012101011
is version of: http://data.ga-group.nl/ics/bics/1415121111
is version of: http://data.ga-group.nl/ics/bics/151012101011
imported on: 2026-06-08T13:03:47.798Z
last refreshed on: 2026-06-08T13:03:47.798Z
source accessed on: 2019-12-03T20:05:01Z
source last accessed on: 2019-12-03T20:05:01Z
label: Administração de propriedades residenciais @pt
label: Gestión de propiedad residencial @es
label: Gestion de propriétés résidentielles @fr
label: Gestione proprietà residenziali @it
label: Immobilienverwaltung - Wohnungen @de
label: Управление жилой недвижимостью @ru
label: 住宅不動產管理 @zh-hant
label: 住宅不動産管理 @ja
label: 住宅物业管理 @zh
label: 주거용 부동산 관리 @ko
definition: This segment includes companies that provide management services for residential property.
notation: 1415121111
valid from: 2014-08-08
valid till: 2020-10-03

Senior Housing Operators
type: BicsLevel5Segment
type: Classifier
type: NamedIndividual
is level5 segment of: Property Management
is anachronous version of: http://data.ga-group.nl/ics/bics/151012101012
is contemporary version of: http://data.ga-group.nl/ics/bics/1415121112
is replaced by: http://data.ga-group.nl/ics/bics/2020/151012101012
is version of: http://data.ga-group.nl/ics/bics/1415121112
is version of: http://data.ga-group.nl/ics/bics/151012101012
imported on: 2026-06-08T13:03:47.798Z
last refreshed on: 2026-06-08T13:03:47.798Z
source accessed on: 2019-12-03T20:05:01Z
source last accessed on: 2019-12-03T20:05:01Z
label: Abitazioni anziani @it
label: Opérateurs logement pr personnes âgées @fr
label: Operadores de moradia para idosos @pt
label: Ops viviendas adultos mayores @es
label: Seniorenwohnungen - Inh. & Erschl. @de
label: Жилье для пенсионеров - Управляющие @ru
label: 老年公寓经营者 @zh
label: 高齡住宅業者 @zh-hant
label: 高齢者用住宅運営 @ja
label: 고령자용 주택 운영자 @ko
definition: This segment includes companies that manages and operate senior housing facilities. These companies provide outsourced management services on behalf of the property owners.
notation: 1415121112
valid from: 2014-08-08
valid till: 2020-10-03

Property Management
type: BicsLevel4SubIndustry
type: Classifier
type: NamedIndividual
is sub industry of: Real Estate Services
is anachronous version of: http://data.ga-group.nl/ics/bics/1510121010
is contemporary version of: http://data.ga-group.nl/ics/bics/14151211
is replaced by: http://data.ga-group.nl/ics/bics/2020/1510121010
is version of: http://data.ga-group.nl/ics/bics/14151211
is version of: http://data.ga-group.nl/ics/bics/1510121010
imported on: 2026-06-08T13:03:47.798Z
last refreshed on: 2026-06-08T13:03:47.798Z
source accessed on: 2019-12-03T20:05:01Z
source last accessed on: 2019-12-03T20:05:01Z
label: Administração de propriedades @pt
label: Gestión de propiedad @es
label: Gestion de propriétés @fr
label: Gestione proprietà @it
label: Immobilienverwaltung @de
label: Управление объектами недвижимости @ru
label: 不動產管理 @zh-hant
label: 不動産管理 @ja
label: 物业管理 @zh
label: 부동산 관리 @ko
definition: This industry subgroup includes companies that provide property management services. Such services include building maintenance and security, and bill payment services.
notation: 14151211
valid from: 2014-08-08
valid till: 2020-10-03

Real Estate Appraisers
type: BicsLevel4SubIndustry
type: Classifier
type: Discontinued
type: NamedIndividual
is sub industry of: Real Estate Services
is contemporary version of: http://data.ga-group.nl/ics/bics/14151212
is version of: http://data.ga-group.nl/ics/bics/14151212
imported on: 2026-06-08T13:03:47.798Z
last refreshed on: 2026-06-08T13:03:47.798Z
source accessed on: 2019-12-03T20:05:01Z
source last accessed on: 2019-12-03T20:05:01Z
label: Avaliadores de imóveis @pt
label: Evaluateurs immobiliers @fr
label: Immobiliengutachter @de
label: Periti immobiliari @it
label: Peritos inmobiliarios @es
label: Оценщики недвижимости @ru
label: 不動產估價 @zh-hant
label: 不動産鑑定業 @ja
label: 房地产鉴定事务所 @zh
label: 부동산 감정업 @ko
definition: This industry subgroup includes companies that appraise real estate values for a fee.
notation: 14151212
valid from: 2014-08-08
valid till: 2020-10-03

RE Brokerage - Leasing
type: BicsLevel4SubIndustry
type: Classifier
type: NamedIndividual
is sub industry of: Real Estate Services
is anachronous version of: http://data.ga-group.nl/ics/bics/151012101110
is contemporary version of: http://data.ga-group.nl/ics/bics/14151213
is replaced by: http://data.ga-group.nl/ics/bics/2020/151012101110
is version of: http://data.ga-group.nl/ics/bics/14151213
is version of: http://data.ga-group.nl/ics/bics/151012101110
imported on: 2026-06-08T13:03:47.798Z
last refreshed on: 2026-06-08T13:03:47.798Z
source accessed on: 2019-12-03T20:05:01Z
source last accessed on: 2019-12-03T20:05:01Z
label: Brokeraggio immobil - affitti @it
label: Corretagem de imóveis - aluguel @pt
label: Corretaje de inmobiliario - Arrendamiento @es
label: Courtage immobilier - Locations @fr
label: Immobilienmaklerfirma - Leasing @de
label: Брокерские услуги по операциям с недвижимостья - Аренда @ru
label: 不動產經紀-租賃 @zh-hant
label: 不動産仲介-ﾘｰｽ @ja
label: 房地产经纪-租赁 @zh
label: 부동산 중개업-리스 @ko
definition: This industry subgroup includes companies that provide brokerage services between a lessee and the property owner for a fee. These companies may represent either sides of the transaction and may provide marketing services. These companies do not own the underlying property.
notation: 14151213
valid from: 2014-08-08
valid till: 2020-10-03

Real Estate Brokerage - Sales
type: BicsLevel4SubIndustry
type: Classifier
type: NamedIndividual
is sub industry of: Real Estate Services
is anachronous version of: http://data.ga-group.nl/ics/bics/151012101111
is contemporary version of: http://data.ga-group.nl/ics/bics/14151214
is replaced by: http://data.ga-group.nl/ics/bics/2020/151012101111
is version of: http://data.ga-group.nl/ics/bics/14151214
is version of: http://data.ga-group.nl/ics/bics/151012101111
imported on: 2026-06-08T13:03:47.798Z
last refreshed on: 2026-06-08T13:03:47.798Z
source accessed on: 2019-12-03T20:05:01Z
source last accessed on: 2019-12-03T20:05:01Z
label: Corretagem de imóveis - Vendas @pt
label: Corretaje inmobiliario - ventas @es
label: Courtage immobilier - Ventes @fr
label: Immobilienmaklerfirma - Sales @de
label: Intermediazioni immobiliari - Vendita @it
label: Брок. услуги по операциям с недвиж. - продажи @ru
label: 不動產經紀-銷售 @zh-hant
label: 不動産仲介-販売 @ja
label: 房地产经纪-销售 @zh
label: 부동산 중개업-판매 @ko
definition: This industry subgroup includes companies that provide brokerage services between a buyer and the property owner for a fee. These companies may represent either side of the transaction and may provide marketing services. These companies do not own the underlying property.
notation: 14151214
valid from: 2014-08-08
valid till: 2020-10-03

Real Estate Fee & Asset Mgmt
type: BicsLevel4SubIndustry
type: Classifier
type: Discontinued
type: NamedIndividual
is sub industry of: Real Estate Services
is contemporary version of: http://data.ga-group.nl/ics/bics/14151215
is version of: http://data.ga-group.nl/ics/bics/14151215
imported on: 2026-06-08T13:03:47.798Z
last refreshed on: 2026-06-08T13:03:47.798Z
source accessed on: 2019-12-03T20:05:01Z
source last accessed on: 2019-12-03T20:05:01Z
label: Frais sur immobilier et gestion d'actifs @fr
label: Immobilien - Gebühren-& Vermögensverwaltung @de
label: Spese manutenz e Asset Management @it
label: Tarifas inmobiliarias y gestión de activos @es
label: Taxa de imóveis e administração de ativos @pt
label: Сборы по недвижимости и управление активами @ru
label: 不動產費用及資產管理 @zh-hant
label: 不動産費用･資産管理 @ja
label: 房地产手续费与资产管理 @zh
label: 부동산 수수료 & 자산 관리 @ko
definition: This industry subgroup includes fee income directly attributable to fee and asset management financing, excluding property management. These are fees generated from a managed portfolio for overseeing a client’s investments, making decisions about capital expenditures, or hiring building managers.
notation: 14151215
valid from: 2014-08-08
valid till: 2020-10-03

Real Estate Services
type: BicsLevel3Industry
type: Classifier
type: NamedIndividual
is industry of: Real Estate
is anachronous version of: http://data.ga-group.nl/ics/bics/15101210
is contemporary version of: http://data.ga-group.nl/ics/bics/141512
is replaced by: http://data.ga-group.nl/ics/bics/2020/15101210
is version of: http://data.ga-group.nl/ics/bics/141512
is version of: http://data.ga-group.nl/ics/bics/15101210
imported on: 2026-06-08T13:03:47.798Z
last refreshed on: 2026-06-08T13:03:47.798Z
source accessed on: 2019-12-03T20:05:01Z
source last accessed on: 2019-12-03T20:05:01Z
label: Immobiliendienstleistungen @de
label: Serviços imobiliários @pt
label: Services immobiliers @fr
label: Servicios inmobiliarios @es
label: Servizi immobiliari @it
label: Услуги по недвижимости @ru
label: 不動産ｻｰﾋﾞｽ @ja
label: 不��產服務 @zh-hant
label: 房地产服务 @zh
label: 부동산 서비스 @ko
definition: This industry includes companies that provide real estate services in addition to normal operations. Such services include property and/or third-party asset management, brokerage and information services for real estate owners.
notation: 141512
valid from: 2014-08-08
valid till: 2020-10-03

Real Estate
type: BicsLevel2IndustryGroup
type: Classifier
type: NamedIndividual
is industry group of: Financials
is anachronous version of: http://data.ga-group.nl/ics/bics/1510
is contemporary version of: http://data.ga-group.nl/ics/bics/1415
is replaced by: http://data.ga-group.nl/ics/bics/2020/1510
is version of: http://data.ga-group.nl/ics/bics/1415
is version of: http://data.ga-group.nl/ics/bics/1510
imported on: 2026-06-08T13:03:47.798Z
last refreshed on: 2026-06-08T13:03:47.798Z
source accessed on: 2019-12-03T20:05:01Z
source last accessed on: 2019-12-03T20:05:01Z
label: Immobili @it
label: Immobilien @de
label: Immobilier @fr
label: Imobiliário @pt
label: Inmuebles @es
label: Недвиж. @ru
label: 不動產 @zh-hant
label: 不動産 @ja
label: 房地产 @zh
label: 부동산 @ko
definition: This industry group includes companies that are involved with real estate, such as companies that own and develop real estate, as well as companies that provide specialized real estate‒related services.
notation: 1415
valid from: 2014-08-08
valid till: 2020-10-03

Financials
type: BicsLevel1Sector
type: Classifier
type: NamedIndividual
is contemporary version of: http://data.ga-group.nl/ics/bics/14
is replaced by: http://data.ga-group.nl/ics/bics/2020/14
is version of: http://data.ga-group.nl/ics/bics/14
imported on: 2026-06-08T13:03:47.798Z
last refreshed on: 2026-06-08T13:03:47.798Z
source accessed on: 2019-12-03T20:05:01Z
source last accessed on: 2019-12-03T20:05:01Z
label: Financières @fr
label: Financiero @es
label: Finanziari @it
label: Finanzwesen @de
label: Serviços Financeiros @pt
label: Финансы @ru
label: 金融 @ja
label: 금융기관 @ko
definition: This sector includes companies that provide financial services or products to retail and commercial clients.
notation: 14
valid from: 2014-08-08
valid till: 2020-10-03

Large Pharma
type: BicsLevel3Industry
type: Classifier
type: NamedIndividual
is industry of: Biotech & Pharma
is anachronous version of: http://data.ga-group.nl/ics/bics/16101010
is contemporary version of: http://data.ga-group.nl/ics/bics/151010
is replaced by: http://data.ga-group.nl/ics/bics/2020/16101010
is version of: http://data.ga-group.nl/ics/bics/151010
is version of: http://data.ga-group.nl/ics/bics/16101010
imported on: 2026-06-08T13:03:47.798Z
last refreshed on: 2026-06-08T13:03:47.798Z
source accessed on: 2019-12-03T20:05:01Z
source last accessed on: 2019-12-03T20:05:01Z
label: Farma grande @it
label: Farmacéuticas grandes @es
label: Grande pharma @fr
label: Grandes ind farmac @pt
label: Große Pharma @de
label: Крупные фармац. компании @ru
label: 大型制药 @zh
label: 大型製藥業 @zh-hant
label: 大手製薬会社 @ja
label: 대형 제약업체 @ko
definition: This industry includes large companies that are involved in all stages of the pharmaceutical industry from drug discovery to manufacturing and marketing. These companies commonly engage in M&A activities to expand their patent portfolios, vertically integrate, or expand into related industries.
notation: 151010
valid from: 2014-08-08
valid till: 2020-10-03

Development Stage Biotech
type: BicsLevel4SubIndustry
type: Classifier
type: Discontinued
type: NamedIndividual
is sub industry of: Biotech
is contemporary version of: http://data.ga-group.nl/ics/bics/15101110
is version of: http://data.ga-group.nl/ics/bics/15101110
imported on: 2026-06-08T13:03:47.798Z
last refreshed on: 2026-06-08T13:03:47.798Z
source accessed on: 2019-12-03T20:05:01Z
source last accessed on: 2019-12-03T20:05:01Z
label: Biotec en fase de desarrollo @es
label: Biotech stade de développement @fr
label: Biotechnologie in der Entwicklungsphase @de
label: Biotecn fase sviluppo @it
label: Biotecnologia em estágio de desenvolvimento @pt
label: Биотехнологии на этапе развития @ru
label: 开���阶段生物科技 @zh
label: 開発ｽﾃｰｼﾞ ﾊﾞｲｵﾃｸ @ja
label: 開發階段生物科技 @zh-hant
label: 개발단계 생명공학 @ko
definition: This industry subgroup includes biotech companies with no marketed products. Products are currently in development. Such companies operate at a loss to fund future product commercialization.
notation: 15101110
valid from: 2014-08-08
valid till: 2020-10-03

Early Commercial Biotech
type: BicsLevel4SubIndustry
type: Classifier
type: Discontinued
type: NamedIndividual
is sub industry of: Biotech
is contemporary version of: http://data.ga-group.nl/ics/bics/15101111
is version of: http://data.ga-group.nl/ics/bics/15101111
imported on: 2026-06-08T13:03:47.798Z
last refreshed on: 2026-06-08T13:03:47.798Z
source accessed on: 2019-12-03T20:05:01Z
source last accessed on: 2019-12-03T20:05:01Z
label: Biotec comercial inicial @es
label: Biotech commerciale Début @fr
label: Biotecn commerc fase iniziale @it
label: Biotecnologia comercial precoce @pt
label: Frühe gewerbliche Biotechnologie @de
label: Коммерч. биотехн. на начальной стадии @ru
label: 早期商业生物科技 @zh
label: 早期商業化生物科技 @zh-hant
label: 早期商業用ﾊﾞｲｵﾃｸﾉﾛｼﾞｰ @ja
label: 상업용 초기 생명공학 @ko
definition: This industry subgroup includes biotech companies with a marketed product, near-term products or significant collaborative revenues but have not yet established a sustainable revenue base.
notation: 15101111
valid from: 2014-08-08
valid till: 2020-10-03

Commercial Growth Biotech
type: BicsLevel4SubIndustry
type: Classifier
type: Discontinued
type: NamedIndividual
is sub industry of: Biotech
is contemporary version of: http://data.ga-group.nl/ics/bics/15101112
is version of: http://data.ga-group.nl/ics/bics/15101112
imported on: 2026-06-08T13:03:47.798Z
last refreshed on: 2026-06-08T13:03:47.798Z
source accessed on: 2019-12-03T20:05:01Z
source last accessed on: 2019-12-03T20:05:01Z
label: Biotec comercial en crecimiento @es
label: Biotech commerciale Croissance @fr
label: Biotecn crescita commerc @it
label: Crescimento comercial de biotec @pt
label: Wachstum der gewerblichen Biotechnologie @de
label: Развив. коммерч. биотехнологии @ru
label: 商业成长生物科技 @zh
label: 商業化成長期生物科技 @zh-hant
label: 商業用発展型ﾊﾞｲｵﾃｸﾉﾛｼﾞｰ @ja
label: 상업용 성장기 생명공학 @ko
definition: This industry subgroup includes biotech companies with marketed products and operations that generate sustainable profits, exclusive of extraordinary events. Such companies are still dedicating significant resources to future growth, and thus, are not mature.
notation: 15101112
valid from: 2014-08-08
valid till: 2020-10-03

Mature Biotechnology
type: BicsLevel4SubIndustry
type: Classifier
type: Discontinued
type: NamedIndividual
is sub industry of: Biotech
is contemporary version of: http://data.ga-group.nl/ics/bics/15101113
is version of: http://data.ga-group.nl/ics/bics/15101113
imported on: 2026-06-08T13:03:47.798Z
last refreshed on: 2026-06-08T13:03:47.798Z
source accessed on: 2019-12-03T20:05:01Z
source last accessed on: 2019-12-03T20:05:01Z
label: Ausgereifte Biotechnologie @de
label: Biotec en fase de madurez @es
label: Biotec madura @pt
label: Biotech Maturité @fr
label: Biotecn fase maturazione @it
label: Развитые биотехнологии @ru
label: 成熟型ﾊﾞｲｵﾃｸﾉﾛｼﾞｰ @ja
label: 成熟期生物科技 @zh-hant
label: 成熟生物科技 @zh
label: 성숙기 생명공학 @ko
definition: This industry subgroup includes global biotech companies with a large, established revenue base and sustained profitability.
notation: 15101113
valid from: 2014-08-08
valid till: 2020-10-03

Biotech
type: BicsLevel3Industry
type: Classifier
type: NamedIndividual
is industry of: Biotech & Pharma
is anachronous version of: http://data.ga-group.nl/ics/bics/16101011
is contemporary version of: http://data.ga-group.nl/ics/bics/151011
is replaced by: http://data.ga-group.nl/ics/bics/2020/16101011
is version of: http://data.ga-group.nl/ics/bics/151011
is version of: http://data.ga-group.nl/ics/bics/16101011
imported on: 2026-06-08T13:03:47.798Z
last refreshed on: 2026-06-08T13:03:47.798Z
source accessed on: 2019-12-03T20:05:01Z
source last accessed on: 2019-12-03T20:05:01Z
label: Biotec @es
label: Biotechn. @de
label: Биотехнологии @ru
label: 生物科技 @zh
label: 생명공학 @ko
label: ﾊﾞｲｵﾃｸﾉﾛｼﾞｰ @ja
definition: This industry includes companies that specialize in discovering, developing and patenting of novel pharmaceuticals. Typically, these companies have high R&D investments, primarily focus on drug discovery/development, and rarely diversify into other verticals. Also, these companies typically pursue high-value/high-risk frontier pharmaceutical targets.
notation: 151011
valid from: 2014-08-08
valid till: 2020-10-03

Development Stage Spec Pharma
type: BicsLevel4SubIndustry
type: Classifier
type: Discontinued
type: NamedIndividual
is sub industry of: Specialty Pharma
is contemporary version of: http://data.ga-group.nl/ics/bics/15101210
is version of: http://data.ga-group.nl/ics/bics/15101210
imported on: 2026-06-08T13:03:47.798Z
last refreshed on: 2026-06-08T13:03:47.798Z
source accessed on: 2019-12-03T20:05:01Z
source last accessed on: 2019-12-03T20:05:01Z
label: Entwicklungsphase - Spezielle Pharma @de
label: Fármaco especial en fase de desarrollo @es
label: Farma Fase di sviluppo spec @it
label: Farmac espec fase de desenvolvimento @pt
label: Prod pharma spéc en dév @fr
label: Фармацевтика в стадии развития @ru
label: 开发阶段特殊药品 @zh
label: 開発段階特殊��薬品 @ja
label: 開發階段特殊製藥 @zh-hant
label: 개발단계 전문 제약업 @ko
definition: This industry subgroup includes specialty pharmaceutical companies with no marketed products. Such companies are either looking to acquire product candidates or have product(s) currently in development. They are operating at a loss to fund future product commercialization.
notation: 15101210
valid from: 2014-08-08
valid till: 2020-10-03

Comml Non-Profit Spec Pharma
type: BicsLevel4SubIndustry
type: Classifier
type: Discontinued
type: NamedIndividual
is sub industry of: Specialty Pharma
is contemporary version of: http://data.ga-group.nl/ics/bics/15101211
is version of: http://data.ga-group.nl/ics/bics/15101211
imported on: 2026-06-08T13:03:47.798Z
last refreshed on: 2026-06-08T13:03:47.798Z
source accessed on: 2019-12-03T20:05:01Z
source last accessed on: 2019-12-03T20:05:01Z
label: Fármaco especial no rentable no comercial @es
label: Farma spec non profit comm @it
label: Farmac espec não rentáveis comerciais @pt
label: Gewerbl., nicht profitable spezielle Pharma @de
label: Prod pharma spéc comm non rentables @fr
label: Фармацевтика в стадии развития-нерент. @ru
label: 商业非营利性特��药品 @zh
label: 商業用非収益性特殊医薬品 @ja
label: 商業非獲利特殊製藥 @zh-hant
label: 상업용 비영리 전문 제약업 @ko
definition: This industry subgroup includes specialty pharmaceutical companies with a marketed product, near-term product launch or significant collaborative revenues but no sustainable profitability of earnings because of significant resource allocation to acquiring or launching new products and to R&D efforts.
notation: 15101211
valid from: 2014-08-08
valid till: 2020-10-03

Comml Profitable Spec Pharm
type: BicsLevel4SubIndustry
type: Classifier
type: Discontinued
type: NamedIndividual
is sub industry of: Specialty Pharma
is contemporary version of: http://data.ga-group.nl/ics/bics/15101212
is version of: http://data.ga-group.nl/ics/bics/15101212
imported on: 2026-06-08T13:03:47.798Z
last refreshed on: 2026-06-08T13:03:47.798Z
source accessed on: 2019-12-03T20:05:01Z
source last accessed on: 2019-12-03T20:05:01Z
label: Fármacos especiales comerciales rentables @es
label: Farma spec lucro comm @it
label: Farmac especializados rentáveis com @pt
label: Gewerbl., profitable spezielle Pharma @de
label: Prod pharma spéc comm rentables @fr
label: Коммерч. рентабельные фармац. комп. @ru
label: 商业营利性特殊药品 @zh
label: 商業獲利特殊製藥 @zh-hant
label: 商業用収益性特殊医薬品 @ja
label: 상업용 영리 전문 제약업 @ko
definition: This industry subgroup includes specialty pharmaceutical companies with an established revenue base and sustained profitability.
notation: 15101212
valid from: 2014-08-08
valid till: 2020-10-03

Specialty Pharma
type: BicsLevel3Industry
type: Classifier
type: NamedIndividual
is industry of: Biotech & Pharma
is anachronous version of: http://data.ga-group.nl/ics/bics/1610101210
is contemporary version of: http://data.ga-group.nl/ics/bics/151012
is replaced by: http://data.ga-group.nl/ics/bics/2020/1610101210
is version of: http://data.ga-group.nl/ics/bics/151012
is version of: http://data.ga-group.nl/ics/bics/1610101210
imported on: 2026-06-08T13:03:47.798Z
last refreshed on: 2026-06-08T13:03:47.798Z
source accessed on: 2019-12-03T20:05:01Z
source last accessed on: 2019-12-03T20:05:01Z
label: Fármacos especiales @es
label: Farma specializzata @it
label: Farmac especializ @pt
label: Prod pharma spécialisés @fr
label: Spezielle Pharma. @de
label: Специальная фармацевтика @ru
label: 特殊医薬品 @ja
label: 特殊药品 @zh
label: 特殊製藥 @zh-hant
label: 전문 제약업체 @ko
definition: This industry includes companies that specialize in developing, manufacturing and marketing pharmaceuticals. Typically, these companies are less R&D focused and more marketing driven. They may seek M&A activities to expand their drug portfolios or vertically integrate. Furthermore, these companies engage in less risky drug developments, such as reformulations and branded generics. Some common products include botanical-based medicine, nutraceuticals, over-the-counter (OTC) drugs and veterinary medicine.
notation: 151012
valid from: 2014-08-08
valid till: 2020-10-03

Biosimilars Valuation
type: BicsLevel4SubIndustry
type: Classifier
type: Discontinued
type: NamedIndividual
is sub industry of: Generic Pharma
is contemporary version of: http://data.ga-group.nl/ics/bics/15101310
is version of: http://data.ga-group.nl/ics/bics/15101310
imported on: 2026-06-08T13:03:47.798Z
last refreshed on: 2026-06-08T13:03:47.798Z
source accessed on: 2019-12-03T20:05:01Z
source last accessed on: 2019-12-03T20:05:01Z
label: Avaliação de biossimilares @pt
label: Biosimilare Bewertung @de
label: Valorisation de biosimilaires @fr
label: Valuación de biosimilares @es
label: Valutaz biosimilari @it
label: Оценка биоаналогов @ru
label: 仿生估值 @zh
label: 生物學名藥評價 @zh-hant
label: 바이오시밀러 평가 @ko
label: ﾊﾞｲｵｼﾐﾗｰ評価 @ja
definition: This industry subgroup includes companies in the Bloomberg Industries Biosimilars Valuation Peers Index that either has established biosimilar products or biosimilar products in late-stage development.
notation: 15101310
valid from: 2014-08-08
valid till: 2020-10-03

Global Generics API
type: BicsLevel4SubIndustry
type: Classifier
type: Discontinued
type: NamedIndividual
is sub industry of: Generic Pharma
is contemporary version of: http://data.ga-group.nl/ics/bics/15101311
is version of: http://data.ga-group.nl/ics/bics/15101311
imported on: 2026-06-08T13:03:47.798Z
last refreshed on: 2026-06-08T13:03:47.798Z
source accessed on: 2019-12-03T20:05:01Z
source last accessed on: 2019-12-03T20:05:01Z
label: API Gx global @pt
label: API de genércos globales @es
label: Génériques mondiaux Ingrédient actif @fr
label: Globales Gx API @de
label: Gx globale API @it
label: Препараты-генерики - API @ru
label: 全球學名藥API @zh-hant
label: 全球非专利药 API @zh
label: 글로벌 제네릭 의약품 API @ko
label: ｸﾞﾛｰﾊﾞﾙ･ｼﾞｪﾈﾘｯｸ医薬品API @ja
definition: This industry subgroup includes companies in the Bloomberg Industries Global Generics API Valuation Peers Index that have sizable active pharmaceutical ingredient (API) sales.
notation: 15101311
valid from: 2014-08-08
valid till: 2020-10-03

Generic Pharma
type: BicsLevel3Industry
type: Classifier
type: NamedIndividual
is industry of: Biotech & Pharma
is anachronous version of: http://data.ga-group.nl/ics/bics/1610101211
is contemporary version of: http://data.ga-group.nl/ics/bics/151013
is replaced by: http://data.ga-group.nl/ics/bics/2020/1610101211
is version of: http://data.ga-group.nl/ics/bics/151013
is version of: http://data.ga-group.nl/ics/bics/1610101211
imported on: 2026-06-08T13:03:47.798Z
last refreshed on: 2026-06-08T13:03:47.798Z
source accessed on: 2019-12-03T20:05:01Z
source last accessed on: 2019-12-03T20:05:01Z
label: Fármaco genérico @es
label: Farma generici @it
label: Generische Pharma @de
label: Prod farmac genér @pt
label: Prod pharma génériques @fr
label: Типовые фармац. продукты @ru
label: 學名藥品 @zh-hant
label: 非专利药品 @zh
label: 제네릭 제약업 @ko
label: ｼﾞｪﾈﾘｯｸ医薬品 @ja
definition: This industry includes companies that specialize in manufacturing generic pharmaceuticals and their active ingredients. These companies manufacture off-patent drugs, which require no or little R&D or marketing. Some generic pharmaceutical companies dedicate resources to biosimilar drugs, in which case they will require R&D to commercialize the products and require some marketing spend.
notation: 151013
valid from: 2014-08-08
valid till: 2020-10-03

Biotech & Pharma
type: BicsLevel2IndustryGroup
type: Classifier
type: NamedIndividual
is industry group of: Health Care
is anachronous version of: http://data.ga-group.nl/ics/bics/161010
is contemporary version of: http://data.ga-group.nl/ics/bics/1510
is replaced by: http://data.ga-group.nl/ics/bics/2020/161010
is version of: http://data.ga-group.nl/ics/bics/1510
is version of: http://data.ga-group.nl/ics/bics/161010
imported on: 2026-06-08T13:03:47.798Z
last refreshed on: 2026-06-08T13:03:47.798Z
source accessed on: 2019-12-03T20:05:01Z
source last accessed on: 2019-12-03T20:05:01Z
label: Biotec y farmacéuticos @es
label: Biotech et pharma @fr
label: Biotech und Pharma @de
label: Biotecologia e farmácia @pt
label: Farmaci e biotech @it
label: Биотех. и фармацевт. @ru
label: 生技及製藥 @zh-hant
label: 生物科技和制药 @zh
label: 생명공학 및 제약 @ko
label: ﾊﾞｲｵﾃｸ及び医薬品 @ja
definition: This industry group includes companies that produce pharmaceutical drugs, generic drugs, over-the-counter drugs, biologic drugs, pharmaceutical ingredients, and provide contract manufacturing services. Typically, these products would have a primary application for humans and animals.
notation: 1510
valid from: 2014-08-08
valid till: 2020-10-03

Hospitals
type: BicsLevel4SubIndustry
type: Classifier
type: NamedIndividual
is sub industry of: Health Care Facilities
is anachronous version of: http://data.ga-group.nl/ics/bics/1610111010
is contemporary version of: http://data.ga-group.nl/ics/bics/15111010
is replaced by: http://data.ga-group.nl/ics/bics/2020/1610111010
is version of: http://data.ga-group.nl/ics/bics/15111010
is version of: http://data.ga-group.nl/ics/bics/1610111010
imported on: 2026-06-08T13:03:47.798Z
last refreshed on: 2026-06-08T13:03:47.798Z
source accessed on: 2019-12-03T20:05:01Z
source last accessed on: 2019-12-03T20:05:01Z
label: Hôpitaux @fr
label: Hospitais @pt
label: Hospitales @es
label: Kliniken @de
label: Ospedali @it
label: Больницы @ru
label: 医院 @zh
label: 病院 @ja
label: 醫院 @zh-hant
label: 병원 @ko
definition: This industry subgroup includes medical facilities that provide short and long term medical and diagnostic testing and treatments.
notation: 15111010
valid from: 2014-08-08
valid till: 2020-10-03

Continuing Care
type: BicsLevel5Segment
type: Classifier
type: NamedIndividual
is level5 segment of: Nursing & Residential Care
is anachronous version of: http://data.ga-group.nl/ics/bics/161011101110
is contemporary version of: http://data.ga-group.nl/ics/bics/1511101110
is replaced by: http://data.ga-group.nl/ics/bics/2020/161011101110
is version of: http://data.ga-group.nl/ics/bics/1511101110
is version of: http://data.ga-group.nl/ics/bics/161011101110
imported on: 2026-06-08T13:03:47.798Z
last refreshed on: 2026-06-08T13:03:47.798Z
source accessed on: 2019-12-03T20:05:01Z
source last accessed on: 2019-12-03T20:05:01Z
label: Cuidado intensivo @es
label: Cuidados intensivos @pt
label: Cura continua @it
label: Fortwährende Fürsorge @de
label: Soins pour personnes âgées @fr
label: Длительный уход @ru
label: 敬老医疗服务 @zh
label: 継続看護 @ja
label: 長期照護 @zh-hant
label: 지속적은퇴관리 @ko
definition: This segment includes companies that operate a type of a retirement community where the needs of aging care, such as assisted living and nursing home, are met in one place.
notation: 1511101110
valid from: 2014-08-08
valid till: 2020-10-03

LTAC & Skilled Nursing
type: BicsLevel5Segment
type: Classifier
type: NamedIndividual
is level5 segment of: Nursing & Residential Care
is anachronous version of: http://data.ga-group.nl/ics/bics/161011101111
is contemporary version of: http://data.ga-group.nl/ics/bics/1511101111
is replaced by: http://data.ga-group.nl/ics/bics/2020/161011101111
is version of: http://data.ga-group.nl/ics/bics/1511101111
is version of: http://data.ga-group.nl/ics/bics/161011101111
imported on: 2026-06-08T13:03:47.798Z
last refreshed on: 2026-06-08T13:03:47.798Z
source accessed on: 2019-12-03T20:05:01Z
source last accessed on: 2019-12-03T20:05:01Z
label: LTAC e enfermagem especializada @pt
label: LTAC e serv inferm qualificati @it
label: LTAC und ausgebildete Krankenpflege @de
label: LTAC y enfermeras especializadas @es
label: LTAC与专业护理 @zh
label: Nursing spécialisé et LTAC @fr
label: Д/с интенс. терапия и высококвалиф. уход @ru
label: 長期急性期医療･看護施設 @ja
label: 長期急性醫療及技術性護理 @zh-hant
label: 장기 급성환자치료 및 전문 간호 @ko
definition: This segment includes companies that provide nursing and rehabilitative services to inpatients. This is a place of residence for people who require constant nursing care and have significant deficiencies with activities of daily living. Residents include the elderly and younger adults with physical disabilities.
notation: 1511101111
valid from: 2014-08-08
valid till: 2020-10-03

Nursing & Residential Care
type: BicsLevel4SubIndustry
type: Classifier
type: NamedIndividual
is sub industry of: Health Care Facilities
is anachronous version of: http://data.ga-group.nl/ics/bics/1610111011
is contemporary version of: http://data.ga-group.nl/ics/bics/15111011
is replaced by: http://data.ga-group.nl/ics/bics/2020/1610111011
is version of: http://data.ga-group.nl/ics/bics/15111011
is version of: http://data.ga-group.nl/ics/bics/1610111011
imported on: 2026-06-08T13:03:47.798Z
last refreshed on: 2026-06-08T13:03:47.798Z
source accessed on: 2019-12-03T20:05:01Z
source last accessed on: 2019-12-03T20:05:01Z
label: Case di cura residenziali @it
label: Cuidado de enfermeras y asilos @es
label: Cuidados enfermagem e residenciais @pt
label: Pflege- & Heimbetreuung @de
label: Soins infirmiers et résidentiels @fr
label: Медицинский уход и попечение @ru
label: 护理及家庭看护 @zh
label: 護理及居家看護 @zh-hant
label: 長期医療系施設･居住施設 @ja
label: 간호 & 거주 요양 @ko
definition: This industry subgroup includes companies that provide nursing and residential care facilities. Such facilities include nursing care facilities, continuing care retirement communities, and homes for the elderly.
notation: 15111011
valid from: 2014-08-08
valid till: 2020-10-03

Psych & Substance Abuse Hosp
type: BicsLevel4SubIndustry
type: Classifier
type: NamedIndividual
is sub industry of: Health Care Facilities
is anachronous version of: http://data.ga-group.nl/ics/bics/1610111012
is contemporary version of: http://data.ga-group.nl/ics/bics/15111012
is replaced by: http://data.ga-group.nl/ics/bics/2020/1610111012
is version of: http://data.ga-group.nl/ics/bics/15111012
is version of: http://data.ga-group.nl/ics/bics/1610111012
imported on: 2026-06-08T13:03:47.798Z
last refreshed on: 2026-06-08T13:03:47.798Z
source accessed on: 2019-12-03T20:05:01Z
source last accessed on: 2019-12-03T20:05:01Z
label: Hôpit psychia/désintox @fr
label: Hosp psiq e clinícas de reabilitação @pt
label: Hospitales psiquiátricos y para la drogadicción @es
label: Osp psi e tossicodipendenza @it
label: Psych. Kliniken & Suchtzentren @de
label: Психиатр. и нарколог. больницы @ru
label: 精神病院与戒瘾院 @zh
label: 精神病院及勒戒醫院 @zh-hant
label: 精神科･薬物専門病院 @ja
label: 정신과 & 약물남용 병원 @ko
definition: This industry subgroup includes hospitals that provide psychiatric and substance abuse services to inpatients who suffer from mental illness or substance abuse.
notation: 15111012
valid from: 2014-08-08
valid till: 2020-10-03

Kidney Dialysis Centers
type: BicsLevel5Segment
type: Classifier
type: NamedIndividual
is level5 segment of: Specialty Facilities
is anachronous version of: http://data.ga-group.nl/ics/bics/161011101310
is contemporary version of: http://data.ga-group.nl/ics/bics/1511101310
is replaced by: http://data.ga-group.nl/ics/bics/2020/161011101310
is version of: http://data.ga-group.nl/ics/bics/1511101310
is version of: http://data.ga-group.nl/ics/bics/161011101310
imported on: 2026-06-08T13:03:47.798Z
last refreshed on: 2026-06-08T13:03:47.798Z
source accessed on: 2019-12-03T20:05:01Z
source last accessed on: 2019-12-03T20:05:01Z
label: Centre de dialyse rénale @fr
label: Centri per la dialisi @it
label: Centros de diálise @pt
label: Centros de diálisis @es
label: Dialysezentren @de
label: Центры диализного лечения почек @ru
label: 肾脏透析中心 @zh
label: 腎臓透析ｾﾝﾀｰ @ja
label: 腎透析中心 @zh-hant
label: 신장투석 센터 @ko
definition: This segment includes companies that provide outpatient kidney or renal dialysis services.
notation: 1511101310
valid from: 2014-08-08
valid till: 2020-10-03

Outpatient Care Centers
type: BicsLevel5Segment
type: Classifier
type: NamedIndividual
is level5 segment of: Specialty Facilities
is anachronous version of: http://data.ga-group.nl/ics/bics/161011101311
is contemporary version of: http://data.ga-group.nl/ics/bics/1511101311
is replaced by: http://data.ga-group.nl/ics/bics/2020/161011101311
is version of: http://data.ga-group.nl/ics/bics/1511101311
is version of: http://data.ga-group.nl/ics/bics/161011101311
imported on: 2026-06-08T13:03:47.798Z
last refreshed on: 2026-06-08T13:03:47.798Z
source accessed on: 2019-12-03T20:05:01Z
source last accessed on: 2019-12-03T20:05:01Z
label: Ambulante Pflegezentren @de
label: Centres de soins ambulatoires @fr
label: Centri ambulatori @it
label: Centros de cuidados ambulatoriais @pt
label: Centros de no hospitalizados @es
label: Центры амбулаторного лечения @ru
label: 外来患者診療施設 @ja
label: 門診醫療中心 @zh-hant
label: 门诊服务中心 @zh
label: 외래환자 진료센터 @ko
definition: This segment includes companies that provide general or specialized outpatient care services, such as pain therapy centers, sleep disorder centers and biofeedback centers.
notation: 1511101311
valid from: 2014-08-08
valid till: 2020-10-03

Rehabilitation Centers
type: BicsLevel5Segment
type: Classifier
type: NamedIndividual
is level5 segment of: Specialty Facilities
is anachronous version of: http://data.ga-group.nl/ics/bics/161011101312
is contemporary version of: http://data.ga-group.nl/ics/bics/1511101312
is replaced by: http://data.ga-group.nl/ics/bics/2020/161011101312
is version of: http://data.ga-group.nl/ics/bics/1511101312
is version of: http://data.ga-group.nl/ics/bics/161011101312
imported on: 2026-06-08T13:03:47.798Z
last refreshed on: 2026-06-08T13:03:47.798Z
source accessed on: 2019-12-03T20:05:01Z
source last accessed on: 2019-12-03T20:05:01Z
label: Centres de réadaptation @fr
label: Centri riabilitazione @it
label: Centros de reabilitação @pt
label: Centros de rehabilitación @es
label: Reha-Kliniken @de
label: Реабилитационные центры @ru
label: 康复中心 @zh
label: 復健中心 @zh-hant
label: 재활센터 @ko
label: ﾘﾊﾋﾞﾘｾﾝﾀｰ @ja
definition: This segment includes companies that provide specialty mental and physical rehabilitation services.
notation: 1511101312
valid from: 2014-08-08
valid till: 2020-10-03

Surgical & Emergency Centers
type: BicsLevel5Segment
type: Classifier
type: NamedIndividual
is level5 segment of: Specialty Facilities
is anachronous version of: http://data.ga-group.nl/ics/bics/161011101313
is contemporary version of: http://data.ga-group.nl/ics/bics/1511101313
is replaced by: http://data.ga-group.nl/ics/bics/2020/161011101313
is version of: http://data.ga-group.nl/ics/bics/1511101313
is version of: http://data.ga-group.nl/ics/bics/161011101313
imported on: 2026-06-08T13:03:47.798Z
last refreshed on: 2026-06-08T13:03:47.798Z
source accessed on: 2019-12-03T20:05:01Z
source last accessed on: 2019-12-03T20:05:01Z
label: Centre urgence chirurgical mob @fr
label: Centros de emergência e cirúrgicos @pt
label: Centros quirúrgicos y de emerg @es
label: Chirurgie- & Notfallzentren @de
label: Pronto soccorso ambulatorio @it
label: Хирургич. и экстренная помощь @ru
label: 手术与急诊中心 @zh
label: 独立系救急外科病院 @ja
label: 獨立流動外科及急診中心 @zh-hant
label: 수술응급의료센터 @ko
definition: This segment includes companies that provide emergency care and surgery services on an outpatient basis. Such services include cataract surgery.
notation: 1511101313
valid from: 2014-08-08
valid till: 2020-10-03

Specialty Facilities
type: BicsLevel4SubIndustry
type: Classifier
type: NamedIndividual
is sub industry of: Health Care Facilities
is anachronous version of: http://data.ga-group.nl/ics/bics/1610111013
is contemporary version of: http://data.ga-group.nl/ics/bics/15111013
is replaced by: http://data.ga-group.nl/ics/bics/2020/1610111013
is version of: http://data.ga-group.nl/ics/bics/15111013
is version of: http://data.ga-group.nl/ics/bics/1610111013
imported on: 2026-06-08T13:03:47.798Z
last refreshed on: 2026-06-08T13:03:47.798Z
source accessed on: 2019-12-03T20:05:01Z
source last accessed on: 2019-12-03T20:05:01Z
label: Aménagements spécialisés @fr
label: Instalações especializadas @pt
label: Instalaciones especializadas @es
label: Sonderfazilitäten @de
label: Strutture specialistiche @it
label: Специализированные помещения @ru
label: 专业设施 @zh
label: 專門設施 @zh-hant
label: 特殊施設 @ja
label: 전문시설 @ko
definition: This industry subgroup includes hospitals that provide diagnostic and medical treatment to inpatients with a specific type of disease. Such treatment includes long-term care to chronically ill or disabled patients.
notation: 15111013
valid from: 2014-08-08
valid till: 2020-10-03

Health Care Facilities
type: BicsLevel3Industry
type: Classifier
type: NamedIndividual
is industry of: Health Care Facilities & Svcs
is anachronous version of: http://data.ga-group.nl/ics/bics/16101110
is contemporary version of: http://data.ga-group.nl/ics/bics/151110
is replaced by: http://data.ga-group.nl/ics/bics/2020/16101110
is version of: http://data.ga-group.nl/ics/bics/151110
is version of: http://data.ga-group.nl/ics/bics/16101110
imported on: 2026-06-08T13:03:47.798Z
last refreshed on: 2026-06-08T13:03:47.798Z
source accessed on: 2019-12-03T20:05:01Z
source last accessed on: 2019-12-03T20:05:01Z
label: GesundWesen: Einrichtungen @de
label: Infrastruct médicales @fr
label: Instal cuid saúde @pt
label: Instal sanidad @es
label: Strutture sanitarie @it
label: Медиц. учреждения @ru
label: 卫生保健设施 @zh
label: 醫療保健設施 @zh-hant
label: 헬스케어 시설 @ko
label: ﾍﾙｽｹｱ施設 @ja
definition: This industry includes health care facilities that provide general medical treatment and surgery, psychiatric and substance abuse, nursing homes and specialty services to inpatients with a variety of medical conditions.
notation: 151110
valid from: 2014-08-08
valid till: 2020-10-03

Contract Research
type: BicsLevel4SubIndustry
type: Classifier
type: NamedIndividual
is sub industry of: Health Care Services
is anachronous version of: http://data.ga-group.nl/ics/bics/1610111110
is contemporary version of: http://data.ga-group.nl/ics/bics/15111110
is replaced by: http://data.ga-group.nl/ics/bics/2020/1610111110
is version of: http://data.ga-group.nl/ics/bics/15111110
is version of: http://data.ga-group.nl/ics/bics/1610111110
imported on: 2026-06-08T13:03:47.798Z
last refreshed on: 2026-06-08T13:03:47.798Z
source accessed on: 2019-12-03T20:05:01Z
source last accessed on: 2019-12-03T20:05:01Z
label: Contratto di ricerca @it
label: Estudios de contratos @es
label: Pesquisa por contrato @pt
label: Recherche sous contrat @fr
label: Vertragliche Research @de
label: Контрактные исследования @ru
label: 受託研究 @ja
label: 合同研究 @zh
label: 合約研究 @zh-hant
label: 위탁 리서치 @ko
definition: This industry subgroup includes service organizations that support the pharmaceutical and biotechnology industries by providing outsourced pharmaceutical research services.
notation: 15111110
valid from: 2014-08-08
valid till: 2020-10-03

Clinical Labs
type: BicsLevel5Segment
type: Classifier
type: NamedIndividual
is level5 segment of: Health Care Testing Services
is anachronous version of: http://data.ga-group.nl/ics/bics/161011111110
is contemporary version of: http://data.ga-group.nl/ics/bics/1511111110
is replaced by: http://data.ga-group.nl/ics/bics/2020/161011111110
is version of: http://data.ga-group.nl/ics/bics/1511111110
is version of: http://data.ga-group.nl/ics/bics/161011111110
imported on: 2026-06-08T13:03:47.798Z
last refreshed on: 2026-06-08T13:03:47.798Z
source accessed on: 2019-12-03T20:05:01Z
source last accessed on: 2019-12-03T20:05:01Z
label: Klinische Labore @de
label: Laboratoires clinique @fr
label: Laboratori clinici @it
label: Laboratorios clínicos @es
label: Labs clínicos @pt
label: Клинические лаборатории @ru
label: 临床实验室 @zh
label: 臨床實驗室 @zh-hant
label: 臨床検査室 @ja
label: 임상 실험실 @ko
definition: This segment includes medical laboratories that provide analytical or diagnostic services to a medical professional or to the patient on referral from a health care practitioner.
notation: 1511111110
valid from: 2014-08-08
valid till: 2020-10-03

Radiology & Diagnostic Imaging
type: BicsLevel5Segment
type: Classifier
type: NamedIndividual
is level5 segment of: Health Care Testing Services
is anachronous version of: http://data.ga-group.nl/ics/bics/161011111111
is contemporary version of: http://data.ga-group.nl/ics/bics/1511111111
is replaced by: http://data.ga-group.nl/ics/bics/2020/161011111111
is version of: http://data.ga-group.nl/ics/bics/1511111111
is version of: http://data.ga-group.nl/ics/bics/161011111111
imported on: 2026-06-08T13:03:47.798Z
last refreshed on: 2026-06-08T13:03:47.798Z
source accessed on: 2019-12-03T20:05:01Z
source last accessed on: 2019-12-03T20:05:01Z
label: Radiología y placas de diagnóstico @es
label: Radiologia e diagnóstico por imagem @pt
label: Radiologia e diagnostica immagini @it
label: Radiologie & diagnostische Bildgebung @de
label: Radiologie et imagerie diagnostique @fr
label: Радиолог. и диагност. визуализация @ru
label: 放射与影像诊断 @zh
label: 放射科及診斷影像 @zh-hant
label: 放射線･画像診断 @ja
label: 방사선학 & 진단영상 @ko
definition: This segment includes companies that provide diagnostic imaging services that produce images of a patient on referral from a health care practitioner. Such services include CAT scans, x-rays, mammograms, magnetic resonance imaging (MRIs), and ultrasound images.
notation: 1511111111
valid from: 2014-08-08
valid till: 2020-10-03

Health Care Testing Services
type: BicsLevel4SubIndustry
type: Classifier
type: NamedIndividual
is sub industry of: Health Care Services
is anachronous version of: http://data.ga-group.nl/ics/bics/1610111111
is contemporary version of: http://data.ga-group.nl/ics/bics/15111111
is replaced by: http://data.ga-group.nl/ics/bics/2020/1610111111
is version of: http://data.ga-group.nl/ics/bics/15111111
is version of: http://data.ga-group.nl/ics/bics/1610111111
imported on: 2026-06-08T13:03:47.798Z
last refreshed on: 2026-06-08T13:03:47.798Z
source accessed on: 2019-12-03T20:05:01Z
source last accessed on: 2019-12-03T20:05:01Z
label: Serviços de teste de saúde @pt
label: Services de tests médicaux @fr
label: Servicios de exámenes médicos @es
label: Servizi di test sanitari @it
label: Untersuchungsdienste im Gesundheitswesen @de
label: Услуги медицинского тестирования @ru
label: 医疗检测服务 @zh
label: 醫療保健檢測服務 @zh-hant
label: 헬스케어 검진 서비스 @ko
label: ﾍﾙｽｹｱ試験ｻｰﾋﾞｽ @ja
definition: This industry subgroup includes companies that provide health care testing services, such as medical laboratories, diagnostic imaging centers, clinical trial services, and biotechnology research and development services.
notation: 15111111
valid from: 2014-08-08
valid till: 2020-10-03

Ambulance Services
type: BicsLevel5Segment
type: Classifier
type: NamedIndividual
is level5 segment of: Outpatient Health Services
is anachronous version of: http://data.ga-group.nl/ics/bics/161011111210
is contemporary version of: http://data.ga-group.nl/ics/bics/1511111210
is replaced by: http://data.ga-group.nl/ics/bics/2020/161011111210
is version of: http://data.ga-group.nl/ics/bics/1511111210
is version of: http://data.ga-group.nl/ics/bics/161011111210
imported on: 2026-06-08T13:03:47.798Z
last refreshed on: 2026-06-08T13:03:47.798Z
source accessed on: 2019-12-03T20:05:01Z
source last accessed on: 2019-12-03T20:05:01Z
label: Ambulante Dienste @de
label: Serviços de ambulância @pt
label: Services d'ambulance @fr
label: Servicios de ambulancia @es
label: Servizi di ambulanza @it
label: Услуги скорой помощи @ru
label: 救急車ｻｰﾋﾞｽ @ja
label: 救护车服务 @zh
label: 救護車服務 @zh-hant
label: 구급차 서비스 @ko
definition: This segment includes companies that provide patient transportation services by ground or air with medical care.
notation: 1511111210
valid from: 2014-08-08
valid till: 2020-10-03

Home Health Care Services
type: BicsLevel5Segment
type: Classifier
type: NamedIndividual
is level5 segment of: Outpatient Health Services
is anachronous version of: http://data.ga-group.nl/ics/bics/161011111211
is contemporary version of: http://data.ga-group.nl/ics/bics/1511111211
is replaced by: http://data.ga-group.nl/ics/bics/2020/161011111211
is version of: http://data.ga-group.nl/ics/bics/1511111211
is version of: http://data.ga-group.nl/ics/bics/161011111211
imported on: 2026-06-08T13:03:47.798Z
last refreshed on: 2026-06-08T13:03:47.798Z
source accessed on: 2019-12-03T20:05:01Z
source last accessed on: 2019-12-03T20:05:01Z
label: Hauskrankenpflegedienste @de
label: Serviços de cuidados de saúde em casa @pt
label: Services soins de santé à domicile @fr
label: Servicios de sanidad a domicilio @es
label: Servizi sanitari domiciliari @it
label: Услуги медицинской помощи на дому @ru
label: 在宅介護ｻｰﾋﾞｽ @ja
label: 家庭保健服务 @zh
label: 家庭保健服務 @zh-hant
label: 가정 헬스케어 서비스 @ko
definition: This segment includes companies that provide skilled nursing services in the home. Such services include visiting nurse and home nursing services.
notation: 1511111211
valid from: 2014-08-08
valid till: 2020-10-03

Misc. Ambulatory H/C Services
type: BicsLevel5Segment
type: Classifier
type: Discontinued
type: NamedIndividual
is level5 segment of: Outpatient Health Services
is contemporary version of: http://data.ga-group.nl/ics/bics/1511111212
is version of: http://data.ga-group.nl/ics/bics/1511111212
imported on: 2026-06-08T13:03:47.798Z
last refreshed on: 2026-06-08T13:03:47.798Z
source accessed on: 2019-12-03T20:05:01Z
source last accessed on: 2019-12-03T20:05:01Z
label: Serv soins ambulatoires divers @fr
label: Serviços H/C de ambulatório div @pt
label: Servizi ambulatoriali vari H/C @it
label: Sonstige Ambulante Gesundheitsdienste @de
label: Varios Servicios ambulatorios H/C @es
label: Различные амбул. мед. услуги @ru
label: その他診療所ﾍﾙｽｹｱｻｰﾋﾞｽ @ja
label: 其他流动医疗服务 @zh
label: 其他流動醫療保健服務 @zh-hant
label: 기타 이동식 보건서비스 @ko
definition: This segment includes companies that provide other ambulatory health care services, such as blood pressure screening centers, health screening centers, fitness evaluation centers, blood banks and organ and tissue banks, and stop-smoking clinics.
notation: 1511111212
valid from: 2014-08-08
valid till: 2020-10-03

Outpatient Health Services
type: BicsLevel4SubIndustry
type: Classifier
type: NamedIndividual
is sub industry of: Health Care Services
is anachronous version of: http://data.ga-group.nl/ics/bics/1610111112
is contemporary version of: http://data.ga-group.nl/ics/bics/15111112
is replaced by: http://data.ga-group.nl/ics/bics/2020/1610111112
is version of: http://data.ga-group.nl/ics/bics/15111112
is version of: http://data.ga-group.nl/ics/bics/1610111112
imported on: 2026-06-08T13:03:47.798Z
last refreshed on: 2026-06-08T13:03:47.798Z
source accessed on: 2019-12-03T20:05:01Z
source last accessed on: 2019-12-03T20:05:01Z
label: Ambulante Dienste im Gesundheitswesen @de
label: Serviços saúde ambulatorial @pt
label: Services de santé ambulatoires @fr
label: Servicios de no hospitalizados @es
label: Servizi ambulatori @it
label: Амбулаторные медицинс��ие услуги @ru
label: 外来患者診療ｻｰﾋﾞｽ @ja
label: 門診保健服務 @zh-hant
label: 门诊医疗服务 @zh
label: 외래환자 건강 서비스 @ko
definition: This industry subgroup includes companies that provide outpatient health care services. Such services are provided by various practitioners such as doctors and dentists, in outpatient health care facilities such as kidney dialysis centers, and by outpatient home nursing services.
notation: 15111112
valid from: 2014-08-08
valid till: 2020-10-03

Veterinary Services
type: BicsLevel4SubIndustry
type: Classifier
type: NamedIndividual
is sub industry of: Health Care Services
is anachronous version of: http://data.ga-group.nl/ics/bics/1610111113
is contemporary version of: http://data.ga-group.nl/ics/bics/15111113
is replaced by: http://data.ga-group.nl/ics/bics/2020/1610111113
is version of: http://data.ga-group.nl/ics/bics/15111113
is version of: http://data.ga-group.nl/ics/bics/1610111113
imported on: 2026-06-08T13:03:47.798Z
last refreshed on: 2026-06-08T13:03:47.798Z
source accessed on: 2019-12-03T20:05:01Z
source last accessed on: 2019-12-03T20:05:01Z
label: Serv veterinarios @es
label: Serviços veterinários @pt
label: Servizi veterinari @it
label: Srv vétérinaires @fr
label: Tierarzt @de
label: Ветеринарные услуги @ru
label: 兽医服务 @zh
label: 動物検疫ｻｰﾋﾞｽ業 @ja
label: 獸醫服務 @zh-hant
label: 수의 서비스 @ko
definition: This industry subgroup includes companies that provide veterinary services. Such companies include veterinarian offices, animal hospitals, veterinary laboratories, veterinary surgery services, and veterinary clinics.
notation: 15111113
valid from: 2014-08-08
valid till: 2020-10-03

Health Care Services
type: BicsLevel3Industry
type: Classifier
type: NamedIndividual
is industry of: Health Care Facilities & Svcs
is anachronous version of: http://data.ga-group.nl/ics/bics/16101111
is contemporary version of: http://data.ga-group.nl/ics/bics/151111
is replaced by: http://data.ga-group.nl/ics/bics/2020/16101111
is version of: http://data.ga-group.nl/ics/bics/151111
is version of: http://data.ga-group.nl/ics/bics/16101111
imported on: 2026-06-08T13:03:47.798Z
last refreshed on: 2026-06-08T13:03:47.798Z
source accessed on: 2019-12-03T20:05:01Z
source last accessed on: 2019-12-03T20:05:01Z
label: GesundWesen: Dienste @de
label: Serv cuidad saúde @pt
label: Services de santé @fr
label: Servizi sanitari @it
label: Servs de sanidad @es
label: Услуги здравоохран. @ru
label: 医疗保健服务 @zh
label: 醫療保健服務 @zh-hant
label: 헬스케어 서비스 @ko
label: ﾍﾙｽｹｱ･ｻｰﾋﾞｽ @ja
definition: This industry includes companies that provide health care services, such as nursing and residential care facilities, outpatient health care, veterinary, and health care testing services.
notation: 151111
valid from: 2014-08-08
valid till: 2020-10-03

Medical Equip Distribution
type: BicsLevel5Segment
type: Classifier
type: NamedIndividual
is level5 segment of: Health Care Distribution
is anachronous version of: http://data.ga-group.nl/ics/bics/161011121010
is contemporary version of: http://data.ga-group.nl/ics/bics/1511121010
is replaced by: http://data.ga-group.nl/ics/bics/2020/161011121010
is version of: http://data.ga-group.nl/ics/bics/1511121010
is version of: http://data.ga-group.nl/ics/bics/161011121010
imported on: 2026-06-08T13:03:47.798Z
last refreshed on: 2026-06-08T13:03:47.798Z
source accessed on: 2019-12-03T20:05:01Z
source last accessed on: 2019-12-03T20:05:01Z
label: Distrib matériel médical @fr
label: Distribución de equipo médico @es
label: Distribuição equip médicos @pt
label: Distribuzione app mediche @it
label: Vertrieb med. Ausrüstung @de
label: Распростр. мед. оборуд. @ru
label: 医疗设备分销 @zh
label: 医療機器販売 @ja
label: 醫療設備經銷 @zh-hant
label: 의료기기 유통 @ko
definition: This segment includes companies that wholesale and distribute professional medical equipment, instruments, and supplies. Products include surgical appliances, hospital beds, dentist equipment, laboratory equipment, hospital furniture, and wheelchairs.
notation: 1511121010
valid from: 2014-08-08
valid till: 2020-10-03

Medical Supp Distribution
type: BicsLevel5Segment
type: Classifier
type: NamedIndividual
is level5 segment of: Health Care Distribution
is anachronous version of: http://data.ga-group.nl/ics/bics/161011121011
is contemporary version of: http://data.ga-group.nl/ics/bics/1511121011
is replaced by: http://data.ga-group.nl/ics/bics/2020/161011121011
is version of: http://data.ga-group.nl/ics/bics/1511121011
is version of: http://data.ga-group.nl/ics/bics/161011121011
imported on: 2026-06-08T13:03:47.798Z
last refreshed on: 2026-06-08T13:03:47.798Z
source accessed on: 2019-12-03T20:05:01Z
source last accessed on: 2019-12-03T20:05:01Z
label: Distrib fournit médicales @fr
label: Distribución de provisiones médicas @es
label: Distribuição supr médicos @pt
label: Distribuzione forn mediche @it
label: Vertrieb med.Produkte @de
label: Распр. мед. вспомог. материалов @ru
label: 医疗用品分销 @zh
label: 医療用品販売 @ja
label: 醫療器材經銷 @zh-hant
label: 의료용품 유통 @ko
definition: This segment includes companies that distribute medical supplies to health care providers.
notation: 1511121011
valid from: 2014-08-08
valid till: 2020-10-03

Pharmaceutical Distribution
type: BicsLevel6Segment
type: Classifier
type: NamedIndividual
is level6 segment of: Pharma & Specialty Distribution
is anachronous version of: http://data.ga-group.nl/ics/bics/16101112101210
is contemporary version of: http://data.ga-group.nl/ics/bics/151112101210
is replaced by: http://data.ga-group.nl/ics/bics/2020/16101112101210
is version of: http://data.ga-group.nl/ics/bics/151112101210
is version of: http://data.ga-group.nl/ics/bics/16101112101210
imported on: 2026-06-08T13:03:47.798Z
last refreshed on: 2026-06-08T13:03:47.798Z
source accessed on: 2019-12-03T20:05:01Z
source last accessed on: 2019-12-03T20:05:01Z
label: Distribución farmacéutica @es
label: Distribuição de farmacêuticos @pt
label: Distribution pharma @fr
label: Distribuzione farmaci @it
label: Pharmazievertrieb @de
label: Распространение фармацев. товаров @ru
label: 制药配送 @zh
label: 医療品販売 @ja
label: 藥物經銷 @zh-hant
label: 제약 유통 @ko
definition: This segment includes companies that wholesale and distribute pharmaceutical drugs.
notation: 151112101210
valid from: 2014-08-08
valid till: 2020-10-03

Specialty Distribution
type: BicsLevel6Segment
type: Classifier
type: NamedIndividual
is level6 segment of: Pharma & Specialty Distribution
is anachronous version of: http://data.ga-group.nl/ics/bics/16101112101211
is contemporary version of: http://data.ga-group.nl/ics/bics/151112101211
is replaced by: http://data.ga-group.nl/ics/bics/2020/16101112101211
is version of: http://data.ga-group.nl/ics/bics/151112101211
is version of: http://data.ga-group.nl/ics/bics/16101112101211
imported on: 2026-06-08T13:03:47.798Z
last refreshed on: 2026-06-08T13:03:47.798Z
source accessed on: 2019-12-03T20:05:01Z
source last accessed on: 2019-12-03T20:05:01Z
label: Distribución especializada @es
label: Distribuição de especialidade @pt
label: Distribution spécialisée @fr
label: Distribuzione speciale @it
label: Sondervertrieb @de
label: Распространение специализ. товаров @ru
label: 專門品經銷 @zh-hant
label: 特殊品販売 @ja
label: 特殊药品配送 @zh
label: 전문 유통 @ko
definition: This segment includes companies that wholesale and distribute biological and medical products, herbs and botanical drugs.
notation: 151112101211
valid from: 2014-08-08
valid till: 2020-10-03

Pharma & Specialty Distribution
type: BicsLevel5Segment
type: Classifier
type: NamedIndividual
is level5 segment of: Health Care Distribution
is anachronous version of: http://data.ga-group.nl/ics/bics/161011121012
is contemporary version of: http://data.ga-group.nl/ics/bics/1511121012
is replaced by: http://data.ga-group.nl/ics/bics/2020/161011121012
is version of: http://data.ga-group.nl/ics/bics/1511121012
is version of: http://data.ga-group.nl/ics/bics/161011121012
imported on: 2026-06-08T13:03:47.798Z
last refreshed on: 2026-06-08T13:03:47.798Z
source accessed on: 2019-12-03T20:05:01Z
source last accessed on: 2019-12-03T20:05:01Z
label: Distrib prod pharma/spécialisés @fr
label: Distribución de medicinas y especializada @es
label: Distribuição de produtos farmacêuticos e especializados @pt
label: Distribuzione speciale e farmaci @it
label: Vertrieb Pharma/Spezial @de
label: Распр. фармац./спец. товаров @ru
label: 制药与特殊药品分销 @zh
label: 医薬品･特殊医薬品販売 @ja
label: 製藥/專門品經銷 @zh-hant
label: 제약 및 전문 유통 @ko
definition: This segment includes companies that wholesale and distribute pharmaceutical drugs, biological and medical products, herbs and botanical drugs.
notation: 1511121012
valid from: 2014-08-08
valid till: 2020-10-03

Health Care Distribution
type: BicsLevel4SubIndustry
type: Classifier
type: NamedIndividual
is sub industry of: Health Care Supply Chain
is anachronous version of: http://data.ga-group.nl/ics/bics/1610111210
is contemporary version of: http://data.ga-group.nl/ics/bics/15111210
is replaced by: http://data.ga-group.nl/ics/bics/2020/1610111210
is version of: http://data.ga-group.nl/ics/bics/15111210
is version of: http://data.ga-group.nl/ics/bics/1610111210
imported on: 2026-06-08T13:03:47.798Z
last refreshed on: 2026-06-08T13:03:47.798Z
source accessed on: 2019-12-03T20:05:01Z
source last accessed on: 2019-12-03T20:05:01Z
label: Distrib de cuidados com a saúde @pt
label: Distribución de sanidad @es
label: Distribution de soins de santé @fr
label: Distribuzione sanitaria @it
label: Vertrieb im Gesundheitswesen @de
label: Распространение товаров здравоохранения @ru
label: 保健分布 @zh
label: 醫療保健經銷 @zh-hant
label: 헬스케어 유통 @ko
label: ﾍﾙｽｹｱ用品販売 @ja
definition: This industry subgroup includes companies that distribute health care products to providers, retail outlets, or end consumers.
notation: 15111210
valid from: 2014-08-08
valid till: 2020-10-03

Pharmacy Benefits Mgmt (PBM)
type: BicsLevel4SubIndustry
type: Classifier
type: NamedIndividual
is sub industry of: Health Care Supply Chain
is anachronous version of: http://data.ga-group.nl/ics/bics/1610111211
is contemporary version of: http://data.ga-group.nl/ics/bics/15111211
is replaced by: http://data.ga-group.nl/ics/bics/2020/1610111211
is version of: http://data.ga-group.nl/ics/bics/15111211
is version of: http://data.ga-group.nl/ics/bics/1610111211
imported on: 2026-06-08T13:03:47.798Z
last refreshed on: 2026-06-08T13:03:47.798Z
source accessed on: 2019-12-03T20:05:01Z
source last accessed on: 2019-12-03T20:05:01Z
label: Gestão de Benefícios de Medicamentos (PBM) @pt
label: Gestión de beneficios de farmacia (PBM) @es
label: PBM @de
label: Страховка рецептов на лекарственные препараты @ru
definition: This industry subgroup includes companies that provide pharmacy benefit management (PBM) services. Such services include prescription drug benefit programs, retail network pharmacy management, retail drug card programs, home delivery pharmacy services, benefit design consultation, drug utilization review, and claims processing.
notation: 15111211
valid from: 2014-08-08
valid till: 2020-10-03

Health Care Supply Chain
type: BicsLevel3Industry
type: Classifier
type: NamedIndividual
is industry of: Health Care Facilities & Svcs
is anachronous version of: http://data.ga-group.nl/ics/bics/16101112
is contemporary version of: http://data.ga-group.nl/ics/bics/151112
is replaced by: http://data.ga-group.nl/ics/bics/2020/16101112
is version of: http://data.ga-group.nl/ics/bics/151112
is version of: http://data.ga-group.nl/ics/bics/16101112
imported on: 2026-06-08T13:03:47.798Z
last refreshed on: 2026-06-08T13:03:47.798Z
source accessed on: 2019-12-03T20:05:01Z
source last accessed on: 2019-12-03T20:05:01Z
label: Cadeia fornec cuid à saúde @pt
label: Cadena sum sanidad @es
label: Chaîne logistique santé @fr
label: GesundWesen: Lieferkette @de
label: Sanità catena di fornitura @it
label: Система снабжения здравоохран. @ru
label: 医疗供应链 @zh
label: 醫療保健供應鏈 @zh-hant
label: 헬스케어 공급망 @ko
label: ﾍﾙｽｹｱ･ｻﾌﾟﾗｲﾁｪｰﾝ @ja
definition: This industry includes companies that act as intermediaries between therapeutic or medical device and supply manufacturers and end consumers. Such companies act as intermediaries between product companies and facilities, retail outlets or health care consumers directly. They include retail and institutional pharmacies, pharmacy benefit managers, group purchasing organizations, drug and medical device and supplies distributors.
notation: 151112
valid from: 2014-08-08
valid till: 2020-10-03

Managed Care Behavior Mgmt
type: BicsLevel4SubIndustry
type: Classifier
type: Discontinued
type: NamedIndividual
is sub industry of: Managed Care
is contemporary version of: http://data.ga-group.nl/ics/bics/15111310
is version of: http://data.ga-group.nl/ics/bics/15111310
imported on: 2026-06-08T13:03:47.798Z
last refreshed on: 2026-06-08T13:03:47.798Z
source accessed on: 2019-12-03T20:05:01Z
source last accessed on: 2019-12-03T20:05:01Z
label: Controle de comportamento de saúde gerenciada @pt
label: Cure mediche gestione comportamentale @it
label: Managed-Care Benehmensleitung @de
label: Seguro médico gestionado de psiquiatría @es
label: Soins gérés Gestion des comportements @fr
label: Упр. мед. обслуж.-Управление поведением @ru
label: 管理医療 行動管理 @ja
label: 管理式医疗行为管理 @zh
label: 管理式照護行為管理 @zh-hant
label: 관리의료 행동관리 @ko
definition: This industry subgroup includes companies that provide managed health care services through a health maintenance organization (HMO) structure to members of behavior services coverage plans.
notation: 15111310
valid from: 2014-08-08
valid till: 2020-10-03

Managed Care Large Group
type: BicsLevel6Segment
type: Classifier
type: Discontinued
type: NamedIndividual
is level6 segment of: Managed Care Group Coverage
is contemporary version of: http://data.ga-group.nl/ics/bics/151113111010
is version of: http://data.ga-group.nl/ics/bics/151113111010
imported on: 2026-06-08T13:03:47.798Z
last refreshed on: 2026-06-08T13:03:47.798Z
source accessed on: 2019-12-03T20:05:01Z
source last accessed on: 2019-12-03T20:05:01Z
label: Cure mediche grandi gruppi @it
label: Grupo grande de sanidad gestionada @es
label: Grupo grande saúde gerenciada @pt
label: Managed Care Große Gruppe @de
label: Soins intégrés Grands groupes @fr
label: Упр. мед. обслуж. - Большая группа @ru
label: 管理医療 大ｸﾞﾙｰﾌﾟ @ja
label: 管理式医疗-大型集团 @zh
label: 管理式醫療-大群組 @zh-hant
label: 관리의료 대형 그룹 @ko
definition: This segment includes companies that provide managed health care services through a health maintenance organization (HMO) structure to employer-sponsored large groups.
notation: 151113111010
valid from: 2014-08-08
valid till: 2020-10-03

Managed Care Small Group
type: BicsLevel6Segment
type: Classifier
type: Discontinued
type: NamedIndividual
is level6 segment of: Managed Care Group Coverage
is contemporary version of: http://data.ga-group.nl/ics/bics/151113111011
is version of: http://data.ga-group.nl/ics/bics/151113111011
imported on: 2026-06-08T13:03:47.798Z
last refreshed on: 2026-06-08T13:03:47.798Z
source accessed on: 2019-12-03T20:05:01Z
source last accessed on: 2019-12-03T20:05:01Z
label: Cure mediche piccoli gruppi @it
label: Grupo peq saúde gerenciada @pt
label: Grupo pequeño de sanidad gestionada @es
label: Managed Care Kleine Gruppe @de
label: Soins intégrés Petits groupes @fr
label: Упр. мед. обслуж. - Небольшая группа @ru
label: 管理医療 小ｸﾞﾙｰﾌﾟ @ja
label: 管理式医疗-小型集团 @zh
label: 管理式醫療-小群組 @zh-hant
label: 관리의료 소형 그룹 @ko
definition: This segment includes companies that provide managed health care services through a health maintenance organization (HMO) structure to employer-sponsored small groups.
notation: 151113111011
valid from: 2014-08-08
valid till: 2020-10-03

Managed Care Group Coverage
type: BicsLevel5Segment
type: Classifier
type: Discontinued
type: NamedIndividual
is level5 segment of: Managed Care Comml Business
is contemporary version of: http://data.ga-group.nl/ics/bics/1511131110
is version of: http://data.ga-group.nl/ics/bics/1511131110
imported on: 2026-06-08T13:03:47.798Z
last refreshed on: 2026-06-08T13:03:47.798Z
source accessed on: 2019-12-03T20:05:01Z
source last accessed on: 2019-12-03T20:05:01Z
label: Cobertura de grupo de cuidados gerenciado @pt
label: Cobertura en grupo de seguro médico gestionado @es
label: Cure mediche copertura gruppi @it
label: Managed-Care Gruppendeckung @de
label: Упр. мед. обслуж.- Групповое страхование @ru
label: 管理医療ｸﾞﾙｰﾌﾟ契約 @ja
label: 管理式医疗团体 @zh
label: 管理式醫療群組涵蓋內容 @zh-hant
label: 관리의료 그룹 보상범위 @ko
definition: This segment includes companies that provide managed health care services through a health maintenance organization (HMO) structure to employer-sponsored groups.
notation: 1511131110
valid from: 2014-08-08
valid till: 2020-10-03

Managed Care Indiv Policies
type: BicsLevel5Segment
type: Classifier
type: Discontinued
type: NamedIndividual
is level5 segment of: Managed Care Comml Business
is contemporary version of: http://data.ga-group.nl/ics/bics/1511131111
is version of: http://data.ga-group.nl/ics/bics/1511131111
imported on: 2026-06-08T13:03:47.798Z
last refreshed on: 2026-06-08T13:03:47.798Z
source accessed on: 2019-12-03T20:05:01Z
source last accessed on: 2019-12-03T20:05:01Z
label: Cure mediche polizze individuali @it
label: Managed Care Einzelne Policen @de
label: Pólizas individuales de sanidad gestionada @es
label: Saúde gerenciada- Políticas individuais @pt
label: Soins intégrés Assurances individuelles @fr
label: Управляемое медицинское обслуживание - Индивидуальные полисы @ru
label: 管理医療-個人保険 @ja
label: 管理式医疗 个别政策 @zh
label: 管理式醫療-個別保單 @zh-hant
label: 관리의료 개인보험 @ko
definition: This segment includes companies that provide managed health care services through a health maintenance organization (HMO) structure to individuals.
notation: 1511131111
valid from: 2014-08-08
valid till: 2020-10-03

Mgd Care Admin Services Only
type: BicsLevel5Segment
type: Classifier
type: Discontinued
type: NamedIndividual
is level5 segment of: Managed Care Comml Business
is contemporary version of: http://data.ga-group.nl/ics/bics/1511131112
is version of: http://data.ga-group.nl/ics/bics/1511131112
imported on: 2026-06-08T13:03:47.798Z
last refreshed on: 2026-06-08T13:03:47.798Z
source accessed on: 2019-12-03T20:05:01Z
source last accessed on: 2019-12-03T20:05:01Z
label: Nur Dienstleistungen für Managed-Care-Admin. @de
label: Sólo servicios de seguro médico gestionado @es
label: Services admin soins gérés seulement @fr
label: Solo servizi amministr mgd care @it
label: Somente serviços administrativos de cuidados gerenciados @pt
label: Упр. мед. обслуж.-Только админ. услуги @ru
label: 管理医療 事務ｻｰﾋﾞｽのみ @ja
label: 管理式医疗管理服务 @zh
label: 限管理式照護行政服務 @zh-hant
label: 관리 의료 행정 서비스만 @ko
definition: This segment includes companies that provide administrative services only and network access for self-funding employers.
notation: 1511131112
valid from: 2014-08-08
valid till: 2020-10-03

Managed Care Comml Business
type: BicsLevel4SubIndustry
type: Classifier
type: NamedIndividual
is sub industry of: Managed Care
is anachronous version of: http://data.ga-group.nl/ics/bics/1610111310
is contemporary version of: http://data.ga-group.nl/ics/bics/15111311
is replaced by: http://data.ga-group.nl/ics/bics/2020/1610111310
is version of: http://data.ga-group.nl/ics/bics/15111311
is version of: http://data.ga-group.nl/ics/bics/1610111310
imported on: 2026-06-08T13:03:47.798Z
last refreshed on: 2026-06-08T13:03:47.798Z
source accessed on: 2019-12-03T20:05:01Z
source last accessed on: 2019-12-03T20:05:01Z
label: Imprese comm managed care @it
label: Managed-Care - gewerbl. Tätigk. @de
label: Negócio com de saúde gerenciada @pt
label: Negocio comercial de seguro médico gestionado @es
label: Soins intégrés - Entrep comm @fr
label: Предприним. в сфере управл. мед. обслуж. @ru
label: 管理医療 営利事業 @ja
label: 管理式医疗商业业务 @zh
label: 管理式醫療-商業業務 @zh-hant
label: 관리의료 상업용 사업 @ko
definition: This industry subgroup includes companies that provide managed health care services through a health maintenance organization (HMO) structure to commercial clients.
notation: 15111311
valid from: 2014-08-08
valid till: 2020-10-03

Managed Care Dental
type: BicsLevel4SubIndustry
type: Classifier
type: Discontinued
type: NamedIndividual
is sub industry of: Managed Care
is contemporary version of: http://data.ga-group.nl/ics/bics/15111312
is version of: http://data.ga-group.nl/ics/bics/15111312
imported on: 2026-06-08T13:03:47.798Z
last refreshed on: 2026-06-08T13:03:47.798Z
source accessed on: 2019-12-03T20:05:01Z
source last accessed on: 2019-12-03T20:05:01Z
label: Cure mediche dentali @it
label: Managed Care Zahnärztlich @de
label: Saúde gerenciada - Tratamento dentário @pt
label: Sanidad gestionada dental @es
label: Soins intégrés Dentaire @fr
label: Управляемое медицинское обслуживание - Стоматология @ru
label: 管理医療-歯科 @ja
label: 管理式医疗 牙科 @zh
label: 管理式醫療-牙科 @zh-hant
label: 관리의료 치과 @ko
definition: This industry subgroup includes companies that provide insurance coverage for various dental conditions through a health maintenance organization (HMO) structure.
notation: 15111312
valid from: 2014-08-08
valid till: 2020-10-03

Managed Care Disease Mgmt
type: BicsLevel4SubIndustry
type: Classifier
type: NamedIndividual
is sub industry of: Managed Care
is anachronous version of: http://data.ga-group.nl/ics/bics/1610111311
is contemporary version of: http://data.ga-group.nl/ics/bics/15111313
is replaced by: http://data.ga-group.nl/ics/bics/2020/1610111311
is version of: http://data.ga-group.nl/ics/bics/15111313
is version of: http://data.ga-group.nl/ics/bics/1610111311
imported on: 2026-06-08T13:03:47.798Z
last refreshed on: 2026-06-08T13:03:47.798Z
source accessed on: 2019-12-03T20:05:01Z
source last accessed on: 2019-12-03T20:05:01Z
label: Controle de enfermidades de saúde gerenciada @pt
label: Cure mediche gestione malattie @it
label: Managed-Care Krankheitsleitung @de
label: Seguro médico gestionado de enfermedades @es
label: Soins gérés Gestion des maladies @fr
label: Упр. мед. обслуж.-Управление болезнями @ru
label: 管理医療 疾病管理 @ja
label: 管理式医疗疾病管理 @zh
label: 管理式照護疾病管理 @zh-hant
label: 관리의료 질병관리 @ko
definition: This industry subgroup includes companies that provide disease management and wellness program services.
notation: 15111313
valid from: 2014-08-08
valid till: 2020-10-03

Managed Care Fed Employee
type: BicsLevel5Segment
type: Classifier
type: Discontinued
type: NamedIndividual
is level5 segment of: Managed Care Govt Business
is contemporary version of: http://data.ga-group.nl/ics/bics/1511131410
is version of: http://data.ga-group.nl/ics/bics/1511131410
imported on: 2026-06-08T13:03:47.798Z
last refreshed on: 2026-06-08T13:03:47.798Z
source accessed on: 2019-12-03T20:05:01Z
source last accessed on: 2019-12-03T20:05:01Z
label: Cure mediche impiegati federali @it
label: Managed Care Bundesangestellter @de
label: Saúde gerenciada-Func governo @pt
label: Sanidad gestionada de empleado federal @es
label: Soins intégrés Employés fédéraux @fr
label: Упр. мед. обслуживание - Госслужащий @ru
label: 管理医療 連邦政府公務員 @ja
label: 管理式医疗 联邦雇员 @zh
label: 管理式醫療-聯邦員工 @zh-hant
label: 관리의료 연방 직원 @ko
definition: This segment includes companies that provide managed health care services through a health maintenance organization (HMO) structure to participants in the Federal Employee Program.
notation: 1511131410
valid from: 2014-08-08
valid till: 2020-10-03

Managed Care Medicaid (XIX)
type: BicsLevel5Segment
type: Classifier
type: NamedIndividual
is level5 segment of: Managed Care Govt Business
is anachronous version of: http://data.ga-group.nl/ics/bics/161011131210
is contemporary version of: http://data.ga-group.nl/ics/bics/1511131411
is replaced by: http://data.ga-group.nl/ics/bics/2020/161011131210
is version of: http://data.ga-group.nl/ics/bics/1511131411
is version of: http://data.ga-group.nl/ics/bics/161011131210
imported on: 2026-06-08T13:03:47.798Z
last refreshed on: 2026-06-08T13:03:47.798Z
source accessed on: 2019-12-03T20:05:01Z
source last accessed on: 2019-12-03T20:05:01Z
label: Cure mediche Medicaid (Title XIX) @it
label: Managed Care Medicaid (Title XIX) @de
label: Medicaid gestionado (Title XIX) @es
label: Saúde gerenciada Medicaid (Título XIX) @pt
label: Soins intégrés Medicaid (Titre XIX) @fr
label: Упр. мед. обслуживание - Medicare (XIX) @ru
label: 管理医療 ﾒﾃﾞｨｹｲﾄﾞ(ﾀｲﾄﾙXIX) @ja
label: 管理醫療聯邦醫療保險(XIX章) @zh-hant
label: 관리의료 메디케이드(타이틀 XIX) @ko
definition: This segment includes companies that provide managed health care services through a health maintenance organization (HMO) structure to participants in the Medicaid program.
notation: 1511131411
valid from: 2014-08-08
valid till: 2020-10-03

Managed Care Medicare (XVIII)
type: BicsLevel6Segment
type: Classifier
type: Discontinued
type: NamedIndividual
is level6 segment of: Managed Care Medicare
is contemporary version of: http://data.ga-group.nl/ics/bics/151113141210
is version of: http://data.ga-group.nl/ics/bics/151113141210
imported on: 2026-06-08T13:03:47.798Z
last refreshed on: 2026-06-08T13:03:47.798Z
source accessed on: 2019-12-03T20:05:01Z
source last accessed on: 2019-12-03T20:05:01Z
label: Cure mediche Medicare (XVIII) @it
label: Managed Care - Medicare (XVIII) @de
label: Medicare de sanidad gestionada (XVIII) @es
label: Saúde gerenciada Medicare (XVIII) @pt
label: Soins intégrés - Medicare (XVIII) @fr
label: Управляемое мед. обслуж. - Medicare (XVIII) @ru
label: 管理医療ﾒﾃﾞｨｹｱ (XVIII) @ja
label: 管理式医疗保险(XVIII) @zh
label: 管理式醫療-聯邦醫療保險(XVIII) @zh-hant
label: 관리의료 메디케어 (XVIII) @ko
definition: This segment includes companies that provide managed health care services through the health maintenance organization (HMO) structure to participants in the Medicare program.
notation: 151113141210
valid from: 2014-08-08
valid till: 2020-10-03

Mgd Care Medicare Advantage
type: BicsLevel6Segment
type: Classifier
type: Discontinued
type: NamedIndividual
is level6 segment of: Managed Care Medicare
is contemporary version of: http://data.ga-group.nl/ics/bics/151113141211
is version of: http://data.ga-group.nl/ics/bics/151113141211
imported on: 2026-06-08T13:03:47.798Z
last refreshed on: 2026-06-08T13:03:47.798Z
source accessed on: 2019-12-03T20:05:01Z
source last accessed on: 2019-12-03T20:05:01Z
label: Managed-Care Medicare-Advantage @de
label: Medicare Advantage @es
label: Saúde gerenciada Medicare Advantage @pt
label: Soins gérés Medicare Advantage @fr
label: Vantaggi Medicare servizi amm @it
label: Упр. мед. обслуж.-Medicare Advantage @ru
label: 管理医療 ﾒﾃﾞｨｹｱ･ｱﾄﾞﾊﾞﾝﾃｰｼﾞ @ja
label: 管理式医疗医疗保险优先 @zh
label: 管理式照護醫療保險優勢 @zh-hant
label: 관리의료 메디케어 어드밴티지 @ko
definition: This segment includes companies that provide managed health care services through a health maintenance organization (HMO) structure to participants in Medicare Advantage Plans.
notation: 151113141211
valid from: 2014-08-08
valid till: 2020-10-03

Mgd Care Medicare Supplement
type: BicsLevel6Segment
type: Classifier
type: Discontinued
type: NamedIndividual
is level6 segment of: Managed Care Medicare
is contemporary version of: http://data.ga-group.nl/ics/bics/151113141212
is version of: http://data.ga-group.nl/ics/bics/151113141212
imported on: 2026-06-08T13:03:47.798Z
last refreshed on: 2026-06-08T13:03:47.798Z
source accessed on: 2019-12-03T20:05:01Z
source last accessed on: 2019-12-03T20:05:01Z
label: Cure mediche Medicare supplem @it
label: Managed Care Medicare-Ergänzung @de
label: Saúde gerenciada-Suplemento Medicare @pt
label: Soins intégrés Supplément Medicare @fr
label: Suplemento a Medicaid gestionado @es
label: Упр. мед. обслуж.-Medicare Supplement @ru
label: 管理医療 医療補助食品 @ja
label: 管理式医疗 补充医疗 @zh
label: 管理式醫療聯邦醫療保險-附加 @zh-hant
label: 관리의료 메디케어 보조보험 @ko
definition: This segment includes companies that provide managed health care services through a health maintenance organization (HMO) structure to participants in Medicare Supplement program.
notation: 151113141212
valid from: 2014-08-08
valid till: 2020-10-03

Cure mediche part D
type: BicsLevel6Segment
type: Classifier
type: Discontinued
type: NamedIndividual
is level6 segment of: Managed Care Medicare
is contemporary version of: http://data.ga-group.nl/ics/bics/151113141213
is version of: http://data.ga-group.nl/ics/bics/151113141213
imported on: 2026-06-08T13:03:47.798Z
last refreshed on: 2026-06-08T13:03:47.798Z
source accessed on: 2019-12-03T20:05:01Z
source last accessed on: 2019-12-03T20:05:01Z
label: Managed Care Part D
label: Saúde gerenc Parte D @pt
label: Sanidad gestionada parte D @es
label: Soins intégrés Section D @fr
label: Упр. мед. обслуживание - Part D @ru
label: 管理医療 ﾊﾟｰﾄD @ja
label: 管理式医疗-D部分 @zh
label: 管理式醫療D部分 @zh-hant
label: 관리의료 파트 D @ko
definition: This segment includes companies that provide managed health care services through a health maintenance organization (HMO) structure to participants in the Medicare Part D program.
notation: 151113141213
valid from: 2014-08-08
valid till: 2020-10-03

Managed Care Medicare
type: BicsLevel5Segment
type: Classifier
type: NamedIndividual
is level5 segment of: Managed Care Govt Business
is anachronous version of: http://data.ga-group.nl/ics/bics/161011131211
is contemporary version of: http://data.ga-group.nl/ics/bics/1511131412
is replaced by: http://data.ga-group.nl/ics/bics/2020/161011131211
is version of: http://data.ga-group.nl/ics/bics/1511131412
is version of: http://data.ga-group.nl/ics/bics/161011131211
imported on: 2026-06-08T13:03:47.798Z
last refreshed on: 2026-06-08T13:03:47.798Z
source accessed on: 2019-12-03T20:05:01Z
source last accessed on: 2019-12-03T20:05:01Z
label: Cure mediche Medicare @it
label: Managed-Care Medicare @de
label: Medicare @es
label: Saúde gerenciada Medicare @pt
label: Soins gérés Medicare @fr
label: Упр. мед. обслуж.-Medicare @ru
label: 管理医療 ﾒﾃﾞｨｹｱ @ja
label: 管理式医疗医疗保险 @zh
label: 管理式醫療聯邦醫療保險 @zh-hant
label: 관리의료 메디케어 @ko
definition: This segment includes companies that provide managed health care services through a health maintenance organization (HMO) structure to participants in all Medicare programs.
notation: 1511131412
valid from: 2014-08-08
valid till: 2020-10-03

Managed Care Military Svcs
type: BicsLevel5Segment
type: Classifier
type: Discontinued
type: NamedIndividual
is level5 segment of: Managed Care Govt Business
is contemporary version of: http://data.ga-group.nl/ics/bics/1511131413
is version of: http://data.ga-group.nl/ics/bics/1511131413
imported on: 2026-06-08T13:03:47.798Z
last refreshed on: 2026-06-08T13:03:47.798Z
source accessed on: 2019-12-03T20:05:01Z
source last accessed on: 2019-12-03T20:05:01Z
label: Managed-Care - Armeedienste @de
label: Serv militares de saúde gerenciada @pt
label: Serv militari managed care @it
label: Servicios gestionados médicos militares @es
label: Soins intégrés - Serv aux militaires @fr
label: Управляемое мед. обслуж.-воинская служба @ru
label: 管理医療 軍事 @ja
label: 管理式医疗军人服务 @zh
label: 管理式醫療-軍事服務 @zh-hant
label: 관리의료 군대서비스 @ko
definition: This segment includes companies that provide managed health care services through a health maintenance organization (HMO) structure to members of the military and their immediate families.
notation: 1511131413
valid from: 2014-08-08
valid till: 2020-10-03

Managed Care Govt Business
type: BicsLevel4SubIndustry
type: Classifier
type: NamedIndividual
is sub industry of: Managed Care
is anachronous version of: http://data.ga-group.nl/ics/bics/1610111312
is contemporary version of: http://data.ga-group.nl/ics/bics/15111314
is replaced by: http://data.ga-group.nl/ics/bics/2020/1610111312
is version of: http://data.ga-group.nl/ics/bics/15111314
is version of: http://data.ga-group.nl/ics/bics/1610111312
imported on: 2026-06-08T13:03:47.798Z
last refreshed on: 2026-06-08T13:03:47.798Z
source accessed on: 2019-12-03T20:05:01Z
source last accessed on: 2019-12-03T20:05:01Z
label: Cure mediche imprese governative @it
label: Managed Care Regierungsgeschäfte @de
label: Negócios do governo saúde gerenciada @pt
label: Paraestatal de sanidad gestionada @es
label: Soins intégrés Affaires gouvernementales @fr
label: Управляемое медицинское обслуживание - Гос. учреждения @ru
label: 管理医療-政府事業 @ja
label: 管理式医疗 政府事务 @zh
label: 管理式醫療-政府業務 @zh-hant
label: 관리의료 정부 사업 @ko
definition: This industry subgroup includes companies that provide managed health care services through a health maintenance organization (HMO) structure to participants of government programs.
notation: 15111314
valid from: 2014-08-08
valid till: 2020-10-03

Managed Care Vision
type: BicsLevel4SubIndustry
type: Classifier
type: Discontinued
type: NamedIndividual
is sub industry of: Managed Care
is contemporary version of: http://data.ga-group.nl/ics/bics/15111315
is version of: http://data.ga-group.nl/ics/bics/15111315
imported on: 2026-06-08T13:03:47.798Z
last refreshed on: 2026-06-08T13:03:47.798Z
source accessed on: 2019-12-03T20:05:01Z
source last accessed on: 2019-12-03T20:05:01Z
label: Cure mediche oculistica @it
label: Managed Care Augenärztlich @de
label: Saúde gerenciada- Tratamento óptico @pt
label: Sanidad gestionada de visión @es
label: Soins intégrés Vision @fr
label: Управляемое медицинское обслуживание - Офтальмология @ru
label: 管理医療-眼科 @ja
label: 管理式医疗 视力 @zh
label: 管理式醫療-視力 @zh-hant
label: 관리의료 안과 @ko
definition: This industry subgroup includes companies that provide insurance coverage plans for vision conditions through a health maintenance organization (HMO) structure.
notation: 15111315
valid from: 2014-08-08
valid till: 2020-10-03

Managed Care
type: BicsLevel3Industry
type: Classifier
type: NamedIndividual
is industry of: Health Care Facilities & Svcs
is anachronous version of: http://data.ga-group.nl/ics/bics/16101113
is contemporary version of: http://data.ga-group.nl/ics/bics/151113
is replaced by: http://data.ga-group.nl/ics/bics/2020/16101113
is version of: http://data.ga-group.nl/ics/bics/151113
is version of: http://data.ga-group.nl/ics/bics/16101113
imported on: 2026-06-08T13:03:47.798Z
last refreshed on: 2026-06-08T13:03:47.798Z
source accessed on: 2019-12-03T20:05:01Z
source last accessed on: 2019-12-03T20:05:01Z
label: Saúde gerenciada @pt
label: Sanidad gestionada @es
label: Soins intégrés @fr
label: Управл. медицина @ru
label: 管理医療 @ja
label: 管理式医疗 @zh
label: 管理式醫療 @zh-hant
label: 관리의료 @ko
definition: This industry includes companies that provide managed health care services through a health maintenance organization (HMO) structure and outpatient medical services by an HMO medical center.
notation: 151113
valid from: 2014-08-08
valid till: 2020-10-03

Health Care Facilities & Svcs
type: BicsLevel2IndustryGroup
type: Classifier
type: NamedIndividual
is industry group of: Health Care
is anachronous version of: http://data.ga-group.nl/ics/bics/161011
is contemporary version of: http://data.ga-group.nl/ics/bics/1511
is replaced by: http://data.ga-group.nl/ics/bics/2020/161011
is version of: http://data.ga-group.nl/ics/bics/1511
is version of: http://data.ga-group.nl/ics/bics/161011
imported on: 2026-06-08T13:03:47.798Z
last refreshed on: 2026-06-08T13:03:47.798Z
source accessed on: 2019-12-03T20:05:01Z
source last accessed on: 2019-12-03T20:05:01Z
label: Gesundheitseinrichtungen & -dienste @de
label: Instalações e serv cuidados saúde @pt
label: Instalaciones y servicios de sanidad @es
label: Installations et serv soins de santé @fr
label: Serv e strutture sanitarie @it
label: Мед. учреждения/услуги @ru
label: 医疗保健设施与服�� @zh
label: 醫療保健設施/服務 @zh-hant
label: 헬스케어 시설 & 서비스 @ko
label: ﾍﾙｽｹｱ施設･ｻｰﾋﾞｽ @ja
definition: This industry group includes companies in the health care services industry. Industries include health care facilities, health care services, health care supply chain and managed health care services such as health maintenance organizations (HMOs).
notation: 1511
valid from: 2014-08-08
valid till: 2020-10-03

Ophthalmic Goods
type: BicsLevel4SubIndustry
type: Classifier
type: NamedIndividual
is sub industry of: Health Care Supplies
is anachronous version of: http://data.ga-group.nl/ics/bics/1610121010
is contemporary version of: http://data.ga-group.nl/ics/bics/15121010
is replaced by: http://data.ga-group.nl/ics/bics/2020/1610121010
is version of: http://data.ga-group.nl/ics/bics/15121010
is version of: http://data.ga-group.nl/ics/bics/1610121010
imported on: 2026-06-08T13:03:47.798Z
last refreshed on: 2026-06-08T13:03:47.798Z
source accessed on: 2019-12-03T20:05:01Z
source last accessed on: 2019-12-03T20:05:01Z
label: Articles ophtalmiques @fr
label: Articoli oftalmici @it
label: Bens oftálmicos @pt
label: Bienes oftálmicos @es
label: Ophthalmische Produkte @de
label: Офтальмологич. продукция @ru
label: 眼科用品 @ja
label: 眼科用產品 @zh-hant
label: 안과용품 @ko
definition: This industry subgroup includes companies that manufacture ophthalmic goods, such as eyeglasses, contact lenses, sunglasses, eyeglass frames and protective eyewear.
notation: 15121010
valid from: 2014-08-08
valid till: 2020-10-03

Surgical Appliances & Supplies
type: BicsLevel4SubIndustry
type: Classifier
type: NamedIndividual
is sub industry of: Health Care Supplies
is anachronous version of: http://data.ga-group.nl/ics/bics/1610121011
is contemporary version of: http://data.ga-group.nl/ics/bics/15121011
is replaced by: http://data.ga-group.nl/ics/bics/2020/1610121011
is version of: http://data.ga-group.nl/ics/bics/15121011
is version of: http://data.ga-group.nl/ics/bics/1610121011
imported on: 2026-06-08T13:03:47.798Z
last refreshed on: 2026-06-08T13:03:47.798Z
source accessed on: 2019-12-03T20:05:01Z
source last accessed on: 2019-12-03T20:05:01Z
label: Aparatos y provisiones de cirugía @es
label: Aparelhos e materiais cirúrgicos @pt
label: Chirurgische Geräte & Bedarf @de
label: Forniture e apparecchi chirurgici @it
label: Fournitures et appareils chirurgicaux @fr
label: Хирургическая аппаратура и расходные материалы @ru
label: 外科器械与用品 @zh
label: 外科用器具及用品 @zh-hant
label: 外科用機器･外科用品 @ja
label: 수술장비 & 수술용품 @ko
definition: This industry subgroup includes companies that manufacture medical supplies. These are the supplies and products used or consumed in surgery, such as bandages, dressings, tape, sutures and syringes. Medical supplies typically are disposable, while devices and equipment usually are implanted or reusable (in the case of an instrument).
notation: 15121011
valid from: 2014-08-08
valid till: 2020-10-03

Health Care Supplies
type: BicsLevel3Industry
type: Classifier
type: NamedIndividual
is industry of: Medical Equipment & Devices
is anachronous version of: http://data.ga-group.nl/ics/bics/16101210
is contemporary version of: http://data.ga-group.nl/ics/bics/151210
is replaced by: http://data.ga-group.nl/ics/bics/2020/16101210
is version of: http://data.ga-group.nl/ics/bics/151210
is version of: http://data.ga-group.nl/ics/bics/16101210
imported on: 2026-06-08T13:03:47.798Z
last refreshed on: 2026-06-08T13:03:47.798Z
source accessed on: 2019-12-03T20:05:01Z
source last accessed on: 2019-12-03T20:05:01Z
label: Fournitures médicales @fr
label: Gesundheitsbedarf @de
label: Provisiones sanidad @es
label: Provvigioni sanità @it
label: Supr cuidad saúde @pt
label: Медикаменты @ru
label: 保健用品 @zh
label: 醫療保健用品 @zh-hant
label: 건강관리 공급 @ko
label: ﾍﾙｽｹｱ用品 @ja
definition: This industry includes companies that manufacture surgical appliances and supplies and ophthalmic goods, such as eyeglasses and contacts lenses.
notation: 151210
valid from: 2014-08-08
valid till: 2020-10-03

Analytical Lab Equipment
type: BicsLevel4SubIndustry
type: Classifier
type: NamedIndividual
is sub industry of: Life Science Equipment
is anachronous version of: http://data.ga-group.nl/ics/bics/1610121110
is contemporary version of: http://data.ga-group.nl/ics/bics/15121110
is replaced by: http://data.ga-group.nl/ics/bics/2020/1610121110
is version of: http://data.ga-group.nl/ics/bics/15121110
is version of: http://data.ga-group.nl/ics/bics/1610121110
imported on: 2026-06-08T13:03:47.798Z
last refreshed on: 2026-06-08T13:03:47.798Z
source accessed on: 2019-12-03T20:05:01Z
source last accessed on: 2019-12-03T20:05:01Z
label: Analytische Laborausrüstung @de
label: Equipaggiamenti analitici laboratorio @it
label: Equipamento de lab análitico @pt
label: Equipo de análisis de laboratorio @es
label: Matériel de laboratoires d'analyse @fr
label: Аналитическое оборудование для лабораторий @ru
label: 分析实验室设备 @zh
label: 分析用實驗設備 @zh-hant
label: 分析研究室設備 @ja
label: 분석실험기기 @ko
definition: This industry subgroup includes companies that manufacture analytical laboratory instruments used to analyze the chemical or physical composition of samples of materials.
notation: 15121110
valid from: 2014-08-08
valid till: 2020-10-03

In Vitro Diagnostics
type: BicsLevel4SubIndustry
type: Classifier
type: NamedIndividual
is sub industry of: Life Science Equipment
is anachronous version of: http://data.ga-group.nl/ics/bics/1610121111
is contemporary version of: http://data.ga-group.nl/ics/bics/15121111
is replaced by: http://data.ga-group.nl/ics/bics/2020/1610121111
is version of: http://data.ga-group.nl/ics/bics/15121111
is version of: http://data.ga-group.nl/ics/bics/1610121111
imported on: 2026-06-08T13:03:47.798Z
last refreshed on: 2026-06-08T13:03:47.798Z
source accessed on: 2019-12-03T20:05:01Z
source last accessed on: 2019-12-03T20:05:01Z
label: Diagnóstico in vitro @es
label: Diagnostica in vitro @it
label: Diagnostiques in vitro @fr
label: In-vitro-Diagnostik @de
label: Диагностика в лабораторных условиях @ru
label: 体外診断 @ja
label: 体外诊断 @zh
label: 體外診斷 @zh-hant
label: 체외 진료 @ko
definition: This industry subgroup includes companies that manufacture in-vitro (not internal) diagnostic substances. These substances are used for diagnostic tests that are performed in test tubes, petri dishes, and machines.
notation: 15121111
valid from: 2014-08-08
valid till: 2020-10-03

Life Science Equipment
type: BicsLevel3Industry
type: Classifier
type: NamedIndividual
is industry of: Medical Equipment & Devices
is anachronous version of: http://data.ga-group.nl/ics/bics/16101211
is contemporary version of: http://data.ga-group.nl/ics/bics/151211
is replaced by: http://data.ga-group.nl/ics/bics/2020/16101211
is version of: http://data.ga-group.nl/ics/bics/151211
is version of: http://data.ga-group.nl/ics/bics/16101211
imported on: 2026-06-08T13:03:47.798Z
last refreshed on: 2026-06-08T13:03:47.798Z
source accessed on: 2019-12-03T20:05:01Z
source last accessed on: 2019-12-03T20:05:01Z
label: Attrezzature scienze vita @it
label: Biowissenschaftlische Ausrüstung @de
label: Equip ciência vida @pt
label: Equipements pour sciences de la vie @fr
label: Equipo de biología @es
label: Биологич. оборудование @ru
label: 生命科学仪器 @zh
label: 生命科学設備 @ja
label: 生命科學設備 @zh-hant
label: 생명 과학 설비 @ko
definition: This industry includes companies that manufacture in-vitro (not internal) diagnostic substances. These substances are used for diagnostic tests that are performed in test tubes, petri dishes, and machines. This segment may also include companies that manufacture analytical laboratory instruments.
notation: 151211
valid from: 2014-08-08
valid till: 2020-10-03

CRT-D Devices
type: BicsLevel7Segment
type: Classifier
type: Discontinued
type: NamedIndividual
is level7 segment of: Cardiac Rhythm Management
is contemporary version of: http://data.ga-group.nl/ics/bics/15121210101010
is version of: http://data.ga-group.nl/ics/bics/15121210101010
imported on: 2026-06-08T13:03:47.798Z
last refreshed on: 2026-06-08T13:03:47.798Z
source accessed on: 2019-12-03T20:05:01Z
source last accessed on: 2019-12-03T20:05:01Z
label: Apparati CRT-D @it
label: Appareils CRT-D @fr
label: CRT-D Dispositivos @es
label: CRT-D 设备 @zh
label: CRT-D 기기 @ko
label: CRT-D-Geräte @de
label: CRT-D機器 @ja
label: Dispositivos CTR-D @pt
label: Устройства CRT-D @ru
label: 心臟再同步治療法除顫器 @zh-hant
definition: This segment includes companies that manufacture cardiac resynchronization therapy with defibrillator devices (CRT-Ds). Such devices combine a standard implantable cardioverter-defibrillator (ICD) with a cardiac resynchronization therapy pacemaker (CRT-P) to treat CRT patients at high risk of sudden death from rapid heartbeats. The device is composed of two pieces: the can, which generates the electrical pulses, and the leads, which deliver the pulses to the heart. These devices are implanted under the skin near the heart with the leads placed in the chambers of the heart. An example of such a device is the Consulta CRT-D manufactured by Medtronic (MDT US).
notation: 15121210101010
valid from: 2014-08-08
valid till: 2020-10-03

CRT-P Devices
type: BicsLevel7Segment
type: Classifier
type: Discontinued
type: NamedIndividual
is level7 segment of: Cardiac Rhythm Management
is contemporary version of: http://data.ga-group.nl/ics/bics/15121210101011
is version of: http://data.ga-group.nl/ics/bics/15121210101011
imported on: 2026-06-08T13:03:47.798Z
last refreshed on: 2026-06-08T13:03:47.798Z
source accessed on: 2019-12-03T20:05:01Z
source last accessed on: 2019-12-03T20:05:01Z
label: Apparati CRT-P @it
label: Appareils CRT-P @fr
label: CRT-P Dispositivos @es
label: CRT-P 设备 @zh
label: CRT-P 기기 @ko
label: CRT-P-Geräte @de
label: CRT-P機器 @ja
label: Dispositivos CTR-P @pt
label: Устройства CRT-P @ru
label: 心臟再同步治療法心律節律器 @zh-hant
definition: This segment includes companies that manufacture cardiac resynchronization therapy with pacemaker devices (CRT-Ps). These devices use three leads (while normal pacemakers use just two) to treat patients with excessively slow heartbeats and stimulate the heartbeat when necessary. The devices are composed of two pieces: the can, which generates the electrical pulses, and the leads, which deliver the pulses to the heart. These devices are implanted under the skin near the heart with the leads placed in the chambers of the heart. An example of such a device is the Anthem CRT-P manufactured by St. Jude Medical (STJ US).
notation: 15121210101011
valid from: 2014-08-08
valid till: 2020-10-03

Implantable Cardiac Monitors
type: BicsLevel7Segment
type: Classifier
type: Discontinued
type: NamedIndividual
is level7 segment of: Cardiac Rhythm Management
is contemporary version of: http://data.ga-group.nl/ics/bics/15121210101012
is version of: http://data.ga-group.nl/ics/bics/15121210101012
imported on: 2026-06-08T13:03:47.798Z
last refreshed on: 2026-06-08T13:03:47.798Z
source accessed on: 2019-12-03T20:05:01Z
source last accessed on: 2019-12-03T20:05:01Z
label: Implantierbare Herzüberwachungsgeräte @de
label: Moniteurs cardiaques implantables @fr
label: Monitor protesi cardiache @it
label: Monitores cardíacos implantáveis @pt
label: Monitores cardiacos de implante @es
label: Имплантируемые сердечные мониторы @ru
label: 植入式心內監測系統 @zh-hant
label: 植込型除細動器ﾓﾆﾀｰ @ja
label: 移植心脏监视器 @zh
label: 이식형 심장모니터 @ko
definition: This segment includes companies that manufacture implantable cardiac monitors. Such devices are usually implanted under the skin in the upper chest and send data on the patient to their physicians if they experience symptoms such as irregular heartbeats (arrhythmias). An example device is the SJM Confirm manufactured by St. Jude Medical (STJ US).
notation: 15121210101012
valid from: 2014-08-08
valid till: 2020-10-03

ICD
type: BicsLevel7Segment
type: Classifier
type: Discontinued
type: NamedIndividual
is level7 segment of: Cardiac Rhythm Management
is contemporary version of: http://data.ga-group.nl/ics/bics/15121210101013
is version of: http://data.ga-group.nl/ics/bics/15121210101013
imported on: 2026-06-08T13:03:47.798Z
last refreshed on: 2026-06-08T13:03:47.798Z
source accessed on: 2019-12-03T20:05:01Z
source last accessed on: 2019-12-03T20:05:01Z
label: 植入性心臟整流去顫器 @zh-hant
definition: This segment includes companies that manufacture implantable cardioverter-defibrillators (ICDs). Such devices deliver high-energy shocks to the heart to correct rapid and sustained irregular heartbeats (called arrhythmias). These devices are composed of two pieces: the can, which generates the electrical pulses, and the leads, which deliver the pulses to the heart. These devices are implanted under the skin near the heart with the leads placed in the chambers of the heart. An example of such a device is the Fortify ICD manufactured by St. Jude Medical (STJ US).
notation: 15121210101013
valid from: 2014-08-08
valid till: 2020-10-03

Pacemakers
type: BicsLevel7Segment
type: Classifier
type: Discontinued
type: NamedIndividual
is level7 segment of: Cardiac Rhythm Management
is contemporary version of: http://data.ga-group.nl/ics/bics/15121210101014
is version of: http://data.ga-group.nl/ics/bics/15121210101014
imported on: 2026-06-08T13:03:47.798Z
last refreshed on: 2026-06-08T13:03:47.798Z
source accessed on: 2019-12-03T20:05:01Z
source last accessed on: 2019-12-03T20:05:01Z
label: Herzschrittmacher @de
label: Marcapasos @es
label: Marcapassos @pt
label: Stimulateurs cardiaques @fr
label: Кардиостимуляторы @ru
label: 節律器 @zh-hant
label: 起搏器 @zh
label: 심박조율기 @ko
label: ﾍﾟｰｽﾒｰｶｰ @ja
definition: This segment includes companies that manufacture pacemakers. These devices deliver electrical impulses to correct abnormally slow heart rhythms (arrhythmias). The device is composed of two pieces: the can, which generates the electrical pulses, and the leads which deliver the pulses to the heart. These devices are implanted under the skin near the heart with the leads placed in the chambers of the heart. Newer generations of pacemakers are considered MRI-safe. An example of such a device is the Revo pacemaker manufactured by Medtronic (MDT US).
notation: 15121210101014
valid from: 2014-08-08
valid till: 2020-10-03

Cardiac Rhythm Management
type: BicsLevel6Segment
type: Classifier
type: NamedIndividual
is level6 segment of: Electrophysiology Devices
is anachronous version of: http://data.ga-group.nl/ics/bics/16101212101010
is contemporary version of: http://data.ga-group.nl/ics/bics/151212101010
is replaced by: http://data.ga-group.nl/ics/bics/2020/16101212101010
is version of: http://data.ga-group.nl/ics/bics/151212101010
is version of: http://data.ga-group.nl/ics/bics/16101212101010
imported on: 2026-06-08T13:03:47.798Z
last refreshed on: 2026-06-08T13:03:47.798Z
source accessed on: 2019-12-03T20:05:01Z
source last accessed on: 2019-12-03T20:05:01Z
label: Contrôle du rythme cardiaque @fr
label: Gerenciamento de ritmo cardíaco @pt
label: Gestión de ritmo cardiaco @es
label: Gestione cardiologia @it
label: Herzrhythmus-Management @de
label: Система мер по управл. част. сердечных сокращений @ru
label: 心律動管理 @ja
label: 心律管理 @zh
label: 心律調節管理 @zh-hant
label: 심장박동관리 @ko
definition: This segment includes companies that manufacture cardiac rhythm management products that treat irregular heartbeats by generating electrical impulses to regulate the heartbeat. Such products include implantable cardioverter-defibrillators (ICDs), pacemakers, cardiac resynchronization therapy devices (CRT-Ds and CRT-Ps) and implantable cardiac monitors.
notation: 151212101010
valid from: 2014-08-08
valid till: 2020-10-03

Ventricular Assist Devices
type: BicsLevel6Segment
type: Classifier
type: NamedIndividual
is level6 segment of: Electrophysiology Devices
is anachronous version of: http://data.ga-group.nl/ics/bics/16101212101011
is contemporary version of: http://data.ga-group.nl/ics/bics/151212101011
is replaced by: http://data.ga-group.nl/ics/bics/2020/16101212101011
is version of: http://data.ga-group.nl/ics/bics/151212101011
is version of: http://data.ga-group.nl/ics/bics/16101212101011
imported on: 2026-06-08T13:03:47.798Z
last refreshed on: 2026-06-08T13:03:47.798Z
source accessed on: 2019-12-03T20:05:01Z
source last accessed on: 2019-12-03T20:05:01Z
label: Apparati assist ventricolare @it
label: Appareils de support ventriculaire @fr
label: Dispositivos auxiliar ventricular @pt
label: Dispositivos de asistencia ventricular @es
label: Ventrikulare Hilfsvorrichtungen @de
label: Вспоспомогательные желудочковые системы @ru
label: 心室補助装置 @ja
label: 心室輔助裝置 @zh-hant
label: 心室辅助装置 @zh
label: 심실보조장치 @ko
definition: This segment includes companies that manufacture ventricular assist devices (VADs). These devices are mechanical pump-type devices that are surgically implanted to function as the left ventricle of a failing heart. These devices are used in heart transplant candidates as a bridge to transplant until a heart transplant is available or as destination therapy, meaning permanent implantation. Examples include Thoratec's HeartMate II and HeartWare's HVAD.
notation: 151212101011
valid from: 2014-08-08
valid till: 2020-10-03

Electrophysiology Devices
type: BicsLevel5Segment
type: Classifier
type: NamedIndividual
is level5 segment of: Cardiovascular Devices
is anachronous version of: http://data.ga-group.nl/ics/bics/161012121010
is contemporary version of: http://data.ga-group.nl/ics/bics/1512121010
is replaced by: http://data.ga-group.nl/ics/bics/2020/161012121010
is version of: http://data.ga-group.nl/ics/bics/1512121010
is version of: http://data.ga-group.nl/ics/bics/161012121010
imported on: 2026-06-08T13:03:47.798Z
last refreshed on: 2026-06-08T13:03:47.798Z
source accessed on: 2019-12-03T20:05:01Z
source last accessed on: 2019-12-03T20:05:01Z
label: Aparelhos para eletrofisiologia @pt
label: Appareils d'électrophysiologie @fr
label: Dispositivi elettrofisiologici @it
label: Dispositivos de electrofisiología @es
label: Elektrophysiologische Geräte @de
label: Электрофизиологич. устройства @ru
label: 电生理设备 @zh
label: 電気生理検査装置 @ja
label: 電生理學器材 @zh-hant
label: 전기생리학 기기 @ko
definition: This segment includes companies that manufacture electrophysiology devices. These devices typically treat an arrhythmia of the heart (irregular beat) by generating electrical impulses to regulate the heartbeat and are often implanted in or near the patient's heart. This segment also includes companies that manufacture heart pumps and blood pumps that assist a failing heart, as well as replacement hearts. It also includes catheters to treat atrial fibrillation. Products include: pacemakers, implantable cardioverter-defibrillators (ICDs), ventricle assist devices (VADs), defibrillators, ablation catheters, and any other cardiovascular device that uses an electrical impulse that is not a heart monitor.
notation: 1512121010
valid from: 2014-08-08
valid till: 2020-10-03

Bare Metal Stents
type: BicsLevel6Segment
type: Classifier
type: Discontinued
type: NamedIndividual
is level6 segment of: Interventional Cardiology
is contemporary version of: http://data.ga-group.nl/ics/bics/151212101110
is version of: http://data.ga-group.nl/ics/bics/151212101110
imported on: 2026-06-08T13:03:47.798Z
last refreshed on: 2026-06-08T13:03:47.798Z
source accessed on: 2019-12-03T20:05:01Z
source last accessed on: 2019-12-03T20:05:01Z
label: Endopróteses metálicas @pt
label: Reine Metallstents @de
label: Stents metálicos descubiertos @es
label: Stents nus en métal @fr
label: Supporti venosi @it
label: Оголенные металлические стенты @ru
label: 地金ｽﾃﾝﾄ @ja
label: 金属裸支架 @zh
label: 金屬血管支架 @zh-hant
label: 금속 스텐트 @ko
definition: This segment includes companies that manufacture bare-metal stents. Such tiny metal devices are placed in previously blocked arteries to prevent them from becoming blocked again. An example is Medtronic's Integrity bare-metal stent.
notation: 151212101110
valid from: 2014-08-08
valid till: 2020-10-03

Diagnostic Catheters
type: BicsLevel6Segment
type: Classifier
type: Discontinued
type: NamedIndividual
is level6 segment of: Interventional Cardiology
is contemporary version of: http://data.ga-group.nl/ics/bics/151212101111
is version of: http://data.ga-group.nl/ics/bics/151212101111
imported on: 2026-06-08T13:03:47.798Z
last refreshed on: 2026-06-08T13:03:47.798Z
source accessed on: 2019-12-03T20:05:01Z
source last accessed on: 2019-12-03T20:05:01Z
label: Cáteres de diagnóstico @es
label: Cateteres de diagnósticos @pt
label: Cateteri @it
label: Cathéters de diagnostic @fr
label: Diagnostische Katheder @de
label: Диагностические катетеры @ru
label: 診断ｶﾃｰﾃﾙ @ja
label: 診斷導管 @zh-hant
label: 诊断导管 @zh
label: 진단 카테터 @ko
definition: This segment includes companies that manufacture diagnostic catheters. Such devices are used in coronary and peripheral vascular procedures, often to deliver contrast medium to selected sites in the vascular system. An example is the Infiniti catheter manufactured by Johnson & Johnson.
notation: 151212101111
valid from: 2014-08-08
valid till: 2020-10-03

Diagnostic Vascular Closures
type: BicsLevel6Segment
type: Classifier
type: Discontinued
type: NamedIndividual
is level6 segment of: Interventional Cardiology
is contemporary version of: http://data.ga-group.nl/ics/bics/151212101112
is version of: http://data.ga-group.nl/ics/bics/151212101112
imported on: 2026-06-08T13:03:47.798Z
last refreshed on: 2026-06-08T13:03:47.798Z
source accessed on: 2019-12-03T20:05:01Z
source last accessed on: 2019-12-03T20:05:01Z
label: Cierre vascular de diagnóstico @es
label: Diagnostic d'obstruction vasculaire @fr
label: Diagnostica chiusure vascolari @it
label: Diagnostische Gefäßverschlüsse @de
label: Fechamento vasculares de diagnóstico @pt
label: Диагностические сосудистые клипсы @ru
label: 血管閉鎖装置 @ja
label: 診斷血管閉合 @zh-hant
label: 诊断血管封合器 @zh
label: 진단 혈관 폐쇄 기구 @ko
definition: This segment includes companies that manufacture vascular closure devices. Such devices are used to close an artery after a surgery has been performed requiring the use of a catheter inserted into the artery under the skin. An example is the angioseal device manufactured by St. Jude Medical (STJ US).
notation: 151212101112
valid from: 2014-08-08
valid till: 2020-10-03

Drug Eluting Stents
type: BicsLevel6Segment
type: Classifier
type: Discontinued
type: NamedIndividual
is level6 segment of: Interventional Cardiology
is contemporary version of: http://data.ga-group.nl/ics/bics/151212101113
is version of: http://data.ga-group.nl/ics/bics/151212101113
imported on: 2026-06-08T13:03:47.798Z
last refreshed on: 2026-06-08T13:03:47.798Z
source accessed on: 2019-12-03T20:05:01Z
source last accessed on: 2019-12-03T20:05:01Z
label: Endopróteses revestidas com fármacos @pt
label: Endoprótesis liberadoras de fármacos @es
label: Medikamentenbeschichtete Stents @de
label: Stents à élution de médicaments @fr
label: Vene artificiali @it
label: Стенты с лекарственным покрытием @ru
label: 塗藥血管支架 @zh-hant
label: 药物洗脱支架 @zh
label: 薬剤溶出ｽﾃﾝﾄ @ja
label: 약물 용출성 스텐트 @ko
definition: This segment includes companies that manufacture drug-eluting stents. These devices are tiny steel or cobalt chromium devices, often covered with a polymer, that release a drug over time. They are placed in a previously blocked artery to prevent the artery from becoming blocked again. An example of such a device is the PROMUS Element stent manufactured by Boston Scientific. (BSX US).
notation: 151212101113
valid from: 2014-08-08
valid till: 2020-10-03

Embolic Protection Devices
type: BicsLevel6Segment
type: Classifier
type: Discontinued
type: NamedIndividual
is level6 segment of: Interventional Cardiology
is contemporary version of: http://data.ga-group.nl/ics/bics/151212101114
is version of: http://data.ga-group.nl/ics/bics/151212101114
imported on: 2026-06-08T13:03:47.798Z
last refreshed on: 2026-06-08T13:03:47.798Z
source accessed on: 2019-12-03T20:05:01Z
source last accessed on: 2019-12-03T20:05:01Z
label: Appar protezione embolica @it
label: Appareils de protection contre les embolies @fr
label: Dispositivos de proteção embólico @pt
label: Dispositivos de protección embólica @es
label: Embolieschutzvorrichtungen @de
label: Устройства противоэмболической защиты @ru
label: 塞栓保護装置 @ja
label: 栓塞保护器 @zh
label: 栓子保護裝置 @zh-hant
label: 색전방지기구 @ko
definition: This segment includes companies that manufacture embolic protection devices. Such devices are placed in the vessels to filter out floating debris in the blood that could cause a stroke. An example of such a device is the ev3 SpiderFX device manufactured by Covidien PLC (COV US).
notation: 151212101114
valid from: 2014-08-08
valid till: 2020-10-03

Guide-Wires
type: BicsLevel6Segment
type: Classifier
type: Discontinued
type: NamedIndividual
is level6 segment of: Interventional Cardiology
is contemporary version of: http://data.ga-group.nl/ics/bics/151212101115
is version of: http://data.ga-group.nl/ics/bics/151212101115
imported on: 2026-06-08T13:03:47.798Z
last refreshed on: 2026-06-08T13:03:47.798Z
source accessed on: 2019-12-03T20:05:01Z
source last accessed on: 2019-12-03T20:05:01Z
label: Führungsdraht @de
label: Fils de guidage @fr
label: Fios guias @pt
label: Guide @it
label: Sondas @es
label: Проволочные направители @ru
label: 导丝 @zh
label: 導引線 @zh-hant
label: 유도 철사 @ko
label: ｶﾞｲﾄﾞﾜｲﾔ @ja
definition: This segment includes companies that manufacture guide wires. These devices are used to facilitate placement of balloon catheters during angioplasty procedures. An example of such a device is the Asahi Prowater guide wire manufactured by Abbott Labs (ABT US).
notation: 151212101115
valid from: 2014-08-08
valid till: 2020-10-03

Guiding Catheters
type: BicsLevel6Segment
type: Classifier
type: Discontinued
type: NamedIndividual
is level6 segment of: Interventional Cardiology
is contemporary version of: http://data.ga-group.nl/ics/bics/151212101116
is version of: http://data.ga-group.nl/ics/bics/151212101116
imported on: 2026-06-08T13:03:47.798Z
last refreshed on: 2026-06-08T13:03:47.798Z
source accessed on: 2019-12-03T20:05:01Z
source last accessed on: 2019-12-03T20:05:01Z
label: Catéter de sonda @es
label: Cateteres guias @pt
label: Cathéters de guidage @fr
label: Führungskatheder @de
label: Guide cateteri @it
label: Проводниковые катетеры @ru
label: 導引導管 @zh-hant
label: 指引导管 @zh
label: 유도 카테터 @ko
label: ｶﾞｲﾃﾞｨﾝｸﾞｶﾃｰﾃﾙ @ja
definition: This segment includes companies that manufacture guiding catheters. Such catheters help deliver interventional devices to the coronary and peripheral vascular systems. An example is the Vista Brite Tip manufactured by Johnson & Johnson (JNJ US).
notation: 151212101116
valid from: 2014-08-08
valid till: 2020-10-03

Introducer Sheaths
type: BicsLevel6Segment
type: Classifier
type: Discontinued
type: NamedIndividual
is level6 segment of: Interventional Cardiology
is contemporary version of: http://data.ga-group.nl/ics/bics/151212101117
is version of: http://data.ga-group.nl/ics/bics/151212101117
imported on: 2026-06-08T13:03:47.798Z
last refreshed on: 2026-06-08T13:03:47.798Z
source accessed on: 2019-12-03T20:05:01Z
source last accessed on: 2019-12-03T20:05:01Z
label: Bainhas introdutoras @pt
label: Einführungshülse @de
label: Gaines d'insertion @fr
label: Guaine introduttive @it
label: Vendajes internos @es
label: Стилеты-катетеры @ru
label: 中空型护套 @zh
label: 導管引導鞘 @zh-hant
label: 抹消血管装置 @ja
label: 삽입관 @ko
definition: This segment includes companies that manufacture introducer sheaths. Such devices allow access to arteries and allow insertion of other instruments to perform coronary angioplasty in the arteries. An example of such a device is the Pinnacle TIF Tip introducer manufactured by Terumo (4543 JP).
notation: 151212101117
valid from: 2014-08-08
valid till: 2020-10-03

IVUS Catheters
type: BicsLevel6Segment
type: Classifier
type: Discontinued
type: NamedIndividual
is level6 segment of: Interventional Cardiology
is contemporary version of: http://data.ga-group.nl/ics/bics/151212101118
is version of: http://data.ga-group.nl/ics/bics/151212101118
imported on: 2026-06-08T13:03:47.798Z
last refreshed on: 2026-06-08T13:03:47.798Z
source accessed on: 2019-12-03T20:05:01Z
source last accessed on: 2019-12-03T20:05:01Z
label: Catéteres IVUS @es
label: Cateteres JVUS @pt
label: Cateteri IVUS @it
label: Cathéters IVUS @fr
label: IVUS 导管 @zh
label: IVUS 카테터 @ko
label: IVUS-Katheder @de
label: IVUSｶﾃｰﾃﾙ @ja
label: Внутрисосудистые ультразвуковые катетеры @ru
label: 血管內超音波導管 @zh-hant
definition: This segment includes companies that manufacture intravascular ultrasound (IVUS) catheters. Such devices use ultrasound imaging to evaluate blocked arteries before and after stent placement. An example of such a device is the Eagle Eye Platinum catheter manufactured by Volcano Corporation (VOLC US).
notation: 151212101118
valid from: 2014-08-08
valid till: 2020-10-03

PTCA Balloons
type: BicsLevel6Segment
type: Classifier
type: Discontinued
type: NamedIndividual
is level6 segment of: Interventional Cardiology
is contemporary version of: http://data.ga-group.nl/ics/bics/151212101119
is version of: http://data.ga-group.nl/ics/bics/151212101119
imported on: 2026-06-08T13:03:47.798Z
last refreshed on: 2026-06-08T13:03:47.798Z
source accessed on: 2019-12-03T20:05:01Z
source last accessed on: 2019-12-03T20:05:01Z
label: Angioplastica @it
label: Balões PTCA @pt
label: Ballonnets PTCA @fr
label: PTCA Globos @es
label: PTCA 球囊 @zh
label: PTCA 벌룬 @ko
label: PTCA-Ballons @de
label: PTCAﾊﾞﾙｰﾝ @ja
label: Шары ЧТКА @ru
label: 冠狀動脈氣球導管 @zh-hant
definition: This segment includes companies that manufacture percutaneous transluminal coronary angioplasty (PTCA) balloons. These devices are used in angioplasty procedures (also called percutaneous coronary interventions, or PCIs) and are rapidly inflated and deflated to unblock arteries by pushing plaque up against the artery walls. An example is the Maverick balloon manufactured by Boston Scientific (BSX US).
notation: 151212101119
valid from: 2014-08-08
valid till: 2020-10-03

Interventional Cardiology
type: BicsLevel5Segment
type: Classifier
type: NamedIndividual
is level5 segment of: Cardiovascular Devices
is anachronous version of: http://data.ga-group.nl/ics/bics/161012121011
is contemporary version of: http://data.ga-group.nl/ics/bics/1512121011
is replaced by: http://data.ga-group.nl/ics/bics/2020/161012121011
is version of: http://data.ga-group.nl/ics/bics/1512121011
is version of: http://data.ga-group.nl/ics/bics/161012121011
imported on: 2026-06-08T13:03:47.798Z
last refreshed on: 2026-06-08T13:03:47.798Z
source accessed on: 2019-12-03T20:05:01Z
source last accessed on: 2019-12-03T20:05:01Z
label: Cardiologia interventiva @it
label: Cardiologie interventionnelle @fr
label: Cardología de intervención @es
label: Interventionelle Kardiologie @de
label: Хирургическая кардиология @ru
label: 介入心脏病学 @zh
label: 介入性心臓装置 @ja
label: 介入性心臟學 @zh-hant
label: 심혈관 중재시술 @ko
definition: This segment includes devices that do not generate an electrical pulse but are used in interventional cardiology procedures to repair heart damage and in peripheral vascular procedures to treat vascular diseases (especially blood vessels). Also included are devices used to treat endovascular diseases (such as abdominal aortic aneurysms) but not endoscopy. Products include coronary stents (drug-eluting and bare-metal), heart valves, coronary stent grafts, cardiac surgery devices, vascular closure devices, vascular plugs, IVUS catheters, atherectomy devices, and peripheral vascular and neurovascular stents and coils.
notation: 1512121011
valid from: 2014-08-08
valid till: 2020-10-03

Cardiovascular Devices
type: BicsLevel4SubIndustry
type: Classifier
type: NamedIndividual
is sub industry of: Medical Devices
is anachronous version of: http://data.ga-group.nl/ics/bics/1610121210
is contemporary version of: http://data.ga-group.nl/ics/bics/15121210
is replaced by: http://data.ga-group.nl/ics/bics/2020/1610121210
is version of: http://data.ga-group.nl/ics/bics/15121210
is version of: http://data.ga-group.nl/ics/bics/1610121210
imported on: 2026-06-08T13:03:47.798Z
last refreshed on: 2026-06-08T13:03:47.798Z
source accessed on: 2019-12-03T20:05:01Z
source last accessed on: 2019-12-03T20:05:01Z
label: Aparelhos cardiov @pt
label: Appareils cardiovasculaires @fr
label: Disp cardiov @es
label: Dispositivi cardiovascolari @it
label: Kardiovaskuläre Geräte @de
label: Кардиоваскулярное оборудование @ru
label: 心臓血管装置 @ja
label: 心血管器材 @zh-hant
label: 心血管设备 @zh
label: 심혈관 장치 @ko
definition: This industry subgroup includes companies that manufacture electromedical and interventional cardiovascular devices that use electrical impulses to stimulate action. Such devices include pacemakers, implantable cardioverter-defibrillators (ICDs), ventricle assist devices (VADs), defibrillators, drug-eluting stents, bare-metal stents, heart valves, coronary stent grafts, cardiac surgery products, and any other cardiovascular device that is not disposable and is not a heart monitor.
notation: 15121210
valid from: 2014-08-08
valid till: 2020-10-03

Neuromodulation Devices
type: BicsLevel4SubIndustry
type: Classifier
type: NamedIndividual
is sub industry of: Medical Devices
is anachronous version of: http://data.ga-group.nl/ics/bics/1610121211
is contemporary version of: http://data.ga-group.nl/ics/bics/15121211
is replaced by: http://data.ga-group.nl/ics/bics/2020/1610121211
is version of: http://data.ga-group.nl/ics/bics/15121211
is version of: http://data.ga-group.nl/ics/bics/1610121211
imported on: 2026-06-08T13:03:47.798Z
last refreshed on: 2026-06-08T13:03:47.798Z
source accessed on: 2019-12-03T20:05:01Z
source last accessed on: 2019-12-03T20:05:01Z
label: Apar neuromodul @pt
label: Dispositifs de neuromodulation @fr
label: Dispositivi neuromodulatori @it
label: Neuromodulación @es
label: Neuromodulare Geräte @de
label: Устройства нейромодуляции @ru
label: 神経変調療法装置 @ja
label: 神經協調器材 @zh-hant
label: 神经调节设备 @zh
label: 신경��절 장치 @ko
definition: This industry subgroup includes companies that manufacture neuromodulation devices. Neuromodulation can be split into two major categories: neurostimulation devices and implantable drug infusion systems. Neurostimulation devices are implantable devices that deliver an electrical current to block pain signals or stimulate neural impulses that were previously absent. Implantable drug infusion systems are implanted pumps that are able to administer much smaller doses of pharmacological agents with fewer side effects because of its direct application.
notation: 15121211
valid from: 2014-08-08
valid till: 2020-10-03

Dental Implants
type: BicsLevel6Segment
type: Classifier
type: NamedIndividual
is level6 segment of: Reconstructive Implants
is anachronous version of: http://data.ga-group.nl/ics/bics/16101212121010
is contemporary version of: http://data.ga-group.nl/ics/bics/151212121010
is replaced by: http://data.ga-group.nl/ics/bics/2020/16101212121010
is version of: http://data.ga-group.nl/ics/bics/151212121010
is version of: http://data.ga-group.nl/ics/bics/16101212121010
imported on: 2026-06-08T13:03:47.798Z
last refreshed on: 2026-06-08T13:03:47.798Z
source accessed on: 2019-12-03T20:05:01Z
source last accessed on: 2019-12-03T20:05:01Z
label: Implantes dentais @pt
label: Implantes dentales @es
label: Implants dentaires @fr
label: Protesi dentali @it
label: Zahnimplantate @de
label: Внутричелюстные зубные импланты @ru
label: 植牙 @zh-hant
label: 歯科ｲﾝﾌﾟﾗﾝﾄ @ja
label: 牙移植 @zh
label: 치아 임플란트 @ko
definition: This segment includes companies that manufacture reconstructive implants, such as screws and crowns, used to restore missing teeth. Dental implants also include products used to remediate jaw bone loss.
notation: 151212121010
valid from: 2014-08-08
valid till: 2020-10-03

Hip Implants
type: BicsLevel6Segment
type: Classifier
type: NamedIndividual
is level6 segment of: Reconstructive Implants
is anachronous version of: http://data.ga-group.nl/ics/bics/16101212121011
is contemporary version of: http://data.ga-group.nl/ics/bics/151212121011
is replaced by: http://data.ga-group.nl/ics/bics/2020/16101212121011
is version of: http://data.ga-group.nl/ics/bics/151212121011
is version of: http://data.ga-group.nl/ics/bics/16101212121011
imported on: 2026-06-08T13:03:47.798Z
last refreshed on: 2026-06-08T13:03:47.798Z
source accessed on: 2019-12-03T20:05:01Z
source last accessed on: 2019-12-03T20:05:01Z
label: Hüftimplantate @de
label: Implantes de quadril @pt
label: Implantes de cadera @es
label: Protesi bacino @it
label: Prothèses de la hanche @fr
label: Импланты бедренного сустава @ru
label: 臀部ｲﾝﾌﾟﾗﾝﾄ @ja
label: 髋移植 @zh
label: 髖關節移植 @zh-hant
label: 인공고관절 @ko
definition: This segment includes companies that manufacture reconstructive implants used in partial or full arthroplasties or resurfacings that restore normal hip function and mobility.
notation: 151212121011
valid from: 2014-08-08
valid till: 2020-10-03

Knee Implants
type: BicsLevel6Segment
type: Classifier
type: NamedIndividual
is level6 segment of: Reconstructive Implants
is anachronous version of: http://data.ga-group.nl/ics/bics/16101212121012
is contemporary version of: http://data.ga-group.nl/ics/bics/151212121012
is replaced by: http://data.ga-group.nl/ics/bics/2020/16101212121012
is version of: http://data.ga-group.nl/ics/bics/151212121012
is version of: http://data.ga-group.nl/ics/bics/16101212121012
imported on: 2026-06-08T13:03:47.798Z
last refreshed on: 2026-06-08T13:03:47.798Z
source accessed on: 2019-12-03T20:05:01Z
source last accessed on: 2019-12-03T20:05:01Z
label: Implantes de joelhos @pt
label: Implantes de rodilla @es
label: Knieimplantate @de
label: Protesi ginocchio @it
label: Prothèses du genou @fr
label: Импланты коленного сустава @ru
label: 人工膝関節ｲﾝﾌﾟﾗﾝﾄ @ja
label: 膝移植 @zh
label: 膝蓋移植 @zh-hant
label: 인공무릎관절 @ko
definition: This segment includes companies that manufacture reconstructive implants used in partial or full arthroplasties that restore normal knee function and mobility.
notation: 151212121012
valid from: 2014-08-08
valid till: 2020-10-03

Reconstructive Implants
type: BicsLevel5Segment
type: Classifier
type: NamedIndividual
is level5 segment of: Orthopedic Devices
is anachronous version of: http://data.ga-group.nl/ics/bics/161012121210
is contemporary version of: http://data.ga-group.nl/ics/bics/1512121210
is replaced by: http://data.ga-group.nl/ics/bics/2020/161012121210
is version of: http://data.ga-group.nl/ics/bics/1512121210
is version of: http://data.ga-group.nl/ics/bics/161012121210
imported on: 2026-06-08T13:03:47.798Z
last refreshed on: 2026-06-08T13:03:47.798Z
source accessed on: 2019-12-03T20:05:01Z
source last accessed on: 2019-12-03T20:05:01Z
label: Implantes de reconstrucción @es
label: Implantes reconstrutivos @pt
label: Implants de reconstruction @fr
label: Protesi ricostruttive @it
label: Rekonstruktive Implantate @de
label: Реконструктивные импланты @ru
label: 再建ｲﾝﾌﾟﾗﾝﾄ @ja
label: 重建植入 @zh
label: 重建移植 @zh-hant
label: 재건 임플란트 @ko
definition: This segment includes companies that manufacture all reconstructive implants and all other orthopedic devices unrelated to spinal disorders. This category includes major joints (hips, knees and shoulders), bone cement and dental devices.
notation: 1512121210
valid from: 2014-08-08
valid till: 2020-10-03

Spinal Devices
type: BicsLevel5Segment
type: Classifier
type: NamedIndividual
is level5 segment of: Orthopedic Devices
is anachronous version of: http://data.ga-group.nl/ics/bics/161012121211
is contemporary version of: http://data.ga-group.nl/ics/bics/1512121211
is replaced by: http://data.ga-group.nl/ics/bics/2020/161012121211
is version of: http://data.ga-group.nl/ics/bics/1512121211
is version of: http://data.ga-group.nl/ics/bics/161012121211
imported on: 2026-06-08T13:03:47.798Z
last refreshed on: 2026-06-08T13:03:47.798Z
source accessed on: 2019-12-03T20:05:01Z
source last accessed on: 2019-12-03T20:05:01Z
label: Aparelhos para coluna vertebral @pt
label: Appareils pour la colonne vertébrale @fr
label: Dispositivi vertrebrali @it
label: Dispositivos de columna @es
label: Spinalgeräte @de
label: Устройства для лечения заболеваний позвоночника @ru
label: 脊椎器材 @zh-hant
label: 脊椎设备 @zh
label: 脊髄装置 @ja
label: 척추 장치 @ko
definition: This segment includes companies that manufacture devices and their related biologics to treat spine-related disorders, such as back pain, degenerative disc disease, arthritis, spinal stenosis, and lumbar disc herniation. Products include Medtronic's Infuse bone graft and Prestige cervical disc; Synthes' ProDisc-L lumbar disc; Biomet's MaxAn cervical plate system, and Exactech's Procyon pedicle screw system.
notation: 1512121211
valid from: 2014-08-08
valid till: 2020-10-03

Orthopedic Devices
type: BicsLevel4SubIndustry
type: Classifier
type: NamedIndividual
is sub industry of: Medical Devices
is anachronous version of: http://data.ga-group.nl/ics/bics/1610121212
is contemporary version of: http://data.ga-group.nl/ics/bics/15121212
is replaced by: http://data.ga-group.nl/ics/bics/2020/1610121212
is version of: http://data.ga-group.nl/ics/bics/15121212
is version of: http://data.ga-group.nl/ics/bics/1610121212
imported on: 2026-06-08T13:03:47.798Z
last refreshed on: 2026-06-08T13:03:47.798Z
source accessed on: 2019-12-03T20:05:01Z
source last accessed on: 2019-12-03T20:05:01Z
label: Aparelhos ortopéd @pt
label: Appareils orthopédiques @fr
label: Dispositivi ortopedici @it
label: Orthopädische Geräte @de
label: Ortopédicos @es
label: Ортопедич. устройства @ru
label: 整形外科装置 @ja
label: 骨科器材 @zh-hant
label: 骨科设备 @zh
label: 정형외과 장치 @ko
definition: This industry subgroup includes companies that produce reconstructive and spinal devices that are used to repair lost joint function (orthopedic devices), spinal conditions (spinal implants), and damaged bones and tissue (bone cement and fixation devices such as screws, pins, plates, etc.). Products include hip and knee implants, spinal plates and screws, orthobiologics, bone cement and dental devices.
notation: 15121212
valid from: 2014-08-08
valid till: 2020-10-03

Medical Devices
type: BicsLevel3Industry
type: Classifier
type: NamedIndividual
is industry of: Medical Equipment & Devices
is anachronous version of: http://data.ga-group.nl/ics/bics/16101212
is contemporary version of: http://data.ga-group.nl/ics/bics/151212
is replaced by: http://data.ga-group.nl/ics/bics/2020/16101212
is version of: http://data.ga-group.nl/ics/bics/151212
is version of: http://data.ga-group.nl/ics/bics/16101212
imported on: 2026-06-08T13:03:47.798Z
last refreshed on: 2026-06-08T13:03:47.798Z
source accessed on: 2019-12-03T20:05:01Z
source last accessed on: 2019-12-03T20:05:01Z
label: Appareils médicaux @fr
label: Dispositivi medici @it
label: Dispositivos médicos @es
label: Medizinische Geräte @de
label: Медицинские устройства @ru
label: 医疗设备 @zh
label: 医療機器 @ja
label: 醫療器材 @zh-hant
label: 의료 기기 @ko
definition: This industry includes companies that design and manufacture medical devices. These products specifically include cardiovascular devices, neuromodulation devices and orthopedic reconstructive devices and implants.
notation: 151212
valid from: 2014-08-08
valid till: 2020-10-03

Cosmetic Surgical Equipment
type: BicsLevel4SubIndustry
type: Classifier
type: NamedIndividual
is sub industry of: Medical Equipment
is anachronous version of: http://data.ga-group.nl/ics/bics/1610121310
is contemporary version of: http://data.ga-group.nl/ics/bics/15121310
is replaced by: http://data.ga-group.nl/ics/bics/2020/1610121310
is version of: http://data.ga-group.nl/ics/bics/15121310
is version of: http://data.ga-group.nl/ics/bics/1610121310
imported on: 2026-06-08T13:03:47.798Z
last refreshed on: 2026-06-08T13:03:47.798Z
source accessed on: 2019-12-03T20:05:01Z
source last accessed on: 2019-12-03T20:05:01Z
label: Equipagg chirurgia cosmetica @it
label: Equipamento cirúrgia plástica @pt
label: Equipements de chirurgie esthétique @fr
label: Equipo de cirugía plástica @es
label: Kosmetische Chirurgieausrüstung @de
label: Оборудование пластической хирургии @ru
label: 整形手術設備 @ja
label: 美容外科设备 @zh
label: 美容整形外科設備 @zh-hant
label: 성형수술 기기 @ko
definition: This industry subgroup includes companies that manufacture surgical equipment and supplies used in cosmetic procedures. Such procedures include invasive and non-invasive procedures, such as liposuction, face lifts, Botox treatments, augmentation, and wrinkle reduction.
notation: 15121310
valid from: 2014-08-08
valid till: 2020-10-03

Dental Equipment
type: BicsLevel4SubIndustry
type: Classifier
type: NamedIndividual
is sub industry of: Medical Equipment
is anachronous version of: http://data.ga-group.nl/ics/bics/1610121311
is contemporary version of: http://data.ga-group.nl/ics/bics/15121311
is replaced by: http://data.ga-group.nl/ics/bics/2020/1610121311
is version of: http://data.ga-group.nl/ics/bics/15121311
is version of: http://data.ga-group.nl/ics/bics/1610121311
imported on: 2026-06-08T13:03:47.798Z
last refreshed on: 2026-06-08T13:03:47.798Z
source accessed on: 2019-12-03T20:05:01Z
source last accessed on: 2019-12-03T20:05:01Z
label: Apparecc dentali @it
label: Equipamento dentário @pt
label: Equipements dentaires @fr
label: Equipo dental @es
label: Zahnärztliche Ausrüstung @de
label: Стоматологическое оборудование @ru
label: 歯科設備 @ja
label: 牙科設備 @zh-hant
label: 牙科设备 @zh
label: 치과 장비 @ko
definition: This industry subgroup includes companies that manufacture dental equipment and supplies. Products include dental hand instruments, dental chairs and dental lighting.
notation: 15121311
valid from: 2014-08-08
valid till: 2020-10-03

Medication Monitor & Delivery
type: BicsLevel4SubIndustry
type: Classifier
type: NamedIndividual
is sub industry of: Medical Equipment
is anachronous version of: http://data.ga-group.nl/ics/bics/1610121312
is contemporary version of: http://data.ga-group.nl/ics/bics/15121312
is replaced by: http://data.ga-group.nl/ics/bics/2020/1610121312
is version of: http://data.ga-group.nl/ics/bics/15121312
is version of: http://data.ga-group.nl/ics/bics/1610121312
imported on: 2026-06-08T13:03:47.798Z
last refreshed on: 2026-06-08T13:03:47.798Z
source accessed on: 2019-12-03T20:05:01Z
source last accessed on: 2019-12-03T20:05:01Z
label: Administration et surveillance de médicaments @fr
label: Consegna e controllo farmaci @it
label: Medikamentierungsüberwachungs- & abgabegeräte @de
label: Monitor de medicamentos e entrega @pt
label: Monitoreo y entrega de medicamentos @es
label: Мониторинг и поставки медикаментов @ru
label: 医药监控与递送 @zh
label: 薬剤ﾓﾆﾀｰ･送達 @ja
label: 藥物管制與投藥 @zh-hant
label: 약물 모니터링 & 전달 @ko
definition: This industry subgroup includes companies that manufacture products used to deliver therapeutic dosages or monitor endocrine levels in the body.
notation: 15121312
valid from: 2014-08-08
valid till: 2020-10-03

Imaging Equipment
type: BicsLevel5Segment
type: Classifier
type: NamedIndividual
is level5 segment of: Radiation Equipment
is anachronous version of: http://data.ga-group.nl/ics/bics/161012131310
is contemporary version of: http://data.ga-group.nl/ics/bics/1512131310
is replaced by: http://data.ga-group.nl/ics/bics/2020/161012131310
is version of: http://data.ga-group.nl/ics/bics/1512131310
is version of: http://data.ga-group.nl/ics/bics/161012131310
imported on: 2026-06-08T13:03:47.798Z
last refreshed on: 2026-06-08T13:03:47.798Z
source accessed on: 2019-12-03T20:05:01Z
source last accessed on: 2019-12-03T20:05:01Z
label: Bildverarbeitungsausrüstung @de
label: Diagnost immagini @it
label: Equipamento de imagem @pt
label: Equipements d'imagerie @fr
label: Equipo de imagen @es
label: Оборудование для создания изображений @ru
label: 影像設備 @zh-hant
label: 成像设备 @zh
label: 映像機器 @ja
label: 영상 장비 @ko
definition: This segment includes companies that manufacture equipment used in diagnostic imaging. Products include x-ray, computed tomography imaging, ultrasound, tomography, and magnetic resonance imaging equipment.
notation: 1512131310
valid from: 2014-08-08
valid till: 2020-10-03

Radiation Therapy
type: BicsLevel5Segment
type: Classifier
type: NamedIndividual
is level5 segment of: Radiation Equipment
is anachronous version of: http://data.ga-group.nl/ics/bics/161012131311
is contemporary version of: http://data.ga-group.nl/ics/bics/1512131311
is replaced by: http://data.ga-group.nl/ics/bics/2020/161012131311
is version of: http://data.ga-group.nl/ics/bics/1512131311
is version of: http://data.ga-group.nl/ics/bics/161012131311
imported on: 2026-06-08T13:03:47.798Z
last refreshed on: 2026-06-08T13:03:47.798Z
source accessed on: 2019-12-03T20:05:01Z
source last accessed on: 2019-12-03T20:05:01Z
label: Strahlentherapiegeräte @de
label: Terapia de radiação @pt
label: Terapia de radiación @es
label: Terapia radioattiva @it
label: Thérapie par radiation @fr
label: Лучевое лечение @ru
label: 放射性治療 @zh-hant
label: 放射線治療 @ja
label: 辐射疗法 @zh
label: 방사선 치료 @ko
definition: This segment includes companies that manufacture equipment used to deliver a dose of radiation to control malignant cells as part of cancer treatment.
notation: 1512131311
valid from: 2014-08-08
valid till: 2020-10-03

Radiation Equipment
type: BicsLevel4SubIndustry
type: Classifier
type: NamedIndividual
is sub industry of: Medical Equipment
is anachronous version of: http://data.ga-group.nl/ics/bics/1610121313
is contemporary version of: http://data.ga-group.nl/ics/bics/15121313
is replaced by: http://data.ga-group.nl/ics/bics/2020/1610121313
is version of: http://data.ga-group.nl/ics/bics/15121313
is version of: http://data.ga-group.nl/ics/bics/1610121313
imported on: 2026-06-08T13:03:47.798Z
last refreshed on: 2026-06-08T13:03:47.798Z
source accessed on: 2019-12-03T20:05:01Z
source last accessed on: 2019-12-03T20:05:01Z
label: Equipagg Radiazioni @it
label: Equipamento radiação @pt
label: Equipements de radiation @fr
label: Equipo de radiación @es
label: Radiationsgeräte @de
label: Радиационное оборудование @ru
label: 放射線設備 @ja
label: 放射設備 @zh-hant
label: 辐射设备 @zh
label: ��사선 장비 @ko
definition: This industry subgroup includes companies that manufacture irradiation apparatus equipment and related supplies. Such equipment includes x-ray equipment devices.
notation: 15121313
valid from: 2014-08-08
valid till: 2020-10-03

Surgical & Medical Instruments
type: BicsLevel4SubIndustry
type: Classifier
type: NamedIndividual
is sub industry of: Medical Equipment
is anachronous version of: http://data.ga-group.nl/ics/bics/1610121314
is contemporary version of: http://data.ga-group.nl/ics/bics/15121314
is replaced by: http://data.ga-group.nl/ics/bics/2020/1610121314
is version of: http://data.ga-group.nl/ics/bics/15121314
is version of: http://data.ga-group.nl/ics/bics/1610121314
imported on: 2026-06-08T13:03:47.798Z
last refreshed on: 2026-06-08T13:03:47.798Z
source accessed on: 2019-12-03T20:05:01Z
source last accessed on: 2019-12-03T20:05:01Z
label: Chirurgische & medizinische Instrumente @de
label: Instrumentos de cirugía y médicos @es
label: Instrumentos médicos e cirúrgicos @pt
label: Instruments médicaux et chirurgicaux @fr
label: Strumenti medici e chirurgici @it
label: Хирургич. и мед. инструменты @ru
label: 外科及醫療器材 @zh-hant
label: 外科･医療用機器 @ja
label: 手术与医疗器械 @zh
label: 수술 & 의료기기 @ko
definition: This industry subgroup includes companies that manufacture any medical devices, instruments or equipment used in surgery or recovery that is not elsewhere classified. An example includes the da Vinci system manufactured by Intuitive Surgical (ISRG US).
notation: 15121314
valid from: 2014-08-08
valid till: 2020-10-03

Medical Equipment
type: BicsLevel3Industry
type: Classifier
type: NamedIndividual
is industry of: Medical Equipment & Devices
is anachronous version of: http://data.ga-group.nl/ics/bics/16101213
is contemporary version of: http://data.ga-group.nl/ics/bics/151213
is replaced by: http://data.ga-group.nl/ics/bics/2020/16101213
is version of: http://data.ga-group.nl/ics/bics/151213
is version of: http://data.ga-group.nl/ics/bics/16101213
imported on: 2026-06-08T13:03:47.798Z
last refreshed on: 2026-06-08T13:03:47.798Z
source accessed on: 2019-12-03T20:05:01Z
source last accessed on: 2019-12-03T20:05:01Z
label: Equipagg medici @it
label: Equipamento médico @pt
label: Equipements médicaux @fr
label: Equipo médico @es
label: Medizinische Geräte @de
label: Мед. оборудование @ru
label: 医疗设备 @zh
label: 医療設備 @ja
label: 醫療設備 @zh-hant
label: 의료장비 @ko
definition: This industry includes companies that manufacture health care equipment. Products include equipment for cosmetic surgery, radiation therapy and imaging, medication monitoring and delivery, and dental.
notation: 151213
valid from: 2014-08-08
valid till: 2020-10-03

Medical Equipment & Devices
type: BicsLevel2IndustryGroup
type: Classifier
type: NamedIndividual
is industry group of: Health Care
is anachronous version of: http://data.ga-group.nl/ics/bics/161012
is contemporary version of: http://data.ga-group.nl/ics/bics/1512
is replaced by: http://data.ga-group.nl/ics/bics/2020/161012
is version of: http://data.ga-group.nl/ics/bics/1512
is version of: http://data.ga-group.nl/ics/bics/161012
imported on: 2026-06-08T13:03:47.798Z
last refreshed on: 2026-06-08T13:03:47.798Z
source accessed on: 2019-12-03T20:05:01Z
source last accessed on: 2019-12-03T20:05:01Z
label: Aparelhos e equipamentos médicos @pt
label: Dispositivi e app mediche @it
label: Equipements et appareils médicaux @fr
label: Equipo y dispositivos médicos @es
label: Medizinische Ausrüstung & Geräte @de
label: Мед. оборуд./приборы @ru
label: 医疗设备与装置 @zh
label: 医療機器･装置 @ja
label: 醫療設備/裝置 @zh-hant
label: 의료 장비 & 기기 @ko
definition: This industry group includes companies that manufacture health care supplies, life science equipment, medical equipment and medical devices.
notation: 1512
valid from: 2014-08-08
valid till: 2020-10-03

Health Care
type: BicsLevel1Sector
type: Classifier
type: NamedIndividual
is anachronous version of: http://data.ga-group.nl/ics/bics/16
is contemporary version of: http://data.ga-group.nl/ics/bics/15
is replaced by: http://data.ga-group.nl/ics/bics/2020/16
is version of: http://data.ga-group.nl/ics/bics/15
is version of: http://data.ga-group.nl/ics/bics/16
imported on: 2026-06-08T13:03:47.798Z
last refreshed on: 2026-06-08T13:03:47.798Z
source accessed on: 2019-12-03T20:05:01Z
source last accessed on: 2019-12-03T20:05:01Z
label: Gesundheitswesen @de
label: Saúde @pt
label: Sanidad @es
label: Sanità @it
label: Santé @fr
label: Здравоохранение @ru
label: 保健 @zh
label: 醫療保健 @zh-hant
label: 건강관리 @ko
label: ﾍﾙｽｹｱ @ja
definition: This sector includes companies in the pharmaceuticals, biotechnology, healthcare products and healthcare services industry groups.
notation: 15
valid from: 2014-08-08
valid till: 2020-10-03

Large Fixed Wing Aircraft
type: BicsLevel5Segment
type: Classifier
type: Discontinued
type: NamedIndividual
is level5 segment of: Aircraft
is contemporary version of: http://data.ga-group.nl/ics/bics/1610101010
is version of: http://data.ga-group.nl/ics/bics/1610101010
imported on: 2026-06-08T13:03:47.798Z
last refreshed on: 2026-06-08T13:03:47.798Z
source accessed on: 2019-12-03T20:05:01Z
source last accessed on: 2019-12-03T20:05:01Z
label: Aerei grandi ala fissa @it
label: Aeronave de asa fixa grande @pt
label: Avión grande de ala fija @es
label: Grands avions à voilure fixe @fr
label: Großer Starrflügler @de
label: Крупные самолеты с крылом неизменяемой геометрии @ru
label: 大型固定翼機 @ja
label: 大型固定翼飞机 @zh
label: 大型定翼飛機 @zh-hant
label: 대형 고정익 항공기 @ko
definition: This segment includes companies that manufacture narrow body and larger aircraft, typically with 100 seats or more, with range of 2,000 nautical miles.
notation: 1610101010
valid from: 2014-08-08
valid till: 2020-10-03

Rotary Wing Aircraft
type: BicsLevel5Segment
type: Classifier
type: Discontinued
type: NamedIndividual
is level5 segment of: Aircraft
is contemporary version of: http://data.ga-group.nl/ics/bics/1610101011
is version of: http://data.ga-group.nl/ics/bics/1610101011
imported on: 2026-06-08T13:03:47.798Z
last refreshed on: 2026-06-08T13:03:47.798Z
source accessed on: 2019-12-03T20:05:01Z
source last accessed on: 2019-12-03T20:05:01Z
label: Aeromobili ad ala rotante @it
label: Aeronave de asa rotativa @pt
label: Avions à voilure tournante @fr
label: Drehflügler @de
label: Helicópteros @es
label: Винтокрылые летательные аппараты @ru
label: 回転翼航空機 @ja
label: 旋转翼飞机 @zh
label: 直升機 @zh-hant
label: 회전익 항공기 @ko
definition: This segment includes companies that manufacture helicopters of all ranges and types except military aircraft.
notation: 1610101011
valid from: 2014-08-08
valid till: 2020-10-03

Small Fixed Wing Aircraft
type: BicsLevel5Segment
type: Classifier
type: Discontinued
type: NamedIndividual
is level5 segment of: Aircraft
is contemporary version of: http://data.ga-group.nl/ics/bics/1610101012
is version of: http://data.ga-group.nl/ics/bics/1610101012
imported on: 2026-06-08T13:03:47.798Z
last refreshed on: 2026-06-08T13:03:47.798Z
source accessed on: 2019-12-03T20:05:01Z
source last accessed on: 2019-12-03T20:05:01Z
label: Aerei piccoli ale fissa @it
label: Aeronave de asa fixa pequena @pt
label: Avión pequeño de ala fija @es
label: Kleiner Starrflügler @de
label: Petits avions à voilure fixe @fr
label: Малые самолеты с крылом неизменяемой геометрии @ru
label: 小型固定翼機 @ja
label: 小型固定翼飞机 @zh
label: 小型定翼飛機 @zh-hant
label: 소형 고정익 항공기 @ko
definition: This segment includes companies that manufacture regional, business jet and general aviation aircraft, typically with less than 100 seats, with ranges less than 2,000 nautical miles.
notation: 1610101012
valid from: 2014-08-08
valid till: 2020-10-03

Aircraft
type: BicsLevel4SubIndustry
type: Classifier
type: NamedIndividual
is sub industry of: Aircraft & Parts
is anachronous version of: http://data.ga-group.nl/ics/bics/1710111010
is contemporary version of: http://data.ga-group.nl/ics/bics/16101010
is replaced by: http://data.ga-group.nl/ics/bics/2020/1710111010
is version of: http://data.ga-group.nl/ics/bics/16101010
is version of: http://data.ga-group.nl/ics/bics/1710111010
imported on: 2026-06-08T13:03:47.798Z
last refreshed on: 2026-06-08T13:03:47.798Z
source accessed on: 2019-12-03T20:05:01Z
source last accessed on: 2019-12-03T20:05:01Z
label: Aeromobili @it
label: Aeronave @pt
label: Aviones @es
label: Avions @fr
label: Flugzeuge @de
label: Воздуш. суда @ru
label: 航空機 @ja
label: 飛機 @zh-hant
label: 飞机 @zh
label: 항공기 @ko
definition: This industry subgroup includes companies that manufacture or assemble commercial aircraft and helicopters, including complete aircraft overhauls and rebuilding.
notation: 16101010
valid from: 2014-08-08
valid till: 2020-10-03

Aircraft Engines & Eng Parts
type: BicsLevel5Segment
type: Classifier
type: NamedIndividual
is level5 segment of: Aircraft Parts
is anachronous version of: http://data.ga-group.nl/ics/bics/171011101110
is contemporary version of: http://data.ga-group.nl/ics/bics/1610101110
is replaced by: http://data.ga-group.nl/ics/bics/2020/171011101110
is version of: http://data.ga-group.nl/ics/bics/1610101110
is version of: http://data.ga-group.nl/ics/bics/171011101110
imported on: 2026-06-08T13:03:47.798Z
last refreshed on: 2026-06-08T13:03:47.798Z
source accessed on: 2019-12-03T20:05:01Z
source last accessed on: 2019-12-03T20:05:01Z
label: Flugzeugmotoren & Motorteile @de
label: Moteurs d'avions et leurs pièces @fr
label: Motores e peças de aeronaves @pt
label: Motores y piezas de aviones @es
label: Motori e parti aeromobili @it
label: Авиац. двигат. и детали @ru
label: 航空機用原動機･部品 @ja
label: 飛機引擎及引擎零件 @zh-hant
label: 飞机发动机及发动机零部件 @zh
label: 항공기 엔진 & 엔진부품 @ko
definition: This segment includes companies that manufacture aircraft engines and aircraft engine parts. Companies that provide a major engine rebuilding or overhaul are also included in this segment.
notation: 1610101110
valid from: 2014-08-08
valid till: 2020-10-03

Aircraft Parts & Equipment
type: BicsLevel5Segment
type: Classifier
type: NamedIndividual
is level5 segment of: Aircraft Parts
is anachronous version of: http://data.ga-group.nl/ics/bics/171011101111
is contemporary version of: http://data.ga-group.nl/ics/bics/1610101111
is replaced by: http://data.ga-group.nl/ics/bics/2020/171011101111
is version of: http://data.ga-group.nl/ics/bics/1610101111
is version of: http://data.ga-group.nl/ics/bics/171011101111
imported on: 2026-06-08T13:03:47.798Z
last refreshed on: 2026-06-08T13:03:47.798Z
source accessed on: 2019-12-03T20:05:01Z
source last accessed on: 2019-12-03T20:05:01Z
label: Equipo y partes de aviones @es
label: Flugzeugteile & -ausrüstung @de
label: Peças e equipamentos para aeronaves @pt
label: Pièces et équipements pour avions @fr
label: Ricambi ed equipaggiamenti aeromobili @it
label: Детали/оборуд. для самолетов @ru
label: 航空機部品･装置 @ja
label: 飛機零件及設備 @zh-hant
label: 飞机零部件与设备 @zh
label: 항공기 부품 & 장비 @ko
definition: This segment includes companies that manufacture aircraft parts, such as wings, fuselage, airframes, tail assemblies and sub-assemblies.
notation: 1610101111
valid from: 2014-08-08
valid till: 2020-10-03

Aircraft Seats
type: BicsLevel5Segment
type: Classifier
type: Discontinued
type: NamedIndividual
is level5 segment of: Aircraft Parts
is contemporary version of: http://data.ga-group.nl/ics/bics/1610101112
is version of: http://data.ga-group.nl/ics/bics/1610101112
imported on: 2026-06-08T13:03:47.798Z
last refreshed on: 2026-06-08T13:03:47.798Z
source accessed on: 2019-12-03T20:05:01Z
source last accessed on: 2019-12-03T20:05:01Z
label: Asientos avión @es
label: Assentos para aeronaves @pt
label: Flugzeugsitze @de
label: Sedili aerei @it
label: Sièges d'avions @fr
label: Сиденья для самолетов @ru
label: 航空座椅 @zh
label: 航空機座席 @ja
label: 飛機座椅 @zh-hant
label: 항공기 좌석 @ko
definition: This segment includes companies that manufacture aircraft parts used for interior furnishing such as seats.
notation: 1610101112
valid from: 2014-08-08
valid till: 2020-10-03

Elec Aerospace & Defense Sys
type: BicsLevel5Segment
type: Classifier
type: NamedIndividual
is level5 segment of: Aircraft Parts
is anachronous version of: http://data.ga-group.nl/ics/bics/171011101112
is contemporary version of: http://data.ga-group.nl/ics/bics/1610101113
is replaced by: http://data.ga-group.nl/ics/bics/2020/171011101112
is version of: http://data.ga-group.nl/ics/bics/1610101113
is version of: http://data.ga-group.nl/ics/bics/171011101112
imported on: 2026-06-08T13:03:47.798Z
last refreshed on: 2026-06-08T13:03:47.798Z
source accessed on: 2019-12-03T20:05:01Z
source last accessed on: 2019-12-03T20:05:01Z
label: Elektr. Raumfahrts- & Verteidigungssysteme @de
label: Sist eletrônico e de defesa aeroespacial @pt
label: Sistema elect aeroesp, militar @es
label: Sistemi di difesa/aeronautica @it
label: Syst déf et aérospaciaux élect @fr
label: Электронные аэрокосмич. и оборонные системы @ru
label: 电子航空及防御系统 @zh
label: 航空宇宙･防衛用電子ｼｽﾃﾑ @ja
label: 電子航太及防禦系統 @zh-hant
label: 전자항공&방위시스템 @ko
definition: This segment includes companies that manufacture aerospace and defense electronics, radar systems, guidance systems and navigation systems.
notation: 1610101113
valid from: 2014-08-08
valid till: 2020-10-03

Aircraft Parts
type: BicsLevel4SubIndustry
type: Classifier
type: NamedIndividual
is sub industry of: Aircraft & Parts
is anachronous version of: http://data.ga-group.nl/ics/bics/1710111011
is contemporary version of: http://data.ga-group.nl/ics/bics/16101011
is replaced by: http://data.ga-group.nl/ics/bics/2020/1710111011
is version of: http://data.ga-group.nl/ics/bics/16101011
is version of: http://data.ga-group.nl/ics/bics/1710111011
imported on: 2026-06-08T13:03:47.798Z
last refreshed on: 2026-06-08T13:03:47.798Z
source accessed on: 2019-12-03T20:05:01Z
source last accessed on: 2019-12-03T20:05:01Z
label: Flugzeugteile @de
label: Partes de aviones @es
label: Peças para aeronaves @pt
label: Pièces d'avions @fr
label: Ricambi aeromobili @it
label: Детали самолетов @ru
label: 航空機部品 @ja
label: 飛機零件 @zh-hant
label: 飞机零部件 @zh
label: 항공기 부품 @ko
definition: This industry subgroup includes companies that manufacture aircraft engines, aircraft engine parts, aircraft seats and seat frames, and aircraft sub-assemblies, such as wings, fuselage, airframes and tails.
notation: 16101011
valid from: 2014-08-08
valid till: 2020-10-03

Aircraft & Parts
type: BicsLevel3Industry
type: Classifier
type: NamedIndividual
is industry of: Aerospace & Defense
is anachronous version of: http://data.ga-group.nl/ics/bics/17101110
is contemporary version of: http://data.ga-group.nl/ics/bics/161010
is replaced by: http://data.ga-group.nl/ics/bics/2020/17101110
is version of: http://data.ga-group.nl/ics/bics/161010
is version of: http://data.ga-group.nl/ics/bics/17101110
imported on: 2026-06-08T13:03:47.798Z
last refreshed on: 2026-06-08T13:03:47.798Z
source accessed on: 2019-12-03T20:05:01Z
source last accessed on: 2019-12-03T20:05:01Z
label: Aeromobili e ricambi @it
label: Aviões e peças @pt
label: Aviones y partes @es
label: Avions et pièces @fr
label: Flugzeugteile @de
label: Воздуш. суда и детали @ru
label: 航空機･部品 @ja
label: 飛機及零件 @zh-hant
label: 飞机与零部件 @zh
label: 항공기 & 부품 @ko
definition: This industry includes companies that manufacture aerospace parts and instruments. Products include aircraft engines and aircraft sub-assemblies, such as wings, fuselages, airframes and tails. Instruments include electronics, radar systems, guidance systems and navigation systems.
notation: 161010
valid from: 2014-08-08
valid till: 2020-10-03

Fighter Aircraft
type: BicsLevel5Segment
type: Classifier
type: Discontinued
type: NamedIndividual
is level5 segment of: Military Aircraft
is contemporary version of: http://data.ga-group.nl/ics/bics/1610111010
is version of: http://data.ga-group.nl/ics/bics/1610111010
imported on: 2026-06-08T13:03:47.798Z
last refreshed on: 2026-06-08T13:03:47.798Z
source accessed on: 2019-12-03T20:05:01Z
source last accessed on: 2019-12-03T20:05:01Z
label: Aereo da combattimento @it
label: Aviões de combate @pt
label: Avion de chasse @fr
label: Jet militar @es
label: Kampfflugzeuge @de
label: Истребители @ru
label: 战斗机 @zh
label: 戦闘機 @ja
label: 戰鬥機 @zh-hant
label: 전투기 @ko
definition: This segment includes companies that manufacture military aircraft that engage in combat with aerial and moving ground targets.
notation: 1610111010
valid from: 2014-08-08
valid till: 2020-10-03

Military Rotary Wing Aircraft
type: BicsLevel5Segment
type: Classifier
type: Discontinued
type: NamedIndividual
is level5 segment of: Military Aircraft
is contemporary version of: http://data.ga-group.nl/ics/bics/1610111011
is version of: http://data.ga-group.nl/ics/bics/1610111011
imported on: 2026-06-08T13:03:47.798Z
last refreshed on: 2026-06-08T13:03:47.798Z
source accessed on: 2019-12-03T20:05:01Z
source last accessed on: 2019-12-03T20:05:01Z
label: Aeromobili militari ad ala rotante @it
label: Aeronave de asa rotativa @pt
label: Avions militaires à voilure tournante @fr
label: Helicóptero militar @es
label: Militärische Drehflügler @de
label: Винтокр. летательные аппараты - военные @ru
label: 军事旋转翼飞机 @zh
label: 軍事用回転翼航空機 @ja
label: 軍用直升機 @zh-hant
label: 회전익항공기 @ko
definition: This segment includes companies that manufacture military helicopters.
notation: 1610111011
valid from: 2014-08-08
valid till: 2020-10-03

Military Transport Aircraft
type: BicsLevel5Segment
type: Classifier
type: Discontinued
type: NamedIndividual
is level5 segment of: Military Aircraft
is contemporary version of: http://data.ga-group.nl/ics/bics/1610111012
is version of: http://data.ga-group.nl/ics/bics/1610111012
imported on: 2026-06-08T13:03:47.798Z
last refreshed on: 2026-06-08T13:03:47.798Z
source accessed on: 2019-12-03T20:05:01Z
source last accessed on: 2019-12-03T20:05:01Z
label: Aeromobile trasporto militare @it
label: Avión militar de transporte @es
label: Aviões de transporte militar @pt
label: Avions de transport pour le militaire @fr
label: Militärische Transportflugzeuge @de
label: Транспортные самолеты-военные @ru
label: 军事运输机 @zh
label: 軍事用輸送機 @ja
label: 軍用運輸機 @zh-hant
label: 군용 수송기 @ko
definition: This segment includes companies that manufacture military aircraft that transport personnel and equipment.
notation: 1610111012
valid from: 2014-08-08
valid till: 2020-10-03

Other Military Aircraft
type: BicsLevel5Segment
type: Classifier
type: Discontinued
type: NamedIndividual
is level5 segment of: Military Aircraft
is contemporary version of: http://data.ga-group.nl/ics/bics/1610111013
is version of: http://data.ga-group.nl/ics/bics/1610111013
imported on: 2026-06-08T13:03:47.798Z
last refreshed on: 2026-06-08T13:03:47.798Z
source accessed on: 2019-12-03T20:05:01Z
source last accessed on: 2019-12-03T20:05:01Z
label: Altri aeromobili militari @it
label: Andere militärische Flugzeuge @de
label: Autres avions militaires @fr
label: Otros aviones militares @es
label: Outras aeronaves para uso militar @pt
label: Прочие летат. аппараты - военные @ru
label: その他軍用機 @ja
label: 其他军用飞机 @zh
label: 其他軍用飛機 @zh-hant
label: 기타 군용기 @ko
definition: This segment includes companies that manufacture all other types of military aircraft not elsewhere classified. Products include trainers and bombers that primarily target stationary ground targets.
notation: 1610111013
valid from: 2014-08-08
valid till: 2020-10-03

Military Aircraft
type: BicsLevel4SubIndustry
type: Classifier
type: NamedIndividual
is sub industry of: Defense Primes
is anachronous version of: http://data.ga-group.nl/ics/bics/1710111110
is contemporary version of: http://data.ga-group.nl/ics/bics/16101110
is replaced by: http://data.ga-group.nl/ics/bics/2020/1710111110
is version of: http://data.ga-group.nl/ics/bics/16101110
is version of: http://data.ga-group.nl/ics/bics/1710111110
imported on: 2026-06-08T13:03:47.798Z
last refreshed on: 2026-06-08T13:03:47.798Z
source accessed on: 2019-12-03T20:05:01Z
source last accessed on: 2019-12-03T20:05:01Z
label: Aeromobili militari @it
label: Aeronaves militares @pt
label: Avión militar @es
label: Avions militaires @fr
label: Militärflugzeuge @de
label: Ввоенно-воздушн. суда @ru
label: 军用飞机 @zh
label: 軍用機 @ja
label: 軍用飛機 @zh-hant
label: 군용항공기 @ko
definition: This industry subgroup includes companies that manufacture or assemble military aircraft and helicopters, including complete aircraft overhauls and rebuilding.
notation: 16101110
valid from: 2014-08-08
valid till: 2020-10-03

Military Armored Veh & Tanks
type: BicsLevel4SubIndustry
type: Classifier
type: NamedIndividual
is sub industry of: Defense Primes
is anachronous version of: http://data.ga-group.nl/ics/bics/1710111111
is contemporary version of: http://data.ga-group.nl/ics/bics/16101111
is replaced by: http://data.ga-group.nl/ics/bics/2020/1710111111
is version of: http://data.ga-group.nl/ics/bics/16101111
is version of: http://data.ga-group.nl/ics/bics/1710111111
imported on: 2026-06-08T13:03:47.798Z
last refreshed on: 2026-06-08T13:03:47.798Z
source accessed on: 2019-12-03T20:05:01Z
source last accessed on: 2019-12-03T20:05:01Z
label: Chars d'assaut et véhicules militaires blindés @fr
label: Gepanzerte Militärfahrzeuge & Panzer @de
label: Tanques y vehículos militar blindados @es
label: Veíc e tanques militares blindados @pt
label: Veicoli mil blindati e carri armati @it
label: Военные бронир. автомоб./танки @ru
label: 军用装甲车与坦克 @zh
label: 軍用裝甲車輛及坦克 @zh-hant
label: 軍装甲車･重装甲戦車 @ja
label: 군용장갑차 & 탱크 @ko
definition: This industry subgroup includes companies that manufacture military armored vehicles, tanks, self-propelled vehicles, and tank components.
notation: 16101111
valid from: 2014-08-08
valid till: 2020-10-03

Missile & Space Vehicles
type: BicsLevel4SubIndustry
type: Classifier
type: NamedIndividual
is sub industry of: Defense Primes
is anachronous version of: http://data.ga-group.nl/ics/bics/1710111112
is contemporary version of: http://data.ga-group.nl/ics/bics/16101112
is replaced by: http://data.ga-group.nl/ics/bics/2020/1710111112
is version of: http://data.ga-group.nl/ics/bics/16101112
is version of: http://data.ga-group.nl/ics/bics/1710111112
imported on: 2026-06-08T13:03:47.798Z
last refreshed on: 2026-06-08T13:03:47.798Z
source accessed on: 2019-12-03T20:05:01Z
source last accessed on: 2019-12-03T20:05:01Z
label: Misiles y vehículos aeroespaciales @es
label: Missiles et véhicules spatiaux @fr
label: Missili e veicoli spaziali @it
label: Raketen & Raumfahrzeuge @de
label: Veículos espaciais e mísseis @pt
label: Ракеты и космич. корабли @ru
label: 导弹与航天器 @zh
label: 導彈及太空器 @zh-hant
label: 미사일 & 우주선 @ko
label: ﾐｻｲﾙ･宇宙船 @ja
definition: This industry subgroup includes companies that manufacture guided missiles and space vehicles, guided missile and space vehicle engines, or guided missile or space vehicle parts and components.
notation: 16101112
valid from: 2014-08-08
valid till: 2020-10-03

Ammunition (excl Small Arms)
type: BicsLevel5Segment
type: Classifier
type: Discontinued
type: NamedIndividual
is level5 segment of: Munitions & Small Arms
is contemporary version of: http://data.ga-group.nl/ics/bics/1610111310
is version of: http://data.ga-group.nl/ics/bics/1610111310
imported on: 2026-06-08T13:03:47.798Z
last refreshed on: 2026-06-08T13:03:47.798Z
source accessed on: 2019-12-03T20:05:01Z
source last accessed on: 2019-12-03T20:05:01Z
label: Munições (exc armas de pequeno porte) @pt
label: Municiones (sin armas pequeñas) @es
label: Munition (exkl. Handfeuerwaffen) @de
label: Munitions (h armes légères) @fr
label: Munizioni (eccetto piccole armi) @it
label: Оружие, искл. мелкокалиберное оружие @ru
label: 弹药(除小型武器) @zh
label: 弾薬(除小火器) @ja
label: 彈藥(小型武器除外) @zh-hant
label: 탄약 (소형무기 제외) @ko
definition: This segment includes companies that manufacture ammunition, except small arms ammunition. Ammunition types include bombs, mines, grenades and torpedoes.
notation: 1610111310
valid from: 2014-08-08
valid till: 2020-10-03

Small Arms Ammunition
type: BicsLevel5Segment
type: Classifier
type: Discontinued
type: NamedIndividual
is level5 segment of: Munitions & Small Arms
is contemporary version of: http://data.ga-group.nl/ics/bics/1610111311
is version of: http://data.ga-group.nl/ics/bics/1610111311
imported on: 2026-06-08T13:03:47.798Z
last refreshed on: 2026-06-08T13:03:47.798Z
source accessed on: 2019-12-03T20:05:01Z
source last accessed on: 2019-12-03T20:05:01Z
label: Armas de pequeno porte @pt
label: Handfeuerwaffenmunition @de
label: Municiones de armas pequeñas @es
label: Munitions pour armes légères @fr
label: Munizioni piccole armi @it
label: Малокалиберн. стрелков. оружие @ru
label: 小型武器和弹药 @zh
label: 小型武裝彈藥 @zh-hant
label: 小火器用弾薬 @ja
label: 소형무기 탄약 @ko
definition: This segment includes companies that manufacture small arms ammunition.
notation: 1610111311
valid from: 2014-08-08
valid till: 2020-10-03

Small Arms
type: BicsLevel5Segment
type: Classifier
type: NamedIndividual
is level5 segment of: Munitions & Small Arms
is anachronous version of: http://data.ga-group.nl/ics/bics/1110141312
is contemporary version of: http://data.ga-group.nl/ics/bics/1610111312
is replaced by: http://data.ga-group.nl/ics/bics/2020/1110141312
is version of: http://data.ga-group.nl/ics/bics/1110141312
is version of: http://data.ga-group.nl/ics/bics/1610111312
imported on: 2026-06-08T13:03:47.798Z
last refreshed on: 2026-06-08T13:03:47.798Z
source accessed on: 2019-12-03T20:05:01Z
source last accessed on: 2019-12-03T20:05:01Z
label: Armas de pequeno porte @pt
label: Armas pequeñas @es
label: Armes légères @fr
label: Handfeuerwaffen @de
label: Piccole armi @it
label: Стрелков. оружие @ru
label: 小型武器 @zh-hant
label: 小型武器制造 @zh
label: 小火器 @ja
label: 소형무기 탄약 @ko
definition: This segment includes companies that manufacture small firearms that individuals can carry. Such firearms include pistols, rifles and shotguns.
notation: 1610111312
valid from: 2014-08-08
valid till: 2020-10-03

Other Ordnance & Accessories
type: BicsLevel5Segment
type: Classifier
type: Discontinued
type: NamedIndividual
is level5 segment of: Munitions & Small Arms
is contemporary version of: http://data.ga-group.nl/ics/bics/1610111313
is version of: http://data.ga-group.nl/ics/bics/1610111313
imported on: 2026-06-08T13:03:47.798Z
last refreshed on: 2026-06-08T13:03:47.798Z
source accessed on: 2019-12-03T20:05:01Z
source last accessed on: 2019-12-03T20:05:01Z
label: Altre munizioni e accessori @it
label: Artillerie & -bedarf @de
label: Autres pièces d'artillerie et accessoires @fr
label: Otros productos de artillería y accesorios @es
label: Outr artilharia e acessórios @pt
label: Прочеее огнестрельн. снаряж. и аксессуары @ru
label: その他武器･付属品 @ja
label: 其他军械与配件 @zh
label: 其他軍械設備 @zh-hant
label: 기타 대포 & 액세서리 @ko
definition: This segment includes companies that manufacture ordnance, except small arms. Such ordinance includes artillery, rocket launchers and mortars. Military accessories, such as military bulletproof vests and military gas masks, are also included in this segment.
notation: 1610111313
valid from: 2014-08-08
valid till: 2020-10-03

Munitions & Small Arms
type: BicsLevel4SubIndustry
type: Classifier
type: NamedIndividual
is sub industry of: Defense Primes
is anachronous version of: http://data.ga-group.nl/ics/bics/1710111113
is contemporary version of: http://data.ga-group.nl/ics/bics/16101113
is replaced by: http://data.ga-group.nl/ics/bics/2020/1710111113
is version of: http://data.ga-group.nl/ics/bics/16101113
is version of: http://data.ga-group.nl/ics/bics/1710111113
imported on: 2026-06-08T13:03:47.798Z
last refreshed on: 2026-06-08T13:03:47.798Z
source accessed on: 2019-12-03T20:05:01Z
source last accessed on: 2019-12-03T20:05:01Z
label: Armes légères et munitions @fr
label: Munições e armas de pequeno porte @pt
label: Municiones y armas pequeñas @es
label: Munition & Handfeuerwaffen @de
label: Munizioni e piccole armi @it
label: Снаряж. и стрелк. оружие @ru
label: 军火弹药和小型武器 @zh
label: 弾薬･小火器 @ja
label: 軍火彈藥及小型武器 @zh-hant
label: 군수품 & 소형무기 @ko
definition: This industry subgroup includes companies that manufacture munitions, ordnance and small arms.
notation: 16101113
valid from: 2014-08-08
valid till: 2020-10-03

Naval Ship Building
type: BicsLevel4SubIndustry
type: Classifier
type: NamedIndividual
is sub industry of: Defense Primes
is anachronous version of: http://data.ga-group.nl/ics/bics/1710111114
is contemporary version of: http://data.ga-group.nl/ics/bics/16101114
is replaced by: http://data.ga-group.nl/ics/bics/2020/1710111114
is version of: http://data.ga-group.nl/ics/bics/16101114
is version of: http://data.ga-group.nl/ics/bics/1710111114
imported on: 2026-06-08T13:03:47.798Z
last refreshed on: 2026-06-08T13:03:47.798Z
source accessed on: 2019-12-03T20:05:01Z
source last accessed on: 2019-12-03T20:05:01Z
label: Construção de navios @pt
label: Construcc de buques @es
label: Construction navale @fr
label: Costruzione navale @it
label: Kriegsschiffsbau @de
label: Строительство военных кораблей @ru
label: 军舰制造 @zh
label: 軍艦營造 @zh-hant
label: 軍艦造船 @ja
label: 해군함 선박조선 @ko
definition: This industry subgroup includes companies that manufacture naval ships, boats and submarines.
notation: 16101114
valid from: 2014-08-08
valid till: 2020-10-03

Defense Primes
type: BicsLevel3Industry
type: Classifier
type: NamedIndividual
is industry of: Aerospace & Defense
is anachronous version of: http://data.ga-group.nl/ics/bics/17101111
is contemporary version of: http://data.ga-group.nl/ics/bics/161011
is replaced by: http://data.ga-group.nl/ics/bics/2020/17101111
is version of: http://data.ga-group.nl/ics/bics/161011
is version of: http://data.ga-group.nl/ics/bics/17101111
imported on: 2026-06-08T13:03:47.798Z
last refreshed on: 2026-06-08T13:03:47.798Z
source accessed on: 2019-12-03T20:05:01Z
source last accessed on: 2019-12-03T20:05:01Z
label: Defesa Primes @pt
label: Difesa @it
label: Primes de defensa @es
label: Primes pour défense @fr
label: Verteidigung @de
label: Снаряды @ru
label: 国防 @zh
label: 國防 @zh-hant
label: 防衛元請業 @ja
label: 방위 프라임 @ko
definition: This industry includes companies that manufacture aerospace and defense products, parts and instruments. Products include aircraft, naval ships, military armored vehicles, guided missile and space vehicles, and munitions and small arms. Parts include aircraft engines, aircraft sub-assemblies, electronics, radar, guidance, and navigation systems.
notation: 161011
valid from: 2014-08-08
valid till: 2020-10-03

Aerospace & Defense
type: BicsLevel2IndustryGroup
type: Classifier
type: NamedIndividual
is industry group of: Industrials
is anachronous version of: http://data.ga-group.nl/ics/bics/171011
is contemporary version of: http://data.ga-group.nl/ics/bics/1610
is replaced by: http://data.ga-group.nl/ics/bics/2020/171011
is version of: http://data.ga-group.nl/ics/bics/1610
is version of: http://data.ga-group.nl/ics/bics/171011
imported on: 2026-06-08T13:03:47.798Z
last refreshed on: 2026-06-08T13:03:47.798Z
source accessed on: 2019-12-03T20:05:01Z
source last accessed on: 2019-12-03T20:05:01Z
label: Aérospatiale et défense @fr
label: Aeroespacial y militar @es
label: Aerospazio e difesa @it
label: Defesa e aeroespacial @pt
label: Raumfahrt & Verteidigung @de
label: Аэрокосм. и оборона @ru
label: 航空宇宙･防衛 @ja
label: 航空與國防 @zh-hant
label: 航空航天及国防 @zh
label: 항공우주 & 방위 @ko
definition: This industry group includes companies that manufacture aerospace and defense products. Such products include aircraft, naval ships, military armored vehicles, guided missile and space vehicles, and munitions and small arms.
notation: 1610
valid from: 2014-08-08
valid till: 2020-10-03

Elevator & Moving Stairway
type: BicsLevel4SubIndustry
type: Classifier
type: NamedIndividual
is sub industry of: Comml & Res Bldg Equip & Sys
is anachronous version of: http://data.ga-group.nl/ics/bics/1710121010
is contemporary version of: http://data.ga-group.nl/ics/bics/16111010
is replaced by: http://data.ga-group.nl/ics/bics/2020/1710121010
is version of: http://data.ga-group.nl/ics/bics/16111010
is version of: http://data.ga-group.nl/ics/bics/1710121010
imported on: 2026-06-08T13:03:47.798Z
last refreshed on: 2026-06-08T13:03:47.798Z
source accessed on: 2019-12-03T20:05:01Z
source last accessed on: 2019-12-03T20:05:01Z
label: Acensores, escaleras eléctric @es
label: Ascenseurs et escaliers mécaniques @fr
label: Ascensori e scale mobili @it
label: Elevador e escada rolante @pt
label: Fahrstühle & Rolltreppen @de
label: Лифты и эскалаторы @ru
label: 电梯与移动楼梯 @zh
label: 電梯及手扶梯 @zh-hant
label: 엘리베이터 & 이동식계단 @ko
label: ｴﾚﾍﾞｰﾀｰ･ｴｽｶﾚｰﾀｰ @ja
definition: This industry subgroup includes companies that manufacture equipment that moves materials from one floor to another floor. Such equipment includes automobile lifts, passenger elevators, and escalators.
notation: 16111010
valid from: 2014-08-08
valid till: 2020-10-03

A/C Heating & Fridge Equip
type: BicsLevel5Segment
type: Classifier
type: NamedIndividual
is level5 segment of: HVAC Building Products
is anachronous version of: http://data.ga-group.nl/ics/bics/171012101110
is contemporary version of: http://data.ga-group.nl/ics/bics/1611101110
is replaced by: http://data.ga-group.nl/ics/bics/2020/171012101110
is version of: http://data.ga-group.nl/ics/bics/1611101110
is version of: http://data.ga-group.nl/ics/bics/171012101110
imported on: 2026-06-08T13:03:47.798Z
last refreshed on: 2026-06-08T13:03:47.798Z
source accessed on: 2019-12-03T20:05:01Z
source last accessed on: 2019-12-03T20:05:01Z
label: A/C 난방 & 냉장고 장비 @ko
label: App A/C riscaldamento e frigo @it
label: Equip para aquecimento de ar condicionado e refrigeração @pt
label: Equipo de calefacción A/C y la refrigerador @es
label: HVAC et appareils de réfrig @fr
label: Temperaturkontrollgeräte @de
label: Холодильное и отопительное оборуд. @ru
label: 冷暖氣及冷凍設備 @zh-hant
label: 空調･冷暖房･冷凍設備 @ja
label: 空调、供暖与制冷设备 @zh
definition: This segment includes companies that manufacture air conditioning and warm air furnace equipment, as well as commercial and industrial walk-in refrigeration and freezer equipment.
notation: 1611101110
valid from: 2014-08-08
valid till: 2020-10-03

Heating Equipment
type: BicsLevel5Segment
type: Classifier
type: NamedIndividual
is level5 segment of: HVAC Building Products
is anachronous version of: http://data.ga-group.nl/ics/bics/171012101111
is contemporary version of: http://data.ga-group.nl/ics/bics/1611101111
is replaced by: http://data.ga-group.nl/ics/bics/2020/171012101111
is version of: http://data.ga-group.nl/ics/bics/1611101111
is version of: http://data.ga-group.nl/ics/bics/171012101111
imported on: 2026-06-08T13:03:47.798Z
last refreshed on: 2026-06-08T13:03:47.798Z
source accessed on: 2019-12-03T20:05:01Z
source last accessed on: 2019-12-03T20:05:01Z
label: Equipamento para aquecimento @pt
label: Equipements de chauffage @fr
label: Equipo de calefacción @es
label: Heizungsausrüstung @de
label: Impianti di riscaldamento @it
label: Отопит. оборуд. @ru
label: 供暖设备 @zh
label: 暖房装置 @ja
label: 暖氣設備 @zh-hant
label: 난방장비 @ko
definition: This segment includes companies that manufacture boilers, heating stoves, furnaces and baseboard heating units.
notation: 1611101111
valid from: 2014-08-08
valid till: 2020-10-03

Industrial Fans & Blowers
type: BicsLevel5Segment
type: Classifier
type: NamedIndividual
is level5 segment of: HVAC Building Products
is anachronous version of: http://data.ga-group.nl/ics/bics/171012101112
is contemporary version of: http://data.ga-group.nl/ics/bics/1611101112
is replaced by: http://data.ga-group.nl/ics/bics/2020/171012101112
is version of: http://data.ga-group.nl/ics/bics/1611101112
is version of: http://data.ga-group.nl/ics/bics/171012101112
imported on: 2026-06-08T13:03:47.798Z
last refreshed on: 2026-06-08T13:03:47.798Z
source accessed on: 2019-12-03T20:05:01Z
source last accessed on: 2019-12-03T20:05:01Z
label: Abanicos y ventiladores industriales @es
label: Industrielle Ventilatoren & Gebläse @de
label: Ventiladores industriais e ventiladores @pt
label: Ventilateurs et souffleurs industriels @fr
label: Ventilatori e aspiratori industriali @it
label: Промышл. и коммерч. вентиляторы @ru
label: 工业风扇与鼓风机 @zh
label: 工商業用風扇及風箱 @zh-hant
label: 産業用換気扇･送風機 @ja
label: 산업용 선풍기 & 송풍기 @ko
definition: This segment includes companies that manufacture attic fans, blowers, and industrial and commercial fans, such as exhaust and ventilating fans.
notation: 1611101112
valid from: 2014-08-08
valid till: 2020-10-03

HVAC Building Products
type: BicsLevel4SubIndustry
type: Classifier
type: NamedIndividual
is sub industry of: Comml & Res Bldg Equip & Sys
is anachronous version of: http://data.ga-group.nl/ics/bics/1710121011
is contemporary version of: http://data.ga-group.nl/ics/bics/16111011
is replaced by: http://data.ga-group.nl/ics/bics/2020/1710121011
is version of: http://data.ga-group.nl/ics/bics/16111011
is version of: http://data.ga-group.nl/ics/bics/1710121011
imported on: 2026-06-08T13:03:47.798Z
last refreshed on: 2026-06-08T13:03:47.798Z
source accessed on: 2019-12-03T20:05:01Z
source last accessed on: 2019-12-03T20:05:01Z
label: HVAC 건축자재 @ko
label: Heiz- & Klimatisierungsprodukte @de
label: Prodotti costruzione HVAC @it
label: Productos de edificación, calefacción y aire acondicionado @es
label: Produits de construction HVAC @fr
label: Produtos para construção HVAC @pt
label: Товары для обогрева, кондиционир. @ru
label: 冷暖房空調設備建設用品 @ja
label: 暖通空调建筑产品 @zh
label: 通風/冷暖氣建築物產品 @zh-hant
definition: This industry subgroup includes companies that manufacture ventilation, heating, air conditioning, and commercial and industrial walk-in refrigeration and freezer equipment.
notation: 16111011
valid from: 2014-08-08
valid till: 2020-10-03

Commercial Light Fixture
type: BicsLevel5Segment
type: Classifier
type: NamedIndividual
is level5 segment of: Lighting Fixture
is anachronous version of: http://data.ga-group.nl/ics/bics/171012101210
is contemporary version of: http://data.ga-group.nl/ics/bics/1611101210
is replaced by: http://data.ga-group.nl/ics/bics/2020/171012101210
is version of: http://data.ga-group.nl/ics/bics/1611101210
is version of: http://data.ga-group.nl/ics/bics/171012101210
imported on: 2026-06-08T13:03:47.798Z
last refreshed on: 2026-06-08T13:03:47.798Z
source accessed on: 2019-12-03T20:05:01Z
source last accessed on: 2019-12-03T20:05:01Z
label: Appareils d'éclairage commerciaux @fr
label: Gewerbl. Beleuchtungskörper @de
label: Impianti elettrici commerciali @it
label: Lámparas comerciales @es
label: Luminárias comerciais @pt
label: Коммерч. электр. осветит. приборы @ru
label: 商業用電気照明器具 @ja
label: 商用照明灯具 @zh
label: 商用照明燈具 @zh-hant
label: 상업용 조명장치 @ko
definition: This segment includes companies that manufacture electric lamp bulbs, lighting fixtures and parts for commercial markets.
notation: 1611101210
valid from: 2014-08-08
valid till: 2020-10-03

Residential Light Fixture
type: BicsLevel5Segment
type: Classifier
type: NamedIndividual
is level5 segment of: Lighting Fixture
is anachronous version of: http://data.ga-group.nl/ics/bics/171012101211
is contemporary version of: http://data.ga-group.nl/ics/bics/1611101211
is replaced by: http://data.ga-group.nl/ics/bics/2020/171012101211
is version of: http://data.ga-group.nl/ics/bics/1611101211
is version of: http://data.ga-group.nl/ics/bics/171012101211
imported on: 2026-06-08T13:03:47.798Z
last refreshed on: 2026-06-08T13:03:47.798Z
source accessed on: 2019-12-03T20:05:01Z
source last accessed on: 2019-12-03T20:05:01Z
label: Appareils d'éclairage résidentiels @fr
label: Impianti elettrici residenziali @it
label: Lámparas ornamentales residenciales @es
label: Luminárias residenciais @pt
label: Private Beleuchtungskörper @de
label: Электр. освет. приборы для дом. польз. @ru
label: 住宅照明灯具 @zh
label: 住宅用電気照明器具 @ja
label: 家用照明燈具 @zh-hant
label: 주거용 조명장치 @ko
definition: This segment includes companies that manufacture electric lamp bulbs, lighting fixtures and parts for housing markets.
notation: 1611101211
valid from: 2014-08-08
valid till: 2020-10-03

Other Lighting Equipment
type: BicsLevel5Segment
type: Classifier
type: Discontinued
type: NamedIndividual
is level5 segment of: Lighting Fixture
is contemporary version of: http://data.ga-group.nl/ics/bics/1611101212
is version of: http://data.ga-group.nl/ics/bics/1611101212
imported on: 2026-06-08T13:03:47.798Z
last refreshed on: 2026-06-08T13:03:47.798Z
source accessed on: 2019-12-03T20:05:01Z
source last accessed on: 2019-12-03T20:05:01Z
label: Altre app d'illuminazione @it
label: Autres appareils d'éclairage @fr
label: Otro equipo de iluminación @es
label: Outros equipamentos elétricos @pt
label: Sonstige Beleuchtungsausrüstung @de
label: Прочее осветит. оборуд. @ru
label: その他照明器具 @ja
label: 其他照明設備 @zh-hant
label: 其他照明设备 @zh
label: 기타 조명장비 @ko
definition: This segment includes companies that manufacture electric lighting fixtures not elsewhere classified.
notation: 1611101212
valid from: 2014-08-08
valid till: 2020-10-03

Lighting Fixture
type: BicsLevel4SubIndustry
type: Classifier
type: NamedIndividual
is sub industry of: Comml & Res Bldg Equip & Sys
is anachronous version of: http://data.ga-group.nl/ics/bics/1710121012
is contemporary version of: http://data.ga-group.nl/ics/bics/16111012
is replaced by: http://data.ga-group.nl/ics/bics/2020/1710121012
is version of: http://data.ga-group.nl/ics/bics/16111012
is version of: http://data.ga-group.nl/ics/bics/1710121012
imported on: 2026-06-08T13:03:47.798Z
last refreshed on: 2026-06-08T13:03:47.798Z
source accessed on: 2019-12-03T20:05:01Z
source last accessed on: 2019-12-03T20:05:01Z
label: Appareils d'éclairage @fr
label: Beleuchtungskörper @de
label: Dispositivos de iluminação @pt
label: Impianti elettrici @it
label: Lámparas @es
label: Осветительные приборы @ru
label: 照明器具 @ja
label: 照明器材 @zh
label: 照明燈具 @zh-hant
label: 조명장치 @ko
definition: This industry subgroup includes companies that manufacture electric lamp bulbs, lighting fixtures and parts.
notation: 16111012
valid from: 2014-08-08
valid till: 2020-10-03

Fire Detection Devices
type: BicsLevel5Segment
type: Classifier
type: NamedIndividual
is level5 segment of: Security Devices
is anachronous version of: http://data.ga-group.nl/ics/bics/171012101310
is contemporary version of: http://data.ga-group.nl/ics/bics/1611101310
is replaced by: http://data.ga-group.nl/ics/bics/2020/171012101310
is version of: http://data.ga-group.nl/ics/bics/1611101310
is version of: http://data.ga-group.nl/ics/bics/171012101310
imported on: 2026-06-08T13:03:47.798Z
last refreshed on: 2026-06-08T13:03:47.798Z
source accessed on: 2019-12-03T20:05:01Z
source last accessed on: 2019-12-03T20:05:01Z
label: Brandmelder @de
label: Dispositifs de détection d'incendie @fr
label: Dispositivi antincendio @it
label: Dispositivos de detectores de incendio @es
label: Equipamentos de detecção de incêndio @pt
label: Системы пожарообнаружения @ru
label: 火災偵測裝置 @zh-hant
label: 火災探知機 @ja
label: 火灾探测装置 @zh
label: 화재 감지 기기 제조업 @ko
definition: This segment includes companies that manufacture fire detection systems, such as smoke detectors. Products also include fire extinguishers.
notation: 1611101310
valid from: 2014-08-08
valid till: 2020-10-03

Security Systems
type: BicsLevel5Segment
type: Classifier
type: NamedIndividual
is level5 segment of: Security Devices
is anachronous version of: http://data.ga-group.nl/ics/bics/171012101311
is contemporary version of: http://data.ga-group.nl/ics/bics/1611101311
is replaced by: http://data.ga-group.nl/ics/bics/2020/171012101311
is version of: http://data.ga-group.nl/ics/bics/1611101311
is version of: http://data.ga-group.nl/ics/bics/171012101311
imported on: 2026-06-08T13:03:47.798Z
last refreshed on: 2026-06-08T13:03:47.798Z
source accessed on: 2019-12-03T20:05:01Z
source last accessed on: 2019-12-03T20:05:01Z
label: Sicherheitssysteme @de
label: Sistemas de segurança @pt
label: Sistemas de seguridad @es
label: Sistemi sicurezza @it
label: Systèmes de sécurité @fr
label: Системы безопасности @ru
label: 安全系統 @zh-hant
label: 安全系统 @zh
label: 보안 시스템 제조업 @ko
label: ｾｷｭﾘﾃｨｼｽﾃﾑ @ja
definition: This segment includes companies that manufacture security systems designed to detect intruders or burglars. Such systems include motion detectors, or devices that recognize and respond to the opening of a door or window. They also include after-market car alarm systems.
notation: 1611101311
valid from: 2014-08-08
valid till: 2020-10-03

Security Devices
type: BicsLevel4SubIndustry
type: Classifier
type: NamedIndividual
is sub industry of: Comml & Res Bldg Equip & Sys
is anachronous version of: http://data.ga-group.nl/ics/bics/1710121013
is contemporary version of: http://data.ga-group.nl/ics/bics/16111013
is replaced by: http://data.ga-group.nl/ics/bics/2020/1710121013
is version of: http://data.ga-group.nl/ics/bics/16111013
is version of: http://data.ga-group.nl/ics/bics/1710121013
imported on: 2026-06-08T13:03:47.798Z
last refreshed on: 2026-06-08T13:03:47.798Z
source accessed on: 2019-12-03T20:05:01Z
source last accessed on: 2019-12-03T20:05:01Z
label: Dispositifs de sécurité @fr
label: Dispositivi sicurezza @it
label: Dispositivos de segurança @pt
label: Dispositivos de seguridad @es
label: Sicherheitsgeräte @de
label: Приборы безопасности @ru
label: 安全装置 @zh
label: 安全裝置 @zh-hant
label: 防犯装置 @ja
label: 보안장치 제조업 @ko
definition: This industry subgroup includes companies that manufacture security devices, such as motion sensors and fire detectors.
notation: 16111013
valid from: 2014-08-08
valid till: 2020-10-03

Comml & Res Bldg Equip & Sys
type: BicsLevel3Industry
type: Classifier
type: NamedIndividual
is industry of: Electrical Equipment
is anachronous version of: http://data.ga-group.nl/ics/bics/17101210
is contemporary version of: http://data.ga-group.nl/ics/bics/161110
is replaced by: http://data.ga-group.nl/ics/bics/2020/17101210
is version of: http://data.ga-group.nl/ics/bics/161110
is version of: http://data.ga-group.nl/ics/bics/17101210
imported on: 2026-06-08T13:03:47.798Z
last refreshed on: 2026-06-08T13:03:47.798Z
source accessed on: 2019-12-03T20:05:01Z
source last accessed on: 2019-12-03T20:05:01Z
label: Eq y sist const com y res @es
label: Equip e sist constr res e com @pt
label: Gewerbl. & Private Gebäudeausrüstung & -systeme @de
label: Sis e app edifici comm e resid @it
label: Syst et équip constr commerc et résid @fr
label: Оборуд. и системы д/коммерч. и жилых зданий @ru
label: 商业与住宅建筑设备与系统 @zh
label: 商業住宅建築設備及系統 @zh-hant
label: 商業ﾋﾞ���&ﾏﾝｼｮﾝ用設備･ｼｽﾃﾑ @ja
label: 상업 & 주거용 건물 장비 & 시스템 @ko
definition: This industry includes companies that manufacture non-structural commercial and residential building equipment, such as HVAC systems, elevators and security devices.
notation: 161110
valid from: 2014-08-08
valid till: 2020-10-03

Portable Generator Sets
type: BicsLevel6Segment
type: Classifier
type: Discontinued
type: NamedIndividual
is level6 segment of: Electric Power Generators
is contemporary version of: http://data.ga-group.nl/ics/bics/161111101010
is version of: http://data.ga-group.nl/ics/bics/161111101010
imported on: 2026-06-08T13:03:47.798Z
last refreshed on: 2026-06-08T13:03:47.798Z
source accessed on: 2019-12-03T20:05:01Z
source last accessed on: 2019-12-03T20:05:01Z
label: Conjuntos geradores port @pt
label: Generatori portatili @it
label: Groupes électrogènes portables @fr
label: Grupos generador portable @es
label: Tragbare Generatorsätze @de
label: Переносные генераторные установки @ru
label: 便携式发电机组 @zh
label: 可攜式發電機組 @zh-hant
label: 携帯用発電機ｾｯﾄ @ja
label: 휴대용 발전기세트 @ko
definition: This segment includes companies that manufacture electric motors, power generators and motor generator sets.
notation: 161111101010
valid from: 2014-08-08
valid till: 2020-10-03

Stationary Power Plant Engines
type: BicsLevel7Segment
type: Classifier
type: Discontinued
type: NamedIndividual
is level7 segment of: Stat Power Plant Gen & Engines
is contemporary version of: http://data.ga-group.nl/ics/bics/16111110101110
is version of: http://data.ga-group.nl/ics/bics/16111110101110
imported on: 2026-06-08T13:03:47.798Z
last refreshed on: 2026-06-08T13:03:47.798Z
source accessed on: 2019-12-03T20:05:01Z
source last accessed on: 2019-12-03T20:05:01Z
label: Maschinen für stationäre Kraftwerke @de
label: Moteurs de centrales électriques stationnaires @fr
label: Motores de planta de energia estacionária @pt
label: Motori fissi centrali elettriche @it
label: Plantas eléctricas y motores estacionarios @es
label: Стационарные электродвигатели @ru
label: 固定式电厂发动机 @zh
label: 固定性電廠引擎 @zh-hant
label: 定置式発電機ｴﾝｼﾞﾝ @ja
label: 정치식 발전소 엔진 @ko
definition: This segment includes companies that manufacture internal combustion engines for power plants.
notation: 16111110101110
valid from: 2014-08-08
valid till: 2020-10-03

Stat Power Plant Gen & Engines
type: BicsLevel6Segment
type: Classifier
type: Discontinued
type: NamedIndividual
is level6 segment of: Electric Power Generators
is contemporary version of: http://data.ga-group.nl/ics/bics/161111101011
is version of: http://data.ga-group.nl/ics/bics/161111101011
imported on: 2026-06-08T13:03:47.798Z
last refreshed on: 2026-06-08T13:03:47.798Z
source accessed on: 2019-12-03T20:05:01Z
source last accessed on: 2019-12-03T20:05:01Z
label: Générat/moteurs centrales stationnaires @fr
label: Generatoren & Motoren f. stationäre Kraftwerke @de
label: Ger e mot usina energia est @pt
label: Motori fissi e gen centrali elettriche @it
label: Plantas eléctricas y motores estacionarios @es
label: Стацион. электрогенераторы и двигатели @ru
label: 固定式電廠發電機及引擎 @zh-hant
label: 固定电厂发电与发动机 @zh
label: 固定発電機･ｴﾝｼﾞﾝ製造 @ja
label: 정치식 발전소 발전기 & 엔진 @ko
definition: This segment includes companies that manufacture non-portable power generators to convert mechanical energy into electricity.
notation: 161111101011
valid from: 2014-08-08
valid till: 2020-10-03

Electric Power Generators
type: BicsLevel5Segment
type: Classifier
type: NamedIndividual
is level5 segment of: Power Generation Equipment
is anachronous version of: http://data.ga-group.nl/ics/bics/171012111010
is contemporary version of: http://data.ga-group.nl/ics/bics/1611111010
is replaced by: http://data.ga-group.nl/ics/bics/2020/171012111010
is version of: http://data.ga-group.nl/ics/bics/1611111010
is version of: http://data.ga-group.nl/ics/bics/171012111010
imported on: 2026-06-08T13:03:47.798Z
last refreshed on: 2026-06-08T13:03:47.798Z
source accessed on: 2019-12-03T20:05:01Z
source last accessed on: 2019-12-03T20:05:01Z
label: Elektrische Stromgeneratoren @de
label: Generatori energia elettrica @it
label: Geradores de energia elétrica @pt
label: Groupes électrogènes @fr
label: Plantas eléctricas @es
label: Генераторы электроэнергии @ru
label: 电力发电机 @zh
label: 発電機 @ja
label: 電力發電機 @zh-hant
label: 전력 발전기 @ko
definition: This segment includes companies that manufacture electricity generators and equipment for all fossil fuel types only (i.e., non-renewable).
notation: 1611111010
valid from: 2014-08-08
valid till: 2020-10-03

Nuclear Power Gen Equip & Sys
type: BicsLevel5Segment
type: Classifier
type: NamedIndividual
is level5 segment of: Power Generation Equipment
is anachronous version of: http://data.ga-group.nl/ics/bics/171012111011
is contemporary version of: http://data.ga-group.nl/ics/bics/1611111011
is replaced by: http://data.ga-group.nl/ics/bics/2020/171012111011
is version of: http://data.ga-group.nl/ics/bics/1611111011
is version of: http://data.ga-group.nl/ics/bics/171012111011
imported on: 2026-06-08T13:03:47.798Z
last refreshed on: 2026-06-08T13:03:47.798Z
source accessed on: 2019-12-03T20:05:01Z
source last accessed on: 2019-12-03T20:05:01Z
label: Ausstattung & Systeme für Kernkraftgewinnung @de
label: Equip e sist equip ger energia nuclear @pt
label: Equipo y sistemas de generación elec nuclear @es
label: Sis e app gen energia nucleare @it
label: Syst/équip gén d'électricité nucléaire @fr
label: Выработка атомн. энергии, оборуд. и системы @ru
label: 原子力発電設備･ｼｽﾃﾑ @ja
label: 核能发电设备���系统 @zh
label: 核能發電設備及系統 @zh-hant
label: 원자력 발전 장비 & 시스템 @ko
definition: This segment includes companies that produce nuclear power generation equipment and systems.
notation: 1611111011
valid from: 2014-08-08
valid till: 2020-10-03

Power Boiler & Heat Exchangers
type: BicsLevel5Segment
type: Classifier
type: NamedIndividual
is level5 segment of: Power Generation Equipment
is anachronous version of: http://data.ga-group.nl/ics/bics/171012111012
is contemporary version of: http://data.ga-group.nl/ics/bics/1611111012
is replaced by: http://data.ga-group.nl/ics/bics/2020/171012111012
is version of: http://data.ga-group.nl/ics/bics/1611111012
is version of: http://data.ga-group.nl/ics/bics/171012111012
imported on: 2026-06-08T13:03:47.798Z
last refreshed on: 2026-06-08T13:03:47.798Z
source accessed on: 2019-12-03T20:05:01Z
source last accessed on: 2019-12-03T20:05:01Z
label: Caldaie e scambiatori di calore @it
label: Caldeira elétrica e permutador de calor @pt
label: Calderas industriales @es
label: Chaudières et échangeurs de chaleur @fr
label: Dampferzeuger & Wärmeaustauscher @de
label: Энергет. котлы и радиаторы @ru
label: 動力鍋爐及熱傳導器 @zh-hant
label: 発電ﾎﾞｲﾗｰ･熱交換器 @ja
label: 锅炉与热交换器 @zh
label: 동력용 보일러 및 열교환기 @ko
definition: This segment includes companies that manufacture equipment used to heat water.
notation: 1611111012
valid from: 2014-08-08
valid till: 2020-10-03

Turbine Generators
type: BicsLevel5Segment
type: Classifier
type: NamedIndividual
is level5 segment of: Power Generation Equipment
is anachronous version of: http://data.ga-group.nl/ics/bics/171012111013
is contemporary version of: http://data.ga-group.nl/ics/bics/1611111013
is replaced by: http://data.ga-group.nl/ics/bics/2020/171012111013
is version of: http://data.ga-group.nl/ics/bics/1611111013
is version of: http://data.ga-group.nl/ics/bics/171012111013
imported on: 2026-06-08T13:03:47.798Z
last refreshed on: 2026-06-08T13:03:47.798Z
source accessed on: 2019-12-03T20:05:01Z
source last accessed on: 2019-12-03T20:05:01Z
label: Générateurs à turbines @fr
label: Generadores de turbina @es
label: Generatori turbine @it
label: Geradores de turbina @pt
label: Turbinengeneratoren @de
label: Турбогенераторы @ru
label: 渦輪發電機 @zh-hant
label: 风机发电机 @zh
label: ﾀｰﾋﾞﾝ発電機 @ja
label: ��빈 발전기 @ko
definition: This segment includes companies that manufacture turbines and turbine generator sets. Includes steam turbines and gas turbines. Excludes turbines used in renewable energy applications.
notation: 1611111013
valid from: 2014-08-08
valid till: 2020-10-03

Power Gen Equip Parts & Svcs
type: BicsLevel5Segment
type: Classifier
type: NamedIndividual
is level5 segment of: Power Generation Equipment
is anachronous version of: http://data.ga-group.nl/ics/bics/171012111014
is contemporary version of: http://data.ga-group.nl/ics/bics/1611111014
is replaced by: http://data.ga-group.nl/ics/bics/2020/171012111014
is version of: http://data.ga-group.nl/ics/bics/1611111014
is version of: http://data.ga-group.nl/ics/bics/171012111014
imported on: 2026-06-08T13:03:47.798Z
last refreshed on: 2026-06-08T13:03:47.798Z
source accessed on: 2019-12-03T20:05:01Z
source last accessed on: 2019-12-03T20:05:01Z
label: Partes de equipo de generación eléctrica y servicios @es
label: Pièces/serv équip prod d'électricité @fr
label: Serv e parti app gen energia @it
label: Serv e peças equipamento de ger energia @pt
label: Stromerzeugungsausrüstung, -teile & -dienste @de
label: Оборуд. д/выраб. электроэн., запчасти @ru
label: 发电设备零部件与服务 @zh
label: 発電機器部品･ｻｰﾋﾞｽ @ja
label: 發電設備零件及服務 @zh-hant
label: 전력 발전 장비 부품 & 서비스 @ko
definition: This segment includes companies that provide parts and aftermarket activities in power generation equipment. Includes maintenance services, as well as manufacturing of spare parts and aftermarket consumables.
notation: 1611111014
valid from: 2014-08-08
valid till: 2020-10-03

Power Generation Equipment
type: BicsLevel4SubIndustry
type: Classifier
type: NamedIndividual
is sub industry of: Electrical Power Equipment
is anachronous version of: http://data.ga-group.nl/ics/bics/1710121110
is contemporary version of: http://data.ga-group.nl/ics/bics/16111110
is replaced by: http://data.ga-group.nl/ics/bics/2020/1710121110
is version of: http://data.ga-group.nl/ics/bics/16111110
is version of: http://data.ga-group.nl/ics/bics/1710121110
imported on: 2026-06-08T13:03:47.798Z
last refreshed on: 2026-06-08T13:03:47.798Z
source accessed on: 2019-12-03T20:05:01Z
source last accessed on: 2019-12-03T20:05:01Z
label: App gen energia @it
label: Eq gener elec @es
label: Equip ger energia @pt
label: Equipements de génération d'électricité @fr
label: Stromerzeugungsgeräte @de
label: Оборуд. для пр-ва электрич. @ru
label: 发电设备 @zh
label: 発電機器 @ja
label: 發電設備 @zh-hant
label: 전력발전기기 @ko
definition: This industry subgroup includes companies that manufacture equipment used in both primary and secondary power generation.
notation: 16111110
valid from: 2014-08-08
valid till: 2020-10-03

Power Automation Equipment
type: BicsLevel5Segment
type: Classifier
type: NamedIndividual
is level5 segment of: Power Trans & Distr Equip
is anachronous version of: http://data.ga-group.nl/ics/bics/171012111110
is contemporary version of: http://data.ga-group.nl/ics/bics/1611111110
is replaced by: http://data.ga-group.nl/ics/bics/2020/171012111110
is version of: http://data.ga-group.nl/ics/bics/1611111110
is version of: http://data.ga-group.nl/ics/bics/171012111110
imported on: 2026-06-08T13:03:47.798Z
last refreshed on: 2026-06-08T13:03:47.798Z
source accessed on: 2019-12-03T20:05:01Z
source last accessed on: 2019-12-03T20:05:01Z
label: Apparecchiature generazione energia @it
label: Equipamento de automação de energia @pt
label: Equipements d'automatisation d'électricité @fr
label: Equipo automáticos eléctricos @es
label: Stromautomatisierungsausrüstung @de
label: Оборуд. д/электропередачи @ru
label: 电力自动化设备 @zh
label: 電力自動化機器 @ja
label: 電力自動化設備 @zh-hant
label: 전력 자동화 장비 @ko
definition: This segment includes companies that manufacture power automation equipment or systems utilized in power generation facilities or their networks.
notation: 1611111110
valid from: 2014-08-08
valid till: 2020-10-03

Power Trans & Distr Components
type: BicsLevel5Segment
type: Classifier
type: NamedIndividual
is level5 segment of: Power Trans & Distr Equip
is anachronous version of: http://data.ga-group.nl/ics/bics/171012111111
is contemporary version of: http://data.ga-group.nl/ics/bics/1611111111
is replaced by: http://data.ga-group.nl/ics/bics/2020/171012111111
is version of: http://data.ga-group.nl/ics/bics/1611111111
is version of: http://data.ga-group.nl/ics/bics/171012111111
imported on: 2026-06-08T13:03:47.798Z
last refreshed on: 2026-06-08T13:03:47.798Z
source accessed on: 2019-12-03T20:05:01Z
source last accessed on: 2019-12-03T20:05:01Z
label: Componentes de distr e trans energia @pt
label: Componentes de transporte eléctrico y distribución @es
label: Componenti distrib e trasp energia @it
label: Composants de transm et distrib d'électricité @fr
label: Stromübertragungs- & verteilungskomponenten @de
label: Компоненты передачи и распр. энергии @ru
label: 电力输送与配送组件 @zh
label: 輸電及配電零組件 @zh-hant
label: 送電･配電ｺﾝﾎﾟｰﾈﾝﾄ @ja
label: 전력 송전 & 배전 부품 @ko
definition: This segment includes companies that manufacture electric motors, generators, transformers, and switchgear apparatus.
notation: 1611111111
valid from: 2014-08-08
valid till: 2020-10-03

Electric Power Grid Parts & Svcs
type: BicsLevel5Segment
type: Classifier
type: NamedIndividual
is level5 segment of: Power Trans & Distr Equip
is anachronous version of: http://data.ga-group.nl/ics/bics/171012111112
is contemporary version of: http://data.ga-group.nl/ics/bics/1611111112
is replaced by: http://data.ga-group.nl/ics/bics/2020/171012111112
is version of: http://data.ga-group.nl/ics/bics/1611111112
is version of: http://data.ga-group.nl/ics/bics/171012111112
imported on: 2026-06-08T13:03:47.798Z
last refreshed on: 2026-06-08T13:03:47.798Z
source accessed on: 2019-12-03T20:05:01Z
source last accessed on: 2019-12-03T20:05:01Z
label: Elektrische Stromnetzteile & -dienste @de
label: Pièces pour réseaux électriques et services @fr
label: Serv e parti rete energia elettrica @it
label: Serv e peças grau energia elétrica @pt
label: Servicios y partes red eléctricas @es
label: Электросеть, обслуж./запчасти @ru
label: 电网零部件与服务 @zh
label: 電力ｸﾞﾘｯﾄﾞ部品･ｻｰﾋﾞｽ @ja
label: 電網零件及服務 @zh-hant
label: 전기 전력 그리드 부품 & 서비스 @ko
definition: This segment includes companies that provide parts and aftermarket activities in power transmission, distribution and automation equipment. Includes maintenance services, as well as manufacturing of spare parts and aftermarket consumables.
notation: 1611111112
valid from: 2014-08-08
valid till: 2020-10-03

Power Trans & Distr Equip
type: BicsLevel4SubIndustry
type: Classifier
type: NamedIndividual
is sub industry of: Electrical Power Equipment
is anachronous version of: http://data.ga-group.nl/ics/bics/1710121111
is contemporary version of: http://data.ga-group.nl/ics/bics/16111111
is replaced by: http://data.ga-group.nl/ics/bics/2020/1710121111
is version of: http://data.ga-group.nl/ics/bics/16111111
is version of: http://data.ga-group.nl/ics/bics/1710121111
imported on: 2026-06-08T13:03:47.798Z
last refreshed on: 2026-06-08T13:03:47.798Z
source accessed on: 2019-12-03T20:05:01Z
source last accessed on: 2019-12-03T20:05:01Z
label: App distrib e trasp energia @it
label: Equip trans e dist de energia @pt
label: Equip trans et distrib d'électricité @fr
label: Equipo de transporte eléctrico y distribución @es
label: Stromübertragungs & -verteilungsausrüstung @de
label: Оборуд. д/электропер., распред. @ru
label: 电力输送与配送设备 @zh
label: 輸配電設備 @zh-hant
label: 送電･配電設備 @ja
label: 전력 송전 & 배전 장비 @ko
definition: This industry subgroup includes companies that manufacture equipment utilized in the distribution and transmission in power. This equipment is primarily used in electricity infrastructure.
notation: 16111111
valid from: 2014-08-08
valid till: 2020-10-03

Electrical Power Equipment
type: BicsLevel3Industry
type: Classifier
type: NamedIndividual
is industry of: Electrical Equipment
is anachronous version of: http://data.ga-group.nl/ics/bics/17101211
is contemporary version of: http://data.ga-group.nl/ics/bics/161111
is replaced by: http://data.ga-group.nl/ics/bics/2020/17101211
is version of: http://data.ga-group.nl/ics/bics/161111
is version of: http://data.ga-group.nl/ics/bics/17101211
imported on: 2026-06-08T13:03:47.798Z
last refreshed on: 2026-06-08T13:03:47.798Z
source accessed on: 2019-12-03T20:05:01Z
source last accessed on: 2019-12-03T20:05:01Z
label: App energia elettrica @it
label: Elektrische Stromgeräte @de
label: Equipamento de energia elétrica @pt
label: Equipements pour électricité @fr
label: Equipo de energía eléctrica @es
label: Силовое электрооборудование @ru
label: 电力设备 @zh
label: 電力設備 @ja
label: 전력 기기 @ko
definition: This industry includes companies that manufacture equipment used in the generation and distribution of electricity.
notation: 161111
valid from: 2014-08-08
valid till: 2020-10-03

Manufacturing Auto Controls
type: BicsLevel4SubIndustry
type: Classifier
type: NamedIndividual
is sub industry of: Industrial Automation Controls
is anachronous version of: http://data.ga-group.nl/ics/bics/1710121210
is contemporary version of: http://data.ga-group.nl/ics/bics/16111210
is replaced by: http://data.ga-group.nl/ics/bics/2020/1710121210
is version of: http://data.ga-group.nl/ics/bics/16111210
is version of: http://data.ga-group.nl/ics/bics/1710121210
imported on: 2026-06-08T13:03:47.798Z
last refreshed on: 2026-06-08T13:03:47.798Z
source accessed on: 2019-12-03T20:05:01Z
source last accessed on: 2019-12-03T20:05:01Z
label: Automatisierungskontrolle @de
label: Contrôles d'automatisation manufacturière @fr
label: Controles de fabricación automatizada @es
label: Fabricação de controles auto @pt
label: Produzione controlli auto @it
label: Средства автоматизации производства @ru
label: 制造自动化控制 @zh
label: 製造業自動控制 @zh-hant
label: 製造自動化制御 @ja
label: 자동화 관리 @ko
definition: This industry subgroup includes companies that manufacture systems and devices used to automate, monitor and optimize manufacturing. Excludes automation controls directly involved in manufacturing of goods (see Factory Automation Equipment).
notation: 16111210
valid from: 2014-08-08
valid till: 2020-10-03

Process Automation Controls
type: BicsLevel4SubIndustry
type: Classifier
type: NamedIndividual
is sub industry of: Industrial Automation Controls
is anachronous version of: http://data.ga-group.nl/ics/bics/1710121211
is contemporary version of: http://data.ga-group.nl/ics/bics/16111211
is replaced by: http://data.ga-group.nl/ics/bics/2020/1710121211
is version of: http://data.ga-group.nl/ics/bics/16111211
is version of: http://data.ga-group.nl/ics/bics/1710121211
imported on: 2026-06-08T13:03:47.798Z
last refreshed on: 2026-06-08T13:03:47.798Z
source accessed on: 2019-12-03T20:05:01Z
source last accessed on: 2019-12-03T20:05:01Z
label: Contrôles d'automatisation de processus @fr
label: Control de proceso automatizado @es
label: Elaboraz contrl autom @it
label: Processo controle de automação @pt
label: Prozessautomatisierungskontrollen @de
label: Автоматизация процесса @ru
label: 加工业自动控制 @zh
label: 工程自動制御 @ja
label: 製���自動控制 @zh-hant
label: 공정 자동화 관리 @ko
definition: This industry subgroup includes companies that manufacture systems and devices used to automate, monitor and optimize non-manufacturing industrial processes. These processes include oil and gas, chemical, mining and other non-manufacturing processes.
notation: 16111211
valid from: 2014-08-08
valid till: 2020-10-03

Industrial Automation Controls
type: BicsLevel3Industry
type: Classifier
type: NamedIndividual
is industry of: Electrical Equipment
is anachronous version of: http://data.ga-group.nl/ics/bics/17101212
is contemporary version of: http://data.ga-group.nl/ics/bics/161112
is replaced by: http://data.ga-group.nl/ics/bics/2020/17101212
is version of: http://data.ga-group.nl/ics/bics/161112
is version of: http://data.ga-group.nl/ics/bics/17101212
imported on: 2026-06-08T13:03:47.798Z
last refreshed on: 2026-06-08T13:03:47.798Z
source accessed on: 2019-12-03T20:05:01Z
source last accessed on: 2019-12-03T20:05:01Z
label: Contrôles d'automatisation industrielle @fr
label: Control automatizado industrial @es
label: Controles de automação industrial @pt
label: Controlli automatizzazione industriale @it
label: Industrielle Automatisierungskontrollen @de
label: Средства автоматизации пром. производства @ru
label: 工业自动化控制 @zh
label: 工業自動控制 @zh-hant
label: 産業自動化制御 @ja
label: 산업 자동화 관리 @ko
definition: This industry includes companies that manufacture systems and devices used to automate, monitor and optimize various processes. Includes PLCs, sensors, switches, software and systems.
notation: 161112
valid from: 2014-08-08
valid till: 2020-10-03

Elec Measuring Instruments
type: BicsLevel4SubIndustry
type: Classifier
type: NamedIndividual
is sub industry of: Measurement Instruments
is anachronous version of: http://data.ga-group.nl/ics/bics/1710121310
is contemporary version of: http://data.ga-group.nl/ics/bics/16111310
is replaced by: http://data.ga-group.nl/ics/bics/2020/1710121310
is version of: http://data.ga-group.nl/ics/bics/16111310
is version of: http://data.ga-group.nl/ics/bics/1710121310
imported on: 2026-06-08T13:03:47.798Z
last refreshed on: 2026-06-08T13:03:47.798Z
source accessed on: 2019-12-03T20:05:01Z
source last accessed on: 2019-12-03T20:05:01Z
label: Elektrische Messinstrumente @de
label: Instrumentos de medição elétrica @pt
label: Instrumentos eléctricos de medición @es
label: Instruments de mesure élec @fr
label: Strumenti misurazione elett @it
label: Счетчики измерения электрич. @ru
label: 电动测量仪器 @zh
label: 電機檢測��器 @zh-hant
label: 電気計測器 @ja
label: 전기계측기 @ko
definition: This industry subgroup includes companies that manufacture instruments used to measure and test the characteristics of electricity and electrical systems. Such instruments include circuit and continuity testers, voltmeters and watt meters.
notation: 16111310
valid from: 2014-08-08
valid till: 2020-10-03

Fluid Meter & Counting Devices
type: BicsLevel4SubIndustry
type: Classifier
type: NamedIndividual
is sub industry of: Measurement Instruments
is anachronous version of: http://data.ga-group.nl/ics/bics/1710121311
is contemporary version of: http://data.ga-group.nl/ics/bics/16111311
is replaced by: http://data.ga-group.nl/ics/bics/2020/1710121311
is version of: http://data.ga-group.nl/ics/bics/16111311
is version of: http://data.ga-group.nl/ics/bics/1710121311
imported on: 2026-06-08T13:03:47.798Z
last refreshed on: 2026-06-08T13:03:47.798Z
source accessed on: 2019-12-03T20:05:01Z
source last accessed on: 2019-12-03T20:05:01Z
label: Compteurs pour fluides/dispositifs de comptage @fr
label: Contatori fluidi e dispositivi conteggio @it
label: Dispositivos de medição de pressão e contagem @pt
label: Dispositivos de medida líquidos @es
label: Flüssigkeitsmesser & Zählgeräte @de
label: Измер. приборы и счетч. для жидкостей @ru
label: 流量表与计量装置 @zh
label: 流量計・計量装置 @ja
label: 液體儀表及計數儀器 @zh-hant
label: 유량계&계량장치 @ko
definition: This industry subgroup includes companies that manufacture devices used to count and register variables, such as gas and water consumption.
notation: 16111311
valid from: 2014-08-08
valid till: 2020-10-03

Measuring & Control Devices
type: BicsLevel4SubIndustry
type: Classifier
type: NamedIndividual
is sub industry of: Measurement Instruments
is anachronous version of: http://data.ga-group.nl/ics/bics/1710121312
is contemporary version of: http://data.ga-group.nl/ics/bics/16111312
is replaced by: http://data.ga-group.nl/ics/bics/2020/1710121312
is version of: http://data.ga-group.nl/ics/bics/16111312
is version of: http://data.ga-group.nl/ics/bics/1710121312
imported on: 2026-06-08T13:03:47.798Z
last refreshed on: 2026-06-08T13:03:47.798Z
source accessed on: 2019-12-03T20:05:01Z
source last accessed on: 2019-12-03T20:05:01Z
label: Appareils de mesure et contrôle @fr
label: Dispositivi controllo e misurazione @it
label: Dispositivos de medição e controle @pt
label: Dispositivos de medida y control @es
label: Mess- & Kontrollgeräte @de
label: Измер. и регулирующ. устройства @ru
label: 测量与控制装置 @zh
label: 測定・制御装置 @ja
label: 量測及控制設備 @zh-hant
label: 계측&제어장치 @ko
definition: This industry subgroup includes companies that manufacture instruments and related devices for measuring, displaying, indicating, recording, transmitting and controlling industrial process variables.
notation: 16111312
valid from: 2014-08-08
valid till: 2020-10-03

Measurement Instruments
type: BicsLevel3Industry
type: Classifier
type: NamedIndividual
is industry of: Electrical Equipment
is anachronous version of: http://data.ga-group.nl/ics/bics/17101213
is contemporary version of: http://data.ga-group.nl/ics/bics/161113
is replaced by: http://data.ga-group.nl/ics/bics/2020/17101213
is version of: http://data.ga-group.nl/ics/bics/161113
is version of: http://data.ga-group.nl/ics/bics/17101213
imported on: 2026-06-08T13:03:47.798Z
last refreshed on: 2026-06-08T13:03:47.798Z
source accessed on: 2019-12-03T20:05:01Z
source last accessed on: 2019-12-03T20:05:01Z
label: Inst de medição @pt
label: Instrum medida @es
label: Instruments de mesure @fr
label: Messinstrumente @de
label: Strum misurazione @it
label: Измерит. инструменты @ru
label: 测量仪 @zh
label: 測定機器 @ja
label: 測量儀 @zh-hant
label: 측량도구 @ko
definition: This industry includes companies that design or manufacture devices used to test, measure and analyze processes and environmental conditions.
notation: 161113
valid from: 2014-08-08
valid till: 2020-10-03

Electronic Coil
type: BicsLevel4SubIndustry
type: Classifier
type: NamedIndividual
is sub industry of: Electrical Components
is anachronous version of: http://data.ga-group.nl/ics/bics/1710121410
is contemporary version of: http://data.ga-group.nl/ics/bics/16111410
is replaced by: http://data.ga-group.nl/ics/bics/2020/1710121410
is version of: http://data.ga-group.nl/ics/bics/16111410
is version of: http://data.ga-group.nl/ics/bics/1710121410
imported on: 2026-06-08T13:03:47.798Z
last refreshed on: 2026-06-08T13:03:47.798Z
source accessed on: 2019-12-03T20:05:01Z
source last accessed on: 2019-12-03T20:05:01Z
label: Bobina eletrônica @pt
label: Bobinas electrónicas @es
label: Bobine elettroniche @it
label: Elektronische Spulen @de
label: Serpentins électroniques @fr
label: Электронные катушки @ru
label: 电子线圈 @zh
label: 電子線圈 @zh-hant
label: 電子ｺｲﾙ @ja
label: 전자코일제조업 @ko
definition: This industry subgroup includes companies that manufacture electronic inductors, such as coils and transformers. Excludes electronic coils for power transmission or distribution (see Power Trans & Distr Components).
notation: 16111410
valid from: 2014-08-08
valid till: 2020-10-03

Electronic Connectors
type: BicsLevel4SubIndustry
type: Classifier
type: NamedIndividual
is sub industry of: Electrical Components
is anachronous version of: http://data.ga-group.nl/ics/bics/1710121411
is contemporary version of: http://data.ga-group.nl/ics/bics/16111411
is replaced by: http://data.ga-group.nl/ics/bics/2020/1710121411
is version of: http://data.ga-group.nl/ics/bics/16111411
is version of: http://data.ga-group.nl/ics/bics/1710121411
imported on: 2026-06-08T13:03:47.798Z
last refreshed on: 2026-06-08T13:03:47.798Z
source accessed on: 2019-12-03T20:05:01Z
source last accessed on: 2019-12-03T20:05:01Z
label: Conectores electrónicos @es
label: Conectores eletrônicos @pt
label: Connecteurs électroniques @fr
label: Connettori elettronici @it
label: Elektronische Anschlussteile @de
label: Электронные коннекторы @ru
label: 电子连接器 @zh
label: 電子連接器 @zh-hant
label: 電子ｺﾈｸﾀｰ @ja
label: 전자접속기제조업 @ko
definition: This industry subgroup includes companies that manufacture electronic connectors.
notation: 16111411
valid from: 2014-08-08
valid till: 2020-10-03

Industrial Electronics Equip
type: BicsLevel4SubIndustry
type: Classifier
type: NamedIndividual
is sub industry of: Electrical Components
is anachronous version of: http://data.ga-group.nl/ics/bics/1710121412
is contemporary version of: http://data.ga-group.nl/ics/bics/16111412
is replaced by: http://data.ga-group.nl/ics/bics/2020/1710121412
is version of: http://data.ga-group.nl/ics/bics/16111412
is version of: http://data.ga-group.nl/ics/bics/1710121412
imported on: 2026-06-08T13:03:47.798Z
last refreshed on: 2026-06-08T13:03:47.798Z
source accessed on: 2019-12-03T20:05:01Z
source last accessed on: 2019-12-03T20:05:01Z
label: Cap investiti elettr p/indus @it
label: Equipamento industrial eletrônico @pt
label: Equipo electrónico industrial @es
label: Industrieelektronikgeräte @de
label: Matériel électronique industriel @fr
label: Промышл. электроника - оборудование @ru
label: 工业电子资本设备 @zh
label: 工業用電子設備 @ja
label: 工業電子設備 @zh-hant
label: 산업전자설비 @ko
definition: This industry subgroup includes companies that manufacture electronics equipment and components used in industrial applications, as opposed to technological or communication applications.
notation: 16111412
valid from: 2014-08-08
valid till: 2020-10-03

Wire & Cable
type: BicsLevel4SubIndustry
type: Classifier
type: NamedIndividual
is sub industry of: Electrical Components
is anachronous version of: http://data.ga-group.nl/ics/bics/1710121413
is contemporary version of: http://data.ga-group.nl/ics/bics/16111413
is replaced by: http://data.ga-group.nl/ics/bics/2020/1710121413
is version of: http://data.ga-group.nl/ics/bics/16111413
is version of: http://data.ga-group.nl/ics/bics/1710121413
imported on: 2026-06-08T13:03:47.798Z
last refreshed on: 2026-06-08T13:03:47.798Z
source accessed on: 2019-12-03T20:05:01Z
source last accessed on: 2019-12-03T20:05:01Z
label: Alambre y cableado @es
label: Draht und Kabel @de
label: Fiação e cabo @pt
label: Fili e cavi @it
label: Fils et câbles @fr
label: Проводы и кабели @ru
label: 电线和电缆 @zh
label: 電線及電纜 @zh-hant
label: 전선 및 케이블 @ko
label: ﾜｲﾔ&ｹｰﾌﾞﾙ @ja
definition: This industry subgroup includes companies that manufacture current-carrying wiring and cable. Excludes fiber optic cables utilized for telecommunication (see Fiber Optic Equipment).
notation: 16111413
valid from: 2014-08-08
valid till: 2020-10-03

Electrical Components
type: BicsLevel3Industry
type: Classifier
type: NamedIndividual
is industry of: Electrical Equipment
is anachronous version of: http://data.ga-group.nl/ics/bics/17101214
is contemporary version of: http://data.ga-group.nl/ics/bics/161114
is replaced by: http://data.ga-group.nl/ics/bics/2020/17101214
is version of: http://data.ga-group.nl/ics/bics/161114
is version of: http://data.ga-group.nl/ics/bics/17101214
imported on: 2026-06-08T13:03:47.798Z
last refreshed on: 2026-06-08T13:03:47.798Z
source accessed on: 2019-12-03T20:05:01Z
source last accessed on: 2019-12-03T20:05:01Z
label: Comp elétricos @pt
label: Componenti elettriche @it
label: Composants électriques @fr
label: Comps eléctricos @es
label: Elektrische Komponenten @de
label: Электрические детали @ru
label: 电器元件 @zh
label: 電子部品 @ja
label: 電機零件 @zh-hant
label: 전기부품 @ko
definition: This industry includes companies that manufacture electrical components used for industrial purposes. Includes coils, wires and cables. Excludes electrical components used for technology hardware (see Electronics Component).
notation: 161114
valid from: 2014-08-08
valid till: 2020-10-03

Electrical Equipment
type: BicsLevel2IndustryGroup
type: Classifier
type: NamedIndividual
is industry group of: Industrials
is anachronous version of: http://data.ga-group.nl/ics/bics/171012
is contemporary version of: http://data.ga-group.nl/ics/bics/1611
is replaced by: http://data.ga-group.nl/ics/bics/2020/171012
is version of: http://data.ga-group.nl/ics/bics/1611
is version of: http://data.ga-group.nl/ics/bics/171012
imported on: 2026-06-08T13:03:47.798Z
last refreshed on: 2026-06-08T13:03:47.798Z
source accessed on: 2019-12-03T20:05:01Z
source last accessed on: 2019-12-03T20:05:01Z
label: Apparecchiature elettriche @it
label: Elektrische Geräte @de
label: Equipo eléctrico @es
label: Equiptos Elétricos @pt
label: Matériel électrique @fr
label: Электрооборудование @ru
label: 电力设备 @zh
label: 電機設備 @zh-hant
label: 電気機器 @ja
label: 전기장비 @ko
definition: This industry group includes companies that manufacture power, distribution and specialty transformers, as well as electric motors, generators, motor gensets, switchgear and switchboard apparatus, relays and industrial controls.
notation: 1611
valid from: 2014-08-08
valid till: 2020-10-03

Farm Tractors & Field Machinery
type: BicsLevel5Segment
type: Classifier
type: NamedIndividual
is level5 segment of: Farm Machinery & Equipment
is anachronous version of: http://data.ga-group.nl/ics/bics/171013101010
is contemporary version of: http://data.ga-group.nl/ics/bics/1612101010
is replaced by: http://data.ga-group.nl/ics/bics/2020/171013101010
is version of: http://data.ga-group.nl/ics/bics/1612101010
is version of: http://data.ga-group.nl/ics/bics/171013101010
imported on: 2026-06-08T13:03:47.798Z
last refreshed on: 2026-06-08T13:03:47.798Z
source accessed on: 2019-12-03T20:05:01Z
source last accessed on: 2019-12-03T20:05:01Z
label: Ackerschlepper & Feldmaschinen @de
label: Tracteurs et machines agricoles @fr
label: Tractores y maquinaria agrícola @es
label: Tratores agrícolas e maquinário de campo @pt
label: Trattori e macchinari agricoli @it
label: Сельскохоз. тракторы и машины @ru
label: 农用拖拉机与田间作业机械 @zh
label: 農業曳引車及農具機 @zh-hant
label: 農業ﾄﾗｸﾀｰ･耕作機械 @ja
label: 농업용 트랙터 & 농경지용 기계 @ko
definition: This segment includes companies that manufacture utility tractors, small and large row crop tractors, self-propelled combines and hay equipment.
notation: 1612101010
valid from: 2014-08-08
valid till: 2020-10-03

Implement & Irrigation Equip
type: BicsLevel5Segment
type: Classifier
type: NamedIndividual
is level5 segment of: Farm Machinery & Equipment
is anachronous version of: http://data.ga-group.nl/ics/bics/171013101011
is contemporary version of: http://data.ga-group.nl/ics/bics/1612101011
is replaced by: http://data.ga-group.nl/ics/bics/2020/171013101011
is version of: http://data.ga-group.nl/ics/bics/1612101011
is version of: http://data.ga-group.nl/ics/bics/171013101011
imported on: 2026-06-08T13:03:47.798Z
last refreshed on: 2026-06-08T13:03:47.798Z
source accessed on: 2019-12-03T20:05:01Z
source last accessed on: 2019-12-03T20:05:01Z
label: Attuazione e equipagg irrigazione @it
label: Equipamento de irrigação e implemento @pt
label: Equipo de aplicación e irrigación @es
label: Implementierungs- & Irrigationsausrüstung @de
label: Outils et équipements d'irrigation @fr
label: Ирригационное оборудование @ru
label: 实施与灌溉设备 @zh
label: 用具･灌漑設備 @ja
label: 農具及灌溉設備 @zh-hant
label: 기구 & 관개 장비 @ko
definition: This segment includes companies that manufacture accessories attached to tractors to perform duties. Such accessories can be pulled or pushed depending on application and type.
notation: 1612101011
valid from: 2014-08-08
valid till: 2020-10-03

Other Farm Equipment
type: BicsLevel5Segment
type: Classifier
type: Discontinued
type: NamedIndividual
is level5 segment of: Farm Machinery & Equipment
is contemporary version of: http://data.ga-group.nl/ics/bics/1612101012
is version of: http://data.ga-group.nl/ics/bics/1612101012
imported on: 2026-06-08T13:03:47.798Z
last refreshed on: 2026-06-08T13:03:47.798Z
source accessed on: 2019-12-03T20:05:01Z
source last accessed on: 2019-12-03T20:05:01Z
label: Altri equipagg agricoli @it
label: Autre équipements agricoles @fr
label: Otro equipo agrícola @es
label: Outros equipamentos para fazenda @pt
label: Sonstige Farmausrüstung @de
label: Др. фермерское оборуд-е @ru
label: その他農業機械 @ja
label: 其他农用设备 @zh
label: 其他農業設備 @zh-hant
label: 기타 농장 장비 @ko
definition: This segment includes companies that manufacture farm equipment not elsewhere classified.
notation: 1612101012
valid from: 2014-08-08
valid till: 2020-10-03

Farm Machinery & Equipment
type: BicsLevel4SubIndustry
type: Classifier
type: NamedIndividual
is sub industry of: Agricultural Machinery
is anachronous version of: http://data.ga-group.nl/ics/bics/1710131010
is contemporary version of: http://data.ga-group.nl/ics/bics/16121010
is replaced by: http://data.ga-group.nl/ics/bics/2020/1710131010
is version of: http://data.ga-group.nl/ics/bics/16121010
is version of: http://data.ga-group.nl/ics/bics/1710131010
imported on: 2026-06-08T13:03:47.798Z
last refreshed on: 2026-06-08T13:03:47.798Z
source accessed on: 2019-12-03T20:05:01Z
source last accessed on: 2019-12-03T20:05:01Z
label: Farmmaschinen & -zubehör @de
label: Macchinari e attrezzature agricole @it
label: Machines et équipements agricoles @fr
label: Maquinário e equipamentos agrícolas @pt
label: Maquinaria y equipo agrícola @es
label: Сельскохозяйственная техника и оборуд. @ru
label: 农用机械与设备 @zh
label: 農業機械設備 @zh-hant
label: 農業機械･設備 @ja
label: 농기계&장비 @ko
definition: This industry subgroup includes companies that manufacture farm tractors and other farm equipment.
notation: 16121010
valid from: 2014-08-08
valid till: 2020-10-03

Home Lawn & Garden Equipment
type: BicsLevel4SubIndustry
type: Classifier
type: NamedIndividual
is sub industry of: Agricultural Machinery
is anachronous version of: http://data.ga-group.nl/ics/bics/1710131011
is contemporary version of: http://data.ga-group.nl/ics/bics/16121011
is replaced by: http://data.ga-group.nl/ics/bics/2020/1710131011
is version of: http://data.ga-group.nl/ics/bics/16121011
is version of: http://data.ga-group.nl/ics/bics/1710131011
imported on: 2026-06-08T13:03:47.798Z
last refreshed on: 2026-06-08T13:03:47.798Z
source accessed on: 2019-12-03T20:05:01Z
source last accessed on: 2019-12-03T20:05:01Z
label: Attrezzi prato e giardino @it
label: Equipamentos de jardinagem doméstica @pt
label: Equipements pelouse et jardinage @fr
label: Equipo de césped y jardinería de vivienda @es
label: Rasenmäher & Gartengeräte @de
label: Оборуд. для дома, газона и сада @ru
label: 住宅用芝刈り機･園芸機器 @ja
label: 園藝用設備 @zh-hant
label: 家用草坪与园艺设备 @zh
label: 잔��� & 정원장비 @ko
definition: This industry subgroup includes companies that manufacture equipment used for non-commercial home and landscaping applications. Includes tractors or lawn mowers (under 40 hp), leaf blowers, hedge trimmers and snow blowers.
notation: 16121011
valid from: 2014-08-08
valid till: 2020-10-03

Agricultural Mach Parts & Svcs
type: BicsLevel4SubIndustry
type: Classifier
type: NamedIndividual
is sub industry of: Agricultural Machinery
is anachronous version of: http://data.ga-group.nl/ics/bics/1710131012
is contemporary version of: http://data.ga-group.nl/ics/bics/16121012
is replaced by: http://data.ga-group.nl/ics/bics/2020/1710131012
is version of: http://data.ga-group.nl/ics/bics/16121012
is version of: http://data.ga-group.nl/ics/bics/1710131012
imported on: 2026-06-08T13:03:47.798Z
last refreshed on: 2026-06-08T13:03:47.798Z
source accessed on: 2019-12-03T20:05:01Z
source last accessed on: 2019-12-03T20:05:01Z
label: Landwirtschaftsmaschinenteile & Dienste @de
label: Peças e serv maq agrícolas @pt
label: Pièces/serv machines agricoles @fr
label: Serv e parti macc agricoli @it
label: Servicios y partes de maquinaria agrícola @es
label: Обслуж. с/х техники и запчастей @ru
label: 农用机械零部件与服务 @zh
label: 農業機械部品･ｻｰﾋﾞｽ @ja
label: 農業機械零件及服務 @zh-hant
label: 농기계 부품 & 서비스 @ko
definition: This industry subgroup includes companies that manufacture parts used for self-propelled combines, tractors, hay equipment and implements.
notation: 16121012
valid from: 2014-08-08
valid till: 2020-10-03

Agricultural Machinery
type: BicsLevel3Industry
type: Classifier
type: NamedIndividual
is industry of: Machinery
is anachronous version of: http://data.ga-group.nl/ics/bics/17101310
is contemporary version of: http://data.ga-group.nl/ics/bics/161210
is replaced by: http://data.ga-group.nl/ics/bics/2020/17101310
is version of: http://data.ga-group.nl/ics/bics/161210
is version of: http://data.ga-group.nl/ics/bics/17101310
imported on: 2026-06-08T13:03:47.798Z
last refreshed on: 2026-06-08T13:03:47.798Z
source accessed on: 2019-12-03T20:05:01Z
source last accessed on: 2019-12-03T20:05:01Z
label: Landwirtschaftsmaschinen @de
label: Macchinari agricoli @it
label: Machines agricoles @fr
label: Maq agricultura @pt
label: Maquinaria agr @es
label: Сельхозтехника @ru
label: 农用机械 @zh
label: 農業機械 @zh-hant
label: 農業用機械 @ja
label: 농기계류 @ko
definition: This industry includes companies that manufacture agricultural machinery parts, farm machinery and equipment, and home lawn and garden equipment.
notation: 161210
valid from: 2014-08-08
valid till: 2020-10-03

Construction Machinery
type: BicsLevel4SubIndustry
type: Classifier
type: NamedIndividual
is sub industry of: Construction & Mining Machinery
is anachronous version of: http://data.ga-group.nl/ics/bics/1710131110
is contemporary version of: http://data.ga-group.nl/ics/bics/16121110
is replaced by: http://data.ga-group.nl/ics/bics/2020/1710131110
is version of: http://data.ga-group.nl/ics/bics/16121110
is version of: http://data.ga-group.nl/ics/bics/1710131110
imported on: 2026-06-08T13:03:47.798Z
last refreshed on: 2026-06-08T13:03:47.798Z
source accessed on: 2019-12-03T20:05:01Z
source last accessed on: 2019-12-03T20:05:01Z
label: Baumaschinen @de
label: Macchinari costruzione @it
label: Machines pour la construction @fr
label: Maquinário para construção @pt
label: Maquinaria de construcción @es
label: Строительная техника @ru
label: 建筑机械 @zh
label: 建設機械 @ja
label: 營建業機械 @zh-hant
label: 건설 기계 @ko
definition: This industry subgroup includes companies that manufacture construction equipment. Such equipment includes crawler tractors, hydraulic excavators, wheel loaders, rigid and articulated haulers, rubber-tracked loaders, skid steer loaders, loader backhoes, mini excavators, pavers, compactors, motor graders and cranes.
notation: 16121110
valid from: 2014-08-08
valid till: 2020-10-03

Mining Material Handling Equip
type: BicsLevel5Segment
type: Classifier
type: NamedIndividual
is level5 segment of: Mining Machinery & Equipment
is anachronous version of: http://data.ga-group.nl/ics/bics/171013111110
is contemporary version of: http://data.ga-group.nl/ics/bics/1612111110
is replaced by: http://data.ga-group.nl/ics/bics/2020/171013111110
is version of: http://data.ga-group.nl/ics/bics/1612111110
is version of: http://data.ga-group.nl/ics/bics/171013111110
imported on: 2026-06-08T13:03:47.798Z
last refreshed on: 2026-06-08T13:03:47.798Z
source accessed on: 2019-12-03T20:05:01Z
source last accessed on: 2019-12-03T20:05:01Z
label: App trattamento mat minerario @it
label: Bergbaumaterialtransportausrüstung @de
label: Equip de manutention de matériel minier @fr
label: Equip manuseio mat mineração @pt
label: Equipo de manejo de materiales mineros @es
label: Погруз.-разгруз. оборуд. для добыв. пром. @ru
label: 礦業物料處理設備製造 @zh-hant
label: 采矿材料处理设备 @zh
label: 鉱業材料運搬機器 @ja
label: 광업 자재 운반 장비 @ko
definition: This segment includes companies that manufacture material handling equipment for the mining, aggregates and construction industries.
notation: 1612111110
valid from: 2014-08-08
valid till: 2020-10-03

Surface Mining Machinery
type: BicsLevel5Segment
type: Classifier
type: NamedIndividual
is level5 segment of: Mining Machinery & Equipment
is anachronous version of: http://data.ga-group.nl/ics/bics/171013111111
is contemporary version of: http://data.ga-group.nl/ics/bics/1612111111
is replaced by: http://data.ga-group.nl/ics/bics/2020/171013111111
is version of: http://data.ga-group.nl/ics/bics/1612111111
is version of: http://data.ga-group.nl/ics/bics/171013111111
imported on: 2026-06-08T13:03:47.798Z
last refreshed on: 2026-06-08T13:03:47.798Z
source accessed on: 2019-12-03T20:05:01Z
source last accessed on: 2019-12-03T20:05:01Z
label: Macchinari estrazione in superficie @it
label: Machines mines à ciel ouvert @fr
label: Maquinário para mineração da superfície @pt
label: Minería superficial @es
label: Tagebaumaschinen @de
label: Оборуд. для наземной добычи @ru
label: 露天採掘機械 @ja
label: 露天采矿机械 @zh
label: 露天開採機械製造 @zh-hant
label: 노천탄광용기계 @ko
definition: This segment includes companies that manufacture surface mining machinery. Such machinery includes electric mining shovels, blasthole drills, draglines and mining trucks.
notation: 1612111111
valid from: 2014-08-08
valid till: 2020-10-03

Underground Mining Machinery
type: BicsLevel5Segment
type: Classifier
type: NamedIndividual
is level5 segment of: Mining Machinery & Equipment
is anachronous version of: http://data.ga-group.nl/ics/bics/171013111112
is contemporary version of: http://data.ga-group.nl/ics/bics/1612111112
is replaced by: http://data.ga-group.nl/ics/bics/2020/171013111112
is version of: http://data.ga-group.nl/ics/bics/1612111112
is version of: http://data.ga-group.nl/ics/bics/171013111112
imported on: 2026-06-08T13:03:47.798Z
last refreshed on: 2026-06-08T13:03:47.798Z
source accessed on: 2019-12-03T20:05:01Z
source last accessed on: 2019-12-03T20:05:01Z
label: Macchinari estrazione sotterranea @it
label: Machines mines souterraine @fr
label: Maquinário para mineração subterrânea @pt
label: Maquinaria de minería subterránea @es
label: Untertagebaumaschinen @de
label: Оборуд. для подземной добычи @ru
label: 地下採掘機械 @ja
label: 地下采矿机械 @zh
label: 地底採礦機械製造 @zh-hant
label: 지하탄광용기계 @ko
definition: This segment includes companies that manufacture underground mining machinery. Such machinery includes draglines, longwall shearers, stage loaders, roof supports, face conveyors, continuous haulage systems, batch haulage vehicles, shovels and excavators, and mining trucks.
notation: 1612111112
valid from: 2014-08-08
valid till: 2020-10-03

Mining Machinery & Equipment
type: BicsLevel4SubIndustry
type: Classifier
type: NamedIndividual
is sub industry of: Construction & Mining Machinery
is anachronous version of: http://data.ga-group.nl/ics/bics/1710131111
is contemporary version of: http://data.ga-group.nl/ics/bics/16121111
is replaced by: http://data.ga-group.nl/ics/bics/2020/1710131111
is version of: http://data.ga-group.nl/ics/bics/16121111
is version of: http://data.ga-group.nl/ics/bics/1710131111
imported on: 2026-06-08T13:03:47.798Z
last refreshed on: 2026-06-08T13:03:47.798Z
source accessed on: 2019-12-03T20:05:01Z
source last accessed on: 2019-12-03T20:05:01Z
label: Bergbaumaschinen & -ausrüstung @de
label: Macchinari e attrezzature minerari @it
label: Machines et équipements mines @fr
label: Maquinário para mineração e equipamentos @pt
label: Maquinaria y equipo de minería @es
label: Горнодоб. техника и оборуд. @ru
label: 礦業機械設備 @zh-hant
label: 采矿机械与设备 @zh
label: 鉱業機械･器具 @ja
label: 채굴기계&장비 @ko
definition: This industry subgroup includes companies that manufacture elevators and conveyors for outdoor use, boring and cutting machinery, mortar mixers, and earth movers.
notation: 16121111
valid from: 2014-08-08
valid till: 2020-10-03

Const & Mining Mach Parts & Svcs
type: BicsLevel4SubIndustry
type: Classifier
type: NamedIndividual
is sub industry of: Construction & Mining Machinery
is anachronous version of: http://data.ga-group.nl/ics/bics/1710131112
is contemporary version of: http://data.ga-group.nl/ics/bics/16121112
is replaced by: http://data.ga-group.nl/ics/bics/2020/1710131112
is version of: http://data.ga-group.nl/ics/bics/16121112
is version of: http://data.ga-group.nl/ics/bics/1710131112
imported on: 2026-06-08T13:03:47.798Z
last refreshed on: 2026-06-08T13:03:47.798Z
source accessed on: 2019-12-03T20:05:01Z
source last accessed on: 2019-12-03T20:05:01Z
label: Bau- & Bergbaumaschinenteile & Dienste @de
label: Peças e serv construção e mineração @pt
label: Pièces/serv mach construction/mines @fr
label: Serv e parti macc costruz e minerario @it
label: Servicios y partes construcción y minería @es
label: Обслуж. и произв. запч. для горнодоб. @ru
label: 建筑与采矿机械零部件与服务 @zh
label: 建設･鉱業機械部品･ｻｰﾋﾞｽ @ja
label: 營建及礦業售後服務及零件 @zh-hant
label: 건설 & 광업 기계 부품 & 서비스 @ko
definition: This industry subgroup includes companies that manufacture parts and accessories for construction and mining machinery.
notation: 16121112
valid from: 2014-08-08
valid till: 2020-10-03

Construction & Mining Machinery
type: BicsLevel3Industry
type: Classifier
type: NamedIndividual
is industry of: Machinery
is anachronous version of: http://data.ga-group.nl/ics/bics/17101311
is contemporary version of: http://data.ga-group.nl/ics/bics/161211
is replaced by: http://data.ga-group.nl/ics/bics/2020/17101311
is version of: http://data.ga-group.nl/ics/bics/161211
is version of: http://data.ga-group.nl/ics/bics/17101311
imported on: 2026-06-08T13:03:47.798Z
last refreshed on: 2026-06-08T13:03:47.798Z
source accessed on: 2019-12-03T20:05:01Z
source last accessed on: 2019-12-03T20:05:01Z
label: Bau- & Bergbaumaschinen @de
label: Macchinari costruzione e minerari @it
label: Machines construction/mines @fr
label: Maquinário para construção e mineração @pt
label: Maquinaria de construcción y minería @es
label: Строительные и горно-шахтные машины @ru
label: 建筑与采矿机械 @zh
label: 建設･鉱業用機械 @ja
label: 營建及礦業機械 @zh-hant
label: 건설 & 광업기계 @ko
definition: This industry includes companies that manufacture construction and mining machinery and parts. Products include earthmoving equipment, rubber tracked loaders, compact equipment, paving machinery and cranes.
notation: 161211
valid from: 2014-08-08
valid till: 2020-10-03

Industrial Engines
type: BicsLevel4SubIndustry
type: Classifier
type: NamedIndividual
is sub industry of: Engine & Transmission
is anachronous version of: http://data.ga-group.nl/ics/bics/1710131210
is contemporary version of: http://data.ga-group.nl/ics/bics/16121210
is replaced by: http://data.ga-group.nl/ics/bics/2020/1710131210
is version of: http://data.ga-group.nl/ics/bics/16121210
is version of: http://data.ga-group.nl/ics/bics/1710131210
imported on: 2026-06-08T13:03:47.798Z
last refreshed on: 2026-06-08T13:03:47.798Z
source accessed on: 2019-12-03T20:05:01Z
source last accessed on: 2019-12-03T20:05:01Z
label: Industriemotoren @de
label: Moteurs industriels @fr
label: Motores industriais @pt
label: Motores industriales @es
label: Motori industriali @it
label: Промышл. двигатели @ru
label: 工业发动机 @zh
label: 工業引擎 @zh-hant
label: 工業用ｴﾝｼﾞﾝ @ja
label: 산업용 엔진 @ko
definition: This industry subgroup includes companies that manufacture combustion piston engines for use in industrial engines, such as steam, hydraulic, wind and gas turbines. They may also manufacture engines for marine craft and rail trains. Excludes airplane, vehicle or motorcycle engines.
notation: 16121210
valid from: 2014-08-08
valid till: 2020-10-03

Power Transmission & Gear
type: BicsLevel4SubIndustry
type: Classifier
type: NamedIndividual
is sub industry of: Engine & Transmission
is anachronous version of: http://data.ga-group.nl/ics/bics/1710131211
is contemporary version of: http://data.ga-group.nl/ics/bics/16121211
is replaced by: http://data.ga-group.nl/ics/bics/2020/1710131211
is version of: http://data.ga-group.nl/ics/bics/16121211
is version of: http://data.ga-group.nl/ics/bics/1710131211
imported on: 2026-06-08T13:03:47.798Z
last refreshed on: 2026-06-08T13:03:47.798Z
source accessed on: 2019-12-03T20:05:01Z
source last accessed on: 2019-12-03T20:05:01Z
label: Engrenages et transmission mécanique @fr
label: Equp de engr e transmissão de energia @pt
label: Ingranaggi e trazione elettrica @it
label: Kraftübertragung & Getriebe @de
label: Transmisión eléctrica @es
label: Зубч. передачи и аппаратура @ru
label: 动力传输与齿轮 @zh
label: 動力伝導装置･歯車 @ja
label: 機械動力傳動設備 @zh-hant
label: 전동장치 & 기어 @ko
definition: This industry subgroup includes companies that manufacture transmissions and related components.
notation: 16121211
valid from: 2014-08-08
valid till: 2020-10-03

Gear
type: BicsLevel4SubIndustry
type: Classifier
type: NamedIndividual
is sub industry of: Engine & Transmission
is anachronous version of: http://data.ga-group.nl/ics/bics/1710131212
is contemporary version of: http://data.ga-group.nl/ics/bics/16121212
is replaced by: http://data.ga-group.nl/ics/bics/2020/1710131212
is version of: http://data.ga-group.nl/ics/bics/16121212
is version of: http://data.ga-group.nl/ics/bics/1710131212
imported on: 2026-06-08T13:03:47.798Z
last refreshed on: 2026-06-08T13:03:47.798Z
source accessed on: 2019-12-03T20:05:01Z
source last accessed on: 2019-12-03T20:05:01Z
label: Commutatori @it
label: Engranaje @es
label: Engrenages @fr
label: Fab equip @pt
label: Getriebe @de
label: З/части промышл. приводов @ru
label: 歯車 @ja
label: 齒輪 @zh-hant
label: 齿轮 @zh
label: 산업용 동력전달장치 부품 제조 @ko
definition: This industry subgroup includes companies that manufacture gears used in drivetrain components for various applications.
notation: 16121212
valid from: 2014-08-08
valid till: 2020-10-03

Engine & Transmission
type: BicsLevel3Industry
type: Classifier
type: NamedIndividual
is industry of: Machinery
is anachronous version of: http://data.ga-group.nl/ics/bics/17101312
is contemporary version of: http://data.ga-group.nl/ics/bics/161212
is replaced by: http://data.ga-group.nl/ics/bics/2020/17101312
is version of: http://data.ga-group.nl/ics/bics/161212
is version of: http://data.ga-group.nl/ics/bics/17101312
imported on: 2026-06-08T13:03:47.798Z
last refreshed on: 2026-06-08T13:03:47.798Z
source accessed on: 2019-12-03T20:05:01Z
source last accessed on: 2019-12-03T20:05:01Z
label: Moteurs et transmissions @fr
label: Motor e trans @pt
label: Motore e trasmissione @it
label: Motoren & Getriebe @de
label: Motores y transm @es
label: Моторы и оборуд. для электроэн. @ru
label: 引擎与变速箱 @zh
label: 引擎及傳動設備 @zh-hant
label: 엔진&전동장치 @ko
label: ｴﾝｼﾞﾝ･ﾄﾗﾝｽﾐｯｼｮﾝ @ja
definition: This industry includes companies that manufacture mechanical power equipment, transmission shafts, cranks, camshafts, crankshafts, gears, gearboxes and couplings, and fully assembled internal combustion engines.
notation: 161212
valid from: 2014-08-08
valid till: 2020-10-03

Ind Process Automation Mach
type: BicsLevel4SubIndustry
type: Classifier
type: NamedIndividual
is sub industry of: Factory Automation Equipment
is anachronous version of: http://data.ga-group.nl/ics/bics/1710131310
is contemporary version of: http://data.ga-group.nl/ics/bics/16121310
is replaced by: http://data.ga-group.nl/ics/bics/2020/1710131310
is version of: http://data.ga-group.nl/ics/bics/16121310
is version of: http://data.ga-group.nl/ics/bics/1710131310
imported on: 2026-06-08T13:03:47.798Z
last refreshed on: 2026-06-08T13:03:47.798Z
source accessed on: 2019-12-03T20:05:01Z
source last accessed on: 2019-12-03T20:05:01Z
label: Ind. Prozessautomatisierungsmasch. @de
label: Macc automazione processo ind @it
label: Machine automatisation process ind @fr
label: Maq de automação de processo ind @pt
label: Maq de automatización de proceso ind @es
label: Оборуд. для автомат. пром. процессов @ru
label: 工业流程自动化机械 @zh
label: 工業流程自動化機器 @zh-hant
label: 産業工程自動化制御機械 @ja
label: 산업용프로세스 자동화기계 @ko
definition: This industry subgroup includes companies that manufacture industrial process automation machinery. Such machinery includes systems designed to monitor and respond to industrial variables in the production process.
notation: 16121310
valid from: 2014-08-08
valid till: 2020-10-03

Industrial Robot
type: BicsLevel4SubIndustry
type: Classifier
type: NamedIndividual
is sub industry of: Factory Automation Equipment
is anachronous version of: http://data.ga-group.nl/ics/bics/1710131311
is contemporary version of: http://data.ga-group.nl/ics/bics/16121311
is replaced by: http://data.ga-group.nl/ics/bics/2020/1710131311
is version of: http://data.ga-group.nl/ics/bics/16121311
is version of: http://data.ga-group.nl/ics/bics/1710131311
imported on: 2026-06-08T13:03:47.798Z
last refreshed on: 2026-06-08T13:03:47.798Z
source accessed on: 2019-12-03T20:05:01Z
source last accessed on: 2019-12-03T20:05:01Z
label: Industrieroboter @de
label: Robôs industriais @pt
label: Robot industrial @es
label: Robot industriali @it
label: Robots industriels @fr
label: Промышл. роботы @ru
label: 工业机器人 @zh
label: 工業機器人 @zh-hant
label: 産業用ﾛﾎﾞｯﾄ @ja
label: 산업용로봇제조업 @ko
definition: This industry subgroup includes companies that manufacture industrial robots, such as robots used to manufacture vehicles and computers.
notation: 16121311
valid from: 2014-08-08
valid till: 2020-10-03

Other Robotics Machinery
type: BicsLevel4SubIndustry
type: Classifier
type: Discontinued
type: NamedIndividual
is sub industry of: Factory Automation Equipment
is contemporary version of: http://data.ga-group.nl/ics/bics/16121312
is version of: http://data.ga-group.nl/ics/bics/16121312
imported on: 2026-06-08T13:03:47.798Z
last refreshed on: 2026-06-08T13:03:47.798Z
source accessed on: 2019-12-03T20:05:01Z
source last accessed on: 2019-12-03T20:05:01Z
label: Altri macchinari robotica @it
label: Autres machines de robotique @fr
label: Otra maquinaria de robots @es
label: Outros maquinários robóticos @pt
label: Sonstige Robotermaschinen @de
label: Прочее роботезир. маш. оборуд. @ru
label: その他ﾛﾎﾞｯﾄ機械 @ja
label: 其他机器人机械 @zh
label: 其他機器人機器 @zh-hant
label: 기타 로봇 기계류 @ko
definition: This industry subgroup includes companies that manufacture other robotics machinery and components not elsewhere classified.
notation: 16121312
valid from: 2014-08-08
valid till: 2020-10-03

Relay & Industrial Control
type: BicsLevel4SubIndustry
type: Classifier
type: NamedIndividual
is sub industry of: Factory Automation Equipment
is anachronous version of: http://data.ga-group.nl/ics/bics/1710131312
is contemporary version of: http://data.ga-group.nl/ics/bics/16121313
is replaced by: http://data.ga-group.nl/ics/bics/2020/1710131312
is version of: http://data.ga-group.nl/ics/bics/16121313
is version of: http://data.ga-group.nl/ics/bics/1710131312
imported on: 2026-06-08T13:03:47.798Z
last refreshed on: 2026-06-08T13:03:47.798Z
source accessed on: 2019-12-03T20:05:01Z
source last accessed on: 2019-12-03T20:05:01Z
label: Relè e controllo Industriale @it
label: Relais und Regeltechnik @de
label: Relais/contrôles industriels @fr
label: Relevo y control industrial @es
label: Retransmissão e controle industrial @pt
label: Реле и средства управления @ru
label: 繼電器及工業控制器 @zh-hant
label: 继电器与工业控制 @zh
label: 릴레이&산업용제어장치 @ko
label: ﾘﾚｰ･産業制御 @ja
definition: This industry subgroup includes companies that manufacture relay and industrial control machinery. Products include electromagnetic brakes and clutches, armature relays, crane and hoist controls, and solenoid switches.
notation: 16121313
valid from: 2014-08-08
valid till: 2020-10-03

Other Factory Automation Mach
type: BicsLevel4SubIndustry
type: Classifier
type: Discontinued
type: NamedIndividual
is sub industry of: Factory Automation Equipment
is contemporary version of: http://data.ga-group.nl/ics/bics/16121314
is version of: http://data.ga-group.nl/ics/bics/16121314
imported on: 2026-06-08T13:03:47.798Z
last refreshed on: 2026-06-08T13:03:47.798Z
source accessed on: 2019-12-03T20:05:01Z
source last accessed on: 2019-12-03T20:05:01Z
label: Altre macc automazione fabbrica @it
label: Autres mach d'automatisation d'usines @fr
label: Otra maquinaria para automatización de fábricas @es
label: Outros maquinários de automação de factory @pt
label: Sonst. Fabrikautomatisierungsmasch. @de
label: Прочего оборуд. для пром. автоматиз. @ru
label: その他工場自動化機械 @ja
label: 其他工厂自动化机械 @zh
label: 其他工廠自動化機器 @zh-hant
label: 기타 공장 자동화 기계 @ko
definition: This industry subgroup includes companies that manufacture other factory automation machinery not elsewhere classified.
notation: 16121314
valid from: 2014-08-08
valid till: 2020-10-03

Factory Automation Parts & Svcs
type: BicsLevel4SubIndustry
type: Classifier
type: NamedIndividual
is sub industry of: Factory Automation Equipment
is anachronous version of: http://data.ga-group.nl/ics/bics/1710131313
is contemporary version of: http://data.ga-group.nl/ics/bics/16121315
is replaced by: http://data.ga-group.nl/ics/bics/2020/1710131313
is version of: http://data.ga-group.nl/ics/bics/16121315
is version of: http://data.ga-group.nl/ics/bics/1710131313
imported on: 2026-06-08T13:03:47.798Z
last refreshed on: 2026-06-08T13:03:47.798Z
source accessed on: 2019-12-03T20:05:01Z
source last accessed on: 2019-12-03T20:05:01Z
label: Fabrikautomatisierungsteile & Dienste @de
label: Partes y servicios de automatización de fábricas @es
label: Pièces/serv automat d'usines @fr
label: Serv e parti automazione fabbrica @it
label: Serv e peças automação factory @pt
label: Запч. и обслуж. для пром. автоматики @ru
label: 工厂自动化零部件与服务 @zh
label: 工場自動化部品･ｻｰﾋﾞｽ @ja
label: 工廠自動化零件及服務 @zh-hant
label: 공장자동화 부품 & 서비스 @ko
definition: This industry subgroup includes companies that have aftermarket sales exposure to the factory automation sector and does not include original equipment sales.
notation: 16121315
valid from: 2014-08-08
valid till: 2020-10-03

Factory Automation Equipment
type: BicsLevel3Industry
type: Classifier
type: NamedIndividual
is industry of: Machinery
is anachronous version of: http://data.ga-group.nl/ics/bics/17101313
is contemporary version of: http://data.ga-group.nl/ics/bics/161213
is replaced by: http://data.ga-group.nl/ics/bics/2020/17101313
is version of: http://data.ga-group.nl/ics/bics/161213
is version of: http://data.ga-group.nl/ics/bics/17101313
imported on: 2026-06-08T13:03:47.798Z
last refreshed on: 2026-06-08T13:03:47.798Z
source accessed on: 2019-12-03T20:05:01Z
source last accessed on: 2019-12-03T20:05:01Z
label: Equipamento de automação de factory @pt
label: Equipements d'automatisation d'usines @fr
label: Equipo de automatización de fábricas @es
label: Fabrikautomatisierungsausrüstung @de
label: Macchinari automatizzazione fabbrica @it
label: Оборуд. для автомат. произв. @ru
label: 工厂自动化设备 @zh
label: 工場自動化機器 @ja
label: 工廠自動化設備 @zh-hant
label: 공장 자동화 장비 @ko
definition: This industry includes companies that manufacture equipment used in manufacturing facilities. Such equipment includes robots, linear actuation devices and automated production equipment (assembly machinery, automated welding machines and sorters).
notation: 161213
valid from: 2014-08-08
valid till: 2020-10-03

Air & Gas Compressor
type: BicsLevel4SubIndustry
type: Classifier
type: NamedIndividual
is sub industry of: Flow Control Equipment
is anachronous version of: http://data.ga-group.nl/ics/bics/1710131410
is contemporary version of: http://data.ga-group.nl/ics/bics/16121410
is replaced by: http://data.ga-group.nl/ics/bics/2020/1710131410
is version of: http://data.ga-group.nl/ics/bics/16121410
is version of: http://data.ga-group.nl/ics/bics/1710131410
imported on: 2026-06-08T13:03:47.798Z
last refreshed on: 2026-06-08T13:03:47.798Z
source accessed on: 2019-12-03T20:05:01Z
source last accessed on: 2019-12-03T20:05:01Z
label: Compresor de aire y gas @es
label: Compresseurs à air/gaz @fr
label: Compressor de ar e gás @pt
label: Compressori aria e gas @it
label: Luftdruck- & Gaskompressoren @de
label: Воздушные и газовые компрес. @ru
label: 空气与气体压缩机 @zh
label: 空気・ｶﾞｽ圧縮機 @ja
label: 空氣壓縮機 @zh-hant
label: 공기 및 가스압축기 @ko
definition: This industry subgroup includes companies that manufacture equipment that increases the pressure of air or gas through a pipe.
notation: 16121410
valid from: 2014-08-08
valid till: 2020-10-03

Fluid Power Cylinder & Actuator
type: BicsLevel4SubIndustry
type: Classifier
type: NamedIndividual
is sub industry of: Flow Control Equipment
is anachronous version of: http://data.ga-group.nl/ics/bics/1710131411
is contemporary version of: http://data.ga-group.nl/ics/bics/16121411
is replaced by: http://data.ga-group.nl/ics/bics/2020/1710131411
is version of: http://data.ga-group.nl/ics/bics/16121411
is version of: http://data.ga-group.nl/ics/bics/1710131411
imported on: 2026-06-08T13:03:47.798Z
last refreshed on: 2026-06-08T13:03:47.798Z
source accessed on: 2019-12-03T20:05:01Z
source last accessed on: 2019-12-03T20:05:01Z
label: Attuatori e cilindri a fluido @it
label: Cilindro de transmissão hidráulica e atuador @pt
label: Cilindro y brazos acc eléctr fluidos @es
label: Cylindres/actionneurs hydrauliques @fr
label: Fluidzylinder & -aktuatoren @de
label: Гидроцил. и приводы @ru
label: 流体ｼﾘﾝﾀﾞｰ･作動装置 @ja
label: 液压缸和传动装置 @zh
label: 液壓氣動瓶及促動器 @zh-hant
label: 유체동력실린더&작동기 @ko
definition: This industry subgroup includes companies that manufacture cylinders and actuators that are used to convert fluid power to linear or rotary mechanical power.
notation: 16121411
valid from: 2014-08-08
valid till: 2020-10-03

Fluid Power Pump & Motor
type: BicsLevel4SubIndustry
type: Classifier
type: NamedIndividual
is sub industry of: Flow Control Equipment
is anachronous version of: http://data.ga-group.nl/ics/bics/1710131412
is contemporary version of: http://data.ga-group.nl/ics/bics/16121412
is replaced by: http://data.ga-group.nl/ics/bics/2020/1710131412
is version of: http://data.ga-group.nl/ics/bics/16121412
is version of: http://data.ga-group.nl/ics/bics/1710131412
imported on: 2026-06-08T13:03:47.798Z
last refreshed on: 2026-06-08T13:03:47.798Z
source accessed on: 2019-12-03T20:05:01Z
source last accessed on: 2019-12-03T20:05:01Z
label: Bomba de transmissão hidráulica e motor @pt
label: Bombas y motores eléctricas de fluidos @es
label: Fluidpumpen und -motoren @de
label: Moteurs/pompes hydrauliques @fr
label: Pompe e motori idraulici @it
label: Гидравл. насосы и моторы @ru
label: 流体動力ﾎﾟﾝﾌﾟ･ﾓｰﾀｰ @ja
label: 液压泵与马达 @zh
label: 液壓氣動幫浦及馬達 @zh-hant
label: 유체동력펌프&모터 @ko
definition: This industry subgroup includes companies that manufacture pumps and motors that convert mechanical power to fluid power.
notation: 16121412
valid from: 2014-08-08
valid till: 2020-10-03

Fluid Power Valve
type: BicsLevel4SubIndustry
type: Classifier
type: NamedIndividual
is sub industry of: Flow Control Equipment
is anachronous version of: http://data.ga-group.nl/ics/bics/1710131413
is contemporary version of: http://data.ga-group.nl/ics/bics/16121413
is replaced by: http://data.ga-group.nl/ics/bics/2020/1710131413
is version of: http://data.ga-group.nl/ics/bics/16121413
is version of: http://data.ga-group.nl/ics/bics/1710131413
imported on: 2026-06-08T13:03:47.798Z
last refreshed on: 2026-06-08T13:03:47.798Z
source accessed on: 2019-12-03T20:05:01Z
source last accessed on: 2019-12-03T20:05:01Z
label: Fluidventile @de
label: Soupapes hydrauliques @fr
label: Válvula de transmissão hidráulica @pt
label: Válvulas eléctricas de fluidos @es
label: Valvole fluidi @it
label: Гидравл. клапаны и шланг. арматура @ru
label: 流体動力ﾊﾞﾙﾌﾞ @ja
label: 流體傳動活閥 @zh-hant
label: 液压阀 @zh
label: 유체동력밸브 @ko
definition: This industry subgroup includes companies that manufacture valves that regulate the passage of fluids through the use of hydraulics or thermostatic controls.
notation: 16121413
valid from: 2014-08-08
valid till: 2020-10-03

Industrial Valve
type: BicsLevel4SubIndustry
type: Classifier
type: NamedIndividual
is sub industry of: Flow Control Equipment
is anachronous version of: http://data.ga-group.nl/ics/bics/1710131414
is contemporary version of: http://data.ga-group.nl/ics/bics/16121414
is replaced by: http://data.ga-group.nl/ics/bics/2020/1710131414
is version of: http://data.ga-group.nl/ics/bics/16121414
is version of: http://data.ga-group.nl/ics/bics/1710131414
imported on: 2026-06-08T13:03:47.798Z
last refreshed on: 2026-06-08T13:03:47.798Z
source accessed on: 2019-12-03T20:05:01Z
source last accessed on: 2019-12-03T20:05:01Z
label: Industriearmaturen @de
label: Soupapes industrielles @fr
label: Válvula industrial @pt
label: Válvulas indus @es
label: Valvole industriali @it
label: Промышл. клапаны @ru
label: 工业阀门 @zh
label: 工業用金屬活閥 @zh-hant
label: 工業用ﾊﾞﾙﾌﾞ @ja
label: 산업용밸브 제조업 @ko
definition: This industry subgroup includes companies that manufacture valves that regulate the passage of fluids in industrial applications.
notation: 16121414
valid from: 2014-08-08
valid till: 2020-10-03

Measuring & Dispensing Pump
type: BicsLevel4SubIndustry
type: Classifier
type: NamedIndividual
is sub industry of: Flow Control Equipment
is anachronous version of: http://data.ga-group.nl/ics/bics/1710131415
is contemporary version of: http://data.ga-group.nl/ics/bics/16121415
is replaced by: http://data.ga-group.nl/ics/bics/2020/1710131415
is version of: http://data.ga-group.nl/ics/bics/16121415
is version of: http://data.ga-group.nl/ics/bics/1710131415
imported on: 2026-06-08T13:03:47.798Z
last refreshed on: 2026-06-08T13:03:47.798Z
source accessed on: 2019-12-03T20:05:01Z
source last accessed on: 2019-12-03T20:05:01Z
label: Bomba de medição e distribuição @pt
label: Bombas de medición y suministro @es
label: Maß- & Verteilungspumpen @de
label: Misurazione e pompe erogazione @it
label: Pompes distribution/mesure @fr
label: Измерит. и раздат. насосы @ru
label: 計量ﾎﾟﾝﾌﾟ･調剤ﾎ���ﾝﾌﾟ @ja
label: 计量与分配泵 @zh
label: 量測及分配用幫浦 @zh-hant
label: 계량 및 디스펜서 펌프 @ko
definition: This industry subgroup includes companies that manufacture pumps used for measuring and dispensing fluids.
notation: 16121415
valid from: 2014-08-08
valid till: 2020-10-03

Engineered Products
type: BicsLevel5Segment
type: Classifier
type: Discontinued
type: NamedIndividual
is level5 segment of: Pump & Pumping Equipment
is contemporary version of: http://data.ga-group.nl/ics/bics/1612141610
is version of: http://data.ga-group.nl/ics/bics/1612141610
imported on: 2026-06-08T13:03:47.798Z
last refreshed on: 2026-06-08T13:03:47.798Z
source accessed on: 2019-12-03T20:05:01Z
source last accessed on: 2019-12-03T20:05:01Z
label: Prodotti fabbricati @it
label: Productos fabricados @es
label: Produits d'ingénierie @fr
label: Produtos de engenharia @pt
label: Technisierte Produkte @de
label: Инженерная продукция @ru
label: 工程产品 @zh
label: 工程產品 @zh-hant
label: 技術製品 @ja
label: 공학제품 @ko
definition: This segment includes companies that produce highly engineered pumps and pump systems as well as their related products.
notation: 1612141610
valid from: 2014-08-08
valid till: 2020-10-03

Industrial Products
type: BicsLevel5Segment
type: Classifier
type: Discontinued
type: NamedIndividual
is level5 segment of: Pump & Pumping Equipment
is contemporary version of: http://data.ga-group.nl/ics/bics/1612141611
is version of: http://data.ga-group.nl/ics/bics/1612141611
imported on: 2026-06-08T13:03:47.798Z
last refreshed on: 2026-06-08T13:03:47.798Z
source accessed on: 2019-12-03T20:05:01Z
source last accessed on: 2019-12-03T20:05:01Z
label: Industrieprodukte @de
label: Prodotti industriali @it
label: Productos industriales @es
label: Produits industriels @fr
label: Produtos industriais @pt
label: Индустриальная продукция @ru
label: 工业产品 @zh
label: 工業產品 @zh-hant
label: 産業用製品 @ja
label: 산업용 상품 @ko
definition: This segment includes companies that produce preconfigured/standard pumps, pump systems and related products.
notation: 1612141611
valid from: 2014-08-08
valid till: 2020-10-03

Pump & Pumping Equipment
type: BicsLevel4SubIndustry
type: Classifier
type: NamedIndividual
is sub industry of: Flow Control Equipment
is anachronous version of: http://data.ga-group.nl/ics/bics/1710131416
is contemporary version of: http://data.ga-group.nl/ics/bics/16121416
is replaced by: http://data.ga-group.nl/ics/bics/2020/1710131416
is version of: http://data.ga-group.nl/ics/bics/16121416
is version of: http://data.ga-group.nl/ics/bics/1710131416
imported on: 2026-06-08T13:03:47.798Z
last refreshed on: 2026-06-08T13:03:47.798Z
source accessed on: 2019-12-03T20:05:01Z
source last accessed on: 2019-12-03T20:05:01Z
label: Bomba e equipamento para bombas @pt
label: Bombas y su equipo @es
label: Pompe e attrezzature pompaggio @it
label: Pompes et équipements de pompage @fr
label: Pumpen & Pumpausrüstung @de
label: Насосы и оборуд. @ru
label: 幫浦及抽唧設備 @zh-hant
label: 泵与泵送设备 @zh
label: 펌프 및 펌프작용 장비 @ko
label: ﾎﾟﾝﾌﾟ･ﾎﾟﾝﾌﾟ装置 @ja
definition: This industry subgroup includes companies that manufacture equipment used to move fluids.
notation: 16121416
valid from: 2014-08-08
valid till: 2020-10-03

Flow Control Equip Parts & Svcs
type: BicsLevel4SubIndustry
type: Classifier
type: NamedIndividual
is sub industry of: Flow Control Equipment
is anachronous version of: http://data.ga-group.nl/ics/bics/1710131417
is contemporary version of: http://data.ga-group.nl/ics/bics/16121417
is replaced by: http://data.ga-group.nl/ics/bics/2020/1710131417
is version of: http://data.ga-group.nl/ics/bics/16121417
is version of: http://data.ga-group.nl/ics/bics/1710131417
imported on: 2026-06-08T13:03:47.798Z
last refreshed on: 2026-06-08T13:03:47.798Z
source accessed on: 2019-12-03T20:05:01Z
source last accessed on: 2019-12-03T20:05:01Z
label: Flusskontrollausrüstungsteile & Dienste @de
label: Partes de equipo de control de flujo y servicios @es
label: Peças e serv controle de fluxo @pt
label: Pièces/serv équip contrôle de débit @fr
label: Serv e comp app controllo flusso @it
label: Запчасти и обслуж. оборуд. @ru
label: 流量控制设备零部件与服务 @zh
label: 流量控制零件及服務 @zh-hant
label: 유량 제어, 부품 & 서비스 @ko
label: ﾌﾛｰ制御機器部品･ｻｰﾋﾞｽ @ja
definition: This industry subgroup includes all companies that have aftermarket sales and activities including servicing/maintenance contracts, space and replacement parts and consumable products.
notation: 16121417
valid from: 2014-08-08
valid till: 2020-10-03

Flow Control Equipment
type: BicsLevel3Industry
type: Classifier
type: NamedIndividual
is industry of: Machinery
is anachronous version of: http://data.ga-group.nl/ics/bics/17101314
is contemporary version of: http://data.ga-group.nl/ics/bics/161214
is replaced by: http://data.ga-group.nl/ics/bics/2020/17101314
is version of: http://data.ga-group.nl/ics/bics/161214
is version of: http://data.ga-group.nl/ics/bics/17101314
imported on: 2026-06-08T13:03:47.798Z
last refreshed on: 2026-06-08T13:03:47.798Z
source accessed on: 2019-12-03T20:05:01Z
source last accessed on: 2019-12-03T20:05:01Z
label: App controllo flusso @it
label: Eq control de flujo @es
label: Equip controle flx @pt
label: Equipements de contrôle de débit @fr
label: Flusskontrollgeräte @de
label: Регуляторы расхода @ru
label: 流量控制設備 @zh-hant
label: 流量控制设备 @zh
label: 유량제어장비 @ko
label: ﾌﾛｰ制御機器 @ja
definition: This industry includes companies that manufacture equipment used in hydraulic as well as fluid, gas and liquid handling equipment such as control valves, pressure regulators and pneumatics electronic instrumentation.
notation: 161214
valid from: 2014-08-08
valid till: 2020-10-03

Automatic Vending Machinery
type: BicsLevel5Segment
type: Classifier
type: NamedIndividual
is level5 segment of: Comml & Service Ind Machinery
is anachronous version of: http://data.ga-group.nl/ics/bics/171013151010
is contemporary version of: http://data.ga-group.nl/ics/bics/1612151010
is replaced by: http://data.ga-group.nl/ics/bics/2020/171013151010
is version of: http://data.ga-group.nl/ics/bics/1612151010
is version of: http://data.ga-group.nl/ics/bics/171013151010
imported on: 2026-06-08T13:03:47.798Z
last refreshed on: 2026-06-08T13:03:47.798Z
source accessed on: 2019-12-03T20:05:01Z
source last accessed on: 2019-12-03T20:05:01Z
label: Distributeurs automatiques @fr
label: Distributori automatici @it
label: Máquina automática de venda @pt
label: Maquinaria dispenso automático @es
label: Verkaufsautomaten @de
label: Торговые автоматы @ru
label: 自动贩卖机械 @zh
label: 自動販売機 @ja
label: 自動販賣機 @zh-hant
label: 자판기 @ko
definition: This segment includes companies that manufacture automated vending machines or coin-operated mechanisms for machines.
notation: 1612151010
valid from: 2014-08-08
valid till: 2020-10-03

Commercial Laundry Machinery
type: BicsLevel5Segment
type: Classifier
type: NamedIndividual
is level5 segment of: Comml & Service Ind Machinery
is anachronous version of: http://data.ga-group.nl/ics/bics/171013151011
is contemporary version of: http://data.ga-group.nl/ics/bics/1612151011
is replaced by: http://data.ga-group.nl/ics/bics/2020/171013151011
is version of: http://data.ga-group.nl/ics/bics/1612151011
is version of: http://data.ga-group.nl/ics/bics/171013151011
imported on: 2026-06-08T13:03:47.798Z
last refreshed on: 2026-06-08T13:03:47.798Z
source accessed on: 2019-12-03T20:05:01Z
source last accessed on: 2019-12-03T20:05:01Z
label: Gewerbl. Waschmaschinen @de
label: Máquinas para lavanderia comercial @pt
label: Macchine lavanderia commerciale @it
label: Machines à laver commerciales @fr
label: Maquinaria comercial de lavandería @es
label: Техника для коммерч. прачечных @ru
label: 商业洗涤机械 @zh
label: 商用洗衣機 @zh-hant
label: 業務用洗濯機 @ja
label: 상업용세탁기 @ko
definition: This segment includes companies that manufacture commercial laundry and dry-cleaning equipment and pressing machines. Exclude laundry machines for home use (see Household Appliance).
notation: 1612151011
valid from: 2014-08-08
valid till: 2020-10-03

Other Machinery
type: BicsLevel5Segment
type: Classifier
type: Discontinued
type: NamedIndividual
is level5 segment of: Comml & Service Ind Machinery
is contemporary version of: http://data.ga-group.nl/ics/bics/1612151012
is version of: http://data.ga-group.nl/ics/bics/1612151012
imported on: 2026-06-08T13:03:47.798Z
last refreshed on: 2026-06-08T13:03:47.798Z
source accessed on: 2019-12-03T20:05:01Z
source last accessed on: 2019-12-03T20:05:01Z
label: Altri macchinari @it
label: Autres machines @fr
label: Otra maquinaria @es
label: Outras máquinas @pt
label: Sonstige Maschinen @de
label: Прочая промышл. техника @ru
label: その他機械 @ja
label: 其他机械 @zh
label: 其他機械 @zh-hant
label: 기타 기계 제조업 @ko
definition: This segment includes companies that manufacture machinery used in commercial and service industries not elsewhere classified. Includes manufacturers of phone recharging stations, arcade equipment and coin-counting machines.
notation: 1612151012
valid from: 2014-08-08
valid till: 2020-10-03

Comml & Service Ind Machinery
type: BicsLevel4SubIndustry
type: Classifier
type: NamedIndividual
is sub industry of: Industrial Machinery
is anachronous version of: http://data.ga-group.nl/ics/bics/1710131510
is contemporary version of: http://data.ga-group.nl/ics/bics/16121510
is replaced by: http://data.ga-group.nl/ics/bics/2020/1710131510
is version of: http://data.ga-group.nl/ics/bics/16121510
is version of: http://data.ga-group.nl/ics/bics/1710131510
imported on: 2026-06-08T13:03:47.798Z
last refreshed on: 2026-06-08T13:03:47.798Z
source accessed on: 2019-12-03T20:05:01Z
source last accessed on: 2019-12-03T20:05:01Z
label: Gewerbe- & Serviceindustriemaschinen @de
label: Máquinas ind de serviço comercial @pt
label: Macc comm e ind serv @it
label: Machine pour commerce/services @fr
label: Maquinaria ind comercial y servicio @es
label: Оборуд. для коммерч. и обсл. отраслей @ru
label: 商业与服务业机械 @zh
label: 商業服務業機械 @zh-hant
label: 商業･ｻｰﾋﾞｽ用産業機械 @ja
label: 상업&서비스산업기계 @ko
definition: This industry subgroup includes companies that manufacture machinery used in the commercial and service industries. Includes automatic vending machines and commercial laundry machines.
notation: 16121510
valid from: 2014-08-08
valid till: 2020-10-03

Food Product Machinery
type: BicsLevel4SubIndustry
type: Classifier
type: NamedIndividual
is sub industry of: Industrial Machinery
is anachronous version of: http://data.ga-group.nl/ics/bics/1710131511
is contemporary version of: http://data.ga-group.nl/ics/bics/16121511
is replaced by: http://data.ga-group.nl/ics/bics/2020/1710131511
is version of: http://data.ga-group.nl/ics/bics/16121511
is version of: http://data.ga-group.nl/ics/bics/1710131511
imported on: 2026-06-08T13:03:47.798Z
last refreshed on: 2026-06-08T13:03:47.798Z
source accessed on: 2019-12-03T20:05:01Z
source last accessed on: 2019-12-03T20:05:01Z
label: Lebensmittelproduktionsmaschinen @de
label: Macchinari prodotti alimentari @it
label: Machines pour l'industrie alimentaire @fr
label: Maquinário para produtos alimentícios @pt
label: Maquinaria para alimentos @es
label: Техника для пищевой промышл. @ru
label: 食品机械 @zh
label: 食品機械 @zh-hant
label: 食品製造用機械 @ja
label: 식료품 기계 @ko
definition: This industry subgroup includes companies that manufacture machinery used to produce foods and beverages.
notation: 16121511
valid from: 2014-08-08
valid till: 2020-10-03

Paper Industry Machinery
type: BicsLevel4SubIndustry
type: Classifier
type: NamedIndividual
is sub industry of: Industrial Machinery
is anachronous version of: http://data.ga-group.nl/ics/bics/1710131512
is contemporary version of: http://data.ga-group.nl/ics/bics/16121512
is replaced by: http://data.ga-group.nl/ics/bics/2020/1710131512
is version of: http://data.ga-group.nl/ics/bics/16121512
is version of: http://data.ga-group.nl/ics/bics/1710131512
imported on: 2026-06-08T13:03:47.798Z
last refreshed on: 2026-06-08T13:03:47.798Z
source accessed on: 2019-12-03T20:05:01Z
source last accessed on: 2019-12-03T20:05:01Z
label: Macchinari industria della carta @it
label: Machines pour l'industrie du papier @fr
label: Maq para la industria de papel @es
label: Maquinário para indústria de papel @pt
label: Papierindustriemaschinen @de
label: Техника для бумажной промышл. @ru
label: 紙業機械 @zh-hant
label: 纸业机械 @zh
label: 製紙機械 @ja
label: 제지산업용기계 @ko
definition: This industry subgroup includes companies that manufacture machinery for making paper pulp, paper and paperboard.
notation: 16121512
valid from: 2014-08-08
valid till: 2020-10-03

Plastics & Rubber Machinery
type: BicsLevel4SubIndustry
type: Classifier
type: NamedIndividual
is sub industry of: Industrial Machinery
is anachronous version of: http://data.ga-group.nl/ics/bics/1710131513
is contemporary version of: http://data.ga-group.nl/ics/bics/16121513
is replaced by: http://data.ga-group.nl/ics/bics/2020/1710131513
is version of: http://data.ga-group.nl/ics/bics/16121513
is version of: http://data.ga-group.nl/ics/bics/1710131513
imported on: 2026-06-08T13:03:47.798Z
last refreshed on: 2026-06-08T13:03:47.798Z
source accessed on: 2019-12-03T20:05:01Z
source last accessed on: 2019-12-03T20:05:01Z
label: Macchinari plastica e gomma @it
label: Machines plastique/caoutchouc @fr
label: Maquinário p/plástico e borracha @pt
label: Maquinaria de caucho y plástico @es
label: Plastik- & Gummimaschinen @de
label: Оборуд. для пласт. и резиновой промышл. @ru
label: 塑料与橡胶机械 @zh
label: 塑膠業及橡膠業機械 @zh-hant
label: 플라스틱&고무기계 @ko
label: ﾌﾟﾗｽﾁｯｸ･ｺﾞﾑ用機械 @ja
definition: This industry subgroup includes companies that manufacture extruders, molders, and pneumatic tire-making or retreading machines for specific types of plastic or rubber products.
notation: 16121513
valid from: 2014-08-08
valid till: 2020-10-03

Printing Machinery & Equip
type: BicsLevel4SubIndustry
type: Classifier
type: NamedIndividual
is sub industry of: Industrial Machinery
is anachronous version of: http://data.ga-group.nl/ics/bics/1710131514
is contemporary version of: http://data.ga-group.nl/ics/bics/16121514
is replaced by: http://data.ga-group.nl/ics/bics/2020/1710131514
is version of: http://data.ga-group.nl/ics/bics/16121514
is version of: http://data.ga-group.nl/ics/bics/1710131514
imported on: 2026-06-08T13:03:47.798Z
last refreshed on: 2026-06-08T13:03:47.798Z
source accessed on: 2019-12-03T20:05:01Z
source last accessed on: 2019-12-03T20:05:01Z
label: Druckmaschinen & -ausrüstung @de
label: Macchinari ed equip stampa @it
label: Machines/équipements imprimerie @fr
label: Maquinário de impressão e equip @pt
label: Maquinaria y equipo de impresión @es
label: Печатная техника и оборуд. @ru
label: 印刷机械与设备 @zh
label: 印刷機械設備 @zh-hant
label: 印刷機･機器 @ja
label: 인쇄기계&장비 @ko
definition: This industry subgroup includes companies that manufacture printing and bookbinding machinery. Products include bookbinding, collating, lithographic, offset printing, and typesetting machinery.
notation: 16121514
valid from: 2014-08-08
valid till: 2020-10-03

Sawmill & Woodworking Mach
type: BicsLevel4SubIndustry
type: Classifier
type: NamedIndividual
is sub industry of: Industrial Machinery
is anachronous version of: http://data.ga-group.nl/ics/bics/1710131515
is contemporary version of: http://data.ga-group.nl/ics/bics/16121515
is replaced by: http://data.ga-group.nl/ics/bics/2020/1710131515
is version of: http://data.ga-group.nl/ics/bics/16121515
is version of: http://data.ga-group.nl/ics/bics/1710131515
imported on: 2026-06-08T13:03:47.798Z
last refreshed on: 2026-06-08T13:03:47.798Z
source accessed on: 2019-12-03T20:05:01Z
source last accessed on: 2019-12-03T20:05:01Z
label: Macc segheria e falegnameria @it
label: Machine scieries/travail du bois @fr
label: Maq aserraderos y carpintería @es
label: Maquinário para serraria e marcenaria @pt
label: Sägewerk- & Holzbearbeitungsmaschinen @de
label: Лесопильн. и деревообр. станки @ru
label: 木廠及木工機械 @zh-hant
label: 製材･木材加工機械 @ja
label: 锯木厂与木工机械 @zh
label: 제재소&목공기계 @ko
definition: This industry subgroup includes companies that manufacture sawmills and woodworking machinery, such as band saws, drill presses and bench and table saws.
notation: 16121515
valid from: 2014-08-08
valid till: 2020-10-03

Textile Machinery
type: BicsLevel4SubIndustry
type: Classifier
type: NamedIndividual
is sub industry of: Industrial Machinery
is anachronous version of: http://data.ga-group.nl/ics/bics/1710131516
is contemporary version of: http://data.ga-group.nl/ics/bics/16121516
is replaced by: http://data.ga-group.nl/ics/bics/2020/1710131516
is version of: http://data.ga-group.nl/ics/bics/16121516
is version of: http://data.ga-group.nl/ics/bics/1710131516
imported on: 2026-06-08T13:03:47.798Z
last refreshed on: 2026-06-08T13:03:47.798Z
source accessed on: 2019-12-03T20:05:01Z
source last accessed on: 2019-12-03T20:05:01Z
label: Macchine tessili @it
label: Machines pour le textile @fr
label: Maquinário têxtil @pt
label: Maquinaria textil @es
label: Textilindustriemaschinen @de
label: Ткацкие станки @ru
label: 紡織業機械 @zh-hant
label: 繊維機械 @ja
label: 纺织机械 @zh
label: 직조기계 제조업 @ko
definition: This industry subgroup includes companies that manufacture machines for producing, extruding, drawing, and texturing fibers, materials, or yarn. Include cotton gins, bale breakers, garnetters, cotton spreaders, wool scourers, combs, spinning machines, reelers, warpers and looms.
notation: 16121516
valid from: 2014-08-08
valid till: 2020-10-03

General Purpose Machinery
type: BicsLevel5Segment
type: Classifier
type: NamedIndividual
is level5 segment of: Other Industrial Machinery
is anachronous version of: http://data.ga-group.nl/ics/bics/1710131518
is contemporary version of: http://data.ga-group.nl/ics/bics/1612151710
is replaced by: http://data.ga-group.nl/ics/bics/2020/1710131518
is version of: http://data.ga-group.nl/ics/bics/1612151710
is version of: http://data.ga-group.nl/ics/bics/1710131518
imported on: 2026-06-08T13:03:47.798Z
last refreshed on: 2026-06-08T13:03:47.798Z
source accessed on: 2019-12-03T20:05:01Z
source last accessed on: 2019-12-03T20:05:01Z
label: Macchinari uso generale @it
label: Machines à usage général @fr
label: Maquinários para usos gerais @pt
label: Maquinaria en general @es
label: Mehrzweckmaschinen @de
label: Техника общего назначения @ru
label: 一般機械 @ja
label: 一般用途机械 @zh
label: 通用機械 @zh-hant
label: 일반용 기계 @ko
definition: This segment includes companies that manufacture general purpose machinery that is not elsewhere classified.
notation: 1612151710
valid from: 2014-08-08
valid till: 2020-10-03

Ind Process Furnace & Oven
type: BicsLevel5Segment
type: Classifier
type: NamedIndividual
is level5 segment of: Other Industrial Machinery
is anachronous version of: http://data.ga-group.nl/ics/bics/171013151810
is contemporary version of: http://data.ga-group.nl/ics/bics/1612151711
is replaced by: http://data.ga-group.nl/ics/bics/2020/171013151810
is version of: http://data.ga-group.nl/ics/bics/1612151711
is version of: http://data.ga-group.nl/ics/bics/171013151810
imported on: 2026-06-08T13:03:47.798Z
last refreshed on: 2026-06-08T13:03:47.798Z
source accessed on: 2019-12-03T20:05:01Z
source last accessed on: 2019-12-03T20:05:01Z
label: Calderas y hornos industriales @es
label: Fornaci/forni industriali @it
label: Fornalha de processamento indust e forno @pt
label: Fournaises/fours procédés ind @fr
label: Industriefeuerungsanlagen & -öfen @de
label: Промышл. вагранки и печи @ru
label: 工业用化工炉和烤箱 @zh
label: 工業炉･ｵｰﾌﾞﾝ炉 @ja
label: 工業用加工鍋爐 @zh-hant
label: 산업용처리 고로 @ko
definition: This segment includes companies that manufacture industrial-process furnaces and ovens. Products include metal melting furnaces, garbage incinerators, paint baking and drying ovens, tile and ceramic kilns, and distillation ovens.
notation: 1612151711
valid from: 2014-08-08
valid till: 2020-10-03

Motor & Generator
type: BicsLevel5Segment
type: Classifier
type: NamedIndividual
is level5 segment of: Other Industrial Machinery
is anachronous version of: http://data.ga-group.nl/ics/bics/171013151811
is contemporary version of: http://data.ga-group.nl/ics/bics/1612151712
is replaced by: http://data.ga-group.nl/ics/bics/2020/171013151811
is version of: http://data.ga-group.nl/ics/bics/1612151712
is version of: http://data.ga-group.nl/ics/bics/171013151811
imported on: 2026-06-08T13:03:47.798Z
last refreshed on: 2026-06-08T13:03:47.798Z
source accessed on: 2019-12-03T20:05:01Z
source last accessed on: 2019-12-03T20:05:01Z
label: Générateurs/moteurs @fr
label: Generatori e motori @it
label: Motor e gerador @pt
label: Motor y generador @es
label: Motoren & Generatoren @de
label: Моторы и генераторы @ru
label: 電動機及發電機 @zh-hant
label: 马达与发电机 @zh
label: 모터&발전기제조업 @ko
label: ﾓｰﾀｰ･発電機 @ja
definition: This segment includes companies that manufacture general purpose electric motors and generators. Typically, these are semifinished products that will be used as components for various products. Excludes finished generator equipment (see Power Generation Equipment).
notation: 1612151712
valid from: 2014-08-08
valid till: 2020-10-03

Packaging Machinery
type: BicsLevel5Segment
type: Classifier
type: NamedIndividual
is level5 segment of: Other Industrial Machinery
is anachronous version of: http://data.ga-group.nl/ics/bics/1710131519
is contemporary version of: http://data.ga-group.nl/ics/bics/1612151713
is replaced by: http://data.ga-group.nl/ics/bics/2020/1710131519
is version of: http://data.ga-group.nl/ics/bics/1612151713
is version of: http://data.ga-group.nl/ics/bics/1710131519
imported on: 2026-06-08T13:03:47.798Z
last refreshed on: 2026-06-08T13:03:47.798Z
source accessed on: 2019-12-03T20:05:01Z
source last accessed on: 2019-12-03T20:05:01Z
label: Macchinari per confezioni @it
label: Machines pour l'emballage @fr
label: Maq para embalagem @pt
label: Maquinaria de empaque @es
label: Verpackungsmaschinenherstellung @de
label: Упаковочное оборуд. @ru
label: 包装机械 @zh
label: 包裝機械 @zh-hant
label: 梱包機械 @ja
label: 포장기계 제조업 @ko
definition: This segment includes companies that manufacture packaging machinery, such as canning and bottling machinery. Other products include bottle washers; bag opening, filling and closing machines; food packaging machinery, and labeling and wrapping machinery.
notation: 1612151713
valid from: 2014-08-08
valid till: 2020-10-03

Recycle Matl Hdlg Equip & Mach
type: BicsLevel5Segment
type: Classifier
type: NamedIndividual
is level5 segment of: Other Industrial Machinery
is anachronous version of: http://data.ga-group.nl/ics/bics/1710131520
is contemporary version of: http://data.ga-group.nl/ics/bics/1612151714
is replaced by: http://data.ga-group.nl/ics/bics/2020/1710131520
is version of: http://data.ga-group.nl/ics/bics/1612151714
is version of: http://data.ga-group.nl/ics/bics/1710131520
imported on: 2026-06-08T13:03:47.798Z
last refreshed on: 2026-06-08T13:03:47.798Z
source accessed on: 2019-12-03T20:05:01Z
source last accessed on: 2019-12-03T20:05:01Z
label: Eq y maq manejo mat reciclaje @es
label: Macc e app tratt mat riciclaggio @it
label: Mach/équipe manut matér recyclés @fr
label: Mat recic e equip manip e máq @pt
label: Recyclingmaterialtransportausr. & -masch. @de
label: Оборуд. для вторсырья @ru
label: 再生材料處理設備及機器 @zh-hant
label: 回收材料处理设备与机械 @zh
label: 재활용 자재 운반 장비&기계 @ko
label: ﾘｻｲｸﾙ資材運搬機器 @ja
definition: This segment includes companies that manufacture recycling material handling equipment and machinery.
notation: 1612151714
valid from: 2014-08-08
valid till: 2020-10-03

Scale & Balance
type: BicsLevel5Segment
type: Classifier
type: NamedIndividual
is level5 segment of: Other Industrial Machinery
is anachronous version of: http://data.ga-group.nl/ics/bics/171013151812
is contemporary version of: http://data.ga-group.nl/ics/bics/1612151715
is replaced by: http://data.ga-group.nl/ics/bics/2020/171013151812
is version of: http://data.ga-group.nl/ics/bics/1612151715
is version of: http://data.ga-group.nl/ics/bics/171013151812
imported on: 2026-06-08T13:03:47.798Z
last refreshed on: 2026-06-08T13:03:47.798Z
source accessed on: 2019-12-03T20:05:01Z
source last accessed on: 2019-12-03T20:05:01Z
label: Balanças @pt
label: Balances @fr
label: Bilance @it
label: Escala/balanza @es
label: Skalierungs- & Balancegeräte @de
label: Весы @ru
label: 天秤･はかり @ja
label: 秤重用具 @zh-hant
label: 称重用具 @zh
label: 저울&천칭 제조업 @ko
definition: This segment includes companies that manufacture commercial scales and balances. Includes industrial scales, motor truck scales, post office‒type scales and retail scales.
notation: 1612151715
valid from: 2014-08-08
valid till: 2020-10-03

Misc. Industrial Machinery
type: BicsLevel5Segment
type: Classifier
type: Discontinued
type: NamedIndividual
is level5 segment of: Other Industrial Machinery
is contemporary version of: http://data.ga-group.nl/ics/bics/1612151716
is version of: http://data.ga-group.nl/ics/bics/1612151716
imported on: 2026-06-08T13:03:47.798Z
last refreshed on: 2026-06-08T13:03:47.798Z
source accessed on: 2019-12-03T20:05:01Z
source last accessed on: 2019-12-03T20:05:01Z
label: Div maquinários industriais @pt
label: Macchinari industriali vari @it
label: Machines industrielles diverses @fr
label: Sonstige Industriemaschinen @de
label: Varios Maquinaria industrial @es
label: Прочая промышл. техника @ru
label: その他産業機械 @ja
label: 其他工业机械 @zh
label: 其他工業機械 @zh-hant
label: 기타 산업용기계 @ko
definition: This segment includes companies that manufacture industrial machinery not elsewhere classified.
notation: 1612151716
valid from: 2014-08-08
valid till: 2020-10-03

Other Industrial Machinery
type: BicsLevel4SubIndustry
type: Classifier
type: Discontinued
type: NamedIndividual
is sub industry of: Industrial Machinery
is contemporary version of: http://data.ga-group.nl/ics/bics/16121517
is version of: http://data.ga-group.nl/ics/bics/16121517
imported on: 2026-06-08T13:03:47.798Z
last refreshed on: 2026-06-08T13:03:47.798Z
source accessed on: 2019-12-03T20:05:01Z
source last accessed on: 2019-12-03T20:05:01Z
label: Altri macchinari industriali @it
label: Autres machines industrielles @fr
label: Otra maquinaria industrial @es
label: Outros maquinários para usos gerais @pt
label: Sonstige Industriemaschinen @de
label: Прочая техники общего назнач. @ru
label: その他産業機械 @ja
label: 其他工业机械 @zh
label: 其他工業機械 @zh-hant
label: 기타 산업용 기계 @ko
definition: This industry subgroup includes companies that manufacture all other general purpose machinery and capital equipment not elsewhere classified.
notation: 16121517
valid from: 2014-08-08
valid till: 2020-10-03

Industrial Machinery Parts & Svcs
type: BicsLevel4SubIndustry
type: Classifier
type: NamedIndividual
is sub industry of: Industrial Machinery
is anachronous version of: http://data.ga-group.nl/ics/bics/1710131521
is contemporary version of: http://data.ga-group.nl/ics/bics/16121518
is replaced by: http://data.ga-group.nl/ics/bics/2020/1710131521
is version of: http://data.ga-group.nl/ics/bics/16121518
is version of: http://data.ga-group.nl/ics/bics/1710131521
imported on: 2026-06-08T13:03:47.798Z
last refreshed on: 2026-06-08T13:03:47.798Z
source accessed on: 2019-12-03T20:05:01Z
source last accessed on: 2019-12-03T20:05:01Z
label: Industriemaschinenteile & Dienste @de
label: Partes y serv de maquinaria industrial @es
label: Peças e serv maquinário industrial @pt
label: Pièces/serv machines industrielles @fr
label: Serv e comp industriali @it
label: Запчасти и обслуж. промышл. оборуд. @ru
label: 工业机械零部件与服务 @zh
label: 工業機械零件及服務 @zh-hant
label: 産業機械部品･ｻｰﾋﾞｽ @ja
label: 산업용 기계 부품 & 서비스 @ko
definition: This industry subgroup includes companies that manufacture industrial machinery parts and components as well as provide aftermarket services.
notation: 16121518
valid from: 2014-08-08
valid till: 2020-10-03

Industrial Machinery
type: BicsLevel3Industry
type: Classifier
type: NamedIndividual
is industry of: Machinery
is anachronous version of: http://data.ga-group.nl/ics/bics/17101315
is contemporary version of: http://data.ga-group.nl/ics/bics/161215
is replaced by: http://data.ga-group.nl/ics/bics/2020/17101315
is version of: http://data.ga-group.nl/ics/bics/161215
is version of: http://data.ga-group.nl/ics/bics/17101315
imported on: 2026-06-08T13:03:47.798Z
last refreshed on: 2026-06-08T13:03:47.798Z
source accessed on: 2019-12-03T20:05:01Z
source last accessed on: 2019-12-03T20:05:01Z
label: Industriemaschinen @de
label: Macchinari industriali @it
label: Machines industrielles @fr
label: Maquinário industrial @pt
label: Maquinaria industrial @es
label: Промышл. машиностр. @ru
label: 工业机械 @zh
label: 工業機械 @zh-hant
label: 産業機械 @ja
label: 산업기계 제조업 @ko
definition: This industry includes companies that manufacture industrial machinery, including saws, paper making machinery, and machines used in the textiles and food industries.
notation: 161215
valid from: 2014-08-08
valid till: 2020-10-03

Conveying Systems Equipment
type: BicsLevel5Segment
type: Classifier
type: Discontinued
type: NamedIndividual
is level5 segment of: Conveyor & Conveying Equip
is contemporary version of: http://data.ga-group.nl/ics/bics/1612161010
is version of: http://data.ga-group.nl/ics/bics/1612161010
imported on: 2026-06-08T13:03:47.798Z
last refreshed on: 2026-06-08T13:03:47.798Z
source accessed on: 2019-12-03T20:05:01Z
source last accessed on: 2019-12-03T20:05:01Z
label: Apparecchiature sistemi trasporto @it
label: Equipamento de sist transporte @pt
label: Equipements systèmes de convoyage @fr
label: Equipo sistemas transporte @es
label: Fördersystemausrüstung @de
label: Конвейерное оборудование @ru
label: 传送系统设备 @zh
label: 輸送系統設備 @zh-hant
label: 컨베이어 시스템 장비 @ko
label: ｺﾝﾍﾞﾔｼｽﾃﾑ用設備 @ja
definition: This segment includes companies that manufacture material handling systems for non-mining and construction-related activities.
notation: 1612161010
valid from: 2014-08-08
valid till: 2020-10-03

Conveying Systems Components
type: BicsLevel5Segment
type: Classifier
type: Discontinued
type: NamedIndividual
is level5 segment of: Conveyor & Conveying Equip
is contemporary version of: http://data.ga-group.nl/ics/bics/1612161011
is version of: http://data.ga-group.nl/ics/bics/1612161011
imported on: 2026-06-08T13:03:47.798Z
last refreshed on: 2026-06-08T13:03:47.798Z
source accessed on: 2019-12-03T20:05:01Z
source last accessed on: 2019-12-03T20:05:01Z
label: Componentes de sist transporte @pt
label: Componentes sistemas transporte @es
label: Componenti sistemi trasporto @it
label: Composants de systèmes de convoyage @fr
label: Fördersystemkomponenten @de
label: Компоненты конвейерн. систем @ru
label: 传送系统零配件 @zh
label: 輸送系統組件 @zh-hant
label: 컨베이어 시스템 부품 @ko
label: ｺﾝﾍﾞﾔｼｽﾃﾑ用部品 @ja
definition: This segment includes companies that manufacture conveying system components for non-mining and construction-related material handling applications.
notation: 1612161011
valid from: 2014-08-08
valid till: 2020-10-03

Conveyor & Conveying Equip
type: BicsLevel4SubIndustry
type: Classifier
type: NamedIndividual
is sub industry of: Material Handling Machinery
is anachronous version of: http://data.ga-group.nl/ics/bics/1710131610
is contemporary version of: http://data.ga-group.nl/ics/bics/16121610
is replaced by: http://data.ga-group.nl/ics/bics/2020/1710131610
is version of: http://data.ga-group.nl/ics/bics/16121610
is version of: http://data.ga-group.nl/ics/bics/1710131610
imported on: 2026-06-08T13:03:47.798Z
last refreshed on: 2026-06-08T13:03:47.798Z
source accessed on: 2019-12-03T20:05:01Z
source last accessed on: 2019-12-03T20:05:01Z
label: Convoyeurs/équip de convoyeurs @fr
label: Equipo p/levantar y trasladar @es
label: Förderbänder &Förderbänderausrüstung @de
label: Transportadora e equip transportadora @pt
label: Trasporto e app trasporto @it
label: Конвейеры и подъемно-транспортн. оборуд. @ru
label: 传送带与传送设备 @zh
label: 傳送帶及運送設備 @zh-hant
label: 운반장치 및 운반용장비 @ko
label: ｺﾝﾍﾞﾔｰ･関連機械 @ja
definition: This industry subgroup includes companies that manufacture equipment that moves materials from one location to another. Such equipment includes belt conveyors, chain conveyors, overhead conveyors, bucket conveyors and various other conveyors.
notation: 16121610
valid from: 2014-08-08
valid till: 2020-10-03

High-Reach Ind Matl Hdlg Equip
type: BicsLevel5Segment
type: Classifier
type: Discontinued
type: NamedIndividual
is level5 segment of: Industrial Trucks & Stackers
is contemporary version of: http://data.ga-group.nl/ics/bics/1612161110
is version of: http://data.ga-group.nl/ics/bics/1612161110
imported on: 2026-06-08T13:03:47.798Z
last refreshed on: 2026-06-08T13:03:47.798Z
source accessed on: 2019-12-03T20:05:01Z
source last accessed on: 2019-12-03T20:05:01Z
label: App tratt e sollevamento materiale @it
label: Equip manut/leval indus @fr
label: Equip masueio material ind alto alcance @pt
label: Equipo para alcanzar mat industrial alto niv @es
label: Hochr., ind. Materialtransportanlagenausrüst. @de
label: Высокоподъем. пром. транспортное оборуд. @ru
label: 高距工业材料处理设备 @zh
label: 高距工��物料處理設備 @zh-hant
label: 길이조절 산업용 자재 운반 장비 @ko
label: ﾊｲﾘｰﾁ工業材料取扱設備 @ja
definition: This segment includes companies that manufacture forklift trucks and other vehicles for use in material handling around factories and plants.
notation: 1612161110
valid from: 2014-08-08
valid till: 2020-10-03

Industrial Trucks
type: BicsLevel5Segment
type: Classifier
type: Discontinued
type: NamedIndividual
is level5 segment of: Industrial Trucks & Stackers
is contemporary version of: http://data.ga-group.nl/ics/bics/1612161111
is version of: http://data.ga-group.nl/ics/bics/1612161111
imported on: 2026-06-08T13:03:47.798Z
last refreshed on: 2026-06-08T13:03:47.798Z
source accessed on: 2019-12-03T20:05:01Z
source last accessed on: 2019-12-03T20:05:01Z
label: Autocarri industriali @it
label: Caminhões industriais @pt
label: Camiones industriales @es
label: Camions industriels @fr
label: Industrielle LKWs @de
label: Промышл. грузовики @ru
label: 工业用卡车 @zh
label: 工業卡車 @zh-hant
label: 工業用ﾄﾗｯｸ @ja
label: 산업용 트럭 @ko
definition: This segment includes companies that manufacture industrial trucks for the movement of goods in factories and plants.
notation: 1612161111
valid from: 2014-08-08
valid till: 2020-10-03

Ind Truck & Stacker Parts & Svcs
type: BicsLevel5Segment
type: Classifier
type: Discontinued
type: NamedIndividual
is level5 segment of: Industrial Trucks & Stackers
is contemporary version of: http://data.ga-group.nl/ics/bics/1612161112
is version of: http://data.ga-group.nl/ics/bics/1612161112
imported on: 2026-06-08T13:03:47.798Z
last refreshed on: 2026-06-08T13:03:47.798Z
source accessed on: 2019-12-03T20:05:01Z
source last accessed on: 2019-12-03T20:05:01Z
label: Industrielle LKW- & Staplerteile & Dienste @de
label: Partes y serv de camiones y apiladora indust @es
label: Parti e serv camion e trattori ind @it
label: Peças e serv caminhão ind e empilhador @pt
label: Pièces/serv gerbeurs/camions indus @fr
label: Происв. запчастей и обслуж. промышл. тележек @ru
label: 工业卡车与堆垛机零部件与服务 @zh
label: 工業卡車及推高機零件及服務 @zh-hant
label: 産業用ﾄﾗｯｸ･ｽﾀｯｶｰ部品･ｻｰﾋﾞｽ @ja
label: 산업용 트럭 및 스태커 부품 & 서비스 @ko
definition: This segment includes companies that have aftermarket operations in industrial truck and stacker market, including servicing, spare parts and consumables.
notation: 1612161112
valid from: 2014-08-08
valid till: 2020-10-03

Industrial Trucks & Stackers
type: BicsLevel4SubIndustry
type: Classifier
type: NamedIndividual
is sub industry of: Material Handling Machinery
is anachronous version of: http://data.ga-group.nl/ics/bics/1710131611
is contemporary version of: http://data.ga-group.nl/ics/bics/16121611
is replaced by: http://data.ga-group.nl/ics/bics/2020/1710131611
is version of: http://data.ga-group.nl/ics/bics/16121611
is version of: http://data.ga-group.nl/ics/bics/1710131611
imported on: 2026-06-08T13:03:47.798Z
last refreshed on: 2026-06-08T13:03:47.798Z
source accessed on: 2019-12-03T20:05:01Z
source last accessed on: 2019-12-03T20:05:01Z
label: Camion e trattori industriali @it
label: Camiones y apiladoras industriales @es
label: Fab de caminhões e empilhadores industriais @pt
label: Gerbeurs (empileurs)/camions indus @fr
label: Herst. v. industriellen LKWs & Staplern @de
label: Произв. грузовых автомоб./самоукладчиков @ru
label: 工业卡车与堆垛机 @zh
label: 工業用卡車及推高機 @zh-hant
label: 産業用ﾄﾗｯｸ･ｽﾀｯｶｰ @ja
label: 산업용 트럭&축척기 제조 @ko
definition: This industry subgroup includes companies that manufacture equipment used to lift and move materials. These items include forklifts, pallet loaders and unloaders.
notation: 16121611
valid from: 2014-08-08
valid till: 2020-10-03

Industrial Overhead Cranes
type: BicsLevel5Segment
type: Classifier
type: Discontinued
type: NamedIndividual
is level5 segment of: Overhead Crane
is contemporary version of: http://data.ga-group.nl/ics/bics/1612161210
is version of: http://data.ga-group.nl/ics/bics/1612161210
imported on: 2026-06-08T13:03:47.798Z
last refreshed on: 2026-06-08T13:03:47.798Z
source accessed on: 2019-12-03T20:05:01Z
source last accessed on: 2019-12-03T20:05:01Z
label: Grúas puentes industriales @es
label: Gru industriali @it
label: Guindastes rolantes industriais @pt
label: Industrielle Hängkräne @de
label: Ponts roulants industriels @fr
label: Промышл. мостовые краны @ru
label: 工业高架起重机 @zh
label: 工業橋式吊車 @zh-hant
label: 産業用天井ｸﾚｰﾝ @ja
label: 산업용 천장 크레인 @ko
definition: This segment includes companies that manufacture overhead cranes for non-marine applications.
notation: 1612161210
valid from: 2014-08-08
valid till: 2020-10-03

Overhd Cranes Parts & Services
type: BicsLevel5Segment
type: Classifier
type: Discontinued
type: NamedIndividual
is level5 segment of: Overhead Crane
is contemporary version of: http://data.ga-group.nl/ics/bics/1612161211
is version of: http://data.ga-group.nl/ics/bics/1612161211
imported on: 2026-06-08T13:03:47.798Z
last refreshed on: 2026-06-08T13:03:47.798Z
source accessed on: 2019-12-03T20:05:01Z
source last accessed on: 2019-12-03T20:05:01Z
label: Hängekranteile & Dienste @de
label: Peças e serviços guindastes rolantes @pt
label: Pièces/Services ponts roulants @fr
label: Servicios y partes grúas puentes @es
label: Servizi e componenti gru @it
label: Запчасти и облужив. мостовых кранов @ru
label: 天井ｸﾚｰﾝ部品･ｻｰﾋﾞｽ @ja
label: 橋式吊車零件及服務 @zh-hant
label: 高架起重机零部件与服务 @zh
label: 천장크레인 부품 & 서비스 @ko
definition: This segment includes companies that have aftermarket sales activities in the overhead cranes and material handling systems for non-marine activities.
notation: 1612161211
valid from: 2014-08-08
valid till: 2020-10-03

Overhead Crane
type: BicsLevel4SubIndustry
type: Classifier
type: NamedIndividual
is sub industry of: Material Handling Machinery
is anachronous version of: http://data.ga-group.nl/ics/bics/1710131612
is contemporary version of: http://data.ga-group.nl/ics/bics/16121612
is replaced by: http://data.ga-group.nl/ics/bics/2020/1710131612
is version of: http://data.ga-group.nl/ics/bics/16121612
is version of: http://data.ga-group.nl/ics/bics/1710131612
imported on: 2026-06-08T13:03:47.798Z
last refreshed on: 2026-06-08T13:03:47.798Z
source accessed on: 2019-12-03T20:05:01Z
source last accessed on: 2019-12-03T20:05:01Z
label: Fabricación de grúas @es
label: Gru mobili @it
label: Hängekräne @de
label: Pontes rolantes @pt
label: Ponts roulants @fr
label: Мостовые краны @ru
label: 天井ｸﾚｰﾝ @ja
label: 橋式吊車零件及服務 @zh-hant
label: 高架起重机 @zh
label: 천정크레인 제조업 @ko
definition: This industry subgroup includes companies that manufacture equipment that runs along a horizontal beam to move items from one place to another. Equipment includes hoists and monorail systems. Excludes mobile or construction cranes (see Construction Machinery).
notation: 16121612
valid from: 2014-08-08
valid till: 2020-10-03

Material Handling Machinery
type: BicsLevel3Industry
type: Classifier
type: NamedIndividual
is industry of: Machinery
is anachronous version of: http://data.ga-group.nl/ics/bics/17101316
is contemporary version of: http://data.ga-group.nl/ics/bics/161216
is replaced by: http://data.ga-group.nl/ics/bics/2020/17101316
is version of: http://data.ga-group.nl/ics/bics/161216
is version of: http://data.ga-group.nl/ics/bics/17101316
imported on: 2026-06-08T13:03:47.798Z
last refreshed on: 2026-06-08T13:03:47.798Z
source accessed on: 2019-12-03T20:05:01Z
source last accessed on: 2019-12-03T20:05:01Z
label: Macchinari trattamento materiale @it
label: Machine manutention de matériel @fr
label: Maquinário de manuseio de material @pt
label: Maquinaria de manejo de materiales @es
label: Materialtransportmaschinen @de
label: Оборуд. для перемещения материалов @ru
label: 原材料处理机械 @zh
label: 原物料處理機械 @zh-hant
label: 資材運搬機械 @ja
label: 화물운반기계 @ko
definition: This industry includes companies that manufacture equipment involved in movement, storage and control of products in the manufacturing and distribution of goods. Products include lift trucks, storage and handling equipment, and conveyor systems.
notation: 161216
valid from: 2014-08-08
valid till: 2020-10-03

Cutting & Machine Tool Acc
type: BicsLevel4SubIndustry
type: Classifier
type: NamedIndividual
is sub industry of: Metalworking Machinery
is anachronous version of: http://data.ga-group.nl/ics/bics/1710131710
is contemporary version of: http://data.ga-group.nl/ics/bics/16121710
is replaced by: http://data.ga-group.nl/ics/bics/2020/1710131710
is version of: http://data.ga-group.nl/ics/bics/16121710
is version of: http://data.ga-group.nl/ics/bics/1710131710
imported on: 2026-06-08T13:03:47.798Z
last refreshed on: 2026-06-08T13:03:47.798Z
source accessed on: 2019-12-03T20:05:01Z
source last accessed on: 2019-12-03T20:05:01Z
label: Cnt ferramenta de máquina e de corte @pt
label: Herr maq, tipos corte metálico @es
label: Machines-outils et acc de découpage @fr
label: Schneidewerkzeuge & -zubehör @de
label: Utensili taglio e macchina acc @it
label: Арматура для резальных машин и станков @ru
label: 切削工具及工具機配件 @zh-hant
label: 切削機器･付属品 @ja
label: 切割与机床配件 @zh
label: 절단도구&공작기계장비 @ko
definition: This industry subgroup includes companies that manufacture tool holders and cutting, drilling and boring accessories.
notation: 16121710
valid from: 2014-08-08
valid till: 2020-10-03

Industrial Mold
type: BicsLevel4SubIndustry
type: Classifier
type: NamedIndividual
is sub industry of: Metalworking Machinery
is anachronous version of: http://data.ga-group.nl/ics/bics/1710131711
is contemporary version of: http://data.ga-group.nl/ics/bics/16121711
is replaced by: http://data.ga-group.nl/ics/bics/2020/1710131711
is version of: http://data.ga-group.nl/ics/bics/16121711
is version of: http://data.ga-group.nl/ics/bics/1710131711
imported on: 2026-06-08T13:03:47.798Z
last refreshed on: 2026-06-08T13:03:47.798Z
source accessed on: 2019-12-03T20:05:01Z
source last accessed on: 2019-12-03T20:05:01Z
label: Industriegussformen @de
label: Moldes industriais @pt
label: Molduras indus @es
label: Moules industriels @fr
label: Stampi industriali @it
label: Промышл. шаблоны @ru
label: 工业模具 @zh
label: 工業鑄模 @zh-hant
label: 金型 @ja
label: 산업용주형제조업 @ko
definition: This industry subgroup includes companies that manufacture metal molds and die castings.
notation: 16121711
valid from: 2014-08-08
valid till: 2020-10-03

Machine Tool (Metal Cutting)
type: BicsLevel4SubIndustry
type: Classifier
type: NamedIndividual
is sub industry of: Metalworking Machinery
is anachronous version of: http://data.ga-group.nl/ics/bics/1710131712
is contemporary version of: http://data.ga-group.nl/ics/bics/16121712
is replaced by: http://data.ga-group.nl/ics/bics/2020/1710131712
is version of: http://data.ga-group.nl/ics/bics/16121712
is version of: http://data.ga-group.nl/ics/bics/1710131712
imported on: 2026-06-08T13:03:47.798Z
last refreshed on: 2026-06-08T13:03:47.798Z
source accessed on: 2019-12-03T20:05:01Z
source last accessed on: 2019-12-03T20:05:01Z
label: (Metallschneidendes) Maschinenwerkzeug @de
label: Ferramenta de máquina (corte de metal) @pt
label: Herramientas de maquinaria (corte de metal) @es
label: Macchine utensili (taglio metalli) @it
label: Machines-outils (découpage des métaux) @fr
label: Станки (металлорежущих) @ru
label: 工作機械(金属切削) @ja
label: 工具機(金屬切削) @zh-hant
label: 机床(金属切割) @zh
label: 공작기계(금속절단 ) @ko
definition: This industry subgroup includes companies that manufacture equipment used to make industrial equipment, such as machines to cut, bore and drill metal materials.
notation: 16121712
valid from: 2014-08-08
valid till: 2020-10-03

Machine Tool (Metal Forming)
type: BicsLevel4SubIndustry
type: Classifier
type: NamedIndividual
is sub industry of: Metalworking Machinery
is anachronous version of: http://data.ga-group.nl/ics/bics/1710131713
is contemporary version of: http://data.ga-group.nl/ics/bics/16121713
is replaced by: http://data.ga-group.nl/ics/bics/2020/1710131713
is version of: http://data.ga-group.nl/ics/bics/16121713
is version of: http://data.ga-group.nl/ics/bics/1710131713
imported on: 2026-06-08T13:03:47.798Z
last refreshed on: 2026-06-08T13:03:47.798Z
source accessed on: 2019-12-03T20:05:01Z
source last accessed on: 2019-12-03T20:05:01Z
label: (Metallformendes) Maschinenwerkzeug @de
label: Ferramenta de máquina (metalúrgica) @pt
label: Herramientas de maquinaria (formación metal) @es
label: Macchine utensili formatura metalli @it
label: Machines-outils (façonnage des métaux) @fr
label: Станки (для формовки металла) @ru
label: 工作機械(金属成形) @ja
label: 工具機(金屬成型銑削) @zh-hant
label: 机床(金属成型) @zh
label: 공작기계(금속가공) @ko
definition: This industry subgroup includes companies that manufacture machine tools that form metal by milling, planing, pressing or grinding metal into the desired shape.
notation: 16121713
valid from: 2014-08-08
valid till: 2020-10-03

Rolling Mill Mach & Equipment
type: BicsLevel4SubIndustry
type: Classifier
type: NamedIndividual
is sub industry of: Metalworking Machinery
is anachronous version of: http://data.ga-group.nl/ics/bics/1710131714
is contemporary version of: http://data.ga-group.nl/ics/bics/16121714
is replaced by: http://data.ga-group.nl/ics/bics/2020/1710131714
is version of: http://data.ga-group.nl/ics/bics/16121714
is version of: http://data.ga-group.nl/ics/bics/1710131714
imported on: 2026-06-08T13:03:47.798Z
last refreshed on: 2026-06-08T13:03:47.798Z
source accessed on: 2019-12-03T20:05:01Z
source last accessed on: 2019-12-03T20:05:01Z
label: App e macchine laminatoi @it
label: Equipements et mach de laminoirs @fr
label: Maq e equipamento de laminador @pt
label: Maquinaria y equipo laminador @es
label: Walzwerkmaschinen & -ausrüstung @de
label: Прокатне станки и оборуд. @ru
label: 圧延機器 @ja
label: 輾壓廠機械設備 @zh-hant
label: 轧制机械与设备 @zh
label: 압연기계 및 장비 @ko
definition: This industry subgroup includes companies that manufacture equipment used to cut, form, stamp and bend metal with a pair of rolls. Equipment includes bar mill machinery, cold and hot rolling machinery, and galvanizing machinery.
notation: 16121714
valid from: 2014-08-08
valid till: 2020-10-03

Sheet Metal Processing Mach
type: BicsLevel4SubIndustry
type: Classifier
type: NamedIndividual
is sub industry of: Metalworking Machinery
is anachronous version of: http://data.ga-group.nl/ics/bics/1710131715
is contemporary version of: http://data.ga-group.nl/ics/bics/16121715
is replaced by: http://data.ga-group.nl/ics/bics/2020/1710131715
is version of: http://data.ga-group.nl/ics/bics/16121715
is version of: http://data.ga-group.nl/ics/bics/1710131715
imported on: 2026-06-08T13:03:47.798Z
last refreshed on: 2026-06-08T13:03:47.798Z
source accessed on: 2019-12-03T20:05:01Z
source last accessed on: 2019-12-03T20:05:01Z
label: Blechmetallverarbeitungsmaschinen @de
label: Máq processam chapas metal @pt
label: Macch trattamento lamine metallo @it
label: Machines transform tôle @fr
label: Maq procesar chapa metálica @es
label: Станок д/обработки листов. металла @ru
label: 板金加工機床 @zh-hant
label: 板金加工機械 @ja
label: 金属薄片加工机 @zh
label: 판금속 가공기계 @ko
definition: This industry subgroup includes companies that manufacture sheet metal processing machines (which can cut holes in, weld and bend metal sheets).
notation: 16121715
valid from: 2014-08-08
valid till: 2020-10-03

Special Die & Tool Fixture
type: BicsLevel4SubIndustry
type: Classifier
type: NamedIndividual
is sub industry of: Metalworking Machinery
is anachronous version of: http://data.ga-group.nl/ics/bics/1710131716
is contemporary version of: http://data.ga-group.nl/ics/bics/16121716
is replaced by: http://data.ga-group.nl/ics/bics/2020/1710131716
is version of: http://data.ga-group.nl/ics/bics/16121716
is version of: http://data.ga-group.nl/ics/bics/1710131716
imported on: 2026-06-08T13:03:47.798Z
last refreshed on: 2026-06-08T13:03:47.798Z
source accessed on: 2019-12-03T20:05:01Z
source last accessed on: 2019-12-03T20:05:01Z
label: Flete de tintas y herramientas @es
label: Moldes especiais e luminárias de ferramenta @pt
label: Moules/pièces fixes pour outils @fr
label: Spezialgüsse & Werkzeuge @de
label: Stampi e attrezzi speciali @it
label: Специ��льные пробойники и инструменты @ru
label: 特殊模切工具設備 @zh-hant
label: 特殊ﾀﾞｲｽ･治具･付属品 @ja
label: 特种模具及工具、夹具 @zh
label: 특수 다이&도구 고정물 @ko
definition: This industry subgroup includes companies that manufacture specialty tools and fixtures, such as dies and jigs.
notation: 16121716
valid from: 2014-08-08
valid till: 2020-10-03

Stamping Press Machinery
type: BicsLevel4SubIndustry
type: Classifier
type: NamedIndividual
is sub industry of: Metalworking Machinery
is anachronous version of: http://data.ga-group.nl/ics/bics/1710131717
is contemporary version of: http://data.ga-group.nl/ics/bics/16121717
is replaced by: http://data.ga-group.nl/ics/bics/2020/1710131717
is version of: http://data.ga-group.nl/ics/bics/16121717
is version of: http://data.ga-group.nl/ics/bics/1710131717
imported on: 2026-06-08T13:03:47.798Z
last refreshed on: 2026-06-08T13:03:47.798Z
source accessed on: 2019-12-03T20:05:01Z
source last accessed on: 2019-12-03T20:05:01Z
label: Macchine stampaggio @it
label: Machines pour presses à estamper @fr
label: Maquinário press estampa @pt
label: Maquina de prensa estampado @es
label: Stanzmaschinen @de
label: Штамповочные прессы @ru
label: 冲压机械 @zh
label: 沖床機 @zh-hant
label: 금형 압축기 @ko
label: ｽﾀﾝﾋﾟﾝｸﾞﾌﾟﾚｽ機械 @ja
definition: This industry subgroup includes companies that manufacture stamping presses to shape or cut metal.
notation: 16121717
valid from: 2014-08-08
valid till: 2020-10-03

Welding & Solder Equipment
type: BicsLevel4SubIndustry
type: Classifier
type: NamedIndividual
is sub industry of: Metalworking Machinery
is anachronous version of: http://data.ga-group.nl/ics/bics/1710131718
is contemporary version of: http://data.ga-group.nl/ics/bics/16121718
is replaced by: http://data.ga-group.nl/ics/bics/2020/1710131718
is version of: http://data.ga-group.nl/ics/bics/16121718
is version of: http://data.ga-group.nl/ics/bics/1710131718
imported on: 2026-06-08T13:03:47.798Z
last refreshed on: 2026-06-08T13:03:47.798Z
source accessed on: 2019-12-03T20:05:01Z
source last accessed on: 2019-12-03T20:05:01Z
label: App saldatura e brasatura @it
label: Equipamento de caldamento e soldagem @pt
label: Equipements de soudage/brasage @fr
label: Equipo de soldadura y metales @es
label: Schweiss- & Lötausrüstung @de
label: Сварочное и паяльное оборуд. @ru
label: 定位焊��与软焊接设备 @zh
label: 溶接･はんだ機器 @ja
label: 焊接設備 @zh-hant
label: 용접 및 납땜 장비 @ko
definition: This industry subgroup includes companies that manufacture equipment used to join metal materials together. Equipment includes arc welding, gas welding, spot welding and other types of welding and soldering equipment.
notation: 16121718
valid from: 2014-08-08
valid till: 2020-10-03

Other Metalworking Machinery
type: BicsLevel4SubIndustry
type: Classifier
type: Discontinued
type: NamedIndividual
is sub industry of: Metalworking Machinery
is contemporary version of: http://data.ga-group.nl/ics/bics/16121719
is version of: http://data.ga-group.nl/ics/bics/16121719
imported on: 2026-06-08T13:03:47.798Z
last refreshed on: 2026-06-08T13:03:47.798Z
source accessed on: 2019-12-03T20:05:01Z
source last accessed on: 2019-12-03T20:05:01Z
label: Autres machines travail des métaux @fr
label: Macchinari lavorazione metallo @it
label: Otra maquinaria para el tratamiento de metales @es
label: Outros maquinários para siderúrgicas @pt
label: Sonstige metallverarbeitende Maschinen @de
label: Прочая техника для обработки металлов @ru
label: その他金型 @ja
label: 其他金属加工机械 @zh
label: 其他金屬加工機械 @zh-hant
label: 기타 금속세공품 기계 @ko
definition: This industry subgroup includes companies that manufacture all metalworking machinery not elsewhere classified.
notation: 16121719
valid from: 2014-08-08
valid till: 2020-10-03

Metalworking Machinery
type: BicsLevel3Industry
type: Classifier
type: NamedIndividual
is industry of: Machinery
is anachronous version of: http://data.ga-group.nl/ics/bics/17101317
is contemporary version of: http://data.ga-group.nl/ics/bics/161217
is replaced by: http://data.ga-group.nl/ics/bics/2020/17101317
is version of: http://data.ga-group.nl/ics/bics/161217
is version of: http://data.ga-group.nl/ics/bics/17101317
imported on: 2026-06-08T13:03:47.798Z
last refreshed on: 2026-06-08T13:03:47.798Z
source accessed on: 2019-12-03T20:05:01Z
source last accessed on: 2019-12-03T20:05:01Z
label: Macchinari lavorazione metallo @it
label: Machines pour le travail des métaux @fr
label: Maquinário siderúrgico @pt
label: Maquinaria para el tratamiento de metales @es
label: Metallverarbeitungsmaschinen @de
label: Техника для обработки металлов @ru
label: 金属加工机械设备 @zh
label: 金属加工機械 @ja
label: 金屬加工用機械 @zh-hant
label: 금속공작기계 @ko
definition: This industry includes companies that manufacture metalworking machinery, including machines to cut, mill, form and weld.
notation: 161217
valid from: 2014-08-08
valid till: 2020-10-03

Machinery
type: BicsLevel2IndustryGroup
type: Classifier
type: NamedIndividual
is industry group of: Industrials
is anachronous version of: http://data.ga-group.nl/ics/bics/171013
is contemporary version of: http://data.ga-group.nl/ics/bics/1612
is replaced by: http://data.ga-group.nl/ics/bics/2020/171013
is version of: http://data.ga-group.nl/ics/bics/1612
is version of: http://data.ga-group.nl/ics/bics/171013
imported on: 2026-06-08T13:03:47.798Z
last refreshed on: 2026-06-08T13:03:47.798Z
source accessed on: 2019-12-03T20:05:01Z
source last accessed on: 2019-12-03T20:05:01Z
label: Macchinari @it
label: Machines @fr
label: Maquinário @pt
label: Maquinaria @es
label: Maschinen @de
label: Машинное оборудование @ru
label: 机械 @zh
label: 機械 @zh-hant
label: 機械工業 @ja
label: 기계류 @ko
definition: This industry group includes companies that manufacture machinery for use in a variety of applications.
notation: 1612
valid from: 2014-08-08
valid till: 2020-10-03

Ball & Roller Bearing
type: BicsLevel4SubIndustry
type: Classifier
type: NamedIndividual
is sub industry of: Fabricated Metal & Hardware
is anachronous version of: http://data.ga-group.nl/ics/bics/171015101010
is contemporary version of: http://data.ga-group.nl/ics/bics/16131010
is replaced by: http://data.ga-group.nl/ics/bics/2020/171015101010
is version of: http://data.ga-group.nl/ics/bics/16131010
is version of: http://data.ga-group.nl/ics/bics/171015101010
imported on: 2026-06-08T13:03:47.798Z
last refreshed on: 2026-06-08T13:03:47.798Z
source accessed on: 2019-12-03T20:05:01Z
source last accessed on: 2019-12-03T20:05:01Z
label: Cojinete de municiones @es
label: Cuscinetti a sfera e a rulli @it
label: Kugel- & Rolllager @de
label: Rolamentos de esferas e de cilindros @pt
label: Roulements à billes/rouleaux @fr
label: Шариковые и роликовые подшипники @ru
label: 各種ﾍﾞｱﾘﾝｸﾞ @ja
label: 滚珠轴承 @zh
label: 球狀物及滾子軸承 @zh-hant
label: 볼/롤러베어링 @ko
definition: This industry subgroup includes companies that manufacture rolling-element bearings designed to reduce rotational friction.
notation: 16131010
valid from: 2014-08-08
valid till: 2020-10-03

Bolt Washer
type: BicsLevel4SubIndustry
type: Classifier
type: NamedIndividual
is sub industry of: Fabricated Metal & Hardware
is anachronous version of: http://data.ga-group.nl/ics/bics/171015101011
is contemporary version of: http://data.ga-group.nl/ics/bics/16131011
is replaced by: http://data.ga-group.nl/ics/bics/2020/171015101011
is version of: http://data.ga-group.nl/ics/bics/16131011
is version of: http://data.ga-group.nl/ics/bics/171015101011
imported on: 2026-06-08T13:03:47.798Z
last refreshed on: 2026-06-08T13:03:47.798Z
source accessed on: 2019-12-03T20:05:01Z
source last accessed on: 2019-12-03T20:05:01Z
label: Anilhas de parafuso @pt
label: Arandela, perno @es
label: Bolzen & Unterlegscheiben @de
label: Bulloni dadi @it
label: Ecrous/rondelles @fr
label: Шурупы/шайбы @ru
label: 螺栓与垫圈 @zh
label: 螺釘墊圈 @zh-hant
label: 볼트/와셔제조업 @ko
label: ﾎﾞﾙﾄ･座金 @ja
definition: This industry subgroup includes companies that manufacture hardware, such as bolts, nuts, screws, rivets and washers.
notation: 16131011
valid from: 2014-08-08
valid till: 2020-10-03

Fabricated Pipe & Pipe Fitting
type: BicsLevel4SubIndustry
type: Classifier
type: NamedIndividual
is sub industry of: Fabricated Metal & Hardware
is anachronous version of: http://data.ga-group.nl/ics/bics/171015101012
is contemporary version of: http://data.ga-group.nl/ics/bics/16131012
is replaced by: http://data.ga-group.nl/ics/bics/2020/171015101012
is version of: http://data.ga-group.nl/ics/bics/16131012
is version of: http://data.ga-group.nl/ics/bics/171015101012
imported on: 2026-06-08T13:03:47.798Z
last refreshed on: 2026-06-08T13:03:47.798Z
source accessed on: 2019-12-03T20:05:01Z
source last accessed on: 2019-12-03T20:05:01Z
label: Tubería y conexiones @es
label: Tubi e guarnizioni fabbricati @it
label: Tubos fabricados e acessórios para tubos @pt
label: Tuyaux/raccords @fr
label: Verarbeitete Rohre & Rohrverbindungen @de
label: Готовые трубы и крепежные детали @ru
label: 導管製品 @zh-hant
label: 管道与管件 @zh
label: 金属製ﾊﾟｲﾌﾟ･付属品 @ja
label: 조립 파이프 및 파이프 장치 @ko
definition: This industry subgroup includes companies that manufacture pipes and various fittings for pipes and tubes made of metals other than iron or steel.
notation: 16131012
valid from: 2014-08-08
valid till: 2020-10-03

Custom Roll Forming
type: BicsLevel5Segment
type: Classifier
type: NamedIndividual
is level5 segment of: Forging & Stamping
is anachronous version of: http://data.ga-group.nl/ics/bics/17101510111010
is contemporary version of: http://data.ga-group.nl/ics/bics/1613101310
is replaced by: http://data.ga-group.nl/ics/bics/2020/17101510111010
is version of: http://data.ga-group.nl/ics/bics/1613101310
is version of: http://data.ga-group.nl/ics/bics/17101510111010
imported on: 2026-06-08T13:03:47.798Z
last refreshed on: 2026-06-08T13:03:47.798Z
source accessed on: 2019-12-03T20:05:01Z
source last accessed on: 2019-12-03T20:05:01Z
label: Formação de rolagem personalizada @pt
label: Frantumaz su ordinaz @it
label: Metales forjados @es
label: Profilage de produit @fr
label: Walzprofilieren @de
label: Специализир. роликовое профилирование @ru
label: 定制辊轧成型 @zh
label: 客製壓延成型 @zh-hant
label: 맞춤형압연성형업 @ko
label: ｶｽﾀﾑ圧延成型 @ja
definition: This segment includes companies that use roll forming to form either a long strand of metal or metal pieces in large quantities.
notation: 1613101310
valid from: 2014-08-08
valid till: 2020-10-03

Iron & Steel Forging
type: BicsLevel5Segment
type: Classifier
type: NamedIndividual
is level5 segment of: Forging & Stamping
is anachronous version of: http://data.ga-group.nl/ics/bics/17101510111011
is contemporary version of: http://data.ga-group.nl/ics/bics/1613101311
is replaced by: http://data.ga-group.nl/ics/bics/2020/17101510111011
is version of: http://data.ga-group.nl/ics/bics/1613101311
is version of: http://data.ga-group.nl/ics/bics/17101510111011
imported on: 2026-06-08T13:03:47.798Z
last refreshed on: 2026-06-08T13:03:47.798Z
source accessed on: 2019-12-03T20:05:01Z
source last accessed on: 2019-12-03T20:05:01Z
label: Eisen-&Stahlschmiede @de
label: Ferro e aço forjados @pt
label: Forgeage fer/acier @fr
label: Fucinaz ferro acciai @it
label: Fund hierro y acero @es
label: Ковка железа и стали @ru
label: 鉄･鉄鋼鍛造 @ja
label: 鋼鐵鍛造 @zh-hant
label: 钢铁锻造 @zh
label: 철강단조업 @ko
definition: This segment includes companies that hot, warm and cold forge both iron and steel.
notation: 1613101311
valid from: 2014-08-08
valid till: 2020-10-03

Metal Stamping
type: BicsLevel5Segment
type: Classifier
type: NamedIndividual
is level5 segment of: Forging & Stamping
is anachronous version of: http://data.ga-group.nl/ics/bics/17101510111012
is contemporary version of: http://data.ga-group.nl/ics/bics/1613101312
is replaced by: http://data.ga-group.nl/ics/bics/2020/17101510111012
is version of: http://data.ga-group.nl/ics/bics/1613101312
is version of: http://data.ga-group.nl/ics/bics/17101510111012
imported on: 2026-06-08T13:03:47.798Z
last refreshed on: 2026-06-08T13:03:47.798Z
source accessed on: 2019-12-03T20:05:01Z
source last accessed on: 2019-12-03T20:05:01Z
label: Estampa de metais @pt
label: Estampage de métaux @fr
label: Frantumaz metallo @it
label: Metales troquelados @es
label: Metallstanzen @de
label: Чеканка металла @ru
label: 金属模印 @zh
label: 金属ﾌﾟﾚｽ @ja
label: 金屬沖壓製造 @zh-hant
label: 공공시스템 건설업 @ko
definition: This segment includes companies that punch sheet metal into desired shapes using a pressing tool.
notation: 1613101312
valid from: 2014-08-08
valid till: 2020-10-03

Powder Metallurgy Parts
type: BicsLevel5Segment
type: Classifier
type: NamedIndividual
is level5 segment of: Forging & Stamping
is anachronous version of: http://data.ga-group.nl/ics/bics/17101510111013
is contemporary version of: http://data.ga-group.nl/ics/bics/1613101313
is replaced by: http://data.ga-group.nl/ics/bics/2020/17101510111013
is version of: http://data.ga-group.nl/ics/bics/1613101313
is version of: http://data.ga-group.nl/ics/bics/17101510111013
imported on: 2026-06-08T13:03:47.798Z
last refreshed on: 2026-06-08T13:03:47.798Z
source accessed on: 2019-12-03T20:05:01Z
source last accessed on: 2019-12-03T20:05:01Z
label: Partes metalúrgicas en polvo @es
label: Parti metallurgici in polvere @it
label: Peças de metalurgia dos pó @pt
label: Pièces pour la métallurgie des poudres @fr
label: Pulvermetallurgieteile @de
label: Детали порошковой металлургии @ru
label: 粉末冶金部品 @ja
label: 粉末冶金零件 @zh-hant
label: 粉末冶金零部件 @zh
label: 분말야금 부품 @ko
definition: This segment includes companies that are involved in powder metallurgy, in which the primary metal is divided into minute particles and passed through a die to form a cohesive structure.
notation: 1613101313
valid from: 2014-08-08
valid till: 2020-10-03

Forging & Stamping
type: BicsLevel4SubIndustry
type: Classifier
type: NamedIndividual
is sub industry of: Fabricated Metal & Hardware
is anachronous version of: http://data.ga-group.nl/ics/bics/171015101110
is contemporary version of: http://data.ga-group.nl/ics/bics/16131013
is replaced by: http://data.ga-group.nl/ics/bics/2020/171015101110
is version of: http://data.ga-group.nl/ics/bics/16131013
is version of: http://data.ga-group.nl/ics/bics/171015101110
imported on: 2026-06-08T13:03:47.798Z
last refreshed on: 2026-06-08T13:03:47.798Z
source accessed on: 2019-12-03T20:05:01Z
source last accessed on: 2019-12-03T20:05:01Z
label: Falsificação e estampa @pt
label: Forgeage, estampage @fr
label: Forjado y estampado @es
label: Fucinaz e frantumaz @it
label: Schmieden & Stanzen @de
label: Ковка и штамповка @ru
label: 金属鋳造･ﾌﾟﾚｽ @ja
label: 鍛造及沖壓 @zh-hant
label: 锻造与冲压 @zh
label: 단조 & 압형 @ko
definition: This industry subgroup includes companies that shape metal in various forms using various methods.
notation: 16131013
valid from: 2014-08-08
valid till: 2020-10-03

Hardware - Other
type: BicsLevel4SubIndustry
type: Classifier
type: Discontinued
type: NamedIndividual
is sub industry of: Fabricated Metal & Hardware
is contemporary version of: http://data.ga-group.nl/ics/bics/16131014
is version of: http://data.ga-group.nl/ics/bics/16131014
imported on: 2026-06-08T13:03:47.798Z
last refreshed on: 2026-06-08T13:03:47.798Z
source accessed on: 2019-12-03T20:05:01Z
source last accessed on: 2019-12-03T20:05:01Z
label: Ferramenta - Altro @it
label: Ferramentas - Outro @pt
label: Herrajes - otros @es
label: Quincaillerie - Autres @fr
label: Sonstige Metallwaren @de
label: Скобяные изделия @ru
label: 五金-其他 @zh
label: 機械設備-その他 @ja
label: 철물 제조업 - 기타 @ko
definition: This industry subgroup includes companies that manufacture other hardware products, such as scissors, razors, padlocks, hinges, hand tools, vices and clamps.
notation: 16131014
valid from: 2014-08-08
valid till: 2020-10-03

Industrial Pattern
type: BicsLevel4SubIndustry
type: Classifier
type: NamedIndividual
is sub industry of: Fabricated Metal & Hardware
is anachronous version of: http://data.ga-group.nl/ics/bics/171015101111
is contemporary version of: http://data.ga-group.nl/ics/bics/16131015
is replaced by: http://data.ga-group.nl/ics/bics/2020/171015101111
is version of: http://data.ga-group.nl/ics/bics/16131015
is version of: http://data.ga-group.nl/ics/bics/171015101111
imported on: 2026-06-08T13:03:47.798Z
last refreshed on: 2026-06-08T13:03:47.798Z
source accessed on: 2019-12-03T20:05:01Z
source last accessed on: 2019-12-03T20:05:01Z
label: Gabarits industriels @fr
label: Industriemuster @de
label: Modelli industriali @it
label: Padrão industrial @pt
label: Patrones indus @es
label: Промышленные образцы @ru
label: 工业制版生产 @zh
label: 工業樣板 @zh-hant
label: 産業用金型 @ja
label: 산업용패턴��조업 @ko
definition: This industry subgroup includes companies that manufacture foundry cores and patterns used to cast various shapes in either iron or steel mills.
notation: 16131015
valid from: 2014-08-08
valid till: 2020-10-03

Industrial Tanks & Storage
type: BicsLevel4SubIndustry
type: Classifier
type: NamedIndividual
is sub industry of: Fabricated Metal & Hardware
is anachronous version of: http://data.ga-group.nl/ics/bics/171015101112
is contemporary version of: http://data.ga-group.nl/ics/bics/16131016
is replaced by: http://data.ga-group.nl/ics/bics/2020/171015101112
is version of: http://data.ga-group.nl/ics/bics/16131016
is version of: http://data.ga-group.nl/ics/bics/171015101112
imported on: 2026-06-08T13:03:47.798Z
last refreshed on: 2026-06-08T13:03:47.798Z
source accessed on: 2019-12-03T20:05:01Z
source last accessed on: 2019-12-03T20:05:01Z
label: Armaz e tanques industriais @pt
label: Industrietanks & Speicher @de
label: Réservoirs industriels/stockage @fr
label: Serbatoi ind e stoccaggio @it
label: Tanques, almacenaje ind @es
label: Индустриальные резервуары для хранения @ru
label: 工业槽罐与仓储 @zh
label: 工業貯槽及儲存 @zh-hant
label: 産業用ﾀﾝｸ･貯蔵庫 @ja
label: 산업용 탱크 & 저장 @ko
definition: This industry subgroup includes companies that manufacture metal tanks, vessels and other containers.
notation: 16131016
valid from: 2014-08-08
valid till: 2020-10-03

Machine Shops
type: BicsLevel4SubIndustry
type: Classifier
type: NamedIndividual
is sub industry of: Fabricated Metal & Hardware
is anachronous version of: http://data.ga-group.nl/ics/bics/171015101113
is contemporary version of: http://data.ga-group.nl/ics/bics/16131017
is replaced by: http://data.ga-group.nl/ics/bics/2020/171015101113
is version of: http://data.ga-group.nl/ics/bics/16131017
is version of: http://data.ga-group.nl/ics/bics/171015101113
imported on: 2026-06-08T13:03:47.798Z
last refreshed on: 2026-06-08T13:03:47.798Z
source accessed on: 2019-12-03T20:05:01Z
source last accessed on: 2019-12-03T20:05:01Z
label: Ateliers d'usinage @fr
label: Lojas de máquinas @pt
label: Officine @it
label: Tiendas maquinaria @es
label: Werkstätten @de
label: Машиностроительные заводы @ru
label: 机械加工车间 @zh
label: 機械工場 @ja
label: 機械廠 @zh-hant
label: 기계공장 제조업 @ko
definition: This industry subgroup uses metalworking machinery for boring, milling, eroding, planing, sawing, grinding and welding of metalwork pieces.
notation: 16131017
valid from: 2014-08-08
valid till: 2020-10-03

Electroplating
type: BicsLevel5Segment
type: Classifier
type: NamedIndividual
is level5 segment of: Metal Coat & Treating
is anachronous version of: http://data.ga-group.nl/ics/bics/17101510111410
is contemporary version of: http://data.ga-group.nl/ics/bics/1613101810
is replaced by: http://data.ga-group.nl/ics/bics/2020/17101510111410
is version of: http://data.ga-group.nl/ics/bics/1613101810
is version of: http://data.ga-group.nl/ics/bics/17101510111410
imported on: 2026-06-08T13:03:47.798Z
last refreshed on: 2026-06-08T13:03:47.798Z
source accessed on: 2019-12-03T20:05:01Z
source last accessed on: 2019-12-03T20:05:01Z
label: Electrogalvanisation @fr
label: Electroplatinado @es
label: Galvanoplastia @pt
label: Galvanoplastica @it
label: Galvanotechnik @de
label: Гальванопластика @ru
label: 电镀 @zh
label: 電気めっき･研磨･陽極酸化業 @ja
label: 電鍍 @zh-hant
label: 전기도금 @ko
definition: This segment includes companies that electroplate products. Electroplating is designed to increase a product's resistance to abrasion and corrosion.
notation: 1613101810
valid from: 2014-08-08
valid till: 2020-10-03

Metal Coat & Engraving Svcs
type: BicsLevel5Segment
type: Classifier
type: NamedIndividual
is level5 segment of: Metal Coat & Treating
is anachronous version of: http://data.ga-group.nl/ics/bics/17101510111411
is contemporary version of: http://data.ga-group.nl/ics/bics/1613101811
is replaced by: http://data.ga-group.nl/ics/bics/2020/17101510111411
is version of: http://data.ga-group.nl/ics/bics/1613101811
is version of: http://data.ga-group.nl/ics/bics/17101510111411
imported on: 2026-06-08T13:03:47.798Z
last refreshed on: 2026-06-08T13:03:47.798Z
source accessed on: 2019-12-03T20:05:01Z
source last accessed on: 2019-12-03T20:05:01Z
label: Metallbeschichtungs- & Gravurdienste @de
label: Recubrimiento y grabado de metal @es
label: Serv gravure/revêtement métallique @fr
label: Serv revestimento de metal e gravura @pt
label: Serv rivestimento metallo e incisione @it
label: Металлизация и гравировка @ru
label: 金属涂层与雕刻服务 @zh
label: 金属表面処理･彫金ｻｰﾋﾞｽ @ja
label: 金屬塗料及雕刻服務 @zh-hant
label: 금속코팅&판화 서비스 @ko
definition: This segment includes companies that coat other products in metals (like aluminum) to improve the strength and heat resistance of the products.
notation: 1613101811
valid from: 2014-08-08
valid till: 2020-10-03

Metal Heat Treating
type: BicsLevel5Segment
type: Classifier
type: NamedIndividual
is level5 segment of: Metal Coat & Treating
is anachronous version of: http://data.ga-group.nl/ics/bics/17101510111412
is contemporary version of: http://data.ga-group.nl/ics/bics/1613101812
is replaced by: http://data.ga-group.nl/ics/bics/2020/17101510111412
is version of: http://data.ga-group.nl/ics/bics/1613101812
is version of: http://data.ga-group.nl/ics/bics/17101510111412
imported on: 2026-06-08T13:03:47.798Z
last refreshed on: 2026-06-08T13:03:47.798Z
source accessed on: 2019-12-03T20:05:01Z
source last accessed on: 2019-12-03T20:05:01Z
label: Traitmt therm. métal @fr
label: Tratam calor de met @es
label: Tratamento térmico de metais @pt
label: Tratt metallo caldo @it
label: Vergüten von Metall @de
label: Термообработка металлов @ru
label: 金属热处理 @zh
label: 金属熱処理 @ja
label: 金屬熱處理 @zh-hant
label: 금속열처리제조업 @ko
definition: This segment includes companies that burn and harden metals.
notation: 1613101812
valid from: 2014-08-08
valid till: 2020-10-03

Metal Coat & Treating
type: BicsLevel4SubIndustry
type: Classifier
type: NamedIndividual
is sub industry of: Fabricated Metal & Hardware
is anachronous version of: http://data.ga-group.nl/ics/bics/171015101114
is contemporary version of: http://data.ga-group.nl/ics/bics/16131018
is replaced by: http://data.ga-group.nl/ics/bics/2020/171015101114
is version of: http://data.ga-group.nl/ics/bics/16131018
is version of: http://data.ga-group.nl/ics/bics/171015101114
imported on: 2026-06-08T13:03:47.798Z
last refreshed on: 2026-06-08T13:03:47.798Z
source accessed on: 2019-12-03T20:05:01Z
source last accessed on: 2019-12-03T20:05:01Z
label: Cubrimiento y tratamiento de metales @es
label: Metal Coat e tratamento @pt
label: Metallbeschichtung & -behandlung @de
label: Revêtement métallique et traitement @fr
label: Rivest metall e tratt @it
label: Покрытие и обработка металлов @ru
label: 金属涂层与处理 @zh
label: 金属表面処理･熱処理 @ja
label: 金屬塗層及處理 @zh-hant
label: 금속 코팅 & 처리 @ko
definition: This industry subgroup includes companies that coat and treat metal, typically to improve the strength and heat resistance of the metal.
notation: 16131018
valid from: 2014-08-08
valid till: 2020-10-03

Metal Valve
type: BicsLevel4SubIndustry
type: Classifier
type: NamedIndividual
is sub industry of: Fabricated Metal & Hardware
is anachronous version of: http://data.ga-group.nl/ics/bics/171015101013
is contemporary version of: http://data.ga-group.nl/ics/bics/16131019
is replaced by: http://data.ga-group.nl/ics/bics/2020/171015101013
is version of: http://data.ga-group.nl/ics/bics/16131019
is version of: http://data.ga-group.nl/ics/bics/171015101013
imported on: 2026-06-08T13:03:47.798Z
last refreshed on: 2026-06-08T13:03:47.798Z
source accessed on: 2019-12-03T20:05:01Z
source last accessed on: 2019-12-03T20:05:01Z
label: Metallarmaturen @de
label: Soupapes en métal @fr
label: Válvula de metal @pt
label: Válvulas metálic @es
label: Valvole metallo @it
label: Металлическая арматура @ru
label: 金属阀门 @zh
label: 金属ﾊﾞﾙﾌﾞ @ja
label: 金屬活閥 @zh-hant
label: 금속 밸브 제조업 @ko
definition: This industry subgroup includes companies that manufacture metal valves used to regulate the passage of fluids.
notation: 16131019
valid from: 2014-08-08
valid till: 2020-10-03

Prefabricated Metal
type: BicsLevel5Segment
type: Classifier
type: NamedIndividual
is level5 segment of: Sheet Metal
is anachronous version of: http://data.ga-group.nl/ics/bics/17101510111510
is contemporary version of: http://data.ga-group.nl/ics/bics/1613102010
is replaced by: http://data.ga-group.nl/ics/bics/2020/17101510111510
is version of: http://data.ga-group.nl/ics/bics/1613102010
is version of: http://data.ga-group.nl/ics/bics/17101510111510
imported on: 2026-06-08T13:03:47.798Z
last refreshed on: 2026-06-08T13:03:47.798Z
source accessed on: 2019-12-03T20:05:01Z
source last accessed on: 2019-12-03T20:05:01Z
label: Métal pré-fabriqué @fr
label: Metal pré-fab @pt
label: Metal prefabricado @es
label: Prefab metal @it
label: Vorverarbeitete Metalle @de
label: Металлические заготовки @ru
label: 預鑄金屬 @zh-hant
label: 预制金属 @zh
label: 사전조립 금속 @ko
label: ﾌﾟﾚﾊﾌﾞ金属 @ja
definition: This segment includes companies that manufacture prefabricated metal buildings, panels and sections.
notation: 1613102010
valid from: 2014-08-08
valid till: 2020-10-03

Sheet Metal Work
type: BicsLevel5Segment
type: Classifier
type: NamedIndividual
is level5 segment of: Sheet Metal
is anachronous version of: http://data.ga-group.nl/ics/bics/17101510111511
is contemporary version of: http://data.ga-group.nl/ics/bics/1613102011
is replaced by: http://data.ga-group.nl/ics/bics/2020/17101510111511
is version of: http://data.ga-group.nl/ics/bics/1613102011
is version of: http://data.ga-group.nl/ics/bics/17101510111511
imported on: 2026-06-08T13:03:47.798Z
last refreshed on: 2026-06-08T13:03:47.798Z
source accessed on: 2019-12-03T20:05:01Z
source last accessed on: 2019-12-03T20:05:01Z
label: Assentador de chapa metálica @pt
label: Blechmetallarbeiten @de
label: Hojas metálicas @es
label: Lavorazione lamiera @it
label: Ouvrages en tôle @fr
label: Изделия из жести @ru
label: 板金加工 @ja
label: 钣金加工 @zh
label: 판금속가공제조업 @ko
definition: This segment includes companies that manufacture metal concrete forms, metal flues, metal ducts, metal studs and metal gutters. Products also include metal stairs, gates and ladders.
notation: 1613102011
valid from: 2014-08-08
valid till: 2020-10-03

Sheet Metal
type: BicsLevel4SubIndustry
type: Classifier
type: NamedIndividual
is sub industry of: Fabricated Metal & Hardware
is anachronous version of: http://data.ga-group.nl/ics/bics/171015101115
is contemporary version of: http://data.ga-group.nl/ics/bics/16131020
is replaced by: http://data.ga-group.nl/ics/bics/2020/171015101115
is version of: http://data.ga-group.nl/ics/bics/16131020
is version of: http://data.ga-group.nl/ics/bics/171015101115
imported on: 2026-06-08T13:03:47.798Z
last refreshed on: 2026-06-08T13:03:47.798Z
source accessed on: 2019-12-03T20:05:01Z
source last accessed on: 2019-12-03T20:05:01Z
label: Blechmetalle @de
label: Hojas metálicas @es
label: Lamiera @it
label: Placas de metal @pt
label: Tôle @fr
label: Металлолисты @ru
label: 板金 @zh-hant
label: 板金製品 @ja
label: 钣金 @zh
label: 판금속 제조업 @ko
definition: This industry subgroup includes companies that manufacture prefabricated metal buildings, panels, sections and sheet metal.
notation: 16131020
valid from: 2014-08-08
valid till: 2020-10-03

Fabricated Structural Metal
type: BicsLevel5Segment
type: Classifier
type: NamedIndividual
is level5 segment of: Structural Metal & Plate Work
is anachronous version of: http://data.ga-group.nl/ics/bics/17101510111610
is contemporary version of: http://data.ga-group.nl/ics/bics/1613102110
is replaced by: http://data.ga-group.nl/ics/bics/2020/17101510111610
is version of: http://data.ga-group.nl/ics/bics/1613102110
is version of: http://data.ga-group.nl/ics/bics/17101510111610
imported on: 2026-06-08T13:03:47.798Z
last refreshed on: 2026-06-08T13:03:47.798Z
source accessed on: 2019-12-03T20:05:01Z
source last accessed on: 2019-12-03T20:05:01Z
label: Elements de structures en métal @fr
label: Metais fabricados estruturados @pt
label: Metal estructural fabricado @es
label: Metalli strutturali fabbricati @it
label: Verarbeitende strukturierte Metalle @de
label: Готов. конструкц. металл @ru
label: 建築用金属製品 @ja
label: 結構金屬製品 @zh-hant
label: 金属结构件 @zh
label: 조립구조 금속 @ko
definition: This segment includes companies that manufacture products made of large metal plates used in the construction of real estate. Typically these plates are used in the construction of infrastructure, including highway supports and flood gates.
notation: 1613102110
valid from: 2014-08-08
valid till: 2020-10-03

Plate Work
type: BicsLevel5Segment
type: Classifier
type: NamedIndividual
is level5 segment of: Structural Metal & Plate Work
is anachronous version of: http://data.ga-group.nl/ics/bics/17101510111611
is contemporary version of: http://data.ga-group.nl/ics/bics/1613102111
is replaced by: http://data.ga-group.nl/ics/bics/2020/17101510111611
is version of: http://data.ga-group.nl/ics/bics/1613102111
is version of: http://data.ga-group.nl/ics/bics/17101510111611
imported on: 2026-06-08T13:03:47.798Z
last refreshed on: 2026-06-08T13:03:47.798Z
source accessed on: 2019-12-03T20:05:01Z
source last accessed on: 2019-12-03T20:05:01Z
label: Assentador de placa @pt
label: Fabricación platos @es
label: Plattenwaren @de
label: Prodotti lamiera @it
label: Tôles fortes @fr
label: Изделия из метал. плит @ru
label: 板材加工 @zh
label: 金属ﾌﾟﾚｰﾄ製品 @ja
label: 金屬板加工 @zh-hant
label: 판금가공 제조업 @ko
definition: This segment includes companies that manufacture products made of large metal plates that are not used in the construction of architectural structures.
notation: 1613102111
valid from: 2014-08-08
valid till: 2020-10-03

Structural Metal & Plate Work
type: BicsLevel4SubIndustry
type: Classifier
type: NamedIndividual
is sub industry of: Fabricated Metal & Hardware
is anachronous version of: http://data.ga-group.nl/ics/bics/171015101116
is contemporary version of: http://data.ga-group.nl/ics/bics/16131021
is replaced by: http://data.ga-group.nl/ics/bics/2020/171015101116
is version of: http://data.ga-group.nl/ics/bics/16131021
is version of: http://data.ga-group.nl/ics/bics/171015101116
imported on: 2026-06-08T13:03:47.798Z
last refreshed on: 2026-06-08T13:03:47.798Z
source accessed on: 2019-12-03T20:05:01Z
source last accessed on: 2019-12-03T20:05:01Z
label: Lamiera e metalli strutturali @it
label: Metais estruturados e assentador de placa @pt
label: Strukturierte Metall- & Plattenarbeiten @de
label: Tôles fortes et métal de structure @fr
label: Trabajos de placas y metal estructural @es
label: Структурн. метал. изделия и пластины @ru
label: 構造金属/板金製品 @ja
label: 結構金屬及金屬板 @zh-hant
label: 结构金属与板材加工 @zh
label: 철골&철판작업 @ko
definition: This industry subgroup includes companies that manufacture products made of large metal plates.
notation: 16131021
valid from: 2014-08-08
valid till: 2020-10-03

Spring (Heavy Gauge)
type: BicsLevel5Segment
type: Classifier
type: NamedIndividual
is level5 segment of: Wire Product
is anachronous version of: http://data.ga-group.nl/ics/bics/17101510111710
is contemporary version of: http://data.ga-group.nl/ics/bics/1613102210
is replaced by: http://data.ga-group.nl/ics/bics/2020/17101510111710
is version of: http://data.ga-group.nl/ics/bics/1613102210
is version of: http://data.ga-group.nl/ics/bics/17101510111710
imported on: 2026-06-08T13:03:47.798Z
last refreshed on: 2026-06-08T13:03:47.798Z
source accessed on: 2019-12-03T20:05:01Z
source last accessed on: 2019-12-03T20:05:01Z
label: Molas (calibre pesado) @pt
label: Molle (pesanti) @it
label: Resortes (calibre grueso) @es
label: Ressorts (en métal épais) @fr
label: Springfedererzeugnisse (Heavy Gauge) @de
label: Крупногабар. пружины @ru
label: 弹簧(大型量规) @zh
label: 重型彈簧 @zh-hant
label: 스프링 (중량) 제조업 @ko
label: ﾊﾞﾈ(重厚) @ja
definition: This segment includes companies that manufacture high-gauge springs.
notation: 1613102210
valid from: 2014-08-08
valid till: 2020-10-03

Spring (Light Gauge)
type: BicsLevel5Segment
type: Classifier
type: NamedIndividual
is level5 segment of: Wire Product
is anachronous version of: http://data.ga-group.nl/ics/bics/17101510111711
is contemporary version of: http://data.ga-group.nl/ics/bics/1613102211
is replaced by: http://data.ga-group.nl/ics/bics/2020/17101510111711
is version of: http://data.ga-group.nl/ics/bics/1613102211
is version of: http://data.ga-group.nl/ics/bics/17101510111711
imported on: 2026-06-08T13:03:47.798Z
last refreshed on: 2026-06-08T13:03:47.798Z
source accessed on: 2019-12-03T20:05:01Z
source last accessed on: 2019-12-03T20:05:01Z
label: Molas (calibre leve) @pt
label: Molle (leggere) @it
label: Resortes (calibre ligero) @es
label: Ressorts (en métal fin) @fr
label: Springfedererzeugnisse (Light Gauge) @de
label: Малогабаритные пружины @ru
label: 弹簧(小型量规) @zh
label: 輕型彈簧 @zh-hant
label: 스프링 (경량) 제조업 @ko
label: ﾊﾞﾈ(薄金) @ja
definition: This segment includes companies that manufacture low-gauge springs.
notation: 1613102211
valid from: 2014-08-08
valid till: 2020-10-03

Other Fabricated Wire Prods
type: BicsLevel5Segment
type: Classifier
type: Discontinued
type: NamedIndividual
is level5 segment of: Wire Product
is contemporary version of: http://data.ga-group.nl/ics/bics/1613102212
is version of: http://data.ga-group.nl/ics/bics/1613102212
imported on: 2026-06-08T13:03:47.798Z
last refreshed on: 2026-06-08T13:03:47.798Z
source accessed on: 2019-12-03T20:05:01Z
source last accessed on: 2019-12-03T20:05:01Z
label: Altri prod metallo fabbricato @it
label: Autres produits de tréfilage @fr
label: Otros productos de cable fabricado @es
label: Outros produtos de fios fabricados @pt
label: Sonstige verarb. Drahtprod. @de
label: Прочие готовые изделия из проволоки @ru
label: その他ﾜｲﾔ製品 @ja
label: 其他线材制品 @zh
label: 其他金屬線製品 @zh-hant
label: 기타조립전선제품 @ko
definition: This segment includes companies that manufacture wire products not elsewhere classified.
notation: 1613102212
valid from: 2014-08-08
valid till: 2020-10-03

Wire Product
type: BicsLevel4SubIndustry
type: Classifier
type: NamedIndividual
is sub industry of: Fabricated Metal & Hardware
is anachronous version of: http://data.ga-group.nl/ics/bics/171015101117
is contemporary version of: http://data.ga-group.nl/ics/bics/16131022
is replaced by: http://data.ga-group.nl/ics/bics/2020/171015101117
is version of: http://data.ga-group.nl/ics/bics/16131022
is version of: http://data.ga-group.nl/ics/bics/171015101117
imported on: 2026-06-08T13:03:47.798Z
last refreshed on: 2026-06-08T13:03:47.798Z
source accessed on: 2019-12-03T20:05:01Z
source last accessed on: 2019-12-03T20:05:01Z
label: Drahtprodukte @de
label: Prodotti filo metallico @it
label: Productos de alambre @es
label: Produits de tréfilage @fr
label: Produtos de fio @pt
label: Изделия из проволоки @ru
label: 彈簧及金屬線 @zh-hant
label: 線材 @ja
label: 线材 @zh
label: 전선 제품 제조업 @ko
definition: This industry subgroup includes companies that manufacture springs and wires. Typically, these products are made by passing drawn metal through progressively smaller dies or holes in draw plates.
notation: 16131022
valid from: 2014-08-08
valid till: 2020-10-03

Other Fabricated Metal Prods
type: BicsLevel4SubIndustry
type: Classifier
type: Discontinued
type: NamedIndividual
is sub industry of: Fabricated Metal & Hardware
is contemporary version of: http://data.ga-group.nl/ics/bics/16131023
is version of: http://data.ga-group.nl/ics/bics/16131023
imported on: 2026-06-08T13:03:47.798Z
last refreshed on: 2026-06-08T13:03:47.798Z
source accessed on: 2019-12-03T20:05:01Z
source last accessed on: 2019-12-03T20:05:01Z
label: Altri prodotti metallo fabbricato @it
label: Autres prod métal transformés @fr
label: Otros productos de metal fabricado @es
label: Outros produtos de metais fabricados @pt
label: Sonstige verarb. Metallprodukte @de
label: Прочие металлич. изделия @ru
label: その他金属加工製品 @ja
label: 其他金属制品 @zh
label: 其他金屬製品 @zh-hant
label: 기타조립금속제품 @ko
definition: This industry subgroup includes companies that manufacture fabricated metal products not elsewhere classified.
notation: 16131023
valid from: 2014-08-08
valid till: 2020-10-03

Fabricated Metal & Hardware
type: BicsLevel3Industry
type: Classifier
type: NamedIndividual
is industry of: Manufactured Goods
is anachronous version of: http://data.ga-group.nl/ics/bics/17101510
is contemporary version of: http://data.ga-group.nl/ics/bics/161310
is replaced by: http://data.ga-group.nl/ics/bics/2020/17101510
is version of: http://data.ga-group.nl/ics/bics/161310
is version of: http://data.ga-group.nl/ics/bics/17101510
imported on: 2026-06-08T13:03:47.798Z
last refreshed on: 2026-06-08T13:03:47.798Z
source accessed on: 2019-12-03T20:05:01Z
source last accessed on: 2019-12-03T20:05:01Z
label: Metais fabricados e hardware @pt
label: Metal fabricado y productos de ferretería @es
label: Metallo fabbricato e ferramenta @it
label: Quincaillerie et métaux transformés @fr
label: Verarbeitetes Metall & Metallwaren @de
label: Металлоконструкции и скобяные изделия @ru
label: 金属制品和五金 @zh
label: 金属製品･金物 @ja
label: 金屬製品及五金 @zh-hant
label: 조립금속&철물 @ko
definition: This industry includes companies that manufacture custom metal hardware used typically in the construction and manufacturing sectors. Fabricators typically specialize in specific manufacturing processes and create various products for many industries.
notation: 161310
valid from: 2014-08-08
valid till: 2020-10-03

Laminated Plastics
type: BicsLevel5Segment
type: Classifier
type: Discontinued
type: NamedIndividual
is level5 segment of: Plastic Products
is contemporary version of: http://data.ga-group.nl/ics/bics/1613111010
is version of: http://data.ga-group.nl/ics/bics/1613111010
imported on: 2026-06-08T13:03:47.798Z
last refreshed on: 2026-06-08T13:03:47.798Z
source accessed on: 2019-12-03T20:05:01Z
source last accessed on: 2019-12-03T20:05:01Z
label: Laminiertes Plastik @de
label: Plásticos laminados @es
label: Plastiques laminés @fr
label: Prodotti laminati plastici @it
label: Ламинат @ru
label: 多層ﾌﾟﾗｽﾁｯｸ @ja
label: 层压塑料 @zh
label: 薄片塑膠 @zh-hant
label: 적층 플라스틱 @ko
definition: This segment includes companies that manufacture laminated plastic profile shapes, such as plates, rods and sheets.
notation: 1613111010
valid from: 2014-08-08
valid till: 2020-10-03

Plastics Compounding
type: BicsLevel5Segment
type: Classifier
type: Discontinued
type: NamedIndividual
is level5 segment of: Plastic Products
is contemporary version of: http://data.ga-group.nl/ics/bics/1613111011
is version of: http://data.ga-group.nl/ics/bics/1613111011
imported on: 2026-06-08T13:03:47.798Z
last refreshed on: 2026-06-08T13:03:47.798Z
source accessed on: 2019-12-03T20:05:01Z
source last accessed on: 2019-12-03T20:05:01Z
label: Composición de plásticos @es
label: Composition de plastiques @fr
label: Composti plastici @it
label: Composto de plástico @pt
label: Plastikmischung @de
label: Пластиковые смеси @ru
label: 塑料复合品 @zh
label: 塑膠配��� @zh-hant
label: 플라스틱 컴파운딩 @ko
label: ﾌﾟﾗｽﾁｯｸ合成 @ja
definition: This segment includes companies that are engaged in custom mixing and blending of plastic resins made elsewhere.
notation: 1613111011
valid from: 2014-08-08
valid till: 2020-10-03

Polystyrene Foam Products
type: BicsLevel5Segment
type: Classifier
type: Discontinued
type: NamedIndividual
is level5 segment of: Plastic Products
is contemporary version of: http://data.ga-group.nl/ics/bics/1613111012
is version of: http://data.ga-group.nl/ics/bics/1613111012
imported on: 2026-06-08T13:03:47.798Z
last refreshed on: 2026-06-08T13:03:47.798Z
source accessed on: 2019-12-03T20:05:01Z
source last accessed on: 2019-12-03T20:05:01Z
label: Espumas y productos de poliestireno @es
label: Polysterenschaumstoffprodukte @de
label: Prodotti polistirolo espanso @it
label: Produits en mousse de polystyrène @fr
label: Produtos de espuma de isopor @pt
label: Продукция из пенополистирола @ru
label: 発泡ｽﾁﾛｰﾙ製品 @ja
label: 聚苯乙烯泡沫产品 @zh
label: 聚苯乙烯泡體產品 @zh-hant
label: 폴리스티렌 발포 제품 @ko
definition: This segment includes companies that manufacture polystyrene foam sheets or products.
notation: 1613111012
valid from: 2014-08-08
valid till: 2020-10-03

Unlaminated Plastic Film
type: BicsLevel5Segment
type: Classifier
type: Discontinued
type: NamedIndividual
is level5 segment of: Plastic Products
is contemporary version of: http://data.ga-group.nl/ics/bics/1613111013
is version of: http://data.ga-group.nl/ics/bics/1613111013
imported on: 2026-06-08T13:03:47.798Z
last refreshed on: 2026-06-08T13:03:47.798Z
source accessed on: 2019-12-03T20:05:01Z
source last accessed on: 2019-12-03T20:05:01Z
label: Filme plástico não laminado @pt
label: Films plastiques non stratifiés @fr
label: Hojas de plástico no laminadas @es
label: Nicht laminierte Plastikfilme @de
label: Pellicole plastica non laminate @it
label: Неламинир. пленка и листы @ru
label: 単層ﾌﾟﾗｽﾁｯｸﾌｨﾙﾑ @ja
label: 无层��塑料薄膜 @zh
label: 非層合塑膠薄膜 @zh-hant
label: 단층 플라스틱 필름 @ko
definition: This segment includes companies that convert plastic resins into plastic film and unlaminated sheets.
notation: 1613111013
valid from: 2014-08-08
valid till: 2020-10-03

Other Foam Products
type: BicsLevel5Segment
type: Classifier
type: Discontinued
type: NamedIndividual
is level5 segment of: Plastic Products
is contemporary version of: http://data.ga-group.nl/ics/bics/1613111014
is version of: http://data.ga-group.nl/ics/bics/1613111014
imported on: 2026-06-08T13:03:47.798Z
last refreshed on: 2026-06-08T13:03:47.798Z
source accessed on: 2019-12-03T20:05:01Z
source last accessed on: 2019-12-03T20:05:01Z
label: Autres produits en mousse @fr
label: Otros prod de goma @es
label: Outros produtos à base de espuma @pt
label: Prod prod in gomma @it
label: Sonstige Schaumstoffprodukte @de
label: Проч. продукция из пенополистирола @ru
label: その他発泡製品 @ja
label: 其他泡沫产品制造 @zh
label: 其他泡體產品 @zh-hant
label: 기타발포제품 @ko
definition: This segment includes companies that manufacture plastic foam products other than polystyrene.
notation: 1613111014
valid from: 2014-08-08
valid till: 2020-10-03

Plastic Products
type: BicsLevel4SubIndustry
type: Classifier
type: NamedIndividual
is sub industry of: Rubber & Plastic
is anachronous version of: http://data.ga-group.nl/ics/bics/1710151110
is contemporary version of: http://data.ga-group.nl/ics/bics/16131110
is replaced by: http://data.ga-group.nl/ics/bics/2020/1710151110
is version of: http://data.ga-group.nl/ics/bics/16131110
is version of: http://data.ga-group.nl/ics/bics/1710151110
imported on: 2026-06-08T13:03:47.798Z
last refreshed on: 2026-06-08T13:03:47.798Z
source accessed on: 2019-12-03T20:05:01Z
source last accessed on: 2019-12-03T20:05:01Z
label: Plastikprodukte @de
label: Prodotti in plastica @it
label: Productos plásticos @es
label: Produits en plastique @fr
label: Produtos plásticos @pt
label: Товары из пластмассы @ru
label: 塑料制品 @zh
label: 塑膠產品 @zh-hant
label: 플라스틱 제품 제조업 @ko
label: ﾌﾟﾗｽﾁｯｸ製品 @ja
definition: This industry subgroup includes companies that specialize in plastic manufacturing processes. Typically, these companies produce intermediate goods with industrial applications.
notation: 16131110
valid from: 2014-08-08
valid till: 2020-10-03

Rubber & Plastic Products
type: BicsLevel4SubIndustry
type: Classifier
type: Discontinued
type: NamedIndividual
is sub industry of: Rubber & Plastic
is contemporary version of: http://data.ga-group.nl/ics/bics/16131111
is version of: http://data.ga-group.nl/ics/bics/16131111
imported on: 2026-06-08T13:03:47.798Z
last refreshed on: 2026-06-08T13:03:47.798Z
source accessed on: 2019-12-03T20:05:01Z
source last accessed on: 2019-12-03T20:05:01Z
label: Gummi- & Kunstoffprodukte @de
label: Prodotti in plastica e gomma @it
label: Productos de goma y plástico @es
label: Produits en caoutchouc/plastique @fr
label: Produtos plásticos e de borracha @pt
label: Резиновые и пластмассовые товары @ru
label: 橡胶与塑���制品 @zh
label: 橡膠及塑膠產品 @zh-hant
label: 고무 & 플라스틱 상품 제조업 @ko
label: ｺﾞﾑ･ﾌﾟﾗｽﾁｯｸ製品 @ja
definition: This industry subgroup includes companies that manufacture rubber and plastic belts and hoses from natural and synthetic rubber and/or plastic resins.
notation: 16131111
valid from: 2014-08-08
valid till: 2020-10-03

Mechanical Rubber Products
type: BicsLevel5Segment
type: Classifier
type: NamedIndividual
is level5 segment of: Rubber Products
is anachronous version of: http://data.ga-group.nl/ics/bics/171015111110
is contemporary version of: http://data.ga-group.nl/ics/bics/1613111210
is replaced by: http://data.ga-group.nl/ics/bics/2020/171015111110
is version of: http://data.ga-group.nl/ics/bics/1613111210
is version of: http://data.ga-group.nl/ics/bics/171015111110
imported on: 2026-06-08T13:03:47.798Z
last refreshed on: 2026-06-08T13:03:47.798Z
source accessed on: 2019-12-03T20:05:01Z
source last accessed on: 2019-12-03T20:05:01Z
label: Mechanische Gummiprodukte @de
label: Prodotti meccanici in gomma @it
label: Productos mecánicos de goma @es
label: Produits de caoutchouc industriel @fr
label: Produtos mecânicos de borracha @pt
label: Резиновые изделия для механ. использ. @ru
label: 工業用ｺﾞﾑ製品 @ja
label: 机械橡胶制品 @zh
label: 機械用橡膠製品 @zh-hant
label: 산업용 고무제품 @ko
definition: This segment includes companies that manufacture rubber goods for mechanical applications. Includes O-rings, gaskets, seals and rubber bushings.
notation: 1613111210
valid from: 2014-08-08
valid till: 2020-10-03

Other Rubber Products
type: BicsLevel5Segment
type: Classifier
type: NamedIndividual
is level5 segment of: Rubber Products
is anachronous version of: http://data.ga-group.nl/ics/bics/171015111111
is contemporary version of: http://data.ga-group.nl/ics/bics/1613111211
is replaced by: http://data.ga-group.nl/ics/bics/2020/171015111111
is version of: http://data.ga-group.nl/ics/bics/1613111211
is version of: http://data.ga-group.nl/ics/bics/171015111111
imported on: 2026-06-08T13:03:47.798Z
last refreshed on: 2026-06-08T13:03:47.798Z
source accessed on: 2019-12-03T20:05:01Z
source last accessed on: 2019-12-03T20:05:01Z
label: Altri prodotti di gomma @it
label: Autres produits en caoutchouc @fr
label: Otros productos de goma @es
label: Outros produtos de borracha @pt
label: Sonstige Gummiprodukte @de
label: Прочие резиновые изделия @ru
label: その他ｺﾞﾑ製品 @ja
label: 其他橡胶制品 @zh
label: 所有其他橡膠製品 @zh-hant
label: 기타 고무제품 @ko
definition: This segment includes companies that manufacture rubber products made from natural and synthetic rubber not specified elsewhere classified.
notation: 1613111211
valid from: 2014-08-08
valid till: 2020-10-03

Rubber Products
type: BicsLevel4SubIndustry
type: Classifier
type: NamedIndividual
is sub industry of: Rubber & Plastic
is anachronous version of: http://data.ga-group.nl/ics/bics/1710151111
is contemporary version of: http://data.ga-group.nl/ics/bics/16131112
is replaced by: http://data.ga-group.nl/ics/bics/2020/1710151111
is version of: http://data.ga-group.nl/ics/bics/16131112
is version of: http://data.ga-group.nl/ics/bics/1710151111
imported on: 2026-06-08T13:03:47.798Z
last refreshed on: 2026-06-08T13:03:47.798Z
source accessed on: 2019-12-03T20:05:01Z
source last accessed on: 2019-12-03T20:05:01Z
label: Derivados da borracha @pt
label: Gummiprodukte @de
label: Prod gomma @it
label: Productos de goma @es
label: Produits en caoutchouc @fr
label: Продукция из резины @ru
label: 其他橡胶制品生产 @zh
label: 橡膠製品 @zh-hant
label: 고무 제품 @ko
label: ｺﾞﾑ製品 @ja
definition: This segment includes companies that specialize in manufacturing rubber products.
notation: 16131112
valid from: 2014-08-08
valid till: 2020-10-03

Rubber & Plastic
type: BicsLevel3Industry
type: Classifier
type: NamedIndividual
is industry of: Manufactured Goods
is anachronous version of: http://data.ga-group.nl/ics/bics/17101511
is contemporary version of: http://data.ga-group.nl/ics/bics/161311
is replaced by: http://data.ga-group.nl/ics/bics/2020/17101511
is version of: http://data.ga-group.nl/ics/bics/161311
is version of: http://data.ga-group.nl/ics/bics/17101511
imported on: 2026-06-08T13:03:47.798Z
last refreshed on: 2026-06-08T13:03:47.798Z
source accessed on: 2019-12-03T20:05:01Z
source last accessed on: 2019-12-03T20:05:01Z
label: Caoutchouc et plastique @fr
label: Goma y plástico @es
label: Gummi & Kunststoff @de
label: Plástico e borracha @pt
label: Plastica e gomma @it
label: Резина и пластмасса @ru
label: 橡胶与塑料 @zh
label: 橡膠及塑膠 @zh-hant
label: 고무 & 플라스틱 제조업 @ko
label: ｺﾞﾑ･ﾌﾟﾗｽﾁｯｸ @ja
definition: This industry includes companies that manufacture rubber and plastic products. Typically, these companies specialize in fabrication processes specific to plastics and rubbers. Products include laminated plastics, polystyrene foam, plastic film, and rubber products used in mechanical product manufacturing, such as gasket and absorption parts.
notation: 161311
valid from: 2014-08-08
valid till: 2020-10-03

Manufactured Goods
type: BicsLevel2IndustryGroup
type: Classifier
type: NamedIndividual
is industry group of: Industrials
is anachronous version of: http://data.ga-group.nl/ics/bics/171015
is contemporary version of: http://data.ga-group.nl/ics/bics/1613
is replaced by: http://data.ga-group.nl/ics/bics/2020/171015
is version of: http://data.ga-group.nl/ics/bics/1613
is version of: http://data.ga-group.nl/ics/bics/171015
imported on: 2026-06-08T13:03:47.798Z
last refreshed on: 2026-06-08T13:03:47.798Z
source accessed on: 2019-12-03T20:05:01Z
source last accessed on: 2019-12-03T20:05:01Z
label: Beni manifatturieri @it
label: Bens manufaturados @pt
label: Bien manufacturés @fr
label: Bienes fabricados @es
label: Industriegüter @de
label: Промышл. то��ары @ru
label: 制成品 @zh
label: 工業製品 @ja
label: 製造品 @zh-hant
label: 제조품 @ko
definition: This industry group includes companies that process materials by machine to manufacture products that are used to produce final goods that are consumed.
notation: 1613
valid from: 2014-08-08
valid till: 2020-10-03

Commercial Vehicles Mfg
type: BicsLevel4SubIndustry
type: Classifier
type: NamedIndividual
is sub industry of: Commercial Vehicles
is anachronous version of: http://data.ga-group.nl/ics/bics/1710141010
is contemporary version of: http://data.ga-group.nl/ics/bics/16141010
is replaced by: http://data.ga-group.nl/ics/bics/2020/1710141010
is version of: http://data.ga-group.nl/ics/bics/16141010
is version of: http://data.ga-group.nl/ics/bics/1710141010
imported on: 2026-06-08T13:03:47.798Z
last refreshed on: 2026-06-08T13:03:47.798Z
source accessed on: 2019-12-03T20:05:01Z
source last accessed on: 2019-12-03T20:05:01Z
label: Fab véhicules commerciaux @fr
label: Fabr de veículos comerciais @pt
label: Fabricación de vehículos comerciales @es
label: Nutzfahrzeugeherst. @de
label: Prod veicoli commerciali @it
label: Коммерч. транспорт @ru
label: 商業用自動車 @ja
label: 商用車 @zh-hant
label: 商用车制造 @zh
label: 상용 자동차 제조업 @ko
definition: This industry subgroup includes companies that manufacture on-highway commercial vehicles. This typically includes class 5 through class 8 commercial vehicles. Excludes vehicles for retail consumers (see Automobiles).
notation: 16141010
valid from: 2014-08-08
valid till: 2020-10-03

Medium-Duty Truck Engines
type: BicsLevel5Segment
type: Classifier
type: Discontinued
type: NamedIndividual
is level5 segment of: Commercial Vehicle Engines
is contemporary version of: http://data.ga-group.nl/ics/bics/1614101110
is version of: http://data.ga-group.nl/ics/bics/1614101110
imported on: 2026-06-08T13:03:47.798Z
last refreshed on: 2026-06-08T13:03:47.798Z
source accessed on: 2019-12-03T20:05:01Z
source last accessed on: 2019-12-03T20:05:01Z
label: Mittelschwere LKW-Motoren @de
label: Moteurs de camions intermédiaires @fr
label: Motores camión peso medio @es
label: Motores caminhão serv médios @pt
label: Motori autocarri medi @it
label: Двигатели для среднетоннаж. грузовиков @ru
label: 中型卡車引擎 @zh-hant
label: 中型载重汽车发动机 @zh
label: 中型ﾄﾗｯｸ･ｴﾝｼﾞﾝ @ja
label: 중형트럭 엔진 @ko
definition: This segment includes companies that manufacture engines for use in on-highway and off-highway vehicles with a gross vehicle weight of 3.5-16 tonnes (International) or 16,001-33,000 lbs. (U.S. Weight Class 6 & 7).
notation: 1614101110
valid from: 2014-08-08
valid till: 2020-10-03

Heavy-Duty Truck Engines
type: BicsLevel5Segment
type: Classifier
type: Discontinued
type: NamedIndividual
is level5 segment of: Commercial Vehicle Engines
is contemporary version of: http://data.ga-group.nl/ics/bics/1614101111
is version of: http://data.ga-group.nl/ics/bics/1614101111
imported on: 2026-06-08T13:03:47.798Z
last refreshed on: 2026-06-08T13:03:47.798Z
source accessed on: 2019-12-03T20:05:01Z
source last accessed on: 2019-12-03T20:05:01Z
label: Moteurs de camions légers @fr
label: Motores caminhão serv pesados @pt
label: Motores de camión pesado @es
label: Motori autocarri pesanti @it
label: Schwere LKW-Motoren @de
label: Двигатели для тяж. грузовиков @ru
label: 大型ﾄﾗｯｸ･ｴﾝｼﾞﾝ @ja
label: 重型卡車引擎 @zh-hant
label: 重型载货汽车发动机 @zh
label: 대형트럭 엔진 @ko
definition: This segment includes companies that manufacture engines for use in on-highway and off-highway vehicles with a gross vehicle weight of 16 tonnes or above (International) or 33,001 lbs. or above (U.S. Weight Class 8).
notation: 1614101111
valid from: 2014-08-08
valid till: 2020-10-03

Commercial Vehicle Engines
type: BicsLevel4SubIndustry
type: Classifier
type: Discontinued
type: NamedIndividual
is sub industry of: Commercial Vehicles
is contemporary version of: http://data.ga-group.nl/ics/bics/16141011
is version of: http://data.ga-group.nl/ics/bics/16141011
imported on: 2026-06-08T13:03:47.798Z
last refreshed on: 2026-06-08T13:03:47.798Z
source accessed on: 2019-12-03T20:05:01Z
source last accessed on: 2019-12-03T20:05:01Z
label: Fabric de veículos comerciais @pt
label: Moteurs de véhicules commerciaux @fr
label: Motores de vehículos comerciales @es
label: Motori veicoli commerciali @it
label: Nutzfahrzeugsmotoren @de
label: Двигатели для коммерч. транспорта @ru
label: 商業用自動車ｴﾝｼﾞﾝ @ja
label: 商用車引擎 @zh-hant
label: 商用车发动机 @zh
label: 상용 자동차 엔진 제조업 @ko
definition: This industry subgroup includes companies that manufacture engines for on-highway commercial vehicles.
notation: 16141011
valid from: 2014-08-08
valid till: 2020-10-03

Comml Veh Other Parts & Svcs
type: BicsLevel4SubIndustry
type: Classifier
type: NamedIndividual
is sub industry of: Commercial Vehicles
is anachronous version of: http://data.ga-group.nl/ics/bics/1710141011
is contemporary version of: http://data.ga-group.nl/ics/bics/16141012
is replaced by: http://data.ga-group.nl/ics/bics/2020/1710141011
is version of: http://data.ga-group.nl/ics/bics/16141012
is version of: http://data.ga-group.nl/ics/bics/1710141011
imported on: 2026-06-08T13:03:47.798Z
last refreshed on: 2026-06-08T13:03:47.798Z
source accessed on: 2019-12-03T20:05:01Z
source last accessed on: 2019-12-03T20:05:01Z
label: Altri serv e parti veicoli comm @it
label: Autres pièces/serv véh comm @fr
label: Outros serv e peças veículo com @pt
label: Sonstige Nutzfahrzeugsteile & Dienste @de
label: Vehículo comercial otros servicios y partes @es
label: Запчасти и обслуж. коммерч. транспорта @ru
label: 商用車其他零件及服務 @zh-hant
label: 商用車部品･ｻｰﾋﾞｽ @ja
label: 商用车其他零部件与服务 @zh
label: 상용 자동차 기타 부품 & 서비스 @ko
definition: This industry subgroup includes companies the manufacture other parts and components for on-highway commercial vehicles. Parts include brake systems, transmission, suspension, doors, steering, wheels and tires, and interior parts and accessories.
notation: 16141012
valid from: 2014-08-08
valid till: 2020-10-03

Tire Retreading
type: BicsLevel4SubIndustry
type: Classifier
type: Discontinued
type: NamedIndividual
is sub industry of: Commercial Vehicles
is contemporary version of: http://data.ga-group.nl/ics/bics/16141013
is version of: http://data.ga-group.nl/ics/bics/16141013
imported on: 2026-06-08T13:03:47.798Z
last refreshed on: 2026-06-08T13:03:47.798Z
source accessed on: 2019-12-03T20:05:01Z
source last accessed on: 2019-12-03T20:05:01Z
label: Fab. pneus rechapés @fr
label: Recauchutado llantas @es
label: Recauchutagem de pneu @pt
label: Reifenrunderneuerung @de
label: Ricostru battistrada @it
label: Ремонт шин @ru
label: 輪胎翻新 @zh-hant
label: 轮胎胎面翻新 @zh
label: 타이어재활용품제조 @ko
label: ﾀｲﾔ再生 @ja
definition: This industry subgroup includes companies that retread or recap the wearing surface of previously worn tires.
notation: 16141013
valid from: 2014-08-08
valid till: 2020-10-03

Truck Trailers
type: BicsLevel4SubIndustry
type: Classifier
type: NamedIndividual
is sub industry of: Commercial Vehicles
is anachronous version of: http://data.ga-group.nl/ics/bics/1710141012
is contemporary version of: http://data.ga-group.nl/ics/bics/16141014
is replaced by: http://data.ga-group.nl/ics/bics/2020/1710141012
is version of: http://data.ga-group.nl/ics/bics/16141014
is version of: http://data.ga-group.nl/ics/bics/1710141012
imported on: 2026-06-08T13:03:47.798Z
last refreshed on: 2026-06-08T13:03:47.798Z
source accessed on: 2019-12-03T20:05:01Z
source last accessed on: 2019-12-03T20:05:01Z
label: Caminhão de reboque @pt
label: Lkw-Anhänger @de
label: Remolques para camiones @es
label: Remorques de camions @fr
label: Rimorchi autocarri @it
label: Прицепы для грузовых автомобилей @ru
label: 卡車拖車 @zh-hant
label: 卡车拖车 @zh
label: 트럭트레일러제조업 @ko
label: ﾄﾗｯｸﾄﾚｰﾗｰ @ja
definition: This industry subgroup includes companies that manufacture trailers for on-highway commercial vehicles.
notation: 16141014
valid from: 2014-08-08
valid till: 2020-10-03

Commercial Vehicles
type: BicsLevel3Industry
type: Classifier
type: NamedIndividual
is industry of: Transportation Equipment
is anachronous version of: http://data.ga-group.nl/ics/bics/17101410
is contemporary version of: http://data.ga-group.nl/ics/bics/161410
is replaced by: http://data.ga-group.nl/ics/bics/2020/17101410
is version of: http://data.ga-group.nl/ics/bics/161410
is version of: http://data.ga-group.nl/ics/bics/17101410
imported on: 2026-06-08T13:03:47.798Z
last refreshed on: 2026-06-08T13:03:47.798Z
source accessed on: 2019-12-03T20:05:01Z
source last accessed on: 2019-12-03T20:05:01Z
label: Nutzfahrzeuge @de
label: Véhicules commerciaux @fr
label: Veíc comerciais @pt
label: Vehículos com @es
label: Veicoli commerciali @it
label: Коммерч. транспорт @ru
label: 商业车辆 @zh
label: 商業用自動車 @ja
label: 商用車 @zh-hant
label: 상업용 자동차 @ko
definition: This industry includes companies that manufacture on-highway commercial vehicles, trailers, engines and parts, including tire retreading.
notation: 161410
valid from: 2014-08-08
valid till: 2020-10-03

Diesel locomotives
type: BicsLevel5Segment
type: Classifier
type: NamedIndividual
is level5 segment of: Locomotives
is anachronous version of: http://data.ga-group.nl/ics/bics/171014111010
is contemporary version of: http://data.ga-group.nl/ics/bics/1614111010
is replaced by: http://data.ga-group.nl/ics/bics/2020/171014111010
is version of: http://data.ga-group.nl/ics/bics/1614111010
is version of: http://data.ga-group.nl/ics/bics/171014111010
imported on: 2026-06-08T13:03:47.798Z
last refreshed on: 2026-06-08T13:03:47.798Z
source accessed on: 2019-12-03T20:05:01Z
source last accessed on: 2019-12-03T20:05:01Z
label: Diesellokomotiven @de
label: Locomotivas a diesel @pt
label: Locomotive diesel @it
label: Locomotives diesel @fr
label: Locomotras diésel @es
label: Дизел. локомотивы @ru
label: 柴油机车 @zh
label: 柴油機車 @zh-hant
label: 디젤기관차 @ko
label: ﾃﾞｨｰｾﾞﾙ機関車 @ja
definition: This segment includes companies that manufacture diesel locomotives for the transport of both freight and passengers.
notation: 1614111010
valid from: 2014-08-08
valid till: 2020-10-03

Electric locomotives
type: BicsLevel5Segment
type: Classifier
type: NamedIndividual
is level5 segment of: Locomotives
is anachronous version of: http://data.ga-group.nl/ics/bics/171014111011
is contemporary version of: http://data.ga-group.nl/ics/bics/1614111011
is replaced by: http://data.ga-group.nl/ics/bics/2020/171014111011
is version of: http://data.ga-group.nl/ics/bics/1614111011
is version of: http://data.ga-group.nl/ics/bics/171014111011
imported on: 2026-06-08T13:03:47.798Z
last refreshed on: 2026-06-08T13:03:47.798Z
source accessed on: 2019-12-03T20:05:01Z
source last accessed on: 2019-12-03T20:05:01Z
label: Elektrische Lokomotiven @de
label: Locomotivas elétricas @pt
label: Locomotive elettriche @it
label: Locomotives électriques @fr
label: Locomotoras eléctricas @es
label: Элект. локомотивы @ru
label: 电力机车 @zh
label: 電力機車 @zh-hant
label: 電気機関車 @ja
label: 전기기관차 @ko
definition: This segment includes companies that manufacture electric locomotives for the transport of both freight and passengers.
notation: 1614111011
valid from: 2014-08-08
valid till: 2020-10-03

Locomotives
type: BicsLevel4SubIndustry
type: Classifier
type: NamedIndividual
is sub industry of: Railroad Rolling Stock
is anachronous version of: http://data.ga-group.nl/ics/bics/1710141110
is contemporary version of: http://data.ga-group.nl/ics/bics/16141110
is replaced by: http://data.ga-group.nl/ics/bics/2020/1710141110
is version of: http://data.ga-group.nl/ics/bics/16141110
is version of: http://data.ga-group.nl/ics/bics/1710141110
imported on: 2026-06-08T13:03:47.798Z
last refreshed on: 2026-06-08T13:03:47.798Z
source accessed on: 2019-12-03T20:05:01Z
source last accessed on: 2019-12-03T20:05:01Z
label: Locomotivas @pt
label: Locomotive @it
label: Locomotoras @es
label: Lokomotiven @de
label: Локомотивы @ru
label: 列車機車 @zh-hant
label: 机车 @zh
label: 機関車 @ja
label: 기관차 @ko
definition: This industry subgroup includes all types of rail-rolling stock locomotives for both suburban and trans-urban railway networks.
notation: 16141110
valid from: 2014-08-08
valid till: 2020-10-03

Rail Freight Cars
type: BicsLevel5Segment
type: Classifier
type: NamedIndividual
is level5 segment of: Rolling Stock - Railcars
is anachronous version of: http://data.ga-group.nl/ics/bics/171014111110
is contemporary version of: http://data.ga-group.nl/ics/bics/1614111110
is replaced by: http://data.ga-group.nl/ics/bics/2020/171014111110
is version of: http://data.ga-group.nl/ics/bics/1614111110
is version of: http://data.ga-group.nl/ics/bics/171014111110
imported on: 2026-06-08T13:03:47.798Z
last refreshed on: 2026-06-08T13:03:47.798Z
source accessed on: 2019-12-03T20:05:01Z
source last accessed on: 2019-12-03T20:05:01Z
label: Carros ferroviarios flete @es
label: Güterwagen @de
label: Vagões de frete @pt
label: Vagoni carico @it
label: Wagons de fret @fr
label: Грузовые вагоны @ru
label: 鉄道貨物車両 @ja
label: 鐵路貨車 @zh-hant
label: 铁路货车 @zh
label: 철도 화물차 @ko
definition: This segment includes companies that manufacture commercial freight railroad rolling stock.
notation: 1614111110
valid from: 2014-08-08
valid till: 2020-10-03

Rail Passenger Cars
type: BicsLevel5Segment
type: Classifier
type: NamedIndividual
is level5 segment of: Rolling Stock - Railcars
is anachronous version of: http://data.ga-group.nl/ics/bics/171014111111
is contemporary version of: http://data.ga-group.nl/ics/bics/1614111111
is replaced by: http://data.ga-group.nl/ics/bics/2020/171014111111
is version of: http://data.ga-group.nl/ics/bics/1614111111
is version of: http://data.ga-group.nl/ics/bics/171014111111
imported on: 2026-06-08T13:03:47.798Z
last refreshed on: 2026-06-08T13:03:47.798Z
source accessed on: 2019-12-03T20:05:01Z
source last accessed on: 2019-12-03T20:05:01Z
label: Carros ferroviarios pasaj @es
label: Personenwagen @de
label: Vagões de passageiro @pt
label: Vagoni passeggeri @it
label: Wagons de passagers @fr
label: Пассажирские вагоны @ru
label: 鉄道旅客車両 @ja
label: 鐵路客車 @zh-hant
label: 铁路客车 @zh
label: 철도 여객차 @ko
definition: This segment includes companies that manufacture passenger railroad cars for both suburban and intercity transport.
notation: 1614111111
valid from: 2014-08-08
valid till: 2020-10-03

Rolling Stock - Railcars
type: BicsLevel4SubIndustry
type: Classifier
type: NamedIndividual
is sub industry of: Railroad Rolling Stock
is anachronous version of: http://data.ga-group.nl/ics/bics/1710141111
is contemporary version of: http://data.ga-group.nl/ics/bics/16141111
is replaced by: http://data.ga-group.nl/ics/bics/2020/1710141111
is version of: http://data.ga-group.nl/ics/bics/16141111
is version of: http://data.ga-group.nl/ics/bics/1710141111
imported on: 2026-06-08T13:03:47.798Z
last refreshed on: 2026-06-08T13:03:47.798Z
source accessed on: 2019-12-03T20:05:01Z
source last accessed on: 2019-12-03T20:05:01Z
label: Mat circ - Vagões de trem @pt
label: Matériel roulant - Wagons @fr
label: Material rodante - automotores @es
label: Materiale rotabile - Vagoni @it
label: Wagen- & Lokomotivenbestand - Triebwagen @de
label: Подвижн. составы-Вагоны @ru
label: 机车车辆-有轨车 @zh
label: 軌道車輛-車廂 @zh-hant
label: 鉄道車両-車両 @ja
label: 철도차량-기관차 @ko
definition: This industry subgroup includes all types of rail-rolling stock for both suburban and trans-urban railway networks in both commercial and passenger transportation spaces.
notation: 16141111
valid from: 2014-08-08
valid till: 2020-10-03

Rolling Stock Electronic Sys
type: BicsLevel5Segment
type: Classifier
type: Discontinued
type: NamedIndividual
is level5 segment of: Rolling Stock Components & Sys
is contemporary version of: http://data.ga-group.nl/ics/bics/1614111210
is version of: http://data.ga-group.nl/ics/bics/1614111210
imported on: 2026-06-08T13:03:47.798Z
last refreshed on: 2026-06-08T13:03:47.798Z
source accessed on: 2019-12-03T20:05:01Z
source last accessed on: 2019-12-03T20:05:01Z
label: Mat rodante sistemas electrónicos @es
label: Sistemas eletrônicos material circ @pt
label: Sistemi elettronici materiale rotabile @it
label: Systèmes électroniques matériel roulant @fr
label: Wagen & Lokomotivenbestand - elektr. Komp. @de
label: Элект. компоненты подвиж. состава @ru
label: 机车车辆电子系统 @zh
label: 軌道車輛電子系統 @zh-hant
label: 鉄道車両用電子ｼｽﾃﾑ @ja
label: 철도차량 전자 시스템 @ko
definition: This segment includes companies that manufacture electronic parts and systems for railroad rolling stock (e.g., signals and switchgear).
notation: 1614111210
valid from: 2014-08-08
valid till: 2020-10-03

Rolling Stk Mech Components
type: BicsLevel5Segment
type: Classifier
type: Discontinued
type: NamedIndividual
is level5 segment of: Rolling Stock Components & Sys
is contemporary version of: http://data.ga-group.nl/ics/bics/1614111211
is version of: http://data.ga-group.nl/ics/bics/1614111211
imported on: 2026-06-08T13:03:47.798Z
last refreshed on: 2026-06-08T13:03:47.798Z
source accessed on: 2019-12-03T20:05:01Z
source last accessed on: 2019-12-03T20:05:01Z
label: Componentes mec mater circ @pt
label: Componenti mecc materiale rotabile @it
label: Composants mécaniques de matériel roulant @fr
label: Mat rodante componentes mec @es
label: Wagen & Lokomotivenbestand - mechan. Komp. @de
label: Мех. компон. подвиж. состава @ru
label: 机车车辆机械零部件 @zh
label: 軌道車輛機械組件 @zh-hant
label: 鉄道車両用機械部品 @ja
label: 철도차량 기계 부품 @ko
definition: This segment includes companies that manufacture mechanical parts and systems for railroad rolling stock (e.g., brakes and couplings).
notation: 1614111211
valid from: 2014-08-08
valid till: 2020-10-03

Rolling Stock Components & Sys
type: BicsLevel4SubIndustry
type: Classifier
type: NamedIndividual
is sub industry of: Railroad Rolling Stock
is anachronous version of: http://data.ga-group.nl/ics/bics/1710141112
is contemporary version of: http://data.ga-group.nl/ics/bics/16141112
is replaced by: http://data.ga-group.nl/ics/bics/2020/1710141112
is version of: http://data.ga-group.nl/ics/bics/16141112
is version of: http://data.ga-group.nl/ics/bics/1710141112
imported on: 2026-06-08T13:03:47.798Z
last refreshed on: 2026-06-08T13:03:47.798Z
source accessed on: 2019-12-03T20:05:01Z
source last accessed on: 2019-12-03T20:05:01Z
label: Compon e sistemas material circulante @pt
label: Componentes y sistemas de material rodante @es
label: Sis e componenti materiale rotabile @it
label: Systèmes et composants de matériel roulant @fr
label: Wagen- & Lokomotivenbestand - Komp. & Syst. @de
label: Компон. и системы подвижн. составов @ru
label: 机车车辆零部件与系统 @zh
label: 軌道車輛部件及系統 @zh-hant
label: 鉄道車両用部品･ｼｽﾃﾑ @ja
label: 철도차량 부품 & 시스템 @ko
definition: This industry subgroup includes companies that manufacture rolling stock components and systems. This may include electronic systems and mechanical components.
notation: 16141112
valid from: 2014-08-08
valid till: 2020-10-03

Rail Track Components & Sys
type: BicsLevel4SubIndustry
type: Classifier
type: NamedIndividual
is sub industry of: Railroad Rolling Stock
is anachronous version of: http://data.ga-group.nl/ics/bics/1710141113
is contemporary version of: http://data.ga-group.nl/ics/bics/16141113
is replaced by: http://data.ga-group.nl/ics/bics/2020/1710141113
is version of: http://data.ga-group.nl/ics/bics/16141113
is version of: http://data.ga-group.nl/ics/bics/1710141113
imported on: 2026-06-08T13:03:47.798Z
last refreshed on: 2026-06-08T13:03:47.798Z
source accessed on: 2019-12-03T20:05:01Z
source last accessed on: 2019-12-03T20:05:01Z
label: Compon e sistemas material circulante @pt
label: Componentes y sistemas ferroviarios @es
label: Eisenbahnschienenkomponenten & -systeme @de
label: Sistemi e componenti ferroviari @it
label: Syst et composants de voies ferrées @fr
label: Компоненты и системы ж/д путей @ru
label: 線路部品･ｼｽﾃﾑ @ja
label: 軌道部件及系統 @zh-hant
label: 轨道组件与系统 @zh
label: 철도 트랙 부품 & 시스템 @ko
definition: This industry subgroup includes companies that manufacture parts and systems for railway infrastructure networks, including switching systems and fasteners.
notation: 16141113
valid from: 2014-08-08
valid till: 2020-10-03

Railroad Rolling Stock
type: BicsLevel3Industry
type: Classifier
type: NamedIndividual
is industry of: Transportation Equipment
is anachronous version of: http://data.ga-group.nl/ics/bics/17101411
is contemporary version of: http://data.ga-group.nl/ics/bics/161411
is replaced by: http://data.ga-group.nl/ics/bics/2020/17101411
is version of: http://data.ga-group.nl/ics/bics/161411
is version of: http://data.ga-group.nl/ics/bics/17101411
imported on: 2026-06-08T13:03:47.798Z
last refreshed on: 2026-06-08T13:03:47.798Z
source accessed on: 2019-12-03T20:05:01Z
source last accessed on: 2019-12-03T20:05:01Z
label: Equipo ferroviario @es
label: Matériel ferroviaire roulant @fr
label: Material circulante ferroviário @pt
label: Sistemi trasporto ferroviario @it
label: Wagen- & Lokomotivenbestand @de
label: Ж/д подвижные составы @ru
label: 軌道車輛及車廂 @zh-hant
label: 鉄道車両 @ja
label: 铁路机车车辆 @zh
label: 철도 차량 @ko
definition: This industry includes companies that manufacture locomotives, transit passenger service cars, freight cars, railroads and rail equipment parts.
notation: 161411
valid from: 2014-08-08
valid till: 2020-10-03

Bulk Carriers
type: BicsLevel5Segment
type: Classifier
type: Discontinued
type: NamedIndividual
is level5 segment of: Shipbuilding & Repair
is contemporary version of: http://data.ga-group.nl/ics/bics/1614121010
is version of: http://data.ga-group.nl/ics/bics/1614121010
imported on: 2026-06-08T13:03:47.798Z
last refreshed on: 2026-06-08T13:03:47.798Z
source accessed on: 2019-12-03T20:05:01Z
source last accessed on: 2019-12-03T20:05:01Z
label: Cargas a granel @pt
label: Graneleros @es
label: Massengutfrachter @de
label: Navi carico @it
label: Vraquiers @fr
label: Суды для перевозки насыпных грузов @ru
label: ばら積船 @ja
label: 散装货轮 @zh
label: 散裝貨輪 @zh-hant
label: 벌크선 @ko
definition: This segment includes companies that manufacture bulk carrier ships. Bulk carrier ships carry unpackaged bulk cargo like coal or grain in holds.
notation: 1614121010
valid from: 2014-08-08
valid till: 2020-10-03

Container Ships
type: BicsLevel5Segment
type: Classifier
type: Discontinued
type: NamedIndividual
is level5 segment of: Shipbuilding & Repair
is contemporary version of: http://data.ga-group.nl/ics/bics/1614121011
is version of: http://data.ga-group.nl/ics/bics/1614121011
imported on: 2026-06-08T13:03:47.798Z
last refreshed on: 2026-06-08T13:03:47.798Z
source accessed on: 2019-12-03T20:05:01Z
source last accessed on: 2019-12-03T20:05:01Z
label: Buques contenedores @es
label: Containerschiffe @de
label: Navi cisterna @it
label: Navios contêiner @pt
label: Navires porte-conteneurs @fr
label: Контейнерные суда @ru
label: 貨櫃船 @zh-hant
label: 集装箱船 @zh
label: 컨테이너선 @ko
label: ｺﾝﾃﾅ船 @ja
definition: This segment includes companies that manufacture container ships. Container ships transport shipping containers or intermodal containers for commercial freight transport.
notation: 1614121011
valid from: 2014-08-08
valid till: 2020-10-03

Cruise Ships
type: BicsLevel5Segment
type: Classifier
type: Discontinued
type: NamedIndividual
is level5 segment of: Shipbuilding & Repair
is contemporary version of: http://data.ga-group.nl/ics/bics/1614121012
is version of: http://data.ga-group.nl/ics/bics/1614121012
imported on: 2026-06-08T13:03:47.798Z
last refreshed on: 2026-06-08T13:03:47.798Z
source accessed on: 2019-12-03T20:05:01Z
source last accessed on: 2019-12-03T20:05:01Z
label: Bateaux de croisière @fr
label: Cruceros @es
label: Kreuzfahrtschiffe @de
label: Navi da crociera @it
label: Navios cruzeiro @pt
label: Круизные суда @ru
label: 游轮 @zh
label: 観光船 @ja
label: 郵輪 @zh-hant
label: 크루즈선 @ko
definition: This segment includes companies that manufacture cruise ships. Cruise ships are used for passenger pleasure voyages where many amenities are provided.
notation: 1614121012
valid from: 2014-08-08
valid till: 2020-10-03

Ferries
type: BicsLevel5Segment
type: Classifier
type: Discontinued
type: NamedIndividual
is level5 segment of: Shipbuilding & Repair
is contemporary version of: http://data.ga-group.nl/ics/bics/1614121013
is version of: http://data.ga-group.nl/ics/bics/1614121013
imported on: 2026-06-08T13:03:47.798Z
last refreshed on: 2026-06-08T13:03:47.798Z
source accessed on: 2019-12-03T20:05:01Z
source last accessed on: 2019-12-03T20:05:01Z
label: Balsas @pt
label: Fähren @de
label: Traghetti @it
label: Transbordadores @es
label: Паромы @ru
label: 渡輪 @zh-hant
label: 轮渡 @zh
label: 페리 @ko
label: ﾌｪﾘｰ @ja
definition: This segment includes companies that manufacture passenger ferries. Ferries are used for passenger transportation services.
notation: 1614121013
valid from: 2014-08-08
valid till: 2020-10-03

General Cargo Ships
type: BicsLevel5Segment
type: Classifier
type: Discontinued
type: NamedIndividual
is level5 segment of: Shipbuilding & Repair
is contemporary version of: http://data.ga-group.nl/ics/bics/1614121014
is version of: http://data.ga-group.nl/ics/bics/1614121014
imported on: 2026-06-08T13:03:47.798Z
last refreshed on: 2026-06-08T13:03:47.798Z
source accessed on: 2019-12-03T20:05:01Z
source last accessed on: 2019-12-03T20:05:01Z
label: Allgemeine Fachtschiffe @de
label: Barcos carga general @es
label: Bateaux cargos @fr
label: Navi da carico generale @it
label: Navios de carga geral @pt
label: Суда для перевозки груз��в общ. назнач. @ru
label: 一般貨物船 @ja
label: 普通货船 @zh
label: 雜貨貨船 @zh-hant
label: 일반 화물선 @ko
definition: This segment includes companies that manufacture all other freight cargo transportation ships.
notation: 1614121014
valid from: 2014-08-08
valid till: 2020-10-03

LNG Carriers
type: BicsLevel5Segment
type: Classifier
type: Discontinued
type: NamedIndividual
is level5 segment of: Shipbuilding & Repair
is contemporary version of: http://data.ga-group.nl/ics/bics/1614121015
is version of: http://data.ga-group.nl/ics/bics/1614121015
imported on: 2026-06-08T13:03:47.798Z
last refreshed on: 2026-06-08T13:03:47.798Z
source accessed on: 2019-12-03T20:05:01Z
source last accessed on: 2019-12-03T20:05:01Z
label: Cargadores de GNL @es
label: Cargas GNL @pt
label: LNG 운반선 @ko
label: LNG-Tanker @de
label: LNG輸送船 @ja
label: LNG运输船 @zh
label: Navi GNL @it
label: Transporteurs de GNL @fr
label: Суда для перевозки СПГ @ru
label: 液化天然氣船 @zh-hant
definition: This segment includes companies that manufacture liquefied natural gas ships. These LNG carriers are specially designed to transport liquefied natural gas.
notation: 1614121015
valid from: 2014-08-08
valid till: 2020-10-03

Oil Tankers
type: BicsLevel5Segment
type: Classifier
type: Discontinued
type: NamedIndividual
is level5 segment of: Shipbuilding & Repair
is contemporary version of: http://data.ga-group.nl/ics/bics/1614121016
is version of: http://data.ga-group.nl/ics/bics/1614121016
imported on: 2026-06-08T13:03:47.798Z
last refreshed on: 2026-06-08T13:03:47.798Z
source accessed on: 2019-12-03T20:05:01Z
source last accessed on: 2019-12-03T20:05:01Z
label: Cisternas petroleras @es
label: Pétroliers @fr
label: Petroleiros @pt
label: Petroliere @it
label: Öltanker @de
label: Нефтяные танкеры @ru
label: 油輪 @zh-hant
label: 油轮 @zh
label: 石油ﾀﾝｶｰ @ja
label: 석유 탱커선 @ko
definition: This segment includes companies that manufacture oil tanker ships. These oil tankers are designed for bulk transportation of oil.
notation: 1614121016
valid from: 2014-08-08
valid till: 2020-10-03

Ro-Ro Carriers
type: BicsLevel5Segment
type: Classifier
type: Discontinued
type: NamedIndividual
is level5 segment of: Shipbuilding & Repair
is contemporary version of: http://data.ga-group.nl/ics/bics/1614121017
is version of: http://data.ga-group.nl/ics/bics/1614121017
imported on: 2026-06-08T13:03:47.798Z
last refreshed on: 2026-06-08T13:03:47.798Z
source accessed on: 2019-12-03T20:05:01Z
source last accessed on: 2019-12-03T20:05:01Z
label: Fabricantes Ro-Ro @es
label: Navi Ro-Ro @it
label: Ro-Ro-Frachter @de
label: Ro-Ro船･自動車船 @ja
label: Rouliers @fr
label: Transportadoras Ro-Ro @pt
label: Трейлер. и пассаж. автомоб. @ru
label: 滚装船 @zh
label: 滾裝船/PTCT @zh-hant
label: 로로/PCTC @ko
definition: This segment includes companies that manufacture roll-on/roll-off (Ro-Ro) ships and passenger car transportation carriers. Ro-Ro ships are designed to allow vehicles to drive on and drive off the ships.
notation: 1614121017
valid from: 2014-08-08
valid till: 2020-10-03

Shipbuilding & Repair
type: BicsLevel4SubIndustry
type: Classifier
type: NamedIndividual
is sub industry of: Shipbuilding
is anachronous version of: http://data.ga-group.nl/ics/bics/1710141210
is contemporary version of: http://data.ga-group.nl/ics/bics/16141210
is replaced by: http://data.ga-group.nl/ics/bics/2020/1710141210
is version of: http://data.ga-group.nl/ics/bics/16141210
is version of: http://data.ga-group.nl/ics/bics/1710141210
imported on: 2026-06-08T13:03:47.798Z
last refreshed on: 2026-06-08T13:03:47.798Z
source accessed on: 2019-12-03T20:05:01Z
source last accessed on: 2019-12-03T20:05:01Z
label: Construcción naval y reparación @es
label: Construction navale et réparation @fr
label: Costruzione e riparazione navale @it
label: Fabr de navios e reparos @pt
label: Schiffsbau & -reparatur @de
label: Строительство и ремонт судов @ru
label: 造船与维修 @zh
label: 造船及維修 @zh-hant
label: 造船･船舶修理 @ja
label: 조선 & 수리 @ko
definition: This industry subgroup includes companies that manufacture and repair ships for commercial use.
notation: 16141210
valid from: 2014-08-08
valid till: 2020-10-03

Marine Parts & Services
type: BicsLevel4SubIndustry
type: Classifier
type: NamedIndividual
is sub industry of: Shipbuilding
is anachronous version of: http://data.ga-group.nl/ics/bics/1710141211
is contemporary version of: http://data.ga-group.nl/ics/bics/16141211
is replaced by: http://data.ga-group.nl/ics/bics/2020/1710141211
is version of: http://data.ga-group.nl/ics/bics/16141211
is version of: http://data.ga-group.nl/ics/bics/1710141211
imported on: 2026-06-08T13:03:47.798Z
last refreshed on: 2026-06-08T13:03:47.798Z
source accessed on: 2019-12-03T20:05:01Z
source last accessed on: 2019-12-03T20:05:01Z
label: Partes y servicios marinos @es
label: Peças e serviços marítimos @pt
label: Pièces/serv industrie navale @fr
label: Porti e servizi marittimi @it
label: Schiffsteile & Dienste @de
label: Запчасти и облуж. кораблей @ru
label: 海洋部品･ｻｰﾋﾞｽ @ja
label: 海運售後市場零件/服務 @zh-hant
label: 船舶零部件与服务 @zh
label: 해양 부품 & 서비스 @ko
definition: This industry subgroup includes companies that manufacture commercial ship parts and provide aftermarket services.
notation: 16141211
valid from: 2014-08-08
valid till: 2020-10-03

Marine Propulsion & Pwr Plants
type: BicsLevel4SubIndustry
type: Classifier
type: Discontinued
type: NamedIndividual
is sub industry of: Shipbuilding
is contemporary version of: http://data.ga-group.nl/ics/bics/16141212
is version of: http://data.ga-group.nl/ics/bics/16141212
imported on: 2026-06-08T13:03:47.798Z
last refreshed on: 2026-06-08T13:03:47.798Z
source accessed on: 2019-12-03T20:05:01Z
source last accessed on: 2019-12-03T20:05:01Z
label: Instal energia e propulsão marítimas @pt
label: Plantas de propulsión marina y eléctr @es
label: Propulsion marine/centrales élect @fr
label: Propulsione e centrali energia marina @it
label: Schiffsantriebe & Kraftwerke @de
label: Корабел. энерг. установки и электрост. @ru
label: 海洋推進ｼｽﾃﾑ･発電所 @ja
label: 船舶动力与发电厂 @zh
label: 輪機動力及電廠 @zh-hant
label: 해양 추진장비 & 발전소 @ko
definition: This industry subgroup includes all companies that manufacture power and propulsion plants and engines for marine applications.
notation: 16141212
valid from: 2014-08-08
valid till: 2020-10-03

Shipbuilding
type: BicsLevel3Industry
type: Classifier
type: NamedIndividual
is industry of: Transportation Equipment
is anachronous version of: http://data.ga-group.nl/ics/bics/17101412
is contemporary version of: http://data.ga-group.nl/ics/bics/161412
is replaced by: http://data.ga-group.nl/ics/bics/2020/17101412
is version of: http://data.ga-group.nl/ics/bics/161412
is version of: http://data.ga-group.nl/ics/bics/17101412
imported on: 2026-06-08T13:03:47.798Z
last refreshed on: 2026-06-08T13:03:47.798Z
source accessed on: 2019-12-03T20:05:01Z
source last accessed on: 2019-12-03T20:05:01Z
label: Construcción naval @es
label: Construction navale @fr
label: Costruzione navale @it
label: Fabricação de navios @pt
label: Schiffsbau @de
label: Строительство судов @ru
label: 造船 @ja
label: 조선 @ko
definition: This industry includes companies that manufacture ships and boats for commercial use. Commercial ships include bulk carriers, container ships, cruise ships, ferries and oil tankers. Excludes yachts and recreational boats (see Recreational Vehicles).
notation: 161412
valid from: 2014-08-08
valid till: 2020-10-03

Transportation Equipment
type: BicsLevel2IndustryGroup
type: Classifier
type: NamedIndividual
is industry group of: Industrials
is anachronous version of: http://data.ga-group.nl/ics/bics/171014
is contemporary version of: http://data.ga-group.nl/ics/bics/1614
is replaced by: http://data.ga-group.nl/ics/bics/2020/171014
is version of: http://data.ga-group.nl/ics/bics/1614
is version of: http://data.ga-group.nl/ics/bics/171014
imported on: 2026-06-08T13:03:47.798Z
last refreshed on: 2026-06-08T13:03:47.798Z
source accessed on: 2019-12-03T20:05:01Z
source last accessed on: 2019-12-03T20:05:01Z
label: Attrezzature da trasporto @it
label: Equipamentos de transportes @pt
label: Equipo de transporte @es
label: Matériel de transport @fr
label: Transportausrüstung @de
label: Транспортное оборудование @ru
label: 交通运输设备 @zh
label: 輸送用機器 @ja
label: 運輸設備 @zh-hant
label: 운송 장비 @ko
definition: This industry group includes companies that manufacture on-highway commercial vehicles and parts, railroad rolling stock and shipbuilding transportation equipment.
notation: 1614
valid from: 2014-08-08
valid till: 2020-10-03

Carpentry Contractors
type: BicsLevel5Segment
type: Classifier
type: Discontinued
type: NamedIndividual
is level5 segment of: Bldg Finishing Contractors
is contemporary version of: http://data.ga-group.nl/ics/bics/1615101010
is version of: http://data.ga-group.nl/ics/bics/1615101010
imported on: 2026-06-08T13:03:47.798Z
last refreshed on: 2026-06-08T13:03:47.798Z
source accessed on: 2019-12-03T20:05:01Z
source last accessed on: 2019-12-03T20:05:01Z
label: Cntrctrs de carpintaria @pt
label: Imprend falegnameria @it
label: Instalac carpentería @es
label: Ss-traitnt menuisier @fr
label: Tischlereien @de
label: Подрядчики по плотницким отделочным работам @ru
label: 大工工事業 @ja
label: 最後修整木工承包 @zh-hant
label: 木工项目承包商 @zh
label: 창호 공사업 @ko
definition: This segment includes companies that provide carpentry services, such as the construction and installation of countertops, doors and windows, and kitchen cabinets.
notation: 1615101010
valid from: 2014-08-08
valid till: 2020-10-03

Drywall & Insulation Contractors
type: BicsLevel5Segment
type: Classifier
type: Discontinued
type: NamedIndividual
is level5 segment of: Bldg Finishing Contractors
is contemporary version of: http://data.ga-group.nl/ics/bics/1615101011
is version of: http://data.ga-group.nl/ics/bics/1615101011
imported on: 2026-06-08T13:03:47.798Z
last refreshed on: 2026-06-08T13:03:47.798Z
source accessed on: 2019-12-03T20:05:01Z
source last accessed on: 2019-12-03T20:05:01Z
label: Bauunternehmen für Trockenwände & Isolierung @de
label: Contratistas de muros falsos y aislamiento @es
label: Empreiteiros de isolamento e paredes de gesso @pt
label: Entrep cloison sèche/isolation @fr
label: Imprend muri a secco e pannelli isolanti @it
label: Подрядчики по установке гипсок. @ru
label: 乾牆及隔音承包 @zh-hant
label: 干墙与绝缘承包商 @zh
label: 건식벽체 및 단열재 공사업 @ko
label: ﾄﾞﾗｲｳｫｰﾙ･断熱工事請負 @ja
definition: This segment includes companies that install drywall and insulation, such as foam insulation and ceiling tiles.
notation: 1615101011
valid from: 2014-08-08
valid till: 2020-10-03

Flooring Contractors
type: BicsLevel5Segment
type: Classifier
type: Discontinued
type: NamedIndividual
is level5 segment of: Bldg Finishing Contractors
is contemporary version of: http://data.ga-group.nl/ics/bics/1615101012
is version of: http://data.ga-group.nl/ics/bics/1615101012
imported on: 2026-06-08T13:03:47.798Z
last refreshed on: 2026-06-08T13:03:47.798Z
source accessed on: 2019-12-03T20:05:01Z
source last accessed on: 2019-12-03T20:05:01Z
label: Empreiteiros de piso @pt
label: Fußbodeninstallation @de
label: Imprend pavimenti @it
label: Instalación de pisos @es
label: Sstraitant revêt sol @fr
label: Подрядчики по напольным работам @ru
label: 地板承包 @zh-hant
label: 地面承包商 @zh
label: 床工事業 @ja
label: 마루 공사업 @ko
definition: This segment includes companies that install flooring and carpeting, including hardwood floors, floor tiles, linoleum and parquet flooring.
notation: 1615101012
valid from: 2014-08-08
valid till: 2020-10-03

Painting & Wall Covering Contr
type: BicsLevel5Segment
type: Classifier
type: Discontinued
type: NamedIndividual
is level5 segment of: Bldg Finishing Contractors
is contemporary version of: http://data.ga-group.nl/ics/bics/1615101013
is version of: http://data.ga-group.nl/ics/bics/1615101013
imported on: 2026-06-08T13:03:47.798Z
last refreshed on: 2026-06-08T13:03:47.798Z
source accessed on: 2019-12-03T20:05:01Z
source last accessed on: 2019-12-03T20:05:01Z
label: Empr pintura e revestimento de parede @pt
label: Entrep peinture/papier peint @fr
label: Imprend pittura e rivestimento parete @it
label: Malerunternehmen @de
label: Pintura y recubr de paredes @es
label: Подрядчики по покраске и облицовке стен @ru
label: 塗装･壁内装工事請負 @ja
label: 油漆与墙面承包商 @zh
label: 粉刷及壁材承包 @zh-hant
label: 페인트&벽도장 공사업 @ko
definition: This segment includes companies that paint structures and provide wall coverings on a contract basis.
notation: 1615101013
valid from: 2014-08-08
valid till: 2020-10-03

Site Preparation Contractors
type: BicsLevel5Segment
type: Classifier
type: Discontinued
type: NamedIndividual
is level5 segment of: Bldg Finishing Contractors
is contemporary version of: http://data.ga-group.nl/ics/bics/1615101014
is version of: http://data.ga-group.nl/ics/bics/1615101014
imported on: 2026-06-08T13:03:47.798Z
last refreshed on: 2026-06-08T13:03:47.798Z
source accessed on: 2019-12-03T20:05:01Z
source last accessed on: 2019-12-03T20:05:01Z
label: Bauunternehmen zur Standortvorbereitung @de
label: Contratistas de preparación de sitios @es
label: Empreiteiros de preparação local @pt
label: Entrep préparation de sites @fr
label: Imprenditori preparazione area di lavoro @it
label: Подрядчики по подготовке стройплощ. @ru
label: 整地承包 @zh-hant
label: 整地承包商 @zh
label: 敷地準備作業請負 @ja
label: 부지 준비 공사업 @ko
definition: This segment includes companies that clear building sites, provide earth-moving excavation, landfilling, leveling, trenching, blasting and rock removal of building sites.
notation: 1615101014
valid from: 2014-08-08
valid till: 2020-10-03

Tile & Terrazzo Contractors
type: BicsLevel5Segment
type: Classifier
type: Discontinued
type: NamedIndividual
is level5 segment of: Bldg Finishing Contractors
is contemporary version of: http://data.ga-group.nl/ics/bics/1615101015
is version of: http://data.ga-group.nl/ics/bics/1615101015
imported on: 2026-06-08T13:03:47.798Z
last refreshed on: 2026-06-08T13:03:47.798Z
source accessed on: 2019-12-03T20:05:01Z
source last accessed on: 2019-12-03T20:05:01Z
label: Contratistas de piso de losetas de barro y terrazos @es
label: Empreiteiros de lajotas e ladrilhos @pt
label: Entrepreneurs en pose de carreaux et coulage de terrazzo @fr
label: Imprenditori piastrelle e mattonelle @it
label: Installation von Fliesen und Terrazzo @de
label: Подрядчики по укладке плитки и террацио @ru
label: 地磚���磨石子地承包 @zh-hant
label: 瓷砖和水磨石承包商 @zh
label: 타일 및 테라초 공사업 @ko
label: ﾀｲﾙ･人造石工事請負 @ja
definition: This segment includes companies that provide tile work services, such as the installation of ceramic, granite and marble tiles.
notation: 1615101015
valid from: 2014-08-08
valid till: 2020-10-03

Waterproof & Wthr Prep Contr
type: BicsLevel5Segment
type: Classifier
type: Discontinued
type: NamedIndividual
is level5 segment of: Bldg Finishing Contractors
is contemporary version of: http://data.ga-group.nl/ics/bics/1615101016
is version of: http://data.ga-group.nl/ics/bics/1615101016
imported on: 2026-06-08T13:03:47.798Z
last refreshed on: 2026-06-08T13:03:47.798Z
source accessed on: 2019-12-03T20:05:01Z
source last accessed on: 2019-12-03T20:05:01Z
label: Contratistas de preparación de impermeabilidad y clima @es
label: Empr cobert a prova de água @pt
label: Entrep isolation/imperméabilisation @fr
label: Imprend isolamento e resistenza idrica @it
label: Unternehmen für Imprägn. & Wettervorb. @de
label: Подрядчики по обеспеч. водон. стройплощ. @ru
label: 防水与气候准备承包商 @zh
label: 防水及氣候調整準備承包 @zh-hant
label: 防水･荒天準備請負 @ja
label: 방수 & 방재처리 도급 @ko
definition: This segment includes companies that provide waterproofing and weather preparation services on a contract basis.
notation: 1615101016
valid from: 2014-08-08
valid till: 2020-10-03

Other Specialty Trade Contr
type: BicsLevel5Segment
type: Classifier
type: Discontinued
type: NamedIndividual
is level5 segment of: Bldg Finishing Contractors
is contemporary version of: http://data.ga-group.nl/ics/bics/1615101017
is version of: http://data.ga-group.nl/ics/bics/1615101017
imported on: 2026-06-08T13:03:47.798Z
last refreshed on: 2026-06-08T13:03:47.798Z
source accessed on: 2019-12-03T20:05:01Z
source last accessed on: 2019-12-03T20:05:01Z
label: Entrep autres spécialités @fr
label: Imprenditori altre specializzazioni @it
label: Otros contratistas especializados @es
label: Outros empr outras especialidades @pt
label: Sonst.Spezialbauuntern. @de
label: Все подрядчики по прочим спец. строит. работам @ru
label: その他全特殊工事請負 @ja
label: 其他專門營造工程承包 @zh-hant
label: 其他特殊项目承包商 @zh
label: 기타 전문 건설업체 @ko
definition: This segment includes companies that provide other contract-based construction services that are not elsewhere classified. Such services include fence installation, driveway paving and sealing, and curb and gutter construction.
notation: 1615101017
valid from: 2014-08-08
valid till: 2020-10-03

Bldg Finishing Contractors
type: BicsLevel4SubIndustry
type: Classifier
type: Discontinued
type: NamedIndividual
is sub industry of: Building Sub Contractors
is contemporary version of: http://data.ga-group.nl/ics/bics/16151010
is version of: http://data.ga-group.nl/ics/bics/16151010
imported on: 2026-06-08T13:03:47.798Z
last refreshed on: 2026-06-08T13:03:47.798Z
source accessed on: 2019-12-03T20:05:01Z
source last accessed on: 2019-12-03T20:05:01Z
label: Bauunternehmen Hausausbau @de
label: Contratistas acabado de edificios @es
label: Empreiteiros de acabamento de const @pt
label: Entrepren finition @fr
label: Imprenditori rifiniture edifici @it
label: Подрядчики по строительно-отдел. работам @ru
label: 建筑装修承包商 @zh
label: 建設仕上げ工事請負 @ja
label: 最後修整工程承包 @zh-hant
label: 건축마감 공사업 @ko
definition: This industry subgroup includes companies that provide building finishing services on a contract basis.
notation: 16151010
valid from: 2014-08-08
valid till: 2020-10-03

Exterior Building Contractors
type: BicsLevel5Segment
type: Classifier
type: Discontinued
type: NamedIndividual
is level5 segment of: Bldg Structure Contractors
is contemporary version of: http://data.ga-group.nl/ics/bics/1615101110
is version of: http://data.ga-group.nl/ics/bics/1615101110
imported on: 2026-06-08T13:03:47.798Z
last refreshed on: 2026-06-08T13:03:47.798Z
source accessed on: 2019-12-03T20:05:01Z
source last accessed on: 2019-12-03T20:05:01Z
label: Contratistas construc exteriores @es
label: Empreiteiros construção exterior @pt
label: Entrepreneurs construc ext @fr
label: Imprenditori esterno edifici @it
label: Unternehmer für äußere Strukturen @de
label: Подрядчики по пр. строит. наруж. частей зд. @ru
label: 外溝工事請負 @ja
label: 大樓外觀承包 @zh-hant
label: 建筑外墙承包商 @zh
label: 건축물 외벽 도급업체 @ko
definition: This segment includes companies that build other building structures, such as awnings, fire escapes, stairways, store fronts, and metal balconies, among others.
notation: 1615101110
valid from: 2014-08-08
valid till: 2020-10-03

Foundation & Structure Contr
type: BicsLevel5Segment
type: Classifier
type: Discontinued
type: NamedIndividual
is level5 segment of: Bldg Structure Contractors
is contemporary version of: http://data.ga-group.nl/ics/bics/1615101111
is version of: http://data.ga-group.nl/ics/bics/1615101111
imported on: 2026-06-08T13:03:47.798Z
last refreshed on: 2026-06-08T13:03:47.798Z
source accessed on: 2019-12-03T20:05:01Z
source last accessed on: 2019-12-03T20:05:01Z
label: Beton- & Strukturfundamenteuntern. @de
label: Contratistas de estructura y base @es
label: Empr estruturas e fundações @pt
label: Entrep fondations/structures @fr
label: Imprend fondamenta e struttura @it
label: Подрядчики по строит. литого бетонного фундам. @ru
label: 地基/結構承包 @zh-hant
label: 地基与结构承包商 @zh
label: 基盤･構築工事請負 @ja
label: 기반 및 구축 공사업 @ko
definition: This segment includes companies that pour concrete and build concrete structures, such as building foundations and chimneys.
notation: 1615101111
valid from: 2014-08-08
valid till: 2020-10-03

Steel Contractors
type: BicsLevel5Segment
type: Classifier
type: Discontinued
type: NamedIndividual
is level5 segment of: Bldg Structure Contractors
is contemporary version of: http://data.ga-group.nl/ics/bics/1615101112
is version of: http://data.ga-group.nl/ics/bics/1615101112
imported on: 2026-06-08T13:03:47.798Z
last refreshed on: 2026-06-08T13:03:47.798Z
source accessed on: 2019-12-03T20:05:01Z
source last accessed on: 2019-12-03T20:05:01Z
label: Charpentiers acier @fr
label: Contratistas acero @es
label: Empreiteiros de aço @pt
label: Imprend acciaio @it
label: Stahlunternehmer @de
label: Подрядч. по строит. стальных конструкц. @ru
label: 鉄骨工事業 @ja
label: 鋼承包 @zh-hant
label: 钢铁承包商 @zh
label: 철강 공사업 @ko
definition: This segment includes companies that build steel and precast concrete structures, such as balconies, steel reinforcing, and walls.
notation: 1615101112
valid from: 2014-08-08
valid till: 2020-10-03

Bldg Structure Contractors
type: BicsLevel4SubIndustry
type: Classifier
type: Discontinued
type: NamedIndividual
is sub industry of: Building Sub Contractors
is contemporary version of: http://data.ga-group.nl/ics/bics/16151011
is version of: http://data.ga-group.nl/ics/bics/16151011
imported on: 2026-06-08T13:03:47.798Z
last refreshed on: 2026-06-08T13:03:47.798Z
source accessed on: 2019-12-03T20:05:01Z
source last accessed on: 2019-12-03T20:05:01Z
label: Baustrukturuntern. @de
label: Contratistas de estructura de edificios @es
label: Empreiteiros de estrutura de const @pt
label: Entrep structures de bâtiment @fr
label: Imprenditori strutture edifici @it
label: Подрядчики по строит. конструкц. @ru
label: 建筑结构承包商 @zh
label: 建築結構承包 @zh-hant
label: 構造物建設請負 @ja
label: 건축 구조물 도급 @ko
definition: This industry subgroup includes companies that build structures on a contractual basis.
notation: 16151011
valid from: 2014-08-08
valid till: 2020-10-03

Electrical Contractors
type: BicsLevel5Segment
type: Classifier
type: Discontinued
type: NamedIndividual
is level5 segment of: Mechanical Systems Contractors
is contemporary version of: http://data.ga-group.nl/ics/bics/1615101210
is version of: http://data.ga-group.nl/ics/bics/1615101210
imported on: 2026-06-08T13:03:47.798Z
last refreshed on: 2026-06-08T13:03:47.798Z
source accessed on: 2019-12-03T20:05:01Z
source last accessed on: 2019-12-03T20:05:01Z
label: Contratistas eléctricos @es
label: Electriciens @fr
label: Elektrikunternehmen @de
label: Empreiteiros elétricos @pt
label: Imprenditori elettrici @it
label: Подрядчики по электроработам @ru
label: 电气承包 @zh
label: 電機工程承包 @zh-hant
label: 電気工事､その他張線請負 @ja
label: 전기 공사하도급 @ko
definition: This segment includes companies that provide electrical services, such as electrical wiring, cable television installation, and security and fire detection system installation.
notation: 1615101210
valid from: 2014-08-08
valid till: 2020-10-03

Plumb, Heating & A/C Contr
type: BicsLevel5Segment
type: Classifier
type: Discontinued
type: NamedIndividual
is level5 segment of: Mechanical Systems Contractors
is contemporary version of: http://data.ga-group.nl/ics/bics/1615101211
is version of: http://data.ga-group.nl/ics/bics/1615101211
imported on: 2026-06-08T13:03:47.798Z
last refreshed on: 2026-06-08T13:03:47.798Z
source accessed on: 2019-12-03T20:05:01Z
source last accessed on: 2019-12-03T20:05:01Z
label: Be- & Entlüftungsanlagenuntern. @de
label: Contratistas de plomería, calefacción y aire acondicionado @es
label: Empr ar cond, aquecimento e hidráulica @pt
label: Entrep plomberie, chauffage et clim @fr
label: Imprend idraulico, riscaldamento e A/C @it
label: Подрядчики по канализ., отоплению и кондиц. @ru
label: 水管/暖氣/空調承包 @zh-hant
label: 管道、供暖及空调承包商 @zh
label: 配管工事･暖房･空調設備請負 @ja
label: 배관, 난방 & 냉방 공사업 @ko
definition: This segment includes companies that install plumbing, heating and air conditioning systems as well as provide additions, alterations, maintenance and repair services by a technician authorized to perform such work.
notation: 1615101211
valid from: 2014-08-08
valid till: 2020-10-03

Other Bldg Equip Contractors
type: BicsLevel5Segment
type: Classifier
type: Discontinued
type: NamedIndividual
is level5 segment of: Mechanical Systems Contractors
is contemporary version of: http://data.ga-group.nl/ics/bics/1615101212
is version of: http://data.ga-group.nl/ics/bics/1615101212
imported on: 2026-06-08T13:03:47.798Z
last refreshed on: 2026-06-08T13:03:47.798Z
source accessed on: 2019-12-03T20:05:01Z
source last accessed on: 2019-12-03T20:05:01Z
label: Entrep autres équip de bâtiments @fr
label: Imprenditori altre app edili @it
label: Otros contratistas de equipo de constr @es
label: Outros empr equip constr @pt
label: Sonst. Bauausrüstungsuntern. @de
label: Прочие подрядчики по строит. оборуд. @ru
label: その他建物設備据付工事請負 @ja
label: 其他建筑设备承包商 @zh
label: 其他建築設備承包 @zh-hant
label: 기타 건물 설비 공사업 @ko
definition: This segment includes companies that provide other installation and maintenance services for a host of commercial and other structures, such as ATMs, garage doors and church bells.
notation: 1615101212
valid from: 2014-08-08
valid till: 2020-10-03

Mechanical Systems Contractors
type: BicsLevel4SubIndustry
type: Classifier
type: Discontinued
type: NamedIndividual
is sub industry of: Building Sub Contractors
is contemporary version of: http://data.ga-group.nl/ics/bics/16151012
is version of: http://data.ga-group.nl/ics/bics/16151012
imported on: 2026-06-08T13:03:47.798Z
last refreshed on: 2026-06-08T13:03:47.798Z
source accessed on: 2019-12-03T20:05:01Z
source last accessed on: 2019-12-03T20:05:01Z
label: Contratistas de sistemas mecánicos @es
label: Empreiteiros de sistemas mecânicos @pt
label: Entrep systèmes mécaniques @fr
label: Imprenditori sistemi meccanici @it
label: Unternehmen für Maschinensysteme @de
label: Подрядчики по механическим системам @ru
label: 机械系统承包商 @zh
label: 機械系統承包 @zh-hant
label: 機械ｼｽﾃﾑ構築請負 @ja
label: 기계 시스템 공사업 @ko
definition: This industry subgroup includes companies that provide contract-based building mechanical systems services. Such services include plumbing and electrical.
notation: 16151012
valid from: 2014-08-08
valid till: 2020-10-03

Building Sub Contractors
type: BicsLevel3Industry
type: Classifier
type: Discontinued
type: NamedIndividual
is industry of: Engineering & Construction Svcs
is contemporary version of: http://data.ga-group.nl/ics/bics/161510
is version of: http://data.ga-group.nl/ics/bics/161510
imported on: 2026-06-08T13:03:47.798Z
last refreshed on: 2026-06-08T13:03:47.798Z
source accessed on: 2019-12-03T20:05:01Z
source last accessed on: 2019-12-03T20:05:01Z
label: Bauunternehmer @de
label: Sous-traitants bâtiment @fr
label: Sub-empreit constr @pt
label: Subappaltatori edili @it
label: Subcontr construc @es
label: Подрядч. по строит. работам @ru
label: 建筑分包商 @zh
label: 建築物轉包商 @zh-hant
label: 建設下請負 @ja
label: 건물 하도급 @ko
definition: This industry includes companies that perform construction services on a fee or contract basis. Includes activities such as carpentry, electrical, plumbing, painting, attaching drywall and tile, and waterproofing, which a building sub-contractor may perform. Excludes janitorial or general repair services (see Commercial Services).
notation: 161510
valid from: 2014-08-08
valid till: 2020-10-03

Civil Engineering Services
type: BicsLevel4SubIndustry
type: Classifier
type: NamedIndividual
is sub industry of: Engineering Services
is anachronous version of: http://data.ga-group.nl/ics/bics/1711131011
is contemporary version of: http://data.ga-group.nl/ics/bics/16151110
is replaced by: http://data.ga-group.nl/ics/bics/2020/1711131011
is version of: http://data.ga-group.nl/ics/bics/16151110
is version of: http://data.ga-group.nl/ics/bics/1711131011
imported on: 2026-06-08T13:03:47.798Z
last refreshed on: 2026-06-08T13:03:47.798Z
source accessed on: 2019-12-03T20:05:01Z
source last accessed on: 2019-12-03T20:05:01Z
label: Bauingenieursdienstleistungen @de
label: Serviços de engenharia civil @pt
label: Services de génie civil @fr
label: Servicios de ingeniería civil @es
label: Servizi ingegneria civile @it
label: Гражданский инжиниринг @ru
label: 土木工事ｻｰﾋﾞｽ @ja
label: 土木工程服务 @zh
label: 土木工程服務 @zh-hant
label: 토목공학 서비스 @ko
definition: This industry subgroup includes companies that provide civil engineering services by designing projects such as bridges, roads, canals, dams and large buildings.
notation: 16151110
valid from: 2014-08-08
valid till: 2020-10-03

Ind & Traffic Engineering Svcs
type: BicsLevel4SubIndustry
type: Classifier
type: NamedIndividual
is sub industry of: Engineering Services
is anachronous version of: http://data.ga-group.nl/ics/bics/1711131012
is contemporary version of: http://data.ga-group.nl/ics/bics/16151111
is replaced by: http://data.ga-group.nl/ics/bics/2020/1711131012
is version of: http://data.ga-group.nl/ics/bics/16151111
is version of: http://data.ga-group.nl/ics/bics/1711131012
imported on: 2026-06-08T13:03:47.798Z
last refreshed on: 2026-06-08T13:03:47.798Z
source accessed on: 2019-12-03T20:05:01Z
source last accessed on: 2019-12-03T20:05:01Z
label: Ind.- & Verkehrsingenieursdienste @de
label: Serv de ingeniería ind y tráfico @es
label: Serv engenharia ind e tráfego @pt
label: Serv génie ind/trafic @fr
label: Serv ingegneria traffico e ind @it
label: Промышленный и дорожный инжиниринг @ru
label: 工业与交通工程服务 @zh
label: 工業及交通工程服務 @zh-hant
label: 経営工学･運輸工学ｻｰﾋﾞｽ @ja
label: 산업&교통공학서비스 @ko
definition: This industry subgroup includes companies that provide industrial engineering services by designing systems aimed to make human processes more efficient. Such systems include traffic management systems.
notation: 16151111
valid from: 2014-08-08
valid till: 2020-10-03

Other Engineering Services
type: BicsLevel4SubIndustry
type: Classifier
type: Discontinued
type: NamedIndividual
is sub industry of: Engineering Services
is contemporary version of: http://data.ga-group.nl/ics/bics/16151112
is version of: http://data.ga-group.nl/ics/bics/16151112
imported on: 2026-06-08T13:03:47.798Z
last refreshed on: 2026-06-08T13:03:47.798Z
source accessed on: 2019-12-03T20:05:01Z
source last accessed on: 2019-12-03T20:05:01Z
label: Altri serv ingegner @it
label: Aut srv ingénierie @fr
label: Otros serv ingenier @es
label: Outs serv de engenharia @pt
label: Sonst. Ingen.dienste @de
label: Другие услуги инжиниринга @ru
label: その他工学ｻｰﾋﾞｽ @ja
label: 其他工程服务 @zh
label: 其他工程服務 @zh-hant
label: 기타 공학 서비스 @ko
definition: This industry subgroup includes companies that provide other engineering services not elsewhere classified.
notation: 16151112
valid from: 2014-08-08
valid till: 2020-10-03

Engineering Services
type: BicsLevel3Industry
type: Classifier
type: NamedIndividual
is industry of: Engineering & Construction Svcs
is anachronous version of: http://data.ga-group.nl/ics/bics/17111310
is contemporary version of: http://data.ga-group.nl/ics/bics/161511
is replaced by: http://data.ga-group.nl/ics/bics/2020/17111310
is version of: http://data.ga-group.nl/ics/bics/161511
is version of: http://data.ga-group.nl/ics/bics/17111310
imported on: 2026-06-08T13:03:47.798Z
last refreshed on: 2026-06-08T13:03:47.798Z
source accessed on: 2019-12-03T20:05:01Z
source last accessed on: 2019-12-03T20:05:01Z
label: Ingenieurwesen @de
label: Serv de engenharia @pt
label: Serv ingeniería @es
label: Services de génie @fr
label: Servizi ingegneria @it
label: Инженерия @ru
label: 土木ｻｰﾋﾞｽ業 @ja
label: 工程服务 @zh
label: 工程服務 @zh-hant
label: 엔지니어링서비스업 @ko
definition: This industry includes companies that provide engineering services, such as design and development and feasibility studies, but do not actually build the project.
notation: 161511
valid from: 2014-08-08
valid till: 2020-10-03

Cable Line Construction
type: BicsLevel5Segment
type: Classifier
type: NamedIndividual
is level5 segment of: Communication Infra Const
is anachronous version of: http://data.ga-group.nl/ics/bics/171113111010
is contemporary version of: http://data.ga-group.nl/ics/bics/1615121010
is replaced by: http://data.ga-group.nl/ics/bics/2020/171113111010
is version of: http://data.ga-group.nl/ics/bics/1615121010
is version of: http://data.ga-group.nl/ics/bics/171113111010
imported on: 2026-06-08T13:03:47.798Z
last refreshed on: 2026-06-08T13:03:47.798Z
source accessed on: 2019-12-03T20:05:01Z
source last accessed on: 2019-12-03T20:05:01Z
label: Construção linha cabo @pt
label: Construcción línea cable @es
label: Construction de câble @fr
label: Costruzione linee cavo @it
label: Kabelleitungsbau @de
label: Проведение кабеля @ru
label: 电缆线路施工 @zh
label: 電纜工程 @zh-hant
label: 케이블선 건설 @ko
label: ｹｰﾌﾞﾙ線敷設 @ja
definition: This segment includes companies that lay cable and build utility lines used in the telecommunications and utility industries.
notation: 1615121010
valid from: 2014-08-08
valid till: 2020-10-03

Comm & Transmission Const
type: BicsLevel5Segment
type: Classifier
type: NamedIndividual
is level5 segment of: Communication Infra Const
is anachronous version of: http://data.ga-group.nl/ics/bics/171113111011
is contemporary version of: http://data.ga-group.nl/ics/bics/1615121011
is replaced by: http://data.ga-group.nl/ics/bics/2020/171113111011
is version of: http://data.ga-group.nl/ics/bics/1615121011
is version of: http://data.ga-group.nl/ics/bics/171113111011
imported on: 2026-06-08T13:03:47.798Z
last refreshed on: 2026-06-08T13:03:47.798Z
source accessed on: 2019-12-03T20:05:01Z
source last accessed on: 2019-12-03T20:05:01Z
label: Const comunicación y trasmición @es
label: Constr com e transmissão @pt
label: Constr comm/transmission @fr
label: Costruz comm e trasmissione @it
label: Komm.- & Stromübertr.-Infrastrukturbau @de
label: Проведение линий связи и передач @ru
label: 通信塔･送電塔建設 @ja
label: 通訊及傳輸塔工程 @zh-hant
label: 通讯与传输建设 @zh
label: 통신 & 전송 건설 @ko
definition: This segment includes companies that build communications and transmission infrastructure, such as cellular phone towers, satellite receiving stations and radio signal transmission towers. Also includes companies that own, operate and rent equipment space on cellular phone towers.
notation: 1615121011
valid from: 2014-08-08
valid till: 2020-10-03

Network Construction
type: BicsLevel5Segment
type: Classifier
type: NamedIndividual
is level5 segment of: Communication Infra Const
is anachronous version of: http://data.ga-group.nl/ics/bics/171113111012
is contemporary version of: http://data.ga-group.nl/ics/bics/1615121012
is replaced by: http://data.ga-group.nl/ics/bics/2020/171113111012
is version of: http://data.ga-group.nl/ics/bics/1615121012
is version of: http://data.ga-group.nl/ics/bics/171113111012
imported on: 2026-06-08T13:03:47.798Z
last refreshed on: 2026-06-08T13:03:47.798Z
source accessed on: 2019-12-03T20:05:01Z
source last accessed on: 2019-12-03T20:05:01Z
label: Construcción de red @es
label: Construction de réseaux @fr
label: Contrução de rede @pt
label: Costruzione rete @it
label: Netzwerkbau @de
label: Проводка сетей @ru
label: 網路建構 @zh-hant
label: 网络建设 @zh
label: 네트워크 구축 @ko
label: ﾈｯﾄﾜｰｸ構築 @ja
definition: This segment includes companies that offer specialty network design and construction services to wireless and wireline telecom carriers.
notation: 1615121012
valid from: 2014-08-08
valid till: 2020-10-03

Communication Infra Const
type: BicsLevel4SubIndustry
type: Classifier
type: NamedIndividual
is sub industry of: Infrastructure Construction
is anachronous version of: http://data.ga-group.nl/ics/bics/1711131110
is contemporary version of: http://data.ga-group.nl/ics/bics/16151210
is replaced by: http://data.ga-group.nl/ics/bics/2020/1711131110
is version of: http://data.ga-group.nl/ics/bics/16151210
is version of: http://data.ga-group.nl/ics/bics/1711131110
imported on: 2026-06-08T13:03:47.798Z
last refreshed on: 2026-06-08T13:03:47.798Z
source accessed on: 2019-12-03T20:05:01Z
source last accessed on: 2019-12-03T20:05:01Z
label: Const de infra comunicação @pt
label: Const infra comunicación @es
label: Constr infra communication @fr
label: Costruz infrastrutture comunicazione @it
label: Komm.-Infrastrukturbau @de
label: Строительство коммуник. инфрастр. @ru
label: 通信ｲﾝﾌﾗ建設 @ja
label: 通訊基礎建設營造 @zh-hant
label: 通讯基础设施建设 @zh
label: 커뮤니케이션 기간시설 건설업 @ko
definition: This industry subgroup includes companies that build infrastructure used by the communications industry.
notation: 16151210
valid from: 2014-08-08
valid till: 2020-10-03

Car Park Concessions
type: BicsLevel5Segment
type: Classifier
type: Discontinued
type: NamedIndividual
is level5 segment of: Infrastructure Concessions
is contemporary version of: http://data.ga-group.nl/ics/bics/1615121110
is version of: http://data.ga-group.nl/ics/bics/1615121110
imported on: 2026-06-08T13:03:47.798Z
last refreshed on: 2026-06-08T13:03:47.798Z
source accessed on: 2019-12-03T20:05:01Z
source last accessed on: 2019-12-03T20:05:01Z
label: Concessões estacion carro @pt
label: Concession parcs autom @fr
label: Concessioni parcheggi @it
label: Conseciones aparcamiento @es
label: Parkplatzkonzessionen @de
label: Предоставление парковки @ru
label: 停車場折讓 @zh-hant
label: 停车场特许权 @zh
label: 駐車場利権 @ja
label: 주차장 영업권 @ko
definition: This segment includes all companies that build and operate car park concessions.
notation: 1615121110
valid from: 2014-08-08
valid till: 2020-10-03

Hway/Brdg/Tunnel Concessions
type: BicsLevel5Segment
type: Classifier
type: NamedIndividual
is level5 segment of: Infrastructure Concessions
is anachronous version of: http://data.ga-group.nl/ics/bics/171112181012
is contemporary version of: http://data.ga-group.nl/ics/bics/1615121111
is replaced by: http://data.ga-group.nl/ics/bics/2020/171112181012
is version of: http://data.ga-group.nl/ics/bics/1615121111
is version of: http://data.ga-group.nl/ics/bics/171112181012
imported on: 2026-06-08T13:03:47.798Z
last refreshed on: 2026-06-08T13:03:47.798Z
source accessed on: 2019-12-03T20:05:01Z
source last accessed on: 2019-12-03T20:05:01Z
label: Concesiones de vías, edificios y túneles @es
label: Concessões pedágio rodovias/ponte/túnel @pt
label: Concession autoroutes/ponts/tunnels @fr
label: Concessioni autostrada/ponte/gall @it
label: Schnellstraßen-, Brücken-, Tunnelkonzessionen @de
label: Концессия - платные автострады, мосты и туннели @ru
label: 公路/橋樑/隧道特許權 @zh-hant
label: 有料道路･橋･ﾄﾝﾈﾙ運営 @ja
label: 高速公路/桥梁/隧道特许 @zh
label: 고속도로/교량/터널 영업권 @ko
definition: This segment includes companies that operate toll highways, bridges and tunnels. Services include toll collection and maintenance support of roadways and related structures.
notation: 1615121111
valid from: 2014-08-08
valid till: 2020-10-03

Other Concessions
type: BicsLevel5Segment
type: Classifier
type: Discontinued
type: NamedIndividual
is level5 segment of: Infrastructure Concessions
is contemporary version of: http://data.ga-group.nl/ics/bics/1615121112
is version of: http://data.ga-group.nl/ics/bics/1615121112
imported on: 2026-06-08T13:03:47.798Z
last refreshed on: 2026-06-08T13:03:47.798Z
source accessed on: 2019-12-03T20:05:01Z
source last accessed on: 2019-12-03T20:05:01Z
label: Altre concessioni @it
label: Autres concessions @fr
label: Otras concesiones @es
label: Outras concessões @pt
label: Sonstige Konzessionen @de
label: Прочие концессии @ru
label: その他利権 @ja
label: 其他优惠 @zh
label: 其他折讓 @zh-hant
label: 기타 영업권 @ko
definition: This segment includes all companies that operate infrastructure concessions not elsewhere classified. Includes airport concessions and power-related facilities concessions.
notation: 1615121112
valid from: 2014-08-08
valid till: 2020-10-03

Infrastructure Concessions
type: BicsLevel4SubIndustry
type: Classifier
type: NamedIndividual
is sub industry of: Infrastructure Construction
is anachronous version of: http://data.ga-group.nl/ics/bics/1711121810
is contemporary version of: http://data.ga-group.nl/ics/bics/16151211
is replaced by: http://data.ga-group.nl/ics/bics/2020/1711121810
is version of: http://data.ga-group.nl/ics/bics/16151211
is version of: http://data.ga-group.nl/ics/bics/1711121810
imported on: 2026-06-08T13:03:47.798Z
last refreshed on: 2026-06-08T13:03:47.798Z
source accessed on: 2019-12-03T20:05:01Z
source last accessed on: 2019-12-03T20:05:01Z
label: Concesiones infraestructura @es
label: Concessão de infraestrutura @pt
label: Concessione infrastruttura @it
label: Concessions d'infrastructures @fr
label: Infrastrukturkonzessionen @de
label: Инфраструкт. концессия @ru
label: 基础设施特许经营 @zh
label: 基礎設施特許權 @zh-hant
label: 사회기반시설 영업권 @ko
label: ｲﾝﾌﾗ利権 @ja
definition: This industry subgroup includes all companies that undertake in and operate infrastructure concession. These companies operate these facilities on behalf of the property owner or government and derive their revenue from operations of the underlying facility.
notation: 16151211
valid from: 2014-08-08
valid till: 2020-10-03

Power Plant Construction
type: BicsLevel5Segment
type: Classifier
type: NamedIndividual
is level5 segment of: Energy Infra Construction
is anachronous version of: http://data.ga-group.nl/ics/bics/171113111110
is contemporary version of: http://data.ga-group.nl/ics/bics/1615121210
is replaced by: http://data.ga-group.nl/ics/bics/2020/171113111110
is version of: http://data.ga-group.nl/ics/bics/1615121210
is version of: http://data.ga-group.nl/ics/bics/171113111110
imported on: 2026-06-08T13:03:47.798Z
last refreshed on: 2026-06-08T13:03:47.798Z
source accessed on: 2019-12-03T20:05:01Z
source last accessed on: 2019-12-03T20:05:01Z
label: Construção usina elétrica @pt
label: Construcción de planta de electricidad @es
label: Construction usines électriques @fr
label: Costruzione centrali elettriche @it
label: Kraftwerkbau @de
label: Строительство электростанций @ru
label: 发电厂建设 @zh
label: 発電所建設 @ja
label: 電廠營建 @zh-hant
label: 발전소 건설 @ko
definition: This segment includes companies that construct electricity generation facilities (non-alternative or nuclear energy).
notation: 1615121210
valid from: 2014-08-08
valid till: 2020-10-03

Nuclear Power Construction
type: BicsLevel5Segment
type: Classifier
type: NamedIndividual
is level5 segment of: Energy Infra Construction
is anachronous version of: http://data.ga-group.nl/ics/bics/171113111111
is contemporary version of: http://data.ga-group.nl/ics/bics/1615121211
is replaced by: http://data.ga-group.nl/ics/bics/2020/171113111111
is version of: http://data.ga-group.nl/ics/bics/1615121211
is version of: http://data.ga-group.nl/ics/bics/171113111111
imported on: 2026-06-08T13:03:47.798Z
last refreshed on: 2026-06-08T13:03:47.798Z
source accessed on: 2019-12-03T20:05:01Z
source last accessed on: 2019-12-03T20:05:01Z
label: Const cent nucléaire @fr
label: Constr de energia nuclear @pt
label: Costruz cen nucleari @it
label: Kernkraftwerkbau @de
label: Plantas nucleares @es
label: Строительство атомных электростанций @ru
label: 原子力発電所建設 @ja
label: 核电厂工程 @zh
label: 核能電廠工程 @zh-hant
label: 원자력발전소 건설 @ko
definition: This segment includes companies that build nuclear power generation facilities.
notation: 1615121211
valid from: 2014-08-08
valid till: 2020-10-03

Oil & Gas Infra Construction
type: BicsLevel5Segment
type: Classifier
type: NamedIndividual
is level5 segment of: Energy Infra Construction
is anachronous version of: http://data.ga-group.nl/ics/bics/171113111112
is contemporary version of: http://data.ga-group.nl/ics/bics/1615121212
is replaced by: http://data.ga-group.nl/ics/bics/2020/171113111112
is version of: http://data.ga-group.nl/ics/bics/1615121212
is version of: http://data.ga-group.nl/ics/bics/171113111112
imported on: 2026-06-08T13:03:47.798Z
last refreshed on: 2026-06-08T13:03:47.798Z
source accessed on: 2019-12-03T20:05:01Z
source last accessed on: 2019-12-03T20:05:01Z
label: Construção de infra de petróleo e gás @pt
label: Construcción de infr de petróleo y gas @es
label: Construction infra pétrole/gaz @fr
label: Costruzione infra petrolio e gas @it
label: Erdöl- & Erdgasinfrastrukturbau @de
label: Строительство газо- нефтяной инфраструктуры @ru
label: 石油与天然气基础设施建设 @zh
label: 石油及天然氣基礎建設營造 @zh-hant
label: 石油･ｶﾞｽｲﾝﾌﾗ建設 @ja
label: 석유&가스관 건설업 @ko
definition: This segment includes companies that build oil and gas sector infrastructure, such as refineries, pumping stations and petrochemicals plants.
notation: 1615121212
valid from: 2014-08-08
valid till: 2020-10-03

Energy Infra Construction
type: BicsLevel4SubIndustry
type: Classifier
type: NamedIndividual
is sub industry of: Infrastructure Construction
is anachronous version of: http://data.ga-group.nl/ics/bics/1711131111
is contemporary version of: http://data.ga-group.nl/ics/bics/16151212
is replaced by: http://data.ga-group.nl/ics/bics/2020/1711131111
is version of: http://data.ga-group.nl/ics/bics/16151212
is version of: http://data.ga-group.nl/ics/bics/1711131111
imported on: 2026-06-08T13:03:47.798Z
last refreshed on: 2026-06-08T13:03:47.798Z
source accessed on: 2019-12-03T20:05:01Z
source last accessed on: 2019-12-03T20:05:01Z
label: Construção infra energia @pt
label: Construcción de infraestructura de energía @es
label: Construction infra énergie @fr
label: Costruzione infra energia @it
label: Energieinfrastrukturbau @de
label: Строительство энергетической инфраструктуры @ru
label: 能源基础设施建设 @zh
label: 能源基礎建設營造 @zh-hant
label: 에너지 기간시설 건설업 @ko
label: ｴﾈﾙｷﾞｰｲﾝﾌﾗ建設 @ja
definition: This industry subgroup includes companies that build power plants, as well as oil and gas pipelines.
notation: 16151212
valid from: 2014-08-08
valid till: 2020-10-03

Airport & Highway Const
type: BicsLevel5Segment
type: Classifier
type: NamedIndividual
is level5 segment of: Transportation Infra Const
is anachronous version of: http://data.ga-group.nl/ics/bics/171113111210
is contemporary version of: http://data.ga-group.nl/ics/bics/1615121310
is replaced by: http://data.ga-group.nl/ics/bics/2020/171113111210
is version of: http://data.ga-group.nl/ics/bics/1615121310
is version of: http://data.ga-group.nl/ics/bics/171113111210
imported on: 2026-06-08T13:03:47.798Z
last refreshed on: 2026-06-08T13:03:47.798Z
source accessed on: 2019-12-03T20:05:01Z
source last accessed on: 2019-12-03T20:05:01Z
label: Bau von Flughäfen & Bundesstraßen @de
label: Construção de rodovias e aeroportos @pt
label: Construcción de aeropuertos y carreteras @es
label: Construction d'aéroports et autoroutes @fr
label: Costruzione di autostrade e aeroporti @it
label: Строительство аэропортов и автострад @ru
label: 机场和高速公路建造 @zh
label: 機場及高速公路營造 @zh-hant
label: 空港･高速道路建設 @ja
label: 공항 & 고속도로 건설 @ko
definition: This segment includes companies that build infrastructure used by automotive vehicles. Such infrastructure includes highways, streets, bridges and tunnels. This segment also includes companies that build airports and runways.
notation: 1615121310
valid from: 2014-08-08
valid till: 2020-10-03

Maritime Construction
type: BicsLevel5Segment
type: Classifier
type: NamedIndividual
is level5 segment of: Transportation Infra Const
is anachronous version of: http://data.ga-group.nl/ics/bics/171113111211
is contemporary version of: http://data.ga-group.nl/ics/bics/1615121311
is replaced by: http://data.ga-group.nl/ics/bics/2020/171113111211
is version of: http://data.ga-group.nl/ics/bics/1615121311
is version of: http://data.ga-group.nl/ics/bics/171113111211
imported on: 2026-06-08T13:03:47.798Z
last refreshed on: 2026-06-08T13:03:47.798Z
source accessed on: 2019-12-03T20:05:01Z
source last accessed on: 2019-12-03T20:05:01Z
label: Constr marítima @pt
label: Construcc marítima @es
label: Construct maritime @fr
label: Costruz marittima @it
label: Seebau @de
label: Морское строительство @ru
label: 海上工事 @ja
label: 海洋工程 @zh
label: 海運工程 @zh-hant
label: 해상건설 @ko
definition: This segment includes companies that build maritime infrastructure, such as port facilities and canals.
notation: 1615121311
valid from: 2014-08-08
valid till: 2020-10-03

Railway/Tunnel/Subway Const
type: BicsLevel5Segment
type: Classifier
type: NamedIndividual
is level5 segment of: Transportation Infra Const
is anachronous version of: http://data.ga-group.nl/ics/bics/171113111212
is contemporary version of: http://data.ga-group.nl/ics/bics/1615121312
is replaced by: http://data.ga-group.nl/ics/bics/2020/171113111212
is version of: http://data.ga-group.nl/ics/bics/1615121312
is version of: http://data.ga-group.nl/ics/bics/171113111212
imported on: 2026-06-08T13:03:47.798Z
last refreshed on: 2026-06-08T13:03:47.798Z
source accessed on: 2019-12-03T20:05:01Z
source last accessed on: 2019-12-03T20:05:01Z
label: Bau von Bahn, Tunnel & U-Bahn @de
label: Const ch de fer, métro, tunnel @fr
label: Const de ferrovia, túnel e metrô @pt
label: Costruz ferrovie/tunnel/metro @it
label: Vías ferrov, túneles y metro @es
label: Строит-во ж/дорог, туннелей и метро @ru
label: 鉄道､ﾄﾝﾈﾙ､地下鉄工事 @ja
label: 鐵路、隧道及地鐵工程 @zh-hant
label: 铁路、隧道和地铁工程 @zh
label: 철도, 터널&지하철 건설 @ko
definition: This segment includes companies that build train and subway infrastructure. Such infrastructure includes railway lines, railway roadbeds, subways and tunnels.
notation: 1615121312
valid from: 2014-08-08
valid till: 2020-10-03

Transportation Infra Const
type: BicsLevel4SubIndustry
type: Classifier
type: NamedIndividual
is sub industry of: Infrastructure Construction
is anachronous version of: http://data.ga-group.nl/ics/bics/1711131112
is contemporary version of: http://data.ga-group.nl/ics/bics/16151213
is replaced by: http://data.ga-group.nl/ics/bics/2020/1711131112
is version of: http://data.ga-group.nl/ics/bics/16151213
is version of: http://data.ga-group.nl/ics/bics/1711131112
imported on: 2026-06-08T13:03:47.798Z
last refreshed on: 2026-06-08T13:03:47.798Z
source accessed on: 2019-12-03T20:05:01Z
source last accessed on: 2019-12-03T20:05:01Z
label: Const infra de transporte @es
label: Constr infra transport @fr
label: Constr infra transportes @pt
label: Costruc infra trasporto @it
label: Transportinfrastrukturbau @de
label: Строительство транспортной инфраструктуры @ru
label: 交通运输基础设施建设 @zh
label: 交通運輸基礎建設營造 @zh-hant
label: 交通ｲﾝﾌﾗ建設 @ja
label: 교통기간시설건설업 @ko
definition: This industry subgroup includes companies that build transportation infrastructure, such as highways, railways and ports.
notation: 16151213
valid from: 2014-08-08
valid till: 2020-10-03

Electric Utility Line Const
type: BicsLevel5Segment
type: Classifier
type: NamedIndividual
is level5 segment of: Utility Line Construction
is anachronous version of: http://data.ga-group.nl/ics/bics/171113111310
is contemporary version of: http://data.ga-group.nl/ics/bics/1615121410
is replaced by: http://data.ga-group.nl/ics/bics/2020/171113111310
is version of: http://data.ga-group.nl/ics/bics/1615121410
is version of: http://data.ga-group.nl/ics/bics/171113111310
imported on: 2026-06-08T13:03:47.798Z
last refreshed on: 2026-06-08T13:03:47.798Z
source accessed on: 2019-12-03T20:05:01Z
source last accessed on: 2019-12-03T20:05:01Z
label: Bau der elektrischen Versorgungslinie @de
label: Construção de linha de serviços públicos de energia @pt
label: Construcción de línea eléctrica @es
label: Construction de conduites électriques @fr
label: Costruzione linee elettriche @it
label: Нефте-газовые услуги @ru
label: 电力公司管线建设 @zh
label: 配電網敷設 @ja
label: 電力公用事業管線建造 @zh-hant
label: 전기 유틸리티 라인 건설 @ko
definition: This segment includes companies that construct the distribution lines for electricity as well as the structures integral for long-distance power lines.
notation: 1615121410
valid from: 2014-08-08
valid till: 2020-10-03

Gas Utility Line Construction
type: BicsLevel5Segment
type: Classifier
type: NamedIndividual
is level5 segment of: Utility Line Construction
is anachronous version of: http://data.ga-group.nl/ics/bics/171113111311
is contemporary version of: http://data.ga-group.nl/ics/bics/1615121411
is replaced by: http://data.ga-group.nl/ics/bics/2020/171113111311
is version of: http://data.ga-group.nl/ics/bics/1615121411
is version of: http://data.ga-group.nl/ics/bics/171113111311
imported on: 2026-06-08T13:03:47.798Z
last refreshed on: 2026-06-08T13:03:47.798Z
source accessed on: 2019-12-03T20:05:01Z
source last accessed on: 2019-12-03T20:05:01Z
label: Construção de linha de abastecimento de gás @pt
label: Construcción de línea de gas @es
label: Construction de conduites de gaz @fr
label: Costruzione linee gas @it
label: Erdgasversorgungsleitungsbau @de
label: Строительство газовых магистралей @ru
label: 天然氣公用事業管線建造 @zh-hant
label: 燃气公司管线建设 @zh
label: 配ｶﾞｽ網敷設 @ja
label: 가스 유틸리티 라인 건설 @ko
definition: This segment includes companies that build natural gas transmission and distribution infrastructure. Such activities do not include the manufacture of equipment or the continued operation of infrastructure subsequent to its construction.
notation: 1615121411
valid from: 2014-08-08
valid till: 2020-10-03

Water Utility Line Construction
type: BicsLevel5Segment
type: Classifier
type: NamedIndividual
is level5 segment of: Utility Line Construction
is anachronous version of: http://data.ga-group.nl/ics/bics/171113111312
is contemporary version of: http://data.ga-group.nl/ics/bics/1615121412
is replaced by: http://data.ga-group.nl/ics/bics/2020/171113111312
is version of: http://data.ga-group.nl/ics/bics/1615121412
is version of: http://data.ga-group.nl/ics/bics/171113111312
imported on: 2026-06-08T13:03:47.798Z
last refreshed on: 2026-06-08T13:03:47.798Z
source accessed on: 2019-12-03T20:05:01Z
source last accessed on: 2019-12-03T20:05:01Z
label: Construção de linha de abastecimento de água @pt
label: Construcción de línea de agua @es
label: Construction de conduites d'eau @fr
label: Costruzione acquedotti @it
label: Wasserversorgungsleitungsbau @de
label: Строительство коммун. водоснабже��ия @ru
label: 供水公司管线建设 @zh
label: 水利公用事業管線建造 @zh-hant
label: 配水管敷設 @ja
label: 수도 유틸리티 라인 건설 @ko
definition: This segment includes companies that build water treatment and distribution infrastructure. Such activities do not include the manufacture of equipment or the continued operation of infrastructure subsequent to its construction.
notation: 1615121412
valid from: 2014-08-08
valid till: 2020-10-03

Utility Line Construction
type: BicsLevel4SubIndustry
type: Classifier
type: NamedIndividual
is sub industry of: Infrastructure Construction
is anachronous version of: http://data.ga-group.nl/ics/bics/1711131113
is contemporary version of: http://data.ga-group.nl/ics/bics/16151214
is replaced by: http://data.ga-group.nl/ics/bics/2020/1711131113
is version of: http://data.ga-group.nl/ics/bics/16151214
is version of: http://data.ga-group.nl/ics/bics/1711131113
imported on: 2026-06-08T13:03:47.798Z
last refreshed on: 2026-06-08T13:03:47.798Z
source accessed on: 2019-12-03T20:05:01Z
source last accessed on: 2019-12-03T20:05:01Z
label: Construção de linha de abastecimento @pt
label: Construcción de línea de servicios públicos @es
label: Construction de conduites @fr
label: Costruzione linee elettriche @it
label: Versorgungsleitungsbau @de
label: Строительство подземных коммуникаций @ru
label: 公用事業管線��造 @zh-hant
label: 公用设施管线建设 @zh
label: 公益事業ｲﾝﾌﾗ建設 @ja
label: 유틸리티 라인 건설 @ko
definition: This industry subgroup includes companies that build utility network infrastructure.
notation: 16151214
valid from: 2014-08-08
valid till: 2020-10-03

Land Subdivision
type: BicsLevel5Segment
type: Classifier
type: Discontinued
type: NamedIndividual
is level5 segment of: Other Infrastructure Const
is contemporary version of: http://data.ga-group.nl/ics/bics/1615121510
is version of: http://data.ga-group.nl/ics/bics/1615121510
imported on: 2026-06-08T13:03:47.798Z
last refreshed on: 2026-06-08T13:03:47.798Z
source accessed on: 2019-12-03T20:05:01Z
source last accessed on: 2019-12-03T20:05:01Z
label: Landaufteilung @de
label: Lotissement terrains @fr
label: Lottizz di terreno @it
label: Repartición tierras @es
label: Subdivisão de terras @pt
label: Подразделение земли @ru
label: 土地細分 @zh-hant
label: 土地规划 @zh
label: 土木工事業 @ja
label: 토지분양지 @ko
definition: This segment includes companies that prepare and divide land into smaller lots for resale.
notation: 1615121510
valid from: 2014-08-08
valid till: 2020-10-03

Military Facilities Construction
type: BicsLevel5Segment
type: Classifier
type: Discontinued
type: NamedIndividual
is level5 segment of: Other Infrastructure Const
is contemporary version of: http://data.ga-group.nl/ics/bics/1615121511
is version of: http://data.ga-group.nl/ics/bics/1615121511
imported on: 2026-06-08T13:03:47.798Z
last refreshed on: 2026-06-08T13:03:47.798Z
source accessed on: 2019-12-03T20:05:01Z
source last accessed on: 2019-12-03T20:05:01Z
label: Construção de instalação militar @pt
label: Construcción de instalación militar @es
label: Construction de complexes militaires @fr
label: Costruzione strutture militari @it
label: Militäranlagenbau @de
label: Строительство военных объектов @ru
label: 军用设施建设 @zh
label: 軍事施設建設 @ja
label: 軍事設施工程 @zh-hant
label: 군용 시설 건설 @ko
definition: This segment includes companies that build military facilities, such as military bases, navy ports, and missile facilities.
notation: 1615121511
valid from: 2014-08-08
valid till: 2020-10-03

Nuclear Waste Disp Plants Const
type: BicsLevel5Segment
type: Classifier
type: Discontinued
type: NamedIndividual
is level5 segment of: Other Infrastructure Const
is contemporary version of: http://data.ga-group.nl/ics/bics/1615121512
is version of: http://data.ga-group.nl/ics/bics/1615121512
imported on: 2026-06-08T13:03:47.798Z
last refreshed on: 2026-06-08T13:03:47.798Z
source accessed on: 2019-12-03T20:05:01Z
source last accessed on: 2019-12-03T20:05:01Z
label: Atommüllentsorgungsanlagen @de
label: Const de plantas nucleares de desechos @es
label: Const planta de elim resíduo nuclear @pt
label: Constr centres élim déchets nucléaires @fr
label: Costruz impianti smalt scorie nucleari @it
label: Строит. заводов по переработке радиоакт. отходов @ru
label: 核废料处置厂建设 @zh
label: 核廃棄物処理工場建設 @ja
label: 核廢料處置廠營建 @zh-hant
label: 핵폐기물처리공장건설 @ko
definition: This segment includes companies that build nuclear waste disposal facilities.
notation: 1615121512
valid from: 2014-08-08
valid till: 2020-10-03

Outdoor Sports Facilities Const
type: BicsLevel5Segment
type: Classifier
type: Discontinued
type: NamedIndividual
is level5 segment of: Other Infrastructure Const
is contemporary version of: http://data.ga-group.nl/ics/bics/1615121513
is version of: http://data.ga-group.nl/ics/bics/1615121513
imported on: 2026-06-08T13:03:47.798Z
last refreshed on: 2026-06-08T13:03:47.798Z
source accessed on: 2019-12-03T20:05:01Z
source last accessed on: 2019-12-03T20:05:01Z
label: Außensportanlagenbau @de
label: Const complexes sport ext @fr
label: Const de instalações desportivas ao ar livre @pt
label: Costruz centri sportivi all'aperto @it
label: Inst deportivas al aire libre @es
label: Строит. открытых спортивных сооружений @ru
label: 屋外運動施設建設 @ja
label: 戶外體育設施營建 @zh-hant
label: 户外运动设施建设 @zh
label: 실외스포츠설비건설 @ko
definition: This segment includes companies that build outdoor sports facilities such, as open-air stadiums and fields.
notation: 1615121513
valid from: 2014-08-08
valid till: 2020-10-03

Other Infrastructure Const
type: BicsLevel4SubIndustry
type: Classifier
type: Discontinued
type: NamedIndividual
is sub industry of: Infrastructure Construction
is contemporary version of: http://data.ga-group.nl/ics/bics/16151215
is version of: http://data.ga-group.nl/ics/bics/16151215
imported on: 2026-06-08T13:03:47.798Z
last refreshed on: 2026-06-08T13:03:47.798Z
source accessed on: 2019-12-03T20:05:01Z
source last accessed on: 2019-12-03T20:05:01Z
label: Const autres infrastructures @fr
label: Contr de outras infraestruturas @pt
label: Costruz altra infrastruttura @it
label: Otra const de infraestructura @es
label: Sonstiger Infrastrukturbau @de
label: Прочая инфраструктура @ru
label: その他ｲﾝﾌﾗ建設 @ja
label: 其他基础设施建设 @zh
label: 其他基礎建設營造 @zh-hant
label: 기타기간시설건설업 @ko
definition: This industry subgroup includes companies that build other types of infrastructure not elsewhere classified. Such infrastructure includes water and sewer lines, outdoor sports facilities and waste disposal.
notation: 16151215
valid from: 2014-08-08
valid till: 2020-10-03

Infrastructure Construction
type: BicsLevel3Industry
type: Classifier
type: NamedIndividual
is industry of: Engineering & Construction Svcs
is anachronous version of: http://data.ga-group.nl/ics/bics/17111311
is contemporary version of: http://data.ga-group.nl/ics/bics/161512
is replaced by: http://data.ga-group.nl/ics/bics/2020/17111311
is version of: http://data.ga-group.nl/ics/bics/161512
is version of: http://data.ga-group.nl/ics/bics/17111311
imported on: 2026-06-08T13:03:47.798Z
last refreshed on: 2026-06-08T13:03:47.798Z
source accessed on: 2019-12-03T20:05:01Z
source last accessed on: 2019-12-03T20:05:01Z
label: Construção infraestrutura @pt
label: Construcción de infraestructura @es
label: Construction d'infrastructures @fr
label: Costruzione infrastruttura @it
label: Infrastrukturbau @de
label: Строительство инфраструктуры @ru
label: 基础设施建设 @zh
label: 基礎建設營造 @zh-hant
label: 기간시설 건설업 @ko
label: ｲﾝﾌﾗ建設 @ja
definition: This industry includes companies that build infrastructure for telecommunications, transportation, energy and utilities.
notation: 161512
valid from: 2014-08-08
valid till: 2020-10-03

Commercial Building Const
type: BicsLevel4SubIndustry
type: Classifier
type: NamedIndividual
is sub industry of: Non-Residential Bldg Const
is anachronous version of: http://data.ga-group.nl/ics/bics/1711131210
is contemporary version of: http://data.ga-group.nl/ics/bics/16151310
is replaced by: http://data.ga-group.nl/ics/bics/2020/1711131210
is version of: http://data.ga-group.nl/ics/bics/16151310
is version of: http://data.ga-group.nl/ics/bics/1711131210
imported on: 2026-06-08T13:03:47.798Z
last refreshed on: 2026-06-08T13:03:47.798Z
source accessed on: 2019-12-03T20:05:01Z
source last accessed on: 2019-12-03T20:05:01Z
label: Construção de prédio comercial @pt
label: Construction d'immeubles commerciaux @fr
label: Costruzioni commerciali @it
label: Edificación no comercial @es
label: Errichtung von gewerblichen Gebäuden @de
label: Строительство коммерческих зданий @ru
label: 商业建筑工程 @zh
label: 商業建築工程 @zh-hant
label: 商業用建物建設 @ja
label: 상업용 건물 건설업 @ko
definition: This industry subgroup includes companies that build commercial buildings, such as malls and shopping centers.
notation: 16151310
valid from: 2014-08-08
valid till: 2020-10-03

Hotel Const & Development
type: BicsLevel4SubIndustry
type: Classifier
type: Discontinued
type: NamedIndividual
is sub industry of: Non-Residential Bldg Const
is contemporary version of: http://data.ga-group.nl/ics/bics/16151311
is version of: http://data.ga-group.nl/ics/bics/16151311
imported on: 2026-06-08T13:03:47.798Z
last refreshed on: 2026-06-08T13:03:47.798Z
source accessed on: 2019-12-03T20:05:01Z
source last accessed on: 2019-12-03T20:05:01Z
label: Construcción y desarrollo de hoteles @es
label: Construction et promotion d'hôtels @fr
label: Costruzione e sviluppo alberghi @it
label: Desenvolvimento e construção de hotéis @pt
label: Hotelbau und -entwicklung @de
label: Строительство и развитие гостиниц @ru
label: 飯店建設及開發 @zh-hant
label: 饭店建设和开发 @zh
label: 호텔 건설 & 개발업 @ko
label: ﾎﾃﾙ建設･開発 @ja
definition: This industry subgroup includes companies that build hotels and resorts.
notation: 16151311
valid from: 2014-08-08
valid till: 2020-10-03

Indoor Sports Facilities Const
type: BicsLevel4SubIndustry
type: Classifier
type: Discontinued
type: NamedIndividual
is sub industry of: Non-Residential Bldg Const
is contemporary version of: http://data.ga-group.nl/ics/bics/16151312
is version of: http://data.ga-group.nl/ics/bics/16151312
imported on: 2026-06-08T13:03:47.798Z
last refreshed on: 2026-06-08T13:03:47.798Z
source accessed on: 2019-12-03T20:05:01Z
source last accessed on: 2019-12-03T20:05:01Z
label: Const complexes sport couverts @fr
label: Const de instalações desportivas fechadas @pt
label: Costruz centri sportivi coperti @it
label: Inst deportivas bajo techo @es
label: Sporthallenbau @de
label: Строит. закрытых спортивных сооружений @ru
label: 室內體育設施營建 @zh-hant
label: 室内运动设施建设 @zh
label: 屋内運動施設建設 @ja
label: 실내 스포츠 설비 건설 @ko
definition: This industry subgroup includes companies that build indoor sporting facilities.
notation: 16151312
valid from: 2014-08-08
valid till: 2020-10-03

Industrial Buildings Const
type: BicsLevel4SubIndustry
type: Classifier
type: NamedIndividual
is sub industry of: Non-Residential Bldg Const
is anachronous version of: http://data.ga-group.nl/ics/bics/1711131212
is contemporary version of: http://data.ga-group.nl/ics/bics/16151313
is replaced by: http://data.ga-group.nl/ics/bics/2020/1711131212
is version of: http://data.ga-group.nl/ics/bics/16151313
is version of: http://data.ga-group.nl/ics/bics/1711131212
imported on: 2026-06-08T13:03:47.798Z
last refreshed on: 2026-06-08T13:03:47.798Z
source accessed on: 2019-12-03T20:05:01Z
source last accessed on: 2019-12-03T20:05:01Z
label: Bâtiments industriels @fr
label: Const edificios industriales @es
label: Const prédios industriais @pt
label: Costruz edifici industriali @it
label: Industriegebäudebau @de
label: Промышленные здания - строительство @ru
label: 工业建筑建设 @zh
label: 工業建築工程 @zh-hant
label: 産業用建築建設 @ja
label: 산업용건물건설업 @ko
definition: This industry subgroup includes companies that build industrial buildings, such as chemical and metal processing plants, foundries and refineries.
notation: 16151313
valid from: 2014-08-08
valid till: 2020-10-03

Institutional Buildings Const
type: BicsLevel4SubIndustry
type: Classifier
type: NamedIndividual
is sub industry of: Non-Residential Bldg Const
is anachronous version of: http://data.ga-group.nl/ics/bics/1711131213
is contemporary version of: http://data.ga-group.nl/ics/bics/16151314
is replaced by: http://data.ga-group.nl/ics/bics/2020/1711131213
is version of: http://data.ga-group.nl/ics/bics/16151314
is version of: http://data.ga-group.nl/ics/bics/1711131213
imported on: 2026-06-08T13:03:47.798Z
last refreshed on: 2026-06-08T13:03:47.798Z
source accessed on: 2019-12-03T20:05:01Z
source last accessed on: 2019-12-03T20:05:01Z
label: Bâtiments institutionnels @fr
label: Const de edificios institucionales @es
label: Const prédios institucionais @pt
label: Costruz edifici istituzionali @it
label: Institutioneller Gebäudebau @de
label: Строительство учреждений @ru
label: 公共機関建物建設 @ja
label: 机构建筑建设 @zh
label: 機構建築工程 @zh-hant
label: 기관 건물 건설 @ko
definition: This industry subgroup includes companies that build institutional buildings, such as government and religious buildings.
notation: 16151314
valid from: 2014-08-08
valid till: 2020-10-03

Logistics & Related Bldg Const
type: BicsLevel4SubIndustry
type: Classifier
type: Discontinued
type: NamedIndividual
is sub industry of: Non-Residential Bldg Const
is contemporary version of: http://data.ga-group.nl/ics/bics/16151315
is version of: http://data.ga-group.nl/ics/bics/16151315
imported on: 2026-06-08T13:03:47.798Z
last refreshed on: 2026-06-08T13:03:47.798Z
source accessed on: 2019-12-03T20:05:01Z
source last accessed on: 2019-12-03T20:05:01Z
label: Const edific logística y relacionada @es
label: Const préd logística e e construções @pt
label: Logistica e costruz edifici assoc @it
label: Logistik- & verw. Gebäudebau @de
label: Logistique/activités liées à la constr @fr
label: Строит. зданий МТО и сопряж. с ними строений @ru
label: 物流及相关建筑建设 @zh
label: 物流及相關建築營建 @zh-hant
label: 物流用･関連建物建設 @ja
label: 물류&관련건물 건설 @ko
definition: This industry subgroup includes companies that build logistics and related buildings, such as warehouses and public transport terminals.
notation: 16151315
valid from: 2014-08-08
valid till: 2020-10-03

Non-Residential Bldg Const
type: BicsLevel3Industry
type: Classifier
type: NamedIndividual
is industry of: Engineering & Construction Svcs
is anachronous version of: http://data.ga-group.nl/ics/bics/17111312
is contemporary version of: http://data.ga-group.nl/ics/bics/161513
is replaced by: http://data.ga-group.nl/ics/bics/2020/17111312
is version of: http://data.ga-group.nl/ics/bics/161513
is version of: http://data.ga-group.nl/ics/bics/17111312
imported on: 2026-06-08T13:03:47.798Z
last refreshed on: 2026-06-08T13:03:47.798Z
source accessed on: 2019-12-03T20:05:01Z
source last accessed on: 2019-12-03T20:05:01Z
label: Bau gewerbl. Gebäude @de
label: Const préd nresid @pt
label: Construc bâtiments non résid @fr
label: Edificac no res @es
label: Edilizia non residenziale @it
label: Стр-во нежилых зданий @ru
label: 非住宅建築營造 @zh-hant
label: 非住宅楼房建造 @zh
label: 비주거용건물건설업 @ko
label: ﾋﾞﾙ建設(除住宅) @ja
definition: This industry includes companies that build commercial and industrial facilities, such as factories, office and retail buildings, and hotels and warehouses. These companies do not own the buildings they construct but realize revenue through construction contracts.
notation: 161513
valid from: 2014-08-08
valid till: 2020-10-03

Engineering & Construction Svcs
type: BicsLevel2IndustryGroup
type: Classifier
type: NamedIndividual
is industry group of: Industrials
is anachronous version of: http://data.ga-group.nl/ics/bics/171113
is contemporary version of: http://data.ga-group.nl/ics/bics/1615
is replaced by: http://data.ga-group.nl/ics/bics/2020/171113
is version of: http://data.ga-group.nl/ics/bics/1615
is version of: http://data.ga-group.nl/ics/bics/171113
imported on: 2026-06-08T13:03:47.798Z
last refreshed on: 2026-06-08T13:03:47.798Z
source accessed on: 2019-12-03T20:05:01Z
source last accessed on: 2019-12-03T20:05:01Z
label: Ingenieur- & Baudienste @de
label: Serv costruzione e ingegneria @it
label: Serv engenharia e construção @pt
label: Serv ingénierie/construction @fr
label: Servicios de ingeniería y construcción @es
label: Инженерно-строит. услуги @ru
label: 工程与建筑服务 @zh
label: 建設･土木ｻｰﾋﾞｽ @ja
label: 營建及工程服務 @zh-hant
label: 엔지니어링 & 건설 서비스 @ko
definition: This industry group includes companies involved in the construction and engineering fields.
notation: 1615
valid from: 2014-08-08
valid till: 2020-10-03

Const/Mining Mach/Equip Distr
type: BicsLevel5Segment
type: Classifier
type: NamedIndividual
is level5 segment of: Industrial Machinery Distr
is anachronous version of: http://data.ga-group.nl/ics/bics/171110101010
is contemporary version of: http://data.ga-group.nl/ics/bics/1616101010
is replaced by: http://data.ga-group.nl/ics/bics/2020/171110101010
is version of: http://data.ga-group.nl/ics/bics/1616101010
is version of: http://data.ga-group.nl/ics/bics/171110101010
imported on: 2026-06-08T13:03:47.798Z
last refreshed on: 2026-06-08T13:03:47.798Z
source accessed on: 2019-12-03T20:05:01Z
source last accessed on: 2019-12-03T20:05:01Z
label: Distr mach/équip constr/mines @fr
label: Distrib app/costruzione/estrazione @it
label: Distrib equip/maq min @pt
label: Distribuidores de equipo y maquinaria de construcción y minería @es
label: Merchant-Händler für Bau- und Bergbaumaschinen und Zubehör @de
label: Дистрибьюторы строит. и горнодоб. техники @ru
label: 建筑/采矿机械/设备分销 @zh
label: 建設･鉱業用機械器具販売 @ja
label: 營建/礦業機械/設備經銷商 @zh-hant
label: 건설/광업용 기계/장비 유통업체 @ko
definition: This segment includes companies that wholesale and distribute specialized machinery, equipment and parts used in construction, mining and logging activities.
notation: 1616101010
valid from: 2014-08-08
valid till: 2020-10-03

Farm/Garden Mach/Equip Distr
type: BicsLevel5Segment
type: Classifier
type: NamedIndividual
is level5 segment of: Industrial Machinery Distr
is anachronous version of: http://data.ga-group.nl/ics/bics/171110101011
is contemporary version of: http://data.ga-group.nl/ics/bics/1616101011
is replaced by: http://data.ga-group.nl/ics/bics/2020/171110101011
is version of: http://data.ga-group.nl/ics/bics/1616101011
is version of: http://data.ga-group.nl/ics/bics/171110101011
imported on: 2026-06-08T13:03:47.798Z
last refreshed on: 2026-06-08T13:03:47.798Z
source accessed on: 2019-12-03T20:05:01Z
source last accessed on: 2019-12-03T20:05:01Z
label: Distr equip/maq fazenda/jardim @pt
label: Distr mach/équip ferme/jardin @fr
label: Distrib app/agr/giardino @it
label: Distribución de maq y equip agrícola y de jardinería @es
label: Merchant-Händler für Land- und Gartenmaschinen und Zubehör @de
label: Дистрибьюторы сельскохоз. техники и оборуд. @ru
label: 农业/园艺机械/设备分销 @zh
label: 農業及園藝機械/設備經銷商 @zh-hant
label: 農業･ｶﾞｰﾃﾞﾆﾝｸﾞ用機械器具販売 @ja
label: 농장/정원용 기계/장비 유통업체 @ko
definition: This segment includes companies that wholesale and distribute specialized machinery, equipment and parts used in farming activities. Products include tractors, harvesters and irrigation equipment.
notation: 1616101011
valid from: 2014-08-08
valid till: 2020-10-03

Industrial Mach & Equip Distr
type: BicsLevel5Segment
type: Classifier
type: NamedIndividual
is level5 segment of: Industrial Machinery Distr
is anachronous version of: http://data.ga-group.nl/ics/bics/171110101012
is contemporary version of: http://data.ga-group.nl/ics/bics/1616101012
is replaced by: http://data.ga-group.nl/ics/bics/2020/171110101012
is version of: http://data.ga-group.nl/ics/bics/1616101012
is version of: http://data.ga-group.nl/ics/bics/171110101012
imported on: 2026-06-08T13:03:47.798Z
last refreshed on: 2026-06-08T13:03:47.798Z
source accessed on: 2019-12-03T20:05:01Z
source last accessed on: 2019-12-03T20:05:01Z
label: Distr machines/équipements indus @fr
label: Distr supr equip industrial @pt
label: Distrib app e macch industriali @it
label: Distribución de equipo y maquinaria ind @es
label: Merchant-Händler für Industriemaschinen und Zubehör @de
label: Дистрибьюторы промышл. техники и оборуд. @ru
label: 工业机械与设备分销 @zh
label: 工業機械/設備經銷商 @zh-hant
label: 工業用機械器具販売 @ja
label: 산업용 기계 및 장비 유통업체 @ko
definition: This segment includes companies that wholesale and distribute stationary machinery and equipment.
notation: 1616101012
valid from: 2014-08-08
valid till: 2020-10-03

Transport Equip & Supply Distr
type: BicsLevel5Segment
type: Classifier
type: NamedIndividual
is level5 segment of: Industrial Machinery Distr
is anachronous version of: http://data.ga-group.nl/ics/bics/171110101013
is contemporary version of: http://data.ga-group.nl/ics/bics/1616101013
is replaced by: http://data.ga-group.nl/ics/bics/2020/171110101013
is version of: http://data.ga-group.nl/ics/bics/1616101013
is version of: http://data.ga-group.nl/ics/bics/171110101013
imported on: 2026-06-08T13:03:47.798Z
last refreshed on: 2026-06-08T13:03:47.798Z
source accessed on: 2019-12-03T20:05:01Z
source last accessed on: 2019-12-03T20:05:01Z
label: Distr équip/fournitures transport @fr
label: Distrib equip transp e supr @pt
label: Distrib forniture e app trasporto @it
label: Distribución de equipo de transporte y oferta @es
label: Merchant-Händler für Transport-Equipment & -zubehör (außer Kraftfahrzeuge) @de
label: Дистрибьюторы трансп. оборуд. и материалов @ru
label: 交通运输设备与物资分销 @zh
label: 輸送用機器･付属品販売 @ja
label: 運輸設備/用品經銷商 @zh-hant
label: 운송장비 & 용품 유통업체 @ko
definition: This segment includes companies that wholesale and distribute on-highway commercial vehicles and parts.
notation: 1616101013
valid from: 2014-08-08
valid till: 2020-10-03

Industrial Machinery Distr
type: BicsLevel4SubIndustry
type: Classifier
type: NamedIndividual
is sub industry of: Industrial Distribution & Rental
is anachronous version of: http://data.ga-group.nl/ics/bics/1711101010
is contemporary version of: http://data.ga-group.nl/ics/bics/16161010
is replaced by: http://data.ga-group.nl/ics/bics/2020/1711101010
is version of: http://data.ga-group.nl/ics/bics/16161010
is version of: http://data.ga-group.nl/ics/bics/1711101010
imported on: 2026-06-08T13:03:47.798Z
last refreshed on: 2026-06-08T13:03:47.798Z
source accessed on: 2019-12-03T20:05:01Z
source last accessed on: 2019-12-03T20:05:01Z
label: Dist máquina industrial @pt
label: Distr machines industrielles @fr
label: Distr maq indust @es
label: Distrib macchinari industriali @it
label: Industriemaschinenvertrieb @de
label: Дистрибьюторы промышл. оборуд. @ru
label: 工业机械分销 @zh
label: 工業機械經銷商 @zh-hant
label: 工業用機器販売 @ja
label: 산업용 기계 유통업체 @ko
definition: This industry subgroup includes companies that wholesale and distribute industrial machinery and parts.
notation: 16161010
valid from: 2014-08-08
valid till: 2020-10-03

Air Heat & A/C Eq & Supp Distr
type: BicsLevel6Segment
type: Classifier
type: NamedIndividual
is level6 segment of: Industrial Equip & Supplies Distr
is anachronous version of: http://data.ga-group.nl/ics/bics/171110101110
is contemporary version of: http://data.ga-group.nl/ics/bics/161610111010
is replaced by: http://data.ga-group.nl/ics/bics/2020/171110101110
is version of: http://data.ga-group.nl/ics/bics/161610111010
is version of: http://data.ga-group.nl/ics/bics/171110101110
imported on: 2026-06-08T13:03:47.798Z
last refreshed on: 2026-06-08T13:03:47.798Z
source accessed on: 2019-12-03T20:05:01Z
source last accessed on: 2019-12-03T20:05:01Z
label: Distr supr e equip calefação e ar cond @pt
label: Distrib forn e app riscald e A/C @it
label: Distrib fournitures/appareils clim/chauffage @fr
label: Distribuidores de equipo y partes de calefacción y aire acondicionado @es
label: Merchant-Händler von Equipment und Zubehör für Luftheizung und Klimaanlage, @de
label: Дистрибьюторы отопит. или охлажд. оборуд. @ru
label: 暖房･空調設備器具販売 @ja
label: 暖氣/空調設備/用品經銷商 @zh-hant
label: 暖��与空调设备与用品分销 @zh
label: 난방 & 냉방 장비 & 용품 유통업체 @ko
definition: This segment includes companies that wholesale and distribute heating, ventilation and air conditioning products.
notation: 161610111010
valid from: 2014-08-08
valid till: 2020-10-03

Electrical Supplies Distr
type: BicsLevel6Segment
type: Classifier
type: NamedIndividual
is level6 segment of: Industrial Equip & Supplies Distr
is anachronous version of: http://data.ga-group.nl/ics/bics/171110101111
is contemporary version of: http://data.ga-group.nl/ics/bics/161610111011
is replaced by: http://data.ga-group.nl/ics/bics/2020/171110101111
is version of: http://data.ga-group.nl/ics/bics/161610111011
is version of: http://data.ga-group.nl/ics/bics/171110101111
imported on: 2026-06-08T13:03:47.798Z
last refreshed on: 2026-06-08T13:03:47.798Z
source accessed on: 2019-12-03T20:05:01Z
source last accessed on: 2019-12-03T20:05:01Z
label: Distrib forniture elettriche @it
label: Distrib fournitures électriques @fr
label: Distrib suprimentos elétricos @pt
label: Distribuidoras sumin eléctrico @es
label: Vertrieb von elektrischem Zubehör @de
label: Дистрибьюторы электротехн. расх. мат. @ru
label: 电气器材分销 @zh
label: 電機用品經銷商 @zh-hant
label: 電気機器販売 @ja
label: 전기용품 공급업체 @ko
definition: This segment includes companies that wholesale and distribute electrical supplies for commercial use.
notation: 161610111011
valid from: 2014-08-08
valid till: 2020-10-03

Janitorial & Sanit Supp Distr
type: BicsLevel6Segment
type: Classifier
type: NamedIndividual
is level6 segment of: Industrial Equip & Supplies Distr
is anachronous version of: http://data.ga-group.nl/ics/bics/171110101112
is contemporary version of: http://data.ga-group.nl/ics/bics/161610111012
is replaced by: http://data.ga-group.nl/ics/bics/2020/171110101112
is version of: http://data.ga-group.nl/ics/bics/161610111012
is version of: http://data.ga-group.nl/ics/bics/171110101112
imported on: 2026-06-08T13:03:47.798Z
last refreshed on: 2026-06-08T13:03:47.798Z
source accessed on: 2019-12-03T20:05:01Z
source last accessed on: 2019-12-03T20:05:01Z
label: Distrib forn sanitarie e pulizia @it
label: Distrib fournitures sanit/entret @fr
label: Distrib supr limpeza e sanit @pt
label: Distribuidoras sumin conserjería y sanidad @es
label: Vertrieb von hausmeisterlichem & hygienischem Zubehör @de
label: Дистрибьюторы уборн. и санит.-гигиен. расх. мат. @ru
label: 保洁与卫生用品分销 @zh
label: 清掃･衛生用品販売 @ja
label: 清潔/衛生用品經銷商 @zh-hant
label: 환경미화 & 위생용품 공급업체 @ko
definition: This segment includes companies that wholesale and distribute janitorial and sanitary supplies for commercial use.
notation: 161610111012
valid from: 2014-08-08
valid till: 2020-10-03

Plumbing & Related Supp Distr
type: BicsLevel6Segment
type: Classifier
type: NamedIndividual
is level6 segment of: Industrial Equip & Supplies Distr
is anachronous version of: http://data.ga-group.nl/ics/bics/171110101113
is contemporary version of: http://data.ga-group.nl/ics/bics/161610111013
is replaced by: http://data.ga-group.nl/ics/bics/2020/171110101113
is version of: http://data.ga-group.nl/ics/bics/161610111013
is version of: http://data.ga-group.nl/ics/bics/171110101113
imported on: 2026-06-08T13:03:47.798Z
last refreshed on: 2026-06-08T13:03:47.798Z
source accessed on: 2019-12-03T20:05:01Z
source last accessed on: 2019-12-03T20:05:01Z
label: Distrib forn idrauliche ed associate @it
label: Distrib plomberie et connexe @fr
label: Distrib supr encan e relacion @pt
label: Distribuidoras fontanería y sumin relacionado @es
label: Vertrieb von Klempner- & verwandtem Zubehör @de
label: Дистрибьюторы водопров. расх. мат. @ru
label: 管道及相关用品分销 @zh
label: 配管/相關用品經銷商 @zh-hant
label: 配管･関連製品販売 @ja
label: 배관 & 관련용품 공급업체 @ko
definition: This segment includes companies that wholesale and distribute plumbing supplies for commercial use.
notation: 161610111013
valid from: 2014-08-08
valid till: 2020-10-03

Other Indus Supplies Distr
type: BicsLevel6Segment
type: Classifier
type: Discontinued
type: NamedIndividual
is level6 segment of: Industrial Equip & Supplies Distr
is contemporary version of: http://data.ga-group.nl/ics/bics/161610111014
is version of: http://data.ga-group.nl/ics/bics/161610111014
imported on: 2026-06-08T13:03:47.798Z
last refreshed on: 2026-06-08T13:03:47.798Z
source accessed on: 2019-12-03T20:05:01Z
source last accessed on: 2019-12-03T20:05:01Z
label: Distr outros suprimentos ind @pt
label: Distrib altre forniture indus @it
label: Distrib autres fournitures indus @fr
label: Otra distrib de sumin industrial @es
label: Sonstige industrielle Lieferantenverteiler @de
label: Дистрибьюторы проч. пром. расх. мат. @ru
label: その他工業用品販売 @ja
label: 其他工业物资分销 @zh
label: 其他工業用品經銷商 @zh-hant
label: 기타 산업용품 공급업체 @ko
definition: This segment includes companies that wholesale and distribute industrial supplies not elsewhere classified.
notation: 161610111014
valid from: 2014-08-08
valid till: 2020-10-03

Industrial Equip & Supplies Distr
type: BicsLevel5Segment
type: Classifier
type: NamedIndividual
is level5 segment of: Industrial Supplies Distributors
is anachronous version of: http://data.ga-group.nl/ics/bics/1711101011
is contemporary version of: http://data.ga-group.nl/ics/bics/1616101110
is replaced by: http://data.ga-group.nl/ics/bics/2020/1711101011
is version of: http://data.ga-group.nl/ics/bics/1616101110
is version of: http://data.ga-group.nl/ics/bics/1711101011
imported on: 2026-06-08T13:03:47.798Z
last refreshed on: 2026-06-08T13:03:47.798Z
source accessed on: 2019-12-03T20:05:01Z
source last accessed on: 2019-12-03T20:05:01Z
label: Distr équip/fournitures indus @fr
label: Distr equip e suprimentos industriais @pt
label: Distrib forniture e app industriali @it
label: Distribución de equipo y suministro ind @es
label: Merchant-Händler für industrielles Zubehör @de
label: Дистрибьюторы промышл. материалов @ru
label: 工业设备与物资分销 @zh
label: 工業用機器販売 @ja
label: 工業設備/用品經銷商 @zh-hant
label: 산업 장비 & 용품 유통업체 @ko
definition: This segment includes companies that wholesale and distribute supplies and equipment.
notation: 1616101110
valid from: 2014-08-08
valid till: 2020-10-03

Svc Establ Equip & Supp Distr
type: BicsLevel5Segment
type: Classifier
type: Discontinued
type: NamedIndividual
is level5 segment of: Industrial Supplies Distributors
is contemporary version of: http://data.ga-group.nl/ics/bics/1616101111
is version of: http://data.ga-group.nl/ics/bics/1616101111
imported on: 2026-06-08T13:03:47.798Z
last refreshed on: 2026-06-08T13:03:47.798Z
source accessed on: 2019-12-03T20:05:01Z
source last accessed on: 2019-12-03T20:05:01Z
label: Distrib forn e app impresa serv @it
label: Distrib fourn/équio établissements de serv @fr
label: Distrib supr e equip estab serv @pt
label: Distribuidores de equipo y partes de establecimiento de servicios @es
label: Merchant-Händler für Dienstleistungsgewerbeausstattung und Zubehör @de
label: Дистрибьюторы оборуд. и матер. @ru
label: 服务设施设备与物资分销 @zh
label: 服務業設備/用品經銷商 @zh-hant
label: 業務用機器･付属品販売 @ja
label: 서비스 시설 장치 및 용품 유통업체 @ko
definition: This segment includes companies that specialize in wholesale distribution of equipment and supplies for customers that are involved in a service industry.
notation: 1616101111
valid from: 2014-08-08
valid till: 2020-10-03

Industrial Supplies Distributors
type: BicsLevel4SubIndustry
type: Classifier
type: Discontinued
type: NamedIndividual
is sub industry of: Industrial Distribution & Rental
is contemporary version of: http://data.ga-group.nl/ics/bics/16161011
is version of: http://data.ga-group.nl/ics/bics/16161011
imported on: 2026-06-08T13:03:47.798Z
last refreshed on: 2026-06-08T13:03:47.798Z
source accessed on: 2019-12-03T20:05:01Z
source last accessed on: 2019-12-03T20:05:01Z
label: Distr fournitures industrielles @fr
label: Distribuições suprim industriais @pt
label: Distribuidores de provisiones industriales @es
label: Distributori forniture industriali @it
label: Händler ind. Zulieferung @de
label: Дистрибьюторы промышл. материалов @ru
label: 工业物资分销商 @zh
label: 工業用品經銷商 @zh-hant
label: 工業用品販売 @ja
label: 산업 용품 유통업체 @ko
definition: This industry subgroup includes companies that wholesale and distributes a broad range of supplies and products used in numerous industries including manufacturing, construction and maintenance. These companies primarily serve commercial and industrial customers.
notation: 16161011
valid from: 2014-08-08
valid till: 2020-10-03

Commercial Vehicle Rental Svcs
type: BicsLevel5Segment
type: Classifier
type: NamedIndividual
is level5 segment of: Commercial Equip Rental Svcs
is anachronous version of: http://data.ga-group.nl/ics/bics/171110101210
is contemporary version of: http://data.ga-group.nl/ics/bics/1616101210
is replaced by: http://data.ga-group.nl/ics/bics/2020/171110101210
is version of: http://data.ga-group.nl/ics/bics/1616101210
is version of: http://data.ga-group.nl/ics/bics/171110101210
imported on: 2026-06-08T13:03:47.798Z
last refreshed on: 2026-06-08T13:03:47.798Z
source accessed on: 2019-12-03T20:05:01Z
source last accessed on: 2019-12-03T20:05:01Z
label: Serv aluguel veículos comerciais @pt
label: Serv location véhicules commerciaux @fr
label: Serv noleggio veicoli commerciali @it
label: Servicios de arrendamiento de vehículos comerciales @es
label: Vermietung von gewerblichen Fahrzeugen @de
label: Прокат коммерч. грузовых автомобилей @ru
label: 商用車出租服務 @zh-hant
label: 商用車ﾚﾝﾀﾙｻｰﾋﾞｽ @ja
label: 商用车辆租赁服务 @zh
label: 상업용 자동차 임대업 @ko
definition: This segment includes companies that rent on-highway commercial vehicles, such as tractor trailers, busses, motor coaches and commercial vans.
notation: 1616101210
valid from: 2014-08-08
valid till: 2020-10-03

General Equip Rental Svcs
type: BicsLevel5Segment
type: Classifier
type: NamedIndividual
is level5 segment of: Commercial Equip Rental Svcs
is anachronous version of: http://data.ga-group.nl/ics/bics/171110101211
is contemporary version of: http://data.ga-group.nl/ics/bics/1616101211
is replaced by: http://data.ga-group.nl/ics/bics/2020/171110101211
is version of: http://data.ga-group.nl/ics/bics/1616101211
is version of: http://data.ga-group.nl/ics/bics/171110101211
imported on: 2026-06-08T13:03:47.798Z
last refreshed on: 2026-06-08T13:03:47.798Z
source accessed on: 2019-12-03T20:05:01Z
source last accessed on: 2019-12-03T20:05:01Z
label: Alquiler de equipo en general @es
label: Serv aluguel equip em geral @pt
label: Serv location équip général @fr
label: Serv noleggio app generali @it
label: Vermietungsdienste für allgemeines Zubehör @de
label: Услуги аренды оборуд. @ru
label: 一般機器ﾚﾝﾀﾙｻｰﾋﾞｽ @ja
label: 一般設備出租服務 @zh-hant
label: 普通设备租赁服务 @zh
label: 일반장비 임대업 @ko
definition: This segment includes companies that rent or lease general equipment for commercial use.
notation: 1616101211
valid from: 2014-08-08
valid till: 2020-10-03

Industrial Equip Rent Svcs
type: BicsLevel5Segment
type: Classifier
type: NamedIndividual
is level5 segment of: Commercial Equip Rental Svcs
is anachronous version of: http://data.ga-group.nl/ics/bics/171110101212
is contemporary version of: http://data.ga-group.nl/ics/bics/1616101212
is replaced by: http://data.ga-group.nl/ics/bics/2020/171110101212
is version of: http://data.ga-group.nl/ics/bics/1616101212
is version of: http://data.ga-group.nl/ics/bics/171110101212
imported on: 2026-06-08T13:03:47.798Z
last refreshed on: 2026-06-08T13:03:47.798Z
source accessed on: 2019-12-03T20:05:01Z
source last accessed on: 2019-12-03T20:05:01Z
label: Serv alug equip industrial @pt
label: Serv location équip indus @fr
label: Serv noleggio app industriali @it
label: Servicios de alquiler de equipo industrial @es
label: Vermietungsdienste für industrielles Zubehör @de
label: Аренда промышл. оборуд. @ru
label: 工业设备租赁服务 @zh
label: 工業用機器ﾚﾝﾀﾙｻｰﾋﾞｽ @ja
label: 工業設備出租服務 @zh-hant
label: 산업장비 임대업 @ko
definition: This segment includes companies that rent or lease industrial equipment, such as energy equipment and other large equipment.
notation: 1616101212
valid from: 2014-08-08
valid till: 2020-10-03

Machinery Rental Services
type: BicsLevel5Segment
type: Classifier
type: NamedIndividual
is level5 segment of: Commercial Equip Rental Svcs
is anachronous version of: http://data.ga-group.nl/ics/bics/171110101213
is contemporary version of: http://data.ga-group.nl/ics/bics/1616101213
is replaced by: http://data.ga-group.nl/ics/bics/2020/171110101213
is version of: http://data.ga-group.nl/ics/bics/1616101213
is version of: http://data.ga-group.nl/ics/bics/171110101213
imported on: 2026-06-08T13:03:47.798Z
last refreshed on: 2026-06-08T13:03:47.798Z
source accessed on: 2019-12-03T20:05:01Z
source last accessed on: 2019-12-03T20:05:01Z
label: Alquiler de maquinaria @es
label: Serviços de aluguel de máquinas @pt
label: Services de location de machinerie @fr
label: Servizi noleggio macchin @it
label: Vermietungsdienste für Maschinen @de
label: Аренда машинного оборудования @ru
label: 机械租赁服务 @zh
label: 機器･設備ﾚﾝﾀﾙｻｰﾋﾞｽ @ja
label: 機械出租服務 @zh-hant
label: 기계 임대 서비스 @ko
definition: This segment includes companies that rent or lease machinery, such as machinery used in mining, construction and material handling.
notation: 1616101213
valid from: 2014-08-08
valid till: 2020-10-03

Commercial Equip Rental Svcs
type: BicsLevel4SubIndustry
type: Classifier
type: NamedIndividual
is sub industry of: Industrial Distribution & Rental
is anachronous version of: http://data.ga-group.nl/ics/bics/1711101012
is contemporary version of: http://data.ga-group.nl/ics/bics/16161012
is replaced by: http://data.ga-group.nl/ics/bics/2020/1711101012
is version of: http://data.ga-group.nl/ics/bics/16161012
is version of: http://data.ga-group.nl/ics/bics/1711101012
imported on: 2026-06-08T13:03:47.798Z
last refreshed on: 2026-06-08T13:03:47.798Z
source accessed on: 2019-12-03T20:05:01Z
source last accessed on: 2019-12-03T20:05:01Z
label: Serv alug equip comerciais @pt
label: Serv location équip comm @fr
label: Serv noleggio app commerciali @it
label: Servicios comerciales de alquiler de equipo @es
label: Vermietungsdienste für gewerbliches Equipment @de
label: Аренда коммерческого оборуд. @ru
label: 商业设备租赁服务 @zh
label: 商業設備ﾚﾝﾀﾙｻｰﾋﾞｽ @ja
label: 商用設備出租服務 @zh-hant
label: 상업용 장비 임대업 @ko
definition: This industry subgroup includes companies that rent or lease heavy commercial and industrial machinery and equipment as well as commercial vehicles.
notation: 16161012
valid from: 2014-08-08
valid till: 2020-10-03

Industrial Distribution & Rental
type: BicsLevel3Industry
type: Classifier
type: NamedIndividual
is industry of: Industrial Services
is anachronous version of: http://data.ga-group.nl/ics/bics/17111010
is contemporary version of: http://data.ga-group.nl/ics/bics/161610
is replaced by: http://data.ga-group.nl/ics/bics/2020/17111010
is version of: http://data.ga-group.nl/ics/bics/161610
is version of: http://data.ga-group.nl/ics/bics/17111010
imported on: 2026-06-08T13:03:47.798Z
last refreshed on: 2026-06-08T13:03:47.798Z
source accessed on: 2019-12-03T20:05:01Z
source last accessed on: 2019-12-03T20:05:01Z
label: Distribución y alquiler industrial @es
label: Distribuição e aluguel industrial @pt
label: Distribution/location industrielle @fr
label: Distribuzione e noleggio industriale @it
label: Industrieller Vertrieb & Vermietung @de
label: Торговля промышл. матер. и аренда оборуд. @ru
label: 工业配送与租赁 @zh
label: 工業製品販売･ﾚﾝﾀﾙ @ja
label: 산업 유통 & 임대 @ko
label: ���業經銷及出租 @zh-hant
definition: This industry includes companies that wholesale-distribute or rent all types of machinery, equipment or supplies for industrial use.
notation: 161610
valid from: 2014-08-08
valid till: 2020-10-03

Elec Precision Equip Maint
type: BicsLevel4SubIndustry
type: Classifier
type: NamedIndividual
is sub industry of: Industrial Maintenance Svcs
is anachronous version of: http://data.ga-group.nl/ics/bics/1711101110
is contemporary version of: http://data.ga-group.nl/ics/bics/16161110
is replaced by: http://data.ga-group.nl/ics/bics/2020/1711101110
is version of: http://data.ga-group.nl/ics/bics/16161110
is version of: http://data.ga-group.nl/ics/bics/1711101110
imported on: 2026-06-08T13:03:47.798Z
last refreshed on: 2026-06-08T13:03:47.798Z
source accessed on: 2019-12-03T20:05:01Z
source last accessed on: 2019-12-03T20:05:01Z
label: Mant eq electrónico precisión @es
label: Manutenção de equip de precisão eletrônica @pt
label: Manutenzione app elettroniche @it
label: Réparat équipt élect précision @fr
label: Wartung elektr. Präzisionsanl. @de
label: Ремонт электр. и точного оборудования @ru
label: 电子和精密设备修理和维护 @zh
label: 電器及精密設備維修保養 @zh-hant
label: 電子･精密機器修理･ﾒﾝﾃﾅﾝｽ業 @ja
label: 전자정밀기기수리 @ko
definition: This industry subgroup includes establishments that repair and maintain electronic and precision equipment.
notation: 16161110
valid from: 2014-08-08
valid till: 2020-10-03

Energy Facilities & Ntwrk Maint
type: BicsLevel4SubIndustry
type: Classifier
type: NamedIndividual
is sub industry of: Industrial Maintenance Svcs
is anachronous version of: http://data.ga-group.nl/ics/bics/1711101112
is contemporary version of: http://data.ga-group.nl/ics/bics/16161111
is replaced by: http://data.ga-group.nl/ics/bics/2020/1711101112
is version of: http://data.ga-group.nl/ics/bics/16161111
is version of: http://data.ga-group.nl/ics/bics/1711101112
imported on: 2026-06-08T13:03:47.798Z
last refreshed on: 2026-06-08T13:03:47.798Z
source accessed on: 2019-12-03T20:05:01Z
source last accessed on: 2019-12-03T20:05:01Z
label: Energiedienste @de
label: Impianti energia e manutenzione rete @it
label: Instalações elétriacs e manut rede @pt
label: Maint réseau/install énergie @fr
label: Mantenimiento de instalaciones y redes de energía @es
label: Энергетич. службы и облуж. сетей @ru
label: 能源設備及網路保養 @zh-hant
label: 能源设施与网络维护 @zh
label: 에너지 시설 & 네트워크 관리 @ko
label: ｴﾈﾙｷﾞｰ施設･ﾈｯﾄﾜｰｸ保守 @ja
definition: This industry subgroup includes companies that provide maintenance and repair services for electric utility networks and power generation facilities.
notation: 16161111
valid from: 2014-08-08
valid till: 2020-10-03

Industrial Mach Equip Repair
type: BicsLevel4SubIndustry
type: Classifier
type: NamedIndividual
is sub industry of: Industrial Maintenance Svcs
is anachronous version of: http://data.ga-group.nl/ics/bics/1711101111
is contemporary version of: http://data.ga-group.nl/ics/bics/16161112
is replaced by: http://data.ga-group.nl/ics/bics/2020/1711101111
is version of: http://data.ga-group.nl/ics/bics/16161112
is version of: http://data.ga-group.nl/ics/bics/1711101111
imported on: 2026-06-08T13:03:47.798Z
last refreshed on: 2026-06-08T13:03:47.798Z
source accessed on: 2019-12-03T20:05:01Z
source last accessed on: 2019-12-03T20:05:01Z
label: Réparation machine industrie @fr
label: Repar maq y equipo industrial @es
label: Reparatur Industriemaschinen @de
label: Reparos de equip de maquinário industrial @pt
label: Riparazione macchine indus @it
label: Ремонт промышл. оборуд. @ru
label: 商工業用機器修理･ﾒﾝﾃﾅﾝｽ業 @ja
label: 工业机械设备修理 @zh
label: 工業機械維修保養 @zh-hant
label: 산업기계수리 @ko
definition: This industry includes companies that repair and maintain industrial machinery and equipment.
notation: 16161112
valid from: 2014-08-08
valid till: 2020-10-03

Industrial Maintenance Svcs
type: BicsLevel3Industry
type: Classifier
type: NamedIndividual
is industry of: Industrial Services
is anachronous version of: http://data.ga-group.nl/ics/bics/17111011
is contemporary version of: http://data.ga-group.nl/ics/bics/161611
is replaced by: http://data.ga-group.nl/ics/bics/2020/17111011
is version of: http://data.ga-group.nl/ics/bics/161611
is version of: http://data.ga-group.nl/ics/bics/17111011
imported on: 2026-06-08T13:03:47.798Z
last refreshed on: 2026-06-08T13:03:47.798Z
source accessed on: 2019-12-03T20:05:01Z
source last accessed on: 2019-12-03T20:05:01Z
label: Reparatur & Wartung @de
label: Serv de manutenção industrial @pt
label: Serv manutenzione industriale @it
label: Svcs maintenance industrielle @fr
label: Svcs mantenimiento industrial @es
label: Услуги по ремонту промышл. оборуд. @ru
label: 工业维护服务 @zh
label: 工業保養服務 @zh-hant
label: 工業用機器保守ｻｰﾋﾞｽ @ja
label: 산업 유지보수업 @ko
definition: This industry includes companies that provide maintenance and repair services for industrial machinery, equipment and facilities.
notation: 161611
valid from: 2014-08-08
valid till: 2020-10-03

Industrial Services
type: BicsLevel2IndustryGroup
type: Classifier
type: NamedIndividual
is industry group of: Industrials
is anachronous version of: http://data.ga-group.nl/ics/bics/171110
is contemporary version of: http://data.ga-group.nl/ics/bics/1616
is replaced by: http://data.ga-group.nl/ics/bics/2020/171110
is version of: http://data.ga-group.nl/ics/bics/1616
is version of: http://data.ga-group.nl/ics/bics/171110
imported on: 2026-06-08T13:03:47.798Z
last refreshed on: 2026-06-08T13:03:47.798Z
source accessed on: 2019-12-03T20:05:01Z
source last accessed on: 2019-12-03T20:05:01Z
label: Industriedienste @de
label: Serviços industriais @pt
label: Services industriels @fr
label: Servicios industriales @es
label: Servizi industriali @it
label: Промышленные услуги @ru
label: 工业服务 @zh
label: 工業服務 @zh-hant
label: 産業ｻｰﾋﾞｽ @ja
label: 산업 서비스 @ko
definition: This industry group includes companies that supply, rent, or repair industrial equipment and machinery.
notation: 1616
valid from: 2014-08-08
valid till: 2020-10-03

Air Cargo
type: BicsLevel4SubIndustry
type: Classifier
type: Discontinued
type: NamedIndividual
is sub industry of: Air Freight
is contemporary version of: http://data.ga-group.nl/ics/bics/16171010
is version of: http://data.ga-group.nl/ics/bics/16171010
imported on: 2026-06-08T13:03:47.798Z
last refreshed on: 2026-06-08T13:03:47.798Z
source accessed on: 2019-12-03T20:05:01Z
source last accessed on: 2019-12-03T20:05:01Z
label: Carga aérea @es
label: Cargo aereo @it
label: Fret aérien @fr
label: Luftfrachterlös @de
label: Авиационные грузы @ru
label: 航空貨物 @ja
label: 航空貨運收入 @zh-hant
label: 航空货运 @zh
label: 항공화물 @ko
definition: This industry subgroup includes companies that provide dedicated air cargo services. These companies transport only freight, not passengers.
notation: 16171010
valid from: 2014-08-08
valid till: 2020-10-03

Airline Cargo
type: BicsLevel4SubIndustry
type: Classifier
type: Discontinued
type: NamedIndividual
is sub industry of: Air Freight
is contemporary version of: http://data.ga-group.nl/ics/bics/16171011
is version of: http://data.ga-group.nl/ics/bics/16171011
imported on: 2026-06-08T13:03:47.798Z
last refreshed on: 2026-06-08T13:03:47.798Z
source accessed on: 2019-12-03T20:05:01Z
source last accessed on: 2019-12-03T20:05:01Z
label: Carga aérea @es
label: Carga de companhia aérea @pt
label: Cargo aérien @fr
label: Cargo linea aerea @it
label: Erlös Flugfracht @de
label: Выручка от авиагрузоперевозок @ru
label: 航空公司貨運收入 @zh-hant
label: 航空公司货运 @zh
label: 航空旅客･貨物 @ja
label: 항공사화물 @ko
definition: This industry subgroup includes passenger airline companies that generate air cargo revenue.
notation: 16171011
valid from: 2014-08-08
valid till: 2020-10-03

Air Freight
type: BicsLevel3Industry
type: Classifier
type: NamedIndividual
is industry of: Transportation & Logistics
is anachronous version of: http://data.ga-group.nl/ics/bics/17111211
is contemporary version of: http://data.ga-group.nl/ics/bics/161710
is replaced by: http://data.ga-group.nl/ics/bics/2020/17111211
is version of: http://data.ga-group.nl/ics/bics/161710
is version of: http://data.ga-group.nl/ics/bics/17111211
imported on: 2026-06-08T13:03:47.798Z
last refreshed on: 2026-06-08T13:03:47.798Z
source accessed on: 2019-12-03T20:05:01Z
source last accessed on: 2019-12-03T20:05:01Z
label: Carga aérea @pt
label: Flete aéreo @es
label: Frachttransport zu Luft @de
label: Transport aérien @fr
label: Trasporto aereo @it
label: Грузовые авиаперевозки @ru
label: 空运 @zh
label: 空運運輸 @zh-hant
label: 航空貨物輸送 @ja
label: 항공 화물 @ko
definition: This industry includes companies that provide air freight transportation services. Such services include shipping freight or mail on passenger airlines or dedicated air freight cargo planes.
notation: 161710
valid from: 2014-08-08
valid till: 2020-10-03

Express Courier Services
type: BicsLevel4SubIndustry
type: Classifier
type: NamedIndividual
is sub industry of: Courier Services
is anachronous version of: http://data.ga-group.nl/ics/bics/1711121210
is contemporary version of: http://data.ga-group.nl/ics/bics/16171110
is replaced by: http://data.ga-group.nl/ics/bics/2020/1711121210
is version of: http://data.ga-group.nl/ics/bics/16171110
is version of: http://data.ga-group.nl/ics/bics/1711121210
imported on: 2026-06-08T13:03:47.798Z
last refreshed on: 2026-06-08T13:03:47.798Z
source accessed on: 2019-12-03T20:05:01Z
source last accessed on: 2019-12-03T20:05:01Z
label: Express-Kurier @de
label: Mensajería express @es
label: Serv de correio expresso @pt
label: Serv post espressi @it
label: Srv courrier express @fr
label: Услуги экспресс-курьера @ru
label: 宅急便ｻｰﾋﾞｽ @ja
label: 快递服务 @zh
label: 快遞服務 @zh-hant
label: 급행 택배 서비스 @ko
definition: This industry subgroup includes companies that provide express delivery courier services. Such delivery is by either ground or air transportation within one to three days.
notation: 16171110
valid from: 2014-08-08
valid till: 2020-10-03

Ground Courier Services
type: BicsLevel4SubIndustry
type: Classifier
type: NamedIndividual
is sub industry of: Courier Services
is anachronous version of: http://data.ga-group.nl/ics/bics/1711121211
is contemporary version of: http://data.ga-group.nl/ics/bics/16171111
is replaced by: http://data.ga-group.nl/ics/bics/2020/1711121211
is version of: http://data.ga-group.nl/ics/bics/16171111
is version of: http://data.ga-group.nl/ics/bics/1711121211
imported on: 2026-06-08T13:03:47.798Z
last refreshed on: 2026-06-08T13:03:47.798Z
source accessed on: 2019-12-03T20:05:01Z
source last accessed on: 2019-12-03T20:05:01Z
label: Corriere via terra @it
label: Kurierdienst zu Land @de
label: Mensajería terrestre @es
label: Serv de correio via terra @pt
label: Srv courrier terre @fr
label: Услуги курьера наземной почты @ru
label: 地面快递服务 @zh
label: 宅配ｻｰﾋﾞｽ @ja
label: 陸地快遞服務 @zh-hant
label: 육상 택배 서비스 @ko
definition: This industry subgroup includes companies that provide ground delivery courier services. Such services include delivery of letters, small packages, and documents by ground transportation.
notation: 16171111
valid from: 2014-08-08
valid till: 2020-10-03

Mail Services
type: BicsLevel4SubIndustry
type: Classifier
type: NamedIndividual
is sub industry of: Courier Services
is anachronous version of: http://data.ga-group.nl/ics/bics/1711121212
is contemporary version of: http://data.ga-group.nl/ics/bics/16171112
is replaced by: http://data.ga-group.nl/ics/bics/2020/1711121212
is version of: http://data.ga-group.nl/ics/bics/16171112
is version of: http://data.ga-group.nl/ics/bics/1711121212
imported on: 2026-06-08T13:03:47.798Z
last refreshed on: 2026-06-08T13:03:47.798Z
source accessed on: 2019-12-03T20:05:01Z
source last accessed on: 2019-12-03T20:05:01Z
label: Postdienst @de
label: Serviços postais @pt
label: Services postaux @fr
label: Servicios de correo @es
label: Servizi postali @it
label: Почтовые услуги @ru
label: 邮件服务 @zh
label: 郵便ｻｰﾋﾞｽ @ja
label: 郵政服務 @zh-hant
label: 우편업 @ko
definition: This industry subgroup includes companies that provide postal services. Such services include the pickup and delivery of mail and the operation of post offices throughout a country.
notation: 16171112
valid from: 2014-08-08
valid till: 2020-10-03

Courier Services
type: BicsLevel3Industry
type: Classifier
type: NamedIndividual
is industry of: Transportation & Logistics
is anachronous version of: http://data.ga-group.nl/ics/bics/17111212
is contemporary version of: http://data.ga-group.nl/ics/bics/161711
is replaced by: http://data.ga-group.nl/ics/bics/2020/17111212
is version of: http://data.ga-group.nl/ics/bics/161711
is version of: http://data.ga-group.nl/ics/bics/17111212
imported on: 2026-06-08T13:03:47.798Z
last refreshed on: 2026-06-08T13:03:47.798Z
source accessed on: 2019-12-03T20:05:01Z
source last accessed on: 2019-12-03T20:05:01Z
label: Express- & Kurierdienste @de
label: Serviços de correios @pt
label: Services de courrier @fr
label: Servicios de mensajería @es
label: Servizi corriere @it
label: Курьерская доставка @ru
label: 宅配ｻｰﾋﾞｽ @ja
label: 快遞服務 @zh-hant
label: 递送服务 @zh
label: 택배 서비스 @ko
definition: This industry includes companies that provide courier delivery services. Such services include pickup and delivery of letters, small packages, and documents. Delivery services can be done by air or ground transportation.
notation: 161711
valid from: 2014-08-08
valid till: 2020-10-03

Coastal Freight Transportation
type: BicsLevel4SubIndustry
type: Classifier
type: NamedIndividual
is sub industry of: Marine Shipping
is anachronous version of: http://data.ga-group.nl/ics/bics/1711121310
is contemporary version of: http://data.ga-group.nl/ics/bics/16171210
is replaced by: http://data.ga-group.nl/ics/bics/2020/1711121310
is version of: http://data.ga-group.nl/ics/bics/16171210
is version of: http://data.ga-group.nl/ics/bics/1711121310
imported on: 2026-06-08T13:03:47.798Z
last refreshed on: 2026-06-08T13:03:47.798Z
source accessed on: 2019-12-03T20:05:01Z
source last accessed on: 2019-12-03T20:05:01Z
label: Flete de costa @es
label: Frachttransp. Küste @de
label: Transport de fret côtier @fr
label: Transporte de frete costeiro @pt
label: Trasporto merci costiero @it
label: Прибрежные грузоперевозки @ru
label: 沿海貨物輸送 @ja
label: 沿海貨運 @zh-hant
label: 沿海货运 @zh
label: 연안 화물운송 @ko
definition: This industry subgroup includes companies that transport freight overseas, tow barges and rent vessels for freight transport.
notation: 16171210
valid from: 2014-08-08
valid till: 2020-10-03

Container Shipping
type: BicsLevel4SubIndustry
type: Classifier
type: NamedIndividual
is sub industry of: Marine Shipping
is anachronous version of: http://data.ga-group.nl/ics/bics/1711121311
is contemporary version of: http://data.ga-group.nl/ics/bics/16171211
is replaced by: http://data.ga-group.nl/ics/bics/2020/1711121311
is version of: http://data.ga-group.nl/ics/bics/16171211
is version of: http://data.ga-group.nl/ics/bics/1711121311
imported on: 2026-06-08T13:03:47.798Z
last refreshed on: 2026-06-08T13:03:47.798Z
source accessed on: 2019-12-03T20:05:01Z
source last accessed on: 2019-12-03T20:05:01Z
label: Containerverschiffg @de
label: Embarque de contêiner @pt
label: Envío por contenedor @es
label: Fret en conteneur @fr
label: Trasporto container @it
label: Контейнерные перевозки @ru
label: 貨櫃航運 @zh-hant
label: 集装箱货运 @zh
label: 컨테이너 운송 @ko
label: ｺﾝﾃﾅ輸送 @ja
definition: This industry subgroup includes companies that provide marine transportation of freight by container ship. These ships transport standardized containers holding a wide range of consumer and industrial products.
notation: 16171211
valid from: 2014-08-08
valid till: 2020-10-03

Dry Bulk Shipping
type: BicsLevel4SubIndustry
type: Classifier
type: NamedIndividual
is sub industry of: Marine Shipping
is anachronous version of: http://data.ga-group.nl/ics/bics/1711121312
is contemporary version of: http://data.ga-group.nl/ics/bics/16171212
is replaced by: http://data.ga-group.nl/ics/bics/2020/1711121312
is version of: http://data.ga-group.nl/ics/bics/16171212
is version of: http://data.ga-group.nl/ics/bics/1711121312
imported on: 2026-06-08T13:03:47.798Z
last refreshed on: 2026-06-08T13:03:47.798Z
source accessed on: 2019-12-03T20:05:01Z
source last accessed on: 2019-12-03T20:05:01Z
label: Envío de carga seca @es
label: Fret maritime vrac @fr
label: Schüttguttransport @de
label: Sped carico secco @it
label: Transporte de carga a granel @pt
label: Морские перевозки сухих грузов @ru
label: 干货运输 @zh
label: 散裝乾貨航運 @zh-hant
label: 건화물 벌크 운송 @ko
label: ﾄﾞﾗｲﾊﾞﾙｸ船輸送 @ja
definition: This industry subgroup includes companies that provide marine transportation of dry bulk commodity products using dry bulk carriers. Such carriers include Capesize, Panamax, Supramax, Kamsarmax, Handymax, Handysize and very large bulk carrier‒type vessels.
notation: 16171212
valid from: 2014-08-08
valid till: 2020-10-03

Inland Water Freight
type: BicsLevel4SubIndustry
type: Classifier
type: NamedIndividual
is sub industry of: Marine Shipping
is anachronous version of: http://data.ga-group.nl/ics/bics/1711121313
is contemporary version of: http://data.ga-group.nl/ics/bics/16171213
is replaced by: http://data.ga-group.nl/ics/bics/2020/1711121313
is version of: http://data.ga-group.nl/ics/bics/16171213
is version of: http://data.ga-group.nl/ics/bics/1711121313
imported on: 2026-06-08T13:03:47.798Z
last refreshed on: 2026-06-08T13:03:47.798Z
source accessed on: 2019-12-03T20:05:01Z
source last accessed on: 2019-12-03T20:05:01Z
label: Binnengewässertran. @de
label: Flete aguas interior @es
label: Fret eau intérieure @fr
label: Transporte de navegação interior @pt
label: Trasp acque interne @it
label: Внутр. водные грузоперевозки @ru
label: 內陸水陸貨運 @zh-hant
label: 内水面貨物輸送 @ja
label: 内陆水上运输业 @zh
label: 내륙수상화물 @ko
definition: This industry subgroup includes companies that transport freight on rivers, canals and lakes on vessels not suitable for ocean transport.
notation: 16171213
valid from: 2014-08-08
valid till: 2020-10-03

Acta Jones
type: BicsLevel4SubIndustry
type: Classifier
type: Discontinued
type: NamedIndividual
is sub industry of: Marine Shipping
is contemporary version of: http://data.ga-group.nl/ics/bics/16171214
is version of: http://data.ga-group.nl/ics/bics/16171214
imported on: 2026-06-08T13:03:47.798Z
last refreshed on: 2026-06-08T13:03:47.798Z
source accessed on: 2019-12-03T20:05:01Z
source last accessed on: 2019-12-03T20:05:01Z
label: Jones Act
label: Jones法案 @zh-hant
label: Loi Jones @fr
label: Закон Джонса @ru
label: 琼斯法案 @zh
label: 존스법 @ko
label: ｼﾞｮｰﾝｽﾞ法 @ja
definition: This industry subgroup includes companies that transport merchandise between two ports in the United States. Under the Jones Act, these companies operate vessels that are built, owned, operated and manned by U.S. citizens and are registered under the U.S. flag.
notation: 16171214
valid from: 2014-08-08
valid till: 2020-10-03

Oil Services Ships
type: BicsLevel4SubIndustry
type: Classifier
type: Discontinued
type: NamedIndividual
is sub industry of: Marine Shipping
is contemporary version of: http://data.ga-group.nl/ics/bics/16171215
is version of: http://data.ga-group.nl/ics/bics/16171215
imported on: 2026-06-08T13:03:47.798Z
last refreshed on: 2026-06-08T13:03:47.798Z
source accessed on: 2019-12-03T20:05:01Z
source last accessed on: 2019-12-03T20:05:01Z
label: Buques serv petrol @es
label: Navi serv petrolio @it
label: Navire srv pétrolier @fr
label: Serviços de embarque de petróleo @pt
label: Ölserviceschiffe @de
label: Всп��могат. нефтяные судна @ru
label: 原油服务航运业 @zh
label: 原油服務航運業 @zh-hant
label: 石油ｻｰﾋﾞｽ船 @ja
label: 원유 서비스 선박 @ko
definition: This industry subgroup includes companies that provide marine transportation of equipment and supplies to oil platforms. Oil services ships include floating production storage and offloading (FPSO) vessels, platform supply vessels (PSVs), construction subsea vessels (CSVs), offshore supply vessels (OSVs), and anchor handling tug supply (AHTS) vessels.
notation: 16171215
valid from: 2014-08-08
valid till: 2020-10-03

Roll-On Roll-Off Shipping
type: BicsLevel4SubIndustry
type: Classifier
type: NamedIndividual
is sub industry of: Marine Shipping
is anachronous version of: http://data.ga-group.nl/ics/bics/1711121314
is contemporary version of: http://data.ga-group.nl/ics/bics/16171216
is replaced by: http://data.ga-group.nl/ics/bics/2020/1711121314
is version of: http://data.ga-group.nl/ics/bics/16171216
is version of: http://data.ga-group.nl/ics/bics/1711121314
imported on: 2026-06-08T13:03:47.798Z
last refreshed on: 2026-06-08T13:03:47.798Z
source accessed on: 2019-12-03T20:05:01Z
source last accessed on: 2019-12-03T20:05:01Z
label: Envío RO-RO @es
label: RO-RO Envio @pt
label: RO-RO貨運 @zh-hant
label: RO-RO선 수송 @ko
label: RoRo-Transport @de
label: Transport RO-RO @fr
label: Trasp mar RO-RO @it
label: Накатная транспортировка @ru
label: 滚装运输 @zh
label: 車両海上輸送 @ja
definition: This industry subgroup includes companies that provide marine transportation of automobiles and other vehicles. Ships are referred to as RO-ROs (roll-on/roll-off).
notation: 16171216
valid from: 2014-08-08
valid till: 2020-10-03

Chemical Tankers
type: BicsLevel5Segment
type: Classifier
type: NamedIndividual
is level5 segment of: Tankers
is anachronous version of: http://data.ga-group.nl/ics/bics/171112131510
is contemporary version of: http://data.ga-group.nl/ics/bics/1617121710
is replaced by: http://data.ga-group.nl/ics/bics/2020/171112131510
is version of: http://data.ga-group.nl/ics/bics/1617121710
is version of: http://data.ga-group.nl/ics/bics/171112131510
imported on: 2026-06-08T13:03:47.798Z
last refreshed on: 2026-06-08T13:03:47.798Z
source accessed on: 2019-12-03T20:05:01Z
source last accessed on: 2019-12-03T20:05:01Z
label: Buques químicos @es
label: Chemische Tanker @de
label: Navi carico-Chimici @it
label: Navio-tanque de produtos químicos @pt
label: Tankers prod chim @fr
label: Танкер с химпродуктами @ru
label: 化学品货轮 @zh
label: 液體化學貨船 @zh-hant
label: 케미컬탱커 @ko
label: ｹﾐｶﾙﾀﾝｶｰ/ﾊﾟｰｾﾙﾀﾝｶｰ @ja
definition: This segment includes companies that provide marine transportation of chemicals using chemical tanker carriers.
notation: 1617121710
valid from: 2014-08-08
valid till: 2020-10-03

LPG & LNG Tankers
type: BicsLevel5Segment
type: Classifier
type: NamedIndividual
is level5 segment of: Tankers
is anachronous version of: http://data.ga-group.nl/ics/bics/171112131511
is contemporary version of: http://data.ga-group.nl/ics/bics/1617121711
is replaced by: http://data.ga-group.nl/ics/bics/2020/171112131511
is version of: http://data.ga-group.nl/ics/bics/1617121711
is version of: http://data.ga-group.nl/ics/bics/171112131511
imported on: 2026-06-08T13:03:47.798Z
last refreshed on: 2026-06-08T13:03:47.798Z
source accessed on: 2019-12-03T20:05:01Z
source last accessed on: 2019-12-03T20:05:01Z
label: Buques de LPG y LNG @es
label: Cargueiros LPG e GNL @pt
label: LPG & LNG 탱커 @ko
label: LPG与LNG货轮 @zh
label: LPG･LNGﾀﾝｶｰ @ja
label: Navi cisterna GNL e GPL @it
label: Tankers de GPL et GNL @fr
label: Verschiffer: Flüssig- & Erdgas @de
label: Перевозчики сжиж. нефти и прир. газа @ru
label: 液化石油氣/天然氣油輪 @zh-hant
definition: This segment includes companies that provide marine transportation of liquefied petroleum gas (LPG) and liquefied natural gas (LNG) via LPG/LNG carriers.
notation: 1617121711
valid from: 2014-08-08
valid till: 2020-10-03

Oil Tankers
type: BicsLevel5Segment
type: Classifier
type: NamedIndividual
is level5 segment of: Tankers
is anachronous version of: http://data.ga-group.nl/ics/bics/171112131512
is contemporary version of: http://data.ga-group.nl/ics/bics/1617121712
is replaced by: http://data.ga-group.nl/ics/bics/2020/171112131512
is version of: http://data.ga-group.nl/ics/bics/1617121712
is version of: http://data.ga-group.nl/ics/bics/171112131512
imported on: 2026-06-08T13:03:47.798Z
last refreshed on: 2026-06-08T13:03:47.798Z
source accessed on: 2019-12-03T20:05:01Z
source last accessed on: 2019-12-03T20:05:01Z
label: Cisternas petroleras @es
label: Pétroliers @fr
label: Petroleiros @pt
label: Petroliere @it
label: Öltanker @de
label: Нефтяные танкеры @ru
label: 原油与炼油制品油轮 @zh
label: 原油及煉油製品油輪 @zh-hant
label: 石油･石油製品ﾀﾝｶｰ @ja
label: 유조선 @ko
definition: This segment includes companies that provide marine transportation of oil and refined petroleum products via oil and product tankers. Oil tankers consist of Panamax, Aframax, Suezmax, VLCC (very large crude carrier), and ULCC (ultra large crude carrier) type carriers. Product ships are usually smaller and carry refined petroleum products.
notation: 1617121712
valid from: 2014-08-08
valid till: 2020-10-03

Tankers
type: BicsLevel4SubIndustry
type: Classifier
type: NamedIndividual
is sub industry of: Marine Shipping
is anachronous version of: http://data.ga-group.nl/ics/bics/1711121315
is contemporary version of: http://data.ga-group.nl/ics/bics/16171217
is replaced by: http://data.ga-group.nl/ics/bics/2020/1711121315
is version of: http://data.ga-group.nl/ics/bics/16171217
is version of: http://data.ga-group.nl/ics/bics/1711121315
imported on: 2026-06-08T13:03:47.798Z
last refreshed on: 2026-06-08T13:03:47.798Z
source accessed on: 2019-12-03T20:05:01Z
source last accessed on: 2019-12-03T20:05:01Z
label: Cisternas @es
label: Navi carico @it
label: Tanker @de
label: Tanques @pt
label: Танкеры @ru
label: 油船 @zh
label: 油輪 @zh-hant
label: 탱커선 @ko
label: ﾀﾝｶｰ @ja
definition: This industry subgroup includes companies that provide marine transportation of chemicals via chemical tankers, oil and refined petroleum products via oil and product tankers, and liquefied petroleum gas (LPG) and liquefied natural gas (LNG) via LPG/LNG carriers.
notation: 16171217
valid from: 2014-08-08
valid till: 2020-10-03

Marine Shipping
type: BicsLevel3Industry
type: Classifier
type: NamedIndividual
is industry of: Transportation & Logistics
is anachronous version of: http://data.ga-group.nl/ics/bics/17111213
is contemporary version of: http://data.ga-group.nl/ics/bics/161712
is replaced by: http://data.ga-group.nl/ics/bics/2020/17111213
is version of: http://data.ga-group.nl/ics/bics/161712
is version of: http://data.ga-group.nl/ics/bics/17111213
imported on: 2026-06-08T13:03:47.798Z
last refreshed on: 2026-06-08T13:03:47.798Z
source accessed on: 2019-12-03T20:05:01Z
source last accessed on: 2019-12-03T20:05:01Z
label: Embarque marítimo @pt
label: Envío marítimo @es
label: Marinetransport @de
label: Transport maritime @fr
label: Trasporto marittimo @it
label: Морские грузоперевозки @ru
label: 海运 @zh
label: 海運服務 @zh-hant
label: 海運ｻｰﾋﾞｽ @ja
label: 해운운송 @ko
definition: This industry includes companies that provide marine transportation services, including freight transportation and oil tankers.
notation: 161712
valid from: 2014-08-08
valid till: 2020-10-03

Intermodal Freight - Rail
type: BicsLevel4SubIndustry
type: Classifier
type: NamedIndividual
is sub industry of: Rail Freight
is anachronous version of: http://data.ga-group.nl/ics/bics/1711121410
is contemporary version of: http://data.ga-group.nl/ics/bics/16171310
is replaced by: http://data.ga-group.nl/ics/bics/2020/1711121410
is version of: http://data.ga-group.nl/ics/bics/16171310
is version of: http://data.ga-group.nl/ics/bics/1711121410
imported on: 2026-06-08T13:03:47.798Z
last refreshed on: 2026-06-08T13:03:47.798Z
source accessed on: 2019-12-03T20:05:01Z
source last accessed on: 2019-12-03T20:05:01Z
label: Carga intermodal - Ferroviário @pt
label: Flete intermodal - ferroviario @es
label: Frachterlös komb. @de
label: Fret intermodal - Rail @fr
label: Trasporto intermodale - Ferrovie @it
label: Интермодальные перевозки-жел. дорога @ru
label: 多式联运-铁路 @zh
label: 綜合貨運-鐵路 @zh-hant
label: 複合一貫輸送-鉄道 @ja
label: 협동일관수송화물 - 철도 @ko
definition: This industry subgroup includes companies that transport products in intermodal containers and trailers by rail.
notation: 16171310
valid from: 2014-08-08
valid till: 2020-10-03

Agriculture Freight - Rail
type: BicsLevel5Segment
type: Classifier
type: NamedIndividual
is level5 segment of: Total Commodity - Rail
is anachronous version of: http://data.ga-group.nl/ics/bics/171112141110
is contemporary version of: http://data.ga-group.nl/ics/bics/1617131110
is replaced by: http://data.ga-group.nl/ics/bics/2020/171112141110
is version of: http://data.ga-group.nl/ics/bics/1617131110
is version of: http://data.ga-group.nl/ics/bics/171112141110
imported on: 2026-06-08T13:03:47.798Z
last refreshed on: 2026-06-08T13:03:47.798Z
source accessed on: 2019-12-03T20:05:01Z
source last accessed on: 2019-12-03T20:05:01Z
label: Carga prod agrícolas - Ferroviário @pt
label: Flete agrícola - ferroviaria @es
label: Frachterlös: LaWi - Bahn @de
label: Fret agricole - Rail @fr
label: Trasporto agricolo - Ferrovie @it
label: Перевозка сельскохоз. товаров-жел. дорога @ru
label: 农产品货运-铁路 @zh
label: 農業貨運-鐵路 @zh-hant
label: 農産物･肥料貨物輸送-鉄道 @ja
label: 농업 화물 -철도 @ko
definition: This segment includes companies that transport agricultural products by rail. Such products include whole grains, such as corn, wheat, soybeans, and food and beverage products.
notation: 1617131110
valid from: 2014-08-08
valid till: 2020-10-03

Auto Freight - Rail
type: BicsLevel5Segment
type: Classifier
type: NamedIndividual
is level5 segment of: Total Commodity - Rail
is anachronous version of: http://data.ga-group.nl/ics/bics/171112141111
is contemporary version of: http://data.ga-group.nl/ics/bics/1617131111
is replaced by: http://data.ga-group.nl/ics/bics/2020/171112141111
is version of: http://data.ga-group.nl/ics/bics/1617131111
is version of: http://data.ga-group.nl/ics/bics/171112141111
imported on: 2026-06-08T13:03:47.798Z
last refreshed on: 2026-06-08T13:03:47.798Z
source accessed on: 2019-12-03T20:05:01Z
source last accessed on: 2019-12-03T20:05:01Z
label: Carga de auto - Ferroviário @pt
label: Flete de auto - ferrocarril @es
label: Frachterlös Autos @de
label: Fret automobile - Rail @fr
label: Trasporto automobili - Ferrovie @it
label: Перевозка автомобилей-жел. дорога @ru
label: 汽車貨運-鐵路 @zh-hant
label: 汽车货运-铁路 @zh
label: 自動車輸送-鉄道 @ja
label: 자동차 화물 - 철도 @ko
definition: This segment includes companies that transport automotive products by rail. Such products include finished vehicles and automotive parts.
notation: 1617131111
valid from: 2014-08-08
valid till: 2020-10-03

Chemical Freight - Rail
type: BicsLevel5Segment
type: Classifier
type: NamedIndividual
is level5 segment of: Total Commodity - Rail
is anachronous version of: http://data.ga-group.nl/ics/bics/171112141112
is contemporary version of: http://data.ga-group.nl/ics/bics/1617131112
is replaced by: http://data.ga-group.nl/ics/bics/2020/171112141112
is version of: http://data.ga-group.nl/ics/bics/1617131112
is version of: http://data.ga-group.nl/ics/bics/171112141112
imported on: 2026-06-08T13:03:47.798Z
last refreshed on: 2026-06-08T13:03:47.798Z
source accessed on: 2019-12-03T20:05:01Z
source last accessed on: 2019-12-03T20:05:01Z
label: Carga prod químicos - Ferroviário @pt
label: Flete de sustancias químicas - ferrocarril @es
label: Frachterlös Chemie @de
label: Fret de produits chimiques - Rail @fr
label: Trasporto prod chimici - Ferrovie @it
label: Перевозка химикатов-жел. дорога @ru
label: 化学品货运-铁路 @zh
label: 化学品輸送-鉄道 @ja
label: 化學品貨運-鐵路 @zh-hant
label: 화학 화물 - 철도 @ko
definition: This segment includes companies that transport chemical products by rail. Such products include agricultural chemicals.
notation: 1617131112
valid from: 2014-08-08
valid till: 2020-10-03

Coal Freight - Rail
type: BicsLevel5Segment
type: Classifier
type: NamedIndividual
is level5 segment of: Total Commodity - Rail
is anachronous version of: http://data.ga-group.nl/ics/bics/171112141113
is contemporary version of: http://data.ga-group.nl/ics/bics/1617131113
is replaced by: http://data.ga-group.nl/ics/bics/2020/171112141113
is version of: http://data.ga-group.nl/ics/bics/1617131113
is version of: http://data.ga-group.nl/ics/bics/171112141113
imported on: 2026-06-08T13:03:47.798Z
last refreshed on: 2026-06-08T13:03:47.798Z
source accessed on: 2019-12-03T20:05:01Z
source last accessed on: 2019-12-03T20:05:01Z
label: Carga de carvão - Ferroviário @pt
label: Flete de carbón - ferrocarril @es
label: Frachterlös Kohle @de
label: Fret charbon - Rail @fr
label: Trasporto carbone - Ferrovie @it
label: Перевозка угля-жел. дорога @ru
label: 煤炭货运-铁路 @zh
label: 煤貨運-鐵路 @zh-hant
label: 石炭輸送-鉄道 @ja
label: 석탄 화물 - 철도 @ko
definition: This segment includes companies that transport coal and coke by rail.
notation: 1617131113
valid from: 2014-08-08
valid till: 2020-10-03

Consumer Prods Freight - Rail
type: BicsLevel5Segment
type: Classifier
type: NamedIndividual
is level5 segment of: Total Commodity - Rail
is anachronous version of: http://data.ga-group.nl/ics/bics/171112141114
is contemporary version of: http://data.ga-group.nl/ics/bics/1617131114
is replaced by: http://data.ga-group.nl/ics/bics/2020/171112141114
is version of: http://data.ga-group.nl/ics/bics/1617131114
is version of: http://data.ga-group.nl/ics/bics/171112141114
imported on: 2026-06-08T13:03:47.798Z
last refreshed on: 2026-06-08T13:03:47.798Z
source accessed on: 2019-12-03T20:05:01Z
source last accessed on: 2019-12-03T20:05:01Z
label: Carga prod consumo - Ferroviário @pt
label: Flete productos de consumidor - ferroviaria @es
label: Frachterlös: Verbr.prod.- Bahn @de
label: Fred prod conso - Rail @fr
label: Trasporto prod consumo - Ferrovie @it
label: Перевозка потребит. товаров-жел. дорога @ru
label: 消費者產品貨運-鐵路 @zh-hant
label: 消費者製品貨物輸送-鉄道 @ja
label: 消费品货运-铁路 @zh
label: 소비자제품 화물-철도 @ko
definition: This segment includes companies that transport consumer products by rail.
notation: 1617131114
valid from: 2014-08-08
valid till: 2020-10-03

Forest Products Freight - Rail
type: BicsLevel5Segment
type: Classifier
type: NamedIndividual
is level5 segment of: Total Commodity - Rail
is anachronous version of: http://data.ga-group.nl/ics/bics/171112141115
is contemporary version of: http://data.ga-group.nl/ics/bics/1617131115
is replaced by: http://data.ga-group.nl/ics/bics/2020/171112141115
is version of: http://data.ga-group.nl/ics/bics/1617131115
is version of: http://data.ga-group.nl/ics/bics/171112141115
imported on: 2026-06-08T13:03:47.798Z
last refreshed on: 2026-06-08T13:03:47.798Z
source accessed on: 2019-12-03T20:05:01Z
source last accessed on: 2019-12-03T20:05:01Z
label: Carga prod florestais - Ferroviário @pt
label: Flete de productos forestales - ferroviaria @es
label: Frachterlös: Waldprod. - Bahn @de
label: Fret produits forestiers - Rail @fr
label: Trasporto prod selvicoltura - Ferrovie @it
label: Перевозка лесопр.-жел. дорога @ru
label: 林业产品货运-铁路 @zh
label: 林木產品貨運-鐵路 @zh-hant
label: 林産物貨物輸送-鉄道 @ja
label: 임산물 화물-철도 @ko
definition: This segment includes companies that transport forest and paper products by rail.
notation: 1617131115
valid from: 2014-08-08
valid till: 2020-10-03

Industrial Prods Freight - Rail
type: BicsLevel5Segment
type: Classifier
type: NamedIndividual
is level5 segment of: Total Commodity - Rail
is anachronous version of: http://data.ga-group.nl/ics/bics/171112141116
is contemporary version of: http://data.ga-group.nl/ics/bics/1617131116
is replaced by: http://data.ga-group.nl/ics/bics/2020/171112141116
is version of: http://data.ga-group.nl/ics/bics/1617131116
is version of: http://data.ga-group.nl/ics/bics/171112141116
imported on: 2026-06-08T13:03:47.798Z
last refreshed on: 2026-06-08T13:03:47.798Z
source accessed on: 2019-12-03T20:05:01Z
source last accessed on: 2019-12-03T20:05:01Z
label: Carga prod industriais - Ferroviário @pt
label: Flete de productos industriales - ferroviaria @es
label: Frachterlös: Ind.prod. - Bahn @de
label: Fret produits industriels - Rail @fr
label: Trasporto prod industriali - Ferrovie @it
label: Перевозка промышл. товаров-жел. дорога @ru
label: 工业产品货运-铁路 @zh
label: 工業產品貨運-鐵路 @zh-hant
label: 工業製品貨物輸送-鉄道 @ja
label: 산업제품 화물-철도 @ko
definition: This segment includes companies that transport industrial products by rail.
notation: 1617131116
valid from: 2014-08-08
valid till: 2020-10-03

Metallic Ores & Metals - Rail
type: BicsLevel5Segment
type: Classifier
type: NamedIndividual
is level5 segment of: Total Commodity - Rail
is anachronous version of: http://data.ga-group.nl/ics/bics/171112141117
is contemporary version of: http://data.ga-group.nl/ics/bics/1617131117
is replaced by: http://data.ga-group.nl/ics/bics/2020/171112141117
is version of: http://data.ga-group.nl/ics/bics/1617131117
is version of: http://data.ga-group.nl/ics/bics/171112141117
imported on: 2026-06-08T13:03:47.798Z
last refreshed on: 2026-06-08T13:03:47.798Z
source accessed on: 2019-12-03T20:05:01Z
source last accessed on: 2019-12-03T20:05:01Z
label: Metallerze und Metalle @de
label: Minérios metálicos e metais - Ferroviário @pt
label: Minerais métalliques et métaux - Rail @fr
label: Minerales y metales-ferrov @es
label: Minerali di ferro e metalli - Ferrovie @it
label: Метал. руды и металлы-жел. дорога @ru
label: 金属矿石与金属-铁路 @zh
label: 金属鉱石･金属輸送-鉄道 @ja
label: 金屬礦及金屬-鐵路 @zh-hant
label: 금속원광 & 금속-철도 @ko
definition: This segment includes companies that transport metal products by rail. Such products include steel, copper, minerals and other metal products.
notation: 1617131117
valid from: 2014-08-08
valid till: 2020-10-03

Non-Metal Minerals - Rail
type: BicsLevel5Segment
type: Classifier
type: NamedIndividual
is level5 segment of: Total Commodity - Rail
is anachronous version of: http://data.ga-group.nl/ics/bics/171112141118
is contemporary version of: http://data.ga-group.nl/ics/bics/1617131118
is replaced by: http://data.ga-group.nl/ics/bics/2020/171112141118
is version of: http://data.ga-group.nl/ics/bics/1617131118
is version of: http://data.ga-group.nl/ics/bics/171112141118
imported on: 2026-06-08T13:03:47.798Z
last refreshed on: 2026-06-08T13:03:47.798Z
source accessed on: 2019-12-03T20:05:01Z
source last accessed on: 2019-12-03T20:05:01Z
label: Minéraux non métalliques - Rail @fr
label: Minerais não metálicos - Ferroviário @pt
label: Minerales no metálicos-ferrocarril @es
label: Minerali non di ferro - Ferrovie @it
label: Nichtmetallische Mineralien & Produkte @de
label: Неметал. минералы и продукция-жел. дорога @ru
label: 非金属矿物-铁路 @zh
label: 非金屬礦物-鐵路 @zh-hant
label: 非鉄鉱物･製品輸送-鉄道 @ja
label: 비금속 광물-철도 @ko
definition: This segment includes companies that transport non-metallic minerals and products by rail. Such products include crushed stone, sand, gravel, clay, glass, cement and limestone.
notation: 1617131118
valid from: 2014-08-08
valid till: 2020-10-03

Other Freight - Rail
type: BicsLevel5Segment
type: Classifier
type: Discontinued
type: NamedIndividual
is level5 segment of: Total Commodity - Rail
is contemporary version of: http://data.ga-group.nl/ics/bics/1617131119
is version of: http://data.ga-group.nl/ics/bics/1617131119
imported on: 2026-06-08T13:03:47.798Z
last refreshed on: 2026-06-08T13:03:47.798Z
source accessed on: 2019-12-03T20:05:01Z
source last accessed on: 2019-12-03T20:05:01Z
label: Altro trasporto - Ferrovie @it
label: Autre fret - Rail @fr
label: Otros fletes - ferroviario @es
label: Outras cargas - Ferroviário @pt
label: Sonstiger Frachterlös @de
label: Прочая фрахтовая выручка-жел. дорога @ru
label: その他輸送-鉄道 @ja
label: 其他貨運-鐵路 @zh-hant
label: 其他货运-铁路 @zh
label: 기타 화물-철도 @ko
definition: This segment includes companies that transport commodities by rail that are not elsewhere classified.
notation: 1617131119
valid from: 2014-08-08
valid till: 2020-10-03

Total Commodity - Rail
type: BicsLevel4SubIndustry
type: Classifier
type: NamedIndividual
is sub industry of: Rail Freight
is anachronous version of: http://data.ga-group.nl/ics/bics/1711121411
is contemporary version of: http://data.ga-group.nl/ics/bics/16171311
is replaced by: http://data.ga-group.nl/ics/bics/2020/1711121411
is version of: http://data.ga-group.nl/ics/bics/16171311
is version of: http://data.ga-group.nl/ics/bics/1711121411
imported on: 2026-06-08T13:03:47.798Z
last refreshed on: 2026-06-08T13:03:47.798Z
source accessed on: 2019-12-03T20:05:01Z
source last accessed on: 2019-12-03T20:05:01Z
label: Commodity totali - Ferrovie @it
label: Ges. Rohstofflinien @de
label: Total de commodities - Ferroviário @pt
label: Total de materias primas - ferrocarril @es
label: Toutes les matières premières - Voies ferrées @fr
label: Всего сырьевые товары-жел. дорога @ru
label: 商品总计-铁路 @zh
label: 商品輸送合計-鉄道 @ja
label: 總商品-鐵路 @zh-hant
label: 총 상품 - 철도 @ko
definition: This industry subgroup includes companies that transport commodities by rail. Such commodities include agricultural and fertilizer products, automotive products, chemical products, coal and coke, consumer products, forest products, industrial products, metallic ores and metal products, and non-metallic minerals.
notation: 16171311
valid from: 2014-08-08
valid till: 2020-10-03

Rail Freight
type: BicsLevel3Industry
type: Classifier
type: NamedIndividual
is industry of: Transportation & Logistics
is anachronous version of: http://data.ga-group.nl/ics/bics/17111214
is contemporary version of: http://data.ga-group.nl/ics/bics/161713
is replaced by: http://data.ga-group.nl/ics/bics/2020/17111214
is version of: http://data.ga-group.nl/ics/bics/161713
is version of: http://data.ga-group.nl/ics/bics/17111214
imported on: 2026-06-08T13:03:47.798Z
last refreshed on: 2026-06-08T13:03:47.798Z
source accessed on: 2019-12-03T20:05:01Z
source last accessed on: 2019-12-03T20:05:01Z
label: Bahnfrachttransport @de
label: Flete ferroviario @es
label: Fret ferroviaire @fr
label: Transp frete férrea @pt
label: Trasporto ferroviario @it
label: Железнодорожные перевозки @ru
label: 鉄道貨物輸送 @ja
label: 鐵路貨運 @zh-hant
label: 铁路货运 @zh
label: 철도 화물운송 @ko
definition: This industry includes companies that provide railroad freight transportation services. Such services are provided over a long distance within a rail network. This does not include rail passenger transportation (see Passenger Transportation).
notation: 161713
valid from: 2014-08-08
valid till: 2020-10-03

Less Than Truckload Freight
type: BicsLevel5Segment
type: Classifier
type: NamedIndividual
is level5 segment of: Asset-Based LTL
is anachronous version of: http://data.ga-group.nl/ics/bics/171112151010
is contemporary version of: http://data.ga-group.nl/ics/bics/1617141010
is replaced by: http://data.ga-group.nl/ics/bics/2020/171112151010
is version of: http://data.ga-group.nl/ics/bics/1617141010
is version of: http://data.ga-group.nl/ics/bics/171112151010
imported on: 2026-06-08T13:03:47.798Z
last refreshed on: 2026-06-08T13:03:47.798Z
source accessed on: 2019-12-03T20:05:01Z
source last accessed on: 2019-12-03T20:05:01Z
label: Autotrasporto carico non pieno @it
label: Carga LTL @pt
label: Fletamiento menor que el de camión @es
label: Fracht - Geringer als Lkw-Ladung @de
label: Fret chargement partiel @fr
label: Малотоннажные грузоперевозки @ru
label: 零担货运 @zh
label: 零擔貨運運輸 @zh-hant
label: 차급미만 화물 @ko
label: ﾄﾗｯｸ輸送(混載) @ja
definition: This segment includes companies that generate freight revenue from less-than-truckload trucking services.
notation: 1617141010
valid from: 2014-08-08
valid till: 2020-10-03

LTL Fuel Surcharge
type: BicsLevel5Segment
type: Classifier
type: NamedIndividual
is level5 segment of: Asset-Based LTL
is anachronous version of: http://data.ga-group.nl/ics/bics/171112151011
is contemporary version of: http://data.ga-group.nl/ics/bics/1617141011
is replaced by: http://data.ga-group.nl/ics/bics/2020/171112151011
is version of: http://data.ga-group.nl/ics/bics/1617141011
is version of: http://data.ga-group.nl/ics/bics/171112151011
imported on: 2026-06-08T13:03:47.798Z
last refreshed on: 2026-06-08T13:03:47.798Z
source accessed on: 2019-12-03T20:05:01Z
source last accessed on: 2019-12-03T20:05:01Z
label: LTL 연료과잉 @ko
label: LTL-Benzinaufpreis @de
label: LTL燃料附加費 @zh-hant
label: LTL燃料附加费 @zh
label: Sobretaxa de combustível LTL @pt
label: Sovraccarico carb carico non pieno @it
label: Subtarifa de carburante LTL @es
label: Surcharge de carbur chargt partiel @fr
label: Топливная надбавка (LTL) @ru
label: 小口ﾄﾗｯｸ輸送燃料ｻｰﾁｬｰｼﾞ @ja
definition: This segment includes companies that generate fuel surcharge revenue from less-than-truckload (LTL) trucking services.
notation: 1617141011
valid from: 2014-08-08
valid till: 2020-10-03

Asset-Based LTL
type: BicsLevel4SubIndustry
type: Classifier
type: NamedIndividual
is sub industry of: Trucking
is anachronous version of: http://data.ga-group.nl/ics/bics/1711121510
is contemporary version of: http://data.ga-group.nl/ics/bics/16171410
is replaced by: http://data.ga-group.nl/ics/bics/2020/1711121510
is version of: http://data.ga-group.nl/ics/bics/16171410
is version of: http://data.ga-group.nl/ics/bics/1711121510
imported on: 2026-06-08T13:03:47.798Z
last refreshed on: 2026-06-08T13:03:47.798Z
source accessed on: 2019-12-03T20:05:01Z
source last accessed on: 2019-12-03T20:05:01Z
label: Asset-basiert kleiner als Lkw-Ladung @de
label: LTL com base em ativo @pt
label: LTL por activo @es
label: LTL su base attivi @it
label: Moins que charg compl, sur actif @fr
label: Малотон. грузопер. СМБ @ru
label: 資產基礎-零擔貨運 @zh-hant
label: 资产基础零担货运 @zh
label: 자산형 LTL @ko
label: ｱｾｯﾄﾍﾞｰｽ型ﾄﾗｯｸ輸送(混載) @ja
definition: This industry subgroup includes companies that provide less-than-truckload (LTL) trucking services. LTL carriers typically pick up multiple shipments from multiple customers on a single truck and then route that freight for delivery through service centers where the freight may be transferred to other trucks with similar destinations.
notation: 16171410
valid from: 2014-08-08
valid till: 2020-10-03

Truckload Freight
type: BicsLevel5Segment
type: Classifier
type: NamedIndividual
is level5 segment of: Asset-Based Truckload
is anachronous version of: http://data.ga-group.nl/ics/bics/171112151110
is contemporary version of: http://data.ga-group.nl/ics/bics/1617141110
is replaced by: http://data.ga-group.nl/ics/bics/2020/171112151110
is version of: http://data.ga-group.nl/ics/bics/1617141110
is version of: http://data.ga-group.nl/ics/bics/171112151110
imported on: 2026-06-08T13:03:47.798Z
last refreshed on: 2026-06-08T13:03:47.798Z
source accessed on: 2019-12-03T20:05:01Z
source last accessed on: 2019-12-03T20:05:01Z
label: Autotrasporto carico pieno @it
label: Carga de caminhão @pt
label: Flete de carga de un camión @es
label: Fracht - Lkw-Ladung @de
label: Fret chargement complet @fr
label: Транзитная норма - груз @ru
label: 整車貨運運輸 @zh-hant
label: 整车货运 @zh
label: 트럭적재 화물 @ko
label: ﾄﾗｯｸ輸送 @ja
definition: This segment includes companies that generate revenue from truckload trucking services.
notation: 1617141110
valid from: 2014-08-08
valid till: 2020-10-03

Truckload Fuel
type: BicsLevel5Segment
type: Classifier
type: NamedIndividual
is level5 segment of: Asset-Based Truckload
is anachronous version of: http://data.ga-group.nl/ics/bics/171112151111
is contemporary version of: http://data.ga-group.nl/ics/bics/1617141111
is replaced by: http://data.ga-group.nl/ics/bics/2020/171112151111
is version of: http://data.ga-group.nl/ics/bics/1617141111
is version of: http://data.ga-group.nl/ics/bics/171112151111
imported on: 2026-06-08T13:03:47.798Z
last refreshed on: 2026-06-08T13:03:47.798Z
source accessed on: 2019-12-03T20:05:01Z
source last accessed on: 2019-12-03T20:05:01Z
label: Benzin - Lkw-Ladung @de
label: Carburant chargement complet @fr
label: Carburante carico pieno @it
label: Carburante de carga de un camión @es
label: Combustível da carga de caminhão @pt
label: Транзитная норма - топливо @ru
label: 整車貨運燃料 @zh-hant
label: 整车燃料 @zh
label: 트럭적재 연료 @ko
label: ﾄﾗｯｸ輸送燃料 @ja
definition: This segment includes companies that generate fuel surcharge revenue from truckload trucking services.
notation: 1617141111
valid from: 2014-08-08
valid till: 2020-10-03

Asset-Based Truckload
type: BicsLevel4SubIndustry
type: Classifier
type: NamedIndividual
is sub industry of: Trucking
is anachronous version of: http://data.ga-group.nl/ics/bics/1711121511
is contemporary version of: http://data.ga-group.nl/ics/bics/16171411
is replaced by: http://data.ga-group.nl/ics/bics/2020/1711121511
is version of: http://data.ga-group.nl/ics/bics/16171411
is version of: http://data.ga-group.nl/ics/bics/1711121511
imported on: 2026-06-08T13:03:47.798Z
last refreshed on: 2026-06-08T13:03:47.798Z
source accessed on: 2019-12-03T20:05:01Z
source last accessed on: 2019-12-03T20:05:01Z
label: Anlagengestützte Lkw-Ladung @de
label: Attivi-Autotrasporto @it
label: Caminhões com base no ativo @pt
label: Carga de camión por activo @es
label: Chargement complet basé sur actif @fr
label: Перевозки 'Asset-Based' @ru
label: 資產基礎-整車貨運 @zh-hant
label: 资产基础整车货运 @zh
label: 자산형 트럭적재 @ko
label: ｱｾｯﾄﾍﾞｰｽ型ﾄﾗｯｸ貨物輸送 @ja
definition: This industry subgroup includes companies that provide truckload trucking services. Such services include delivery of products from only one shipper to the consignee.
notation: 16171411
valid from: 2014-08-08
valid till: 2020-10-03

Moving Services
type: BicsLevel4SubIndustry
type: Classifier
type: NamedIndividual
is sub industry of: Trucking
is anachronous version of: http://data.ga-group.nl/ics/bics/1711121512
is contemporary version of: http://data.ga-group.nl/ics/bics/16171412
is replaced by: http://data.ga-group.nl/ics/bics/2020/1711121512
is version of: http://data.ga-group.nl/ics/bics/16171412
is version of: http://data.ga-group.nl/ics/bics/1711121512
imported on: 2026-06-08T13:03:47.798Z
last refreshed on: 2026-06-08T13:03:47.798Z
source accessed on: 2019-12-03T20:05:01Z
source last accessed on: 2019-12-03T20:05:01Z
label: Mudanzas @es
label: Serv de mudança @pt
label: Service déménagement @fr
label: Servizi di trasloco @it
label: Umzugsdienste @de
label: Услуги по переезду @ru
label: 引越ｻｰﾋﾞｽ @ja
label: 搬家服务 @zh
label: 運輸服務 @zh-hant
label: 이사업 서비스 @ko
definition: This industry subgroup includes companies that provide moving services. Such services include moving household and office furniture and equipment and are provided by trucks and van lines.
notation: 16171412
valid from: 2014-08-08
valid till: 2020-10-03

Specialized Freight Trucking Svcs
type: BicsLevel4SubIndustry
type: Classifier
type: NamedIndividual
is sub industry of: Trucking
is anachronous version of: http://data.ga-group.nl/ics/bics/1711121513
is contemporary version of: http://data.ga-group.nl/ics/bics/16171413
is replaced by: http://data.ga-group.nl/ics/bics/2020/1711121513
is version of: http://data.ga-group.nl/ics/bics/16171413
is version of: http://data.ga-group.nl/ics/bics/1711121513
imported on: 2026-06-08T13:03:47.798Z
last refreshed on: 2026-06-08T13:03:47.798Z
source accessed on: 2019-12-03T20:05:01Z
source last accessed on: 2019-12-03T20:05:01Z
label: LKW-Spezialfrachtdienste @de
label: Serv autotrasporto carico specializzato @it
label: Serv caminhão de carga especializada @pt
label: Serv transp spéc fret @fr
label: Servicio especializado de flete de camión @es
label: Специализированные автоперевозки @ru
label: 特殊貨物卡車服務 @zh-hant
label: 特殊貨物ﾄﾗｯｸ輸送ｻｰﾋﾞｽ @ja
label: 特殊货物卡车服务 @zh
label: 전문화물트럭운송업 @ko
definition: This industry subgroup includes companies that provide specialized freight trucking services, such as transporting bulk commodities and automobiles, as well as dedicated trucking services.
notation: 16171413
valid from: 2014-08-08
valid till: 2020-10-03

Trucking
type: BicsLevel3Industry
type: Classifier
type: NamedIndividual
is industry of: Transportation & Logistics
is anachronous version of: http://data.ga-group.nl/ics/bics/17111215
is contemporary version of: http://data.ga-group.nl/ics/bics/161714
is replaced by: http://data.ga-group.nl/ics/bics/2020/17111215
is version of: http://data.ga-group.nl/ics/bics/161714
is version of: http://data.ga-group.nl/ics/bics/17111215
imported on: 2026-06-08T13:03:47.798Z
last refreshed on: 2026-06-08T13:03:47.798Z
source accessed on: 2019-12-03T20:05:01Z
source last accessed on: 2019-12-03T20:05:01Z
label: Camiones @es
label: Transport routier @fr
label: Transportdienste @de
label: Transporte rodoviário @pt
label: Trasporto autocarri @it
label: Грузоперевозки @ru
label: 卡車運輸 @zh-hant
label: 卡车 @zh
label: 트럭운송 @ko
label: ﾄﾗｯｸ輸送 @ja
definition: This industry includes companies that provide trucking services. Services include truckload freight, less-than-truckload freight delivery services and specialized freight trucking services.
notation: 161714
valid from: 2014-08-08
valid till: 2020-10-03

Air Freight Brokerage
type: BicsLevel5Segment
type: Classifier
type: NamedIndividual
is level5 segment of: Brokerage
is anachronous version of: http://data.ga-group.nl/ics/bics/171112171010
is contemporary version of: http://data.ga-group.nl/ics/bics/1617151010
is replaced by: http://data.ga-group.nl/ics/bics/2020/171112171010
is version of: http://data.ga-group.nl/ics/bics/1617151010
is version of: http://data.ga-group.nl/ics/bics/171112171010
imported on: 2026-06-08T13:03:47.798Z
last refreshed on: 2026-06-08T13:03:47.798Z
source accessed on: 2019-12-03T20:05:01Z
source last accessed on: 2019-12-03T20:05:01Z
label: Brokeraggio trasporto aereo @it
label: Corretagem frete aéreo @pt
label: Corretaje de flete aéreo @es
label: Courtage fret aérien @fr
label: Luftfracht-Brokerage @de
label: Брокерские услуги воздушных перевозок @ru
label: 空运经纪 @zh
label: 空運經紀 @zh-hant
label: 航空貨物輸送仲介 @ja
label: 항공 화물 중개인 @ko
definition: This segment includes companies that provide air freight brokerage services.
notation: 1617151010
valid from: 2014-08-08
valid till: 2020-10-03

Intermodal Brokerage
type: BicsLevel5Segment
type: Classifier
type: NamedIndividual
is level5 segment of: Brokerage
is anachronous version of: http://data.ga-group.nl/ics/bics/171112171011
is contemporary version of: http://data.ga-group.nl/ics/bics/1617151011
is replaced by: http://data.ga-group.nl/ics/bics/2020/171112171011
is version of: http://data.ga-group.nl/ics/bics/1617151011
is version of: http://data.ga-group.nl/ics/bics/171112171011
imported on: 2026-06-08T13:03:47.798Z
last refreshed on: 2026-06-08T13:03:47.798Z
source accessed on: 2019-12-03T20:05:01Z
source last accessed on: 2019-12-03T20:05:01Z
label: Brokeraggio intermodale @it
label: Corretagem intemodal @pt
label: Corretaje intermodal @es
label: Courtage intermodal @fr
label: Kombinierte Brokerage @de
label: Брокерские услуги межтранспортных перевозок @ru
label: 多式联运经纪 @zh
label: 綜合貨運經紀 @zh-hant
label: 複合一貫輸送仲介 @ja
label: 복합운송 중개인 @ko
definition: This segment includes companies that provide intermodal brokerage services.
notation: 1617151011
valid from: 2014-08-08
valid till: 2020-10-03

Ocean Brokerage
type: BicsLevel5Segment
type: Classifier
type: NamedIndividual
is level5 segment of: Brokerage
is anachronous version of: http://data.ga-group.nl/ics/bics/171112171012
is contemporary version of: http://data.ga-group.nl/ics/bics/1617151012
is replaced by: http://data.ga-group.nl/ics/bics/2020/171112171012
is version of: http://data.ga-group.nl/ics/bics/1617151012
is version of: http://data.ga-group.nl/ics/bics/171112171012
imported on: 2026-06-08T13:03:47.798Z
last refreshed on: 2026-06-08T13:03:47.798Z
source accessed on: 2019-12-03T20:05:01Z
source last accessed on: 2019-12-03T20:05:01Z
label: Brokeraggio oceano @it
label: Corretagem oceano @pt
label: Corretaje de oceáno @es
label: Courtage océan @fr
label: See-Brokerage @de
label: Брокерские услуги океанских перевозок @ru
label: 海上輸送仲介 @ja
label: 海洋经纪 @zh
label: 海運經紀 @zh-hant
label: 해상 중개인 @ko
definition: This segment includes companies that provide ocean brokerage services.
notation: 1617151012
valid from: 2014-08-08
valid till: 2020-10-03

Truck Brokerage
type: BicsLevel5Segment
type: Classifier
type: NamedIndividual
is level5 segment of: Brokerage
is anachronous version of: http://data.ga-group.nl/ics/bics/171112171013
is contemporary version of: http://data.ga-group.nl/ics/bics/1617151013
is replaced by: http://data.ga-group.nl/ics/bics/2020/171112171013
is version of: http://data.ga-group.nl/ics/bics/1617151013
is version of: http://data.ga-group.nl/ics/bics/171112171013
imported on: 2026-06-08T13:03:47.798Z
last refreshed on: 2026-06-08T13:03:47.798Z
source accessed on: 2019-12-03T20:05:01Z
source last accessed on: 2019-12-03T20:05:01Z
label: Brokeraggio camion @it
label: Corretagem de caminhões @pt
label: Corretaje de camiones @es
label: Courtage en camionnage @fr
label: Makler für Fuhrunternehmen @de
label: Брокерские услуги грузовиков @ru
label: 卡車貨運經紀 @zh-hant
label: 卡车运输经纪 @zh
label: 트럭 중개인 @ko
label: ﾄﾗｯｸ仲介 @ja
definition: This segment includes companies that provide truckload and less-than-truckload brokerage services.
notation: 1617151013
valid from: 2014-08-08
valid till: 2020-10-03

Other Brokerage
type: BicsLevel5Segment
type: Classifier
type: Discontinued
type: NamedIndividual
is level5 segment of: Brokerage
is contemporary version of: http://data.ga-group.nl/ics/bics/1617151014
is version of: http://data.ga-group.nl/ics/bics/1617151014
imported on: 2026-06-08T13:03:47.798Z
last refreshed on: 2026-06-08T13:03:47.798Z
source accessed on: 2019-12-03T20:05:01Z
source last accessed on: 2019-12-03T20:05:01Z
label: Altro brokeraggio @it
label: Autre courtage @fr
label: Otro corretaje @es
label: Outras corretagens @pt
label: Sonstige Brokerage @de
label: Прочие брокерские услуги @ru
label: その他仲介 @ja
label: 其他經紀 @zh-hant
label: 其他经纪 @zh
label: 기타 중개인 @ko
definition: This segment includes companies that provide transportation brokerage services other than air freight, intermodal and ocean brokerage services.
notation: 1617151014
valid from: 2014-08-08
valid till: 2020-10-03

Brokerage
type: BicsLevel4SubIndustry
type: Classifier
type: NamedIndividual
is sub industry of: Logistics Services
is anachronous version of: http://data.ga-group.nl/ics/bics/1711121710
is contemporary version of: http://data.ga-group.nl/ics/bics/16171510
is replaced by: http://data.ga-group.nl/ics/bics/2020/1711121710
is version of: http://data.ga-group.nl/ics/bics/16171510
is version of: http://data.ga-group.nl/ics/bics/1711121710
imported on: 2026-06-08T13:03:47.798Z
last refreshed on: 2026-06-08T13:03:47.798Z
source accessed on: 2019-12-03T20:05:01Z
source last accessed on: 2019-12-03T20:05:01Z
label: Brokeraggio @it
label: Corretagem @pt
label: Corretaje @es
label: Courtage @fr
label: Брокерские услуги @ru
label: 仲介ｻｰﾋﾞｽ @ja
label: 經紀 @zh-hant
label: 经纪 @zh
label: 중개인 @ko
definition: This industry subgroup includes companies that provide transportation brokerage services, such as air freight, intermodal, ocean and other brokerage services.
notation: 16171510
valid from: 2014-08-08
valid till: 2020-10-03

Freight Forwarding Services
type: BicsLevel4SubIndustry
type: Classifier
type: NamedIndividual
is sub industry of: Logistics Services
is anachronous version of: http://data.ga-group.nl/ics/bics/1711121711
is contemporary version of: http://data.ga-group.nl/ics/bics/16171511
is replaced by: http://data.ga-group.nl/ics/bics/2020/1711121711
is version of: http://data.ga-group.nl/ics/bics/16171511
is version of: http://data.ga-group.nl/ics/bics/1711121711
imported on: 2026-06-08T13:03:47.798Z
last refreshed on: 2026-06-08T13:03:47.798Z
source accessed on: 2019-12-03T20:05:01Z
source last accessed on: 2019-12-03T20:05:01Z
label: Frachtspeditionsdienste @de
label: Services d'acheminement du fret @fr
label: Servicios de reenvío de flete @es
label: Servizi di trasporto @it
label: Seviços transitários @pt
label: Транспортно-экспедиторские услуги @ru
label: 貨物転送���ｰﾋﾞｽ @ja
label: 貨運轉運服務 @zh-hant
label: 货运代理服务 @zh
label: 수취인지불 운송 서비스 @ko
definition: This industry subgroup includes companies that provide freight forwarding services. These companies do not move the products themselves, but arrange the shipment by contracting with carriers.
notation: 16171511
valid from: 2014-08-08
valid till: 2020-10-03

Intermodal Services
type: BicsLevel4SubIndustry
type: Classifier
type: NamedIndividual
is sub industry of: Logistics Services
is anachronous version of: http://data.ga-group.nl/ics/bics/1711121712
is contemporary version of: http://data.ga-group.nl/ics/bics/16171512
is replaced by: http://data.ga-group.nl/ics/bics/2020/1711121712
is version of: http://data.ga-group.nl/ics/bics/16171512
is version of: http://data.ga-group.nl/ics/bics/1711121712
imported on: 2026-06-08T13:03:47.798Z
last refreshed on: 2026-06-08T13:03:47.798Z
source accessed on: 2019-12-03T20:05:01Z
source last accessed on: 2019-12-03T20:05:01Z
label: Kombinierte Dienste @de
label: Serviços intermodal @pt
label: Service intermodaux @fr
label: Servicios intermodales @es
label: Servizi intermodali @it
label: Межтранспортные услуги @ru
label: 綜合貨運服務 @zh-hant
label: 联运服务 @zh
label: 複合一貫ｻｰﾋﾞｽ @ja
label: 복합운송 서비스 @ko
definition: This industry subgroup includes companies that provide intermodal services. These services involve transporting freight through intermodal containers with the use of various forms of transportation. The company may transport the goods themselves or contract with carriers.
notation: 16171512
valid from: 2014-08-08
valid till: 2020-10-03

Storage & Warehousing Services
type: BicsLevel4SubIndustry
type: Classifier
type: NamedIndividual
is sub industry of: Logistics Services
is anachronous version of: http://data.ga-group.nl/ics/bics/1711121713
is contemporary version of: http://data.ga-group.nl/ics/bics/16171513
is replaced by: http://data.ga-group.nl/ics/bics/2020/1711121713
is version of: http://data.ga-group.nl/ics/bics/16171513
is version of: http://data.ga-group.nl/ics/bics/1711121713
imported on: 2026-06-08T13:03:47.798Z
last refreshed on: 2026-06-08T13:03:47.798Z
source accessed on: 2019-12-03T20:05:01Z
source last accessed on: 2019-12-03T20:05:01Z
label: Lagerungs- & Lagerhallendienste @de
label: Serviços de armazenagem e depósito @pt
label: Services d'entreposage et stockage @fr
label: Servicios de almacenamiento y bodega @es
label: Servizi scorte e immagazzinaggio @it
label: Услуги хранения и складирования @ru
label: 仓储服务 @zh
label: 倉儲服務 @zh-hant
label: 倉庫･保管ｻｰﾋﾞｽ @ja
label: 보관 및 창고업 @ko
definition: This industry subgroup includes companies that provide storage and warehousing services.
notation: 16171513
valid from: 2014-08-08
valid till: 2020-10-03

Other Logistic Services
type: BicsLevel4SubIndustry
type: Classifier
type: Discontinued
type: NamedIndividual
is sub industry of: Logistics Services
is contemporary version of: http://data.ga-group.nl/ics/bics/16171514
is version of: http://data.ga-group.nl/ics/bics/16171514
imported on: 2026-06-08T13:03:47.798Z
last refreshed on: 2026-06-08T13:03:47.798Z
source accessed on: 2019-12-03T20:05:01Z
source last accessed on: 2019-12-03T20:05:01Z
label: Altri servizi logistici @it
label: Autres services logistiques @fr
label: Otros servicios logísticos @es
label: Outros serviços de logísticas @pt
label: Sonstiger Transport/Logistik @de
label: Другие услуги логистики @ru
label: 其他物流服务 @zh
label: 其他物流服務 @zh-hant
label: 物流ｻｰﾋﾞｽ @ja
label: 기타 물류 서비스 @ko
definition: This industry subgroup includes companies that provide logistics services not elsewhere classified, such as pricing, contract management, transportation mode and carrier selection, freight tracking, and freight bill payment.
notation: 16171514
valid from: 2014-08-08
valid till: 2020-10-03

Logistics Services
type: BicsLevel3Industry
type: Classifier
type: NamedIndividual
is industry of: Transportation & Logistics
is anachronous version of: http://data.ga-group.nl/ics/bics/17111217
is contemporary version of: http://data.ga-group.nl/ics/bics/161715
is replaced by: http://data.ga-group.nl/ics/bics/2020/17111217
is version of: http://data.ga-group.nl/ics/bics/161715
is version of: http://data.ga-group.nl/ics/bics/17111217
imported on: 2026-06-08T13:03:47.798Z
last refreshed on: 2026-06-08T13:03:47.798Z
source accessed on: 2019-12-03T20:05:01Z
source last accessed on: 2019-12-03T20:05:01Z
label: Logistikdienstleistungen @de
label: Serviços de logística @pt
label: Services de logistique @fr
label: Servicios de logística @es
label: Servizi logistici @it
label: Логистика @ru
label: 物流服务 @zh
label: 物流服務 @zh-hant
label: 物流ｻｰﾋﾞｽ @ja
label: 물류 서비스 @ko
definition: This industry includes companies that provide asset light trucking services, brokerage services including air freight, ocean, intermodal, truck brokerage, freight forwarding services, intermodal services and logistic services.
notation: 161715
valid from: 2014-08-08
valid till: 2020-10-03

Support Services - Air Transp
type: BicsLevel5Segment
type: Classifier
type: Discontinued
type: NamedIndividual
is level5 segment of: Air Transp Support Services
is contemporary version of: http://data.ga-group.nl/ics/bics/1617161010
is version of: http://data.ga-group.nl/ics/bics/1617161010
imported on: 2026-06-08T13:03:47.798Z
last refreshed on: 2026-06-08T13:03:47.798Z
source accessed on: 2019-12-03T20:05:01Z
source last accessed on: 2019-12-03T20:05:01Z
label: Hilfsdienste - Lufttransport @de
label: Serv de asistencia - transporte aéreo @es
label: Serv soutien transp aérien @fr
label: Serviços de apoio - Transporte aéreo @pt
label: Servizi supporto - Trasp aereo @it
label: Воздушные перевозки - вспомогат. деятельность @ru
label: その他航空支援ｻｰﾋﾞｽ @ja
label: 支持服务-航空运输 @zh
label: 支援服務-空運 @zh-hant
label: 지원 서비스-항공운송 @ko
definition: This segment includes companies that provide other support activities for air transportation. Such activities include maintenance, inspection, fueling, and testing of aircraft.
notation: 1617161010
valid from: 2014-08-08
valid till: 2020-10-03

Other Airport Operations
type: BicsLevel5Segment
type: Classifier
type: NamedIndividual
is level5 segment of: Air Transp Support Services
is anachronous version of: http://data.ga-group.nl/ics/bics/171112181010
is contemporary version of: http://data.ga-group.nl/ics/bics/1617161011
is replaced by: http://data.ga-group.nl/ics/bics/2020/171112181010
is version of: http://data.ga-group.nl/ics/bics/1617161011
is version of: http://data.ga-group.nl/ics/bics/171112181010
imported on: 2026-06-08T13:03:47.798Z
last refreshed on: 2026-06-08T13:03:47.798Z
source accessed on: 2019-12-03T20:05:01Z
source last accessed on: 2019-12-03T20:05:01Z
label: Altre op aeroporto @it
label: Autre opér aéroport @fr
label: Otras oper aerop @es
label: Outras op de aeroporto @pt
label: Sonst. Flughafenakt. @de
label: Др. деятельность аэропорта @ru
label: その他空港運営業 @ja
label: 其他机场运营 @zh
label: 其他機場營運 @zh-hant
label: 기타 공항 운영업 @ko
definition: This segment includes companies that operate airports. Such activities include the maintenance of airport facilities and runways, baggage handling services, cargo handling and hangar rental.
notation: 1617161011
valid from: 2014-08-08
valid till: 2020-10-03

Air Transp Support Services
type: BicsLevel4SubIndustry
type: Classifier
type: NamedIndividual
is sub industry of: Transport Support Services
is anachronous version of: http://data.ga-group.nl/ics/bics/171112181110
is contemporary version of: http://data.ga-group.nl/ics/bics/16171610
is replaced by: http://data.ga-group.nl/ics/bics/2020/171112181110
is version of: http://data.ga-group.nl/ics/bics/16171610
is version of: http://data.ga-group.nl/ics/bics/171112181110
imported on: 2026-06-08T13:03:47.798Z
last refreshed on: 2026-06-08T13:03:47.798Z
source accessed on: 2019-12-03T20:05:01Z
source last accessed on: 2019-12-03T20:05:01Z
label: Apoyo transp aéreo @es
label: Appui trans aérien @fr
label: Lufttransportbetr. @de
label: Serv de apoio trans aéreo @pt
label: Servizi trasp aereo @it
label: Воздушный транспорт @ru
label: 空运支援服务 @zh
label: 空運支援服務 @zh-hant
label: 航空輸送支援ｻｰﾋﾞｽ @ja
label: 항공운송지원서비스 @ko
definition: This industry subgroup includes companies that provide air transportation support services. Such services include airport operations and aircraft maintenance and fueling.
notation: 16171610
valid from: 2014-08-08
valid till: 2020-10-03

Navigational Services
type: BicsLevel5Segment
type: Classifier
type: Discontinued
type: NamedIndividual
is level5 segment of: Marine Support Services
is contemporary version of: http://data.ga-group.nl/ics/bics/1617161110
is version of: http://data.ga-group.nl/ics/bics/1617161110
imported on: 2026-06-08T13:03:47.798Z
last refreshed on: 2026-06-08T13:03:47.798Z
source accessed on: 2019-12-03T20:05:01Z
source last accessed on: 2019-12-03T20:05:01Z
label: Navigationsdienste @de
label: Serv de navegação @pt
label: Serv navegación @es
label: Serv navigazione @it
label: Service navigation @fr
label: Навигационные услуги @ru
label: 港湾運送業 @ja
label: 航运导航服务 @zh
label: 航運導航服務 @zh-hant
label: 해양항해서비스 @ko
definition: This segment includes companies that provide navigational services, such as marine salvaging, tugboat services and ship piloting services.
notation: 1617161110
valid from: 2014-08-08
valid till: 2020-10-03

Port & Harbor Operations
type: BicsLevel5Segment
type: Classifier
type: NamedIndividual
is level5 segment of: Marine Support Services
is anachronous version of: http://data.ga-group.nl/ics/bics/171112181011
is contemporary version of: http://data.ga-group.nl/ics/bics/1617161111
is replaced by: http://data.ga-group.nl/ics/bics/2020/171112181011
is version of: http://data.ga-group.nl/ics/bics/1617161111
is version of: http://data.ga-group.nl/ics/bics/171112181011
imported on: 2026-06-08T13:03:47.798Z
last refreshed on: 2026-06-08T13:03:47.798Z
source accessed on: 2019-12-03T20:05:01Z
source last accessed on: 2019-12-03T20:05:01Z
label: Hafenaktivitäten @de
label: Op de porto e ancoradouro @pt
label: Opération portuaire @fr
label: Operazioni portuali @it
label: Puertos y melles @es
label: Портовые услуги @ru
label: 港口运营 @zh
label: 港埠營運 @zh-hant
label: 港湾業 @ja
label: 항만 운영업 @ko
definition: This segment includes companies that operate ports and harbors. Services include port facility operation, marine cargo handling, harbor and lighthouse operation, and canal operation.
notation: 1617161111
valid from: 2014-08-08
valid till: 2020-10-03

Waterways Concession
type: BicsLevel5Segment
type: Classifier
type: Discontinued
type: NamedIndividual
is level5 segment of: Marine Support Services
is contemporary version of: http://data.ga-group.nl/ics/bics/1617161112
is version of: http://data.ga-group.nl/ics/bics/1617161112
imported on: 2026-06-08T13:03:47.798Z
last refreshed on: 2026-06-08T13:03:47.798Z
source accessed on: 2019-12-03T20:05:01Z
source last accessed on: 2019-12-03T20:05:01Z
label: Concesión canales @es
label: Concessão de vias navegáveis @pt
label: Concession voies eau @fr
label: Concessioni acqua @it
label: Konz. Wasserstraßen @de
label: Отвод канала @ru
label: 水路利権 @ja
label: 水运特许权 @zh
label: 水運特許權 @zh-hant
label: 수로 컨세션 @ko
definition: This segment includes companies that operate waterway concessions. Services include fee collection and maintenance support on canals and locks on river systems.
notation: 1617161112
valid from: 2014-08-08
valid till: 2020-10-03

Other Marine Support Services
type: BicsLevel5Segment
type: Classifier
type: Discontinued
type: NamedIndividual
is level5 segment of: Marine Support Services
is contemporary version of: http://data.ga-group.nl/ics/bics/1617161113
is version of: http://data.ga-group.nl/ics/bics/1617161113
imported on: 2026-06-08T13:03:47.798Z
last refreshed on: 2026-06-08T13:03:47.798Z
source accessed on: 2019-12-03T20:05:01Z
source last accessed on: 2019-12-03T20:05:01Z
label: Altri servizi supporto marittimo @it
label: Autres services de soutien maritime @fr
label: Otros servicios de apoyo de marinas @es
label: Outros serviços apoio marítimo @pt
label: Sonstige maritime Hilfsdienste @de
label: Прочая морская вспомогат. деятельность @ru
label: その他水運支援ｻｰﾋﾞｽ @ja
label: 其他海运支持服务 @zh
label: 其他海運支援服務 @zh-hant
label: 수상 운송업 관련 기타 지원 활동 @ko
definition: This segment includes companies that provide other support activities for marine transportation. Such activities include routine maintenance and repair of ships, floating dry-dock services and ship dismantling.
notation: 1617161113
valid from: 2014-08-08
valid till: 2020-10-03

Marine Support Services
type: BicsLevel4SubIndustry
type: Classifier
type: NamedIndividual
is sub industry of: Transport Support Services
is anachronous version of: http://data.ga-group.nl/ics/bics/171112181111
is contemporary version of: http://data.ga-group.nl/ics/bics/16171611
is replaced by: http://data.ga-group.nl/ics/bics/2020/171112181111
is version of: http://data.ga-group.nl/ics/bics/16171611
is version of: http://data.ga-group.nl/ics/bics/171112181111
imported on: 2026-06-08T13:03:47.798Z
last refreshed on: 2026-06-08T13:03:47.798Z
source accessed on: 2019-12-03T20:05:01Z
source last accessed on: 2019-12-03T20:05:01Z
label: Maritime Hilfsdienste @de
label: Serviços de apoio marítimo @pt
label: Services de soutien maritime @fr
label: Servicios de apoyo de marinas @es
label: Servizi supporto marittimo @it
label: Морская вспомогат. деятельность @ru
label: 海上輸送支援ｻｰﾋﾞｽ @ja
label: 海运支持服务 @zh
label: 海運支援服務 @zh-hant
label: 해운 지원 활동 @ko
definition: This industry subgroup includes companies that provide marine support services. Such activities include operation of port facilities, cargo handling, dry-dock services and navigational services.
notation: 16171611
valid from: 2014-08-08
valid till: 2020-10-03

Support Services - Rail Transp
type: BicsLevel4SubIndustry
type: Classifier
type: NamedIndividual
is sub industry of: Transport Support Services
is anachronous version of: http://data.ga-group.nl/ics/bics/171112181112
is contemporary version of: http://data.ga-group.nl/ics/bics/16171612
is replaced by: http://data.ga-group.nl/ics/bics/2020/171112181112
is version of: http://data.ga-group.nl/ics/bics/16171612
is version of: http://data.ga-group.nl/ics/bics/171112181112
imported on: 2026-06-08T13:03:47.798Z
last refreshed on: 2026-06-08T13:03:47.798Z
source accessed on: 2019-12-03T20:05:01Z
source last accessed on: 2019-12-03T20:05:01Z
label: Hilfsdienste - Schienentransport @de
label: Serv de asistencia - transporte ferrov @es
label: Serv soutien - Transp ferroviaire @fr
label: Serviços de apoio - Transp ferroviário @pt
label: Servizi supporto - Trasp ferroviario @it
label: Вспомогат. деятельность-Жел. дорога @ru
label: 支持服务-铁路运输 @zh
label: 支援服務-鐵路運輸 @zh-hant
label: 鉄道輸送支援ｻｰﾋﾞｽ @ja
label: 철도운송지원 @ko
definition: This industry subgroup includes companies that provide railroad support activities. Such activities include rail terminal operation, loading and unloading services, and locomotive and rail car repair.
notation: 16171612
valid from: 2014-08-08
valid till: 2020-10-03

Trucking Support Services
type: BicsLevel4SubIndustry
type: Classifier
type: NamedIndividual
is sub industry of: Transport Support Services
is anachronous version of: http://data.ga-group.nl/ics/bics/171112181113
is contemporary version of: http://data.ga-group.nl/ics/bics/16171613
is replaced by: http://data.ga-group.nl/ics/bics/2020/171112181113
is version of: http://data.ga-group.nl/ics/bics/16171613
is version of: http://data.ga-group.nl/ics/bics/171112181113
imported on: 2026-06-08T13:03:47.798Z
last refreshed on: 2026-06-08T13:03:47.798Z
source accessed on: 2019-12-03T20:05:01Z
source last accessed on: 2019-12-03T20:05:01Z
label: Fuhrunternehmen, Support-Services @de
label: Serviços de suporte ao transporte rodoviário @pt
label: Services de soutien au camionnage @fr
label: Servicios de soporte de camiones @es
label: Servizi supporto camion @it
label: Вспомог. услуги перевозки на грузовых автомобилях @ru
label: 卡車運輸支援服務 @zh-hant
label: 卡车运输支持服务 @zh
label: 트럭운송 지원 서비스 @ko
label: ﾄﾗｯｸ輸送ｻｰﾋﾞｽ @ja
definition: This industry subgroup includes companies that provide trucking support services, such as equipment maintenance, rentals, and tank washing.
notation: 16171613
valid from: 2014-08-08
valid till: 2020-10-03

Other Pipelines (excl Oil & Gas)
type: BicsLevel4SubIndustry
type: Classifier
type: Discontinued
type: NamedIndividual
is sub industry of: Transport Support Services
is contemporary version of: http://data.ga-group.nl/ics/bics/16171614
is version of: http://data.ga-group.nl/ics/bics/16171614
imported on: 2026-06-08T13:03:47.798Z
last refreshed on: 2026-06-08T13:03:47.798Z
source accessed on: 2019-12-03T20:05:01Z
source last accessed on: 2019-12-03T20:05:01Z
label: Altre condotte (escluso petrolio e gas) @it
label: Autres pipelines (hors pétrole et gaz) @fr
label: Otros gasoductos (excl petróleo y gas) @es
label: Outros dutos (excl petróleo e gás) @pt
label: Sonstige Pipelines (exkl. Öl & Gas) @de
label: Прочие трубопроводы (искл. нефть/газ) @ru
label: その他ﾊﾟｲﾌﾟﾗｲﾝ(除石油･ｶﾞｽ) @ja
label: 其他管線運輸(不含油氣) @zh-hant
label: 其他管道(不含油气） @zh
label: 기타파이프라인(석유&가스제외) @ko
definition: This industry subgroup includes companies that provide pipeline transportation of other products not elsewhere classified. Products include ammonia and coal slurries.
notation: 16171614
valid from: 2014-08-08
valid till: 2020-10-03

Transport Support Services
type: BicsLevel3Industry
type: Classifier
type: NamedIndividual
is industry of: Transportation & Logistics
is anachronous version of: http://data.ga-group.nl/ics/bics/1711121811
is contemporary version of: http://data.ga-group.nl/ics/bics/161716
is replaced by: http://data.ga-group.nl/ics/bics/2020/1711121811
is version of: http://data.ga-group.nl/ics/bics/161716
is version of: http://data.ga-group.nl/ics/bics/1711121811
imported on: 2026-06-08T13:03:47.798Z
last refreshed on: 2026-06-08T13:03:47.798Z
source accessed on: 2019-12-03T20:05:01Z
source last accessed on: 2019-12-03T20:05:01Z
label: Appui au transport @fr
label: Serv apoio transp @pt
label: Serv apoyo transp @es
label: Servizio trasporto @it
label: Transportbetreuung @de
label: Транспортировка @ru
label: 輸送支援ｻｰﾋﾞｽ @ja
label: 运输支援服务 @zh
label: 運輸支援服務 @zh-hant
label: 운송지원업 @ko
definition: This industry includes companies that provide transportation support services. Such services include airport operations and aircraft maintenance, port operations and navigational services, railroad terminal operations, toll highway and bridge operations, and non-oil product pipeline operations.
notation: 161716
valid from: 2014-08-08
valid till: 2020-10-03

Transportation & Logistics
type: BicsLevel2IndustryGroup
type: Classifier
type: NamedIndividual
is industry group of: Industrials
is anachronous version of: http://data.ga-group.nl/ics/bics/171112
is contemporary version of: http://data.ga-group.nl/ics/bics/1617
is replaced by: http://data.ga-group.nl/ics/bics/2020/171112
is version of: http://data.ga-group.nl/ics/bics/1617
is version of: http://data.ga-group.nl/ics/bics/171112
imported on: 2026-06-08T13:03:47.798Z
last refreshed on: 2026-06-08T13:03:47.798Z
source accessed on: 2019-12-03T20:05:01Z
source last accessed on: 2019-12-03T20:05:01Z
label: Transport et Logistique @fr
label: Transporte y logística @es
label: Transportes e logística @pt
label: Transportwesen & Logistik @de
label: Trasporti e logistica @it
label: Транспортировка и логистика @ru
label: 輸送･流通 @ja
label: 运输与物流 @zh
label: 運輸及物流 @zh-hant
label: 운송 & 물류 @ko
definition: This industry group includes companies that provide passenger and freight transportation services. Includes air freight, railroad, trucking and marine shipping services as well as logistics, postal and courier delivery services.
notation: 1617
valid from: 2014-08-08
valid till: 2020-10-03

Environ Consulting Services
type: BicsLevel4SubIndustry
type: Classifier
type: NamedIndividual
is sub industry of: Environ Engineer & Consulting
is anachronous version of: http://data.ga-group.nl/ics/bics/171113101310
is contemporary version of: http://data.ga-group.nl/ics/bics/16181010
is replaced by: http://data.ga-group.nl/ics/bics/2020/171113101310
is version of: http://data.ga-group.nl/ics/bics/16181010
is version of: http://data.ga-group.nl/ics/bics/171113101310
imported on: 2026-06-08T13:03:47.798Z
last refreshed on: 2026-06-08T13:03:47.798Z
source accessed on: 2019-12-03T20:05:01Z
source last accessed on: 2019-12-03T20:05:01Z
label: Asesoría ambiental @es
label: Serv conseils environn @fr
label: Serviços de consultoria amb @pt
label: Servizi consulenza ambiente @it
label: Umweltberatungsdienste @de
label: Услуги экологического консульт. @ru
label: 环境咨询服务 @zh
label: 環保諮詢服務 @zh-hant
label: 環境���ﾝｻﾙﾃｨﾝｸﾞｻｰﾋﾞｽ @ja
label: 환경 상담 서비스 @ko
definition: This industry subgroup includes companies that provide environmental consulting services. Such companies provide advice on the control of environmental contamination, sanitation and site remediation.
notation: 16181010
valid from: 2014-08-08
valid till: 2020-10-03

Environ Engineering Services
type: BicsLevel4SubIndustry
type: Classifier
type: NamedIndividual
is sub industry of: Environ Engineer & Consulting
is anachronous version of: http://data.ga-group.nl/ics/bics/171113101311
is contemporary version of: http://data.ga-group.nl/ics/bics/16181011
is replaced by: http://data.ga-group.nl/ics/bics/2020/171113101311
is version of: http://data.ga-group.nl/ics/bics/16181011
is version of: http://data.ga-group.nl/ics/bics/171113101311
imported on: 2026-06-08T13:03:47.798Z
last refreshed on: 2026-06-08T13:03:47.798Z
source accessed on: 2019-12-03T20:05:01Z
source last accessed on: 2019-12-03T20:05:01Z
label: Serv ingénierie envir @fr
label: Serviços de engenharia amb @pt
label: Servicios de ingeniería ambiental @es
label: Servizi ingegneria ambiente @it
label: Umweltingenieursdienste @de
label: Услуги экологич. инжиниринга @ru
label: 环境工程服务 @zh
label: 環境工学ｻｰﾋﾞｽ @ja
label: 環境工程服務 @zh-hant
label: 환경 공학 서비스 @ko
definition: This industry subgroup includes companies that provide environmental engineering services, such as concept development, initial planning, and design of resource-related projects. Projects include water resource management, waste management and environmental restoration.
notation: 16181011
valid from: 2014-08-08
valid till: 2020-10-03

Environ Engineer & Consulting
type: BicsLevel3Industry
type: Classifier
type: NamedIndividual
is industry of: Waste & Environ Svcs & Equip
is anachronous version of: http://data.ga-group.nl/ics/bics/1711131013
is contemporary version of: http://data.ga-group.nl/ics/bics/161810
is replaced by: http://data.ga-group.nl/ics/bics/2020/1711131013
is version of: http://data.ga-group.nl/ics/bics/161810
is version of: http://data.ga-group.nl/ics/bics/1711131013
imported on: 2026-06-08T13:03:47.798Z
last refreshed on: 2026-06-08T13:03:47.798Z
source accessed on: 2019-12-03T20:05:01Z
source last accessed on: 2019-12-03T20:05:01Z
label: Asesoría e ingeniería ambiental @es
label: Conseils/ingénierie environn @fr
label: Consulenza e ingegneria ambiente @it
label: Engenharia e consultoria amb @pt
label: Umweltingenieursdienste & Beratung @de
label: Услуги экологической инженерии @ru
label: 环境工程与咨询 @zh
label: 環境工学･ｺﾝｻﾙﾃｨﾝｸﾞ @ja
label: 環境工程及顧問 @zh-hant
label: 환경공학&컨설팅 @ko
definition: This industry includes companies that provide environmental engineering and consulting services.
notation: 161810
valid from: 2014-08-08
valid till: 2020-10-03

Air Purification Equipment
type: BicsLevel4SubIndustry
type: Classifier
type: NamedIndividual
is sub industry of: Pollution Control Equipment
is anachronous version of: http://data.ga-group.nl/ics/bics/1710131810
is contemporary version of: http://data.ga-group.nl/ics/bics/16181110
is replaced by: http://data.ga-group.nl/ics/bics/2020/1710131810
is version of: http://data.ga-group.nl/ics/bics/16181110
is version of: http://data.ga-group.nl/ics/bics/1710131810
imported on: 2026-06-08T13:03:47.798Z
last refreshed on: 2026-06-08T13:03:47.798Z
source accessed on: 2019-12-03T20:05:01Z
source last accessed on: 2019-12-03T20:05:01Z
label: Apparecchiature purificazione aria @it
label: Equipamentos para purificação do ar @pt
label: Equipement de purification de l'air @fr
label: Equipo de purificación de aire @es
label: Luftreinhaltungsausrüstung @de
label: Оборуд. для очистки воздуха @ru
label: 空气净化设备 @zh
label: 空気清浄機器 @ja
label: 空��濾淨設備 @zh-hant
label: 공기정화장비 @ko
definition: This industry subgroup includes companies that manufacture air purification equipment products used to reduce air pollution by removing contaminates before they are released into the atmosphere. Such products include flue gas emission reduction equipment, dust elimination equipment, and activated carbon.
notation: 16181110
valid from: 2014-08-08
valid till: 2020-10-03

Filtration Prods - Air & Liquids
type: BicsLevel4SubIndustry
type: Classifier
type: NamedIndividual
is sub industry of: Pollution Control Equipment
is anachronous version of: http://data.ga-group.nl/ics/bics/1710131811
is contemporary version of: http://data.ga-group.nl/ics/bics/16181111
is replaced by: http://data.ga-group.nl/ics/bics/2020/1710131811
is version of: http://data.ga-group.nl/ics/bics/16181111
is version of: http://data.ga-group.nl/ics/bics/1710131811
imported on: 2026-06-08T13:03:47.798Z
last refreshed on: 2026-06-08T13:03:47.798Z
source accessed on: 2019-12-03T20:05:01Z
source last accessed on: 2019-12-03T20:05:01Z
label: Filterprodukte - Luft & Flüssigkeiten @de
label: Prod filtragem - Ar e líquidos @pt
label: Prod filtraggio - Aria e liquidi @it
label: Prod filtration - Air/liquides @fr
label: Productos de filtración de aire y líquidos @es
label: Фильтры для очистки воздуха и жидк. @ru
label: ろ過製品-空気･液体 @ja
label: 过滤产品-气体与液体 @zh
label: 過濾產品-氣體/液體 @zh-hant
label: 필터제품-공기&유동체 @ko
definition: This industry subgroup includes companies that manufacture filters for air purification, automotive applications, furnaces and liquids. Other products include membranes and liquid separation equipment.
notation: 16181111
valid from: 2014-08-08
valid till: 2020-10-03

Water Purification Equipment
type: BicsLevel4SubIndustry
type: Classifier
type: NamedIndividual
is sub industry of: Pollution Control Equipment
is anachronous version of: http://data.ga-group.nl/ics/bics/1710131812
is contemporary version of: http://data.ga-group.nl/ics/bics/16181112
is replaced by: http://data.ga-group.nl/ics/bics/2020/1710131812
is version of: http://data.ga-group.nl/ics/bics/16181112
is version of: http://data.ga-group.nl/ics/bics/1710131812
imported on: 2026-06-08T13:03:47.798Z
last refreshed on: 2026-06-08T13:03:47.798Z
source accessed on: 2019-12-03T20:05:01Z
source last accessed on: 2019-12-03T20:05:01Z
label: Apparecchiature depurazione idrica @it
label: Equipamento para purificação da água @pt
label: Equipements purification de l'eau @fr
label: Equipo de purificación de agua @es
label: Wasserreinhaltungsausrüstung @de
label: Оборуд. для очистки воды @ru
label: 水净化设备 @zh
label: 水濾淨設備製造 @zh-hant
label: 浄水機器 @ja
label: 수질정화장비 @ko
definition: This industry subgroup includes companies that manufacture water purification equipment. Products include water treatment systems equipment, water purification chemicals, and activated carbon products.
notation: 16181112
valid from: 2014-08-08
valid till: 2020-10-03

Pollution Control Equipment
type: BicsLevel3Industry
type: Classifier
type: NamedIndividual
is industry of: Waste & Environ Svcs & Equip
is anachronous version of: http://data.ga-group.nl/ics/bics/17101318
is contemporary version of: http://data.ga-group.nl/ics/bics/161811
is replaced by: http://data.ga-group.nl/ics/bics/2020/17101318
is version of: http://data.ga-group.nl/ics/bics/161811
is version of: http://data.ga-group.nl/ics/bics/17101318
imported on: 2026-06-08T13:03:47.798Z
last refreshed on: 2026-06-08T13:03:47.798Z
source accessed on: 2019-12-03T20:05:01Z
source last accessed on: 2019-12-03T20:05:01Z
label: App controllo inquinamento @it
label: Eq control contam @es
label: Equip controle à poluição @pt
label: Equipements anti-pollution @fr
label: Umweltschutzausrüstung @de
label: Оборуд. контроля за загрязн. @ru
label: 汚染制御機器 @ja
label: 污染控制設備 @zh-hant
label: 污染控制设备 @zh
label: 오염 정화장치 @ko
definition: This industry includes companies that manufacture pollution control equipment. Products include air and water purification equipment, air and liquid filtration equipment, and filters.
notation: 161811
valid from: 2014-08-08
valid till: 2020-10-03

Hazardous Waste Collection
type: BicsLevel5Segment
type: Classifier
type: NamedIndividual
is level5 segment of: Hazardous Waste Collect & Treat
is anachronous version of: http://data.ga-group.nl/ics/bics/171111151010
is contemporary version of: http://data.ga-group.nl/ics/bics/1618121010
is replaced by: http://data.ga-group.nl/ics/bics/2020/171111151010
is version of: http://data.ga-group.nl/ics/bics/1618121010
is version of: http://data.ga-group.nl/ics/bics/171111151010
imported on: 2026-06-08T13:03:47.798Z
last refreshed on: 2026-06-08T13:03:47.798Z
source accessed on: 2019-12-03T20:05:01Z
source last accessed on: 2019-12-03T20:05:01Z
label: Coleta de resíduos perigosos @pt
label: Giftmüllsammlung @de
label: Manejo desechos pel @es
label: Racc rif pericolosi @it
label: Ramas déchet danger @fr
label: Опасные отходы - сбор @ru
label: 危害性廢物收集 @zh-hant
label: 有害废物收集 @zh
label: 有害廃棄物回収業 @ja
label: 지정폐기물수집 @ko
definition: This segment includes companies that provide hazardous waste collection services. Such services include the collection and hauling of radioactive waste, medical waste, and oil and other hydrocarbons.
notation: 1618121010
valid from: 2014-08-08
valid till: 2020-10-03

Hazardous Waste Treat & Disp
type: BicsLevel5Segment
type: Classifier
type: NamedIndividual
is level5 segment of: Hazardous Waste Collect & Treat
is anachronous version of: http://data.ga-group.nl/ics/bics/171111151011
is contemporary version of: http://data.ga-group.nl/ics/bics/1618121011
is replaced by: http://data.ga-group.nl/ics/bics/2020/171111151011
is version of: http://data.ga-group.nl/ics/bics/1618121011
is version of: http://data.ga-group.nl/ics/bics/171111151011
imported on: 2026-06-08T13:03:47.798Z
last refreshed on: 2026-06-08T13:03:47.798Z
source accessed on: 2019-12-03T20:05:01Z
source last accessed on: 2019-12-03T20:05:01Z
label: Disp e tratt rifuti pericolosi @it
label: Giftabfallbearbeitung & -entsorgung @de
label: Tra de resíduos per e eliminação @pt
label: Trait/élim déchets dangereux @fr
label: Tratamiento y despojo des pelig @es
label: Перераб. и очистка опасных отходов @ru
label: 有害废物处理与处置 @zh
label: 有害廃棄物処理･処分 @ja
label: 有害廢棄物處理/處置 @zh-hant
label: 폐기물처리업 @ko
definition: This segment includes companies that provide hazardous waste collection services. Such services include pickup, collection, disposal and treatment.
notation: 1618121011
valid from: 2014-08-08
valid till: 2020-10-03

Hazardous Waste Collect & Treat
type: BicsLevel4SubIndustry
type: Classifier
type: NamedIndividual
is sub industry of: Waste Management
is anachronous version of: http://data.ga-group.nl/ics/bics/1711111510
is contemporary version of: http://data.ga-group.nl/ics/bics/16181210
is replaced by: http://data.ga-group.nl/ics/bics/2020/1711111510
is version of: http://data.ga-group.nl/ics/bics/16181210
is version of: http://data.ga-group.nl/ics/bics/1711111510
imported on: 2026-06-08T13:03:47.798Z
last refreshed on: 2026-06-08T13:03:47.798Z
source accessed on: 2019-12-03T20:05:01Z
source last accessed on: 2019-12-03T20:05:01Z
label: Coleta e trat de resíduos perigosos @pt
label: Collecte/traitement déchets dangereux @fr
label: Giftabfallsammlung & -bearbeitung @de
label: Raccolta e tratt rifiuti pericolosi @it
label: Tratado y recogimiento de desechos peligrosos @es
label: Сбор и перераб. опасных отходов @ru
label: 有害废物收集与处理 @zh
label: 有害廃棄物回収･処理 @ja
label: 有害廢棄物收集/處理 @zh-hant
label: 위험 폐기물수집&취급 @ko
definition: This industry subgroup includes companies that provide hazardous waste collection and treatment services. It also includes companies that provide oil and hydrocarbon collection and recycling.
notation: 16181210
valid from: 2014-08-08
valid till: 2020-10-03

Recyclable Materials
type: BicsLevel4SubIndustry
type: Classifier
type: NamedIndividual
is sub industry of: Waste Management
is anachronous version of: http://data.ga-group.nl/ics/bics/1711111511
is contemporary version of: http://data.ga-group.nl/ics/bics/16181211
is replaced by: http://data.ga-group.nl/ics/bics/2020/1711111511
is version of: http://data.ga-group.nl/ics/bics/16181211
is version of: http://data.ga-group.nl/ics/bics/1711111511
imported on: 2026-06-08T13:03:47.798Z
last refreshed on: 2026-06-08T13:03:47.798Z
source accessed on: 2019-12-03T20:05:01Z
source last accessed on: 2019-12-03T20:05:01Z
label: Matériaux recyclables @fr
label: Materiais recicláveis @pt
label: Materiales reciclables @es
label: Materiali riciclabili @it
label: Recycelbare Materialien @de
label: Вторсырье @ru
label: 再生資源物 @ja
label: 可循环材料 @zh
label: 回收材料 @zh-hant
label: 재활용 원료 @ko
definition: This industry subgroup includes companies that wholesale metal and non-metal waste and scrap for recycling. Includes activities, such as collecting, sorting, separating and stripping used goods for reusable parts.
notation: 16181211
valid from: 2014-08-08
valid till: 2020-10-03

Recycling Facilities
type: BicsLevel5Segment
type: Classifier
type: NamedIndividual
is level5 segment of: Solid Waste Collection & Treat
is anachronous version of: http://data.ga-group.nl/ics/bics/171111151210
is contemporary version of: http://data.ga-group.nl/ics/bics/1618121210
is replaced by: http://data.ga-group.nl/ics/bics/2020/171111151210
is version of: http://data.ga-group.nl/ics/bics/1618121210
is version of: http://data.ga-group.nl/ics/bics/171111151210
imported on: 2026-06-08T13:03:47.798Z
last refreshed on: 2026-06-08T13:03:47.798Z
source accessed on: 2019-12-03T20:05:01Z
source last accessed on: 2019-12-03T20:05:01Z
label: Imp recupero mat @it
label: Instalações de reciclagem @pt
label: Instalac reciclaje @es
label: Installa. recyclage @fr
label: Recyclinganlagen @de
label: Утилизация @ru
label: 材料再生施設 @ja
label: 材料再生设施 @zh
label: 資源回收單位 @zh-hant
label: 재활용 시설업 @ko
definition: This segment includes companies that operate materials recovery facilities. Services include collecting, sorting and separating recyclable material, such as paper, plastic, glass, tires and various metals.
notation: 1618121210
valid from: 2014-08-08
valid till: 2020-10-03

Remediation Services
type: BicsLevel5Segment
type: Classifier
type: NamedIndividual
is level5 segment of: Solid Waste Collection & Treat
is anachronous version of: http://data.ga-group.nl/ics/bics/171111151211
is contemporary version of: http://data.ga-group.nl/ics/bics/1618121211
is replaced by: http://data.ga-group.nl/ics/bics/2020/171111151211
is version of: http://data.ga-group.nl/ics/bics/1618121211
is version of: http://data.ga-group.nl/ics/bics/171111151211
imported on: 2026-06-08T13:03:47.798Z
last refreshed on: 2026-06-08T13:03:47.798Z
source accessed on: 2019-12-03T20:05:01Z
source last accessed on: 2019-12-03T20:05:01Z
label: Sanierungsdienstl. @de
label: Serv de reparação @pt
label: Serv remediación @es
label: Servizi remediation @it
label: Srv d'assainissement @fr
label: Рекультивация @ru
label: 回收服务 @zh
label: 浄化ｻｰﾋﾞｽ業 @ja
label: 環境淨化服務 @zh-hant
label: 환경정화서비스업 @ko
definition: This segment includes companies that provide remediation services. Such services include asbestos abatement, lead paint removal, oil spill cleanup, soil remediation and mine reclamation services.
notation: 1618121211
valid from: 2014-08-08
valid till: 2020-10-03

Solid Waste Collection
type: BicsLevel5Segment
type: Classifier
type: NamedIndividual
is level5 segment of: Solid Waste Collection & Treat
is anachronous version of: http://data.ga-group.nl/ics/bics/171111151212
is contemporary version of: http://data.ga-group.nl/ics/bics/1618121212
is replaced by: http://data.ga-group.nl/ics/bics/2020/171111151212
is version of: http://data.ga-group.nl/ics/bics/1618121212
is version of: http://data.ga-group.nl/ics/bics/171111151212
imported on: 2026-06-08T13:03:47.798Z
last refreshed on: 2026-06-08T13:03:47.798Z
source accessed on: 2019-12-03T20:05:01Z
source last accessed on: 2019-12-03T20:05:01Z
label: Colecc desecho sól @es
label: Coleta de resíduos sólidos @pt
label: Hausmüllsammlung @de
label: Racc rifiuti solidi @it
label: Ramassage déchet sol @fr
label: Твердые коммунально-бытовые отходы - сбор @ru
label: 固体废物收��� @zh
label: 固定廃棄物回収業 @ja
label: 固態廢物收集 @zh-hant
label: 고형폐기물 수집업 @ko
definition: This segment includes companies that provide solid waste collection services. Such services include pickup, collection and hauling of garbage and recyclable materials.
notation: 1618121212
valid from: 2014-08-08
valid till: 2020-10-03

Solid Waste Incinerators
type: BicsLevel5Segment
type: Classifier
type: NamedIndividual
is level5 segment of: Solid Waste Collection & Treat
is anachronous version of: http://data.ga-group.nl/ics/bics/171111151213
is contemporary version of: http://data.ga-group.nl/ics/bics/1618121213
is replaced by: http://data.ga-group.nl/ics/bics/2020/171111151213
is version of: http://data.ga-group.nl/ics/bics/1618121213
is version of: http://data.ga-group.nl/ics/bics/171111151213
imported on: 2026-06-08T13:03:47.798Z
last refreshed on: 2026-06-08T13:03:47.798Z
source accessed on: 2019-12-03T20:05:01Z
source last accessed on: 2019-12-03T20:05:01Z
label: Inceneritori di rifiuti solidi @it
label: Incinération déchets solides @fr
label: Incineradores de resíduos sólidos @pt
label: Müllverbrennung, fest @de
label: Vertedero de desechos sólidos @es
label: Твердые отходы - печь для сжигания @ru
label: 固体废物废弃物焚烧 @zh
label: 固形廃棄物焼却業 @ja
label: 固態廢物焚燒及焚毀 @zh-hant
label: 고형폐기물연소기 @ko
definition: This segment includes companies that operate solid waste combustors and incinerators.
notation: 1618121213
valid from: 2014-08-08
valid till: 2020-10-03

Solid Waste Landfill
type: BicsLevel5Segment
type: Classifier
type: NamedIndividual
is level5 segment of: Solid Waste Collection & Treat
is anachronous version of: http://data.ga-group.nl/ics/bics/171111151214
is contemporary version of: http://data.ga-group.nl/ics/bics/1618121214
is replaced by: http://data.ga-group.nl/ics/bics/2020/171111151214
is version of: http://data.ga-group.nl/ics/bics/1618121214
is version of: http://data.ga-group.nl/ics/bics/171111151214
imported on: 2026-06-08T13:03:47.798Z
last refreshed on: 2026-06-08T13:03:47.798Z
source accessed on: 2019-12-03T20:05:01Z
source last accessed on: 2019-12-03T20:05:01Z
label: Abfalldeponie, fest @de
label: Aterro sanitário para resíduos sólidos @pt
label: Enfouisst déchet sol @fr
label: Sotterram rif solidi @it
label: Vertederos desechos @es
label: Твердые отходы - мес��о хранение @ru
label: 固体废物填埋 @zh
label: 固形廃棄物埋立業 @ja
label: 固態廢物掩埋 @zh-hant
label: 고형폐기물 매립지 @ko
definition: This segment includes companies that operate solid waste landfill facilities for the disposal of solid waste.
notation: 1618121214
valid from: 2014-08-08
valid till: 2020-10-03

Solid Waste Transfer
type: BicsLevel5Segment
type: Classifier
type: NamedIndividual
is level5 segment of: Solid Waste Collection & Treat
is anachronous version of: http://data.ga-group.nl/ics/bics/171111151215
is contemporary version of: http://data.ga-group.nl/ics/bics/1618121215
is replaced by: http://data.ga-group.nl/ics/bics/2020/171111151215
is version of: http://data.ga-group.nl/ics/bics/1618121215
is version of: http://data.ga-group.nl/ics/bics/171111151215
imported on: 2026-06-08T13:03:47.798Z
last refreshed on: 2026-06-08T13:03:47.798Z
source accessed on: 2019-12-03T20:05:01Z
source last accessed on: 2019-12-03T20:05:01Z
label: Abfalltransfer, fest @de
label: Transferência de resíduos sólidos @pt
label: Transferenc desechos @es
label: Transfert déchet sol @fr
label: Trasf rifiuti solidi @it
label: Твердые отходы - перемещение @ru
label: 固体废物转运设施 @zh
label: 固形廃棄物輸送施設 @ja
label: 固體廢物轉運設施 @zh-hant
label: 고형폐기물이동시설 @ko
definition: This segment includes companies that operate solid waste transfer facilities. Such facilities consolidate and compact the solid waste and then transport it to disposal sites by rail or truck.
notation: 1618121215
valid from: 2014-08-08
valid till: 2020-10-03

Solid Waste Collection & Treat
type: BicsLevel4SubIndustry
type: Classifier
type: NamedIndividual
is sub industry of: Waste Management
is anachronous version of: http://data.ga-group.nl/ics/bics/1711111512
is contemporary version of: http://data.ga-group.nl/ics/bics/16181212
is replaced by: http://data.ga-group.nl/ics/bics/2020/1711111512
is version of: http://data.ga-group.nl/ics/bics/16181212
is version of: http://data.ga-group.nl/ics/bics/1711111512
imported on: 2026-06-08T13:03:47.798Z
last refreshed on: 2026-06-08T13:03:47.798Z
source accessed on: 2019-12-03T20:05:01Z
source last accessed on: 2019-12-03T20:05:01Z
label: Coleta e trat de res sólidos @pt
label: Collecte/traitement déchets solides @fr
label: Festabfallsammlung & -bearbeitung @de
label: Raccolta e tratt rifiuti solidi @it
label: Tratamiento de recolección de desechos sólidos @es
label: Твердые отходы - сбор и переработка @ru
label: 固体废物收集与处理 @zh
label: 固定廃棄物回収･処理 @ja
label: 固態廢棄物收集/處理 @zh-hant
label: 고형폐기물수집&취급 @ko
definition: This industry subgroup includes companies that provide solid waste collection and treatment services, such as the collection, treatment and disposal of solid waste and recyclable materials.
notation: 16181212
valid from: 2014-08-08
valid till: 2020-10-03

Septic Tank Services
type: BicsLevel5Segment
type: Classifier
type: Discontinued
type: NamedIndividual
is level5 segment of: Other Waste Management Svcs
is contemporary version of: http://data.ga-group.nl/ics/bics/1618121310
is version of: http://data.ga-group.nl/ics/bics/1618121310
imported on: 2026-06-08T13:03:47.798Z
last refreshed on: 2026-06-08T13:03:47.798Z
source accessed on: 2019-12-03T20:05:01Z
source last accessed on: 2019-12-03T20:05:01Z
label: Klärbehälterdienste @de
label: Serv de tanque séptico @pt
label: Serv fosse settiche @it
label: Serv tanques sépt @es
label: Srv fosses septiques @fr
label: Услуги - септик-тэнк @ru
label: 化粪池和相关服务业 @zh
label: 化糞池及相關服務 @zh-hant
label: 浄化槽･関連ｻｰﾋﾞｽ業 @ja
label: 분뇨정화조서비스 @ko
definition: This segment includes companies that clean septic tanks. Other services include cleaning portable toilets and cesspools.
notation: 1618121310
valid from: 2014-08-08
valid till: 2020-10-03

Other Waste Collection
type: BicsLevel5Segment
type: Classifier
type: Discontinued
type: NamedIndividual
is level5 segment of: Other Waste Management Svcs
is contemporary version of: http://data.ga-group.nl/ics/bics/1618121311
is version of: http://data.ga-group.nl/ics/bics/1618121311
imported on: 2026-06-08T13:03:47.798Z
last refreshed on: 2026-06-08T13:03:47.798Z
source accessed on: 2019-12-03T20:05:01Z
source last accessed on: 2019-12-03T20:05:01Z
label: Coleta de outros resíduos @pt
label: Otro manejo desechos @es
label: Racc altri rifiuti @it
label: Ramass autr déchets @fr
label: Sonst. Abfallsammlg @de
label: Другие отходы - сбор @ru
label: その他廃棄物回収業 @ja
label: 其他废物收集 @zh
label: 其他廢物收集 @zh-hant
label: 기타 폐���물수집업 @ko
definition: This segment includes companies that provide waste collection services not elsewhere classified. Such services include brush collection and rubble removal.
notation: 1618121311
valid from: 2014-08-08
valid till: 2020-10-03

Other Waste Management Svcs
type: BicsLevel4SubIndustry
type: Classifier
type: Discontinued
type: NamedIndividual
is sub industry of: Waste Management
is contemporary version of: http://data.ga-group.nl/ics/bics/16181213
is version of: http://data.ga-group.nl/ics/bics/16181213
imported on: 2026-06-08T13:03:47.798Z
last refreshed on: 2026-06-08T13:03:47.798Z
source accessed on: 2019-12-03T20:05:01Z
source last accessed on: 2019-12-03T20:05:01Z
label: Altri serv gestione rifiuti @it
label: Autres serv gestion des déchets @fr
label: Otros servicios manejo de desechos @es
label: Outros serv de gestão de resíduos @pt
label: Sonstige Abfalldienste @de
label: Другие услуги по перераб. мусора @ru
label: その他廃棄物管理 @ja
label: 其他废物管理服务 @zh
label: 其他廢棄物管理服務 @zh-hant
label: 기타폐기물관리업 @ko
definition: This industry subgroup includes companies that provide other waste management services. Such services include the collection of other waste products and septic tank cleaning services.
notation: 16181213
valid from: 2014-08-08
valid till: 2020-10-03

Waste Management
type: BicsLevel3Industry
type: Classifier
type: NamedIndividual
is industry of: Waste & Environ Svcs & Equip
is anachronous version of: http://data.ga-group.nl/ics/bics/17111115
is contemporary version of: http://data.ga-group.nl/ics/bics/161812
is replaced by: http://data.ga-group.nl/ics/bics/2020/17111115
is version of: http://data.ga-group.nl/ics/bics/161812
is version of: http://data.ga-group.nl/ics/bics/17111115
imported on: 2026-06-08T13:03:47.798Z
last refreshed on: 2026-06-08T13:03:47.798Z
source accessed on: 2019-12-03T20:05:01Z
source last accessed on: 2019-12-03T20:05:01Z
label: Abfallwirtschaft @de
label: Gerenciamento lixo @pt
label: Gestion déchets @fr
label: Gestione dei rifiuti @it
label: Planificac desechos @es
label: Переработка отходов @ru
label: 废物管理 @zh
label: 廃棄物管理 @ja
label: 廢物管理 @zh-hant
label: 폐기물 관리 @ko
definition: This industry includes companies that collect, store, dispose, recycle or treat various forms of waste. Includes organic and hazardous waste materials, landfills, incineration, and treatment plants.
notation: 161812
valid from: 2014-08-08
valid till: 2020-10-03

Waste & Environ Svcs & Equip
type: BicsLevel2IndustryGroup
type: Classifier
type: Discontinued
type: NamedIndividual
is industry group of: Industrials
is contemporary version of: http://data.ga-group.nl/ics/bics/1618
is version of: http://data.ga-group.nl/ics/bics/1618
imported on: 2026-06-08T13:03:47.798Z
last refreshed on: 2026-06-08T13:03:47.798Z
source accessed on: 2019-12-03T20:05:01Z
source last accessed on: 2019-12-03T20:05:01Z
label: Abfall- & Umweltdienste & Ausrüstung @de
label: Equip e serv amb e de resíduos @pt
label: Serv e app rifiuti e ambiente @it
label: Serv/équip environn/déchets @fr
label: Servicios y equipos de desechos y medio ambiente @es
label: Оборуд. и услуги по переработке мусора @ru
label: 废物与环境服务与设备 @zh
label: 廃棄物･環境ｻｰﾋﾞｽ･機器 @ja
label: 廢棄物/環境服務/設備 @zh-hant
label: 폐기물&환경 서비스 장비 @ko
definition: This industry group includes companies that provide environmental control services or manufacture pollution control equipment. Services include waste management, environmental engineering and remediation services.
notation: 1618
valid from: 2014-08-08
valid till: 2020-10-03

Industrials
type: BicsLevel1Sector
type: Classifier
type: NamedIndividual
is anachronous version of: http://data.ga-group.nl/ics/bics/17
is contemporary version of: http://data.ga-group.nl/ics/bics/16
is replaced by: http://data.ga-group.nl/ics/bics/2020/17
is version of: http://data.ga-group.nl/ics/bics/16
is version of: http://data.ga-group.nl/ics/bics/17
imported on: 2026-06-08T13:03:47.798Z
last refreshed on: 2026-06-08T13:03:47.798Z
source accessed on: 2019-12-03T20:05:01Z
source last accessed on: 2019-12-03T20:05:01Z
label: Industriais @pt
label: Industriales @es
label: Industriali @it
label: Industrie @de
label: 工业 @zh
label: 工業 @ja
label: 공산업 @ko
definition: This sector includes companies that manufacture, distribute and provide industrial products and services.
notation: 16
valid from: 2014-08-08
valid till: 2020-10-03

Agricultural Chemical Distr
type: BicsLevel4SubIndustry
type: Classifier
type: Discontinued
type: NamedIndividual
is sub industry of: Agricultural Chemicals
is contemporary version of: http://data.ga-group.nl/ics/bics/17101010
is version of: http://data.ga-group.nl/ics/bics/17101010
imported on: 2026-06-08T13:03:47.798Z
last refreshed on: 2026-06-08T13:03:47.798Z
source accessed on: 2019-12-03T20:05:01Z
source last accessed on: 2019-12-03T20:05:01Z
label: Dist prod químicos agrícolas @pt
label: Distrib prod chimici agr @it
label: Distribución de prod químicos agrícolas @es
label: LaWi-Chemikalienvertrieb @de
label: Produits chimiques agricoles @fr
label: Распр. сельскохоз. химикатов @ru
label: 农用化学品分销 @zh
label: 農業化学品小売･卸売 @ja
label: 農業化學品經銷 @zh-hant
label: 농업용 화학제품 유통 @ko
definition: This industry subgroup includes companies that wholesale-distribute or retail agricultural chemicals to industrial customers. Excludes companies that manufacture agricultural chemicals.
notation: 17101010
valid from: 2014-08-08
valid till: 2020-10-03

Fungicides
type: BicsLevel5Segment
type: Classifier
type: NamedIndividual
is level5 segment of: Crop Chemicals
is anachronous version of: http://data.ga-group.nl/ics/bics/181010101010
is contemporary version of: http://data.ga-group.nl/ics/bics/1710101110
is replaced by: http://data.ga-group.nl/ics/bics/2020/181010101010
is version of: http://data.ga-group.nl/ics/bics/1710101110
is version of: http://data.ga-group.nl/ics/bics/181010101010
imported on: 2026-06-08T13:03:47.798Z
last refreshed on: 2026-06-08T13:03:47.798Z
source accessed on: 2019-12-03T20:05:01Z
source last accessed on: 2019-12-03T20:05:01Z
label: Fongicides @fr
label: Funghicidi @it
label: Fungicidas @es
label: Fungizide @de
label: Фунгициды @ru
label: 杀菌剂 @zh
label: 殺菌剤 @ja
label: 殺菌劑 @zh-hant
label: 살진균제 @ko
definition: This segment includes companies that manufacture fungicides. These chemicals primarily serve the purpose of killing or inhibiting growth of fungi or fungal spores.
notation: 1710101110
valid from: 2014-08-08
valid till: 2020-10-03

Herbicides
type: BicsLevel5Segment
type: Classifier
type: NamedIndividual
is level5 segment of: Crop Chemicals
is anachronous version of: http://data.ga-group.nl/ics/bics/181010101011
is contemporary version of: http://data.ga-group.nl/ics/bics/1710101111
is replaced by: http://data.ga-group.nl/ics/bics/2020/181010101011
is version of: http://data.ga-group.nl/ics/bics/1710101111
is version of: http://data.ga-group.nl/ics/bics/181010101011
imported on: 2026-06-08T13:03:47.798Z
last refreshed on: 2026-06-08T13:03:47.798Z
source accessed on: 2019-12-03T20:05:01Z
source last accessed on: 2019-12-03T20:05:01Z
label: Erbicidi @it
label: Herbicidas @es
label: Herbizide @de
label: Гербициды @ru
label: 除草剂 @zh
label: 除草剤 @ja
label: 除草劑 @zh-hant
label: 제초제 @ko
definition: This segment includes companies that manufacture herbicides. These chemicals primarily serve the purpose of killing or inhibiting growth of unwanted plants.
notation: 1710101111
valid from: 2014-08-08
valid till: 2020-10-03

Insecticides
type: BicsLevel5Segment
type: Classifier
type: NamedIndividual
is level5 segment of: Crop Chemicals
is anachronous version of: http://data.ga-group.nl/ics/bics/181010101012
is contemporary version of: http://data.ga-group.nl/ics/bics/1710101112
is replaced by: http://data.ga-group.nl/ics/bics/2020/181010101012
is version of: http://data.ga-group.nl/ics/bics/1710101112
is version of: http://data.ga-group.nl/ics/bics/181010101012
imported on: 2026-06-08T13:03:47.798Z
last refreshed on: 2026-06-08T13:03:47.798Z
source accessed on: 2019-12-03T20:05:01Z
source last accessed on: 2019-12-03T20:05:01Z
label: Insecticidas @es
label: Insektizide @de
label: Inseticidas @pt
label: Insetticidi @it
label: Инсектициды @ru
label: 杀虫剂 @zh
label: 殺虫剤 @ja
label: 殺蟲劑 @zh-hant
label: 살충제 @ko
definition: This segment includes companies that manufacture insecticides. These chemicals primarily serve the purpose of killing or deterring insects.
notation: 1710101112
valid from: 2014-08-08
valid till: 2020-10-03

Other Crop Chemicals
type: BicsLevel5Segment
type: Classifier
type: Discontinued
type: NamedIndividual
is level5 segment of: Crop Chemicals
is contemporary version of: http://data.ga-group.nl/ics/bics/1710101113
is version of: http://data.ga-group.nl/ics/bics/1710101113
imported on: 2026-06-08T13:03:47.798Z
last refreshed on: 2026-06-08T13:03:47.798Z
source accessed on: 2019-12-03T20:05:01Z
source last accessed on: 2019-12-03T20:05:01Z
label: Altra coltivazione chimici @it
label: Autres prod chim récoltes @fr
label: Otros químicos de cosechas @es
label: Outros prod químicos safra @pt
label: Sonstige Nutzpflanzenchemikalien @de
label: Прочие пестициды @ru
label: その他農薬 @ja
label: 其他作物保护化学品 @zh
label: 其他作物化學品 @zh-hant
label: 기타 작물 화학제품 @ko
definition: This segment includes companies that manufactures crop chemicals not classified elsewhere.
notation: 1710101113
valid from: 2014-08-08
valid till: 2020-10-03

Crop Chemicals
type: BicsLevel4SubIndustry
type: Classifier
type: NamedIndividual
is sub industry of: Agricultural Chemicals
is anachronous version of: http://data.ga-group.nl/ics/bics/1810101010
is contemporary version of: http://data.ga-group.nl/ics/bics/17101011
is replaced by: http://data.ga-group.nl/ics/bics/2020/1810101010
is version of: http://data.ga-group.nl/ics/bics/17101011
is version of: http://data.ga-group.nl/ics/bics/1810101010
imported on: 2026-06-08T13:03:47.798Z
last refreshed on: 2026-06-08T13:03:47.798Z
source accessed on: 2019-12-03T20:05:01Z
source last accessed on: 2019-12-03T20:05:01Z
label: Coltivazione chimici @it
label: Nutzpflanzenchemikalien @de
label: Prod químicos p/safra @pt
label: Produits chimiques récoltes @fr
label: Químicos de cosechas @es
label: Пестициды @ru
label: 作物保护化学品 @zh
label: 作物化學品 @zh-hant
label: 農薬 @ja
label: 작물 화학제품 @ko
definition: This industry subgroup includes companies that manufacture pesticides and other agricultural chemicals with specific applications to crops or plants. These chemicals primarily serve the purpose of preventing, killing or deterring various pests or threats to crops.
notation: 17101011
valid from: 2014-08-08
valid till: 2020-10-03

Fertilizer Blending & Distr
type: BicsLevel5Segment
type: Classifier
type: NamedIndividual
is level5 segment of: Fertilizers
is anachronous version of: http://data.ga-group.nl/ics/bics/181010101110
is contemporary version of: http://data.ga-group.nl/ics/bics/1710101210
is replaced by: http://data.ga-group.nl/ics/bics/2020/181010101110
is version of: http://data.ga-group.nl/ics/bics/1710101210
is version of: http://data.ga-group.nl/ics/bics/181010101110
imported on: 2026-06-08T13:03:47.798Z
last refreshed on: 2026-06-08T13:03:47.798Z
source accessed on: 2019-12-03T20:05:01Z
source last accessed on: 2019-12-03T20:05:01Z
label: Düngermittelmischung & -vertrieb @de
label: Distr e mistura fertilizantes @pt
label: Distrib e miscela fertilizzanti @it
label: Mélange/distrib d'engrais @fr
label: Mezclado y distribución de fertilizantes @es
label: Смешивание и распр. удобрений @ru
label: 肥料混合物分销 @zh
label: 肥料混拌/經銷 @zh-hant
label: 肥料配合･販売 @ja
label: 비료 배합 & 유통 @ko
definition: This segment includes companies that blend and source fertilizer materials and chemicals from suppliers. Excludes companies that manufacture the underlying fertilizer sources.
notation: 1710101210
valid from: 2014-08-08
valid till: 2020-10-03

Nitrogenous Fertilizers
type: BicsLevel5Segment
type: Classifier
type: NamedIndividual
is level5 segment of: Fertilizers
is anachronous version of: http://data.ga-group.nl/ics/bics/181010101111
is contemporary version of: http://data.ga-group.nl/ics/bics/1710101211
is replaced by: http://data.ga-group.nl/ics/bics/2020/181010101111
is version of: http://data.ga-group.nl/ics/bics/1710101211
is version of: http://data.ga-group.nl/ics/bics/181010101111
imported on: 2026-06-08T13:03:47.798Z
last refreshed on: 2026-06-08T13:03:47.798Z
source accessed on: 2019-12-03T20:05:01Z
source last accessed on: 2019-12-03T20:05:01Z
label: Engrais azotés @fr
label: Fertilizantes nitrogenados @es
label: Fertilizzante azotato @it
label: Stickstoffdüngemittel @de
label: Азотные удобрения @ru
label: 氮肥 @zh
label: 窒素質肥料 @ja
label: 질소화학비료 @ko
definition: This segment includes companies that manufacture fertilizers based on nitrogenous materials. Nitrogenous fertilizer materials are typically based on coal, natural gas feedstock, sewage or animal waste.
notation: 1710101211
valid from: 2014-08-08
valid till: 2020-10-03

Phosphate Fertilizers
type: BicsLevel5Segment
type: Classifier
type: NamedIndividual
is level5 segment of: Fertilizers
is anachronous version of: http://data.ga-group.nl/ics/bics/181010101112
is contemporary version of: http://data.ga-group.nl/ics/bics/1710101212
is replaced by: http://data.ga-group.nl/ics/bics/2020/181010101112
is version of: http://data.ga-group.nl/ics/bics/1710101212
is version of: http://data.ga-group.nl/ics/bics/181010101112
imported on: 2026-06-08T13:03:47.798Z
last refreshed on: 2026-06-08T13:03:47.798Z
source accessed on: 2019-12-03T20:05:01Z
source last accessed on: 2019-12-03T20:05:01Z
label: Engrais phosphatés @fr
label: Fertilizantes de fosfato @es
label: Fertilizantes fosfato @pt
label: Fertilizzanti fosfati @it
label: Phosphatdüngemittel @de
label: Фосфорные удобрения @ru
label: 磷肥 @zh
label: 磷酸肥料 @zh-hant
label: 인산염 비료 @ko
label: ﾘﾝ酸肥料 @ja
definition: This segment includes companies that manufacture fertilizers based on phosphoric materials. Includes phosphate rocks, phosphoric acid, superphosphate, mono-ammonium phosphate, di-ammonium phosphate, and ammonium polyphosphate.
notation: 1710101212
valid from: 2014-08-08
valid till: 2020-10-03

Potassium Fertilizers
type: BicsLevel5Segment
type: Classifier
type: NamedIndividual
is level5 segment of: Fertilizers
is anachronous version of: http://data.ga-group.nl/ics/bics/181010101113
is contemporary version of: http://data.ga-group.nl/ics/bics/1710101213
is replaced by: http://data.ga-group.nl/ics/bics/2020/181010101113
is version of: http://data.ga-group.nl/ics/bics/1710101213
is version of: http://data.ga-group.nl/ics/bics/181010101113
imported on: 2026-06-08T13:03:47.798Z
last refreshed on: 2026-06-08T13:03:47.798Z
source accessed on: 2019-12-03T20:05:01Z
source last accessed on: 2019-12-03T20:05:01Z
label: Engrais potassiques @fr
label: Fertilizantes de potasio @es
label: Fertilizantes potássio @pt
label: Fertilizzanti potassio @it
label: Kaliumdüngemittel @de
label: Калиевые удобрения @ru
label: 鉀肥 @zh-hant
label: 钾肥 @zh
label: 칼륨 비료 @ko
label: ｶﾘ肥料 @ja
definition: This segment includes companies that manufacture fertilizers based on potassium-based materials. Includes potash, potassium chloride, and potassium sulphate.
notation: 1710101213
valid from: 2014-08-08
valid till: 2020-10-03

Fertilizers
type: BicsLevel4SubIndustry
type: Classifier
type: NamedIndividual
is sub industry of: Agricultural Chemicals
is anachronous version of: http://data.ga-group.nl/ics/bics/1810101011
is contemporary version of: http://data.ga-group.nl/ics/bics/17101012
is replaced by: http://data.ga-group.nl/ics/bics/2020/1810101011
is version of: http://data.ga-group.nl/ics/bics/17101012
is version of: http://data.ga-group.nl/ics/bics/1810101011
imported on: 2026-06-08T13:03:47.798Z
last refreshed on: 2026-06-08T13:03:47.798Z
source accessed on: 2019-12-03T20:05:01Z
source last accessed on: 2019-12-03T20:05:01Z
label: Düngemittel @de
label: Engrais @fr
label: Fertilizantes @es
label: Fertilizzanti @it
label: Удобрения @ru
label: 肥料 @ja
label: 비료 @ko
definition: This industry subgroup includes companies that manufacture fertilizers. These chemicals primarily serve the purpose of supplying nutrients to plants.
notation: 17101012
valid from: 2014-08-08
valid till: 2020-10-03

Seeds & Agriculture Biotech
type: BicsLevel4SubIndustry
type: Classifier
type: NamedIndividual
is sub industry of: Agricultural Chemicals
is anachronous version of: http://data.ga-group.nl/ics/bics/1810101012
is contemporary version of: http://data.ga-group.nl/ics/bics/17101013
is replaced by: http://data.ga-group.nl/ics/bics/2020/1810101012
is version of: http://data.ga-group.nl/ics/bics/17101013
is version of: http://data.ga-group.nl/ics/bics/1810101012
imported on: 2026-06-08T13:03:47.798Z
last refreshed on: 2026-06-08T13:03:47.798Z
source accessed on: 2019-12-03T20:05:01Z
source last accessed on: 2019-12-03T20:05:01Z
label: Biotech graines et agriculture @fr
label: Biotecnología de semillas y agrícola @es
label: Saatgut und Agrarbiotechnologie @de
label: Sementes e biotecnologia agrícola @pt
label: Semi e agricoltura biotech @it
label: Семена и с/хоз. биотехнологии @ru
label: 种子与农业生物科技 @zh
label: 種子及農業生物科技 @zh-hant
label: 農業ﾊﾞｲｵﾃｯｸ製品 @ja
label: 종자 및 농업 생명공학 @ko
definition: This industry subgroup includes companies that research and develop patented seed and agricultural products. Revenue is primarily realized through biological patents and may include integrated manufacturing or licensing of patents. Includes genetic engineering on seeds and crops.
notation: 17101013
valid from: 2014-08-08
valid till: 2020-10-03

Agricultural Chemicals
type: BicsLevel3Industry
type: Classifier
type: NamedIndividual
is industry of: Chemicals
is anachronous version of: http://data.ga-group.nl/ics/bics/18101010
is contemporary version of: http://data.ga-group.nl/ics/bics/171010
is replaced by: http://data.ga-group.nl/ics/bics/2020/18101010
is version of: http://data.ga-group.nl/ics/bics/171010
is version of: http://data.ga-group.nl/ics/bics/18101010
imported on: 2026-06-08T13:03:47.798Z
last refreshed on: 2026-06-08T13:03:47.798Z
source accessed on: 2019-12-03T20:05:01Z
source last accessed on: 2019-12-03T20:05:01Z
label: LaWi-Chemikalien @de
label: Prod chim agricoles @fr
label: Prod chimici agricoli @it
label: Prod quím agríc @pt
label: Químicos agrícolas @es
label: С/х химикаты @ru
label: 农用化学品 @zh
label: 農業化學品 @zh-hant
label: 農薬 @ja
label: 농업용 화학제품 @ko
definition: This industry includes companies that manufacture chemicals primarily used in agricultural operations.
notation: 171010
valid from: 2014-08-08
valid till: 2020-10-03

Alkalis & Chlorine
type: BicsLevel5Segment
type: Classifier
type: NamedIndividual
is level5 segment of: Inorganic Base Chemicals
is anachronous version of: http://data.ga-group.nl/ics/bics/181010111010
is contemporary version of: http://data.ga-group.nl/ics/bics/1710111010
is replaced by: http://data.ga-group.nl/ics/bics/2020/181010111010
is version of: http://data.ga-group.nl/ics/bics/1710111010
is version of: http://data.ga-group.nl/ics/bics/181010111010
imported on: 2026-06-08T13:03:47.798Z
last refreshed on: 2026-06-08T13:03:47.798Z
source accessed on: 2019-12-03T20:05:01Z
source last accessed on: 2019-12-03T20:05:01Z
label: Alcali e cloro @it
label: Alcalis et chlore @fr
label: Alkali & Chlor @de
label: Álcalis e cloro @pt
label: álcalies y cloro @es
label: Щелочи и хлор @ru
label: 烧碱制造 @zh
label: 鹼性物及氯化物 @zh-hant
label: 알칼리&염기제품 @ko
label: ｱﾙｶﾘ･塩素製品 @ja
definition: This segment includes companies that manufacture chemicals derived from chloralkali chemical processes. Includes chlorine, caustic soda and alkalis.
notation: 1710111010
valid from: 2014-08-08
valid till: 2020-10-03

Bulk Acids
type: BicsLevel5Segment
type: Classifier
type: NamedIndividual
is level5 segment of: Inorganic Base Chemicals
is anachronous version of: http://data.ga-group.nl/ics/bics/181010111011
is contemporary version of: http://data.ga-group.nl/ics/bics/1710111011
is replaced by: http://data.ga-group.nl/ics/bics/2020/181010111011
is version of: http://data.ga-group.nl/ics/bics/1710111011
is version of: http://data.ga-group.nl/ics/bics/181010111011
imported on: 2026-06-08T13:03:47.798Z
last refreshed on: 2026-06-08T13:03:47.798Z
source accessed on: 2019-12-03T20:05:01Z
source last accessed on: 2019-12-03T20:05:01Z
label: Acides en masse @fr
label: Acidi all'ingrosso @it
label: Säure in Bulk @de
label: Ácidos másicos @es
label: Ácidos volume @pt
label: Кислоты оптом @ru
label: 散装酸 @zh
label: 散裝酸 @zh-hant
label: 벌크산 @ko
label: ﾊﾞﾙｸ酸 @ja
definition: This segment includes companies that manufacture inorganic acids. Includes mineral acid, hydrochloric acid, nitric acid, phosphoric acid, sulfuric acid, boric acid, hydrofluoric acid and perchloric acid.
notation: 1710111011
valid from: 2014-08-08
valid till: 2020-10-03

Industrial Gas
type: BicsLevel5Segment
type: Classifier
type: NamedIndividual
is level5 segment of: Inorganic Base Chemicals
is anachronous version of: http://data.ga-group.nl/ics/bics/181010111012
is contemporary version of: http://data.ga-group.nl/ics/bics/1710111012
is replaced by: http://data.ga-group.nl/ics/bics/2020/181010111012
is version of: http://data.ga-group.nl/ics/bics/1710111012
is version of: http://data.ga-group.nl/ics/bics/181010111012
imported on: 2026-06-08T13:03:47.798Z
last refreshed on: 2026-06-08T13:03:47.798Z
source accessed on: 2019-12-03T20:05:01Z
source last accessed on: 2019-12-03T20:05:01Z
label: Gás industrial @pt
label: Gas industrial @es
label: Gaz industriels @fr
label: Industriegase @de
label: Prod gas industriale @it
label: Промышленный газ @ru
label: 工业气体生产 @zh
label: 工業用氣體 @zh-hant
label: 工業用ｶ��ｽ @ja
label: 산업용가스 @ko
definition: This segment includes companies that manufacture industrial organic and inorganic gases in liquid, solid and compressed forms. These gases include basic elemental gases as well as compound gases. Includes carbon dioxide, dry ice, helium, neon, nitrogen and oxygen.
notation: 1710111012
valid from: 2014-08-08
valid till: 2020-10-03

Other Inorganic Base Chemicals
type: BicsLevel5Segment
type: Classifier
type: Discontinued
type: NamedIndividual
is level5 segment of: Inorganic Base Chemicals
is contemporary version of: http://data.ga-group.nl/ics/bics/1710111013
is version of: http://data.ga-group.nl/ics/bics/1710111013
imported on: 2026-06-08T13:03:47.798Z
last refreshed on: 2026-06-08T13:03:47.798Z
source accessed on: 2019-12-03T20:05:01Z
source last accessed on: 2019-12-03T20:05:01Z
label: Altri prodotti chimici inorganici di base @it
label: Autres prod chim inorganiques de base @fr
label: Otros químicos de base inorgánica @es
label: Outros quím base inorgância @pt
label: Sonstige anorganische Basischemikalien @de
label: Прочие хим. продукты с неорг. осн. @ru
label: その他無機化学品 @ja
label: 其他无机基础化工产品 @zh
label: 其他無機化學品 @zh-hant
label: 기타 무기질베이스 화학제품 @ko
definition: This segment includes companies that manufacture non-carbon‒based basic chemicals not classified elsewhere.
notation: 1710111013
valid from: 2014-08-08
valid till: 2020-10-03

Inorganic Base Chemicals
type: BicsLevel4SubIndustry
type: Classifier
type: NamedIndividual
is sub industry of: Basic & Diversified Chemicals
is anachronous version of: http://data.ga-group.nl/ics/bics/1810101110
is contemporary version of: http://data.ga-group.nl/ics/bics/17101110
is replaced by: http://data.ga-group.nl/ics/bics/2020/1810101110
is version of: http://data.ga-group.nl/ics/bics/17101110
is version of: http://data.ga-group.nl/ics/bics/1810101110
imported on: 2026-06-08T13:03:47.798Z
last refreshed on: 2026-06-08T13:03:47.798Z
source accessed on: 2019-12-03T20:05:01Z
source last accessed on: 2019-12-03T20:05:01Z
label: Anorganische Basischemikalien @de
label: Prod chimici inorganici di base @it
label: Prod chimiques base inorganiques @fr
label: Prod químicos base inorgânica @pt
label: Químicos de base inorgánica @es
label: Химические продукты с неорганическим основанием @ru
label: 无机化工基地 @zh
label: 無機化学品 @ja
label: 無機化學品 @zh-hant
label: 무기질베이스 화학제품 @ko
definition: This industry subgroup includes companies that manufacture non-carbon‒based chemicals in high volumes.
notation: 17101110
valid from: 2014-08-08
valid till: 2020-10-03

Alcohols
type: BicsLevel5Segment
type: Classifier
type: NamedIndividual
is level5 segment of: Organic Chem & Intermediates
is anachronous version of: http://data.ga-group.nl/ics/bics/181010111110
is contemporary version of: http://data.ga-group.nl/ics/bics/1710111110
is replaced by: http://data.ga-group.nl/ics/bics/2020/181010111110
is version of: http://data.ga-group.nl/ics/bics/1710111110
is version of: http://data.ga-group.nl/ics/bics/181010111110
imported on: 2026-06-08T13:03:47.798Z
last refreshed on: 2026-06-08T13:03:47.798Z
source accessed on: 2019-12-03T20:05:01Z
source last accessed on: 2019-12-03T20:05:01Z
label: Alcoholes @es
label: Alcool @it
label: Alcools @fr
label: Alkohol @de
label: Álcoois @pt
label: Спирты @ru
label: 酒精 @zh-hant
label: 醇 @zh
label: 알코올 @ko
label: ｱﾙｺｰﾙ @ja
definition: This segment includes companies that manufacture industrial alcohols. Alcohols are a class of chemical compounds. Typically, these are used in transportation fuels. Includes methanol, ethanol and butanol.
notation: 1710111110
valid from: 2014-08-08
valid till: 2020-10-03

Aromatics
type: BicsLevel5Segment
type: Classifier
type: NamedIndividual
is level5 segment of: Organic Chem & Intermediates
is anachronous version of: http://data.ga-group.nl/ics/bics/181010111111
is contemporary version of: http://data.ga-group.nl/ics/bics/1710111111
is replaced by: http://data.ga-group.nl/ics/bics/2020/181010111111
is version of: http://data.ga-group.nl/ics/bics/1710111111
is version of: http://data.ga-group.nl/ics/bics/181010111111
imported on: 2026-06-08T13:03:47.798Z
last refreshed on: 2026-06-08T13:03:47.798Z
source accessed on: 2019-12-03T20:05:01Z
source last accessed on: 2019-12-03T20:05:01Z
label: Aromáticos @es
label: Aromaten @de
label: Aromatici @it
label: Aromatiques @fr
label: Ароматические соединения @ru
label: 芳烃 @zh
label: 芳香族化合物 @ja
label: 芳香烴 @zh-hant
label: 방향제 @ko
definition: This segment includes companies that manufacture aromatics. Aromatics are a type of petrochemical derived from catalytic reforming of naphtha. Includes benzene, toluene and xylenes.
notation: 1710111111
valid from: 2014-08-08
valid till: 2020-10-03

Intermediates
type: BicsLevel5Segment
type: Classifier
type: NamedIndividual
is level5 segment of: Organic Chem & Intermediates
is anachronous version of: http://data.ga-group.nl/ics/bics/181010111112
is contemporary version of: http://data.ga-group.nl/ics/bics/1710111112
is replaced by: http://data.ga-group.nl/ics/bics/2020/181010111112
is version of: http://data.ga-group.nl/ics/bics/1710111112
is version of: http://data.ga-group.nl/ics/bics/181010111112
imported on: 2026-06-08T13:03:47.798Z
last refreshed on: 2026-06-08T13:03:47.798Z
source accessed on: 2019-12-03T20:05:01Z
source last accessed on: 2019-12-03T20:05:01Z
label: Intermédiaires @fr
label: Intermedi @it
label: Intermediários @pt
label: Intermedios @es
label: Zwischenprodukte @de
label: Промежуточные продукты @ru
label: 中間品 @zh-hant
label: 中间体 @zh
label: 媒介物 @ja
label: 중간재 @ko
definition: This segment includes companies that manufacture intermediates. Intermediates are a type of petrochemical produced from stream cracker plants. These are chemicals typically derived from aromatics and olefins. Includes toluene, diisocyanate, vinyl acetate, styrene, ethylene, dichloride, and propylene oxide.
notation: 1710111112
valid from: 2014-08-08
valid till: 2020-10-03

Olefins
type: BicsLevel5Segment
type: Classifier
type: NamedIndividual
is level5 segment of: Organic Chem & Intermediates
is anachronous version of: http://data.ga-group.nl/ics/bics/181010111113
is contemporary version of: http://data.ga-group.nl/ics/bics/1710111113
is replaced by: http://data.ga-group.nl/ics/bics/2020/181010111113
is version of: http://data.ga-group.nl/ics/bics/1710111113
is version of: http://data.ga-group.nl/ics/bics/181010111113
imported on: 2026-06-08T13:03:47.798Z
last refreshed on: 2026-06-08T13:03:47.798Z
source accessed on: 2019-12-03T20:05:01Z
source last accessed on: 2019-12-03T20:05:01Z
label: Alcènes @fr
label: Olefinas @es
label: Olefine @de
label: Olefini @it
label: Олефины @ru
label: 烯烃 @zh
label: 烯烴 @zh-hant
label: 올레핀 @ko
label: ｵﾚﾌｨﾝ @ja
definition: This segment includes companies that manufacture olefins. Olefins are a type of petrochemical. Includes ethylene, propylene and butadiene.
notation: 1710111113
valid from: 2014-08-08
valid till: 2020-10-03

Carbon Black
type: BicsLevel6Segment
type: Classifier
type: NamedIndividual
is level6 segment of: Other Organic Base Chemicals
is anachronous version of: http://data.ga-group.nl/ics/bics/18101011111410
is contemporary version of: http://data.ga-group.nl/ics/bics/171011111410
is replaced by: http://data.ga-group.nl/ics/bics/2020/18101011111410
is version of: http://data.ga-group.nl/ics/bics/171011111410
is version of: http://data.ga-group.nl/ics/bics/18101011111410
imported on: 2026-06-08T13:03:47.798Z
last refreshed on: 2026-06-08T13:03:47.798Z
source accessed on: 2019-12-03T20:05:01Z
source last accessed on: 2019-12-03T20:05:01Z
label: Carbone nero @it
label: Carbono negro @es
label: Fuligem @pt
label: Noir de carbone @fr
label: Rußschwarz @de
label: Сажа @ru
label: 碳粉制造 @zh
label: 碳黑製品 @zh-hant
label: 카본블랙 제조업 @ko
label: ｶｰﾎﾞﾝﾌﾞﾗｯｸ @ja
definition: This segment includes companies that manufacture carbon black as well as bone black and lamp black. These are typically charred or soot by-products.
notation: 171011111410
valid from: 2014-08-08
valid till: 2020-10-03

Cyclic Crude & Intermed
type: BicsLevel6Segment
type: Classifier
type: NamedIndividual
is level6 segment of: Other Organic Base Chemicals
is anachronous version of: http://data.ga-group.nl/ics/bics/18101011111411
is contemporary version of: http://data.ga-group.nl/ics/bics/171011111411
is replaced by: http://data.ga-group.nl/ics/bics/2020/18101011111411
is version of: http://data.ga-group.nl/ics/bics/171011111411
is version of: http://data.ga-group.nl/ics/bics/18101011111411
imported on: 2026-06-08T13:03:47.798Z
last refreshed on: 2026-06-08T13:03:47.798Z
source accessed on: 2019-12-03T20:05:01Z
source last accessed on: 2019-12-03T20:05:01Z
label: Bruto cíclico e intermediário @pt
label: Crudo cíclico e intermedio @es
label: Greggio e intermed ciclici @it
label: Pétrole cycliques bruts/interméd @fr
label: Zykl. Roh- & Zwischenprodukte @de
label: Циклич. углевод. и полуфабрик. @ru
label: 原型/中型環狀化學品 @zh-hant
label: 环状原料与中间产品 @zh
label: 環式中間物 @ja
label: 순환원유&중간재 @ko
definition: This segment includes companies that distill coal tars and/or manufacture cyclic derivative products from refined petroleum or natural gas. Includes FCC tar, coal tar, and ethylene cracking tar. Excludes asphalt by-products (See Asphalt).
notation: 171011111411
valid from: 2014-08-08
valid till: 2020-10-03

Gum & Wood
type: BicsLevel6Segment
type: Classifier
type: NamedIndividual
is level6 segment of: Other Organic Base Chemicals
is anachronous version of: http://data.ga-group.nl/ics/bics/18101011111412
is contemporary version of: http://data.ga-group.nl/ics/bics/171011111412
is replaced by: http://data.ga-group.nl/ics/bics/2020/18101011111412
is version of: http://data.ga-group.nl/ics/bics/171011111412
is version of: http://data.ga-group.nl/ics/bics/18101011111412
imported on: 2026-06-08T13:03:47.798Z
last refreshed on: 2026-06-08T13:03:47.798Z
source accessed on: 2019-12-03T20:05:01Z
source last accessed on: 2019-12-03T20:05:01Z
label: Goma e madeira @pt
label: Goma y madera @es
label: Gomma e legno @it
label: Gummi & Holz @de
label: Résines/bois @fr
label: Смолы и древесина @ru
label: 天然樹脂木材化学品 @ja
label: 树脂及林产化学品制造 @zh
label: 樹膠及樹木 @zh-hant
label: 수지&목재 @ko
definition: This segment includes companies that distill wood or gum from plants into products. Includes navel stores, natural tanning materials, charcoal briquettes and charcoal.
notation: 171011111412
valid from: 2014-08-08
valid till: 2020-10-03

Other Organic Base Chemicals
type: BicsLevel5Segment
type: Classifier
type: NamedIndividual
is level5 segment of: Organic Chem & Intermediates
is anachronous version of: http://data.ga-group.nl/ics/bics/181010111114
is contemporary version of: http://data.ga-group.nl/ics/bics/1710111114
is replaced by: http://data.ga-group.nl/ics/bics/2020/181010111114
is version of: http://data.ga-group.nl/ics/bics/1710111114
is version of: http://data.ga-group.nl/ics/bics/181010111114
imported on: 2026-06-08T13:03:47.798Z
last refreshed on: 2026-06-08T13:03:47.798Z
source accessed on: 2019-12-03T20:05:01Z
source last accessed on: 2019-12-03T20:05:01Z
label: Autres prod chim organiques de base @fr
label: Otros químicos de base orgánicos @es
label: Outros químicos de base orgânica @pt
label: Prod chimici organici-Altro @it
label: Sonstige organische Basischemikalien @de
label: Другие органические химикаты @ru
label: その他有機化学品 @ja
label: 其他有机化学基础材料 @zh
label: 其他有機化學品 @zh-hant
label: 기타 유기 기초화학제품 @ko
definition: This segment includes companies that manufacture organic chemicals not classified elsewhere.
notation: 1710111114
valid from: 2014-08-08
valid till: 2020-10-03

Organic Chem & Intermediates
type: BicsLevel4SubIndustry
type: Classifier
type: NamedIndividual
is sub industry of: Basic & Diversified Chemicals
is anachronous version of: http://data.ga-group.nl/ics/bics/1810101111
is contemporary version of: http://data.ga-group.nl/ics/bics/17101111
is replaced by: http://data.ga-group.nl/ics/bics/2020/1810101111
is version of: http://data.ga-group.nl/ics/bics/17101111
is version of: http://data.ga-group.nl/ics/bics/1810101111
imported on: 2026-06-08T13:03:47.798Z
last refreshed on: 2026-06-08T13:03:47.798Z
source accessed on: 2019-12-03T20:05:01Z
source last accessed on: 2019-12-03T20:05:01Z
label: Organische Chem. & Zwischenprodukte @de
label: Prod chim base/intermédiaires @fr
label: Prod chimici intermedi e organici @it
label: Prod químicos base orgânica e intermed @pt
label: Químicos e intermediarios orgánicos @es
label: Хим. продукты с орган. основ. и промеж. продукты @ru
label: 有机化学品与中间体 @zh
label: 有機化學品及中間品 @zh-hant
label: 유기 화학제품 & 중간체 @ko
label: ���機化学品･中間製品 @ja
definition: This industry subgroup includes companies that manufacture carbon-based chemicals in high volumes. Most of these chemicals are derived from organic sources such as petroleum (petrochemicals).
notation: 17101111
valid from: 2014-08-08
valid till: 2020-10-03

Cellulosic Organic Fiber
type: BicsLevel6Segment
type: Classifier
type: NamedIndividual
is level6 segment of: Artificial Fibers & Filaments
is anachronous version of: http://data.ga-group.nl/ics/bics/18101011121010
is contemporary version of: http://data.ga-group.nl/ics/bics/171011121010
is replaced by: http://data.ga-group.nl/ics/bics/2020/18101011121010
is version of: http://data.ga-group.nl/ics/bics/171011121010
is version of: http://data.ga-group.nl/ics/bics/18101011121010
imported on: 2026-06-08T13:03:47.798Z
last refreshed on: 2026-06-08T13:03:47.798Z
source accessed on: 2019-12-03T20:05:01Z
source last accessed on: 2019-12-03T20:05:01Z
label: Fibra orgánica celulósica @es
label: Fibra orgânica de celulose @pt
label: Fibre cellulosiche @it
label: Fibres organiques cellulosiques @fr
label: Zellulosehaltige organische Fasern @de
label: Целлюлозное органическое волокно @ru
label: 有機纖維素纖維 @zh-hant
label: 纤维质有机纤维 @zh
label: 섬유소 유기 섬유 @ko
label: ｾﾙﾛｰｽ系有機繊維 @ja
definition: This segment includes companies that manufacture fibers from organic sources. Includes cigarette tow, viscose fibers, yarn, and acetate fibers. Excludes fibers that are produced naturally in nature, such as fibers from cotton or wool (See Fiber, Yarn & Thread Mfg).
notation: 171011121010
valid from: 2014-08-08
valid till: 2020-10-03

Non-Cellulosic Organic Fiber
type: BicsLevel6Segment
type: Classifier
type: NamedIndividual
is level6 segment of: Artificial Fibers & Filaments
is anachronous version of: http://data.ga-group.nl/ics/bics/18101011121011
is contemporary version of: http://data.ga-group.nl/ics/bics/171011121011
is replaced by: http://data.ga-group.nl/ics/bics/2020/18101011121011
is version of: http://data.ga-group.nl/ics/bics/171011121011
is version of: http://data.ga-group.nl/ics/bics/18101011121011
imported on: 2026-06-08T13:03:47.798Z
last refreshed on: 2026-06-08T13:03:47.798Z
source accessed on: 2019-12-03T20:05:01Z
source last accessed on: 2019-12-03T20:05:01Z
label: Fibra orgánica no celulósica @es
label: Fibras orgânicas não celulósicas @pt
label: Fibre non cellulosiche @it
label: Fibres organiques non cellulosiques @fr
label: Nichtzellulosehaltige organische Fasern @de
label: Нецеллюлозное органическое волокно @ru
label: 有機非纖維素纖維 @zh-hant
label: 非纤维质有机纤维 @zh
label: 非ｾﾙﾛｰｽ系有機繊維 @ja
label: 비섬유소 유기 섬유 @ko
definition: This segment includes companies that manufacture fibers from inorganic sources. Includes vinyl, nylon, polyester and carbon.
notation: 171011121011
valid from: 2014-08-08
valid till: 2020-10-03

Artificial Fibers & Filaments
type: BicsLevel5Segment
type: Classifier
type: NamedIndividual
is level5 segment of: Organic Resins, Fibers & Rubber
is anachronous version of: http://data.ga-group.nl/ics/bics/181010111210
is contemporary version of: http://data.ga-group.nl/ics/bics/1710111210
is replaced by: http://data.ga-group.nl/ics/bics/2020/181010111210
is version of: http://data.ga-group.nl/ics/bics/1710111210
is version of: http://data.ga-group.nl/ics/bics/181010111210
imported on: 2026-06-08T13:03:47.798Z
last refreshed on: 2026-06-08T13:03:47.798Z
source accessed on: 2019-12-03T20:05:01Z
source last accessed on: 2019-12-03T20:05:01Z
label: Fibras e filamentos artificiais @pt
label: Fibras y filamentos artificiales @es
label: Fibre, fili artificiali @it
label: Fibres/filaments artificiels @fr
label: Textilfasern & Filamente @de
label: Искусственное волокно и нити @ru
label: 人工･合成繊維/ﾌｨﾗﾒﾝﾄ @ja
label: 人造纖維及長纖 @zh-hant
label: 人造纤维及长丝 @zh
label: 인조섬유 & 필라멘트 @ko
definition: This segment includes companies that manufacture standardized fibers. Typically, these fibers are used for further processing in textiles or composites.
notation: 1710111210
valid from: 2014-08-08
valid till: 2020-10-03

Organic Resins
type: BicsLevel5Segment
type: Classifier
type: NamedIndividual
is level5 segment of: Organic Resins, Fibers & Rubber
is anachronous version of: http://data.ga-group.nl/ics/bics/181010111211
is contemporary version of: http://data.ga-group.nl/ics/bics/1710111211
is replaced by: http://data.ga-group.nl/ics/bics/2020/181010111211
is version of: http://data.ga-group.nl/ics/bics/1710111211
is version of: http://data.ga-group.nl/ics/bics/181010111211
imported on: 2026-06-08T13:03:47.798Z
last refreshed on: 2026-06-08T13:03:47.798Z
source accessed on: 2019-12-03T20:05:01Z
source last accessed on: 2019-12-03T20:05:01Z
label: Organische Harze @de
label: Résines organiques @fr
label: Resinas orgánicas @es
label: Resinas orgân @pt
label: Resine organiche @it
label: Органическая смола @ru
label: 有机树脂 @zh
label: 有機樹脂 @ja
label: 유기 수지 @ko
definition: This segment includes companies that manufacture organic resins. These resins are most commonly used in the production of plastics. Includes allyl, amino, cellulose, cresol, and polystyrene.
notation: 1710111211
valid from: 2014-08-08
valid till: 2020-10-03

Synthetic Rubber
type: BicsLevel5Segment
type: Classifier
type: NamedIndividual
is level5 segment of: Organic Resins, Fibers & Rubber
is anachronous version of: http://data.ga-group.nl/ics/bics/181010111212
is contemporary version of: http://data.ga-group.nl/ics/bics/1710111212
is replaced by: http://data.ga-group.nl/ics/bics/2020/181010111212
is version of: http://data.ga-group.nl/ics/bics/1710111212
is version of: http://data.ga-group.nl/ics/bics/181010111212
imported on: 2026-06-08T13:03:47.798Z
last refreshed on: 2026-06-08T13:03:47.798Z
source accessed on: 2019-12-03T20:05:01Z
source last accessed on: 2019-12-03T20:05:01Z
label: Borracha sintética @pt
label: Caoutchouc synthétique @fr
label: Goma sintética @es
label: Gomma sintetica @it
label: Kunstkautschuk @de
label: Синтетический каучук @ru
label: 合成橡胶制造 @zh
label: 合成橡膠 @zh-hant
label: 合成ｺﾞﾑ製造 @ja
label: 합성고무 @ko
definition: This segment includes companies that manufacture synthetic rubber. Includes elastomers, polyethylene rubber, urethane rubber, N-type rubber, S-type rubber and vulcanized oils.
notation: 1710111212
valid from: 2014-08-08
valid till: 2020-10-03

Organic Resins, Fibers & Rubber
type: BicsLevel4SubIndustry
type: Classifier
type: NamedIndividual
is sub industry of: Basic & Diversified Chemicals
is anachronous version of: http://data.ga-group.nl/ics/bics/1810101112
is contemporary version of: http://data.ga-group.nl/ics/bics/17101112
is replaced by: http://data.ga-group.nl/ics/bics/2020/1810101112
is version of: http://data.ga-group.nl/ics/bics/17101112
is version of: http://data.ga-group.nl/ics/bics/1810101112
imported on: 2026-06-08T13:03:47.798Z
last refreshed on: 2026-06-08T13:03:47.798Z
source accessed on: 2019-12-03T20:05:01Z
source last accessed on: 2019-12-03T20:05:01Z
label: Organische Harze, Fasern, & Gummi @de
label: Résines organiques/fibres/caoutchouc @fr
label: Resinas orgân, fibras, borracha @pt
label: Resinas, fibras y hule orgánicos @es
label: Resine organiche, fibre e gomma @it
label: Органич. смолы, волокна, каучук и произв. @ru
label: 有机树脂、纤维及橡胶 @zh
label: 有機樹脂/纖維/橡膠 @zh-hant
label: 有機樹脂､繊維､ｺﾞﾑ及び派生物 @ja
label: 유기수지, 섬유 & 고무 @ko
definition: This industry subgroup includes companies that manufacture fibers and chemicals used in various forms of plastics or rubbers.
notation: 17101112
valid from: 2014-08-08
valid till: 2020-10-03

Basic & Diversified Chemicals
type: BicsLevel3Industry
type: Classifier
type: NamedIndividual
is industry of: Chemicals
is anachronous version of: http://data.ga-group.nl/ics/bics/18101011
is contemporary version of: http://data.ga-group.nl/ics/bics/171011
is replaced by: http://data.ga-group.nl/ics/bics/2020/18101011
is version of: http://data.ga-group.nl/ics/bics/171011
is version of: http://data.ga-group.nl/ics/bics/18101011
imported on: 2026-06-08T13:03:47.798Z
last refreshed on: 2026-06-08T13:03:47.798Z
source accessed on: 2019-12-03T20:05:01Z
source last accessed on: 2019-12-03T20:05:01Z
label: Basische & diversifizierte Chemikalien @de
label: Chimici di base e diversificati @it
label: Prod chim base/diversifiés @fr
label: Prod quím básic e divers @pt
label: Prod quim bás/div @es
label: Осн. и многоотр. хим. продукты @ru
label: 基本及多元化學品 @zh-hant
label: 基本及多种化学制品 @zh
label: 基礎･���合化学品 @ja
label: 기초 및 다각화된 화학제품 @ko
definition: This industry includes companies that manufacture basic component chemicals or intermediaries in high volumes. These companies typically produce chemicals that are undifferentiated and commoditized.
notation: 171011
valid from: 2014-08-08
valid till: 2020-10-03

Adhesives & Sealants
type: BicsLevel4SubIndustry
type: Classifier
type: NamedIndividual
is sub industry of: Specialty Chemicals
is anachronous version of: http://data.ga-group.nl/ics/bics/1810101210
is contemporary version of: http://data.ga-group.nl/ics/bics/17101210
is replaced by: http://data.ga-group.nl/ics/bics/2020/1810101210
is version of: http://data.ga-group.nl/ics/bics/17101210
is version of: http://data.ga-group.nl/ics/bics/1810101210
imported on: 2026-06-08T13:03:47.798Z
last refreshed on: 2026-06-08T13:03:47.798Z
source accessed on: 2019-12-03T20:05:01Z
source last accessed on: 2019-12-03T20:05:01Z
label: Adesivi e collanti @it
label: Adesivos e selantes @pt
label: Adhesivos y selladores @es
label: Colles et mastics @fr
label: Klebstoffe & Versieglungsmaterial @de
label: Клеящие вещества и герметики @ru
label: 接着剤･ｼｰﾘﾝｸﾞ剤 @ja
label: 胶粘剂和密封剂 @zh
label: 黏著劑及密封劑 @zh-hant
label: 접착제 & 방수제 @ko
definition: This industry subgroup includes companies that manufacture chemicals with the purpose of binding or sealing. Includes adhesives, glues and caulks.
notation: 17101210
valid from: 2014-08-08
valid till: 2020-10-03

Advanced Ceramics
type: BicsLevel5Segment
type: Classifier
type: NamedIndividual
is level5 segment of: Advanced Materials
is anachronous version of: http://data.ga-group.nl/ics/bics/181010121110
is contemporary version of: http://data.ga-group.nl/ics/bics/1710121110
is replaced by: http://data.ga-group.nl/ics/bics/2020/181010121110
is version of: http://data.ga-group.nl/ics/bics/1710121110
is version of: http://data.ga-group.nl/ics/bics/181010121110
imported on: 2026-06-08T13:03:47.798Z
last refreshed on: 2026-06-08T13:03:47.798Z
source accessed on: 2019-12-03T20:05:01Z
source last accessed on: 2019-12-03T20:05:01Z
label: Céramiques avancées @fr
label: Cerâmicas avançadas @pt
label: Ceramica avanzata @it
label: Moderne Keramik @de
label: Prod avanz cerámica @es
label: Изделия из высококачеств. керамики @ru
label: 先端ｾﾗﾐｯｸ製品 @ja
label: 高級陶瓷品 @zh-hant
label: 高级陶瓷品 @zh
label: 첨단세라믹 제품 @ko
definition: This segment includes companies that manufacture ceramic products that are designed to be highly impact or heat resistant. Includes ceramic armor and insulation.
notation: 1710121110
valid from: 2014-08-08
valid till: 2020-10-03

Carbon Fiber
type: BicsLevel5Segment
type: Classifier
type: NamedIndividual
is level5 segment of: Advanced Materials
is anachronous version of: http://data.ga-group.nl/ics/bics/181010121111
is contemporary version of: http://data.ga-group.nl/ics/bics/1710121111
is replaced by: http://data.ga-group.nl/ics/bics/2020/181010121111
is version of: http://data.ga-group.nl/ics/bics/1710121111
is version of: http://data.ga-group.nl/ics/bics/181010121111
imported on: 2026-06-08T13:03:47.798Z
last refreshed on: 2026-06-08T13:03:47.798Z
source accessed on: 2019-12-03T20:05:01Z
source last accessed on: 2019-12-03T20:05:01Z
label: Fibra de carbón @es
label: Fibra de carbono @pt
label: Fibre carbonio @it
label: Fibres de carbone @fr
label: Kohlefasern @de
label: Углеродное волокно @ru
label: 炭素繊維 @ja
label: 碳纖維 @zh-hant
label: 碳纤维 @zh
label: 탄소 섬유 @ko
definition: This segment includes companies that manufacture carbon fiber. Carbon fiber is a specific type of composite composed of polymer resins and carbon fibers.
notation: 1710121111
valid from: 2014-08-08
valid till: 2020-10-03

Composite
type: BicsLevel5Segment
type: Classifier
type: NamedIndividual
is level5 segment of: Advanced Materials
is anachronous version of: http://data.ga-group.nl/ics/bics/181010121112
is contemporary version of: http://data.ga-group.nl/ics/bics/1710121112
is replaced by: http://data.ga-group.nl/ics/bics/2020/181010121112
is version of: http://data.ga-group.nl/ics/bics/1710121112
is version of: http://data.ga-group.nl/ics/bics/181010121112
imported on: 2026-06-08T13:03:47.798Z
last refreshed on: 2026-06-08T13:03:47.798Z
source accessed on: 2019-12-03T20:05:01Z
source last accessed on: 2019-12-03T20:05:01Z
label: Composites
label: Composti @it
label: Compostos @pt
label: Композитные материалы @ru
label: 合成物 @zh-hant
label: 复合材料 @zh
label: 総合製造 @ja
label: 복합소재 제조업 @ko
definition: This segment includes companies that manufacture materials based on blended components not classified elsewhere.
notation: 1710121112
valid from: 2014-08-08
valid till: 2020-10-03

Engineering Plastics
type: BicsLevel5Segment
type: Classifier
type: NamedIndividual
is level5 segment of: Advanced Materials
is anachronous version of: http://data.ga-group.nl/ics/bics/181010121113
is contemporary version of: http://data.ga-group.nl/ics/bics/1710121113
is replaced by: http://data.ga-group.nl/ics/bics/2020/181010121113
is version of: http://data.ga-group.nl/ics/bics/1710121113
is version of: http://data.ga-group.nl/ics/bics/181010121113
imported on: 2026-06-08T13:03:47.798Z
last refreshed on: 2026-06-08T13:03:47.798Z
source accessed on: 2019-12-03T20:05:01Z
source last accessed on: 2019-12-03T20:05:01Z
label: Ingegneria plastiche @it
label: Plásticos de ingeniería @es
label: Plásticos engenharia @pt
label: Plastiques d'ingénierie @fr
label: Technisierter Kunststoff @de
label: Конструкционные полимеры @ru
label: 工程塑料 @zh
label: 工程塑膠 @zh-hant
label: 엔지니어링 플라스틱 @ko
label: ｴﾝｼﾞﾆｱﾘﾝｸﾞﾌﾟﾗｽﾁｯｸ @ja
definition: This segment includes companies that manufacture plastic materials with greater strength and heat resistance as compared with commodity plastics. These materials are often used to replace metals due to their lighter weight.
notation: 1710121113
valid from: 2014-08-08
valid till: 2020-10-03

Graphite Products
type: BicsLevel5Segment
type: Classifier
type: NamedIndividual
is level5 segment of: Advanced Materials
is anachronous version of: http://data.ga-group.nl/ics/bics/181010121114
is contemporary version of: http://data.ga-group.nl/ics/bics/1710121114
is replaced by: http://data.ga-group.nl/ics/bics/2020/181010121114
is version of: http://data.ga-group.nl/ics/bics/1710121114
is version of: http://data.ga-group.nl/ics/bics/181010121114
imported on: 2026-06-08T13:03:47.798Z
last refreshed on: 2026-06-08T13:03:47.798Z
source accessed on: 2019-12-03T20:05:01Z
source last accessed on: 2019-12-03T20:05:01Z
label: Graphitprodukte @de
label: Prodotti in grafite @it
label: Productos de grafito @es
label: Produits en graphite @fr
label: Produtos de grafite @pt
label: Товары из графита @ru
label: 石墨产品 @zh
label: 石墨產品 @zh-hant
label: 黒鉛製品 @ja
label: 흑연제품 @ko
definition: This segment includes companies that manufacture graphite products. Includes electrodes and pencil graphite.
notation: 1710121114
valid from: 2014-08-08
valid till: 2020-10-03

Nanotechnology
type: BicsLevel5Segment
type: Classifier
type: NamedIndividual
is level5 segment of: Advanced Materials
is anachronous version of: http://data.ga-group.nl/ics/bics/181010121115
is contemporary version of: http://data.ga-group.nl/ics/bics/1710121115
is replaced by: http://data.ga-group.nl/ics/bics/2020/181010121115
is version of: http://data.ga-group.nl/ics/bics/1710121115
is version of: http://data.ga-group.nl/ics/bics/181010121115
imported on: 2026-06-08T13:03:47.798Z
last refreshed on: 2026-06-08T13:03:47.798Z
source accessed on: 2019-12-03T20:05:01Z
source last accessed on: 2019-12-03T20:05:01Z
label: Nanotechnologie @de
label: Nanotecnología @es
label: Nanotecnologia @it
label: Нанотехнологии @ru
label: 奈米科技 @zh-hant
label: 纳米技术和纳米材料 @zh
label: 나노기술 @ko
label: ﾅﾉﾃｸﾉﾛｼﾞｰ @ja
definition: This segment includes companies that manufacture extremely small materials sometimes used to improve the characteristics of another material. Includes nanomaterials. Excludes nanotechnology used for medical purposes.
notation: 1710121115
valid from: 2014-08-08
valid till: 2020-10-03

Special Coated Metals
type: BicsLevel5Segment
type: Classifier
type: NamedIndividual
is level5 segment of: Advanced Materials
is anachronous version of: http://data.ga-group.nl/ics/bics/181010121116
is contemporary version of: http://data.ga-group.nl/ics/bics/1710121116
is replaced by: http://data.ga-group.nl/ics/bics/2020/181010121116
is version of: http://data.ga-group.nl/ics/bics/1710121116
is version of: http://data.ga-group.nl/ics/bics/181010121116
imported on: 2026-06-08T13:03:47.798Z
last refreshed on: 2026-06-08T13:03:47.798Z
source accessed on: 2019-12-03T20:05:01Z
source last accessed on: 2019-12-03T20:05:01Z
label: Métaux spéciaux revêtus @fr
label: Metais de revestimento especial @pt
label: Metales cubiertos especiales @es
label: Metalli rivest speciali @it
label: Spezifische beschichtete Metalle @de
label: Металлы со специальным покрытием @ru
label: 特殊塗装金属 @ja
label: 特殊鍍膜金屬 @zh-hant
label: 特殊镀膜金属 @zh
label: 특수 코팅 금속 @ko
definition: This segment includes companies that manufacture metals that have been bonded or coated using advanced processes designed to increase anti-abrasive and corrosive properties or to improve resistance to heat.
notation: 1710121116
valid from: 2014-08-08
valid till: 2020-10-03

Other Advanced Materials
type: BicsLevel5Segment
type: Classifier
type: Discontinued
type: NamedIndividual
is level5 segment of: Advanced Materials
is contemporary version of: http://data.ga-group.nl/ics/bics/1710121117
is version of: http://data.ga-group.nl/ics/bics/1710121117
imported on: 2026-06-08T13:03:47.798Z
last refreshed on: 2026-06-08T13:03:47.798Z
source accessed on: 2019-12-03T20:05:01Z
source last accessed on: 2019-12-03T20:05:01Z
label: Altri materiali avanzati @it
label: Autres matériaux avancés @fr
label: Otros materiales avanzados @es
label: Outros materiais avançados @pt
label: Sonstige moderne Materialien @de
label: Прочие современные материалы @ru
label: その他先端材料 @ja
label: 其他先进材料 @zh
label: 기타 첨단재료 @ko
label: ���他先進材料 @zh-hant
definition: This segment includes companies that manufacture other advanced materials not classified elsewhere.
notation: 1710121117
valid from: 2014-08-08
valid till: 2020-10-03

Advanced Materials
type: BicsLevel4SubIndustry
type: Classifier
type: NamedIndividual
is sub industry of: Specialty Chemicals
is anachronous version of: http://data.ga-group.nl/ics/bics/1810101211
is contemporary version of: http://data.ga-group.nl/ics/bics/17101211
is replaced by: http://data.ga-group.nl/ics/bics/2020/1810101211
is version of: http://data.ga-group.nl/ics/bics/17101211
is version of: http://data.ga-group.nl/ics/bics/1810101211
imported on: 2026-06-08T13:03:47.798Z
last refreshed on: 2026-06-08T13:03:47.798Z
source accessed on: 2019-12-03T20:05:01Z
source last accessed on: 2019-12-03T20:05:01Z
label: Matériaux avancés @fr
label: Materiais avançados @pt
label: Materiales avanzados @es
label: Materiali avanzati @it
label: Moderne Materialien @de
label: Современные материалы @ru
label: 先端材料 @ja
label: 先進材料 @zh-hant
label: 高级材料 @zh
label: 첨단재료 @ko
definition: This industry subgroup includes companies that manufacture advanced materials. Advanced materials typically have highly engineered properties.
notation: 17101211
valid from: 2014-08-08
valid till: 2020-10-03

Catalysts
type: BicsLevel4SubIndustry
type: Classifier
type: NamedIndividual
is sub industry of: Specialty Chemicals
is anachronous version of: http://data.ga-group.nl/ics/bics/1810101212
is contemporary version of: http://data.ga-group.nl/ics/bics/17101212
is replaced by: http://data.ga-group.nl/ics/bics/2020/1810101212
is version of: http://data.ga-group.nl/ics/bics/17101212
is version of: http://data.ga-group.nl/ics/bics/1810101212
imported on: 2026-06-08T13:03:47.798Z
last refreshed on: 2026-06-08T13:03:47.798Z
source accessed on: 2019-12-03T20:05:01Z
source last accessed on: 2019-12-03T20:05:01Z
label: Catalisadores @pt
label: Catalizadores @es
label: Catalizzatori @it
label: Catalyseurs @fr
label: Katalysatoren @de
label: Катализаторы @ru
label: 催化剂 @zh
label: 催化劑 @zh-hant
label: 触媒素材 @ja
label: 촉매제 @ko
definition: This industry subgroup includes companies that manufacture inorganic or organic catalysts commonly used for refinery processes, automotive emissions control, and other feedstock and chemicals processing.
notation: 17101212
valid from: 2014-08-08
valid till: 2020-10-03

Consumer Retail Chemicals
type: BicsLevel4SubIndustry
type: Classifier
type: NamedIndividual
is sub industry of: Specialty Chemicals
is anachronous version of: http://data.ga-group.nl/ics/bics/1810101213
is contemporary version of: http://data.ga-group.nl/ics/bics/17101213
is replaced by: http://data.ga-group.nl/ics/bics/2020/1810101213
is version of: http://data.ga-group.nl/ics/bics/17101213
is version of: http://data.ga-group.nl/ics/bics/1810101213
imported on: 2026-06-08T13:03:47.798Z
last refreshed on: 2026-06-08T13:03:47.798Z
source accessed on: 2019-12-03T20:05:01Z
source last accessed on: 2019-12-03T20:05:01Z
label: Chimici al consumo @it
label: Menudeo de químicos @es
label: Prod quím p/consumidor varejo @pt
label: Produits chimiques vendus au détail @fr
label: Verbraucherchemikalien @de
label: Потребительские розничные хим. продукты @ru
label: 消費者用化学品小売 @ja
label: 消費零售化學品 @zh-hant
label: 消费零售-化学品 @zh
label: 소비자 소매 화학제품 @ko
definition: This industry subgroup includes companies that manufacture chemicals for retail consumer applications rather than commercial uses.
notation: 17101213
valid from: 2014-08-08
valid till: 2020-10-03

Electronic Chemicals
type: BicsLevel4SubIndustry
type: Classifier
type: NamedIndividual
is sub industry of: Specialty Chemicals
is anachronous version of: http://data.ga-group.nl/ics/bics/1810101214
is contemporary version of: http://data.ga-group.nl/ics/bics/17101214
is replaced by: http://data.ga-group.nl/ics/bics/2020/1810101214
is version of: http://data.ga-group.nl/ics/bics/17101214
is version of: http://data.ga-group.nl/ics/bics/1810101214
imported on: 2026-06-08T13:03:47.798Z
last refreshed on: 2026-06-08T13:03:47.798Z
source accessed on: 2019-12-03T20:05:01Z
source last accessed on: 2019-12-03T20:05:01Z
label: Chimici elettronici @it
label: Elektronische Chemikalien @de
label: Prod chim pour électronique @fr
label: Prod químicos eletr @pt
label: Químicos electrónicos @es
label: Электронные химикаты @ru
label: 电子化学品 @zh
label: 電子化学品 @ja
label: 電子化學品 @zh-hant
label: 전자 화학제품 @ko
definition: This industry subgroup includes companies that manufacture functional chemicals primarily used by the electronics industry. These chemicals are often used for production of memory, integrated circuits, displays and other electronic components. Excludes chemicals used as a feedstock for semiconductors (see Assembly Materials & Solutions).
notation: 17101214
valid from: 2014-08-08
valid till: 2020-10-03

Explosives
type: BicsLevel4SubIndustry
type: Classifier
type: NamedIndividual
is sub industry of: Specialty Chemicals
is anachronous version of: http://data.ga-group.nl/ics/bics/1810101215
is contemporary version of: http://data.ga-group.nl/ics/bics/17101215
is replaced by: http://data.ga-group.nl/ics/bics/2020/1810101215
is version of: http://data.ga-group.nl/ics/bics/17101215
is version of: http://data.ga-group.nl/ics/bics/1810101215
imported on: 2026-06-08T13:03:47.798Z
last refreshed on: 2026-06-08T13:03:47.798Z
source accessed on: 2019-12-03T20:05:01Z
source last accessed on: 2019-12-03T20:05:01Z
label: Esplosivi @it
label: Explosifs @fr
label: Explosivos @es
label: Sprengstoff @de
label: Взрывчатые вещества @ru
label: 火薬類 @ja
label: 炸药制造 @zh
label: 炸藥 @zh-hant
label: 폭발물 @ko
definition: This industry subgroup includes companies that manufacture explosives. Includes detonators, gunpowder, TNT and dynamite.
notation: 17101215
valid from: 2014-08-08
valid till: 2020-10-03

Fine Chemicals
type: BicsLevel4SubIndustry
type: Classifier
type: NamedIndividual
is sub industry of: Specialty Chemicals
is anachronous version of: http://data.ga-group.nl/ics/bics/1810101216
is contemporary version of: http://data.ga-group.nl/ics/bics/17101216
is replaced by: http://data.ga-group.nl/ics/bics/2020/1810101216
is version of: http://data.ga-group.nl/ics/bics/17101216
is version of: http://data.ga-group.nl/ics/bics/1810101216
imported on: 2026-06-08T13:03:47.798Z
last refreshed on: 2026-06-08T13:03:47.798Z
source accessed on: 2019-12-03T20:05:01Z
source last accessed on: 2019-12-03T20:05:01Z
label: Chimici ad alto contenuto tecnologico @it
label: Chimie fine @fr
label: Feinchemikalien @de
label: Prod químicos finos @pt
label: Químicos de pureza @es
label: Чистые химикаты @ru
label: 精密化學品 @zh-hant
label: 精细化学品 @zh
label: 정밀 화학제품 @ko
label: ﾌｧｲﾝｹﾐｶﾙ @ja
definition: This industry subgroup includes companies that manufacture tailored, low-volume, high-purity chemicals. Typically, fine chemicals are high priced and manufactured under contract, most commonly for pharmaceutical companies. Excludes fine chemicals utilized as the primary active pharmaceutical ingredient (see Global Generic API).
notation: 17101216
valid from: 2014-08-08
valid till: 2020-10-03

Flavors & Fragrances
type: BicsLevel4SubIndustry
type: Classifier
type: NamedIndividual
is sub industry of: Specialty Chemicals
is anachronous version of: http://data.ga-group.nl/ics/bics/1810101217
is contemporary version of: http://data.ga-group.nl/ics/bics/17101217
is replaced by: http://data.ga-group.nl/ics/bics/2020/1810101217
is version of: http://data.ga-group.nl/ics/bics/17101217
is version of: http://data.ga-group.nl/ics/bics/1810101217
imported on: 2026-06-08T13:03:47.798Z
last refreshed on: 2026-06-08T13:03:47.798Z
source accessed on: 2019-12-03T20:05:01Z
source last accessed on: 2019-12-03T20:05:01Z
label: Aroma & Düfte @de
label: Sabores e fragrâncias @pt
label: Sabores y fragancias @es
label: Sapori e fragranze @it
label: Saveurs et parfums @fr
label: Вкусовые добавки и ароматизаторы @ru
label: 香料･香水 @ja
label: 香精及香料 @zh-hant
label: 香精香料 @zh
label: 향신료 & 향료 @ko
definition: This industry subgroup includes companies that specialize in manufacturing chemicals for desired smells and flavors. Typically, these chemicals are utilized in retail consumer goods or foods.
notation: 17101217
valid from: 2014-08-08
valid till: 2020-10-03

Cosmetic Additives
type: BicsLevel5Segment
type: Classifier
type: NamedIndividual
is level5 segment of: Functional Additives
is anachronous version of: http://data.ga-group.nl/ics/bics/181010121810
is contemporary version of: http://data.ga-group.nl/ics/bics/1710121810
is replaced by: http://data.ga-group.nl/ics/bics/2020/181010121810
is version of: http://data.ga-group.nl/ics/bics/1710121810
is version of: http://data.ga-group.nl/ics/bics/181010121810
imported on: 2026-06-08T13:03:47.798Z
last refreshed on: 2026-06-08T13:03:47.798Z
source accessed on: 2019-12-03T20:05:01Z
source last accessed on: 2019-12-03T20:05:01Z
label: Additifs de cosmétiques @fr
label: Additivi cosmetici @it
label: Aditivos de cosméticos @es
label: Aditivos p/cosméticos @pt
label: Kosmetische Zusätze @de
label: К��сметические добавки @ru
label: 化妆品添加剂 @zh
label: 化妝品添加劑 @zh-hant
label: 化粧用添加剤 @ja
label: 화장품 첨가제 @ko
definition: This segment includes companies that manufacture functional additives that are primarily utilized in cosmetics.
notation: 1710121810
valid from: 2014-08-08
valid till: 2020-10-03

Fluid & Lubricant Additives
type: BicsLevel5Segment
type: Classifier
type: NamedIndividual
is level5 segment of: Functional Additives
is anachronous version of: http://data.ga-group.nl/ics/bics/181010121811
is contemporary version of: http://data.ga-group.nl/ics/bics/1710121811
is replaced by: http://data.ga-group.nl/ics/bics/2020/181010121811
is version of: http://data.ga-group.nl/ics/bics/1710121811
is version of: http://data.ga-group.nl/ics/bics/181010121811
imported on: 2026-06-08T13:03:47.798Z
last refreshed on: 2026-06-08T13:03:47.798Z
source accessed on: 2019-12-03T20:05:01Z
source last accessed on: 2019-12-03T20:05:01Z
label: Additifs fluides et lubrifiants @fr
label: Additivi fluidi e lubrificanti @it
label: Aditivos de fluído e lubrific @pt
label: Aditivos de fluidos y lubricantes @es
label: Flüssige & schmierige Zusätze @de
label: Жидкие смазки и присадки для смазочных масел @ru
label: 液体与润滑油添加剂 @zh
label: 液体･潤滑油添加剤 @ja
label: 液狀及潤滑油添加劑 @zh-hant
label: 액체 & 윤활유 첨가제 @ko
definition: This segment includes companies that manufacture finished lubricant products or functional additives that contribute to the viscosity or fluidity of finished goods. Primarily, these are additives for industrial purposes, such as engine and machine lubrication, hydraulics and heat transfer.
notation: 1710121811
valid from: 2014-08-08
valid till: 2020-10-03

Food Additives
type: BicsLevel5Segment
type: Classifier
type: NamedIndividual
is level5 segment of: Functional Additives
is anachronous version of: http://data.ga-group.nl/ics/bics/181010121812
is contemporary version of: http://data.ga-group.nl/ics/bics/1710121812
is replaced by: http://data.ga-group.nl/ics/bics/2020/181010121812
is version of: http://data.ga-group.nl/ics/bics/1710121812
is version of: http://data.ga-group.nl/ics/bics/181010121812
imported on: 2026-06-08T13:03:47.798Z
last refreshed on: 2026-06-08T13:03:47.798Z
source accessed on: 2019-12-03T20:05:01Z
source last accessed on: 2019-12-03T20:05:01Z
label: Additifs alimentaires @fr
label: Additivi alimentari @it
label: Aditivos de alimentos @es
label: Aditivos p/alimentos @pt
label: Lebensmittelzusätze @de
label: Пищевые добавки @ru
label: 食品添加剂 @zh
label: 食品添加剤 @ja
label: 食品添加劑 @zh-hant
label: 식품 첨가제 @ko
definition: This segment includes companies that manufacture functional additives that are primarily used for food processing and functional quality enhancement.
notation: 1710121812
valid from: 2014-08-08
valid till: 2020-10-03

Paper Additives & Process Chem
type: BicsLevel5Segment
type: Classifier
type: NamedIndividual
is level5 segment of: Functional Additives
is anachronous version of: http://data.ga-group.nl/ics/bics/181010121813
is contemporary version of: http://data.ga-group.nl/ics/bics/1710121813
is replaced by: http://data.ga-group.nl/ics/bics/2020/181010121813
is version of: http://data.ga-group.nl/ics/bics/1710121813
is version of: http://data.ga-group.nl/ics/bics/181010121813
imported on: 2026-06-08T13:03:47.798Z
last refreshed on: 2026-06-08T13:03:47.798Z
source accessed on: 2019-12-03T20:05:01Z
source last accessed on: 2019-12-03T20:05:01Z
label: Additifs papier/processus chim @fr
label: Additivi carta e processi chim @it
label: Aditivos de papel e processo quím @pt
label: Aditivos de papel y químicos de procesamiento @es
label: Papierzusätze & Verarbeitungschem. @de
label: Добавки и химикаты для бум. произв. @ru
label: 紙添加剤･ﾌﾟﾛｾｽ化学品 @ja
label: 紙添加劑及加工化學品 @zh-hant
label: 造纸助剂及工艺处理化学品 @zh
label: 제지 첨가제 & 공정용 화학제품 @ko
definition: This segment includes companies that manufacture functional additives that are primarily utilized in paper production processes. Excludes chemicals that contribute to the smell or taste of finished goods (see Flavors & Fragrances).
notation: 1710121813
valid from: 2014-08-08
valid till: 2020-10-03

Polymer Additives
type: BicsLevel5Segment
type: Classifier
type: NamedIndividual
is level5 segment of: Functional Additives
is anachronous version of: http://data.ga-group.nl/ics/bics/181010121814
is contemporary version of: http://data.ga-group.nl/ics/bics/1710121814
is replaced by: http://data.ga-group.nl/ics/bics/2020/181010121814
is version of: http://data.ga-group.nl/ics/bics/1710121814
is version of: http://data.ga-group.nl/ics/bics/181010121814
imported on: 2026-06-08T13:03:47.798Z
last refreshed on: 2026-06-08T13:03:47.798Z
source accessed on: 2019-12-03T20:05:01Z
source last accessed on: 2019-12-03T20:05:01Z
label: Additifs polymères @fr
label: Additivi polimeri @it
label: Aditivos de polímeros @es
label: Aditivos p/polímeros @pt
label: Polymer-Zusätze @de
label: Полимерные добавки @ru
label: 聚合物添加剂 @zh
label: 聚合物添加劑 @zh-hant
label: 폴리머 첨가제 @ko
label: ﾎﾟﾘﾏｰ添加剤 @ja
definition: This segment includes companies that manufacture functional additives that alter the property of polymers. Includes antioxidants and flame retardants.
notation: 1710121814
valid from: 2014-08-08
valid till: 2020-10-03

Functional Additives
type: BicsLevel4SubIndustry
type: Classifier
type: NamedIndividual
is sub industry of: Specialty Chemicals
is anachronous version of: http://data.ga-group.nl/ics/bics/1810101218
is contemporary version of: http://data.ga-group.nl/ics/bics/17101218
is replaced by: http://data.ga-group.nl/ics/bics/2020/1810101218
is version of: http://data.ga-group.nl/ics/bics/17101218
is version of: http://data.ga-group.nl/ics/bics/1810101218
imported on: 2026-06-08T13:03:47.798Z
last refreshed on: 2026-06-08T13:03:47.798Z
source accessed on: 2019-12-03T20:05:01Z
source last accessed on: 2019-12-03T20:05:01Z
label: Additifs fonctionnels @fr
label: Additivi funzionali @it
label: Aditivos funcionais @pt
label: Aditivos funcionales @es
label: Funktionelle Zusätze @de
label: Функциональные добавки @ru
label: 功能性添加劑 @zh-hant
label: 功能添加剂 @zh
label: 機能的添加剤 @ja
label: 기능성 첨가제 @ko
definition: This industry subgroup includes companies that manufacture specialty chemicals that contribute to the functional characteristics of finished goods. Excludes chemicals that contribute to smell or taste of finished goods (see Flavors & Fragrances).
notation: 17101218
valid from: 2014-08-08
valid till: 2020-10-03

Ind & Instl Cleaning Chemicals
type: BicsLevel4SubIndustry
type: Classifier
type: NamedIndividual
is sub industry of: Specialty Chemicals
is anachronous version of: http://data.ga-group.nl/ics/bics/1810101219
is contemporary version of: http://data.ga-group.nl/ics/bics/17101219
is replaced by: http://data.ga-group.nl/ics/bics/2020/1810101219
is version of: http://data.ga-group.nl/ics/bics/17101219
is version of: http://data.ga-group.nl/ics/bics/1810101219
imported on: 2026-06-08T13:03:47.798Z
last refreshed on: 2026-06-08T13:03:47.798Z
source accessed on: 2019-12-03T20:05:01Z
source last accessed on: 2019-12-03T20:05:01Z
label: Detergenti chimici ind e ist @it
label: Ind. & Inst. Reinigungschemikalien @de
label: Prod quím limpeza ind e instit @pt
label: Produits de nettoyage indus/institut @fr
label: Químicos de limpieza y industrial e inst @es
label: Промышл. и офисные чист. химикаты @ru
label: 工业与机构清洁化学品 @zh
label: 工業及機構清潔用化學品 @zh-hant
label: 工業･研究用化学品 @ja
label: 공업 & 기관용 청소 화학제품 @ko
definition: This industry subgroup includes companies that manufacture chemicals and services used in large-scale sanitation, cleaning, and public health applications, such as restaurants, hotels or hospitals.
notation: 17101219
valid from: 2014-08-08
valid till: 2020-10-03

Oilfield Chemicals
type: BicsLevel4SubIndustry
type: Classifier
type: NamedIndividual
is sub industry of: Specialty Chemicals
is anachronous version of: http://data.ga-group.nl/ics/bics/1810101220
is contemporary version of: http://data.ga-group.nl/ics/bics/17101220
is replaced by: http://data.ga-group.nl/ics/bics/2020/1810101220
is version of: http://data.ga-group.nl/ics/bics/17101220
is version of: http://data.ga-group.nl/ics/bics/1810101220
imported on: 2026-06-08T13:03:47.798Z
last refreshed on: 2026-06-08T13:03:47.798Z
source accessed on: 2019-12-03T20:05:01Z
source last accessed on: 2019-12-03T20:05:01Z
label: Chimici campi petroliferi @it
label: Prod chim champs pétrolifères @fr
label: Prod quím de campo petrolífero @pt
label: Químicos de yacimiento petrolífero @es
label: Ölfeldchemikalien @de
label: Нефтепромысловые химические продукты @ru
label: 油田化学品 @zh
label: 油田化學品 @zh-hant
label: 油田用化学品 @ja
label: 유전 화학제품 @ko
definition: This industry subgroup includes chemicals used in oil and natural gas exploration and production. Includes drilling fluids, fracking aids, antifouling agents and transport additives.
notation: 17101220
valid from: 2014-08-08
valid till: 2020-10-03

Industrial Coatings
type: BicsLevel5Segment
type: Classifier
type: NamedIndividual
is level5 segment of: Paints & Coatings
is anachronous version of: http://data.ga-group.nl/ics/bics/181010122110
is contemporary version of: http://data.ga-group.nl/ics/bics/1710122110
is replaced by: http://data.ga-group.nl/ics/bics/2020/181010122110
is version of: http://data.ga-group.nl/ics/bics/1710122110
is version of: http://data.ga-group.nl/ics/bics/181010122110
imported on: 2026-06-08T13:03:47.798Z
last refreshed on: 2026-06-08T13:03:47.798Z
source accessed on: 2019-12-03T20:05:01Z
source last accessed on: 2019-12-03T20:05:01Z
label: Cubrimientos industriales @es
label: Industrielle Beschichtungen @de
label: Revêtements industriels @fr
label: Revest industrial @pt
label: Rivestim industriali @it
label: Промышленные покрытия @ru
label: 工业涂料 @zh
label: 工業塗料 @zh-hant
label: 工業用ｺｰﾃｨﾝｸﾞ @ja
label: 산업용 코팅 @ko
definition: This segment includes companies that manufacture paints and coatings with diversified industrial applications. Industrial paint is used in applications, such as automotive, aerospace, marine, industrial and packaging industries.
notation: 1710122110
valid from: 2014-08-08
valid till: 2020-10-03

Specialty Coatings
type: BicsLevel5Segment
type: Classifier
type: NamedIndividual
is level5 segment of: Paints & Coatings
is anachronous version of: http://data.ga-group.nl/ics/bics/181010122111
is contemporary version of: http://data.ga-group.nl/ics/bics/1710122111
is replaced by: http://data.ga-group.nl/ics/bics/2020/181010122111
is version of: http://data.ga-group.nl/ics/bics/1710122111
is version of: http://data.ga-group.nl/ics/bics/181010122111
imported on: 2026-06-08T13:03:47.798Z
last refreshed on: 2026-06-08T13:03:47.798Z
source accessed on: 2019-12-03T20:05:01Z
source last accessed on: 2019-12-03T20:05:01Z
label: Cubrimientos especiales @es
label: Espec revestimento @pt
label: Revêtements spécialisés @fr
label: Rivestimenti speciali @it
label: Spezialbeschichtungen @de
label: Специальные покрытия @ru
label: 特殊塗料 @zh-hant
label: 特殊ｺｰﾃｨﾝｸﾞ @ja
label: 特种涂料 @zh
label: 특수 코팅 @ko
definition: This segment includes companies that manufacture paints and coatings with more specialized purposes and applications.
notation: 1710122111
valid from: 2014-08-08
valid till: 2020-10-03

Paints & Coatings
type: BicsLevel4SubIndustry
type: Classifier
type: NamedIndividual
is sub industry of: Specialty Chemicals
is anachronous version of: http://data.ga-group.nl/ics/bics/1810101221
is contemporary version of: http://data.ga-group.nl/ics/bics/17101221
is replaced by: http://data.ga-group.nl/ics/bics/2020/1810101221
is version of: http://data.ga-group.nl/ics/bics/17101221
is version of: http://data.ga-group.nl/ics/bics/1810101221
imported on: 2026-06-08T13:03:47.798Z
last refreshed on: 2026-06-08T13:03:47.798Z
source accessed on: 2019-12-03T20:05:01Z
source last accessed on: 2019-12-03T20:05:01Z
label: Farben & Beschichtungen @de
label: Peintures et revêtements @fr
label: Pinturas y cubrimientos @es
label: Pitture e rivestimenti @it
label: Tintas e revestimentos @pt
label: Краски и покрытия @ru
label: 塗料及塗膜 @zh-hant
label: 油漆和涂料 @zh
label: 페인트 및 코팅 @ko
label: ﾍﾟｲﾝﾄ､ｺｰﾃｨﾝｸﾞ @ja
definition: This industry subgroup includes companies that manufacture paint products and/or mix pigments, solvents and binders into paints and other coatings.
notation: 17101221
valid from: 2014-08-08
valid till: 2020-10-03

Printing Ink
type: BicsLevel4SubIndustry
type: Classifier
type: NamedIndividual
is sub industry of: Specialty Chemicals
is anachronous version of: http://data.ga-group.nl/ics/bics/1810101222
is contemporary version of: http://data.ga-group.nl/ics/bics/17101222
is replaced by: http://data.ga-group.nl/ics/bics/2020/1810101222
is version of: http://data.ga-group.nl/ics/bics/17101222
is version of: http://data.ga-group.nl/ics/bics/1810101222
imported on: 2026-06-08T13:03:47.798Z
last refreshed on: 2026-06-08T13:03:47.798Z
source accessed on: 2019-12-03T20:05:01Z
source last accessed on: 2019-12-03T20:05:01Z
label: Druckfarben @de
label: Encre d'imprimerie @fr
label: Inchiostro stampa @it
label: Tinta de impressão @pt
label: Tinta para impresión @es
label: Печатная краска @ru
label: 印刷油墨 @zh-hant
label: 印刷油墨制造 @zh
label: 印刷ｲﾝｷ @ja
label: 인쇄잉크 @ko
definition: This industry subgroup includes companies that manufacture printing inks, inkjet inks and inkjet cartridges.
notation: 17101222
valid from: 2014-08-08
valid till: 2020-10-03

Inorganic Dye & Pigments
type: BicsLevel5Segment
type: Classifier
type: NamedIndividual
is level5 segment of: Synthetic Dye & Pigments
is anachronous version of: http://data.ga-group.nl/ics/bics/181010122310
is contemporary version of: http://data.ga-group.nl/ics/bics/1710122310
is replaced by: http://data.ga-group.nl/ics/bics/2020/181010122310
is version of: http://data.ga-group.nl/ics/bics/1710122310
is version of: http://data.ga-group.nl/ics/bics/181010122310
imported on: 2026-06-08T13:03:47.798Z
last refreshed on: 2026-06-08T13:03:47.798Z
source accessed on: 2019-12-03T20:05:01Z
source last accessed on: 2019-12-03T20:05:01Z
label: Anorganische Farbstoffe & Pigmente @de
label: Teintures/pigments inorganiques @fr
label: Tinte y pigmentos inorgánicos @es
label: Tintura e pigmentos inorgân @pt
label: Tintura inorganica e pigmenti @it
label: Неорганическая краска и пигменты @ru
label: 无机染料和颜料 @zh
label: 無機染料及顏料 @zh-hant
label: 무기염료 및 안료 @ko
label: ��機染料･顔料製造 @ja
definition: This segment includes companies that manufacture non-carbon‒based dyes and pigments. Includes color pigments, umber, and zinc-based pigments.
notation: 1710122310
valid from: 2014-08-08
valid till: 2020-10-03

Organic Dye & Pigments
type: BicsLevel5Segment
type: Classifier
type: NamedIndividual
is level5 segment of: Synthetic Dye & Pigments
is anachronous version of: http://data.ga-group.nl/ics/bics/181010122311
is contemporary version of: http://data.ga-group.nl/ics/bics/1710122311
is replaced by: http://data.ga-group.nl/ics/bics/2020/181010122311
is version of: http://data.ga-group.nl/ics/bics/1710122311
is version of: http://data.ga-group.nl/ics/bics/181010122311
imported on: 2026-06-08T13:03:47.798Z
last refreshed on: 2026-06-08T13:03:47.798Z
source accessed on: 2019-12-03T20:05:01Z
source last accessed on: 2019-12-03T20:05:01Z
label: Organische Farbstoffe & Pigmente @de
label: Pigmento e corante orgânico @pt
label: Pigmentos y colorantes orgánicos @es
label: Teintures/pigments organiques @fr
label: Tinture e colori organici @it
label: Органические красители и наполнители @ru
label: 合成有機染料及顏料 @zh-hant
label: 有机染料与颜料 @zh
label: 有機染料･顔料 @ja
label: 유기염료 & 안료 @ko
definition: This segment includes companies that manufacture carbon-based dyes and pigments that do not naturally occur in nature. Includes lakes and toners.
notation: 1710122311
valid from: 2014-08-08
valid till: 2020-10-03

Synthetic Dye & Pigments
type: BicsLevel4SubIndustry
type: Classifier
type: NamedIndividual
is sub industry of: Specialty Chemicals
is anachronous version of: http://data.ga-group.nl/ics/bics/1810101223
is contemporary version of: http://data.ga-group.nl/ics/bics/17101223
is replaced by: http://data.ga-group.nl/ics/bics/2020/1810101223
is version of: http://data.ga-group.nl/ics/bics/17101223
is version of: http://data.ga-group.nl/ics/bics/1810101223
imported on: 2026-06-08T13:03:47.798Z
last refreshed on: 2026-06-08T13:03:47.798Z
source accessed on: 2019-12-03T20:05:01Z
source last accessed on: 2019-12-03T20:05:01Z
label: Colorants et pigments @fr
label: Corantes sintéticos e pigmentos @pt
label: Pigmentos y colorantes sintéticos @es
label: Synthetische Farbstoffe & Pigmente @de
label: Tinture e colori sintetici @it
label: Синтетические краски и пигменты @ru
label: 合成染料与颜料 @zh
label: 合成染料及顏料 @zh-hant
label: 合成染料･顔料製造 @ja
label: 합성염료&안료 @ko
definition: This industry subgroup includes companies that manufacture synthetic or non-natural dyes and pigments.
notation: 17101223
valid from: 2014-08-08
valid till: 2020-10-03

Water Treatment Chemicals
type: BicsLevel4SubIndustry
type: Classifier
type: NamedIndividual
is sub industry of: Specialty Chemicals
is anachronous version of: http://data.ga-group.nl/ics/bics/1810101224
is contemporary version of: http://data.ga-group.nl/ics/bics/17101224
is replaced by: http://data.ga-group.nl/ics/bics/2020/1810101224
is version of: http://data.ga-group.nl/ics/bics/17101224
is version of: http://data.ga-group.nl/ics/bics/1810101224
imported on: 2026-06-08T13:03:47.798Z
last refreshed on: 2026-06-08T13:03:47.798Z
source accessed on: 2019-12-03T20:05:01Z
source last accessed on: 2019-12-03T20:05:01Z
label: Chimici trattamento acque @it
label: Prod chim traitement des eaux @fr
label: Prod quím p/tratamento de água @pt
label: Químicos de tratamiento de agua @es
label: Wasseraufbereitungschemikalien @de
label: Хим. продукты для водоочистки @ru
label: 水処理化学品 @ja
label: 水处理化学品 @zh
label: 水處理化學品 @zh-hant
label: 수자원처리 화학제품 @ko
definition: This industry subgroup includes companies that manufacture chemicals used to treat water. Typically, these are used in industrial processes or public utility water treatment.
notation: 17101224
valid from: 2014-08-08
valid till: 2020-10-03

Specialty Chemicals
type: BicsLevel3Industry
type: Classifier
type: NamedIndividual
is industry of: Chemicals
is anachronous version of: http://data.ga-group.nl/ics/bics/18101012
is contemporary version of: http://data.ga-group.nl/ics/bics/171012
is replaced by: http://data.ga-group.nl/ics/bics/2020/18101012
is version of: http://data.ga-group.nl/ics/bics/171012
is version of: http://data.ga-group.nl/ics/bics/18101012
imported on: 2026-06-08T13:03:47.798Z
last refreshed on: 2026-06-08T13:03:47.798Z
source accessed on: 2019-12-03T20:05:01Z
source last accessed on: 2019-12-03T20:05:01Z
label: Chimici specializz @it
label: Prod chimiques spécialisés @fr
label: Prod quím espec @pt
label: Prod quim espec @es
label: Spezialchemikalien @de
label: Специализир. химикаты @ru
label: 特殊化学品 @ja
label: 特用化學品 @zh-hant
label: 特种化学品 @zh
label: 특수 화학제품 @ko
definition: This industry includes companies that manufacture specialized organic and inorganic chemical products. These companies create formulated, mixtured chemicals with specific applications and purposes.
notation: 171012
valid from: 2014-08-08
valid till: 2020-10-03

Chem & Allied Prods Whslrs
type: BicsLevel4SubIndustry
type: Classifier
type: NamedIndividual
is sub industry of: Chemicals Distribution
is anachronous version of: http://data.ga-group.nl/ics/bics/1810101310
is contemporary version of: http://data.ga-group.nl/ics/bics/17101310
is replaced by: http://data.ga-group.nl/ics/bics/2020/1810101310
is version of: http://data.ga-group.nl/ics/bics/17101310
is version of: http://data.ga-group.nl/ics/bics/1810101310
imported on: 2026-06-08T13:03:47.798Z
last refreshed on: 2026-06-08T13:03:47.798Z
source accessed on: 2019-12-03T20:05:01Z
source last accessed on: 2019-12-03T20:05:01Z
label: Chemikalien & verw. Produkte @de
label: Comm ingrosso prodotti chimici e associati @it
label: Grossiste prod chim et apparentés @fr
label: Productos químicos y relac @es
label: Produtos químicos e afins-Atacadista @pt
label: Опт. торговля - Химич. и смежные продукты @ru
label: その他化学品･化学製品卸売業 @ja
label: 其他化学品批发商 @zh
label: 其他化學及其製品批發 @zh-hant
label: 화학&관련제품 도매업 @ko
definition: This industry subgroup includes companies that wholesale and distribute basic and diversified chemicals and/or specialty chemicals.
notation: 17101310
valid from: 2014-08-08
valid till: 2020-10-03

Plastic Matl & Forms Whslrs
type: BicsLevel4SubIndustry
type: Classifier
type: NamedIndividual
is sub industry of: Chemicals Distribution
is anachronous version of: http://data.ga-group.nl/ics/bics/1810101311
is contemporary version of: http://data.ga-group.nl/ics/bics/17101311
is replaced by: http://data.ga-group.nl/ics/bics/2020/1810101311
is version of: http://data.ga-group.nl/ics/bics/17101311
is version of: http://data.ga-group.nl/ics/bics/1810101311
imported on: 2026-06-08T13:03:47.798Z
last refreshed on: 2026-06-08T13:03:47.798Z
source accessed on: 2019-12-03T20:05:01Z
source last accessed on: 2019-12-03T20:05:01Z
label: Atac mat plást e formas @pt
label: Gross matériaux/formes en plastique @fr
label: Grossiste forme e mat plastiche @it
label: Mat y formas básicas plásticos @es
label: Plastikmaterial & -formen Großhandel @de
label: Оптовая торговля - пластмассы и формы @ru
label: 塑料材料与型材批发商 @zh
label: 塑膠原料及初級產品批發 @zh-hant
label: 플라스틱원료&틀 도매업 @ko
label: ﾌﾟﾗｽﾁｯｸ材料･成形品卸売 @ja
definition: This industry subgroup includes companies that wholesale and distribute intermediate plastic products and/or chemical used in plastics manufacturing. Includes wholesale distribution of plastics, organic resins, plastic film, plastic sheeting and plastic foams.
notation: 17101311
valid from: 2014-08-08
valid till: 2020-10-03

Chemicals Distribution
type: BicsLevel3Industry
type: Classifier
type: NamedIndividual
is industry of: Chemicals
is anachronous version of: http://data.ga-group.nl/ics/bics/18101013
is contemporary version of: http://data.ga-group.nl/ics/bics/171013
is replaced by: http://data.ga-group.nl/ics/bics/2020/18101013
is version of: http://data.ga-group.nl/ics/bics/171013
is version of: http://data.ga-group.nl/ics/bics/18101013
imported on: 2026-06-08T13:03:47.798Z
last refreshed on: 2026-06-08T13:03:47.798Z
source accessed on: 2019-12-03T20:05:01Z
source last accessed on: 2019-12-03T20:05:01Z
label: Chemikalienvertrieb @de
label: Dist prod químicos @pt
label: Distrib prod quim @es
label: Distrib produits chim @fr
label: Distribuzione chimici @it
label: Распростран. химикатов @ru
label: 化学品販売 @ja
label: 化學品經銷 @zh-hant
label: 化工分销 @zh
label: 화학제품 유통 @ko
definition: This industry includes companies that wholesale and distribute chemicals. Excludes companies that manufacture chemicals or wholesale and distribute chemicals for agricultural purposes (see Agricultural Chemicals Retailing & Distribution).
notation: 171013
valid from: 2014-08-08
valid till: 2020-10-03

Chemicals
type: BicsLevel2IndustryGroup
type: Classifier
type: NamedIndividual
is industry group of: Materials
is anachronous version of: http://data.ga-group.nl/ics/bics/181010
is contemporary version of: http://data.ga-group.nl/ics/bics/1710
is replaced by: http://data.ga-group.nl/ics/bics/2020/181010
is version of: http://data.ga-group.nl/ics/bics/1710
is version of: http://data.ga-group.nl/ics/bics/181010
imported on: 2026-06-08T13:03:47.798Z
last refreshed on: 2026-06-08T13:03:47.798Z
source accessed on: 2019-12-03T20:05:01Z
source last accessed on: 2019-12-03T20:05:01Z
label: Chemikalien @de
label: Chimie @fr
label: Prodotti chimici @it
label: Produtos químicos @pt
label: Químicos @es
label: Химическая промышленность @ru
label: 化学工業 @ja
label: 化學 @zh-hant
label: 化工产品 @zh
label: 화학 @ko
definition: This industry group includes companies that manufacture organic and inorganic chemicals. Typically, these materials have a constant chemical composition and characteristic properties.
notation: 1710
valid from: 2014-08-08
valid till: 2020-10-03

Crushed Stone Mining
type: BicsLevel5Segment
type: Classifier
type: NamedIndividual
is level5 segment of: Aggregates
is anachronous version of: http://data.ga-group.nl/ics/bics/181011101010
is contemporary version of: http://data.ga-group.nl/ics/bics/1711101010
is replaced by: http://data.ga-group.nl/ics/bics/2020/181011101010
is version of: http://data.ga-group.nl/ics/bics/1711101010
is version of: http://data.ga-group.nl/ics/bics/181011101010
imported on: 2026-06-08T13:03:47.798Z
last refreshed on: 2026-06-08T13:03:47.798Z
source accessed on: 2019-12-03T20:05:01Z
source last accessed on: 2019-12-03T20:05:01Z
label: Abbau: gebr. Steine @de
label: Estraz pietre frant @it
label: Extração de pedra britada @pt
label: Mine pierre concass @fr
label: Minería piedr molida @es
label: Добыча дробленного камня @ru
label: 岩石採石 @ja
label: 碎石礦業及採取業 @zh-hant
label: 非金属矿物矿业和开采 @zh
label: 쇄석광업 @ko
definition: This segment includes companies that extract, mine and quarry crushed or broken stone. Crushed stones are produced by breaking down rock deposits to desired sizes by mining machinery. The process usually produces more angular-shaped stones. Also known as angular rocks.
notation: 1711101010
valid from: 2014-08-08
valid till: 2020-10-03

Sand & Gravel Mining
type: BicsLevel5Segment
type: Classifier
type: NamedIndividual
is level5 segment of: Aggregates
is anachronous version of: http://data.ga-group.nl/ics/bics/181011101011
is contemporary version of: http://data.ga-group.nl/ics/bics/1711101011
is replaced by: http://data.ga-group.nl/ics/bics/2020/181011101011
is version of: http://data.ga-group.nl/ics/bics/1711101011
is version of: http://data.ga-group.nl/ics/bics/181011101011
imported on: 2026-06-08T13:03:47.798Z
last refreshed on: 2026-06-08T13:03:47.798Z
source accessed on: 2019-12-03T20:05:01Z
source last accessed on: 2019-12-03T20:05:01Z
label: Estraz sabbia/ghiaia @it
label: Extração de areia e cascalho @pt
label: Gewinng: Sand & Kies @de
label: Mine sable/gravier @fr
label: Minería arena/grava @es
label: Добыча песка и гравеля @ru
label: 砂和粘土矿业和开采 @zh
label: 砂黏土礦業及採取業 @zh-hant
label: 砂･砂利採取 @ja
label: 모래&자갈광업 @ko
definition: This segment includes companies that extract, mine and quarry sand and gravel. Sand and gravel are naturally produced by weathering and erosion. These quarry materials have more rounded shapes.
notation: 1711101011
valid from: 2014-08-08
valid till: 2020-10-03

Aggregates
type: BicsLevel4SubIndustry
type: Classifier
type: NamedIndividual
is sub industry of: Cement & Aggregates
is anachronous version of: http://data.ga-group.nl/ics/bics/1810111010
is contemporary version of: http://data.ga-group.nl/ics/bics/17111010
is replaced by: http://data.ga-group.nl/ics/bics/2020/1810111010
is version of: http://data.ga-group.nl/ics/bics/17111010
is version of: http://data.ga-group.nl/ics/bics/1810111010
imported on: 2026-06-08T13:03:47.798Z
last refreshed on: 2026-06-08T13:03:47.798Z
source accessed on: 2019-12-03T20:05:01Z
source last accessed on: 2019-12-03T20:05:01Z
label: Aggregate @de
label: Aggregati @it
label: Agrégats @fr
label: Agregados @es
label: Совокупные данные @ru
label: 综合 @zh
label: 骨材 @ja
label: 골재 @ko
definition: This industry subgroup includes companies that mine and quarry stones. Typically, these aggregates are uniform in size and have other industrial uses beyond construction.
notation: 17111010
valid from: 2014-08-08
valid till: 2020-10-03

Asfalto
type: BicsLevel4SubIndustry
type: Classifier
type: NamedIndividual
is sub industry of: Cement & Aggregates
is anachronous version of: http://data.ga-group.nl/ics/bics/1810111011
is contemporary version of: http://data.ga-group.nl/ics/bics/17111011
is replaced by: http://data.ga-group.nl/ics/bics/2020/1810111011
is version of: http://data.ga-group.nl/ics/bics/17111011
is version of: http://data.ga-group.nl/ics/bics/1810111011
imported on: 2026-06-08T13:03:47.798Z
last refreshed on: 2026-06-08T13:03:47.798Z
source accessed on: 2019-12-03T20:05:01Z
source last accessed on: 2019-12-03T20:05:01Z
label: Asphalt
label: Asphalte @fr
label: Асфальт @ru
label: 沥青 @zh
label: 瀝青 @zh-hant
label: 아스팔트 @ko
label: ｱｽﾌｧﾙﾄ @ja
definition: This industry subgroup includes companies that manufacture asphalt. Asphalt is typically a by-product of crude oil production and is often used for road construction when heated and mixed with aggregates. Also known as bitumen, tarmac, or asphalt pavement.
notation: 17111011
valid from: 2014-08-08
valid till: 2020-10-03

Cement
type: BicsLevel4SubIndustry
type: Classifier
type: NamedIndividual
is sub industry of: Cement & Aggregates
is anachronous version of: http://data.ga-group.nl/ics/bics/1810111012
is contemporary version of: http://data.ga-group.nl/ics/bics/17111012
is replaced by: http://data.ga-group.nl/ics/bics/2020/1810111012
is version of: http://data.ga-group.nl/ics/bics/17111012
is version of: http://data.ga-group.nl/ics/bics/1810111012
imported on: 2026-06-08T13:03:47.798Z
last refreshed on: 2026-06-08T13:03:47.798Z
source accessed on: 2019-12-03T20:05:01Z
source last accessed on: 2019-12-03T20:05:01Z
label: Cemento @es
label: Ciment @fr
label: Cimento @pt
label: Zement @de
label: Цемент @ru
label: 水泥 @zh
label: 시멘트 @ko
label: ｾﾒﾝ��� @ja
definition: This industry subgroup includes companies that manufacture cement. Cement is a powdery binder that is added to aggregates to create concrete.
notation: 17111012
valid from: 2014-08-08
valid till: 2020-10-03

Ready Mix Concrete
type: BicsLevel4SubIndustry
type: Classifier
type: NamedIndividual
is sub industry of: Cement & Aggregates
is anachronous version of: http://data.ga-group.nl/ics/bics/1810111013
is contemporary version of: http://data.ga-group.nl/ics/bics/17111013
is replaced by: http://data.ga-group.nl/ics/bics/2020/1810111013
is version of: http://data.ga-group.nl/ics/bics/17111013
is version of: http://data.ga-group.nl/ics/bics/1810111013
imported on: 2026-06-08T13:03:47.798Z
last refreshed on: 2026-06-08T13:03:47.798Z
source accessed on: 2019-12-03T20:05:01Z
source last accessed on: 2019-12-03T20:05:01Z
label: Béton prêt à l'emploi @fr
label: Calce pronto @it
label: Concreto prefabricado @es
label: Concreto pronto @pt
label: Transportbeton @de
label: Товарный бетон @ru
label: 生ｺﾝｸﾘｰﾄ @ja
label: 預拌混凝土 @zh-hant
label: 预拌混凝土 @zh
label: 레미콘 @ko
definition: This industry subgroup includes companies that manufacture concrete. Concrete is a composite material composed of cement, aggregates and water. These companies manufacture concrete at a batching plant and deliver their products to construction sites in concrete mixers. Also known as ready mixed concrete or ReMiCon.
notation: 17111013
valid from: 2014-08-08
valid till: 2020-10-03

Cement & Aggregates
type: BicsLevel3Industry
type: Classifier
type: NamedIndividual
is industry of: Construction Materials
is anachronous version of: http://data.ga-group.nl/ics/bics/18101110
is contemporary version of: http://data.ga-group.nl/ics/bics/171110
is replaced by: http://data.ga-group.nl/ics/bics/2020/18101110
is version of: http://data.ga-group.nl/ics/bics/171110
is version of: http://data.ga-group.nl/ics/bics/18101110
imported on: 2026-06-08T13:03:47.798Z
last refreshed on: 2026-06-08T13:03:47.798Z
source accessed on: 2019-12-03T20:05:01Z
source last accessed on: 2019-12-03T20:05:01Z
label: Cemento e aggregati @it
label: Cemento y agregados @es
label: Cimento/agregados @pt
label: Ciments et agrégats @fr
label: Zement & Zuschläge @de
label: Цемент и заполнители @ru
label: 水泥与骨料 @zh
label: 水泥及骨材 @zh-hant
label: 시멘트 & 골재 @ko
label: ｾﾒﾝﾄ･骨材 @ja
definition: This industry includes companies that manufacture cement and its aggregates.
notation: 171110
valid from: 2014-08-08
valid till: 2020-10-03

Engineered Wood (excl Truss)
type: BicsLevel5Segment
type: Classifier
type: NamedIndividual
is level5 segment of: Structural Wood
is anachronous version of: http://data.ga-group.nl/ics/bics/181013121012
is contemporary version of: http://data.ga-group.nl/ics/bics/1711111010
is replaced by: http://data.ga-group.nl/ics/bics/2020/181013121012
is version of: http://data.ga-group.nl/ics/bics/1711111010
is version of: http://data.ga-group.nl/ics/bics/181013121012
imported on: 2026-06-08T13:03:47.798Z
last refreshed on: 2026-06-08T13:03:47.798Z
source accessed on: 2019-12-03T20:05:01Z
source last accessed on: 2019-12-03T20:05:01Z
label: Bois d'ingénierie (h poutres) @fr
label: Holzwerkstoffe (exkl. Holzbalken) @de
label: Legno lavorato (escluso travi) @it
label: Madeira preparada @pt
label: Madera de ingeniería (no laminados y aglutinados) @es
label: Композ. древесн. констр. (кроме балок) @ru
label: 复合木(除桁架) @zh
label: 工程木材(衍架除外) @zh-hant
label: 공학목재(트러스 외) @ko
label: ｴﾝｼﾞﾆｱｰﾄﾞｳｯﾄﾞ構材(除ﾄﾗｽ)製造 @ja
definition: This segment includes companies that manufacture fabricated or laminated wood composites used for structural purposes. Exclude engineered wood in truss form (see Truss Manufacturing) or engineered wood in panel form (see Wood Plywood).
notation: 1711111010
valid from: 2014-08-08
valid till: 2020-10-03

Sawmills
type: BicsLevel5Segment
type: Classifier
type: NamedIndividual
is level5 segment of: Structural Wood
is anachronous version of: http://data.ga-group.nl/ics/bics/181013121010
is contemporary version of: http://data.ga-group.nl/ics/bics/1711111011
is replaced by: http://data.ga-group.nl/ics/bics/2020/181013121010
is version of: http://data.ga-group.nl/ics/bics/1711111011
is version of: http://data.ga-group.nl/ics/bics/181013121010
imported on: 2026-06-08T13:03:47.798Z
last refreshed on: 2026-06-08T13:03:47.798Z
source accessed on: 2019-12-03T20:05:01Z
source last accessed on: 2019-12-03T20:05:01Z
label: Aserraderos @es
label: Sägewerke @de
label: Scieries @fr
label: Segherie @it
label: Serrarias @pt
label: Лесопильни @ru
label: 製材 @ja
label: 鋸木廠 @zh-hant
label: 锯木厂 @zh
label: 일반 제재업 @ko
definition: This segment includes companies that operate sawmills. Sawmills are facilities that saw and manufacture dimension lumber from logs. Typically, the products sawmills manufacture are intermediate goods supplied to other manufacturers.
notation: 1711111011
valid from: 2014-08-08
valid till: 2020-10-03

Trusses
type: BicsLevel5Segment
type: Classifier
type: Discontinued
type: NamedIndividual
is level5 segment of: Structural Wood
is contemporary version of: http://data.ga-group.nl/ics/bics/1711111012
is version of: http://data.ga-group.nl/ics/bics/1711111012
imported on: 2026-06-08T13:03:47.798Z
last refreshed on: 2026-06-08T13:03:47.798Z
source accessed on: 2019-12-03T20:05:01Z
source last accessed on: 2019-12-03T20:05:01Z
label: Andaime @pt
label: Celosías @es
label: Holzbacken @de
label: Poutres @fr
label: Travi @it
label: Балки @ru
label: 桁架 @zh
label: 트러스 제조업 @ko
label: ﾄﾗｽ製造 @ja
definition: This segment includes companies that manufacture laminated or fabricated wood roof and floor trusses. Trusses are structures identified with five or more triangle units.
notation: 1711111012
valid from: 2014-08-08
valid till: 2020-10-03

Wood Preservation
type: BicsLevel5Segment
type: Classifier
type: NamedIndividual
is level5 segment of: Structural Wood
is anachronous version of: http://data.ga-group.nl/ics/bics/181013121013
is contemporary version of: http://data.ga-group.nl/ics/bics/1711111013
is replaced by: http://data.ga-group.nl/ics/bics/2020/181013121013
is version of: http://data.ga-group.nl/ics/bics/1711111013
is version of: http://data.ga-group.nl/ics/bics/181013121013
imported on: 2026-06-08T13:03:47.798Z
last refreshed on: 2026-06-08T13:03:47.798Z
source accessed on: 2019-12-03T20:05:01Z
source last accessed on: 2019-12-03T20:05:01Z
label: Conservación madera @es
label: Conservazione legno @it
label: Holzkonservierung @de
label: Préservation du bois @fr
label: Preservação de madeira @pt
label: Пропитка древесины консервантами @ru
label: 木材防腐 @zh-hant
label: 木材防腐业 @zh
label: 防腐木材 @ja
label: 목재보존업 @ko
definition: This segment includes companies that treat wood products with preservatives to prevent decay. Excludes manufacturing of wood products.
notation: 1711111013
valid from: 2014-08-08
valid till: 2020-10-03

Structural Wood
type: BicsLevel4SubIndustry
type: Classifier
type: NamedIndividual
is sub industry of: Wood Building Materials
is anachronous version of: http://data.ga-group.nl/ics/bics/1810131210
is contemporary version of: http://data.ga-group.nl/ics/bics/17111110
is replaced by: http://data.ga-group.nl/ics/bics/2020/1810131210
is version of: http://data.ga-group.nl/ics/bics/17111110
is version of: http://data.ga-group.nl/ics/bics/1810131210
imported on: 2026-06-08T13:03:47.798Z
last refreshed on: 2026-06-08T13:03:47.798Z
source accessed on: 2019-12-03T20:05:01Z
source last accessed on: 2019-12-03T20:05:01Z
label: Bois de charpente @fr
label: Legno strutturale @it
label: Madeira estrutural @pt
label: Madera estructurada @es
label: Strukturholz @de
label: Структурная фанера @ru
label: 構造用木材 @ja
label: 結構三夾板 @zh-hant
label: 结构木 @zh
label: 구조용 목재 @ko
definition: This industry subgroup includes companies that manufacture wood products that are utilized for structural purposes. Structural wood is typically designed with specifications to meet national/international standards. Excludes plywood in a panel form (see Wood Plywood).
notation: 17111110
valid from: 2014-08-08
valid till: 2020-10-03

Cust Woodwork & Millwork
type: BicsLevel5Segment
type: Classifier
type: Discontinued
type: NamedIndividual
is level5 segment of: Wood Millwork
is contemporary version of: http://data.ga-group.nl/ics/bics/1711111110
is version of: http://data.ga-group.nl/ics/bics/1711111110
imported on: 2026-06-08T13:03:47.798Z
last refreshed on: 2026-06-08T13:03:47.798Z
source accessed on: 2019-12-03T20:05:01Z
source last accessed on: 2019-12-03T20:05:01Z
label: Boiserie/menuiserie sur mesure @fr
label: Carpenteria e falegnameria sotto ord @it
label: Carpintaria e marcenaria pers @pt
label: Carpintería personalizada @es
label: Maßgefertige Holzarbeiten & Holzfertigteile @de
label: Деревянные и столярные изделия @ru
label: 定制木制品 @zh
label: 訂製木材及木工製品 @zh-hant
label: 특별제작목공&문창틀 @ko
label: ｶｽﾀﾑ建築木工･造作材 @ja
definition: This segment includes companies that manufacture custom-designed woodwork and millwork. Typically these are used for decorative purposes and tailored to customers’ specifications. Excludes mass production woodworking and millwork (see Home Improvement). Excludes cabinets (see Kitchen Cabinets/Countertop).
notation: 1711111110
valid from: 2014-08-08
valid till: 2020-10-03

Cut Stock, Resaw Lumber & Plan
type: BicsLevel5Segment
type: Classifier
type: Discontinued
type: NamedIndividual
is level5 segment of: Wood Millwork
is contemporary version of: http://data.ga-group.nl/ics/bics/1711111111
is version of: http://data.ga-group.nl/ics/bics/1711111111
imported on: 2026-06-08T13:03:47.798Z
last refreshed on: 2026-06-08T13:03:47.798Z
source accessed on: 2019-12-03T20:05:01Z
source last accessed on: 2019-12-03T20:05:01Z
label: Corte, aplainamento, desdobr mad e plan @pt
label: Découpe/dédoublage/rabotage @fr
label: Prod mad cortada, reaserrada @es
label: Schnittholz/Hobeln @de
label: Taglio, risegatura e piallatura legno @it
label: Заготовки/заготовки древесины/планировка @ru
label: 切割、再锯木材及刨平 @zh
label: 切割規劃木材 @zh-hant
label: 細工材/引き割り/平削り @ja
label: 목재절단, 제재&표면가공 @ko
definition: This segment includes companies that manufacture dimension lumber from purchased lumber and lumber stock. These companies use woodworking machines to shape the wood or resaw the output of sawmills even further. Excludes companies that process logs (see Sawmills).
notation: 1711111111
valid from: 2014-08-08
valid till: 2020-10-03

Wood Millwork
type: BicsLevel4SubIndustry
type: Classifier
type: Discontinued
type: NamedIndividual
is sub industry of: Wood Building Materials
is contemporary version of: http://data.ga-group.nl/ics/bics/17111111
is version of: http://data.ga-group.nl/ics/bics/17111111
imported on: 2026-06-08T13:03:47.798Z
last refreshed on: 2026-06-08T13:03:47.798Z
source accessed on: 2019-12-03T20:05:01Z
source last accessed on: 2019-12-03T20:05:01Z
label: Bois de menuiserie @fr
label: Falegnameria @it
label: Holzfertigteile @de
label: Molinería madera @es
label: Produção de madeira @pt
label: Древесные столярные изделия @ru
label: 木制品 @zh
label: 木工品･木質床材 @ja
label: 木製品 @zh-hant
label: 목재 목공제품 @ko
definition: This industry subgroup includes companies that manufacture wood millwork, custom woodwork, and shaping and planing of wood.
notation: 17111111
valid from: 2014-08-08
valid till: 2020-10-03

Hardwood Veneer & Plywood
type: BicsLevel5Segment
type: Classifier
type: NamedIndividual
is level5 segment of: Wood Plywood
is anachronous version of: http://data.ga-group.nl/ics/bics/181013121110
is contemporary version of: http://data.ga-group.nl/ics/bics/1711111210
is replaced by: http://data.ga-group.nl/ics/bics/2020/181013121110
is version of: http://data.ga-group.nl/ics/bics/1711111210
is version of: http://data.ga-group.nl/ics/bics/181013121110
imported on: 2026-06-08T13:03:47.798Z
last refreshed on: 2026-06-08T13:03:47.798Z
source accessed on: 2019-12-03T20:05:01Z
source last accessed on: 2019-12-03T20:05:01Z
label: Contreplaqués/placages de feuillus @fr
label: Folheados de madeira e compensado @pt
label: Hartholzfurnier & Sperrholz @de
label: Laminados y triplay de madera dura @es
label: Legno duro e compensato @it
label: Листовая фанера и обшивка (тв. древесина) @ru
label: 硬木薄板及合板 @zh-hant
label: 硬木饰面板与胶合板 @zh
label: 硬材製ﾍﾞﾆﾔ板･合板 @ja
label: 강화 단판 및 합판 @ko
definition: This segment includes companies that manufacture hardwood veneer and hardwood plywood. These are wood composites composed of thin sheets of wood bonded together. Hardwood has superior strength and stiffness and is made from angiosperm trees. Includes ash plywood, birch plywood, balsa plywood and oak plywood.
notation: 1711111210
valid from: 2014-08-08
valid till: 2020-10-03

Reconstituted Wood Products
type: BicsLevel5Segment
type: Classifier
type: NamedIndividual
is level5 segment of: Wood Plywood
is anachronous version of: http://data.ga-group.nl/ics/bics/181013121111
is contemporary version of: http://data.ga-group.nl/ics/bics/1711111211
is replaced by: http://data.ga-group.nl/ics/bics/2020/181013121111
is version of: http://data.ga-group.nl/ics/bics/1711111211
is version of: http://data.ga-group.nl/ics/bics/181013121111
imported on: 2026-06-08T13:03:47.798Z
last refreshed on: 2026-06-08T13:03:47.798Z
source accessed on: 2019-12-03T20:05:01Z
source last accessed on: 2019-12-03T20:05:01Z
label: Prodotti legno ricostituito @it
label: Productos reconstituidos de madera @es
label: Produits en bois reconstitué @fr
label: Produtos de madeira reconstituída @pt
label: Wiederverwendete Holzprodukte @de
label: Реконструир. деревянных изделий @ru
label: 再生木材制品 @zh
label: 組合木材 @zh-hant
label: 集成材 @ja
label: 재생목제품 @ko
definition: This segment includes companies that manufacture reconstituted wood sheets and boards.
notation: 1711111211
valid from: 2014-08-08
valid till: 2020-10-03

Softwood Veneer & Plywood
type: BicsLevel5Segment
type: Classifier
type: NamedIndividual
is level5 segment of: Wood Plywood
is anachronous version of: http://data.ga-group.nl/ics/bics/181013121011
is contemporary version of: http://data.ga-group.nl/ics/bics/1711111212
is replaced by: http://data.ga-group.nl/ics/bics/2020/181013121011
is version of: http://data.ga-group.nl/ics/bics/1711111212
is version of: http://data.ga-group.nl/ics/bics/181013121011
imported on: 2026-06-08T13:03:47.798Z
last refreshed on: 2026-06-08T13:03:47.798Z
source accessed on: 2019-12-03T20:05:01Z
source last accessed on: 2019-12-03T20:05:01Z
label: Folheados de madeira macia e compensado @pt
label: Laminados y triplay de madera suave @es
label: Legno dolce e compensato @it
label: Placages et contreplaqués de résineux @fr
label: Weichholzfurniere & Sperrholz @de
label: Листовая фанера и обшивка (мгк древесина) @ru
label: 軟木薄板及合板 @zh-hant
label: 軟材製ﾍﾞﾆﾔ板･合板 @ja
label: 软木饰面板及胶合板 @zh
label: 연화 단판 및 합판 @ko
definition: This segment includes companies that manufacture softwood veneer and softwood plywood. These are wood composites composed of thin sheets of wood bonded together. Softwood flooring is from gymnosperm trees. Includes cedar plywood, pine plywood and spruce plywood.
notation: 1711111212
valid from: 2014-08-08
valid till: 2020-10-03

Wood Plywood
type: BicsLevel4SubIndustry
type: Classifier
type: Discontinued
type: NamedIndividual
is sub industry of: Wood Building Materials
is contemporary version of: http://data.ga-group.nl/ics/bics/17111112
is version of: http://data.ga-group.nl/ics/bics/17111112
imported on: 2026-06-08T13:03:47.798Z
last refreshed on: 2026-06-08T13:03:47.798Z
source accessed on: 2019-12-03T20:05:01Z
source last accessed on: 2019-12-03T20:05:01Z
label: Compensados de madeira @pt
label: Contreplaqués de bois @fr
label: Legno compensato @it
label: Sperrholz @de
label: Triplay madera @es
label: Древесная фанера @ru
label: 合板･繊維板 @ja
label: 木合板及粒片板 @zh-hant
label: 木胶合板和木屑板 @zh
label: 목재 합판 @ko
definition: This industry subgroup includes companies that manufacture wood plywood as well as reconstituted wood products. Typically, these are in a panel or board form.
notation: 17111112
valid from: 2014-08-08
valid till: 2020-10-03

Other Misc. Wood Products
type: BicsLevel4SubIndustry
type: Classifier
type: Discontinued
type: NamedIndividual
is sub industry of: Wood Building Materials
is contemporary version of: http://data.ga-group.nl/ics/bics/17111113
is version of: http://data.ga-group.nl/ics/bics/17111113
imported on: 2026-06-08T13:03:47.798Z
last refreshed on: 2026-06-08T13:03:47.798Z
source accessed on: 2019-12-03T20:05:01Z
source last accessed on: 2019-12-03T20:05:01Z
label: Altri prod legno vari @it
label: Autres produits en bois @fr
label: Otros varios Productos de madera @es
label: Outros produtos div de madeira @pt
label: Sonstiges verschiedenes Holzprodukte @de
label: Прочие разл. дерев. изделия @ru
label: その他木材製品 @ja
label: 其他木制品 @zh
label: 其他雜項木製品 @zh-hant
label: 그외 기타 목재제품 @ko
definition: This industry subgroup includes companies that manufacture other wood building products not elsewhere classified.
notation: 17111113
valid from: 2014-08-08
valid till: 2020-10-03

Wood Building Materials
type: BicsLevel3Industry
type: Classifier
type: NamedIndividual
is industry of: Construction Materials
is anachronous version of: http://data.ga-group.nl/ics/bics/18101312
is contemporary version of: http://data.ga-group.nl/ics/bics/171111
is replaced by: http://data.ga-group.nl/ics/bics/2020/18101312
is version of: http://data.ga-group.nl/ics/bics/171111
is version of: http://data.ga-group.nl/ics/bics/18101312
imported on: 2026-06-08T13:03:47.798Z
last refreshed on: 2026-06-08T13:03:47.798Z
source accessed on: 2019-12-03T20:05:01Z
source last accessed on: 2019-12-03T20:05:01Z
label: Holzbaumaterialien @de
label: Matériaux de construction en bois @fr
label: Materiais de construção de madeira @pt
label: Materiales de construcción en madera @es
label: Materiali costruzione legno @it
label: Древесные строительные изделия @ru
label: 建築木材 @ja
label: 木制建筑材料 @zh
label: 木材建材製造 @zh-hant
label: 목제 건축자재 @ko
definition: This industry includes companies that manufacture wood products and wood materials primarily used in construction. Excludes wood products used in interior furnishing (see Home Improvement).
notation: 171111
valid from: 2014-08-08
valid till: 2020-10-03

Brick & Structural Clay Tile
type: BicsLevel5Segment
type: Classifier
type: NamedIndividual
is level5 segment of: Brick, Tile & Clay Bldg Matl
is anachronous version of: http://data.ga-group.nl/ics/bics/181011111010
is contemporary version of: http://data.ga-group.nl/ics/bics/1711121010
is replaced by: http://data.ga-group.nl/ics/bics/2020/181011111010
is version of: http://data.ga-group.nl/ics/bics/1711121010
is version of: http://data.ga-group.nl/ics/bics/181011111010
imported on: 2026-06-08T13:03:47.798Z
last refreshed on: 2026-06-08T13:03:47.798Z
source accessed on: 2019-12-03T20:05:01Z
source last accessed on: 2019-12-03T20:05:01Z
label: Azulejos de ladrillo y arcilla estructural @es
label: Briques/tuiles de structure en argile @fr
label: Mattonelle e mattoni strutturali @it
label: Mauerziegel & Betonbauplatten @de
label: Tijolo e azulejo de argila estrutural @pt
label: Кирпичи и строит. керамич. плитка @ru
label: 砖块与结构粘土瓦 @zh
label: 磚塊/結構性黏土磚 @zh-hant
label: 벽돌 및 구조용 내화 타일 @ko
label: ﾚﾝｶﾞ･建設用粘土ﾀｲﾙ @ja
definition: This segment includes companies that manufacture clay bricks and clay tiles. Excludes bricks made from concrete (see Concrete Block & Brick Manufacturing).
notation: 1711121010
valid from: 2014-08-08
valid till: 2020-10-03

Non-Clay Refract
type: BicsLevel5Segment
type: Classifier
type: NamedIndividual
is level5 segment of: Brick, Tile & Clay Bldg Matl
is anachronous version of: http://data.ga-group.nl/ics/bics/181011111011
is contemporary version of: http://data.ga-group.nl/ics/bics/1711121011
is replaced by: http://data.ga-group.nl/ics/bics/2020/181011111011
is version of: http://data.ga-group.nl/ics/bics/1711121011
is version of: http://data.ga-group.nl/ics/bics/181011111011
imported on: 2026-06-08T13:03:47.798Z
last refreshed on: 2026-06-08T13:03:47.798Z
source accessed on: 2019-12-03T20:05:01Z
source last accessed on: 2019-12-03T20:05:01Z
label: Feuerfeste Stoffe (Nicht Ton) @de
label: Prod refrat não argila @pt
label: Réfractaires non argileux @fr
label: Refrac no barro @es
label: Refrattari non argillosi @it
label: Неглиняные огнеупорные изделия @ru
label: 耐火製品 @ja
label: 非粘土防火材料 @zh
label: 非黏土耐火物 @zh-hant
label: 비내화제품 제조업 @ko
definition: This segment includes companies that manufacture non-clay refractory (high temperature) products.
notation: 1711121011
valid from: 2014-08-08
valid till: 2020-10-03

Other Structural Clay Products
type: BicsLevel5Segment
type: Classifier
type: Discontinued
type: NamedIndividual
is level5 segment of: Brick, Tile & Clay Bldg Matl
is contemporary version of: http://data.ga-group.nl/ics/bics/1711121012
is version of: http://data.ga-group.nl/ics/bics/1711121012
imported on: 2026-06-08T13:03:47.798Z
last refreshed on: 2026-06-08T13:03:47.798Z
source accessed on: 2019-12-03T20:05:01Z
source last accessed on: 2019-12-03T20:05:01Z
label: Altri prodotti strutturali in argilla @it
label: Autres produits de structure en argile @fr
label: Otros productos estructurales de arcilla @es
label: Outros produtos de argila estrutural @pt
label: Sonstige strukturelle Tonprodukte @de
label: Прочие изделия из строительной глины @ru
label: その他建設用粘土製品 @ja
label: 其他結構性黏土磚 @zh-hant
label: 其他结构粘土制品 @zh
label: 기타 구조용 내화제품 @ko
definition: This segment includes companies that manufacture other clay products utilized in construction not classified elsewhere. Includes clay sewer pipes, clay flue liners and clay roofing tiles.
notation: 1711121012
valid from: 2014-08-08
valid till: 2020-10-03

Brick, Tile & Clay Bldg Matl
type: BicsLevel4SubIndustry
type: Classifier
type: NamedIndividual
is sub industry of: Non Wood Building Materials
is anachronous version of: http://data.ga-group.nl/ics/bics/1810111110
is contemporary version of: http://data.ga-group.nl/ics/bics/17111210
is replaced by: http://data.ga-group.nl/ics/bics/2020/1810111110
is version of: http://data.ga-group.nl/ics/bics/17111210
is version of: http://data.ga-group.nl/ics/bics/1810111110
imported on: 2026-06-08T13:03:47.798Z
last refreshed on: 2026-06-08T13:03:47.798Z
source accessed on: 2019-12-03T20:05:01Z
source last accessed on: 2019-12-03T20:05:01Z
label: Briques/tuiles/mat constr en argile @fr
label: Ladrillo, azul, arcilla constr @es
label: Mat const, tijolo, azulejo e argila @pt
label: Mattoni, mattonelle e materiali argillosi edili @it
label: Ziegel-, Fliesen- & Tonbaumaterial @de
label: Кирпич, плитка и глиняные строймат. @ru
label: 建築用ﾚﾝｶﾞ､ﾀｲﾙ､粘土 @ja
label: 砖块、瓷砖及粘土建材 @zh
label: 磚塊/磁磚/黏土建材 @zh-hant
label: 벽돌, 타일&점토 건축자재 @ko
definition: This industry subgroup includes companies that manufacture clay bricks and clay tiles, ceramic wall and floor tiles, other clay building products, and non-clay refractory products.
notation: 17111210
valid from: 2014-08-08
valid till: 2020-10-03

Concrete Block & Brick
type: BicsLevel5Segment
type: Classifier
type: NamedIndividual
is level5 segment of: Concrete Products
is anachronous version of: http://data.ga-group.nl/ics/bics/181011111110
is contemporary version of: http://data.ga-group.nl/ics/bics/1711121110
is replaced by: http://data.ga-group.nl/ics/bics/2020/181011111110
is version of: http://data.ga-group.nl/ics/bics/1711121110
is version of: http://data.ga-group.nl/ics/bics/181011111110
imported on: 2026-06-08T13:03:47.798Z
last refreshed on: 2026-06-08T13:03:47.798Z
source accessed on: 2019-12-03T20:05:01Z
source last accessed on: 2019-12-03T20:05:01Z
label: Betonziegel und -blöcke @de
label: Bloc/briques en béton @fr
label: Blocchi di cemento e mattoni @it
label: Blocos e tijolos de concreto @pt
label: Bloques y ladrillos de concreto @es
label: Бетонные кирпичи/блоки @ru
label: 混凝土砌块与砖块 @zh
label: 混凝土磚塊 @zh-hant
label: 콘크리트 벽돌 및 블록 @ko
label: ｺﾝｸﾘｰﾄﾌﾞﾛｯｸ/ﾚﾝｶﾞ @ja
definition: This segment includes companies that manufacture concrete blocks and bricks. Excludes bricks made from concrete (see Brick & Structural Clay Tile Manufacturing).
notation: 1711121110
valid from: 2014-08-08
valid till: 2020-10-03

Concrete Pipe
type: BicsLevel5Segment
type: Classifier
type: NamedIndividual
is level5 segment of: Concrete Products
is anachronous version of: http://data.ga-group.nl/ics/bics/181011111111
is contemporary version of: http://data.ga-group.nl/ics/bics/1711121111
is replaced by: http://data.ga-group.nl/ics/bics/2020/181011111111
is version of: http://data.ga-group.nl/ics/bics/1711121111
is version of: http://data.ga-group.nl/ics/bics/181011111111
imported on: 2026-06-08T13:03:47.798Z
last refreshed on: 2026-06-08T13:03:47.798Z
source accessed on: 2019-12-03T20:05:01Z
source last accessed on: 2019-12-03T20:05:01Z
label: Betonrohr @de
label: Tubería de concreto @es
label: Tubi in calcestruzzo @it
label: Tubos de concreto @pt
label: Tuyaux en béton @fr
label: Бетонные трубы @ru
label: 混凝土管道 @zh
label: 콘크리트관 제조업 @ko
label: ｺﾝｸﾘｰﾄ管 @ja
definition: This segment includes companies that manufacture concrete pipes used for sewers and irrigation.
notation: 1711121111
valid from: 2014-08-08
valid till: 2020-10-03

Other Concrete Products
type: BicsLevel5Segment
type: Classifier
type: Discontinued
type: NamedIndividual
is level5 segment of: Concrete Products
is contemporary version of: http://data.ga-group.nl/ics/bics/1711121112
is version of: http://data.ga-group.nl/ics/bics/1711121112
imported on: 2026-06-08T13:03:47.798Z
last refreshed on: 2026-06-08T13:03:47.798Z
source accessed on: 2019-12-03T20:05:01Z
source last accessed on: 2019-12-03T20:05:01Z
label: Altri prodotti in calcestruzzo @it
label: Autres produits en béton @fr
label: Otros productos de concreto @es
label: Outros produtos de concreto @pt
label: Sonstige Betonprodukte @de
label: Прочая продукция из бетона @ru
label: その他ｺﾝｸﾘｰﾄ製品 @ja
label: 其他混凝土产品 @zh
label: 其他混凝土產品 @zh-hant
label: 기타 콘크리트제품 @ko
definition: This segment includes companies that manufacture concrete products not classified elsewhere.
notation: 1711121112
valid from: 2014-08-08
valid till: 2020-10-03

Concrete Products
type: BicsLevel4SubIndustry
type: Classifier
type: NamedIndividual
is sub industry of: Non Wood Building Materials
is anachronous version of: http://data.ga-group.nl/ics/bics/1810111111
is contemporary version of: http://data.ga-group.nl/ics/bics/17111211
is replaced by: http://data.ga-group.nl/ics/bics/2020/1810111111
is version of: http://data.ga-group.nl/ics/bics/17111211
is version of: http://data.ga-group.nl/ics/bics/1810111111
imported on: 2026-06-08T13:03:47.798Z
last refreshed on: 2026-06-08T13:03:47.798Z
source accessed on: 2019-12-03T20:05:01Z
source last accessed on: 2019-12-03T20:05:01Z
label: Betonprodukte @de
label: Prodotti in calcestruzzo @it
label: Productos de hormigón @es
label: Produits en béton @fr
label: Produtos concreto @pt
label: Продукция из бетона @ru
label: 混凝土产品 @zh
label: 混凝土產品 @zh-hant
label: 콘크리트 제품 제조업 @ko
label: ｺﾝｸﾘｰﾄ製品 @ja
definition: This industry subgroup includes companies that manufacture construction materials and products derived from concrete.
notation: 17111211
valid from: 2014-08-08
valid till: 2020-10-03

Flat Glass
type: BicsLevel5Segment
type: Classifier
type: Discontinued
type: NamedIndividual
is level5 segment of: Glass Products - Bldg Materials
is contemporary version of: http://data.ga-group.nl/ics/bics/1711121210
is version of: http://data.ga-group.nl/ics/bics/1711121210
imported on: 2026-06-08T13:03:47.798Z
last refreshed on: 2026-06-08T13:03:47.798Z
source accessed on: 2019-12-03T20:05:01Z
source last accessed on: 2019-12-03T20:05:01Z
label: Flachglas @de
label: Verre plat @fr
label: Vetro a lastre @it
label: Vidrio plano @es
label: Vidro plano @pt
label: Плоское стекло @ru
label: 平板玻璃 @zh
label: 平面玻璃 @zh-hant
label: 板ｶﾞﾗｽ @ja
label: 평판유리 제조업 @ko
definition: This segment includes companies that manufacture flat glass and laminated glass. Typically, flat glass is produced in a flat plane form and is used for diverse industrial purposes.
notation: 1711121210
valid from: 2014-08-08
valid till: 2020-10-03

Other Building Glass
type: BicsLevel5Segment
type: Classifier
type: Discontinued
type: NamedIndividual
is level5 segment of: Glass Products - Bldg Materials
is contemporary version of: http://data.ga-group.nl/ics/bics/1711121211
is version of: http://data.ga-group.nl/ics/bics/1711121211
imported on: 2026-06-08T13:03:47.798Z
last refreshed on: 2026-06-08T13:03:47.798Z
source accessed on: 2019-12-03T20:05:01Z
source last accessed on: 2019-12-03T20:05:01Z
label: Altra edilizia vetro @it
label: Autre verre construction @fr
label: Otro vidrio de construcción @es
label: Outros vidros p/ construção @pt
label: Sonstiges Bauglas @de
label: Изделия из стекла @ru
label: 其他建筑玻璃 @zh
label: 其他建築玻璃 @zh-hant
label: 기타 건축 유리 @ko
label: ｶﾞﾗｽ製品 @ja
definition: This segment includes companies that manufacture glass-based construction materials not classified elsewhere. Includes glass bricks and door glass.
notation: 1711121211
valid from: 2014-08-08
valid till: 2020-10-03

Glass Products - Bldg Materials
type: BicsLevel4SubIndustry
type: Classifier
type: NamedIndividual
is sub industry of: Non Wood Building Materials
is anachronous version of: http://data.ga-group.nl/ics/bics/1810111112
is contemporary version of: http://data.ga-group.nl/ics/bics/17111212
is replaced by: http://data.ga-group.nl/ics/bics/2020/1810111112
is version of: http://data.ga-group.nl/ics/bics/17111212
is version of: http://data.ga-group.nl/ics/bics/1810111112
imported on: 2026-06-08T13:03:47.798Z
last refreshed on: 2026-06-08T13:03:47.798Z
source accessed on: 2019-12-03T20:05:01Z
source last accessed on: 2019-12-03T20:05:01Z
label: Glasprodukte - Baumaterialien @de
label: Prodotti in vetro - Materiali edili @it
label: Productos de vidrio - materiales de constr @es
label: Produits de verre - Mat constr @fr
label: Produtos vidro - Materiais const @pt
label: Товары из стекла - строит. материалы @ru
label: 玻璃制品-建材 @zh
label: 玻璃產品製造-建材 @zh-hant
label: 판유리가공품-건축자재 @ko
label: ｶﾞﾗｽ加工品-建材 @ja
definition: This industry subgroup includes companies that manufacture construction materials and products derived from glass.
notation: 17111212
valid from: 2014-08-08
valid till: 2020-10-03

Gypsum Products
type: BicsLevel4SubIndustry
type: Classifier
type: NamedIndividual
is sub industry of: Non Wood Building Materials
is anachronous version of: http://data.ga-group.nl/ics/bics/1810111113
is contemporary version of: http://data.ga-group.nl/ics/bics/17111213
is replaced by: http://data.ga-group.nl/ics/bics/2020/1810111113
is version of: http://data.ga-group.nl/ics/bics/17111213
is version of: http://data.ga-group.nl/ics/bics/1810111113
imported on: 2026-06-08T13:03:47.798Z
last refreshed on: 2026-06-08T13:03:47.798Z
source accessed on: 2019-12-03T20:05:01Z
source last accessed on: 2019-12-03T20:05:01Z
label: Gipsprodukte @de
label: Prodotti in gesso @it
label: Productos de yeso @es
label: Produits en gypse @fr
label: Produtos de gesso @pt
label: Продукция из гипса @ru
label: 石こう @ja
label: 石膏产品 @zh
label: 石膏產品 @zh-hant
label: 석고제품 제조업 @ko
definition: This industry subgroup includes companies that manufacture construction materials primarily derived from gypsum. Includes drywall, wallboard and plasterboard.
notation: 17111213
valid from: 2014-08-08
valid till: 2020-10-03

Mineral Wool
type: BicsLevel5Segment
type: Classifier
type: NamedIndividual
is level5 segment of: Insulation Products
is anachronous version of: http://data.ga-group.nl/ics/bics/181011111410
is contemporary version of: http://data.ga-group.nl/ics/bics/1711121410
is replaced by: http://data.ga-group.nl/ics/bics/2020/181011111410
is version of: http://data.ga-group.nl/ics/bics/1711121410
is version of: http://data.ga-group.nl/ics/bics/181011111410
imported on: 2026-06-08T13:03:47.798Z
last refreshed on: 2026-06-08T13:03:47.798Z
source accessed on: 2019-12-03T20:05:01Z
source last accessed on: 2019-12-03T20:05:01Z
label: Lã mineral @pt
label: Laine minérale @fr
label: Lana mineral @es
label: Lane minerali @it
label: Mineralwolle @de
label: Минеральная вата @ru
label: 矿棉 @zh
label: 礦棉 @zh-hant
label: 미네랄 울 제조업 @ko
label: ﾐﾈﾗﾙｳｰﾙ @ja
definition: This segment includes companies that manufacture insulation from mineral fibers. Common mineral fibers include fiberglass, ceramic fibers and stone wool.
notation: 1711121410
valid from: 2014-08-08
valid till: 2020-10-03

Polystyrene Foam Insulation
type: BicsLevel5Segment
type: Classifier
type: NamedIndividual
is level5 segment of: Insulation Products
is anachronous version of: http://data.ga-group.nl/ics/bics/181011111411
is contemporary version of: http://data.ga-group.nl/ics/bics/1711121411
is replaced by: http://data.ga-group.nl/ics/bics/2020/181011111411
is version of: http://data.ga-group.nl/ics/bics/1711121411
is version of: http://data.ga-group.nl/ics/bics/181011111411
imported on: 2026-06-08T13:03:47.798Z
last refreshed on: 2026-06-08T13:03:47.798Z
source accessed on: 2019-12-03T20:05:01Z
source last accessed on: 2019-12-03T20:05:01Z
label: Espumas e aislamiento de poliestireno @es
label: Isolamento de espuma de isopor @pt
label: Isolants en mousse de polystyrène @fr
label: Polystyrolschaumisolierung @de
label: Schiuma polistirene per isolamento @it
label: Изоляция из пенополистирола @ru
label: 発砲ｽﾁﾛｰﾙ断熱材 @ja
label: 聚苯乙烯泡沫绝缘产品 @zh
label: 聚苯乙烯泡體保溫品 @zh-hant
label: 폴리스티렌단열재 @ko
definition: This segment includes companies that manufacture polystyrene thermal foam insulation. Excludes companies that manufacture bulk foam used in various end products (see Polystyrene Foam Product).
notation: 1711121411
valid from: 2014-08-08
valid till: 2020-10-03

Insulation Products
type: BicsLevel4SubIndustry
type: Classifier
type: NamedIndividual
is sub industry of: Non Wood Building Materials
is anachronous version of: http://data.ga-group.nl/ics/bics/1810111114
is contemporary version of: http://data.ga-group.nl/ics/bics/17111214
is replaced by: http://data.ga-group.nl/ics/bics/2020/1810111114
is version of: http://data.ga-group.nl/ics/bics/17111214
is version of: http://data.ga-group.nl/ics/bics/1810111114
imported on: 2026-06-08T13:03:47.798Z
last refreshed on: 2026-06-08T13:03:47.798Z
source accessed on: 2019-12-03T20:05:01Z
source last accessed on: 2019-12-03T20:05:01Z
label: Isolationsstoffe @de
label: Prod isolamento @pt
label: Prodotti isolanti @it
label: Productos insulación @es
label: Produits d'isolation @fr
label: Изоляц. товары @ru
label: 断熱製品 @ja
label: 絕緣製品 @zh-hant
label: 绝缘产品 @zh
label: 단열재 제품 @ko
definition: This industry subgroup includes companies that manufacture building insulation products.
notation: 17111214
valid from: 2014-08-08
valid till: 2020-10-03

Plastic Pipe & Pipe Fitting
type: BicsLevel5Segment
type: Classifier
type: Discontinued
type: NamedIndividual
is level5 segment of: Plastic Building Materials
is contemporary version of: http://data.ga-group.nl/ics/bics/1711121510
is version of: http://data.ga-group.nl/ics/bics/1711121510
imported on: 2026-06-08T13:03:47.798Z
last refreshed on: 2026-06-08T13:03:47.798Z
source accessed on: 2019-12-03T20:05:01Z
source last accessed on: 2019-12-03T20:05:01Z
label: Kunststoffrohre & Zubehörteile @de
label: Tubería y conexión de plástico @es
label: Tubi e guarnizioni plastica @it
label: Tubos plást e acessórios @pt
label: Tuyaux/raccords en plastique @fr
label: Пластиковые трубы/детали @ru
label: 塑料管道与管件 @zh
label: 塑膠管及管件 @zh-hant
label: 플라스틱 관 & 배관 @ko
label: ﾌﾟﾗｽﾁｯｸ管･継手 @ja
definition: This segment includes companies that manufacture plastic pipes and pipe fittings.
notation: 1711121510
valid from: 2014-08-08
valid till: 2020-10-03

Other Plastics Products
type: BicsLevel5Segment
type: Classifier
type: Discontinued
type: NamedIndividual
is level5 segment of: Plastic Building Materials
is contemporary version of: http://data.ga-group.nl/ics/bics/1711121511
is version of: http://data.ga-group.nl/ics/bics/1711121511
imported on: 2026-06-08T13:03:47.798Z
last refreshed on: 2026-06-08T13:03:47.798Z
source accessed on: 2019-12-03T20:05:01Z
source last accessed on: 2019-12-03T20:05:01Z
label: Altri prodotti plastici @it
label: Autres produits en plastique @fr
label: Otros productos de plástico @es
label: Outros produtos de plástico @pt
label: Sonstige Plastikprodukte @de
label: Прочая продукция из пластмасс @ru
label: その他ﾌﾟﾗｽﾁｯｸ製品 @ja
label: 其他塑料制品 @zh
label: 所有其他塑膠品 @zh-hant
label: 기타 플라스틱제품 @ko
definition: This segment includes companies that manufacture plastic building material products not classified elsewhere. Includes awnings and plastic woods.
notation: 1711121511
valid from: 2014-08-08
valid till: 2020-10-03

Plastic Building Materials
type: BicsLevel4SubIndustry
type: Classifier
type: NamedIndividual
is sub industry of: Non Wood Building Materials
is anachronous version of: http://data.ga-group.nl/ics/bics/1810111115
is contemporary version of: http://data.ga-group.nl/ics/bics/17111215
is replaced by: http://data.ga-group.nl/ics/bics/2020/1810111115
is version of: http://data.ga-group.nl/ics/bics/17111215
is version of: http://data.ga-group.nl/ics/bics/1810111115
imported on: 2026-06-08T13:03:47.798Z
last refreshed on: 2026-06-08T13:03:47.798Z
source accessed on: 2019-12-03T20:05:01Z
source last accessed on: 2019-12-03T20:05:01Z
label: Baumaterialien aus Kunststoff @de
label: Matériaux de construction en plastique @fr
label: Materiais para construção de plástico @pt
label: Materiales plásticos de construcción @es
label: Materiali costruzione plastici @it
label: Пластиковые стройматериалы @ru
label: 合成樹脂建材 @ja
label: 塑料建材 @zh
label: 塑膠建材 @zh-hant
label: 플라스틱건축자재 @ko
definition: This industry subgroup includes companies that manufacture construction materials primarily derived from plastic.
notation: 17111215
valid from: 2014-08-08
valid till: 2020-10-03

Roofing Materials
type: BicsLevel4SubIndustry
type: Classifier
type: NamedIndividual
is sub industry of: Non Wood Building Materials
is anachronous version of: http://data.ga-group.nl/ics/bics/1810111116
is contemporary version of: http://data.ga-group.nl/ics/bics/17111216
is replaced by: http://data.ga-group.nl/ics/bics/2020/1810111116
is version of: http://data.ga-group.nl/ics/bics/17111216
is version of: http://data.ga-group.nl/ics/bics/1810111116
imported on: 2026-06-08T13:03:47.798Z
last refreshed on: 2026-06-08T13:03:47.798Z
source accessed on: 2019-12-03T20:05:01Z
source last accessed on: 2019-12-03T20:05:01Z
label: Dachmaterialien @de
label: Matériaux de toiture @fr
label: Materiais para telhado @pt
label: Materiales de techos @es
label: Materiali tetti @it
label: Кровельное покрытие @ru
label: 屋根材 @ja
label: 屋頂材料 @zh-hant
label: 屋顶材料 @zh
label: 지붕 자재 제조업 @ko
definition: This industry subgroup includes companies that manufacture roofing materials, components of roofing systems and roofing accessories. Includes asphalt shingles and roofing cement.
notation: 17111216
valid from: 2014-08-08
valid till: 2020-10-03

Abrasive Products
type: BicsLevel5Segment
type: Classifier
type: NamedIndividual
is level5 segment of: Sundry Building Products
is anachronous version of: http://data.ga-group.nl/ics/bics/181011111710
is contemporary version of: http://data.ga-group.nl/ics/bics/1711121710
is replaced by: http://data.ga-group.nl/ics/bics/2020/181011111710
is version of: http://data.ga-group.nl/ics/bics/1711121710
is version of: http://data.ga-group.nl/ics/bics/181011111710
imported on: 2026-06-08T13:03:47.798Z
last refreshed on: 2026-06-08T13:03:47.798Z
source accessed on: 2019-12-03T20:05:01Z
source last accessed on: 2019-12-03T20:05:01Z
label: Prodotti abrasivi @it
label: Productos abrasivos @es
label: Produits abrasifs @fr
label: Produto abrasivos @pt
label: Schleifmittel @de
label: Абразивные изделия @ru
label: 研磨制品 @zh
label: 研磨材料製品 @zh-hant
label: 研磨用製品 @ja
label: 연마제품 제조업 @ko
definition: This segment includes companies that manufacture abrasive products. Includes sandpaper and grinding wheels.
notation: 1711121710
valid from: 2014-08-08
valid till: 2020-10-03

Nonmetal Mineral Products
type: BicsLevel5Segment
type: Classifier
type: NamedIndividual
is level5 segment of: Sundry Building Products
is anachronous version of: http://data.ga-group.nl/ics/bics/181011111711
is contemporary version of: http://data.ga-group.nl/ics/bics/1711121711
is replaced by: http://data.ga-group.nl/ics/bics/2020/181011111711
is version of: http://data.ga-group.nl/ics/bics/1711121711
is version of: http://data.ga-group.nl/ics/bics/181011111711
imported on: 2026-06-08T13:03:47.798Z
last refreshed on: 2026-06-08T13:03:47.798Z
source accessed on: 2019-12-03T20:05:01Z
source last accessed on: 2019-12-03T20:05:01Z
label: Nichtmetallische Mineralprodukte @de
label: Prodotti minerali non metalli @it
label: Productos de minera no metálicos @es
label: Produits minéraux non métalliques @fr
label: Produtos minerais não metálicos @pt
label: Неметаллич. минеральн. продукты @ru
label: その他非金属鉱物製品 @ja
label: 其他非金屬礦物產品 @zh-hant
label: 非金属矿物产品 @zh
label: 비금속 광물제품 @ko
definition: This segment includes companies that manufacture nonmetallic mineral products utilized in construction not elsewhere classified.
notation: 1711121711
valid from: 2014-08-08
valid till: 2020-10-03

Sundry Building Products
type: BicsLevel4SubIndustry
type: Classifier
type: NamedIndividual
is sub industry of: Non Wood Building Materials
is anachronous version of: http://data.ga-group.nl/ics/bics/1810111117
is contemporary version of: http://data.ga-group.nl/ics/bics/17111217
is replaced by: http://data.ga-group.nl/ics/bics/2020/1810111117
is version of: http://data.ga-group.nl/ics/bics/17111217
is version of: http://data.ga-group.nl/ics/bics/1810111117
imported on: 2026-06-08T13:03:47.798Z
last refreshed on: 2026-06-08T13:03:47.798Z
source accessed on: 2019-12-03T20:05:01Z
source last accessed on: 2019-12-03T20:05:01Z
label: Productos diversa de construcción @es
label: Produits de construction divers @fr
label: Produtos div prédios @pt
label: Vari prodotti edili @it
label: Verschiedene Baumaterialien @de
label: Различные строительные изделия @ru
label: 各種建築製品 @ja
label: 杂项建筑产品 @zh
label: 기타 건축 제품 @ko
definition: This industry subgroup includes companies that manufacture abrasive products and nonmetallic mineral products.
notation: 17111217
valid from: 2014-08-08
valid till: 2020-10-03

Crushed Limestone
type: BicsLevel5Segment
type: Classifier
type: NamedIndividual
is level5 segment of: Other Stone Mining
is anachronous version of: http://data.ga-group.nl/ics/bics/181011111810
is contemporary version of: http://data.ga-group.nl/ics/bics/1711121810
is replaced by: http://data.ga-group.nl/ics/bics/2020/181011111810
is version of: http://data.ga-group.nl/ics/bics/1711121810
is version of: http://data.ga-group.nl/ics/bics/181011111810
imported on: 2026-06-08T13:03:47.798Z
last refreshed on: 2026-06-08T13:03:47.798Z
source accessed on: 2019-12-03T20:05:01Z
source last accessed on: 2019-12-03T20:05:01Z
label: Calcário triturado @pt
label: Calcaire concassé @fr
label: Estraz calcare frant @it
label: Gebr. Kalkstein @de
label: Piedra caliza tritur @es
label: Дробленый известковый к��мень @ru
label: 石灰岩採石･砕石場 @ja
label: 石灰碎石礦業採取業 @zh-hant
label: 破碎石灰石开采 @zh
label: 석회 쇄석 광업 @ko
definition: This segment includes companies that mine and quarry crushed or broken limestone, dolomite, cement rock, marl and chalk.
notation: 1711121810
valid from: 2014-08-08
valid till: 2020-10-03

Dimension Stone Mining
type: BicsLevel5Segment
type: Classifier
type: NamedIndividual
is level5 segment of: Other Stone Mining
is anachronous version of: http://data.ga-group.nl/ics/bics/181011111811
is contemporary version of: http://data.ga-group.nl/ics/bics/1711121811
is replaced by: http://data.ga-group.nl/ics/bics/2020/181011111811
is version of: http://data.ga-group.nl/ics/bics/1711121811
is version of: http://data.ga-group.nl/ics/bics/181011111811
imported on: 2026-06-08T13:03:47.798Z
last refreshed on: 2026-06-08T13:03:47.798Z
source accessed on: 2019-12-03T20:05:01Z
source last accessed on: 2019-12-03T20:05:01Z
label: Estrazione pietre ornamentali @it
label: Excavación de piedra @es
label: Extração de pedras calcárias @pt
label: Gewinnung von Schottersteinen @de
label: Mine pierre taille @fr
label: Добыча природного камня @ru
label: 特定尺寸石料开采 @zh
label: 石材礦業及採取 @zh-hant
label: 規格石材採石業･採石場 @ja
label: 치수 석재물 광업 @ko
definition: This segment includes companies that mine and quarry stones that are shaped to specific sizes and dimensions. Excludes small fabricated stones for use in road manufacturing (see Aggregates).
notation: 1711121811
valid from: 2014-08-08
valid till: 2020-10-03

Granite Mining
type: BicsLevel5Segment
type: Classifier
type: NamedIndividual
is level5 segment of: Other Stone Mining
is anachronous version of: http://data.ga-group.nl/ics/bics/181011111812
is contemporary version of: http://data.ga-group.nl/ics/bics/1711121812
is replaced by: http://data.ga-group.nl/ics/bics/2020/181011111812
is version of: http://data.ga-group.nl/ics/bics/1711121812
is version of: http://data.ga-group.nl/ics/bics/181011111812
imported on: 2026-06-08T13:03:47.798Z
last refreshed on: 2026-06-08T13:03:47.798Z
source accessed on: 2019-12-03T20:05:01Z
source last accessed on: 2019-12-03T20:05:01Z
label: Estraz granito frant @it
label: Extração de granito @pt
label: Granitabbau @de
label: Mine de granite @fr
label: Minería de granito @es
label: Добыча гранита @ru
label: 破碎花岗石开采 @zh
label: 花崗岩採石･砕石場 @ja
label: 花崗碎石礦業採取業 @zh-hant
label: 화강 쇄석 광업 @ko
definition: This segment includes companies that mine and quarry crushed or broken granite, gneiss, riprap, syenite and diorite.
notation: 1711121812
valid from: 2014-08-08
valid till: 2020-10-03

Other Crushed Stone
type: BicsLevel5Segment
type: Classifier
type: Discontinued
type: NamedIndividual
is level5 segment of: Other Stone Mining
is contemporary version of: http://data.ga-group.nl/ics/bics/1711121813
is version of: http://data.ga-group.nl/ics/bics/1711121813
imported on: 2026-06-08T13:03:47.798Z
last refreshed on: 2026-06-08T13:03:47.798Z
source accessed on: 2019-12-03T20:05:01Z
source last accessed on: 2019-12-03T20:05:01Z
label: Autre pierre concass @fr
label: Estraz altre pietre @it
label: Otra piedra triturad @es
label: Outras pedras trituradas @pt
label: Sonst. gebr. Steine @de
label: Проч. дробл. камень @ru
label: 他岩石採石･砕石場 @ja
label: 其他破碎石料开采 @zh
label: 其他碎石礦業採取業 @zh-hant
label: 기타 쇄석 광업 @ko
definition: This segment includes companies that mine and quarry crushed stones not elsewhere classified. Includes bituminous limestone.
notation: 1711121813
valid from: 2014-08-08
valid till: 2020-10-03

Other Stone Mining
type: BicsLevel4SubIndustry
type: Classifier
type: NamedIndividual
is sub industry of: Non Wood Building Materials
is anachronous version of: http://data.ga-group.nl/ics/bics/1810111118
is contemporary version of: http://data.ga-group.nl/ics/bics/17111218
is replaced by: http://data.ga-group.nl/ics/bics/2020/1810111118
is version of: http://data.ga-group.nl/ics/bics/17111218
is version of: http://data.ga-group.nl/ics/bics/1810111118
imported on: 2026-06-08T13:03:47.798Z
last refreshed on: 2026-06-08T13:03:47.798Z
source accessed on: 2019-12-03T20:05:01Z
source last accessed on: 2019-12-03T20:05:01Z
label: Estraz altre pietre @it
label: Extração out pedra @pt
label: Extraction pierres @fr
label: Otra extrac piedra @es
label: Sonst. Gewinnung v. Steinen @de
label: Добыча проч. камня @ru
label: その他採石 @ja
label: 其他石礦業 @zh-hant
label: 其他采石 @zh
label: 기타 채석 광업 @ko
definition: This industry subgroup includes companies that mine other stone materials.
notation: 17111218
valid from: 2014-08-08
valid till: 2020-10-03

Non Wood Building Materials
type: BicsLevel3Industry
type: Classifier
type: NamedIndividual
is industry of: Construction Materials
is anachronous version of: http://data.ga-group.nl/ics/bics/18101111
is contemporary version of: http://data.ga-group.nl/ics/bics/171112
is replaced by: http://data.ga-group.nl/ics/bics/2020/18101111
is version of: http://data.ga-group.nl/ics/bics/171112
is version of: http://data.ga-group.nl/ics/bics/18101111
imported on: 2026-06-08T13:03:47.798Z
last refreshed on: 2026-06-08T13:03:47.798Z
source accessed on: 2019-12-03T20:05:01Z
source last accessed on: 2019-12-03T20:05:01Z
label: Baumaterialien, nicht aus Holz @de
label: Matér construction (pas bois) @fr
label: Materiais de construção exceto madeira @pt
label: Materiales de construcción no de madera @es
label: Materiali edili non legno @it
label: Недревесные стройматериалы @ru
label: 非木材建材 @zh
label: 非木質建材 @ja
label: 비목재 건축자재 @ko
definition: This industry includes companies that manufacture non-wood products and non-wood material utilized in construction.
notation: 171112
valid from: 2014-08-08
valid till: 2020-10-03

Construction Materials
type: BicsLevel2IndustryGroup
type: Classifier
type: NamedIndividual
is industry group of: Materials
is anachronous version of: http://data.ga-group.nl/ics/bics/181011
is contemporary version of: http://data.ga-group.nl/ics/bics/1711
is replaced by: http://data.ga-group.nl/ics/bics/2020/181011
is version of: http://data.ga-group.nl/ics/bics/1711
is version of: http://data.ga-group.nl/ics/bics/181011
imported on: 2026-06-08T13:03:47.798Z
last refreshed on: 2026-06-08T13:03:47.798Z
source accessed on: 2019-12-03T20:05:01Z
source last accessed on: 2019-12-03T20:05:01Z
label: Baustoffe @de
label: Matériaux de constr @fr
label: Materiais de construção @pt
label: Materiales de construcción @es
label: Materiali edili @it
label: Стройматериалы @ru
label: 建材 @zh-hant
label: 建筑材料 @zh
label: 建設資材 @ja
label: 건설자재 @ko
definition: This industry group includes companies that manufacture materials primarily used in construction.
notation: 1711
valid from: 2014-08-08
valid till: 2020-10-03

Glass Containers
type: BicsLevel4SubIndustry
type: Classifier
type: NamedIndividual
is sub industry of: Containers & Packaging
is anachronous version of: http://data.ga-group.nl/ics/bics/1810121010
is contemporary version of: http://data.ga-group.nl/ics/bics/17121010
is replaced by: http://data.ga-group.nl/ics/bics/2020/1810121010
is version of: http://data.ga-group.nl/ics/bics/17121010
is version of: http://data.ga-group.nl/ics/bics/1810121010
imported on: 2026-06-08T13:03:47.798Z
last refreshed on: 2026-06-08T13:03:47.798Z
source accessed on: 2019-12-03T20:05:01Z
source last accessed on: 2019-12-03T20:05:01Z
label: Contêineres de vidro @pt
label: Contenants en verre @fr
label: Contenedores de vidrio @es
label: Contenitori di vetro @it
label: Glasbehälter @de
label: Стеклянные контейнеры @ru
label: 玻璃容器 @zh
label: 유리용기 제조업 @ko
label: ｶﾞﾗｽ容器 @ja
definition: This industry subgroup includes companies that manufacture glass containers used in packaging applications. Includes glass bottles, glass jars and glass containers.
notation: 17121010
valid from: 2014-08-08
valid till: 2020-10-03

Aluminum Foil for Packaging
type: BicsLevel5Segment
type: Classifier
type: NamedIndividual
is level5 segment of: Metal Containers & Packaging
is anachronous version of: http://data.ga-group.nl/ics/bics/181012101110
is contemporary version of: http://data.ga-group.nl/ics/bics/1712101110
is replaced by: http://data.ga-group.nl/ics/bics/2020/181012101110
is version of: http://data.ga-group.nl/ics/bics/1712101110
is version of: http://data.ga-group.nl/ics/bics/181012101110
imported on: 2026-06-08T13:03:47.798Z
last refreshed on: 2026-06-08T13:03:47.798Z
source accessed on: 2019-12-03T20:05:01Z
source last accessed on: 2019-12-03T20:05:01Z
label: Aluminiumfolie für Verpackungen @de
label: Fogli alluminio per imballaggio @it
label: Folha de alumínio para embalagem @pt
label: Papel de aluminio para empaquetado @es
label: Papier d'aluminium pour emballage @fr
label: Алюмин. фольга для упаковка @ru
label: はり合わせｱﾙﾐ箔 @ja
label: 包装用铝箔 @zh
label: 包裝用鍍膜鋁箔紙 @zh-hant
label: 알루미늄 호일 @ko
definition: This segment includes companies that manufacture aluminum foil used in flexible packaging applications.
notation: 1712101110
valid from: 2014-08-08
valid till: 2020-10-03

Metal Containers
type: BicsLevel5Segment
type: Classifier
type: NamedIndividual
is level5 segment of: Metal Containers & Packaging
is anachronous version of: http://data.ga-group.nl/ics/bics/181012101111
is contemporary version of: http://data.ga-group.nl/ics/bics/1712101111
is replaced by: http://data.ga-group.nl/ics/bics/2020/181012101111
is version of: http://data.ga-group.nl/ics/bics/1712101111
is version of: http://data.ga-group.nl/ics/bics/181012101111
imported on: 2026-06-08T13:03:47.798Z
last refreshed on: 2026-06-08T13:03:47.798Z
source accessed on: 2019-12-03T20:05:01Z
source last accessed on: 2019-12-03T20:05:01Z
label: Contêineres de metal @pt
label: Contenants en métal @fr
label: Contenedores de metal @es
label: Contenitori di metallo @it
label: Metallcontainer @de
label: Металлич. контейнеры @ru
label: 金属容器 @ja
label: 金屬容器 @zh-hant
label: 금속 컨테이너 제조업 @ko
definition: This segment includes companies that manufacture metal cans used in packaging applications. Includes soda cans, soup cans, tin cans, paint cans, and lids.
notation: 1712101111
valid from: 2014-08-08
valid till: 2020-10-03

Metal Containers & Packaging
type: BicsLevel4SubIndustry
type: Classifier
type: NamedIndividual
is sub industry of: Containers & Packaging
is anachronous version of: http://data.ga-group.nl/ics/bics/1810121011
is contemporary version of: http://data.ga-group.nl/ics/bics/17121011
is replaced by: http://data.ga-group.nl/ics/bics/2020/1810121011
is version of: http://data.ga-group.nl/ics/bics/17121011
is version of: http://data.ga-group.nl/ics/bics/1810121011
imported on: 2026-06-08T13:03:47.798Z
last refreshed on: 2026-06-08T13:03:47.798Z
source accessed on: 2019-12-03T20:05:01Z
source last accessed on: 2019-12-03T20:05:01Z
label: Contêineres de metal e embalagem @pt
label: Contenants et emballages en métal @fr
label: Contenedores de metal y embalaje @es
label: Contenitori e imballaggi metallo @it
label: Metallcontainer & -verpackung @de
label: Метал. контейн. и упаков. матер. @ru
label: 金属容器与包装 @zh
label: 金属容器･包装材 @ja
label: 金屬容器及包裝品 @zh-hant
label: 금속컨테이너&포장 @ko
definition: This industry subgroup includes companies that manufacture metal containers used in packaging applications. Includes metal cans and aluminum foil.
notation: 17121011
valid from: 2014-08-08
valid till: 2020-10-03

Corrugated Packaging Matl
type: BicsLevel5Segment
type: Classifier
type: NamedIndividual
is level5 segment of: Paper Containers & Packaging
is anachronous version of: http://data.ga-group.nl/ics/bics/181012101210
is contemporary version of: http://data.ga-group.nl/ics/bics/1712101210
is replaced by: http://data.ga-group.nl/ics/bics/2020/181012101210
is version of: http://data.ga-group.nl/ics/bics/1712101210
is version of: http://data.ga-group.nl/ics/bics/181012101210
imported on: 2026-06-08T13:03:47.798Z
last refreshed on: 2026-06-08T13:03:47.798Z
source accessed on: 2019-12-03T20:05:01Z
source last accessed on: 2019-12-03T20:05:01Z
label: Gewelltes Verpackungsmaterial @de
label: Mat de empaquetado corrugado @es
label: Mat embalagens de papel canelado @pt
label: Mat emballage carton ondulé @fr
label: Mat imballaggio cartone ondulato @it
label: Гофрированные упаковочные материалы @ru
label: 梱包用���ﾎﾞｰﾙ @ja
label: 瓦楞紙包裝材料 @zh-hant
label: 瓦楞纸包装材料 @zh
label: 골판지 포장재료 @ko
definition: This segment includes companies that manufacture cardboard and cardboard boxes used in packaging applications. Includes corrugated boxes, linerboard boxes and cardboard boxes.
notation: 1712101210
valid from: 2014-08-08
valid till: 2020-10-03

Merchandise Displays & Boxes
type: BicsLevel5Segment
type: Classifier
type: Discontinued
type: NamedIndividual
is level5 segment of: Paper Containers & Packaging
is contemporary version of: http://data.ga-group.nl/ics/bics/1712101211
is version of: http://data.ga-group.nl/ics/bics/1712101211
imported on: 2026-06-08T13:03:47.798Z
last refreshed on: 2026-06-08T13:03:47.798Z
source accessed on: 2019-12-03T20:05:01Z
source last accessed on: 2019-12-03T20:05:01Z
label: Esposizioni e scatole mercanzia @it
label: Estantes y casilleros de mercancía @es
label: Exibição de mercadoria e caixas @pt
label: Présentoirs et boîtes @fr
label: Verkaufsdisplays und Boxen @de
label: Торговые витрины и шкафы @ru
label: 商品展示/盒 @zh-hant
label: 商品展示与盒子 @zh
label: 商業用ﾃﾞｨｽﾌﾟﾚｰ･箱 @ja
label: 판촉 전시 및 박스 @ko
definition: This segment includes companies that manufacture setup paperboard boxes used in packaging applications. Includes shoe boxes and paperboard displays.
notation: 1712101211
valid from: 2014-08-08
valid till: 2020-10-03

Molded Fiber Packaging Prods
type: BicsLevel5Segment
type: Classifier
type: NamedIndividual
is level5 segment of: Paper Containers & Packaging
is anachronous version of: http://data.ga-group.nl/ics/bics/181012101211
is contemporary version of: http://data.ga-group.nl/ics/bics/1712101212
is replaced by: http://data.ga-group.nl/ics/bics/2020/181012101211
is version of: http://data.ga-group.nl/ics/bics/1712101212
is version of: http://data.ga-group.nl/ics/bics/181012101211
imported on: 2026-06-08T13:03:47.798Z
last refreshed on: 2026-06-08T13:03:47.798Z
source accessed on: 2019-12-03T20:05:01Z
source last accessed on: 2019-12-03T20:05:01Z
label: Papierfaserverpackungen @de
label: Prod d'emballage fibre moulée @fr
label: Prod embalagem de fibras moldadas @pt
label: Prod empaquetado fibras moldeadas @es
label: Prod imballaggio fibra stampata @it
label: Упаковочные изделия из формованной фибры @ru
label: 梱包用成型ﾊﾟﾙﾌﾟ @ja
label: 模塑纖維包裝品 @zh-hant
label: 模塑纤维包装产品 @zh
label: 파이버주형 포장제품 @ko
definition: This segment includes companies that manufacture molded paper-based containers. These products are made from paper pulps that are formed by a molding process. Includes egg cartons, food trays and coffee filters.
notation: 1712101212
valid from: 2014-08-08
valid till: 2020-10-03

Paper Bag
type: BicsLevel5Segment
type: Classifier
type: NamedIndividual
is level5 segment of: Paper Containers & Packaging
is anachronous version of: http://data.ga-group.nl/ics/bics/181012101212
is contemporary version of: http://data.ga-group.nl/ics/bics/1712101213
is replaced by: http://data.ga-group.nl/ics/bics/2020/181012101212
is version of: http://data.ga-group.nl/ics/bics/1712101213
is version of: http://data.ga-group.nl/ics/bics/181012101212
imported on: 2026-06-08T13:03:47.798Z
last refreshed on: 2026-06-08T13:03:47.798Z
source accessed on: 2019-12-03T20:05:01Z
source last accessed on: 2019-12-03T20:05:01Z
label: Bolsas de papel @es
label: Papiertüten @de
label: Sacchetti carta @it
label: Sacolas de papel @pt
label: Sacs en papier @fr
label: Бумажные пакеты @ru
label: 紙袋 @ja
label: 纸袋 @zh
label: 종이가방 제조업 @ko
definition: This segment includes companies that manufacture paper bags used in packaging applications. Includes paper grocery bags, paper multiwall bags and paper sacks.
notation: 1712101213
valid from: 2014-08-08
valid till: 2020-10-03

Paper Food Containers
type: BicsLevel5Segment
type: Classifier
type: NamedIndividual
is level5 segment of: Paper Containers & Packaging
is anachronous version of: http://data.ga-group.nl/ics/bics/181012101213
is contemporary version of: http://data.ga-group.nl/ics/bics/1712101214
is replaced by: http://data.ga-group.nl/ics/bics/2020/181012101213
is version of: http://data.ga-group.nl/ics/bics/1712101214
is version of: http://data.ga-group.nl/ics/bics/181012101213
imported on: 2026-06-08T13:03:47.798Z
last refreshed on: 2026-06-08T13:03:47.798Z
source accessed on: 2019-12-03T20:05:01Z
source last accessed on: 2019-12-03T20:05:01Z
label: Contêineres de papel para alimentos @pt
label: Contenitori carta per alimentari @it
label: Envases de papel para alimento @es
label: Lebensmittelcontainer aus Papier @de
label: Récipients alimentaires en papier @fr
label: Бумажные пищевые контейнеры @ru
label: 紙製食品容器 @ja
label: 紙類食品容器 @zh-hant
label: 纸质食品容器 @zh
label: 제지식품컨테이너 @ko
definition: This segment includes companies that specialize in manufacturing sanitary containers used when eating food. Typically, these would be containers that are in direct contact with ready-to-eat foods. Includes milk cartons, paper plates, paper cups, paper bowls, paper takeout boxes, and paper soup cups. Excludes containers used for packaging applications.
notation: 1712101214
valid from: 2014-08-08
valid till: 2020-10-03

Paperboard Packaging Materials
type: BicsLevel5Segment
type: Classifier
type: NamedIndividual
is level5 segment of: Paper Containers & Packaging
is anachronous version of: http://data.ga-group.nl/ics/bics/181012101214
is contemporary version of: http://data.ga-group.nl/ics/bics/1712101215
is replaced by: http://data.ga-group.nl/ics/bics/2020/181012101214
is version of: http://data.ga-group.nl/ics/bics/1712101215
is version of: http://data.ga-group.nl/ics/bics/181012101214
imported on: 2026-06-08T13:03:47.798Z
last refreshed on: 2026-06-08T13:03:47.798Z
source accessed on: 2019-12-03T20:05:01Z
source last accessed on: 2019-12-03T20:05:01Z
label: Kartonverpackungsmaterialien @de
label: Matériaux d'emballage en carton @fr
label: Materiais de embalagens papelão @pt
label: Materiales de cartón de empaquetado @es
label: Materiali imballaggi cartone @it
label: Картонные упаковочные материалы @ru
label: 梱包用板紙 @ja
label: 紙板包裝材料 @zh-hant
label: 纸板包装材料 @zh
label: 판지 포장재료 @ko
definition: This segment includes companies that manufacture paperboard and paperboard boxes used in packaging applications. Includes carton board boxes, carton board containers, and paperboard.
notation: 1712101215
valid from: 2014-08-08
valid till: 2020-10-03

Paper Containers & Packaging
type: BicsLevel4SubIndustry
type: Classifier
type: NamedIndividual
is sub industry of: Containers & Packaging
is anachronous version of: http://data.ga-group.nl/ics/bics/1810121012
is contemporary version of: http://data.ga-group.nl/ics/bics/17121012
is replaced by: http://data.ga-group.nl/ics/bics/2020/1810121012
is version of: http://data.ga-group.nl/ics/bics/17121012
is version of: http://data.ga-group.nl/ics/bics/1810121012
imported on: 2026-06-08T13:03:47.798Z
last refreshed on: 2026-06-08T13:03:47.798Z
source accessed on: 2019-12-03T20:05:01Z
source last accessed on: 2019-12-03T20:05:01Z
label: Contêineres e embalagem de papel @pt
label: Contenants et emballages en papier @fr
label: Contenedores y embalaje de papel @es
label: Contenitori e imballaggi carta @it
label: Papiercontainer & -verpackung @de
label: Бумажные контейнеры и упаковка @ru
label: 紙容器及包裝品 @zh-hant
label: 紙製容器･包装材 @ja
label: 纸质容器与包装 @zh
label: 종이 컨테이너&포장 @ko
definition: This industry subgroup includes companies that manufacture paper containers and paper-based packaging materials.
notation: 17121012
valid from: 2014-08-08
valid till: 2020-10-03

Plastic Bag & Pouch
type: BicsLevel5Segment
type: Classifier
type: NamedIndividual
is level5 segment of: Plastic Containers & Packaging
is anachronous version of: http://data.ga-group.nl/ics/bics/181012101310
is contemporary version of: http://data.ga-group.nl/ics/bics/1712101310
is replaced by: http://data.ga-group.nl/ics/bics/2020/181012101310
is version of: http://data.ga-group.nl/ics/bics/1712101310
is version of: http://data.ga-group.nl/ics/bics/181012101310
imported on: 2026-06-08T13:03:47.798Z
last refreshed on: 2026-06-08T13:03:47.798Z
source accessed on: 2019-12-03T20:05:01Z
source last accessed on: 2019-12-03T20:05:01Z
label: Bolsas de plástico y paquetes @es
label: Borsa e custodie plastica @it
label: Plastiktüten & -beutel @de
label: Poches/sacs plastiques @fr
label: Sacolas e bolsas plásticas @pt
label: Полиэтилен. мешки и сумки @ru
label: 塑料袋与小袋 @zh
label: 塑膠袋及小袋 @zh-hant
label: 플라스틱 가방 및 파우치 @ko
label: ﾎﾟﾘ袋･ﾎﾟｰﾁ @ja
definition: This segment includes companies that manufacture plastic bags. Includes storage bags, grocery bags, merchandise bags, plastic multiwall bags, garbage bags, and plastic merchandise bags.
notation: 1712101310
valid from: 2014-08-08
valid till: 2020-10-03

Plastic Bottle
type: BicsLevel5Segment
type: Classifier
type: NamedIndividual
is level5 segment of: Plastic Containers & Packaging
is anachronous version of: http://data.ga-group.nl/ics/bics/181012101311
is contemporary version of: http://data.ga-group.nl/ics/bics/1712101311
is replaced by: http://data.ga-group.nl/ics/bics/2020/181012101311
is version of: http://data.ga-group.nl/ics/bics/1712101311
is version of: http://data.ga-group.nl/ics/bics/181012101311
imported on: 2026-06-08T13:03:47.798Z
last refreshed on: 2026-06-08T13:03:47.798Z
source accessed on: 2019-12-03T20:05:01Z
source last accessed on: 2019-12-03T20:05:01Z
label: Botellas de plástico @es
label: Bottiglie in plastica @it
label: Bouteilles en plastique @fr
label: Garrafa plástica @pt
label: Plastikflaschen @de
label: Пластиковые бутылки @ru
label: 塑料瓶 @zh
label: 塑膠瓶 @zh-hant
label: 플라스틱병 제조업 @ko
label: ﾌﾟﾗｽﾁｯｸ瓶 @ja
definition: This segment includes companies that manufacture plastic bottles and their closures. Includes PET Bottles, plastic bottles and plastic caps.
notation: 1712101311
valid from: 2014-08-08
valid till: 2020-10-03

Plastic Packaging Film & Sheet
type: BicsLevel5Segment
type: Classifier
type: NamedIndividual
is level5 segment of: Plastic Containers & Packaging
is anachronous version of: http://data.ga-group.nl/ics/bics/181012101312
is contemporary version of: http://data.ga-group.nl/ics/bics/1712101312
is replaced by: http://data.ga-group.nl/ics/bics/2020/181012101312
is version of: http://data.ga-group.nl/ics/bics/1712101312
is version of: http://data.ga-group.nl/ics/bics/181012101312
imported on: 2026-06-08T13:03:47.798Z
last refreshed on: 2026-06-08T13:03:47.798Z
source accessed on: 2019-12-03T20:05:01Z
source last accessed on: 2019-12-03T20:05:01Z
label: Envases y hojas plásticas @es
label: Feuilles/films d'emballage plastique @fr
label: Filme plástico para embalagem @pt
label: Pellicole e lastre imballaggi in plastica @it
label: Plastikverpackungsfilme @de
label: Пластмас. упаковочн. пленки @ru
label: 塑料包装薄膜与板材 @zh
label: 塑膠包裝膜/片 @zh-hant
label: 플라스틱 포장용 필름&시트 @ko
label: ﾌﾟﾗｽﾁｯｸ包装ﾌｨﾙﾑ/ｼｰﾄ @ja
definition: This segment includes companies that manufacture flexible plastic sheets and films used in packaging applications. Includes industrial plastic wrap and packaging shrink wrap.
notation: 1712101312
valid from: 2014-08-08
valid till: 2020-10-03

Plastic Tube Containers
type: BicsLevel5Segment
type: Classifier
type: Discontinued
type: NamedIndividual
is level5 segment of: Plastic Containers & Packaging
is contemporary version of: http://data.ga-group.nl/ics/bics/1712101313
is version of: http://data.ga-group.nl/ics/bics/1712101313
imported on: 2026-06-08T13:03:47.798Z
last refreshed on: 2026-06-08T13:03:47.798Z
source accessed on: 2019-12-03T20:05:01Z
source last accessed on: 2019-12-03T20:05:01Z
label: Contêineres de tubo plástico @pt
label: Contenants tubulaires plastiques @fr
label: Contenedores de tubos plástico @es
label: Contenitori tubi plastica @it
label: Kunststoffröhrencontainer @de
label: Пластмас. контейнеры @ru
label: 塑料管容器 @zh
label: 塑膠管容器 @zh-hant
label: 플라스틱 튜브 컨테이너 @ko
label: ﾌﾟﾗｽﾁｯｸﾁｭｰﾌﾞ容器 @ja
definition: This segment includes companies that manufacture plastic containers for packaging applications not classified elsewhere. Includes toothpaste tubes, hair gel containers and plastic merchandise boxes.
notation: 1712101313
valid from: 2014-08-08
valid till: 2020-10-03

Protective Packaging Materials
type: BicsLevel5Segment
type: Classifier
type: NamedIndividual
is level5 segment of: Plastic Containers & Packaging
is anachronous version of: http://data.ga-group.nl/ics/bics/181012101313
is contemporary version of: http://data.ga-group.nl/ics/bics/1712101314
is replaced by: http://data.ga-group.nl/ics/bics/2020/181012101313
is version of: http://data.ga-group.nl/ics/bics/1712101314
is version of: http://data.ga-group.nl/ics/bics/181012101313
imported on: 2026-06-08T13:03:47.798Z
last refreshed on: 2026-06-08T13:03:47.798Z
source accessed on: 2019-12-03T20:05:01Z
source last accessed on: 2019-12-03T20:05:01Z
label: Matériel de packaging @fr
label: Materiais de embalagens de proteção @pt
label: Materiales protectores de empaquetado @es
label: Materiali imballaggi protettivi @it
label: Schützende Verpackungsmaterialien @de
label: Защитные упаковочные материалы @ru
label: 保护包装材料 @zh
label: 保護包裝材料 @zh-hant
label: 緩衝包装材 @ja
label: 보호포장재 @ko
definition: This segment includes companies that manufacture protective packaging materials used to protect other products during shipment. Includes bubble wrap, fabricated foam and molding foam.
notation: 1712101314
valid from: 2014-08-08
valid till: 2020-10-03

Plastic Containers & Packaging
type: BicsLevel4SubIndustry
type: Classifier
type: NamedIndividual
is sub industry of: Containers & Packaging
is anachronous version of: http://data.ga-group.nl/ics/bics/1810121013
is contemporary version of: http://data.ga-group.nl/ics/bics/17121013
is replaced by: http://data.ga-group.nl/ics/bics/2020/1810121013
is version of: http://data.ga-group.nl/ics/bics/17121013
is version of: http://data.ga-group.nl/ics/bics/1810121013
imported on: 2026-06-08T13:03:47.798Z
last refreshed on: 2026-06-08T13:03:47.798Z
source accessed on: 2019-12-03T20:05:01Z
source last accessed on: 2019-12-03T20:05:01Z
label: Contêineres e embalagem de plástico @pt
label: Contenedores y embalaje plásticos @es
label: Contenitori e imballaggi plastica @it
label: Emballages/contenants plastiques @fr
label: Plastikcontainer & -verpackung @de
label: Пластиковые контейнеры и упаков. материалы @ru
label: 塑料容器与包装 @zh
label: 塑膠容器及包裝品 @zh-hant
label: 플라스틱 컨테이너&포장 @ko
label: ﾌﾟﾗｽﾁｯｸ製容器･包装材 @ja
definition: This industry subgroup includes companies that manufacture plastic containers and films used in packaging applications.
notation: 17121013
valid from: 2014-08-08
valid till: 2020-10-03

Wood Containers & Pallet
type: BicsLevel4SubIndustry
type: Classifier
type: Discontinued
type: NamedIndividual
is sub industry of: Containers & Packaging
is contemporary version of: http://data.ga-group.nl/ics/bics/17121014
is version of: http://data.ga-group.nl/ics/bics/17121014
imported on: 2026-06-08T13:03:47.798Z
last refreshed on: 2026-06-08T13:03:47.798Z
source accessed on: 2019-12-03T20:05:01Z
source last accessed on: 2019-12-03T20:05:01Z
label: Contêineres de madeira e paletes @pt
label: Contenants/palettes en bois @fr
label: Contenitori e pallet legno @it
label: Envases y paletas de madera @es
label: Holzbehälter und -paletten @de
label: Деревянные контейнеры и поддоны @ru
label: 木制容器与托盘 @zh
label: 木製ｺﾝﾃﾅ/ﾊﾟﾚｯﾄ @ja
label: 木質容器及棧板 @zh-hant
label: 목제 포장용기 및 깔판류 @ko
definition: This industry subgroup includes companies that manufacture wooden containers and pallets. Includes wooden crates, wine barrels, wooden boxes, wooden baskets and wooden pallets.
notation: 17121014
valid from: 2014-08-08
valid till: 2020-10-03

Containers & Packaging
type: BicsLevel3Industry
type: Classifier
type: NamedIndividual
is industry of: Containers & Packaging
is anachronous version of: http://data.ga-group.nl/ics/bics/18101210
is contemporary version of: http://data.ga-group.nl/ics/bics/171210
is replaced by: http://data.ga-group.nl/ics/bics/2020/18101210
is version of: http://data.ga-group.nl/ics/bics/171210
is version of: http://data.ga-group.nl/ics/bics/18101210
imported on: 2026-06-08T13:03:47.798Z
last refreshed on: 2026-06-08T13:03:47.798Z
source accessed on: 2019-12-03T20:05:01Z
source last accessed on: 2019-12-03T20:05:01Z
label: Behälter & Verpackung @de
label: Contêineres e embalagem @pt
label: Contenants et emballages @fr
label: Contenedores y embalaje @es
label: Contenitori e imballaggi @it
label: Упаковка и тара @ru
label: 容器与包装 @zh
label: 容器與包裝 @zh-hant
label: 容器･包装 @ja
label: 컨테이너 및 포장 제조업 @ko
definition: This industry includes companies that manufacture all types of containers and packaging materials.
notation: 171210
valid from: 2014-08-08
valid till: 2020-10-03

Packaging Labels
type: BicsLevel4SubIndustry
type: Classifier
type: NamedIndividual
is sub industry of: Packaging Services
is anachronous version of: http://data.ga-group.nl/ics/bics/1810121014
is contemporary version of: http://data.ga-group.nl/ics/bics/17121110
is replaced by: http://data.ga-group.nl/ics/bics/2020/1810121014
is version of: http://data.ga-group.nl/ics/bics/17121110
is version of: http://data.ga-group.nl/ics/bics/1810121014
imported on: 2026-06-08T13:03:47.798Z
last refreshed on: 2026-06-08T13:03:47.798Z
source accessed on: 2019-12-03T20:05:01Z
source last accessed on: 2019-12-03T20:05:01Z
label: Etichette imball @it
label: Etiquetas de embalagem @pt
label: Etiquetas de envase @es
label: Labels d'emballage @fr
label: Verpackungsetiketten @de
label: Упаковочные ярлыки @ru
label: 包装标签 @zh
label: 包装用ﾗﾍﾞﾙ @ja
label: 包裝標籤 @zh-hant
label: 포장 라벨 @ko
definition: This industry subgroup includes companies that manufacture packaging labels and tapes. These labels and tapes can be made of paper, plastic, or aluminum with a pressure-sensitive adhesive backing.
notation: 17121110
valid from: 2014-08-08
valid till: 2020-10-03

Packing & Crating
type: BicsLevel4SubIndustry
type: Classifier
type: Discontinued
type: NamedIndividual
is sub industry of: Packaging Services
is contemporary version of: http://data.ga-group.nl/ics/bics/17121111
is version of: http://data.ga-group.nl/ics/bics/17121111
imported on: 2026-06-08T13:03:47.798Z
last refreshed on: 2026-06-08T13:03:47.798Z
source accessed on: 2019-12-03T20:05:01Z
source last accessed on: 2019-12-03T20:05:01Z
label: Embalagem e engradados @pt
label: Emball/déséquerrage @fr
label: Envasar y empacar @es
label: Imballaggio @it
label: Verpacken&Verstauen @de
label: Упаковка и тара @ru
label: 包装与装箱 @zh
label: 包裝及裝箱 @zh-hant
label: 梱包業 @ja
label: 화물 포장업 @ko
definition: This industry subgroup includes companies that provide packing and crating services for third parties.
notation: 17121111
valid from: 2014-08-08
valid till: 2020-10-03

Other Packaging Services
type: BicsLevel4SubIndustry
type: Classifier
type: Discontinued
type: NamedIndividual
is sub industry of: Packaging Services
is contemporary version of: http://data.ga-group.nl/ics/bics/17121112
is version of: http://data.ga-group.nl/ics/bics/17121112
imported on: 2026-06-08T13:03:47.798Z
last refreshed on: 2026-06-08T13:03:47.798Z
source accessed on: 2019-12-03T20:05:01Z
source last accessed on: 2019-12-03T20:05:01Z
label: Altri servizi imballaggi @it
label: Autres services d'emballage @fr
label: Otros servicios de envase @es
label: Outros serviços de embalagem @pt
label: Sonstige Verpackungsdienste @de
label: Другие услуги по упаковке @ru
label: その他梱包ｻｰﾋﾞｽ業 @ja
label: 其他包装服务 @zh
label: 其他包裝服務 @zh-hant
label: 기타 포장 서비스 @ko
definition: This industry subgroup includes companies that provide packing services not elsewhere classified.
notation: 17121112
valid from: 2014-08-08
valid till: 2020-10-03

Packaging Services
type: BicsLevel3Industry
type: Classifier
type: Discontinued
type: NamedIndividual
is industry of: Containers & Packaging
is contemporary version of: http://data.ga-group.nl/ics/bics/171211
is version of: http://data.ga-group.nl/ics/bics/171211
imported on: 2026-06-08T13:03:47.798Z
last refreshed on: 2026-06-08T13:03:47.798Z
source accessed on: 2019-12-03T20:05:01Z
source last accessed on: 2019-12-03T20:05:01Z
label: Serv de embalagem @pt
label: Serv imballaggio @it
label: Services emballage @fr
label: Servicios de envase @es
label: Verpackungsdienste @de
label: Упаковочн. услуги @ru
label: 包装服务 @zh
label: 包裝服務 @zh-hant
label: 梱包ｻｰﾋﾞｽ @ja
label: 포장 서비스 @ko
definition: This industry includes companies that manufacture packing labels and provide packaging support services.
notation: 171211
valid from: 2014-08-08
valid till: 2020-10-03

Containers & Packaging
type: BicsLevel2IndustryGroup
type: Classifier
type: NamedIndividual
is industry group of: Materials
is anachronous version of: http://data.ga-group.nl/ics/bics/18101210
is contemporary version of: http://data.ga-group.nl/ics/bics/1712
is replaced by: http://data.ga-group.nl/ics/bics/2020/18101210
is version of: http://data.ga-group.nl/ics/bics/1712
is version of: http://data.ga-group.nl/ics/bics/18101210
imported on: 2026-06-08T13:03:47.798Z
last refreshed on: 2026-06-08T13:03:47.798Z
source accessed on: 2019-12-03T20:05:01Z
source last accessed on: 2019-12-03T20:05:01Z
label: Contêiner e embalagem @pt
label: Container & Verpackung @de
label: Contenedores y envasado @es
label: Contenitori e imballaggio @it
label: Emballages & Conteneurs @fr
label: Упаковка и емкости @ru
label: 容器与包装 @zh
label: 容器與包裝 @zh-hant
label: 容器･梱包 @ja
label: 컨테이너 및 포장 @ko
definition: This industry group includes companies that manufacture all types of containers and packaging materials. It also includes companies that engage in packing, crating and labeling services.
notation: 1712
valid from: 2014-08-08
valid till: 2020-10-03

Logging
type: BicsLevel4SubIndustry
type: Classifier
type: NamedIndividual
is sub industry of: Forestry & Logging
is anachronous version of: http://data.ga-group.nl/ics/bics/1810131011
is contemporary version of: http://data.ga-group.nl/ics/bics/17131010
is replaced by: http://data.ga-group.nl/ics/bics/2020/1810131011
is version of: http://data.ga-group.nl/ics/bics/17131010
is version of: http://data.ga-group.nl/ics/bics/1810131011
imported on: 2026-06-08T13:03:47.798Z
last refreshed on: 2026-06-08T13:03:47.798Z
source accessed on: 2019-12-03T20:05:01Z
source last accessed on: 2019-12-03T20:05:01Z
label: Exploit. forestière @fr
label: Exploração florestal @pt
label: Holzwirtschaft @de
label: Taglio/trasp legno @it
label: Tala de árboles @es
label: Лесозаготовки @ru
label: 伐木业 @zh
label: 伐木業 @zh-hant
label: 木材伐採業 @ja
label: 벌목업 @ko
definition: This industry subgroup includes companies that conduct logging operations. Such operations include cutting timber, log harvesting and wood chipping.
notation: 17131010
valid from: 2014-08-08
valid till: 2020-10-03

Nursery & Tree Products
type: BicsLevel4SubIndustry
type: Classifier
type: NamedIndividual
is sub industry of: Forestry & Logging
is anachronous version of: http://data.ga-group.nl/ics/bics/1810131012
is contemporary version of: http://data.ga-group.nl/ics/bics/17131011
is replaced by: http://data.ga-group.nl/ics/bics/2020/1810131012
is version of: http://data.ga-group.nl/ics/bics/17131011
is version of: http://data.ga-group.nl/ics/bics/1810131012
imported on: 2026-06-08T13:03:47.798Z
last refreshed on: 2026-06-08T13:03:47.798Z
source accessed on: 2019-12-03T20:05:01Z
source last accessed on: 2019-12-03T20:05:01Z
label: Coltivaz vivai @it
label: Cultivo en viveros @es
label: Gärtnerei& Baumzucht @de
label: Pépinière/arboricult @fr
label: Prod de viveiro e árvore @pt
label: Питомники и выращивание деревьев @ru
label: 種苗･植木栽培 @ja
label: 苗圃及樹生產 @zh-hant
label: 苗圃和树苗生产 @zh
label: 종묘&나무재배업 @ko
definition: This industry subgroup includes companies that specialize in operating nurseries and produce trees and plants for non-retail consumers. Typically, these companies grow these plants to be used as stock and harvest them within relatively shorter time frames. Includes flower nurseries, Christmas tree farms and rose nurseries. Exclude nurseries for retail consumers (Nursery & Garden Centers).
notation: 17131011
valid from: 2014-08-08
valid till: 2020-10-03

Rubber Plantation
type: BicsLevel4SubIndustry
type: Classifier
type: NamedIndividual
is sub industry of: Forestry & Logging
is anachronous version of: http://data.ga-group.nl/ics/bics/1810131013
is contemporary version of: http://data.ga-group.nl/ics/bics/17131012
is replaced by: http://data.ga-group.nl/ics/bics/2020/1810131013
is version of: http://data.ga-group.nl/ics/bics/17131012
is version of: http://data.ga-group.nl/ics/bics/1810131013
imported on: 2026-06-08T13:03:47.798Z
last refreshed on: 2026-06-08T13:03:47.798Z
source accessed on: 2019-12-03T20:05:01Z
source last accessed on: 2019-12-03T20:05:01Z
label: Exploração de borracha @pt
label: Explotación de goma @es
label: Gummi-Plantage @de
label: Piantagione gomma @it
label: Planta. caoutchouc @fr
label: Каучуковые плантации @ru
label: 橡胶种植 @zh
label: 橡膠林 @zh-hant
label: 고무 플랜테이션 @ko
label: ｺﾞﾑ栽培 @ja
definition: This industry subgroup includes companies that grow rubber trees.
notation: 17131012
valid from: 2014-08-08
valid till: 2020-10-03

Timber Resources
type: BicsLevel4SubIndustry
type: Classifier
type: NamedIndividual
is sub industry of: Forestry & Logging
is anachronous version of: http://data.ga-group.nl/ics/bics/1810131010
is contemporary version of: http://data.ga-group.nl/ics/bics/17131013
is replaced by: http://data.ga-group.nl/ics/bics/2020/1810131010
is version of: http://data.ga-group.nl/ics/bics/17131013
is version of: http://data.ga-group.nl/ics/bics/1810131010
imported on: 2026-06-08T13:03:47.798Z
last refreshed on: 2026-06-08T13:03:47.798Z
source accessed on: 2019-12-03T20:05:01Z
source last accessed on: 2019-12-03T20:05:01Z
label: Fontes de madeira @pt
label: Nutzholzressourcen @de
label: Recursos de madera @es
label: Ressources forestières @fr
label: Risorse legnami @it
label: Ресурсы лесосек @ru
label: 木材資源 @zh-hant
label: 木材资源 @zh
label: 森林資源 @ja
label: 목재 자원 @ko
definition: This industry subgroup includes companies that operate and manage forestry lands or timber tracts. These companies own the underlying forest land rights to grow and maintain the timber resources.
notation: 17131013
valid from: 2014-08-08
valid till: 2020-10-03

Forestry & Logging
type: BicsLevel3Industry
type: Classifier
type: NamedIndividual
is industry of: Forest & Paper Products
is anachronous version of: http://data.ga-group.nl/ics/bics/18101310
is contemporary version of: http://data.ga-group.nl/ics/bics/171310
is replaced by: http://data.ga-group.nl/ics/bics/2020/18101310
is version of: http://data.ga-group.nl/ics/bics/171310
is version of: http://data.ga-group.nl/ics/bics/18101310
imported on: 2026-06-08T13:03:47.798Z
last refreshed on: 2026-06-08T13:03:47.798Z
source accessed on: 2019-12-03T20:05:01Z
source last accessed on: 2019-12-03T20:05:01Z
label: Forestac y tala mad @es
label: Foresterie/Abattage @fr
label: Forstwirtschaft @de
label: Selvicoltura @it
label: Silvic e expl florestal @pt
label: Лесное хоз-во и лесозаг. @ru
label: 林业和伐木业 @zh
label: 林業及伐木業 @zh-hant
label: 林業･伐木業 @ja
label: 임업 & 벌목업 @ko
definition: This industry includes companies involved in the production of timber or rubber trees that are harvested in natural or planted forests. This industry also includes nursery and tree products.
notation: 171310
valid from: 2014-08-08
valid till: 2020-10-03

Newsprint Mills
type: BicsLevel4SubIndustry
type: Classifier
type: Discontinued
type: NamedIndividual
is sub industry of: Paper
is contemporary version of: http://data.ga-group.nl/ics/bics/17131110
is version of: http://data.ga-group.nl/ics/bics/17131110
imported on: 2026-06-08T13:03:47.798Z
last refreshed on: 2026-06-08T13:03:47.798Z
source accessed on: 2019-12-03T20:05:01Z
source last accessed on: 2019-12-03T20:05:01Z
label: Fábricas de papel de jornal @pt
label: Fabb carta giornale @it
label: Molinería papel per @es
label: Usine papier journal @fr
label: Zeitungspapiermühlen @de
label: Производители газетной бумаги @ru
label: 新聞用紙廠 @zh-hant
label: 新聞紙製造業 @ja
label: 新闻��纸业 @zh
label: 기타 전문 공사업 @ko
definition: This industry subgroup includes companies that manufacture newsprint and ground wood paper.
notation: 17131110
valid from: 2014-08-08
valid till: 2020-10-03

Paper Mills
type: BicsLevel4SubIndustry
type: Classifier
type: NamedIndividual
is sub industry of: Paper
is anachronous version of: http://data.ga-group.nl/ics/bics/1810131110
is contemporary version of: http://data.ga-group.nl/ics/bics/17131111
is replaced by: http://data.ga-group.nl/ics/bics/2020/1810131110
is version of: http://data.ga-group.nl/ics/bics/17131111
is version of: http://data.ga-group.nl/ics/bics/1810131110
imported on: 2026-06-08T13:03:47.798Z
last refreshed on: 2026-06-08T13:03:47.798Z
source accessed on: 2019-12-03T20:05:01Z
source last accessed on: 2019-12-03T20:05:01Z
label: Fábricas de papel @pt
label: Fabbriche di carta @it
label: Molinería de papel @es
label: Papierfabriken @de
label: Usines de papier @fr
label: Заводы по произв. бумаги @ru
label: 紙廠(新聞用紙除外) @zh-hant
label: 製紙業(除新聞紙) @ja
label: 造纸(新闻纸除外)业 @zh
label: 종이 제조업 @ko
definition: This industry subgroup includes companies that manufactures a diverse offering of paper and paper products from pulp.
notation: 17131111
valid from: 2014-08-08
valid till: 2020-10-03

Pulp Mills
type: BicsLevel4SubIndustry
type: Classifier
type: NamedIndividual
is sub industry of: Paper
is anachronous version of: http://data.ga-group.nl/ics/bics/1810131111
is contemporary version of: http://data.ga-group.nl/ics/bics/17131112
is replaced by: http://data.ga-group.nl/ics/bics/2020/1810131111
is version of: http://data.ga-group.nl/ics/bics/17131112
is version of: http://data.ga-group.nl/ics/bics/1810131111
imported on: 2026-06-08T13:03:47.798Z
last refreshed on: 2026-06-08T13:03:47.798Z
source accessed on: 2019-12-03T20:05:01Z
source last accessed on: 2019-12-03T20:05:01Z
label: Fábricas de celulose @pt
label: Fabbriche di pasta @it
label: Molinería celulosa @es
label: Usines pâte à papier @fr
label: Zellstofffabriken @de
label: Заводы по произв. целлюлозы @ru
label: 紙漿廠 @zh-hant
label: 纸浆制造 @zh
label: 펄프 제조업 @ko
label: ﾊﾟﾙﾌﾟ製造業 @ja
definition: This industry subgroup includes mills that produce pulp from plant materials.
notation: 17131112
valid from: 2014-08-08
valid till: 2020-10-03

Paper
type: BicsLevel3Industry
type: Classifier
type: NamedIndividual
is industry of: Forest & Paper Products
is anachronous version of: http://data.ga-group.nl/ics/bics/18101311
is contemporary version of: http://data.ga-group.nl/ics/bics/171311
is replaced by: http://data.ga-group.nl/ics/bics/2020/18101311
is version of: http://data.ga-group.nl/ics/bics/171311
is version of: http://data.ga-group.nl/ics/bics/18101311
imported on: 2026-06-08T13:03:47.798Z
last refreshed on: 2026-06-08T13:03:47.798Z
source accessed on: 2019-12-03T20:05:01Z
source last accessed on: 2019-12-03T20:05:01Z
label: Carta @it
label: Papel @es
label: Papier @de
label: Бумага @ru
label: 紙 @zh-hant
label: 纸类 @zh
label: 製紙 @ja
label: 제지업 @ko
definition: This industry includes companies that manufacture bulk paper with primary applications for printing as well as raw pulp materials.
notation: 171311
valid from: 2014-08-08
valid till: 2020-10-03

Forest & Paper Products
type: BicsLevel2IndustryGroup
type: Classifier
type: NamedIndividual
is industry group of: Materials
is anachronous version of: http://data.ga-group.nl/ics/bics/181013
is contemporary version of: http://data.ga-group.nl/ics/bics/1713
is replaced by: http://data.ga-group.nl/ics/bics/2020/181013
is version of: http://data.ga-group.nl/ics/bics/1713
is version of: http://data.ga-group.nl/ics/bics/181013
imported on: 2026-06-08T13:03:47.798Z
last refreshed on: 2026-06-08T13:03:47.798Z
source accessed on: 2019-12-03T20:05:01Z
source last accessed on: 2019-12-03T20:05:01Z
label: Forst- & Papierprodukte @de
label: Prod de produtos florestais e papel @pt
label: Prod forestales/pap @es
label: Prod forestali @it
label: Produits forestiers/du papier @fr
label: Бумага и лесопродукты @ru
label: 林木及紙產品 @zh-hant
label: 林木和纸类产��� @zh
label: 林産物･紙製品 @ja
label: 임업 & 종이제품 @ko
definition: This industry group includes companies that conduct forestry operations and that manufacture paper products.
notation: 1713
valid from: 2014-08-08
valid till: 2020-10-03

Iron Mills
type: BicsLevel4SubIndustry
type: Classifier
type: Discontinued
type: NamedIndividual
is sub industry of: Steel Raw Material Suppliers
is contemporary version of: http://data.ga-group.nl/ics/bics/17141010
is version of: http://data.ga-group.nl/ics/bics/17141010
imported on: 2026-06-08T13:03:47.798Z
last refreshed on: 2026-06-08T13:03:47.798Z
source accessed on: 2019-12-03T20:05:01Z
source last accessed on: 2019-12-03T20:05:01Z
label: Eisenwerke @de
label: Fabbriche di ferro @it
label: Ferronnerie @fr
label: Molinos de hierro @es
label: Produção de ferro @pt
label: Железолитейные заводы @ru
label: 煉鐵廠 @zh-hant
label: 鉄製造 @ja
label: 钢铁 @zh
label: 제철소 @ko
definition: This industry subgroup includes companies that smelt iron ore into various intermediate ingot forms. Includes pig iron and iron ingots. Excludes companies that smelt iron ore and cast products into finished goods (see Iron Foundries).
notation: 17141010
valid from: 2014-08-08
valid till: 2020-10-03

Iron Ore Mining
type: BicsLevel4SubIndustry
type: Classifier
type: NamedIndividual
is sub industry of: Steel Raw Material Suppliers
is anachronous version of: http://data.ga-group.nl/ics/bics/1810151010
is contemporary version of: http://data.ga-group.nl/ics/bics/17141011
is replaced by: http://data.ga-group.nl/ics/bics/2020/1810151010
is version of: http://data.ga-group.nl/ics/bics/17141011
is version of: http://data.ga-group.nl/ics/bics/1810151010
imported on: 2026-06-08T13:03:47.798Z
last refreshed on: 2026-06-08T13:03:47.798Z
source accessed on: 2019-12-03T20:05:01Z
source last accessed on: 2019-12-03T20:05:01Z
label: Eisenerzabbau @de
label: Estraz min di ferro @it
label: Extração de minério de ferro @pt
label: Mine minerais de fer @fr
label: Minería de hierro @es
label: Добыча железных руд @ru
label: 生铁矿业 @zh
label: 鉄鉱石業 @ja
label: 鐵礦業 @zh-hant
label: 철 광업 @ko
definition: This industry subgroup includes companies that mine ire ore as a raw material for steel making. The may also be in the business of exploring for new locations for mining iron ore.
notation: 17141011
valid from: 2014-08-08
valid till: 2020-10-03

Metallurgical Coal
type: BicsLevel4SubIndustry
type: Classifier
type: NamedIndividual
is sub industry of: Steel Raw Material Suppliers
is anachronous version of: http://data.ga-group.nl/ics/bics/1810151411
is contemporary version of: http://data.ga-group.nl/ics/bics/17141012
is replaced by: http://data.ga-group.nl/ics/bics/2020/1810151411
is version of: http://data.ga-group.nl/ics/bics/17141012
is version of: http://data.ga-group.nl/ics/bics/1810151411
imported on: 2026-06-08T13:03:47.798Z
last refreshed on: 2026-06-08T13:03:47.798Z
source accessed on: 2019-12-03T20:05:01Z
source last accessed on: 2019-12-03T20:05:01Z
label: Carbón metalúrgico @es
label: Carbone metallurgico @it
label: Carvão metalúrgico @pt
label: Charbon métallurgi. @fr
label: Metallurg Kohleabbau @de
label: Коксующийся у��оль @ru
label: 冶金煤炭采矿 @zh
label: 冶金用煤 @zh-hant
label: 原料炭採鉱業 @ja
label: 원료탄 @ko
definition: This industry subgroup includes companies that mine metallurgical coal. Metallurgical coal is a type of bituminous coal used primarily for the production of steel. Excludes coal that is used in energy production or heating (see Coal Mining). Also known as coking coal.
notation: 17141012
valid from: 2014-08-08
valid till: 2020-10-03

Steel Scrap
type: BicsLevel4SubIndustry
type: Classifier
type: Discontinued
type: NamedIndividual
is sub industry of: Steel Raw Material Suppliers
is contemporary version of: http://data.ga-group.nl/ics/bics/17141013
is version of: http://data.ga-group.nl/ics/bics/17141013
imported on: 2026-06-08T13:03:47.798Z
last refreshed on: 2026-06-08T13:03:47.798Z
source accessed on: 2019-12-03T20:05:01Z
source last accessed on: 2019-12-03T20:05:01Z
label: Acero desechado @es
label: Déchets acier @fr
label: Rottame acciaio @it
label: Stahlschrott @de
label: Sucata de aço @pt
label: Стальной скрап @ru
label: 废钢 @zh
label: 廢鋼 @zh-hant
label: 鉄ｽｸﾗｯﾌﾟ @ja
label: 강철스크랩 @ko
definition: This industry subgroup includes companies that specialize in the wholesale and distribution of steel scraps to steel producers. These companies may also gather and process the steel scrap. Excludes companies that gather, process and sell non-steel scrap metal (see Recyclable Materials).
notation: 17141013
valid from: 2014-08-08
valid till: 2020-10-03

Steel Raw Material Suppliers
type: BicsLevel3Industry
type: Classifier
type: Discontinued
type: NamedIndividual
is industry of: Iron & Steel
is contemporary version of: http://data.ga-group.nl/ics/bics/171410
is version of: http://data.ga-group.nl/ics/bics/171410
imported on: 2026-06-08T13:03:47.798Z
last refreshed on: 2026-06-08T13:03:47.798Z
source accessed on: 2019-12-03T20:05:01Z
source last accessed on: 2019-12-03T20:05:01Z
label: Fornec mat aço bruto @pt
label: Fornitori mat prime acciaio @it
label: Fournisseurs mat prem acier @fr
label: Provs mats de acero bruto @es
label: Stahlrohmaterialienlieferant @de
label: Поставщики сырья металла @ru
label: 鉄鋼原材料供給業 @ja
label: 鋼原料供應商 @zh-hant
label: 钢原料供应商 @zh
label: 철강 원자재 공급업체 @ko
definition: This industry includes companies that supply all raw materials used to produce steel.
notation: 171410
valid from: 2014-08-08
valid till: 2020-10-03

Iron Foundries
type: BicsLevel4SubIndustry
type: Classifier
type: NamedIndividual
is sub industry of: Iron & Steel Foundry
is anachronous version of: http://data.ga-group.nl/ics/bics/1810151011
is contemporary version of: http://data.ga-group.nl/ics/bics/17141110
is replaced by: http://data.ga-group.nl/ics/bics/2020/1810151011
is version of: http://data.ga-group.nl/ics/bics/17141110
is version of: http://data.ga-group.nl/ics/bics/1810151011
imported on: 2026-06-08T13:03:47.798Z
last refreshed on: 2026-06-08T13:03:47.798Z
source accessed on: 2019-12-03T20:05:01Z
source last accessed on: 2019-12-03T20:05:01Z
label: Eisengießereien @de
label: Fonderie di ferro @it
label: Fonderies de fer @fr
label: Fundições de ferro @pt
label: Fundiciones hierro @es
label: Железолитейные заводы @ru
label: 鉄鋳造 @ja
label: 鑄鐵業 @zh-hant
label: 铸铁厂 @zh
label: 철 주조업 @ko
definition: This industry subgroup includes companies that cast molten iron into various shapes or products in the companies' own iron foundries. Companies in this segment purchase iron made by other firms.
notation: 17141110
valid from: 2014-08-08
valid till: 2020-10-03

Steel Foundries
type: BicsLevel4SubIndustry
type: Classifier
type: Discontinued
type: NamedIndividual
is sub industry of: Iron & Steel Foundry
is contemporary version of: http://data.ga-group.nl/ics/bics/17141111
is version of: http://data.ga-group.nl/ics/bics/17141111
imported on: 2026-06-08T13:03:47.798Z
last refreshed on: 2026-06-08T13:03:47.798Z
source accessed on: 2019-12-03T20:05:01Z
source last accessed on: 2019-12-03T20:05:01Z
label: Fonderie acciaio @it
label: Fonderies d'acier @fr
label: Fundições de aço @pt
label: Fundiciones acero @es
label: Stahlgießereien @de
label: Сталелитейные заводы @ru
label: 鋼鉄鋳造 @ja
label: 鋼鐵鑄造業 @zh-hant
label: 钢铁铸造（熔模除外） @zh
label: 강철 주조업 @ko
definition: This industry subgroup includes companies that cast steel into various shapes or products in the companies' own steel foundries. Companies in this area purchase steel made by other firms.
notation: 17141111
valid from: 2014-08-08
valid till: 2020-10-03

Iron & Steel Foundry
type: BicsLevel3Industry
type: Classifier
type: Discontinued
type: NamedIndividual
is industry of: Iron & Steel
is contemporary version of: http://data.ga-group.nl/ics/bics/171411
is version of: http://data.ga-group.nl/ics/bics/171411
imported on: 2026-06-08T13:03:47.798Z
last refreshed on: 2026-06-08T13:03:47.798Z
source accessed on: 2019-12-03T20:05:01Z
source last accessed on: 2019-12-03T20:05:01Z
label: Eisen-&Stahlgießerei @de
label: Fond acciaio ferro @it
label: Fonderie acier/fer @fr
label: Fund ferro e aço @pt
label: Fund hierro/acero @es
label: Чугунолитейный/сталелитейный цех @ru
label: 鉄･製鋼鋳造 @ja
label: 鋼鐵鑄造業 @zh-hant
label: 钢铁铸造业 @zh
label: 철강 주조 @ko
definition: This industry includes companies that cast iron and steel into various products. Such companies purchase steel and iron made by other firms.
notation: 171411
valid from: 2014-08-08
valid till: 2020-10-03

Flat Rolled
type: BicsLevel4SubIndustry
type: Classifier
type: NamedIndividual
is sub industry of: Steel Producers
is anachronous version of: http://data.ga-group.nl/ics/bics/1810141010
is contemporary version of: http://data.ga-group.nl/ics/bics/17141210
is replaced by: http://data.ga-group.nl/ics/bics/2020/1810141010
is version of: http://data.ga-group.nl/ics/bics/17141210
is version of: http://data.ga-group.nl/ics/bics/1810141010
imported on: 2026-06-08T13:03:47.798Z
last refreshed on: 2026-06-08T13:03:47.798Z
source accessed on: 2019-12-03T20:05:01Z
source last accessed on: 2019-12-03T20:05:01Z
label: Flachstahl @de
label: Laminé plat @fr
label: Laminado plano @es
label: Laminado @pt
label: Laminati piatti @it
label: Полосовая сталь @ru
label: 圧延製品 @ja
label: 扁軋鋼 @zh-hant
label: 扁钢材 @zh
label: 압연평판 @ko
definition: This industry subgroup includes companies that produce steel processed on rolls with flat faces that create flat, sheeted steel products. Includes sheets (hot-rolled, cold-rolled, galvanized), strip and tin. Excludes steel products processed on grooved or cut faces (see Long, Pipe & Tubular).
notation: 17141210
valid from: 2014-08-08
valid till: 2020-10-03

Long Products
type: BicsLevel5Segment
type: Classifier
type: NamedIndividual
is level5 segment of: Long, Pipe & Tubular
is anachronous version of: http://data.ga-group.nl/ics/bics/181014101110
is contemporary version of: http://data.ga-group.nl/ics/bics/1714121110
is replaced by: http://data.ga-group.nl/ics/bics/2020/181014101110
is version of: http://data.ga-group.nl/ics/bics/1714121110
is version of: http://data.ga-group.nl/ics/bics/181014101110
imported on: 2026-06-08T13:03:47.798Z
last refreshed on: 2026-06-08T13:03:47.798Z
source accessed on: 2019-12-03T20:05:01Z
source last accessed on: 2019-12-03T20:05:01Z
label: Long Produkte @de
label: Prodotti long @it
label: Productos largos @es
label: Produits longs @fr
label: Produtos longos @pt
label: Долгосрочные продукты @ru
label: 条鋼 @ja
label: 長型產品 @zh-hant
label: 长材 @zh
label: 장형 제품 @ko
definition: This segment includes companies that produce long products. Includes angles, channels, I-beams, rebar, rods and bars.
notation: 1714121110
valid from: 2014-08-08
valid till: 2020-10-03

Pipe & Tubular
type: BicsLevel5Segment
type: Classifier
type: NamedIndividual
is level5 segment of: Long, Pipe & Tubular
is anachronous version of: http://data.ga-group.nl/ics/bics/181014101111
is contemporary version of: http://data.ga-group.nl/ics/bics/1714121111
is replaced by: http://data.ga-group.nl/ics/bics/2020/181014101111
is version of: http://data.ga-group.nl/ics/bics/1714121111
is version of: http://data.ga-group.nl/ics/bics/181014101111
imported on: 2026-06-08T13:03:47.798Z
last refreshed on: 2026-06-08T13:03:47.798Z
source accessed on: 2019-12-03T20:05:01Z
source last accessed on: 2019-12-03T20:05:01Z
label: Condutt e tubol @it
label: Ducto y tubular @es
label: Oleodutos e tubulação @pt
label: Rohr & röhrenförmig @de
label: Tuyaux et tubes @fr
label: Трубы @ru
label: 管材 @zh
label: 鋼管 @ja
label: 강관 @ko
definition: This segment includes companies that produce steel tubes and pipes.
notation: 1714121111
valid from: 2014-08-08
valid till: 2020-10-03

Steel Wire Drawing
type: BicsLevel5Segment
type: Classifier
type: NamedIndividual
is level5 segment of: Long, Pipe & Tubular
is anachronous version of: http://data.ga-group.nl/ics/bics/181014101112
is contemporary version of: http://data.ga-group.nl/ics/bics/1714121112
is replaced by: http://data.ga-group.nl/ics/bics/2020/181014101112
is version of: http://data.ga-group.nl/ics/bics/1714121112
is version of: http://data.ga-group.nl/ics/bics/181014101112
imported on: 2026-06-08T13:03:47.798Z
last refreshed on: 2026-06-08T13:03:47.798Z
source accessed on: 2019-12-03T20:05:01Z
source last accessed on: 2019-12-03T20:05:01Z
label: Etirage fils d'acier @fr
label: Extr alambres acero @es
label: Rinven filo acciaio @it
label: Trefilação de fios de aço @pt
label: Ziehen v. Stahldraht @de
label: Волочение стальных пружин @ru
label: 伸鋼線製造 @ja
label: 线材拉丝 @zh
label: 鋼線伸線 @zh-hant
label: 강선 제조업 @ko
definition: This segment includes companies that manufacture steel wire.
notation: 1714121112
valid from: 2014-08-08
valid till: 2020-10-03

Long, Pipe & Tubular
type: BicsLevel4SubIndustry
type: Classifier
type: NamedIndividual
is sub industry of: Steel Producers
is anachronous version of: http://data.ga-group.nl/ics/bics/1810141011
is contemporary version of: http://data.ga-group.nl/ics/bics/17141211
is replaced by: http://data.ga-group.nl/ics/bics/2020/1810141011
is version of: http://data.ga-group.nl/ics/bics/17141211
is version of: http://data.ga-group.nl/ics/bics/1810141011
imported on: 2026-06-08T13:03:47.798Z
last refreshed on: 2026-06-08T13:03:47.798Z
source accessed on: 2019-12-03T20:05:01Z
source last accessed on: 2019-12-03T20:05:01Z
label: Lang, Röhre & röhrenförmig @de
label: Largo, ducto y tubular @es
label: Long, conduttura, tubolare @it
label: Long, tuyaux et tubes @fr
label: Tubulares, longos e dutos @pt
label: Сортовой прокат, трубы @ru
label: 条鋼､鋼管 @ja
label: 钢管 @zh
label: 長管材 @zh-hant
label: 장강, 강관 @ko
definition: This industry subgroup includes companies that produce steel processed on rolls with grooved or cut faces.
notation: 17141211
valid from: 2014-08-08
valid till: 2020-10-03

Specialty Metals
type: BicsLevel4SubIndustry
type: Classifier
type: NamedIndividual
is sub industry of: Steel Producers
is anachronous version of: http://data.ga-group.nl/ics/bics/1810141012
is contemporary version of: http://data.ga-group.nl/ics/bics/17141212
is replaced by: http://data.ga-group.nl/ics/bics/2020/1810141012
is version of: http://data.ga-group.nl/ics/bics/17141212
is version of: http://data.ga-group.nl/ics/bics/1810141012
imported on: 2026-06-08T13:03:47.798Z
last refreshed on: 2026-06-08T13:03:47.798Z
source accessed on: 2019-12-03T20:05:01Z
source last accessed on: 2019-12-03T20:05:01Z
label: Métaux spéciaux @fr
label: Metais específicos @pt
label: Metales especiales @es
label: Metalli specializzati @it
label: Sondermetalle @de
label: Металлы со спец. свойствами @ru
label: 特殊金属 @ja
label: 特殊金屬 @zh-hant
label: 特种金属 @zh
label: 특수 금속 @ko
definition: This industry subgroup includes companies that manufacture flat-rolled and long products made of stainless steel, titanium, and high alloy steels.
notation: 17141212
valid from: 2014-08-08
valid till: 2020-10-03

Steel Producers
type: BicsLevel3Industry
type: Classifier
type: NamedIndividual
is industry of: Iron & Steel
is anachronous version of: http://data.ga-group.nl/ics/bics/18101410
is contemporary version of: http://data.ga-group.nl/ics/bics/171412
is replaced by: http://data.ga-group.nl/ics/bics/2020/18101410
is version of: http://data.ga-group.nl/ics/bics/171412
is version of: http://data.ga-group.nl/ics/bics/18101410
imported on: 2026-06-08T13:03:47.798Z
last refreshed on: 2026-06-08T13:03:47.798Z
source accessed on: 2019-12-03T20:05:01Z
source last accessed on: 2019-12-03T20:05:01Z
label: Producteurs d'acier @fr
label: Productores de acero @es
label: Produtores de aço @pt
label: Produttori acciaio @it
label: Stahlproduzenten @de
label: Производители стали @ru
label: 鉄鋼製造 @ja
label: 鋼製造業 @zh-hant
label: 钢产品 @zh
label: 철강 제조업체 @ko
definition: This industry includes companies that produce steel and steel products. Typically, these companies are vertically integrated and operate their own iron and steel mills.
notation: 171412
valid from: 2014-08-08
valid till: 2020-10-03

Iron & Steel Wholesalers
type: BicsLevel4SubIndustry
type: Classifier
type: Discontinued
type: NamedIndividual
is sub industry of: Metal Svc Center & Other Whslrs
is contemporary version of: http://data.ga-group.nl/ics/bics/17141310
is version of: http://data.ga-group.nl/ics/bics/17141310
imported on: 2026-06-08T13:03:47.798Z
last refreshed on: 2026-06-08T13:03:47.798Z
source accessed on: 2019-12-03T20:05:01Z
source last accessed on: 2019-12-03T20:05:01Z
label: Atacadistas de aço e ferro @pt
label: Comercio al por mayor de hierro y acero @es
label: Großhändler für Eisen & Stahl @de
label: Grossistes en fer et acier @fr
label: Grossisti ferro e acciaio @it
label: Оптовые продавцы-железо и сталь @ru
label: 鉄･ｽﾁｰﾙ卸売 @ja
label: 鋼鐵批發 @zh-hant
label: 钢铁批发商 @zh
label: 철 & 강철 상품 도매업 @ko
definition: This industry subgroup includes companies that wholesale and distribute steel raw materials or ferrous finished products.
notation: 17141310
valid from: 2014-08-08
valid till: 2020-10-03

Service Centers
type: BicsLevel5Segment
type: Classifier
type: NamedIndividual
is level5 segment of: Steel Processors
is anachronous version of: http://data.ga-group.nl/ics/bics/1810141110
is contemporary version of: http://data.ga-group.nl/ics/bics/1714131110
is replaced by: http://data.ga-group.nl/ics/bics/2020/1810141110
is version of: http://data.ga-group.nl/ics/bics/1714131110
is version of: http://data.ga-group.nl/ics/bics/1810141110
imported on: 2026-06-08T13:03:47.798Z
last refreshed on: 2026-06-08T13:03:47.798Z
source accessed on: 2019-12-03T20:05:01Z
source last accessed on: 2019-12-03T20:05:01Z
label: Centres de service @fr
label: Centri servizi @it
label: Centros de servicios @es
label: Centros serviço @pt
label: Service-Centers @de
label: Центры обслуживания @ru
label: 服务中心 @zh
label: 服務中心 @zh-hant
label: 서비스 센터 @ko
label: ｻｰﾋﾞｽｾﾝﾀｰ @ja
definition: This segment includes companies that operate metal service center locations that distribute metal products to industrial customers. Products include steel, cast iron, metal pipes, nonferrous metal products, metal storage tanks and metal tubing. These service centers also provide value-added services including cutting, tempering, cold rolling, heat treating, and painting.
notation: 1714131110
valid from: 2014-08-08
valid till: 2020-10-03

Toll Processors
type: BicsLevel5Segment
type: Classifier
type: Discontinued
type: NamedIndividual
is level5 segment of: Steel Processors
is contemporary version of: http://data.ga-group.nl/ics/bics/1714131111
is version of: http://data.ga-group.nl/ics/bics/1714131111
imported on: 2026-06-08T13:03:47.798Z
last refreshed on: 2026-06-08T13:03:47.798Z
source accessed on: 2019-12-03T20:05:01Z
source last accessed on: 2019-12-03T20:05:01Z
label: Mautprozessoren @de
label: Procesadores de cuotas @es
label: Process pedágio @pt
label: Processori @it
label: Traitement de péages @fr
label: Платные переработчики @ru
label: 收費處理器 @zh-hant
label: 收费处理器 @zh
label: 料金処理装置 @ja
label: 통행료 처리장치 @ko
definition: This segment includes companies that provide steel processing services for a toll fee. These companies do not take legal possession of the material.
notation: 1714131111
valid from: 2014-08-08
valid till: 2020-10-03

Steel Processors
type: BicsLevel4SubIndustry
type: Classifier
type: NamedIndividual
is sub industry of: Metal Svc Center & Other Whslrs
is anachronous version of: http://data.ga-group.nl/ics/bics/1810141111
is contemporary version of: http://data.ga-group.nl/ics/bics/17141311
is replaced by: http://data.ga-group.nl/ics/bics/2020/1810141111
is version of: http://data.ga-group.nl/ics/bics/17141311
is version of: http://data.ga-group.nl/ics/bics/1810141111
imported on: 2026-06-08T13:03:47.798Z
last refreshed on: 2026-06-08T13:03:47.798Z
source accessed on: 2019-12-03T20:05:01Z
source last accessed on: 2019-12-03T20:05:01Z
label: Procesadores de acero @es
label: Processamento de aço @pt
label: Stahlverarbeiter @de
label: Transformation de l'acier @fr
label: Trattamento acciaio @it
label: Устройства по обработке стали @ru
label: 鉄鋼加工��� @ja
label: 鋼鐵處理 @zh-hant
label: 钢加工 @zh
label: 철강 가공업 @ko
definition: This industry subgroup includes companies that operate service centers or provide processing service on metal products. Excludes companies that wholesale and distribute from a storefront location (see Service Center).
notation: 17141311
valid from: 2014-08-08
valid till: 2020-10-03

Metal Svc Center & Other Whslrs
type: BicsLevel3Industry
type: Classifier
type: NamedIndividual
is industry of: Iron & Steel
is anachronous version of: http://data.ga-group.nl/ics/bics/18101411
is contemporary version of: http://data.ga-group.nl/ics/bics/171413
is replaced by: http://data.ga-group.nl/ics/bics/2020/18101411
is version of: http://data.ga-group.nl/ics/bics/171413
is version of: http://data.ga-group.nl/ics/bics/18101411
imported on: 2026-06-08T13:03:47.798Z
last refreshed on: 2026-06-08T13:03:47.798Z
source accessed on: 2019-12-03T20:05:01Z
source last accessed on: 2019-12-03T20:05:01Z
label: Centres serv métaux/autres grossistes @fr
label: Centro de serv de metal y y otros al p/mayor @es
label: Centro serv metalli e altri grossisti @it
label: Centros serv metal e outros atadistas @pt
label: Metalldienstleistungszentren & sonstiger Großhdl. @de
label: Сервис-центры по металлу и опт. продавцы @ru
label: 金属服务中心及其他批发商 @zh
label: 金属ｻｰﾋﾞｽｾﾝﾀｰ･他金属卸売 @ja
label: 金屬服務中心/其他批發 @zh-hant
label: 금속서비스센터/기타도매 @ko
definition: This industry includes companies that wholesale and distribute steel raw materials or ferrous finished products.
notation: 171413
valid from: 2014-08-08
valid till: 2020-10-03

Iron & Steel
type: BicsLevel2IndustryGroup
type: Classifier
type: NamedIndividual
is industry group of: Materials
is anachronous version of: http://data.ga-group.nl/ics/bics/181014
is contemporary version of: http://data.ga-group.nl/ics/bics/1714
is replaced by: http://data.ga-group.nl/ics/bics/2020/181014
is version of: http://data.ga-group.nl/ics/bics/1714
is version of: http://data.ga-group.nl/ics/bics/181014
imported on: 2026-06-08T13:03:47.798Z
last refreshed on: 2026-06-08T13:03:47.798Z
source accessed on: 2019-12-03T20:05:01Z
source last accessed on: 2019-12-03T20:05:01Z
label: Eisen & Stahl @de
label: Fer et acier @fr
label: Ferro e aço @pt
label: Ferro e acciaio @it
label: Hierro y acero @es
label: Железо и сталь @ru
label: 鉄鋼 @ja
label: 鋼鐵 @zh-hant
label: 钢铁 @zh
label: 제철제강 @ko
definition: This industry group includes companies that operate throughout the steel manufacturing supply chain.
notation: 1714
valid from: 2014-08-08
valid till: 2020-10-03

Primary Aluminum Smelt & Refin
type: BicsLevel6Segment
type: Classifier
type: Discontinued
type: NamedIndividual
is level6 segment of: Aluminum Smelting & Refining
is contemporary version of: http://data.ga-group.nl/ics/bics/171510101010
is version of: http://data.ga-group.nl/ics/bics/171510101010
imported on: 2026-06-08T13:03:47.798Z
last refreshed on: 2026-06-08T13:03:47.798Z
source accessed on: 2019-12-03T20:05:01Z
source last accessed on: 2019-12-03T20:05:01Z
label: Fund ref primária de alumínio @pt
label: Fundición y refinación primarias de aluminio @es
label: Fusion/affinage alum primaire @fr
label: Fusione e raff primaria alluminio @it
label: Schmelz. & Raffin. von Primäralum. @de
label: Плавка и очистка первичного алюминия @ru
label: 原铝冶炼与精炼 @zh
label: 鋁材一次冶煉及精製 @zh-hant
label: 제1차 알루미늄 제련 및 정제업 @ko
label: ｱﾙﾐﾆｳﾑ第1次精錬･精製 @ja
definition: This segment includes companies that are primary producers and refiners of aluminum and aluminum products.
notation: 171510101010
valid from: 2014-08-08
valid till: 2020-10-03

Secondary Alum Smelt & Refining
type: BicsLevel6Segment
type: Classifier
type: Discontinued
type: NamedIndividual
is level6 segment of: Aluminum Smelting & Refining
is contemporary version of: http://data.ga-group.nl/ics/bics/171510101011
is version of: http://data.ga-group.nl/ics/bics/171510101011
imported on: 2026-06-08T13:03:47.798Z
last refreshed on: 2026-06-08T13:03:47.798Z
source accessed on: 2019-12-03T20:05:01Z
source last accessed on: 2019-12-03T20:05:01Z
label: Fund e ref secundária alumínio @pt
label: Fundición y refinación secundarias de aluminio @es
label: Fusion/affinage alum sec @fr
label: Fusione e raff secondaria rame @it
label: Schmelz. & Raffin. von Sekundäralum. @de
label: Плавка и очистка вторичного алюминия @ru
label: 再生铝冶炼与精炼 @zh
label: 鋁材二次冶煉及精製 @zh-hant
label: 제2차 알루미늄 제련 및 정제업 @ko
label: ｱﾙﾐﾆｳﾑ第2次精錬･精製 @ja
definition: This segment includes companies that are secondary producers and refiners of aluminum and aluminum products.
notation: 171510101011
valid from: 2014-08-08
valid till: 2020-10-03

Aluminum Smelting & Refining
type: BicsLevel5Segment
type: Classifier
type: NamedIndividual
is level5 segment of: Aluminum
is anachronous version of: http://data.ga-group.nl/ics/bics/181015111011
is contemporary version of: http://data.ga-group.nl/ics/bics/1715101010
is replaced by: http://data.ga-group.nl/ics/bics/2020/181015111011
is version of: http://data.ga-group.nl/ics/bics/1715101010
is version of: http://data.ga-group.nl/ics/bics/181015111011
imported on: 2026-06-08T13:03:47.798Z
last refreshed on: 2026-06-08T13:03:47.798Z
source accessed on: 2019-12-03T20:05:01Z
source last accessed on: 2019-12-03T20:05:01Z
label: Fundição e refinção de alumínio @pt
label: Fundición y refinación de aluminio @es
label: Fusion et affinage d'aluminium @fr
label: Fusione e raffinazione alluminio @it
label: Schmelzung & Raffinierung von Aluminium @de
label: Выплавка алюминия @ru
label: 鋁冶鍊及精製 @zh-hant
label: 铝冶炼与精炼 @zh
label: 알루미늄 제련 & 정제업 @ko
label: ｱﾙﾐﾆｳﾑ精錬 @ja
definition: This segment includes companies that produce aluminum from alumina.
notation: 1715101010
valid from: 2014-08-08
valid till: 2020-10-03

Bauxite Mining & Alumina Refin
type: BicsLevel5Segment
type: Classifier
type: NamedIndividual
is level5 segment of: Aluminum
is anachronous version of: http://data.ga-group.nl/ics/bics/181015111010
is contemporary version of: http://data.ga-group.nl/ics/bics/1715101011
is replaced by: http://data.ga-group.nl/ics/bics/2020/181015111010
is version of: http://data.ga-group.nl/ics/bics/1715101011
is version of: http://data.ga-group.nl/ics/bics/181015111010
imported on: 2026-06-08T13:03:47.798Z
last refreshed on: 2026-06-08T13:03:47.798Z
source accessed on: 2019-12-03T20:05:01Z
source last accessed on: 2019-12-03T20:05:01Z
label: Bauxitbergbau & Aluminiumoxid-Raffin. @de
label: Estrazione bauxite e raff allumina @it
label: Extraction bauxite/affin alumine @fr
label: Minería de bauxita y refinación de alúmina @es
label: Mineração de bauxita e ref alumina @pt
label: Добыча и переработка алюминиевых руд @ru
label: 鋁土礦及精煉鋁 @zh-hant
label: 铝土采矿与铝精炼 @zh
label: 보크사이트 광업 & 알루미나 제련업 @ko
label: ﾎﾞｰｷｻｲﾄ採掘･ｱﾙﾐ精製 @ja
definition: This segment includes companies that mine bauxite and refine bauxite into alumina.
notation: 1715101011
valid from: 2014-08-08
valid till: 2020-10-03

Aluminum
type: BicsLevel4SubIndustry
type: Classifier
type: NamedIndividual
is sub industry of: Base Metals
is anachronous version of: http://data.ga-group.nl/ics/bics/1810151110
is contemporary version of: http://data.ga-group.nl/ics/bics/17151010
is replaced by: http://data.ga-group.nl/ics/bics/2020/1810151110
is version of: http://data.ga-group.nl/ics/bics/17151010
is version of: http://data.ga-group.nl/ics/bics/1810151110
imported on: 2026-06-08T13:03:47.798Z
last refreshed on: 2026-06-08T13:03:47.798Z
source accessed on: 2019-12-03T20:05:01Z
source last accessed on: 2019-12-03T20:05:01Z
label: Alluminio @it
label: Alumínio @pt
label: Aluminio @es
label: Aluminium @de
label: Алюминий @ru
label: 鋁 @zh-hant
label: 铝 @zh
label: 알루미늄 @ko
label: ｱﾙﾐﾆｳﾑ @ja
definition: This industry subgroup includes companies that mine bauxite, produce alumina and smelt aluminum. It also includes companies that smelt and recycle secondary aluminum.
notation: 17151010
valid from: 2014-08-08
valid till: 2020-10-03

Cobalt
type: BicsLevel4SubIndustry
type: Classifier
type: NamedIndividual
is sub industry of: Base Metals
is anachronous version of: http://data.ga-group.nl/ics/bics/1810151111
is contemporary version of: http://data.ga-group.nl/ics/bics/17151011
is replaced by: http://data.ga-group.nl/ics/bics/2020/1810151111
is version of: http://data.ga-group.nl/ics/bics/17151011
is version of: http://data.ga-group.nl/ics/bics/1810151111
imported on: 2026-06-08T13:03:47.798Z
last refreshed on: 2026-06-08T13:03:47.798Z
source accessed on: 2019-12-03T20:05:01Z
source last accessed on: 2019-12-03T20:05:01Z
label: Cobalto @es
label: Kobalt @de
label: Кобальт @ru
label: 鈷 @zh-hant
label: 钴 @zh
label: 코발트 @ko
label: ｺﾊﾞﾙﾄ @ja
definition: This industry subgroup includes companies that mine and refine cobalt.
notation: 17151011
valid from: 2014-08-08
valid till: 2020-10-03

Copper Mining
type: BicsLevel5Segment
type: Classifier
type: NamedIndividual
is level5 segment of: Copper
is anachronous version of: http://data.ga-group.nl/ics/bics/181015111210
is contemporary version of: http://data.ga-group.nl/ics/bics/1715101210
is replaced by: http://data.ga-group.nl/ics/bics/2020/181015111210
is version of: http://data.ga-group.nl/ics/bics/1715101210
is version of: http://data.ga-group.nl/ics/bics/181015111210
imported on: 2026-06-08T13:03:47.798Z
last refreshed on: 2026-06-08T13:03:47.798Z
source accessed on: 2019-12-03T20:05:01Z
source last accessed on: 2019-12-03T20:05:01Z
label: Estraz rame @it
label: Extraction du cuivre @fr
label: Kupferabbau @de
label: Minería de cobre @es
label: Mineração cobre @pt
label: Добыча медной руды @ru
label: 銅礦 @zh-hant
label: 銅鉱業 @ja
label: 铜矿 @zh
label: 구리 광업 @ko
definition: This segment includes companies that mine copper ore.
notation: 1715101210
valid from: 2014-08-08
valid till: 2020-10-03

Copper Roll, Draw & Extruding
type: BicsLevel6Segment
type: Classifier
type: Discontinued
type: NamedIndividual
is level6 segment of: Copper Smelting & Refining
is contemporary version of: http://data.ga-group.nl/ics/bics/171510121110
is version of: http://data.ga-group.nl/ics/bics/171510121110
imported on: 2026-06-08T13:03:47.798Z
last refreshed on: 2026-06-08T13:03:47.798Z
source accessed on: 2019-12-03T20:05:01Z
source last accessed on: 2019-12-03T20:05:01Z
label: Kupferstrangpressen @de
label: Lam, extrusión, estiraje cobre @es
label: Laminage/étirage/extrusion Cu @fr
label: Laminagem de cobre, estiramento e extrusão @pt
label: Laminatura, rinvenimento ed estrusione rame @it
label: Прокатка/волочение/выдавливание меди @ru
label: 銅圧延･引抜･押出製造 @ja
label: 銅材軋延/伸線/擠型 @zh-hant
label: 铜轧延、拉丝及挤型 @zh
label: 구리 압연, 인발 & 압출 @ko
definition: This segment includes companies that roll, draw, and extrude copper products.
notation: 171510121110
valid from: 2014-08-08
valid till: 2020-10-03

Copper Wire (excl Mech Drawing)
type: BicsLevel6Segment
type: Classifier
type: Discontinued
type: NamedIndividual
is level6 segment of: Copper Smelting & Refining
is contemporary version of: http://data.ga-group.nl/ics/bics/171510121111
is version of: http://data.ga-group.nl/ics/bics/171510121111
imported on: 2026-06-08T13:03:47.798Z
last refreshed on: 2026-06-08T13:03:47.798Z
source accessed on: 2019-12-03T20:05:01Z
source last accessed on: 2019-12-03T20:05:01Z
label: Alambre de cobre (no mecánico) @es
label: Fil de Cu (h étirage mécan) @fr
label: Filo rame (eccetto meccanico) @it
label: Fio de cobre (ex laminação mec) @pt
label: Kupferdraht (exkl. mech. Drahtzug) @de
label: Медные провода (исключая механ. черчение) @ru
label: 銅線(機械除外)伸線 @zh-hant
label: 銅線(除ﾒｶﾆｶﾙ用) @ja
label: 铜线(除机械拉丝) @zh
label: 구리선(기계적인발제외) @ko
definition: This segment includes companies that manufacture copper wire products, excluding mechanical drawing processes.
notation: 171510121111
valid from: 2014-08-08
valid till: 2020-10-03

Primary Copper Smelt & Refin
type: BicsLevel6Segment
type: Classifier
type: Discontinued
type: NamedIndividual
is level6 segment of: Copper Smelting & Refining
is contemporary version of: http://data.ga-group.nl/ics/bics/171510121112
is version of: http://data.ga-group.nl/ics/bics/171510121112
imported on: 2026-06-08T13:03:47.798Z
last refreshed on: 2026-06-08T13:03:47.798Z
source accessed on: 2019-12-03T20:05:01Z
source last accessed on: 2019-12-03T20:05:01Z
label: Fund e ref de cobre primário @pt
label: Fundición y refinación primarias de cobre @es
label: Fusion/affinage Cu primaire @fr
label: Fusione e raff primaria rame @it
label: Schmelz. & Raffin. von Primärkupfer @de
label: Медь - первичная выплавка и переработка @ru
label: 一次冶煉及精製-銅 @zh-hant
label: 原铜冶炼与精炼 @zh
label: 銅1次精錬 @ja
label: 제1차 구리 제련 및 정제업 @ko
definition: This segment includes companies that are primary producers and refiners of copper.
notation: 171510121112
valid from: 2014-08-08
valid till: 2020-10-03

Secondary Copper Smelt & Refin
type: BicsLevel6Segment
type: Classifier
type: Discontinued
type: NamedIndividual
is level6 segment of: Copper Smelting & Refining
is contemporary version of: http://data.ga-group.nl/ics/bics/171510121113
is version of: http://data.ga-group.nl/ics/bics/171510121113
imported on: 2026-06-08T13:03:47.798Z
last refreshed on: 2026-06-08T13:03:47.798Z
source accessed on: 2019-12-03T20:05:01Z
source last accessed on: 2019-12-03T20:05:01Z
label: Fund e ref de cobre secundário @pt
label: Fundición y refinación secundarias de cobre @es
label: Fusion/affinage Cu secondaire @fr
label: Fusione e raff secondaria rame @it
label: Schmelz. & Raffin. von Sekundärkupfer @de
label: Медь - вторичная плавка и переработка @ru
label: 二次冶鍊及精製-銅 @zh-hant
label: 再生铜冶炼与精炼 @zh
label: 銅2次精錬･精製 @ja
label: 제2차 구리 제련 및 정제업 @ko
definition: This segment includes companies that are secondary producers and refiners of copper.
notation: 171510121113
valid from: 2014-08-08
valid till: 2020-10-03

Copper Smelting & Refining
type: BicsLevel5Segment
type: Classifier
type: NamedIndividual
is level5 segment of: Copper
is anachronous version of: http://data.ga-group.nl/ics/bics/181015111211
is contemporary version of: http://data.ga-group.nl/ics/bics/1715101211
is replaced by: http://data.ga-group.nl/ics/bics/2020/181015111211
is version of: http://data.ga-group.nl/ics/bics/1715101211
is version of: http://data.ga-group.nl/ics/bics/181015111211
imported on: 2026-06-08T13:03:47.798Z
last refreshed on: 2026-06-08T13:03:47.798Z
source accessed on: 2019-12-03T20:05:01Z
source last accessed on: 2019-12-03T20:05:01Z
label: Fundição e refinação de cobre @pt
label: Fundición y refinación de cobre @es
label: Fusion/affinage du cuivre @fr
label: Fusione e raffinazione rame @it
label: Kupferschmelzung & -raffinierung @de
label: Медь - плавка и переработка @ru
label: 銅冶鍊及精製 @zh-hant
label: 銅精錬･精製 @ja
label: 铜冶炼与精炼 @zh
label: 구리 제련 & 정제업 @ko
definition: This segment includes companies that smelt and refine copper and their associated products.
notation: 1715101211
valid from: 2014-08-08
valid till: 2020-10-03

Copper
type: BicsLevel4SubIndustry
type: Classifier
type: NamedIndividual
is sub industry of: Base Metals
is anachronous version of: http://data.ga-group.nl/ics/bics/1810151112
is contemporary version of: http://data.ga-group.nl/ics/bics/17151012
is replaced by: http://data.ga-group.nl/ics/bics/2020/1810151112
is version of: http://data.ga-group.nl/ics/bics/17151012
is version of: http://data.ga-group.nl/ics/bics/1810151112
imported on: 2026-06-08T13:03:47.798Z
last refreshed on: 2026-06-08T13:03:47.798Z
source accessed on: 2019-12-03T20:05:01Z
source last accessed on: 2019-12-03T20:05:01Z
label: Cobre @es
label: Cuivre @fr
label: Kupfer @de
label: Rame @it
label: Медь @ru
label: 銅 @ja
label: 铜 @zh
label: 구리 @ko
definition: This industry subgroup includes companies that mine and refine copper ore and copper products.
notation: 17151012
valid from: 2014-08-08
valid till: 2020-10-03

Manganese
type: BicsLevel4SubIndustry
type: Classifier
type: NamedIndividual
is sub industry of: Base Metals
is anachronous version of: http://data.ga-group.nl/ics/bics/1810151113
is contemporary version of: http://data.ga-group.nl/ics/bics/17151013
is replaced by: http://data.ga-group.nl/ics/bics/2020/1810151113
is version of: http://data.ga-group.nl/ics/bics/17151013
is version of: http://data.ga-group.nl/ics/bics/1810151113
imported on: 2026-06-08T13:03:47.798Z
last refreshed on: 2026-06-08T13:03:47.798Z
source accessed on: 2019-12-03T20:05:01Z
source last accessed on: 2019-12-03T20:05:01Z
label: Mangan @de
label: Manganèse @fr
label: Manganês @pt
label: Manganeso @es
label: Марганец @ru
label: 錳 @zh-hant
label: 锰 @zh
label: 망간 @ko
label: ﾏﾝｶﾞﾝ @ja
definition: This industry subgroup includes companies that mine and refine manganese.
notation: 17151013
valid from: 2014-08-08
valid till: 2020-10-03

Molybdenum
type: BicsLevel4SubIndustry
type: Classifier
type: NamedIndividual
is sub industry of: Base Metals
is anachronous version of: http://data.ga-group.nl/ics/bics/1810151114
is contemporary version of: http://data.ga-group.nl/ics/bics/17151014
is replaced by: http://data.ga-group.nl/ics/bics/2020/1810151114
is version of: http://data.ga-group.nl/ics/bics/17151014
is version of: http://data.ga-group.nl/ics/bics/1810151114
imported on: 2026-06-08T13:03:47.798Z
last refreshed on: 2026-06-08T13:03:47.798Z
source accessed on: 2019-12-03T20:05:01Z
source last accessed on: 2019-12-03T20:05:01Z
label: Molibdênio @pt
label: Molibdeno @es
label: Molybdän @de
label: Molybdène @fr
label: Молибден @ru
label: 鉬 @zh-hant
label: 钼 @zh
label: 몰리브덴 @ko
label: ﾓﾘﾌﾞﾃﾞﾝ @ja
definition: This industry subgroup includes companies that mine and refine molybdenum.
notation: 17151014
valid from: 2014-08-08
valid till: 2020-10-03

Lead Ore Mining
type: BicsLevel5Segment
type: Classifier
type: NamedIndividual
is level5 segment of: Nickel, Lead & Zinc Ore
is anachronous version of: http://data.ga-group.nl/ics/bics/181015111510
is contemporary version of: http://data.ga-group.nl/ics/bics/1715101510
is replaced by: http://data.ga-group.nl/ics/bics/2020/181015111510
is version of: http://data.ga-group.nl/ics/bics/1715101510
is version of: http://data.ga-group.nl/ics/bics/181015111510
imported on: 2026-06-08T13:03:47.798Z
last refreshed on: 2026-06-08T13:03:47.798Z
source accessed on: 2019-12-03T20:05:01Z
source last accessed on: 2019-12-03T20:05:01Z
label: Bleierzgewinnung @de
label: Estraz min di piombo @it
label: Extração de minério de chumbo @pt
label: Mine minerais plomb @fr
label: Minería de plomo @es
label: Добыча свинцовой руды @ru
label: 鉛礦礦業 @zh-hant
label: 鉛鉱業 @ja
label: 铅矿业 @zh
label: 연 광업 @ko
definition: This segment includes companies that mine lead ore.
notation: 1715101510
valid from: 2014-08-08
valid till: 2020-10-03

Nickel Ore Mining
type: BicsLevel5Segment
type: Classifier
type: NamedIndividual
is level5 segment of: Nickel, Lead & Zinc Ore
is anachronous version of: http://data.ga-group.nl/ics/bics/181015111511
is contemporary version of: http://data.ga-group.nl/ics/bics/1715101511
is replaced by: http://data.ga-group.nl/ics/bics/2020/181015111511
is version of: http://data.ga-group.nl/ics/bics/1715101511
is version of: http://data.ga-group.nl/ics/bics/181015111511
imported on: 2026-06-08T13:03:47.798Z
last refreshed on: 2026-06-08T13:03:47.798Z
source accessed on: 2019-12-03T20:05:01Z
source last accessed on: 2019-12-03T20:05:01Z
label: Estrazione minerale di nichel @it
label: Extraction de minerai de nickel @fr
label: Minería de mineral de níquel @es
label: Mineração de níquel @pt
label: Nickelerz-Abbau @de
label: Никелевая руда - Дoбыча @ru
label: 鎳礦業 @zh-hant
label: 镍矿开采 @zh
label: 니켈 광업 @ko
label: ﾆｯｹﾙ原鉱業 @ja
definition: This segment includes companies that mine nickel ore.
notation: 1715101511
valid from: 2014-08-08
valid till: 2020-10-03

Zinc Ore Mining
type: BicsLevel5Segment
type: Classifier
type: NamedIndividual
is level5 segment of: Nickel, Lead & Zinc Ore
is anachronous version of: http://data.ga-group.nl/ics/bics/181015111512
is contemporary version of: http://data.ga-group.nl/ics/bics/1715101512
is replaced by: http://data.ga-group.nl/ics/bics/2020/181015111512
is version of: http://data.ga-group.nl/ics/bics/1715101512
is version of: http://data.ga-group.nl/ics/bics/181015111512
imported on: 2026-06-08T13:03:47.798Z
last refreshed on: 2026-06-08T13:03:47.798Z
source accessed on: 2019-12-03T20:05:01Z
source last accessed on: 2019-12-03T20:05:01Z
label: Estraz min di zinco @it
label: Extração de minério de zinco @pt
label: Mine minerai zinc @fr
label: Minería de zinc @es
label: Zinkerzgewinnung @de
label: Добыча цинковой руды @ru
label: 亜鉛鉱業 @ja
label: 鋅礦礦業 @zh-hant
label: 锌矿业 @zh
label: 아연 광업 @ko
definition: This segment includes companies that mine zinc ore.
notation: 1715101512
valid from: 2014-08-08
valid till: 2020-10-03

Nickel, Lead & Zinc Ore
type: BicsLevel4SubIndustry
type: Classifier
type: NamedIndividual
is sub industry of: Base Metals
is anachronous version of: http://data.ga-group.nl/ics/bics/1810151115
is contemporary version of: http://data.ga-group.nl/ics/bics/17151015
is replaced by: http://data.ga-group.nl/ics/bics/2020/1810151115
is version of: http://data.ga-group.nl/ics/bics/17151015
is version of: http://data.ga-group.nl/ics/bics/1810151115
imported on: 2026-06-08T13:03:47.798Z
last refreshed on: 2026-06-08T13:03:47.798Z
source accessed on: 2019-12-03T20:05:01Z
source last accessed on: 2019-12-03T20:05:01Z
label: Min piombo, zinco, nichel @it
label: Mineração de níquel, chumbo e zinco @pt
label: Minerai nickel/zinc/plomb @fr
label: Mineral de níquel, plomo y zinc @es
label: Nickel, Blei & Zinkerz @de
label: Никель, свинец и цинковая руда @ru
label: 鎳、鉛及鋅礦 @zh-hant
label: 镍、铅与锌矿石 @zh
label: 니켈, 납 & 아연 광석 @ko
label: ﾆｯｹﾙ､鉛､亜鉛原鉱業 @ja
definition: This industry subgroup includes companies that mine nickel, lead and zinc ore and their related aggregates. Products include sphalerite, galena, calamine and willemite.
notation: 17151015
valid from: 2014-08-08
valid till: 2020-10-03

Tin
type: BicsLevel4SubIndustry
type: Classifier
type: NamedIndividual
is sub industry of: Base Metals
is anachronous version of: http://data.ga-group.nl/ics/bics/1810151116
is contemporary version of: http://data.ga-group.nl/ics/bics/17151016
is replaced by: http://data.ga-group.nl/ics/bics/2020/1810151116
is version of: http://data.ga-group.nl/ics/bics/17151016
is version of: http://data.ga-group.nl/ics/bics/1810151116
imported on: 2026-06-08T13:03:47.798Z
last refreshed on: 2026-06-08T13:03:47.798Z
source accessed on: 2019-12-03T20:05:01Z
source last accessed on: 2019-12-03T20:05:01Z
label: Estaño @es
label: Estanho @pt
label: Etain @fr
label: Stagno @it
label: Zinn @de
label: Жесть @ru
label: 錫 @zh-hant
label: 锡 @zh
label: 주석 @ko
label: ｽｽﾞ @ja
definition: This industry subgroup includes companies that mine and refine tin.
notation: 17151016
valid from: 2014-08-08
valid till: 2020-10-03

Uranium
type: BicsLevel4SubIndustry
type: Classifier
type: NamedIndividual
is sub industry of: Base Metals
is anachronous version of: http://data.ga-group.nl/ics/bics/1810151117
is contemporary version of: http://data.ga-group.nl/ics/bics/17151017
is replaced by: http://data.ga-group.nl/ics/bics/2020/1810151117
is version of: http://data.ga-group.nl/ics/bics/17151017
is version of: http://data.ga-group.nl/ics/bics/1810151117
imported on: 2026-06-08T13:03:47.798Z
last refreshed on: 2026-06-08T13:03:47.798Z
source accessed on: 2019-12-03T20:05:01Z
source last accessed on: 2019-12-03T20:05:01Z
label: Urânio @pt
label: Uran @de
label: Uranio @es
label: Урановые руды @ru
label: 鈾 @zh-hant
label: 铀 @zh
label: 우라늄 @ko
label: ｳﾗﾆｳﾑ @ja
definition: This industry subgroup includes companies that mine uranium rock and extract the uranium from the rock for further refinement as well as enrichment.
notation: 17151017
valid from: 2014-08-08
valid till: 2020-10-03

Clays & Non-Metallic
type: BicsLevel5Segment
type: Classifier
type: Discontinued
type: NamedIndividual
is level5 segment of: Other Non-Ferrous Smelting
is contemporary version of: http://data.ga-group.nl/ics/bics/1715101810
is version of: http://data.ga-group.nl/ics/bics/1715101810
imported on: 2026-06-08T13:03:47.798Z
last refreshed on: 2026-06-08T13:03:47.798Z
source accessed on: 2019-12-03T20:05:01Z
source last accessed on: 2019-12-03T20:05:01Z
label: Arcilla y min no met @es
label: Argilas e não metálicos @pt
label: Argile et non métal. @fr
label: Argille, non metalli @it
label: Ton & Nichtmetalle @de
label: Глина и нерудные ископаемые @ru
label: 泥土及非金屬 @zh-hant
label: 泥土和非金属矿石 @zh
label: 粘土･非鉄 @ja
label: 점토&비금속광물 @ko
definition: This segment includes companies that mine clay, kaolin and non-metallic materials.
notation: 1715101810
valid from: 2014-08-08
valid till: 2020-10-03

Non-Ferrous Metal Rolling
type: BicsLevel5Segment
type: Classifier
type: Discontinued
type: NamedIndividual
is level5 segment of: Other Non-Ferrous Smelting
is contemporary version of: http://data.ga-group.nl/ics/bics/1715101811
is version of: http://data.ga-group.nl/ics/bics/1715101811
imported on: 2026-06-08T13:03:47.798Z
last refreshed on: 2026-06-08T13:03:47.798Z
source accessed on: 2019-12-03T20:05:01Z
source last accessed on: 2019-12-03T20:05:01Z
label: Buntmetallwalzen @de
label: Estiraje metales no ferrosos @es
label: Laminage métaux non ferreux @fr
label: Laminagem de metal não ferroso @pt
label: Rullamento metalli non ferrosi @it
label: Прокатка цвет. металлов @ru
label: 有色金属轧延 @zh
label: 非鉄金属圧延製造業(除銅ｱﾙﾐ) @ja
label: 非鐵金屬軋延 @zh-hant
label: 비철금속 압연 @ko
definition: This segment includes companies that roll, draw and extrude nonferrous products.
notation: 1715101811
valid from: 2014-08-08
valid till: 2020-10-03

Primary Non-Ferrous Refining
type: BicsLevel5Segment
type: Classifier
type: Discontinued
type: NamedIndividual
is level5 segment of: Other Non-Ferrous Smelting
is contemporary version of: http://data.ga-group.nl/ics/bics/1715101812
is version of: http://data.ga-group.nl/ics/bics/1715101812
imported on: 2026-06-08T13:03:47.798Z
last refreshed on: 2026-06-08T13:03:47.798Z
source accessed on: 2019-12-03T20:05:01Z
source last accessed on: 2019-12-03T20:05:01Z
label: Affinage métaux non ferreux @fr
label: Fusione di metalli non ferrosi @it
label: Metais não ferrosos @pt
label: Primäveredlung von Buntmetall @de
label: Refinación primaria no ferrosa @es
label: Первичные цветные металлы - перерабока @ru
label: 有色金属精炼 @zh
label: 非鉄金属第1次精錬業(除銅･ｱﾙﾐ) @ja
label: 非鐵金屬一次冶鍊及精製 @zh-hant
label: 비철금속 제련 @ko
definition: This segment includes companies that are primary producers and refiners of non-copper and non-aluminum non-ferrous products.
notation: 1715101812
valid from: 2014-08-08
valid till: 2020-10-03

Secondary Non-Ferrous Refin
type: BicsLevel5Segment
type: Classifier
type: Discontinued
type: NamedIndividual
is level5 segment of: Other Non-Ferrous Smelting
is contemporary version of: http://data.ga-group.nl/ics/bics/1715101813
is version of: http://data.ga-group.nl/ics/bics/1715101813
imported on: 2026-06-08T13:03:47.798Z
last refreshed on: 2026-06-08T13:03:47.798Z
source accessed on: 2019-12-03T20:05:01Z
source last accessed on: 2019-12-03T20:05:01Z
label: Affinage non ferreux 2e fusion @fr
label: Fusione second met non ferrosi @it
label: Refinação de não ferrosos secundários @pt
label: Refinación secund no ferrosa @es
label: Sekundärveredlg von Buntmetall @de
label: Вторичная выплавка металлов @ru
label: 有色金属二次精炼 @zh
label: 非鉄金属第2次精錬 @ja
label: 非鐵金屬二次冶鍊及精製 @zh-hant
label: 비철금속 2차제련 @ko
definition: This segment includes companies that are secondary producers and refiners of non-copper and non-aluminum non-ferrous products.
notation: 1715101813
valid from: 2014-08-08
valid till: 2020-10-03

Other Non-Ferrous Smelting
type: BicsLevel4SubIndustry
type: Classifier
type: Discontinued
type: NamedIndividual
is sub industry of: Base Metals
is contemporary version of: http://data.ga-group.nl/ics/bics/17151018
is version of: http://data.ga-group.nl/ics/bics/17151018
imported on: 2026-06-08T13:03:47.798Z
last refreshed on: 2026-06-08T13:03:47.798Z
source accessed on: 2019-12-03T20:05:01Z
source last accessed on: 2019-12-03T20:05:01Z
label: Fonte d'autres métaux non ferreux @fr
label: Fusione altri non ferrosi @it
label: Otras fundición metales no ferrosos @es
label: Outras fundições de metais não ferrosos @pt
label: Schmelzung von anderen Buntmetallen @de
label: Плавка изделий из прочих цв. металлов @ru
label: その他非鉄金属精錬 @ja
label: 其他有色金属冶炼 @zh
label: 其他非鐵金屬冶鍊 @zh-hant
label: 기타 비철금속 제련 & 제조업 @ko
definition: This industry subgroup includes companies that smelt and manufacture other non-ferrous metals.
notation: 17151018
valid from: 2014-08-08
valid till: 2020-10-03

Other Metals
type: BicsLevel4SubIndustry
type: Classifier
type: Discontinued
type: NamedIndividual
is sub industry of: Base Metals
is contemporary version of: http://data.ga-group.nl/ics/bics/17151019
is version of: http://data.ga-group.nl/ics/bics/17151019
imported on: 2026-06-08T13:03:47.798Z
last refreshed on: 2026-06-08T13:03:47.798Z
source accessed on: 2019-12-03T20:05:01Z
source last accessed on: 2019-12-03T20:05:01Z
label: Altri metalli @it
label: Autres métaux @fr
label: Otros metales @es
label: Outros metais @pt
label: Sonstige Metalle @de
label: Другие металлы @ru
label: その他金属 @ja
label: 其他金属 @zh
label: 其他金屬 @zh-hant
label: 기타 금속 @ko
definition: This industry subgroup includes companies that mine other metals not elsewhere classified, such as antimony, ferro-alloys, titanium and tungsten.
notation: 17151019
valid from: 2014-08-08
valid till: 2020-10-03

Base Metals
type: BicsLevel3Industry
type: Classifier
type: NamedIndividual
is industry of: Metals & Mining
is anachronous version of: http://data.ga-group.nl/ics/bics/18101511
is contemporary version of: http://data.ga-group.nl/ics/bics/171510
is replaced by: http://data.ga-group.nl/ics/bics/2020/18101511
is version of: http://data.ga-group.nl/ics/bics/171510
is version of: http://data.ga-group.nl/ics/bics/18101511
imported on: 2026-06-08T13:03:47.798Z
last refreshed on: 2026-06-08T13:03:47.798Z
source accessed on: 2019-12-03T20:05:01Z
source last accessed on: 2019-12-03T20:05:01Z
label: Grundmetalle @de
label: Métaux de base @fr
label: Metais de base @pt
label: Metales base @es
label: Metalli base @it
label: Цветные металлы @ru
label: 基本金属 @zh
label: 基本金屬 @zh-hant
label: 非鉄金属 @ja
label: 기초금속 @ko
definition: This industry includes companies that mine base metals and their aggregates, such as aluminum, copper, lead, zinc, nickel and other metals.
notation: 171510
valid from: 2014-08-08
valid till: 2020-10-03

Gold Mining
type: BicsLevel4SubIndustry
type: Classifier
type: NamedIndividual
is sub industry of: Precious Metal Mining
is anachronous version of: http://data.ga-group.nl/ics/bics/1810151210
is contemporary version of: http://data.ga-group.nl/ics/bics/17151110
is replaced by: http://data.ga-group.nl/ics/bics/2020/1810151210
is version of: http://data.ga-group.nl/ics/bics/17151110
is version of: http://data.ga-group.nl/ics/bics/1810151210
imported on: 2026-06-08T13:03:47.798Z
last refreshed on: 2026-06-08T13:03:47.798Z
source accessed on: 2019-12-03T20:05:01Z
source last accessed on: 2019-12-03T20:05:01Z
label: Estrazione oro @it
label: Goldbergbau @de
label: Minería de oro @es
label: Mineração de ouro @pt
label: Mines aurifères @fr
label: Добыча золотых руд @ru
label: 采金 @zh
label: 金 -鉱業 @ja
label: 金礦業 @zh-hant
label: 금채광업 @ko
definition: This industry subgroup includes companies that mine gold ore, gold bullion and sylvanite.
notation: 17151110
valid from: 2014-08-08
valid till: 2020-10-03

Paládio
type: BicsLevel5Segment
type: Classifier
type: NamedIndividual
is level5 segment of: Platinum Group Metals
is anachronous version of: http://data.ga-group.nl/ics/bics/181015121110
is contemporary version of: http://data.ga-group.nl/ics/bics/1715111110
is replaced by: http://data.ga-group.nl/ics/bics/2020/181015121110
is version of: http://data.ga-group.nl/ics/bics/1715111110
is version of: http://data.ga-group.nl/ics/bics/181015121110
imported on: 2026-06-08T13:03:47.798Z
last refreshed on: 2026-06-08T13:03:47.798Z
source accessed on: 2019-12-03T20:05:01Z
source last accessed on: 2019-12-03T20:05:01Z
label: Paladio @es
label: Palladio @it
label: Palladium
label: Палладий @ru
label: 鈀金 @zh-hant
label: 钯 @zh
label: 팔라듐 @ko
label: ﾊﾟﾗｼﾞｳﾑ @ja
definition: This segment includes companies that mine palladium.
notation: 1715111110
valid from: 2014-08-08
valid till: 2020-10-03

Platinum
type: BicsLevel5Segment
type: Classifier
type: NamedIndividual
is level5 segment of: Platinum Group Metals
is anachronous version of: http://data.ga-group.nl/ics/bics/181015121111
is contemporary version of: http://data.ga-group.nl/ics/bics/1715111111
is replaced by: http://data.ga-group.nl/ics/bics/2020/181015121111
is version of: http://data.ga-group.nl/ics/bics/1715111111
is version of: http://data.ga-group.nl/ics/bics/181015121111
imported on: 2026-06-08T13:03:47.798Z
last refreshed on: 2026-06-08T13:03:47.798Z
source accessed on: 2019-12-03T20:05:01Z
source last accessed on: 2019-12-03T20:05:01Z
label: Platin @de
label: Platina @pt
label: Platine @fr
label: Platino @es
label: Платина @ru
label: 白金 @zh-hant
label: 铂金 @zh
label: 플라티늄 @ko
label: ﾌﾟﾗﾁﾅ @ja
definition: This segment includes companies that mine platinum.
notation: 1715111111
valid from: 2014-08-08
valid till: 2020-10-03

Ródio
type: BicsLevel5Segment
type: Classifier
type: NamedIndividual
is level5 segment of: Platinum Group Metals
is anachronous version of: http://data.ga-group.nl/ics/bics/181015121112
is contemporary version of: http://data.ga-group.nl/ics/bics/1715111112
is replaced by: http://data.ga-group.nl/ics/bics/2020/181015121112
is version of: http://data.ga-group.nl/ics/bics/1715111112
is version of: http://data.ga-group.nl/ics/bics/181015121112
imported on: 2026-06-08T13:03:47.798Z
last refreshed on: 2026-06-08T13:03:47.798Z
source accessed on: 2019-12-03T20:05:01Z
source last accessed on: 2019-12-03T20:05:01Z
label: Rhodium
label: Rodio @es
label: Родий @ru
label: 銠 @zh-hant
label: 铑 @zh
label: 로듐 @ko
label: ﾛｼﾞｳﾑ @ja
definition: This segment includes companies that mine rhodium.
notation: 1715111112
valid from: 2014-08-08
valid till: 2020-10-03

Other Platinum Group Metals
type: BicsLevel5Segment
type: Classifier
type: Discontinued
type: NamedIndividual
is level5 segment of: Platinum Group Metals
is contemporary version of: http://data.ga-group.nl/ics/bics/1715111113
is version of: http://data.ga-group.nl/ics/bics/1715111113
imported on: 2026-06-08T13:03:47.798Z
last refreshed on: 2026-06-08T13:03:47.798Z
source accessed on: 2019-12-03T20:05:01Z
source last accessed on: 2019-12-03T20:05:01Z
label: Autres métaux du groupe platine @fr
label: Otros metales del grupo del platino @es
label: Outros grupos de metais platina @pt
label: Platino e altri metalli @it
label: Sonstige Platingruppenmetalle @de
label: Прочие металлы платиновой группы @ru
label: その他白金属 @ja
label: 其他白金類金屬 @zh-hant
label: 其他铂族金属 @zh
label: 기타 플라티늄종류 금속 @ko
definition: This segment includes companies that mine other platinum group metals, such as iridium, osmium and ruthenium.
notation: 1715111113
valid from: 2014-08-08
valid till: 2020-10-03

Platinum Group Metals
type: BicsLevel4SubIndustry
type: Classifier
type: NamedIndividual
is sub industry of: Precious Metal Mining
is anachronous version of: http://data.ga-group.nl/ics/bics/1810151211
is contemporary version of: http://data.ga-group.nl/ics/bics/17151111
is replaced by: http://data.ga-group.nl/ics/bics/2020/1810151211
is version of: http://data.ga-group.nl/ics/bics/17151111
is version of: http://data.ga-group.nl/ics/bics/1810151211
imported on: 2026-06-08T13:03:47.798Z
last refreshed on: 2026-06-08T13:03:47.798Z
source accessed on: 2019-12-03T20:05:01Z
source last accessed on: 2019-12-03T20:05:01Z
label: Métaux du groupe platine @fr
label: Metais / Platina @pt
label: Metales del grupo de platino @es
label: Metalle d.Platingruppe @de
label: Metalli gruppo platino @it
label: Металлы платиновой группы @ru
label: 白金属需給統計 @ja
label: 白金类金属 @zh
label: 白金類金屬 @zh-hant
label: 플라티늄종류 금속 @ko
definition: This industry subgroup includes companies that mine platinum, palladium, iridium, rhodium, osmium and ruthenium.
notation: 17151111
valid from: 2014-08-08
valid till: 2020-10-03

Silver Mining
type: BicsLevel4SubIndustry
type: Classifier
type: NamedIndividual
is sub industry of: Precious Metal Mining
is anachronous version of: http://data.ga-group.nl/ics/bics/1810151212
is contemporary version of: http://data.ga-group.nl/ics/bics/17151112
is replaced by: http://data.ga-group.nl/ics/bics/2020/1810151212
is version of: http://data.ga-group.nl/ics/bics/17151112
is version of: http://data.ga-group.nl/ics/bics/1810151212
imported on: 2026-06-08T13:03:47.798Z
last refreshed on: 2026-06-08T13:03:47.798Z
source accessed on: 2019-12-03T20:05:01Z
source last accessed on: 2019-12-03T20:05:01Z
label: Estrazione argento @it
label: Minería de plata @es
label: Mineração de prata @pt
label: Mines d'argent @fr
label: Silberbergbau @de
label: Добыча серебряных руд @ru
label: 采银 @zh
label: 銀 -鉱業 @ja
label: 銀礦業 @zh-hant
label: 은채광업 @ko
definition: This industry subgroup includes companies that mine silver ore and bullion.
notation: 17151112
valid from: 2014-08-08
valid till: 2020-10-03

Precious Metal Mining
type: BicsLevel3Industry
type: Classifier
type: NamedIndividual
is industry of: Metals & Mining
is anachronous version of: http://data.ga-group.nl/ics/bics/18101512
is contemporary version of: http://data.ga-group.nl/ics/bics/171511
is replaced by: http://data.ga-group.nl/ics/bics/2020/18101512
is version of: http://data.ga-group.nl/ics/bics/171511
is version of: http://data.ga-group.nl/ics/bics/18101512
imported on: 2026-06-08T13:03:47.798Z
last refreshed on: 2026-06-08T13:03:47.798Z
source accessed on: 2019-12-03T20:05:01Z
source last accessed on: 2019-12-03T20:05:01Z
label: Edelmetallgewinnung @de
label: Estraz metalli preziosi @it
label: Extr metais prec @pt
label: Extract métaux précieux @fr
label: Mineríametales prec @es
label: Добыча драг. металлов @ru
label: 貴金属採掘 @ja
label: 貴金屬礦業 @zh-hant
label: 贵金属开采 @zh
label: 귀금속 채굴 @ko
definition: This industry includes companies that mine precious metals and their aggregates, such as gold, silver and platinum.
notation: 171511
valid from: 2014-08-08
valid till: 2020-10-03

Clay Ceramic
type: BicsLevel4SubIndustry
type: Classifier
type: NamedIndividual
is sub industry of: Other Mined Minerals
is anachronous version of: http://data.ga-group.nl/ics/bics/181015131010
is contemporary version of: http://data.ga-group.nl/ics/bics/17151210
is replaced by: http://data.ga-group.nl/ics/bics/2020/181015131010
is version of: http://data.ga-group.nl/ics/bics/17151210
is version of: http://data.ga-group.nl/ics/bics/181015131010
imported on: 2026-06-08T13:03:47.798Z
last refreshed on: 2026-06-08T13:03:47.798Z
source accessed on: 2019-12-03T20:05:01Z
source last accessed on: 2019-12-03T20:05:01Z
label: Céramique argileuse @fr
label: Cerámica de arcilla @es
label: Cerâmica de argila @pt
label: Ceramiche @it
label: Ton, Keramik @de
label: Глиняная керамика @ru
label: 窯業 @ja
label: 陶土陶瓷 @zh-hant
label: 陶瓷粘土 @zh
label: 점토 세라믹 @ko
definition: This industry subgroup includes companies that mine and quarry clays and ceramics.
notation: 17151210
valid from: 2014-08-08
valid till: 2020-10-03

Lítio
type: BicsLevel4SubIndustry
type: Classifier
type: NamedIndividual
is sub industry of: Other Mined Minerals
is anachronous version of: http://data.ga-group.nl/ics/bics/181015131011
is contemporary version of: http://data.ga-group.nl/ics/bics/17151211
is replaced by: http://data.ga-group.nl/ics/bics/2020/181015131011
is version of: http://data.ga-group.nl/ics/bics/17151211
is version of: http://data.ga-group.nl/ics/bics/181015131011
imported on: 2026-06-08T13:03:47.798Z
last refreshed on: 2026-06-08T13:03:47.798Z
source accessed on: 2019-12-03T20:05:01Z
source last accessed on: 2019-12-03T20:05:01Z
label: Lithium
label: Litio @es
label: Литий @ru
label: 鋰 @zh-hant
label: 锂 @zh
label: 리튬 @ko
label: ﾘﾁｳﾑ @ja
definition: This industry subgroup includes companies that mine and refine lithium.
notation: 17151211
valid from: 2014-08-08
valid till: 2020-10-03

Phosphate Rock
type: BicsLevel4SubIndustry
type: Classifier
type: NamedIndividual
is sub industry of: Other Mined Minerals
is anachronous version of: http://data.ga-group.nl/ics/bics/181015131012
is contemporary version of: http://data.ga-group.nl/ics/bics/17151212
is replaced by: http://data.ga-group.nl/ics/bics/2020/181015131012
is version of: http://data.ga-group.nl/ics/bics/17151212
is version of: http://data.ga-group.nl/ics/bics/181015131012
imported on: 2026-06-08T13:03:47.798Z
last refreshed on: 2026-06-08T13:03:47.798Z
source accessed on: 2019-12-03T20:05:01Z
source last accessed on: 2019-12-03T20:05:01Z
label: Fosfati minerali @it
label: Fosfato natural @pt
label: Phosphatgestein @de
label: Phosphorite @fr
label: Roca de fosfatos @es
label: Фосфориты @ru
label: りん鉱石 @ja
label: 磷酸盐岩石 @zh
label: 磷酸石 @zh-hant
label: 인광석 @ko
definition: This industry subgroup includes companies that mine phosphate rock.
notation: 17151212
valid from: 2014-08-08
valid till: 2020-10-03

Potash, Soda, Borate
type: BicsLevel4SubIndustry
type: Classifier
type: NamedIndividual
is sub industry of: Other Mined Minerals
is anachronous version of: http://data.ga-group.nl/ics/bics/181015131013
is contemporary version of: http://data.ga-group.nl/ics/bics/17151213
is replaced by: http://data.ga-group.nl/ics/bics/2020/181015131013
is version of: http://data.ga-group.nl/ics/bics/17151213
is version of: http://data.ga-group.nl/ics/bics/181015131013
imported on: 2026-06-08T13:03:47.798Z
last refreshed on: 2026-06-08T13:03:47.798Z
source accessed on: 2019-12-03T20:05:01Z
source last accessed on: 2019-12-03T20:05:01Z
label: Potasa, soda y borato @es
label: Potassa, soda, borato @pt
label: Potasse, soude et borate @fr
label: Potassio, soda, borato @it
label: Pottasche, Soda, Borate @de
label: Калий, сода и борат @ru
label: 鉀、碳酸鈉及硼酸 @zh-hant
label: 钾肥、纯碱、硼酸盐 @zh
label: 가성칼리, 소다 및 붕산염 @ko
label: ｶﾘ､ｿｰﾀﾞ､ﾎｳ酸塩 @ja
definition: This industry subgroup includes companies that mine and refine potash, soda and borate.
notation: 17151213
valid from: 2014-08-08
valid till: 2020-10-03

Diamond Mining
type: BicsLevel5Segment
type: Classifier
type: NamedIndividual
is level5 segment of: Precious Stones
is anachronous version of: http://data.ga-group.nl/ics/bics/181015131110
is contemporary version of: http://data.ga-group.nl/ics/bics/1715121410
is replaced by: http://data.ga-group.nl/ics/bics/2020/181015131110
is version of: http://data.ga-group.nl/ics/bics/1715121410
is version of: http://data.ga-group.nl/ics/bics/181015131110
imported on: 2026-06-08T13:03:47.798Z
last refreshed on: 2026-06-08T13:03:47.798Z
source accessed on: 2019-12-03T20:05:01Z
source last accessed on: 2019-12-03T20:05:01Z
label: Diamantengewinnung @de
label: Estrazione diamanti @it
label: Extração de diamantes @pt
label: Mine de diamants @fr
label: Minería de diamantes @es
label: Добыча алмазов @ru
label: 鑽石礦業 @zh-hant
label: 钻石矿业 @zh
label: 다이아몬드 광업 @ko
label: ﾀﾞｲﾔﾓ���ﾄﾞ鉱業 @ja
definition: This segment includes companies that mine and quarry diamonds.
notation: 1715121410
valid from: 2014-08-08
valid till: 2020-10-03

Other Non-Metallic Mining
type: BicsLevel5Segment
type: Classifier
type: NamedIndividual
is level5 segment of: Precious Stones
is anachronous version of: http://data.ga-group.nl/ics/bics/181015131111
is contemporary version of: http://data.ga-group.nl/ics/bics/1715121411
is replaced by: http://data.ga-group.nl/ics/bics/2020/181015131111
is version of: http://data.ga-group.nl/ics/bics/1715121411
is version of: http://data.ga-group.nl/ics/bics/181015131111
imported on: 2026-06-08T13:03:47.798Z
last refreshed on: 2026-06-08T13:03:47.798Z
source accessed on: 2019-12-03T20:05:01Z
source last accessed on: 2019-12-03T20:05:01Z
label: Abbau sonst. Nichtmetalle @de
label: Estraz di minerali non metalli @it
label: Mine minerais non métalliques @fr
label: Otra minería no de metales @es
label: Outros tipos de mineração de produtos não metálicos @pt
label: Добыча нерудных минералов @ru
label: その他非金属鉱業 @ja
label: 其他非金屬礦業 @zh-hant
label: 所有其他非金属矿物开采 @zh
label: 기타 비금속 채광업 @ko
definition: This segment includes companies that mine and quarry other non-metallic minerals not elsewhere classified, such as gemstones, asbestos, asphalt, peat and grindstone.
notation: 1715121411
valid from: 2014-08-08
valid till: 2020-10-03

Precious Stones
type: BicsLevel4SubIndustry
type: Classifier
type: NamedIndividual
is sub industry of: Other Mined Minerals
is anachronous version of: http://data.ga-group.nl/ics/bics/1810151311
is contemporary version of: http://data.ga-group.nl/ics/bics/17151214
is replaced by: http://data.ga-group.nl/ics/bics/2020/1810151311
is version of: http://data.ga-group.nl/ics/bics/17151214
is version of: http://data.ga-group.nl/ics/bics/1810151311
imported on: 2026-06-08T13:03:47.798Z
last refreshed on: 2026-06-08T13:03:47.798Z
source accessed on: 2019-12-03T20:05:01Z
source last accessed on: 2019-12-03T20:05:01Z
label: Edelsteine @de
label: Pedras preciosas @pt
label: Piedras preciosas @es
label: Pierres précieuses @fr
label: Pietre preziose @it
label: Драгоценные камни @ru
label: 宝石 @ja
label: 寶石 @zh-hant
label: 보석 @ko
definition: This industry subgroup includes companies that mine precious stones.
notation: 17151214
valid from: 2014-08-08
valid till: 2020-10-03

Rare Earth
type: BicsLevel4SubIndustry
type: Classifier
type: NamedIndividual
is sub industry of: Other Mined Minerals
is anachronous version of: http://data.ga-group.nl/ics/bics/181015131014
is contemporary version of: http://data.ga-group.nl/ics/bics/17151215
is replaced by: http://data.ga-group.nl/ics/bics/2020/181015131014
is version of: http://data.ga-group.nl/ics/bics/17151215
is version of: http://data.ga-group.nl/ics/bics/181015131014
imported on: 2026-06-08T13:03:47.798Z
last refreshed on: 2026-06-08T13:03:47.798Z
source accessed on: 2019-12-03T20:05:01Z
source last accessed on: 2019-12-03T20:05:01Z
label: Lanthanides @fr
label: Seltene Erden @de
label: Terras raras @pt
label: Terre rare @it
label: Tierra rara @es
label: Редкоземельные @ru
label: 稀土 @zh
label: 희토류 @ko
label: ﾚｱｱｰｽ(希土類) @ja
definition: This industry subgroup includes companies that mine and refine rare earth metals.
notation: 17151215
valid from: 2014-08-08
valid till: 2020-10-03

Other Chemicals & Minerals
type: BicsLevel4SubIndustry
type: Classifier
type: Discontinued
type: NamedIndividual
is sub industry of: Other Mined Minerals
is contemporary version of: http://data.ga-group.nl/ics/bics/17151216
is version of: http://data.ga-group.nl/ics/bics/17151216
imported on: 2026-06-08T13:03:47.798Z
last refreshed on: 2026-06-08T13:03:47.798Z
source accessed on: 2019-12-03T20:05:01Z
source last accessed on: 2019-12-03T20:05:01Z
label: Autres produits chimiques et minéraux @fr
label: Chimici altro e minerali @it
label: Otros químicos y minerales @es
label: Outros produtos químicos e minerais @pt
label: Sonstige Chemikalien & Mineralien @de
label: Прочие химические продукты и минералы @ru
label: 其他化工与矿产 @zh
label: 其它化學及金屬 @zh-hant
label: 化学品､ﾐﾈﾗﾙ @ja
label: 기타 화학물질 & 광물 @ko
definition: This industry subgroup includes companies that mine and refine other chemicals and minerals.
notation: 17151216
valid from: 2014-08-08
valid till: 2020-10-03

Other Mined Minerals
type: BicsLevel3Industry
type: Classifier
type: NamedIndividual
is industry of: Metals & Mining
is anachronous version of: http://data.ga-group.nl/ics/bics/18101513
is contemporary version of: http://data.ga-group.nl/ics/bics/171512
is replaced by: http://data.ga-group.nl/ics/bics/2020/18101513
is version of: http://data.ga-group.nl/ics/bics/171512
is version of: http://data.ga-group.nl/ics/bics/18101513
imported on: 2026-06-08T13:03:47.798Z
last refreshed on: 2026-06-08T13:03:47.798Z
source accessed on: 2019-12-03T20:05:01Z
source last accessed on: 2019-12-03T20:05:01Z
label: Altri minerali estratti @it
label: Autres minéraux minés @fr
label: Otros mins minados @es
label: Out minerais extr @pt
label: Sonst. abgebaute Minerale @de
label: Прочие минералы @ru
label: その他鉱物 @ja
label: 其他开采矿产 @zh
label: 其他開採礦物 @zh-hant
label: 기타 광석 미네랄 @ko
definition: This industry includes companies that mine phosphate, potash, soda, borate, precious stones and other minerals.
notation: 171512
valid from: 2014-08-08
valid till: 2020-10-03

Coal Support Services
type: BicsLevel4SubIndustry
type: Classifier
type: NamedIndividual
is sub industry of: Mining Services
is anachronous version of: http://data.ga-group.nl/ics/bics/1810151510
is contemporary version of: http://data.ga-group.nl/ics/bics/17151310
is replaced by: http://data.ga-group.nl/ics/bics/2020/1810151510
is version of: http://data.ga-group.nl/ics/bics/17151310
is version of: http://data.ga-group.nl/ics/bics/1810151510
imported on: 2026-06-08T13:03:47.798Z
last refreshed on: 2026-06-08T13:03:47.798Z
source accessed on: 2019-12-03T20:05:01Z
source last accessed on: 2019-12-03T20:05:01Z
label: Serv supporto carbone @it
label: Serviços de suporte ao carvão @pt
label: Services de soutien au charbon @fr
label: Servicios de soporte de carbón @es
label: Support-Services für Kohle @de
label: Уголь-Вспомогательные услуги @ru
label: 煤支持服务 @zh
label: 煤炭輔助服務 @zh-hant
label: 石炭ｻﾎﾟｰﾄｻｰﾋﾞｽ @ja
label: 석탄 지원 서비스 @ko
definition: This industry subgroup includes companies that provide support services for coal mining operations.
notation: 17151310
valid from: 2014-08-08
valid till: 2020-10-03

Metals Support Services
type: BicsLevel4SubIndustry
type: Classifier
type: NamedIndividual
is sub industry of: Mining Services
is anachronous version of: http://data.ga-group.nl/ics/bics/1810151511
is contemporary version of: http://data.ga-group.nl/ics/bics/17151311
is replaced by: http://data.ga-group.nl/ics/bics/2020/1810151511
is version of: http://data.ga-group.nl/ics/bics/17151311
is version of: http://data.ga-group.nl/ics/bics/1810151511
imported on: 2026-06-08T13:03:47.798Z
last refreshed on: 2026-06-08T13:03:47.798Z
source accessed on: 2019-12-03T20:05:01Z
source last accessed on: 2019-12-03T20:05:01Z
label: Serviços de suporte à metais @pt
label: Services de soutien aux métaux @fr
label: Servicios de soporte de metales @es
label: Servizi supporto metalli @it
label: Support-Services für Metalle @de
label: Металлы-Вспомогательные услуги @ru
label: 金属支持服务 @zh
label: 金属ｻﾎﾟｰﾄｻｰﾋﾞｽ @ja
label: 金屬輔助服務 @zh-hant
label: 금속 지원 서비스 @ko
definition: This industry subgroup includes companies that provide support services for metal mining operations.
notation: 17151311
valid from: 2014-08-08
valid till: 2020-10-03

Non-Metallic Mining Support
type: BicsLevel4SubIndustry
type: Classifier
type: NamedIndividual
is sub industry of: Mining Services
is anachronous version of: http://data.ga-group.nl/ics/bics/1810151512
is contemporary version of: http://data.ga-group.nl/ics/bics/17151312
is replaced by: http://data.ga-group.nl/ics/bics/2020/1810151512
is version of: http://data.ga-group.nl/ics/bics/17151312
is version of: http://data.ga-group.nl/ics/bics/1810151512
imported on: 2026-06-08T13:03:47.798Z
last refreshed on: 2026-06-08T13:03:47.798Z
source accessed on: 2019-12-03T20:05:01Z
source last accessed on: 2019-12-03T20:05:01Z
label: Servicios de soporte de minería no metálica @es
label: Soutien extraction minière non-métaux @fr
label: Suporte à mineração de não metálicos @pt
label: Supporto minerario non metallo @it
label: Unterstützung für nichtmetall. Bergbau @de
label: Вспомогат. услуги по добыче неметал. ископ. @ru
label: 非金属矿业支持 @zh
label: 非金属鉱業ｻﾎﾟｰﾄ @ja
label: 非金屬礦業支援 @zh-hant
label: 비금속 채굴 지원 @ko
definition: This industry subgroup includes companies that provide support services for non-metallic mining operations.
notation: 17151312
valid from: 2014-08-08
valid till: 2020-10-03

Mining Services
type: BicsLevel3Industry
type: Classifier
type: NamedIndividual
is industry of: Metals & Mining
is anachronous version of: http://data.ga-group.nl/ics/bics/18101515
is contemporary version of: http://data.ga-group.nl/ics/bics/171513
is replaced by: http://data.ga-group.nl/ics/bics/2020/18101515
is version of: http://data.ga-group.nl/ics/bics/171513
is version of: http://data.ga-group.nl/ics/bics/18101515
imported on: 2026-06-08T13:03:47.798Z
last refreshed on: 2026-06-08T13:03:47.798Z
source accessed on: 2019-12-03T20:05:01Z
source last accessed on: 2019-12-03T20:05:01Z
label: Bergbaudienste @de
label: Serv d'extraction @fr
label: Serv mineração @pt
label: Servicios de minería @es
label: Servizi minerari @it
label: Услуги по добыче ископаемых @ru
label: 採礦服務業 @zh-hant
label: 采矿服务 @zh
label: 鉱業関連ｻｰﾋﾞｽ @ja
label: 채굴 서비스 @ko
definition: This industry includes companies that provide support services for coal and metal mining.
notation: 171513
valid from: 2014-08-08
valid till: 2020-10-03

Metals & Ore Whslrs & Traders
type: BicsLevel3Industry
type: Classifier
type: NamedIndividual
is industry of: Metals & Mining
is anachronous version of: http://data.ga-group.nl/ics/bics/18101516
is contemporary version of: http://data.ga-group.nl/ics/bics/171514
is replaced by: http://data.ga-group.nl/ics/bics/2020/18101516
is version of: http://data.ga-group.nl/ics/bics/171514
is version of: http://data.ga-group.nl/ics/bics/18101516
imported on: 2026-06-08T13:03:47.798Z
last refreshed on: 2026-06-08T13:03:47.798Z
source accessed on: 2019-12-03T20:05:01Z
source last accessed on: 2019-12-03T20:05:01Z
label: Atac e comerc de metais e minério @pt
label: Com may/ops metales y min @es
label: GH/Trader v. Metall & Erz @de
label: Gross/traders en métaux/minerais @fr
label: Grossisti e comm metalli e minerali @it
label: Оптовые продавцы/трейдеры-Металлы и руда @ru
label: 金属与矿石批发商及贸易商 @zh
label: 金属･鉱物卸売業者､ﾄﾚｰﾀﾞｰ @ja
label: 金屬及礦物批發/貿易 @zh-hant
label: 금속 & 광석 도매업/거래업체 @ko
definition: This industry includes companies that trade non-ferrous minerals and/or metals.
notation: 171514
valid from: 2014-08-08
valid till: 2020-10-03

Metals & Mining
type: BicsLevel2IndustryGroup
type: Classifier
type: NamedIndividual
is industry group of: Materials
is anachronous version of: http://data.ga-group.nl/ics/bics/181015
is contemporary version of: http://data.ga-group.nl/ics/bics/1715
is replaced by: http://data.ga-group.nl/ics/bics/2020/181015
is version of: http://data.ga-group.nl/ics/bics/1715
is version of: http://data.ga-group.nl/ics/bics/181015
imported on: 2026-06-08T13:03:47.798Z
last refreshed on: 2026-06-08T13:03:47.798Z
source accessed on: 2019-12-03T20:05:01Z
source last accessed on: 2019-12-03T20:05:01Z
label: Industrie minero-metallurgiche @it
label: Métaux & Minerais @fr
label: Metais e Mineração @pt
label: Metales y minas @es
label: Metalle & Bergbau @de
label: Металлы и горная пром. @ru
label: 金属与矿业 @zh
label: 金属･鉱業 @ja
label: 金屬與礦業 @zh-hant
label: 금속과 채광 @ko
definition: This industry group includes companies that mine metals and minerals. Activities include ore and mineral mining, stone mining and quarrying, non-ferrous metals smelting and manufacturing, and mining support services.
notation: 1715
valid from: 2014-08-08
valid till: 2020-10-03

Materials
type: BicsLevel1Sector
type: Classifier
type: NamedIndividual
is anachronous version of: http://data.ga-group.nl/ics/bics/1810
is contemporary version of: http://data.ga-group.nl/ics/bics/17
is replaced by: http://data.ga-group.nl/ics/bics/2020/1810
is version of: http://data.ga-group.nl/ics/bics/17
is version of: http://data.ga-group.nl/ics/bics/1810
imported on: 2026-06-08T13:03:47.798Z
last refreshed on: 2026-06-08T13:03:47.798Z
source accessed on: 2019-12-03T20:05:01Z
source last accessed on: 2019-12-03T20:05:01Z
label: Matériaux @fr
label: Materiais @pt
label: Materiales @es
label: Materiali @it
label: Rohstoffe @de
label: Материалы @ru
label: 原料 @zh-hant
label: 原材料 @ja
label: 材料 @zh
label: 원자재 @ko
definition: This sector includes companies involved in the basic materials industries. Such industries include forest and paper products, chemicals, mining, steel and packaging.
notation: 17
valid from: 2014-08-08
valid till: 2020-10-03

Broadcasting Equipment
type: BicsLevel4SubIndustry
type: Classifier
type: NamedIndividual
is sub industry of: Communications Equipment
is anachronous version of: http://data.ga-group.nl/ics/bics/1910101010
is contemporary version of: http://data.ga-group.nl/ics/bics/18101010
is replaced by: http://data.ga-group.nl/ics/bics/2020/1910101010
is version of: http://data.ga-group.nl/ics/bics/18101010
is version of: http://data.ga-group.nl/ics/bics/1910101010
imported on: 2026-06-08T13:03:47.798Z
last refreshed on: 2026-06-08T13:03:47.798Z
source accessed on: 2019-12-03T20:05:01Z
source last accessed on: 2019-12-03T20:05:01Z
label: Apparecchiature trasmissioni @it
label: Equip de transmissão @pt
label: Equipement de diffusion @fr
label: Equipo de transmisión AV @es
label: Fernseh- & Rundfunkgeräte @de
label: Оборудование для радио и телевещания @ru
label: 广播设备 @zh
label: 廣播設備 @zh-hant
label: 放送機器 @ja
label: 방송장비 @ko
definition: This industry subgroup includes companies that manufacture television and radio broadcasting equipment used to create, manage and transmit media content.
notation: 18101010
valid from: 2014-08-08
valid till: 2020-10-03

Home & Sm Business Netw Equip
type: BicsLevel5Segment
type: Classifier
type: NamedIndividual
is level5 segment of: Data Networking Equipment
is anachronous version of: http://data.ga-group.nl/ics/bics/191010101110
is contemporary version of: http://data.ga-group.nl/ics/bics/1810101110
is replaced by: http://data.ga-group.nl/ics/bics/2020/191010101110
is version of: http://data.ga-group.nl/ics/bics/1810101110
is version of: http://data.ga-group.nl/ics/bics/191010101110
imported on: 2026-06-08T13:03:47.798Z
last refreshed on: 2026-06-08T13:03:47.798Z
source accessed on: 2019-12-03T20:05:01Z
source last accessed on: 2019-12-03T20:05:01Z
label: App rete resid e piccole aziende @it
label: Equip réseau maison/petites entreprises @fr
label: Equip rede peq negócios e domésticos @pt
label: Equipo de red para el hogar y la pequeña empresa @es
label: Netzwerkger. f. Haus & Kleinbetr. @de
label: Сетевое оборуд. для дома и малого бизнеса @ru
label: 住宅/小型企業網路設備 @zh-hant
label: 在宅事業･中小企業用ﾈｯﾄﾜｰｸ機器 @ja
label: 家庭与小企业网络设备 @zh
label: 가정 & 소형사업 네트워크설비 @ko
definition: This segment includes companies that manufacture and market home and small business networking equipment, such as routers, modems and adapters. This segment includes both wireless and wireline home networking products.
notation: 1810101110
valid from: 2014-08-08
valid till: 2020-10-03

Wireless Data Network Equip
type: BicsLevel5Segment
type: Classifier
type: NamedIndividual
is level5 segment of: Data Networking Equipment
is anachronous version of: http://data.ga-group.nl/ics/bics/191010101111
is contemporary version of: http://data.ga-group.nl/ics/bics/1810101111
is replaced by: http://data.ga-group.nl/ics/bics/2020/191010101111
is version of: http://data.ga-group.nl/ics/bics/1810101111
is version of: http://data.ga-group.nl/ics/bics/191010101111
imported on: 2026-06-08T13:03:47.798Z
last refreshed on: 2026-06-08T13:03:47.798Z
source accessed on: 2019-12-03T20:05:01Z
source last accessed on: 2019-12-03T20:05:01Z
label: Apparecchi di rete mobile @it
label: Equipamento de rede de dados sem fio @pt
label: Equipement de réseaux données sans fil @fr
label: Equipo de redes de datos inalámbricos @es
label: Kabellose Datennetzwerk-Equipment @de
label: Беспроводное сетевое оборудование @ru
label: 无线数据网络设备 @zh
label: 無線ﾃﾞｰﾀﾈｯﾄﾜｰｸ機器 @ja
label: 行動通信數據網路設備 @zh-hant
label: 무선 데이터 네트워크 장비 @ko
definition: This segment includes companies that manufacture data networking equipment used to manage and transmit mobile data.
notation: 1810101111
valid from: 2014-08-08
valid till: 2020-10-03

Wireline Data Network Equip
type: BicsLevel5Segment
type: Classifier
type: NamedIndividual
is level5 segment of: Data Networking Equipment
is anachronous version of: http://data.ga-group.nl/ics/bics/191010101112
is contemporary version of: http://data.ga-group.nl/ics/bics/1810101112
is replaced by: http://data.ga-group.nl/ics/bics/2020/191010101112
is version of: http://data.ga-group.nl/ics/bics/1810101112
is version of: http://data.ga-group.nl/ics/bics/191010101112
imported on: 2026-06-08T13:03:47.798Z
last refreshed on: 2026-06-08T13:03:47.798Z
source accessed on: 2019-12-03T20:05:01Z
source last accessed on: 2019-12-03T20:05:01Z
label: Equipaggiam reti dati telefonia fissa @it
label: Equipamento de rede de dados de linha fixa @pt
label: Equipement de données par réseau filaire @fr
label: Equipo alámbrico de redes de datos @es
label: Geräte für drahtgebundenen Datennetzwerken @de
label: Проводное оборудование сетей данных @ru
label: 固網數據網路設備 @zh-hant
label: 有線ﾃﾞｰﾀﾈｯﾄﾜｰｸ機器 @ja
label: 有线数据联网设��� @zh
label: 유선 데이터 네트워크 장비 @ko
definition: This segment includes companies that manufacture enterprise and carrier-class networking equipment, such as routers, switches, bridges and gateways.
notation: 1810101112
valid from: 2014-08-08
valid till: 2020-10-03

Data Networking Equipment
type: BicsLevel4SubIndustry
type: Classifier
type: NamedIndividual
is sub industry of: Communications Equipment
is anachronous version of: http://data.ga-group.nl/ics/bics/1910101011
is contemporary version of: http://data.ga-group.nl/ics/bics/18101011
is replaced by: http://data.ga-group.nl/ics/bics/2020/1910101011
is version of: http://data.ga-group.nl/ics/bics/18101011
is version of: http://data.ga-group.nl/ics/bics/1910101011
imported on: 2026-06-08T13:03:47.798Z
last refreshed on: 2026-06-08T13:03:47.798Z
source accessed on: 2019-12-03T20:05:01Z
source last accessed on: 2019-12-03T20:05:01Z
label: Apparecchiature rete dati @it
label: Ausstattung des Datennetzwerks @de
label: Equipamento de rede dados @pt
label: Equipement de réseaux de données @fr
label: Equipo de red de datos @es
label: Оборудование для сетей данных @ru
label: 数据联网设备 @zh
label: 數據網路設備 @zh-hant
label: 데이터 네트워킹 장비 @ko
label: ﾃﾞｰﾀﾈｯﾄﾜｰｸ機器 @ja
definition: This industry subgroup includes companies that manufacture data networking equipment for wireless and wireline networks. Such equipment includes enterprise networking equipment, as well as small business and home premises equipment.
notation: 18101011
valid from: 2014-08-08
valid till: 2020-10-03

Mobile Phone Devices
type: BicsLevel5Segment
type: Classifier
type: Discontinued
type: NamedIndividual
is level5 segment of: Mobile Phones
is contemporary version of: http://data.ga-group.nl/ics/bics/1810101210
is version of: http://data.ga-group.nl/ics/bics/1810101210
imported on: 2026-06-08T13:03:47.798Z
last refreshed on: 2026-06-08T13:03:47.798Z
source accessed on: 2019-12-03T20:05:01Z
source last accessed on: 2019-12-03T20:05:01Z
label: Apar Telefones móveis @pt
label: Aparatos móbiles @es
label: Appareils de téléphonie mobile @fr
label: Mobiltelefongeräte @de
label: Telefonini @it
label: Мобильные телефоны @ru
label: 携帯電話機器 @ja
label: 移动电话装置 @zh
label: 行動手機裝置 @zh-hant
label: 휴대폰 단말기 @ko
definition: This segment includes companies that design, manufacture and sell mobile handsets to wireless carriers and retail outlets.
notation: 1810101210
valid from: 2014-08-08
valid till: 2020-10-03

Mobile Phone Accessories
type: BicsLevel5Segment
type: Classifier
type: Discontinued
type: NamedIndividual
is level5 segment of: Mobile Phones
is contemporary version of: http://data.ga-group.nl/ics/bics/1810101211
is version of: http://data.ga-group.nl/ics/bics/1810101211
imported on: 2026-06-08T13:03:47.798Z
last refreshed on: 2026-06-08T13:03:47.798Z
source accessed on: 2019-12-03T20:05:01Z
source last accessed on: 2019-12-03T20:05:01Z
label: Accesorios de celulares @es
label: Accessoires pour portables @fr
label: Accessori telefonia mobile @it
label: Acessórios para telefonia móvel @pt
label: Handyzubehör @de
label: Аксессуары для мобильных телефонов @ru
label: 手机配件 @zh
label: 携��電話付属品 @ja
label: 行動電話配件 @zh-hant
label: 휴대폰 액세서리 @ko
definition: This segment includes companies that manufacture and sell cell phone accessories, such as headsets and chargers.
notation: 1810101211
valid from: 2014-08-08
valid till: 2020-10-03

Mobile Phones
type: BicsLevel4SubIndustry
type: Classifier
type: NamedIndividual
is sub industry of: Communications Equipment
is anachronous version of: http://data.ga-group.nl/ics/bics/1910101012
is contemporary version of: http://data.ga-group.nl/ics/bics/18101012
is replaced by: http://data.ga-group.nl/ics/bics/2020/1910101012
is version of: http://data.ga-group.nl/ics/bics/18101012
is version of: http://data.ga-group.nl/ics/bics/1910101012
imported on: 2026-06-08T13:03:47.798Z
last refreshed on: 2026-06-08T13:03:47.798Z
source accessed on: 2019-12-03T20:05:01Z
source last accessed on: 2019-12-03T20:05:01Z
label: Celulares @es
label: Fones móveis @pt
label: Mobiltelefone @de
label: Téléphones portables @fr
label: Telefonia mobile @it
label: Мобильные телефоны @ru
label: 携帯端末 @ja
label: 移动电话 @zh
label: 行動手機 @zh-hant
label: 휴대폰 @ko
definition: This industry subgroup includes companies that manufacture mobile telephones.
notation: 18101012
valid from: 2014-08-08
valid till: 2020-10-03

Mobile Radio Comm Equipment
type: BicsLevel6Segment
type: Classifier
type: NamedIndividual
is level6 segment of: Wireless Telecom Equipment
is anachronous version of: http://data.ga-group.nl/ics/bics/19101010131010
is contemporary version of: http://data.ga-group.nl/ics/bics/181010131010
is replaced by: http://data.ga-group.nl/ics/bics/2020/19101010131010
is version of: http://data.ga-group.nl/ics/bics/181010131010
is version of: http://data.ga-group.nl/ics/bics/19101010131010
imported on: 2026-06-08T13:03:47.798Z
last refreshed on: 2026-06-08T13:03:47.798Z
source accessed on: 2019-12-03T20:05:01Z
source last accessed on: 2019-12-03T20:05:01Z
label: Apparecchi com radiomobile @it
label: Equip communication radio mobile @fr
label: Equipamento comunic por rádio móvel @pt
label: Equipo radiocomunicación @es
label: Mobilfunkkommunikationsger. @de
label: Радиокоммуникационное мобильное оборуд. @ru
label: 無線通信機器 @ja
label: 移动无线电通信设备 @zh
label: 行動無線電通訊設備 @zh-hant
label: 모바일 라디오 통신 장비 @ko
definition: This segment includes companies that manufacture mobile radio equipment, such as handheld radios used by the police, firefighters and the military.
notation: 181010131010
valid from: 2014-08-08
valid till: 2020-10-03

RFID Devices
type: BicsLevel6Segment
type: Classifier
type: NamedIndividual
is level6 segment of: Wireless Telecom Equipment
is anachronous version of: http://data.ga-group.nl/ics/bics/19101010131011
is contemporary version of: http://data.ga-group.nl/ics/bics/181010131011
is replaced by: http://data.ga-group.nl/ics/bics/2020/19101010131011
is version of: http://data.ga-group.nl/ics/bics/181010131011
is version of: http://data.ga-group.nl/ics/bics/19101010131011
imported on: 2026-06-08T13:03:47.798Z
last refreshed on: 2026-06-08T13:03:47.798Z
source accessed on: 2019-12-03T20:05:01Z
source last accessed on: 2019-12-03T20:05:01Z
label: Appareils RFID @fr
label: Dispositivi RFID @it
label: Dispositivos RFID @es
label: RFID Aparelhos @pt
label: RFID 장치 @ko
label: RFID-Geräte @de
label: RFID機器 @ja
label: RFID装置 @zh
label: Устройства RFID @ru
label: 無線射頻辨識裝置 @zh-hant
definition: This segment includes companies that manufacture and market radio frequency identification (RFID) equipment used for remote tracking of packages and inventory management.
notation: 181010131011
valid from: 2014-08-08
valid till: 2020-10-03

Satellite Commercial Equip
type: BicsLevel6Segment
type: Classifier
type: NamedIndividual
is level6 segment of: Wireless Telecom Equipment
is anachronous version of: http://data.ga-group.nl/ics/bics/19101010131012
is contemporary version of: http://data.ga-group.nl/ics/bics/181010131012
is replaced by: http://data.ga-group.nl/ics/bics/2020/19101010131012
is version of: http://data.ga-group.nl/ics/bics/181010131012
is version of: http://data.ga-group.nl/ics/bics/19101010131012
imported on: 2026-06-08T13:03:47.798Z
last refreshed on: 2026-06-08T13:03:47.798Z
source accessed on: 2019-12-03T20:05:01Z
source last accessed on: 2019-12-03T20:05:01Z
label: Equipagg comunicazione satellitare @it
label: Equipamento de comunicações por satélite @pt
label: Equipement de communication par satellite @fr
label: Equipo de comunicaciones de satélite @es
label: Satellitenkommunikationsgeräte @de
label: Оборудование спутниковой связи @ru
label: 卫星通信设备 @zh
label: 衛星通信機器 @ja
label: 衛星通訊設備 @zh-hant
label: 위성 통신장비 @ko
definition: This segment includes companies that manufacture and market satellite network equipment, such as transmission equipment, antennas, satellite phones and other satellite equipment. Many of these companies also produce equipment for related applications, such as radar systems and other specialized applications.
notation: 181010131012
valid from: 2014-08-08
valid till: 2020-10-03

Wireless Application Svc Equip
type: BicsLevel6Segment
type: Classifier
type: NamedIndividual
is level6 segment of: Wireless Telecom Equipment
is anachronous version of: http://data.ga-group.nl/ics/bics/19101010131013
is contemporary version of: http://data.ga-group.nl/ics/bics/181010131013
is replaced by: http://data.ga-group.nl/ics/bics/2020/19101010131013
is version of: http://data.ga-group.nl/ics/bics/181010131013
is version of: http://data.ga-group.nl/ics/bics/19101010131013
imported on: 2026-06-08T13:03:47.798Z
last refreshed on: 2026-06-08T13:03:47.798Z
source accessed on: 2019-12-03T20:05:01Z
source last accessed on: 2019-12-03T20:05:01Z
label: App swev applicazioni senza fili @it
label: Equip serv aplicações sem fio @pt
label: Equip serv applc sans fil @fr
label: Equipo de servicios de aplicaciones inalámbricas @es
label: Kabell. Applikationsservicegeräte @de
label: Оборуд. для услуг беспроводных приложений @ru
label: 无线应用服务设备 @zh
label: 無線應用服務設備 @zh-hant
label: 無線ｱﾌﾟﾘ･ｻｰﾋﾞｽ機器 @ja
label: 무선 애플리케이션 서비스 장비 @ko
definition: This segment includes companies that provide mobile applications services platforms (like applications servers) to support services, such as push-to-talk, enterprise messaging and field force management.
notation: 181010131013
valid from: 2014-08-08
valid till: 2020-10-03

Wireless Network Infra Equip
type: BicsLevel6Segment
type: Classifier
type: NamedIndividual
is level6 segment of: Wireless Telecom Equipment
is anachronous version of: http://data.ga-group.nl/ics/bics/19101010131014
is contemporary version of: http://data.ga-group.nl/ics/bics/181010131014
is replaced by: http://data.ga-group.nl/ics/bics/2020/19101010131014
is version of: http://data.ga-group.nl/ics/bics/181010131014
is version of: http://data.ga-group.nl/ics/bics/19101010131014
imported on: 2026-06-08T13:03:47.798Z
last refreshed on: 2026-06-08T13:03:47.798Z
source accessed on: 2019-12-03T20:05:01Z
source last accessed on: 2019-12-03T20:05:01Z
label: App infra rete senza fili @it
label: Equip infra réseaux sans fil @fr
label: Equip infra rede sem fio @pt
label: Equipo de infraestructura de red inalámbrica @es
label: Kabell. Netzinfrastrukturgeräte @de
label: Оборуд. инфраструктуры беспроводной связи @ru
label: 无线网络基础设施设备 @zh
label: 無線網路基礎建設設備 @zh-hant
label: 無線通信ｲﾝﾌﾗ機器 @ja
label: 무선 네트워크 인프라 장비 @ko
definition: This segment includes companies that design, manufacture and sell wireless network transmission, switching and access equipment, such as base stations, microwave radios and mobile telephone switches.
notation: 181010131014
valid from: 2014-08-08
valid till: 2020-10-03

Other Wireless Comm Equip
type: BicsLevel6Segment
type: Classifier
type: Discontinued
type: NamedIndividual
is level6 segment of: Wireless Telecom Equipment
is contemporary version of: http://data.ga-group.nl/ics/bics/181010131015
is version of: http://data.ga-group.nl/ics/bics/181010131015
imported on: 2026-06-08T13:03:47.798Z
last refreshed on: 2026-06-08T13:03:47.798Z
source accessed on: 2019-12-03T20:05:01Z
source last accessed on: 2019-12-03T20:05:01Z
label: Altri equipaggiam comunicaz senza fili @it
label: Autres équipements communication sans fil @fr
label: Otro equipo de comunicación inalámbrica @es
label: Outros equipamentos de comunicação sem fio @pt
label: Sonstige drahtlose Kommunikationsgeräte @de
label: Прочее беспроводное коммуникац. оборудование @ru
label: その他無線通信機器 @ja
label: 其他无线通信设备 @zh
label: 其他無線通訊設備 @zh-hant
label: 기타 무선통신장비 @ko
definition: This segment includes companies that manufacture other wireless communications equipment not elsewhere classified, such as enterprise wireless networking equipment, wireless applications and related components.
notation: 181010131015
valid from: 2014-08-08
valid till: 2020-10-03

Wireless Telecom Equipment
type: BicsLevel5Segment
type: Classifier
type: NamedIndividual
is level5 segment of: Telecommunications Equipment
is anachronous version of: http://data.ga-group.nl/ics/bics/191010101310
is contemporary version of: http://data.ga-group.nl/ics/bics/1810101310
is replaced by: http://data.ga-group.nl/ics/bics/2020/191010101310
is version of: http://data.ga-group.nl/ics/bics/1810101310
is version of: http://data.ga-group.nl/ics/bics/191010101310
imported on: 2026-06-08T13:03:47.798Z
last refreshed on: 2026-06-08T13:03:47.798Z
source accessed on: 2019-12-03T20:05:01Z
source last accessed on: 2019-12-03T20:05:01Z
label: Apparecchi telecom senza fili @it
label: Equipamento telecom sem fio @pt
label: Equipements télécomm sans fil @fr
label: Equipo telecom móvil @es
label: Kabellose Telekommunikationsgeräte @de
label: Беспроводн. телекоммуникац. оборуд. @ru
label: 携帯通信機器 @ja
label: 无线电信设备 @zh
label: 無線電信設備 @zh-hant
label: 무선 정보통신 장비 @ko
definition: This segment includes companies that manufacture wireless and satellite communications equipment, such as wireless networking, satellite communications, and mobile radio communications equipment.
notation: 1810101310
valid from: 2014-08-08
valid till: 2020-10-03

Cable TV Equipment
type: BicsLevel6Segment
type: Classifier
type: NamedIndividual
is level6 segment of: Wireline Telecom Equipment
is anachronous version of: http://data.ga-group.nl/ics/bics/19101010131110
is contemporary version of: http://data.ga-group.nl/ics/bics/181010131110
is replaced by: http://data.ga-group.nl/ics/bics/2020/19101010131110
is version of: http://data.ga-group.nl/ics/bics/181010131110
is version of: http://data.ga-group.nl/ics/bics/19101010131110
imported on: 2026-06-08T13:03:47.798Z
last refreshed on: 2026-06-08T13:03:47.798Z
source accessed on: 2019-12-03T20:05:01Z
source last accessed on: 2019-12-03T20:05:01Z
label: Apparecchi TV cavo @it
label: Equipamento de TV a cabo @pt
label: Equipement Télé câble @fr
label: Equipo de TV de cable @es
label: Geräte für Kabel-TV @de
label: Оборудование для кабельного ТВ @ru
label: 有線電視設備 @zh-hant
label: 有线电视设备 @zh
label: 케이블 TV 장비 @ko
label: ｹｰﾌﾞﾙﾃﾚﾋﾞ機器 @ja
definition: This segment includes companies that manufacture and market cable television set-tops as well as network infrastructure equipment. Products include set-top boxes, high definition television (HDTV) equipment, Internet Protocol television (IPTV) equipment, video processing products, fiber optic equipment, headends, and systems to manage video on demand (VOD), digital advertising and digital video recording.
notation: 181010131110
valid from: 2014-08-08
valid till: 2020-10-03

Fiber Optic Telecom Equipment
type: BicsLevel6Segment
type: Classifier
type: NamedIndividual
is level6 segment of: Wireline Telecom Equipment
is anachronous version of: http://data.ga-group.nl/ics/bics/19101010131111
is contemporary version of: http://data.ga-group.nl/ics/bics/181010131111
is replaced by: http://data.ga-group.nl/ics/bics/2020/19101010131111
is version of: http://data.ga-group.nl/ics/bics/181010131111
is version of: http://data.ga-group.nl/ics/bics/19101010131111
imported on: 2026-06-08T13:03:47.798Z
last refreshed on: 2026-06-08T13:03:47.798Z
source accessed on: 2019-12-03T20:05:01Z
source last accessed on: 2019-12-03T20:05:01Z
label: Apparecchi telecom fibra ottica @it
label: Equipamento telecom fibra ótica @pt
label: Equipement télécom fibre optique @fr
label: Equipo Telecom de fibras ópticas @es
label: Glasfaserkomm.-Geräte @de
label: Волоконнооптическое телекоммуникац. оборуд. @ru
label: 光纖電信設備 @zh-hant
label: 光纤电信设备 @zh
label: 光ﾌｧｲﾊﾞｰ通信機器 @ja
label: 광섬유 정보통신 장비 @ko
definition: This segment includes companies that manufacture and market fiber optic communications equipment including transmission, access and switching systems.
notation: 181010131111
valid from: 2014-08-08
valid till: 2020-10-03

Telecommunications Devices
type: BicsLevel6Segment
type: Classifier
type: NamedIndividual
is level6 segment of: Wireline Telecom Equipment
is anachronous version of: http://data.ga-group.nl/ics/bics/19101010131112
is contemporary version of: http://data.ga-group.nl/ics/bics/181010131112
is replaced by: http://data.ga-group.nl/ics/bics/2020/19101010131112
is version of: http://data.ga-group.nl/ics/bics/181010131112
is version of: http://data.ga-group.nl/ics/bics/19101010131112
imported on: 2026-06-08T13:03:47.798Z
last refreshed on: 2026-06-08T13:03:47.798Z
source accessed on: 2019-12-03T20:05:01Z
source last accessed on: 2019-12-03T20:05:01Z
label: Aparelhos de telecomunicações @pt
label: Appareils de télécommunication @fr
label: Dispositivi telecomunicazioni @it
label: Dispositivos de telecomunicaciones @es
label: Telekommunikationsgeräte @de
label: Телекоммуникационные устройства @ru
label: 电信设备 @zh
label: 通信機器 @ja
label: 電信裝置 @zh-hant
label: 정보통신 기기 @ko
definition: This segment includes companies that manufacture fixed-line customer premises equipment (CPE). Equipment includes telephone systems, video conferencing equipment, digital recording equipment and headsets.
notation: 181010131112
valid from: 2014-08-08
valid till: 2020-10-03

Wireline Customer Premise Equip
type: BicsLevel6Segment
type: Classifier
type: NamedIndividual
is level6 segment of: Wireline Telecom Equipment
is anachronous version of: http://data.ga-group.nl/ics/bics/19101010131113
is contemporary version of: http://data.ga-group.nl/ics/bics/181010131113
is replaced by: http://data.ga-group.nl/ics/bics/2020/19101010131113
is version of: http://data.ga-group.nl/ics/bics/181010131113
is version of: http://data.ga-group.nl/ics/bics/19101010131113
imported on: 2026-06-08T13:03:47.798Z
last refreshed on: 2026-06-08T13:03:47.798Z
source accessed on: 2019-12-03T20:05:01Z
source last accessed on: 2019-12-03T20:05:01Z
label: App sede cliente via cavo @it
label: Equip instalações para clientes linha fixa @pt
label: Equip locaux clients filaires @fr
label: Equipo alámbrico de instalaciones del cliente @es
label: Kabelgeb. Geräten in Kundenhand @de
label: Абонентское проводное оконечное оборуд. @ru
label: 固定通信加入者宅内機器 @ja
label: 固網用戶終端設備 @zh-hant
label: 有线客户端设备 @zh
label: 유선 고객 소재지 장비 @ko
definition: This segment includes companies that manufacture wireline telecommunication devices. Such devices include home and small office networking equipment, video conferencing equipment and telephone systems.
notation: 181010131113
valid from: 2014-08-08
valid till: 2020-10-03

Wireline Network Infra Equip
type: BicsLevel6Segment
type: Classifier
type: NamedIndividual
is level6 segment of: Wireline Telecom Equipment
is anachronous version of: http://data.ga-group.nl/ics/bics/19101010131114
is contemporary version of: http://data.ga-group.nl/ics/bics/181010131114
is replaced by: http://data.ga-group.nl/ics/bics/2020/19101010131114
is version of: http://data.ga-group.nl/ics/bics/181010131114
is version of: http://data.ga-group.nl/ics/bics/19101010131114
imported on: 2026-06-08T13:03:47.798Z
last refreshed on: 2026-06-08T13:03:47.798Z
source accessed on: 2019-12-03T20:05:01Z
source last accessed on: 2019-12-03T20:05:01Z
label: Drahtgebundenes Netzwerk, Infrastr.-Geräte @de
label: Equip infra réseau filaire @fr
label: Equipaggiam reti via cavo @it
label: Equipo infra de red alámb @es
label: Infra equipam de rede fixa @pt
label: Проводное сетевое оборудование @ru
label: 固定ﾈｯﾄﾜｰｸ･ｲﾝﾌﾗ機器 @ja
label: 固網電信基建設備 @zh-hant
label: 有线网络基础设备 @zh
label: 유선 네트워크 인프라 장비 @ko
definition: This segment includes companies that manufacture and market legacy wireline telecommunication equipment including transmission, switching and access equipment. Products include class 5 switches, digital cross-connects, access multiplexers and PBXs.
notation: 181010131114
valid from: 2014-08-08
valid till: 2020-10-03

Other Wireline Telecom Equip
type: BicsLevel6Segment
type: Classifier
type: Discontinued
type: NamedIndividual
is level6 segment of: Wireline Telecom Equipment
is contemporary version of: http://data.ga-group.nl/ics/bics/181010131115
is version of: http://data.ga-group.nl/ics/bics/181010131115
imported on: 2026-06-08T13:03:47.798Z
last refreshed on: 2026-06-08T13:03:47.798Z
source accessed on: 2019-12-03T20:05:01Z
source last accessed on: 2019-12-03T20:05:01Z
label: Altri equipagg telefonia fissa @it
label: Autre équip télécom filaire @fr
label: Otro equipo alámbrico telecom @es
label: Outros equip telecom linha fixa @pt
label: Sonstige drahtgebundene Telekommunikationsgeräte @de
label: Другое проводное телекоммуникационное оборудование @ru
label: その他固定通信機器 @ja
label: 其他固網電信設備 @zh-hant
label: 其他有线电信设备 @zh
label: 기타 유선 정보통신 장비 @ko
definition: This segment includes companies that manufacture other wired telecommunications and networking equipment not elsewhere classified. Such equipment is used by wireline telecom service providers, cable television operators and enterprise customers, and includes equipment used for local area networks, wide area networks, fiber optic networks and cable TV networks.
notation: 181010131115
valid from: 2014-08-08
valid till: 2020-10-03

Wireline Telecom Equipment
type: BicsLevel5Segment
type: Classifier
type: NamedIndividual
is level5 segment of: Telecommunications Equipment
is anachronous version of: http://data.ga-group.nl/ics/bics/191010101311
is contemporary version of: http://data.ga-group.nl/ics/bics/1810101311
is replaced by: http://data.ga-group.nl/ics/bics/2020/191010101311
is version of: http://data.ga-group.nl/ics/bics/1810101311
is version of: http://data.ga-group.nl/ics/bics/191010101311
imported on: 2026-06-08T13:03:47.798Z
last refreshed on: 2026-06-08T13:03:47.798Z
source accessed on: 2019-12-03T20:05:01Z
source last accessed on: 2019-12-03T20:05:01Z
label: Apparecchi telecom fisse @it
label: Equipamento comunic linha fixa @pt
label: Equipements télécomm filaire @fr
label: Equipos de telecomunicaciones @es
label: Kabelgeb. Kommunikationsger. @de
label: Проводное телекоммуникационное оборуд. @ru
label: 固定通信機器 @ja
label: 固網電信設備 @zh-hant
label: 有线电信设备 @zh
label: 유선 정보통신 장비 @ko
definition: This segment includes companies that manufacture wired communications and networking equipment. Such equipment is used by wireline telecom service providers and cable television operators. Communications devices like phone systems and video conferencing equipment are also included.
notation: 1810101311
valid from: 2014-08-08
valid till: 2020-10-03

Telecommunications Equipment
type: BicsLevel4SubIndustry
type: Classifier
type: NamedIndividual
is sub industry of: Communications Equipment
is anachronous version of: http://data.ga-group.nl/ics/bics/1910101013
is contemporary version of: http://data.ga-group.nl/ics/bics/18101013
is replaced by: http://data.ga-group.nl/ics/bics/2020/1910101013
is version of: http://data.ga-group.nl/ics/bics/18101013
is version of: http://data.ga-group.nl/ics/bics/1910101013
imported on: 2026-06-08T13:03:47.798Z
last refreshed on: 2026-06-08T13:03:47.798Z
source accessed on: 2019-12-03T20:05:01Z
source last accessed on: 2019-12-03T20:05:01Z
label: Apparecchiature telecomunicazione @it
label: Equipamento telecomunicações @pt
label: Equipement de télécommunications @fr
label: Equipo de telecomunicaciones @es
label: Telekommunikationsausrüstung @de
label: Телекоммуник. оборудование @ru
label: 电信设备 @zh
label: 通信機器 @ja
label: 電信設備 @zh-hant
label: 정보통신 장비 @ko
definition: This industry subgroup includes companies that manufacture telecommunications equipment. Such equipment includes infrastructure and customer premises equipment for wireline and wireless networks.
notation: 18101013
valid from: 2014-08-08
valid till: 2020-10-03

Communications Equipment
type: BicsLevel3Industry
type: Classifier
type: NamedIndividual
is industry of: Articoli per ferramenta
is anachronous version of: http://data.ga-group.nl/ics/bics/19101010
is contemporary version of: http://data.ga-group.nl/ics/bics/181010
is replaced by: http://data.ga-group.nl/ics/bics/2020/19101010
is version of: http://data.ga-group.nl/ics/bics/181010
is version of: http://data.ga-group.nl/ics/bics/19101010
imported on: 2026-06-08T13:03:47.798Z
last refreshed on: 2026-06-08T13:03:47.798Z
source accessed on: 2019-12-03T20:05:01Z
source last accessed on: 2019-12-03T20:05:01Z
label: Eq comunicaciones @es
label: Equip communications @fr
label: Equip comunicações @pt
label: Equipaggiam comunicazioni @it
label: KommGeräte @de
label: Оборудование связи @ru
label: 通信機器 @ja
label: 通訊設備 @zh-hant
label: 通讯设备 @zh
label: 통신장��� @ko
definition: This industry includes companies that manufacture technology hardware used for communication purposes. Includes broadcasting equipment, networking equipment, mobile phones, and telecommunication equipment.
notation: 181010
valid from: 2014-08-08
valid till: 2020-10-03

Home & Car Audio Equipment
type: BicsLevel5Segment
type: Classifier
type: NamedIndividual
is level5 segment of: Audio Equipment
is anachronous version of: http://data.ga-group.nl/ics/bics/191010111010
is contemporary version of: http://data.ga-group.nl/ics/bics/1810111010
is replaced by: http://data.ga-group.nl/ics/bics/2020/191010111010
is version of: http://data.ga-group.nl/ics/bics/1810111010
is version of: http://data.ga-group.nl/ics/bics/191010111010
imported on: 2026-06-08T13:03:47.798Z
last refreshed on: 2026-06-08T13:03:47.798Z
source accessed on: 2019-12-03T20:05:01Z
source last accessed on: 2019-12-03T20:05:01Z
label: Apparecchiature audio casa e auto @it
label: Equipamento de áudio p/casa e carro @pt
label: Equipo audio para el hogar y autos @es
label: Equipt audio voiture et maison @fr
label: Home- und Auto-Stereos @de
label: Дом./автомоб. аудиотехника @ru
label: 家庭・自動車用ｵｰﾃﾞｨｵ機器 @ja
label: 家庭及汽車音響設備 @zh-hant
label: 家庭和汽车音响设备 @zh
label: 가정용 및 자동차 오디오 장비 @ko
definition: This segment includes companies that manufacture home and car stereo systems and equipment. Includes home sound systems, speakers, satellite radio, AM/FM radio, receivers, subwoofers and car audio dashboard units.
notation: 1810111010
valid from: 2014-08-08
valid till: 2020-10-03

Personal Audio Devices
type: BicsLevel5Segment
type: Classifier
type: NamedIndividual
is level5 segment of: Audio Equipment
is anachronous version of: http://data.ga-group.nl/ics/bics/191010111011
is contemporary version of: http://data.ga-group.nl/ics/bics/1810111011
is replaced by: http://data.ga-group.nl/ics/bics/2020/191010111011
is version of: http://data.ga-group.nl/ics/bics/1810111011
is version of: http://data.ga-group.nl/ics/bics/191010111011
imported on: 2026-06-08T13:03:47.798Z
last refreshed on: 2026-06-08T13:03:47.798Z
source accessed on: 2019-12-03T20:05:01Z
source last accessed on: 2019-12-03T20:05:01Z
label: Aparelhos áudio pessoal @pt
label: Dispositivi audio personali @it
label: Dispositivos personales de audio @es
label: Mat audio à usage perso @fr
label: Persönliche Audiogeräte @de
label: Персонал. аудиоустройства @ru
label: 个人音频装置 @zh
label: 個人用ｵｰﾃﾞｨｵ機器 @ja
label: 個人聲音裝置 @zh-hant
label: 개인용 오디오 기기 @ko
definition: This segment includes companies that manufacture personal, portable audio devices. Includes MP3 players, portable CD players and portable satellite radio devices.
notation: 1810111011
valid from: 2014-08-08
valid till: 2020-10-03

Professional Audio Equipment
type: BicsLevel5Segment
type: Classifier
type: NamedIndividual
is level5 segment of: Audio Equipment
is anachronous version of: http://data.ga-group.nl/ics/bics/191010111012
is contemporary version of: http://data.ga-group.nl/ics/bics/1810111012
is replaced by: http://data.ga-group.nl/ics/bics/2020/191010111012
is version of: http://data.ga-group.nl/ics/bics/1810111012
is version of: http://data.ga-group.nl/ics/bics/191010111012
imported on: 2026-06-08T13:03:47.798Z
last refreshed on: 2026-06-08T13:03:47.798Z
source accessed on: 2019-12-03T20:05:01Z
source last accessed on: 2019-12-03T20:05:01Z
label: Apparecchiature audio professionali @it
label: Equipamentos profissionais áudio @pt
label: Equipo profesional de audio @es
label: Equipt audio professionnel @fr
label: Professionelles Audiozubehör @de
label: Профессион. аудиоприборы @ru
label: 专业音响设备 @zh
label: 專業音響設備 @zh-hant
label: 業務用ｵｰﾃﾞｨｵ機器 @ja
label: 전문오디오장비 @ko
definition: This segment includes companies that manufacture professional audio equipment used to record and process sound in professional forums. Typically, this equipment is used for television/radio broadcasting, film production and live music entertainment events. Includes turntables, mixers, professional microphones, recorders, signal processors and boom poles.
notation: 1810111012
valid from: 2014-08-08
valid till: 2020-10-03

Other Audio Equipment
type: BicsLevel5Segment
type: Classifier
type: Discontinued
type: NamedIndividual
is level5 segment of: Audio Equipment
is contemporary version of: http://data.ga-group.nl/ics/bics/1810111013
is version of: http://data.ga-group.nl/ics/bics/1810111013
imported on: 2026-06-08T13:03:47.798Z
last refreshed on: 2026-06-08T13:03:47.798Z
source accessed on: 2019-12-03T20:05:01Z
source last accessed on: 2019-12-03T20:05:01Z
label: Altre apparecchiature audio @it
label: Aut équipt audio @fr
label: Otro equipo auditivo @es
label: Outros equipamentos áudio @pt
label: Sonstiges Audiozubehör @de
label: Прочее аудиооборудование @ru
label: その他ｵｰﾃﾞｨｵ @ja
label: 其他音响设备 @zh
label: 其他音響設備 @zh-hant
label: 기타오디오장비 @ko
definition: This segment includes companies that manufacture other audio equipment not classified elsewhere. Includes headphones, ear buds and consumer amplifiers.
notation: 1810111013
valid from: 2014-08-08
valid till: 2020-10-03

Audio Equipment
type: BicsLevel4SubIndustry
type: Classifier
type: NamedIndividual
is sub industry of: Consumer Electronics
is anachronous version of: http://data.ga-group.nl/ics/bics/1910101110
is contemporary version of: http://data.ga-group.nl/ics/bics/18101110
is replaced by: http://data.ga-group.nl/ics/bics/2020/1910101110
is version of: http://data.ga-group.nl/ics/bics/18101110
is version of: http://data.ga-group.nl/ics/bics/1910101110
imported on: 2026-06-08T13:03:47.798Z
last refreshed on: 2026-06-08T13:03:47.798Z
source accessed on: 2019-12-03T20:05:01Z
source last accessed on: 2019-12-03T20:05:01Z
label: Apparecchiature audio @it
label: Audiozubehör @de
label: Equipamento áudio @pt
label: Equipement audio @fr
label: Equipo auditivo @es
label: Пр-во аудио оборудования @ru
label: 音响设备 @zh
label: 音響設備 @zh-hant
label: 오디오장비 @ko
label: ｵｰﾃﾞｨｵ機器 @ja
definition: This industry subgroup includes companies that manufacture audio equipment.
notation: 18101110
valid from: 2014-08-08
valid till: 2020-10-03

Digital Cameras
type: BicsLevel5Segment
type: Classifier
type: NamedIndividual
is level5 segment of: Camera Equipment
is anachronous version of: http://data.ga-group.nl/ics/bics/191010111110
is contemporary version of: http://data.ga-group.nl/ics/bics/1810111110
is replaced by: http://data.ga-group.nl/ics/bics/2020/191010111110
is version of: http://data.ga-group.nl/ics/bics/1810111110
is version of: http://data.ga-group.nl/ics/bics/191010111110
imported on: 2026-06-08T13:03:47.798Z
last refreshed on: 2026-06-08T13:03:47.798Z
source accessed on: 2019-12-03T20:05:01Z
source last accessed on: 2019-12-03T20:05:01Z
label: App photos numéri. @fr
label: Cámaras digitales @es
label: Câmeras digitais @pt
label: Digitalkameras @de
label: Macchine fotografiche digitali @it
label: Цифров. фотоап. @ru
label: 数码相机 @zh
label: 數位相機 @zh-hant
label: 디지털카메라 @ko
label: ﾃﾞｼﾞﾀﾙｶﾒﾗ @ja
definition: This segment includes companies that manufacture both digital and film cameras that are primarily used for taking still photographs.
notation: 1810111110
valid from: 2014-08-08
valid till: 2020-10-03

Video Cameras
type: BicsLevel5Segment
type: Classifier
type: NamedIndividual
is level5 segment of: Camera Equipment
is anachronous version of: http://data.ga-group.nl/ics/bics/191010111111
is contemporary version of: http://data.ga-group.nl/ics/bics/1810111111
is replaced by: http://data.ga-group.nl/ics/bics/2020/191010111111
is version of: http://data.ga-group.nl/ics/bics/1810111111
is version of: http://data.ga-group.nl/ics/bics/191010111111
imported on: 2026-06-08T13:03:47.798Z
last refreshed on: 2026-06-08T13:03:47.798Z
source accessed on: 2019-12-03T20:05:01Z
source last accessed on: 2019-12-03T20:05:01Z
label: Cámaras de video @es
label: Câmeras de vídeo @pt
label: Caméras vidéo @fr
label: Videocamere @it
label: Videokameras @de
label: Видеокамеры @ru
label: 摄像机 @zh
label: 錄影機 @zh-hant
label: 비디오카메라 @ko
label: ﾋﾞﾃﾞｵｶﾒﾗ @ja
definition: This segment includes companies that manufacture both digital and film cameras that are primarily used for recording video.
notation: 1810111111
valid from: 2014-08-08
valid till: 2020-10-03

Camera Accessories
type: BicsLevel5Segment
type: Classifier
type: NamedIndividual
is level5 segment of: Camera Equipment
is anachronous version of: http://data.ga-group.nl/ics/bics/191010111112
is contemporary version of: http://data.ga-group.nl/ics/bics/1810111112
is replaced by: http://data.ga-group.nl/ics/bics/2020/191010111112
is version of: http://data.ga-group.nl/ics/bics/1810111112
is version of: http://data.ga-group.nl/ics/bics/191010111112
imported on: 2026-06-08T13:03:47.798Z
last refreshed on: 2026-06-08T13:03:47.798Z
source accessed on: 2019-12-03T20:05:01Z
source last accessed on: 2019-12-03T20:05:01Z
label: Accesorios cámaras @es
label: Access. app. photo @fr
label: Accessori macch foto @it
label: Acessórios de câmera @pt
label: Kamerazubehör @de
label: Аксессуары для фотоаппаратов @ru
label: 相机配件 @zh
label: 相機配件 @zh-hant
label: 카메라 부속품 @ko
label: ｶﾒﾗｱｸｾｻﾘｰ @ja
definition: This segment includes companies that manufacture camera accessories and supplies, such as interchangeable lenses, flash devices, cables and photographic film.
notation: 1810111112
valid from: 2014-08-08
valid till: 2020-10-03

Camera Equipment
type: BicsLevel4SubIndustry
type: Classifier
type: NamedIndividual
is sub industry of: Consumer Electronics
is anachronous version of: http://data.ga-group.nl/ics/bics/1910101111
is contemporary version of: http://data.ga-group.nl/ics/bics/18101111
is replaced by: http://data.ga-group.nl/ics/bics/2020/1910101111
is version of: http://data.ga-group.nl/ics/bics/18101111
is version of: http://data.ga-group.nl/ics/bics/1910101111
imported on: 2026-06-08T13:03:47.798Z
last refreshed on: 2026-06-08T13:03:47.798Z
source accessed on: 2019-12-03T20:05:01Z
source last accessed on: 2019-12-03T20:05:01Z
label: Apparecchiature macchine foto @it
label: Equipamento câmera @pt
label: Equipo cámaras @es
label: Kamerazubehör @de
label: Matériel photo @fr
label: Фотооборудование @ru
label: 相机设备 @zh
label: 相機設備 @zh-hant
label: 카메라장비 @ko
label: ｶﾒﾗ機器 @ja
definition: This industry subgroup includes companies that manufacture cameras and camera equipment.
notation: 18101111
valid from: 2014-08-08
valid till: 2020-10-03

TV & Monitors
type: BicsLevel5Segment
type: Classifier
type: NamedIndividual
is level5 segment of: Displays
is anachronous version of: http://data.ga-group.nl/ics/bics/191010111210
is contemporary version of: http://data.ga-group.nl/ics/bics/1810111210
is replaced by: http://data.ga-group.nl/ics/bics/2020/191010111210
is version of: http://data.ga-group.nl/ics/bics/1810111210
is version of: http://data.ga-group.nl/ics/bics/191010111210
imported on: 2026-06-08T13:03:47.798Z
last refreshed on: 2026-06-08T13:03:47.798Z
source accessed on: 2019-12-03T20:05:01Z
source last accessed on: 2019-12-03T20:05:01Z
label: TV & Monitore @de
label: TV & 모니터 @ko
label: TV e monitor @it
label: TV e monitores @pt
label: TV et moniteurs @fr
label: Televisor y monitores @es
label: Экраны и телевизоры @ru
label: 电视与显示器 @zh
label: 電視/螢幕 @zh-hant
label: ﾃﾚﾋﾞ･ﾓﾆﾀｰ @ja
definition: This segment includes companies that design or manufacture televisions and monitors. Televisions have a built-in tuner and are utilized for home entertainment purposes. Monitors do not have a TV tuner and are primarily utilized for computers.
notation: 1810111210
valid from: 2014-08-08
valid till: 2020-10-03

Other Displays
type: BicsLevel5Segment
type: Classifier
type: NamedIndividual
is level5 segment of: Displays
is anachronous version of: http://data.ga-group.nl/ics/bics/191010111211
is contemporary version of: http://data.ga-group.nl/ics/bics/1810111211
is replaced by: http://data.ga-group.nl/ics/bics/2020/191010111211
is version of: http://data.ga-group.nl/ics/bics/1810111211
is version of: http://data.ga-group.nl/ics/bics/191010111211
imported on: 2026-06-08T13:03:47.798Z
last refreshed on: 2026-06-08T13:03:47.798Z
source accessed on: 2019-12-03T20:05:01Z
source last accessed on: 2019-12-03T20:05:01Z
label: Altri display @it
label: Autres affichages @fr
label: Otras pantallas @es
label: Outras telas @pt
label: Sonstige Displays @de
label: Др. дисплеи @ru
label: その他ﾃﾞｨｽﾌﾟﾚｲ機器 @ja
label: 其他显示器 @zh
label: 其他顯示器 @zh-hant
label: 기타 디스플레이 @ko
definition: This segment includes companies that manufacture displays not elsewhere classified. Includes projectors, LED billboard displays and other electronic advertising displays.
notation: 1810111211
valid from: 2014-08-08
valid till: 2020-10-03

Displays
type: BicsLevel4SubIndustry
type: Classifier
type: NamedIndividual
is sub industry of: Consumer Electronics
is anachronous version of: http://data.ga-group.nl/ics/bics/1910101112
is contemporary version of: http://data.ga-group.nl/ics/bics/18101112
is replaced by: http://data.ga-group.nl/ics/bics/2020/1910101112
is version of: http://data.ga-group.nl/ics/bics/18101112
is version of: http://data.ga-group.nl/ics/bics/1910101112
imported on: 2026-06-08T13:03:47.798Z
last refreshed on: 2026-06-08T13:03:47.798Z
source accessed on: 2019-12-03T20:05:01Z
source last accessed on: 2019-12-03T20:05:01Z
label: Bildschirme @de
label: Ecrans @fr
label: Esposizioni @it
label: Exibições @pt
label: Muestra @es
label: Дисплеи @ru
label: 显示器 @zh
label: 顯示器 @zh-hant
label: 디스플레이 @ko
label: ﾃﾞｨｽﾌﾟﾚｲ @ja
definition: This industry subgroup includes companies that design or manufacture display hardware. Excludes unfinished products used as components for other types of electronics (see Display Components).
notation: 18101112
valid from: 2014-08-08
valid till: 2020-10-03

DVD Devices
type: BicsLevel5Segment
type: Classifier
type: Discontinued
type: NamedIndividual
is level5 segment of: Video Equipment
is contemporary version of: http://data.ga-group.nl/ics/bics/1810111310
is version of: http://data.ga-group.nl/ics/bics/1810111310
imported on: 2026-06-08T13:03:47.798Z
last refreshed on: 2026-06-08T13:03:47.798Z
source accessed on: 2019-12-03T20:05:01Z
source last accessed on: 2019-12-03T20:05:01Z
label: Aparelhos DVD @pt
label: Appareils DVD @fr
label: DVD 기기 @ko
label: DVD-Geräte @de
label: DVD機器 @ja
label: DVD裝置 @zh-hant
label: DVD设备 @zh
label: Dispositivi DVD @it
label: Dispositivos DVD @es
label: Устройства DVD @ru
definition: This segment includes companies that manufacture DVD players, digital video recorders, and wireless devices that transfer video content from the Internet to your television.
notation: 1810111310
valid from: 2014-08-08
valid till: 2020-10-03

Other Video Equipment
type: BicsLevel5Segment
type: Classifier
type: Discontinued
type: NamedIndividual
is level5 segment of: Video Equipment
is contemporary version of: http://data.ga-group.nl/ics/bics/1810111311
is version of: http://data.ga-group.nl/ics/bics/1810111311
imported on: 2026-06-08T13:03:47.798Z
last refreshed on: 2026-06-08T13:03:47.798Z
source accessed on: 2019-12-03T20:05:01Z
source last accessed on: 2019-12-03T20:05:01Z
label: Altre apparrecchiature video @it
label: Autr équip vidéo @fr
label: Otro equipo de video @es
label: Outros equipamentos vídeo @pt
label: Sonstiges Videozubehör @de
label: Прочее видеооборуд. @ru
label: その他映像機器 @ja
label: 其他影像設備 @zh-hant
label: 其他影像设备 @zh
label: 기타비디오장비 @ko
definition: This segment includes companies that manufacture other video equipment not elsewhere classified. Such equipment includes television remote controls, prerecorded DVDs, and other video equipment.
notation: 1810111311
valid from: 2014-08-08
valid till: 2020-10-03

Video Equipment
type: BicsLevel4SubIndustry
type: Classifier
type: NamedIndividual
is sub industry of: Consumer Electronics
is anachronous version of: http://data.ga-group.nl/ics/bics/1910101116
is contemporary version of: http://data.ga-group.nl/ics/bics/18101113
is replaced by: http://data.ga-group.nl/ics/bics/2020/1910101116
is version of: http://data.ga-group.nl/ics/bics/18101113
is version of: http://data.ga-group.nl/ics/bics/1910101116
imported on: 2026-06-08T13:03:47.798Z
last refreshed on: 2026-06-08T13:03:47.798Z
source accessed on: 2019-12-03T20:05:01Z
source last accessed on: 2019-12-03T20:05:01Z
label: Apparecchiature video @it
label: Equipamento de vídeo @pt
label: Equipo video @es
label: Equipt vidéo @fr
label: Videogeräte @de
label: Видеооборудование @ru
label: 影像設備 @zh-hant
label: 视频设备 @zh
label: 비디오장비 @ko
label: ﾋﾞﾃﾞｵ機器 @ja
definition: This industry subgroup includes companies that manufacture consumer video equipment, such as televisions, DVD players and other video equipment.
notation: 18101113
valid from: 2014-08-08
valid till: 2020-10-03

Handheld Consoles
type: BicsLevel5Segment
type: Classifier
type: Discontinued
type: NamedIndividual
is level5 segment of: Video Game Equipment
is contemporary version of: http://data.ga-group.nl/ics/bics/1810111410
is version of: http://data.ga-group.nl/ics/bics/1810111410
imported on: 2026-06-08T13:03:47.798Z
last refreshed on: 2026-06-08T13:03:47.798Z
source accessed on: 2019-12-03T20:05:01Z
source last accessed on: 2019-12-03T20:05:01Z
label: Consolas portátiles @es
label: Console portátil @pt
label: Console portatili @it
label: Consoles portables @fr
label: Handheld-Konsolen @de
label: Карм. видеоигры @ru
label: 掌上型電玩 @zh-hant
label: 掌上游戏机 @zh
label: 携帯ｺﾝｿｰﾙ @ja
label: 휴대 콘솔 @ko
definition: This segment includes companies that manufacture portable, handheld video game consoles.
notation: 1810111410
valid from: 2014-08-08
valid till: 2020-10-03

Video Game Consoles
type: BicsLevel5Segment
type: Classifier
type: Discontinued
type: NamedIndividual
is level5 segment of: Video Game Equipment
is contemporary version of: http://data.ga-group.nl/ics/bics/1810111411
is version of: http://data.ga-group.nl/ics/bics/1810111411
imported on: 2026-06-08T13:03:47.798Z
last refreshed on: 2026-06-08T13:03:47.798Z
source accessed on: 2019-12-03T20:05:01Z
source last accessed on: 2019-12-03T20:05:01Z
label: Consolas juego vid @es
label: Console videogiochi @it
label: Consoles jeux vidéo @fr
label: Fab de consola para jogos de vídeo @pt
label: Videospielkonsolen @de
label: Игровые видео-приставки @ru
label: 电子游戏主机 @zh
label: 電玩遊戲主機 @zh-hant
label: 비디오게임콘솔 @ko
label: ﾋﾞﾃﾞｵｹﾞｰﾑ機 @ja
definition: This segment includes companies that manufacture video game consoles for household use. These consoles are not portable and require peripherals and display hardware to operate.
notation: 1810111411
valid from: 2014-08-08
valid till: 2020-10-03

Other Video Game Equipment
type: BicsLevel5Segment
type: Classifier
type: Discontinued
type: NamedIndividual
is level5 segment of: Video Game Equipment
is contemporary version of: http://data.ga-group.nl/ics/bics/1810111412
is version of: http://data.ga-group.nl/ics/bics/1810111412
imported on: 2026-06-08T13:03:47.798Z
last refreshed on: 2026-06-08T13:03:47.798Z
source accessed on: 2019-12-03T20:05:01Z
source last accessed on: 2019-12-03T20:05:01Z
label: Altre apparecchiature videogiochi @it
label: Autres équipts de jeux vidéo @fr
label: Otro equipo de juegos de video @es
label: Outros equipamentos jogos vídeo @pt
label: Sonstiges Videospielzubehör @de
label: Прочее оборудование для видеоигр @ru
label: その他ﾋﾞﾃﾞｵｹﾞｰﾑ機器 @ja
label: 其他电子游戏设备 @zh
label: 其他電玩遊戲設備 @zh-hant
label: 기타 비디오 게임 장비 @ko
definition: This segment includes companies that manufacture other video game equipment and accessories not elsewhere classified, such as controllers. Excludes the video games themselves (see Video Game Software).
notation: 1810111412
valid from: 2014-08-08
valid till: 2020-10-03

Video Game Equipment
type: BicsLevel4SubIndustry
type: Classifier
type: NamedIndividual
is sub industry of: Consumer Electronics
is anachronous version of: http://data.ga-group.nl/ics/bics/1910101117
is contemporary version of: http://data.ga-group.nl/ics/bics/18101114
is replaced by: http://data.ga-group.nl/ics/bics/2020/1910101117
is version of: http://data.ga-group.nl/ics/bics/18101114
is version of: http://data.ga-group.nl/ics/bics/1910101117
imported on: 2026-06-08T13:03:47.798Z
last refreshed on: 2026-06-08T13:03:47.798Z
source accessed on: 2019-12-03T20:05:01Z
source last accessed on: 2019-12-03T20:05:01Z
label: Apparecchiature videogiochi @it
label: Equipamento jogos vídeo @pt
label: Equipo juegos de video @es
label: Equipt jeu vidéo @fr
label: Videospielzubehör @de
label: Оборудование для видеоигр @ru
label: 电子游戏设备 @zh
label: 電玩遊戲設備 @zh-hant
label: 비디오게임장비 @ko
label: ﾋﾞﾃﾞｵｹﾞｰﾑ機器 @ja
definition: This industry subgroup includes companies that manufacture video game equipment, such as consoles and accessories.
notation: 18101114
valid from: 2014-08-08
valid till: 2020-10-03

CB & Two Way Radios
type: BicsLevel5Segment
type: Classifier
type: Discontinued
type: NamedIndividual
is level5 segment of: Other Wireless Devices
is contemporary version of: http://data.ga-group.nl/ics/bics/1810111510
is version of: http://data.ga-group.nl/ics/bics/1810111510
imported on: 2026-06-08T13:03:47.798Z
last refreshed on: 2026-06-08T13:03:47.798Z
source accessed on: 2019-12-03T20:05:01Z
source last accessed on: 2019-12-03T20:05:01Z
label: CB & 쌍방향 라디오 @ko
label: CB-Radios & Walkie-Talkies @de
label: CB･双方向無線 @ja
label: Rádios CB e walkie talkie @pt
label: Radio CB e walkie talkie @it
label: Radios banda y Walkie Talkies @es
label: Walkie-talkies/radios CB @fr
label: Рации и портат. радиоприемники @ru
label: 民用波段和双向无线电 @zh
label: 民用波段無線通信/對講機 @zh-hant
definition: This segment includes companies that manufacture CB radios, walkie-talkies, and other personal consumer products used for short-distance wireless communication.
notation: 1810111510
valid from: 2014-08-08
valid till: 2020-10-03

GPS Devices
type: BicsLevel5Segment
type: Classifier
type: NamedIndividual
is level5 segment of: Other Wireless Devices
is anachronous version of: http://data.ga-group.nl/ics/bics/1910101113
is contemporary version of: http://data.ga-group.nl/ics/bics/1810111511
is replaced by: http://data.ga-group.nl/ics/bics/2020/1910101113
is version of: http://data.ga-group.nl/ics/bics/1810111511
is version of: http://data.ga-group.nl/ics/bics/1910101113
imported on: 2026-06-08T13:03:47.798Z
last refreshed on: 2026-06-08T13:03:47.798Z
source accessed on: 2019-12-03T20:05:01Z
source last accessed on: 2019-12-03T20:05:01Z
label: Aparelhos GPS @pt
label: Appareils GPS @fr
label: Dispositivi GPS @it
label: Dispositivos GPS @es
label: GPS 장치 @ko
label: GPS-Geräte @de
label: GPS装置 @ja
label: GPS設備 @zh-hant
label: Устройства GPS @ru
definition: This segment includes companies that manufacture portable global positioning system (GPS) devices used in consumer applications, such as in cars or for hiking and traveling.
notation: 1810111511
valid from: 2014-08-08
valid till: 2020-10-03

Other Wireless Devices
type: BicsLevel4SubIndustry
type: Classifier
type: Discontinued
type: NamedIndividual
is sub industry of: Consumer Electronics
is contemporary version of: http://data.ga-group.nl/ics/bics/18101115
is version of: http://data.ga-group.nl/ics/bics/18101115
imported on: 2026-06-08T13:03:47.798Z
last refreshed on: 2026-06-08T13:03:47.798Z
source accessed on: 2019-12-03T20:05:01Z
source last accessed on: 2019-12-03T20:05:01Z
label: Altri dispositivi wireless @it
label: Autres appareils ss fil @fr
label: Otros dispositivos inalámbric @es
label: Outros aparelhos wireless @pt
label: Sonstige drahtlose Geräte @de
label: Проч. беспровод. приборы @ru
label: その他無線装置 @ja
label: 其他无线装置 @zh
label: 其他行動通信裝置 @zh-hant
label: 기타무선장치 @ko
definition: This industry subgroup includes companies that manufacture wireless consumer products not elsewhere classified. Such products include global positioning system (GPS) devices and CB radios.
notation: 18101115
valid from: 2014-08-08
valid till: 2020-10-03

Consumer Electronics
type: BicsLevel3Industry
type: Classifier
type: NamedIndividual
is industry of: Articoli per ferramenta
is anachronous version of: http://data.ga-group.nl/ics/bics/19101011
is contemporary version of: http://data.ga-group.nl/ics/bics/181011
is replaced by: http://data.ga-group.nl/ics/bics/2020/19101011
is version of: http://data.ga-group.nl/ics/bics/181011
is version of: http://data.ga-group.nl/ics/bics/19101011
imported on: 2026-06-08T13:03:47.798Z
last refreshed on: 2026-06-08T13:03:47.798Z
source accessed on: 2019-12-03T20:05:01Z
source last accessed on: 2019-12-03T20:05:01Z
label: Electrónica consumo @es
label: Electro grand public @fr
label: Eletrôn consumo @pt
label: Elettronica al consumo @it
label: Verbraucherelektronik @de
label: Пр-во быт. электр. @ru
label: 消費性電子 @zh-hant
label: 消費者用電子製品 @ja
label: 电子消费品 @zh
label: 소비자 전자제품 @ko
definition: This industry includes companies that design or manufacture consumer electronics. Typically, consumer electronics are used by retail consumers for household use. Includes audio equipment, cameras, video equipment, televisions, monitors, video game consoles and GPS devices. Excludes electronics used for communication purposes (see Communication Equipment). Exclude hardware used in offices (see Office Electronics).
notation: 181011
valid from: 2014-08-08
valid till: 2020-10-03

Comml Printers & Scanners
type: BicsLevel4SubIndustry
type: Classifier
type: NamedIndividual
is sub industry of: Office Electronics
is anachronous version of: http://data.ga-group.nl/ics/bics/191010111510
is contemporary version of: http://data.ga-group.nl/ics/bics/18101210
is replaced by: http://data.ga-group.nl/ics/bics/2020/191010111510
is version of: http://data.ga-group.nl/ics/bics/18101210
is version of: http://data.ga-group.nl/ics/bics/191010111510
imported on: 2026-06-08T13:03:47.798Z
last refreshed on: 2026-06-08T13:03:47.798Z
source accessed on: 2019-12-03T20:05:01Z
source last accessed on: 2019-12-03T20:05:01Z
label: Drucker & Scanner für Gewerbe @de
label: Impresoras y escaneadoras comerciales @es
label: Imprimantes et scanneurs commerciaux @fr
label: Scanners e impressoras comerciais @pt
label: Stampanti e scanner commerciali @it
label: Коммерческие принтеры и сканеры @ru
label: 商業用ﾌﾟﾘﾝﾀｰ @ja
label: 商用印表機及掃描機 @zh-hant
label: 商用打印机和扫描仪 @zh
label: 상업용 프린터 & 스캐너 @ko
definition: This industry subgroup includes companies that design or manufacture commercial printers and scanners.
notation: 18101210
valid from: 2014-08-08
valid till: 2020-10-03

Consumer Printers & Scanners
type: BicsLevel4SubIndustry
type: Classifier
type: Discontinued
type: NamedIndividual
is sub industry of: Office Electronics
is contemporary version of: http://data.ga-group.nl/ics/bics/18101211
is version of: http://data.ga-group.nl/ics/bics/18101211
imported on: 2026-06-08T13:03:47.798Z
last refreshed on: 2026-06-08T13:03:47.798Z
source accessed on: 2019-12-03T20:05:01Z
source last accessed on: 2019-12-03T20:05:01Z
label: Drucker & Scanner für Verbraucher @de
label: Impresoras y escaneadoras de consumo @es
label: Imprimantes et scanneurs personnels @fr
label: Scanners e impressoras do consumidor @pt
label: Stampanti e scanner al consumo @it
label: Потребительские принтеры и сканеры @ru
label: 民生用ﾌﾟﾘﾝﾀｰ･ｽｷ���ﾅｰ @ja
label: 民用打印机和扫描仪 @zh
label: 消費性印表機及掃描機 @zh-hant
label: 소비자용 프린터 & 스캐너 @ko
definition: This industry subgroup includes companies that design or manufacture consumer printers and scanners.
notation: 18101211
valid from: 2014-08-08
valid till: 2020-10-03

Photocopying Systems
type: BicsLevel4SubIndustry
type: Classifier
type: Discontinued
type: NamedIndividual
is sub industry of: Office Electronics
is contemporary version of: http://data.ga-group.nl/ics/bics/18101212
is version of: http://data.ga-group.nl/ics/bics/18101212
imported on: 2026-06-08T13:03:47.798Z
last refreshed on: 2026-06-08T13:03:47.798Z
source accessed on: 2019-12-03T20:05:01Z
source last accessed on: 2019-12-03T20:05:01Z
label: Fotokopiersysteme @de
label: Mножит. аппараты @ru
label: Sist fotocopiatrici @it
label: Sistemas de fotocópias @pt
label: Sistemas fotocopiado @es
label: Syst photocopie @fr
label: 商业影印设备 @zh
label: 商業影印系統 @zh-hant
label: 복사기시스템 @ko
label: ｺﾋﾟｰｼｽﾃﾑ @ja
definition: This industry subgroup includes companies that design or manufacture photocopying systems.
notation: 18101212
valid from: 2014-08-08
valid till: 2020-10-03

Office Electronics Supplies
type: BicsLevel4SubIndustry
type: Classifier
type: NamedIndividual
is sub industry of: Office Electronics
is anachronous version of: http://data.ga-group.nl/ics/bics/191010111511
is contemporary version of: http://data.ga-group.nl/ics/bics/18101213
is replaced by: http://data.ga-group.nl/ics/bics/2020/191010111511
is version of: http://data.ga-group.nl/ics/bics/18101213
is version of: http://data.ga-group.nl/ics/bics/191010111511
imported on: 2026-06-08T13:03:47.798Z
last refreshed on: 2026-06-08T13:03:47.798Z
source accessed on: 2019-12-03T20:05:01Z
source last accessed on: 2019-12-03T20:05:01Z
label: Büroelektronikbedarf @de
label: Forniture elettroniche ufficio @it
label: Fournitures électroniques de bureau @fr
label: Suministros electrónicos de oficina @es
label: Suprimentos eletrônicos para escritório @pt
label: Поставщики офисной электроники @ru
label: 事務用電子機器供給 @ja
label: 办公电子设备用品 @zh
label: 辦公室電子設備用品 @zh-hant
label: 사무용 전자 소모품 @ko
definition: This industry subgroup includes companies that design or manufacture printing and imaging supplies, as well as other equipment not elsewhere classified.
notation: 18101213
valid from: 2014-08-08
valid till: 2020-10-03

Other Office Electronics
type: BicsLevel4SubIndustry
type: Classifier
type: Discontinued
type: NamedIndividual
is sub industry of: Office Electronics
is contemporary version of: http://data.ga-group.nl/ics/bics/18101214
is version of: http://data.ga-group.nl/ics/bics/18101214
imported on: 2026-06-08T13:03:47.798Z
last refreshed on: 2026-06-08T13:03:47.798Z
source accessed on: 2019-12-03T20:05:01Z
source last accessed on: 2019-12-03T20:05:01Z
label: Altra elettronica ufficio @it
label: Autre électronique de bureau @fr
label: Otros disp elec de oficina @es
label: Outros eletrônicos p/ escritório @pt
label: Sonst. elektr. Bürogeräte @de
label: Проч. электр. офисное оборуд. @ru
label: その他事務用電子機器 @ja
label: 其他办公电子产品 @zh
label: 其他辦公室電子設備 @zh-hant
label: 기타 사무용 전자제품 @ko
definition: This industry subgroup includes companies that design or manufacture office electronics not elsewhere classified.
notation: 18101214
valid from: 2014-08-08
valid till: 2020-10-03

Office Electronics
type: BicsLevel3Industry
type: Classifier
type: NamedIndividual
is industry of: Articoli per ferramenta
is anachronous version of: http://data.ga-group.nl/ics/bics/1910101115
is contemporary version of: http://data.ga-group.nl/ics/bics/181012
is replaced by: http://data.ga-group.nl/ics/bics/2020/1910101115
is version of: http://data.ga-group.nl/ics/bics/181012
is version of: http://data.ga-group.nl/ics/bics/1910101115
imported on: 2026-06-08T13:03:47.798Z
last refreshed on: 2026-06-08T13:03:47.798Z
source accessed on: 2019-12-03T20:05:01Z
source last accessed on: 2019-12-03T20:05:01Z
label: Büroelektronik @de
label: Electrónicos de oficina @es
label: Electronique de bureau @fr
label: Eletrônicos para escritório @pt
label: Prodotti elettronici per ufficio @it
label: Офисная электроника @ru
label: 事務用電子機器 @ja
label: 办公电子设备 @zh
label: 辦公室電子設備 @zh-hant
label: 사무용 전자제품 @ko
definition: This industry includes companies that design or manufacture electronic hardware used for office-related purposes. Includes printers, scanners, photocopiers and supplies for these electronics.
notation: 181012
valid from: 2014-08-08
valid till: 2020-10-03

Desktop Computers
type: BicsLevel5Segment
type: Classifier
type: NamedIndividual
is level5 segment of: Personal Computers
is anachronous version of: http://data.ga-group.nl/ics/bics/191010121010
is contemporary version of: http://data.ga-group.nl/ics/bics/1810131010
is replaced by: http://data.ga-group.nl/ics/bics/2020/191010121010
is version of: http://data.ga-group.nl/ics/bics/1810131010
is version of: http://data.ga-group.nl/ics/bics/191010121010
imported on: 2026-06-08T13:03:47.798Z
last refreshed on: 2026-06-08T13:03:47.798Z
source accessed on: 2019-12-03T20:05:01Z
source last accessed on: 2019-12-03T20:05:01Z
label: Computadores de mesa @pt
label: Computer fissi @it
label: Desktop, Computer @de
label: Ordenadores @es
label: Ordinateurs de bureaux @fr
label: Настольные компьютеры @ru
label: 台式电脑 @zh
label: 桌上型電腦 @zh-hant
label: 데스크탑 컴퓨터 @ko
label: ﾃﾞｽｸﾄｯﾌﾟ型ｺﾝﾋﾟｭｰﾀｰ @ja
definition: This segment includes companies that design or manufacture desktop computers.
notation: 1810131010
valid from: 2014-08-08
valid till: 2020-10-03

Handheld Computers
type: BicsLevel5Segment
type: Classifier
type: NamedIndividual
is level5 segment of: Personal Computers
is anachronous version of: http://data.ga-group.nl/ics/bics/191010121011
is contemporary version of: http://data.ga-group.nl/ics/bics/1810131011
is replaced by: http://data.ga-group.nl/ics/bics/2020/191010121011
is version of: http://data.ga-group.nl/ics/bics/1810131011
is version of: http://data.ga-group.nl/ics/bics/191010121011
imported on: 2026-06-08T13:03:47.798Z
last refreshed on: 2026-06-08T13:03:47.798Z
source accessed on: 2019-12-03T20:05:01Z
source last accessed on: 2019-12-03T20:05:01Z
label: Computadores portáteis @pt
label: Handheld-Computer @de
label: Ordenadores manuales @es
label: Ordinateur de poche @fr
label: Prod comp palmari @it
label: Портативные компьютеры @ru
label: 掌上型電腦 @zh-hant
label: 掌上电脑制造 @zh
label: 휴대용컴퓨터제조업 @ko
label: ﾊﾝﾄﾞﾍﾙﾄﾞｺﾝﾋﾟｭｰﾀｰ @ja
definition: This segment includes companies that design or manufacture handheld computers. Such computers include tablet computers, nano personal computers, and other handheld computing devices.
notation: 1810131011
valid from: 2014-08-08
valid till: 2020-10-03

Notebook Computers
type: BicsLevel5Segment
type: Classifier
type: NamedIndividual
is level5 segment of: Personal Computers
is anachronous version of: http://data.ga-group.nl/ics/bics/191010121012
is contemporary version of: http://data.ga-group.nl/ics/bics/1810131012
is replaced by: http://data.ga-group.nl/ics/bics/2020/191010121012
is version of: http://data.ga-group.nl/ics/bics/1810131012
is version of: http://data.ga-group.nl/ics/bics/191010121012
imported on: 2026-06-08T13:03:47.798Z
last refreshed on: 2026-06-08T13:03:47.798Z
source accessed on: 2019-12-03T20:05:01Z
source last accessed on: 2019-12-03T20:05:01Z
label: Computadores Notebook @pt
label: Computer portatili @it
label: Notebook, Computer @de
label: Ordenadores portátiles @es
label: Ordinateurs portables @fr
label: Портативные компьютеры @ru
label: 笔记本电脑 @zh
label: 筆記型電腦 @zh-hant
label: 노트북 컴퓨터 @ko
label: ﾉｰﾄﾌﾞｯｸ型ｺﾝﾋﾟｭｰﾀｰ @ja
definition: This segment includes companies that design or manufacture computer notebooks.
notation: 1810131012
valid from: 2014-08-08
valid till: 2020-10-03

Estações de trabalho
type: BicsLevel5Segment
type: Classifier
type: NamedIndividual
is level5 segment of: Personal Computers
is anachronous version of: http://data.ga-group.nl/ics/bics/191010121013
is contemporary version of: http://data.ga-group.nl/ics/bics/1810131013
is replaced by: http://data.ga-group.nl/ics/bics/2020/191010121013
is version of: http://data.ga-group.nl/ics/bics/1810131013
is version of: http://data.ga-group.nl/ics/bics/191010121013
imported on: 2026-06-08T13:03:47.798Z
last refreshed on: 2026-06-08T13:03:47.798Z
source accessed on: 2019-12-03T20:05:01Z
source last accessed on: 2019-12-03T20:05:01Z
label: Estaciones de trabajo @es
label: Postes de travail @fr
label: Workstation @it
label: Workstations
label: Настольные компьютеры @ru
label: 工作站 @zh
label: 워크스테이션 @ko
label: ﾜｰｸｽﾃｰｼｮﾝ @ja
definition: This segment includes companies that design or manufacture workstations. Workstations are commercial computers that typically offer greater performance than traditional personal computers and are often specialized to operate specific resource-demanding application software (AutoCAD, 3D Studio Max, etc).
notation: 1810131013
valid from: 2014-08-08
valid till: 2020-10-03

Personal Computers
type: BicsLevel4SubIndustry
type: Classifier
type: NamedIndividual
is sub industry of: Computer Hardware & Storage
is anachronous version of: http://data.ga-group.nl/ics/bics/1910101210
is contemporary version of: http://data.ga-group.nl/ics/bics/18101310
is replaced by: http://data.ga-group.nl/ics/bics/2020/1910101210
is version of: http://data.ga-group.nl/ics/bics/18101310
is version of: http://data.ga-group.nl/ics/bics/1910101210
imported on: 2026-06-08T13:03:47.798Z
last refreshed on: 2026-06-08T13:03:47.798Z
source accessed on: 2019-12-03T20:05:01Z
source last accessed on: 2019-12-03T20:05:01Z
label: Computadores pessoais @pt
label: Ordenadores personales @es
label: Ordinateurs personnels @fr
label: PC @de
label: Personal Computer @it
label: Персональные компьютеры @ru
label: 个人电脑 @zh
label: 個人電腦 @zh-hant
label: 개인용 컴퓨터 @ko
label: ﾊﾟｰｿﾅﾙｺﾝﾋﾟｭｰﾀｰ @ja
definition: This industry subgroup includes companies that design or manufacture personal computers. Personal computers include desktop computers, notebooks, workstations and handheld devices.
notation: 18101310
valid from: 2014-08-08
valid till: 2020-10-03

Hard Disk Drives
type: BicsLevel5Segment
type: Classifier
type: NamedIndividual
is level5 segment of: Computer Storage
is anachronous version of: http://data.ga-group.nl/ics/bics/191010121110
is contemporary version of: http://data.ga-group.nl/ics/bics/1810131110
is replaced by: http://data.ga-group.nl/ics/bics/2020/191010121110
is version of: http://data.ga-group.nl/ics/bics/1810131110
is version of: http://data.ga-group.nl/ics/bics/191010121110
imported on: 2026-06-08T13:03:47.798Z
last refreshed on: 2026-06-08T13:03:47.798Z
source accessed on: 2019-12-03T20:05:01Z
source last accessed on: 2019-12-03T20:05:01Z
label: Disques durs @fr
label: Festplattenlaufwerke @de
label: Hard Disk Drive @it
label: Unidades de disco duro @es
label: Unidades de discos rígidos @pt
label: Жесткие диски @ru
label: 硬盘驱动器 @zh
label: 硬碟機 @zh-hant
label: 하드디스크 드라이브 @ko
label: ﾊｰﾄﾞﾃﾞｨｽｸﾄﾞﾗｲﾌﾞ @ja
definition: This segment includes companies that design or manufacture computer hard drives and portable hard drives.
notation: 1810131110
valid from: 2014-08-08
valid till: 2020-10-03

Solid State Drives
type: BicsLevel5Segment
type: Classifier
type: NamedIndividual
is level5 segment of: Computer Storage
is anachronous version of: http://data.ga-group.nl/ics/bics/191010121111
is contemporary version of: http://data.ga-group.nl/ics/bics/1810131111
is replaced by: http://data.ga-group.nl/ics/bics/2020/191010121111
is version of: http://data.ga-group.nl/ics/bics/1810131111
is version of: http://data.ga-group.nl/ics/bics/191010121111
imported on: 2026-06-08T13:03:47.798Z
last refreshed on: 2026-06-08T13:03:47.798Z
source accessed on: 2019-12-03T20:05:01Z
source last accessed on: 2019-12-03T20:05:01Z
label: Dispositivos de estado sólido @es
label: Drive stato solido @it
label: Drives estado sólido @pt
label: Solid-State-Laufwerke @de
label: Твердот. накопитель @ru
label: 固态硬盘驱动器 @zh
label: 固態硬碟 @zh-hant
label: 솔리드 스테이트 드라이브 @ko
label: ｿﾘｯﾄﾞｽﾃｰﾄﾄﾞﾗｲﾌﾞ @ja
definition: This segment includes companies that design or manufacture solid-state disk drives (SSDs). Excludes companies that design or manufacture the underlying memory IC chips (see Memory ICs).
notation: 1810131111
valid from: 2014-08-08
valid till: 2020-10-03

Network Storage & Fabric
type: BicsLevel5Segment
type: Classifier
type: NamedIndividual
is level5 segment of: Computer Storage
is anachronous version of: http://data.ga-group.nl/ics/bics/191010121112
is contemporary version of: http://data.ga-group.nl/ics/bics/1810131112
is replaced by: http://data.ga-group.nl/ics/bics/2020/191010121112
is version of: http://data.ga-group.nl/ics/bics/1810131112
is version of: http://data.ga-group.nl/ics/bics/191010121112
imported on: 2026-06-08T13:03:47.798Z
last refreshed on: 2026-06-08T13:03:47.798Z
source accessed on: 2019-12-03T20:05:01Z
source last accessed on: 2019-12-03T20:05:01Z
label: Almacenamiento y material de red @es
label: Armazenagem de rede e tecidos @pt
label: Memoriz network e fabric @it
label: Network Storage et Fabric @fr
label: Netzwerkspeicher & Gewebe @de
label: Сетевое хранение и шифрование данных @ru
label: 網路儲存及光纖 @zh-hant
label: 网络存储与网络结构 @zh
label: 네트워크 스토리지 & 패브릭 @ko
label: ﾈｯﾄﾜｰｸ･ｽﾄﾚｰｼﾞ&素材 @ja
definition: This segment includes companies that design or manufacture network or server-based storage devices.
notation: 1810131112
valid from: 2014-08-08
valid till: 2020-10-03

Other Storage
type: BicsLevel5Segment
type: Classifier
type: Discontinued
type: NamedIndividual
is level5 segment of: Computer Storage
is contemporary version of: http://data.ga-group.nl/ics/bics/1810131113
is version of: http://data.ga-group.nl/ics/bics/1810131113
imported on: 2026-06-08T13:03:47.798Z
last refreshed on: 2026-06-08T13:03:47.798Z
source accessed on: 2019-12-03T20:05:01Z
source last accessed on: 2019-12-03T20:05:01Z
label: Altra memorizzazione @it
label: Autres stockages @fr
label: Otro almacenamiento @es
label: Outro tipo de armazenamento @pt
label: Sonstiger Speicher @de
label: Другие виды устройств для хранения данных @ru
label: その他ｽﾄﾚｰｼﾞ @ja
label: 其他儲存 @zh-hant
label: 其他存储 @zh
label: 기타 저장공간 @ko
definition: This segment includes companies that design or manufacture storage devices not elsewhere classified.
notation: 1810131113
valid from: 2014-08-08
valid till: 2020-10-03

Hard Drive Components
type: BicsLevel5Segment
type: Classifier
type: NamedIndividual
is level5 segment of: Computer Storage
is anachronous version of: http://data.ga-group.nl/ics/bics/191010121113
is contemporary version of: http://data.ga-group.nl/ics/bics/1810131114
is replaced by: http://data.ga-group.nl/ics/bics/2020/191010121113
is version of: http://data.ga-group.nl/ics/bics/1810131114
is version of: http://data.ga-group.nl/ics/bics/191010121113
imported on: 2026-06-08T13:03:47.798Z
last refreshed on: 2026-06-08T13:03:47.798Z
source accessed on: 2019-12-03T20:05:01Z
source last accessed on: 2019-12-03T20:05:01Z
label: Componentes de dico duro @es
label: Componentes de discos rígidos @pt
label: Componenti Hard Drive @it
label: Composants de disques durs @fr
label: Festplattenkomponente @de
label: Компоненты жесткого диска @ru
label: 硬盘驱动器组件 @zh
label: 硬碟組件 @zh-hant
label: 하드디스크 드라이브 부품 @ko
label: ﾊｰﾄﾞﾄﾞﾗｲﾌﾞ部品 @ja
definition: This segment includes companies that design or manufacture internal components specifically for use in computer hard drives. Includes spindle heads, magnetic readers, and disk balancing mechanisms. Excludes companies that design or manufacture the underlying memory IC chips (see Memory ICs).
notation: 1810131114
valid from: 2014-08-08
valid till: 2020-10-03

Computer Storage
type: BicsLevel4SubIndustry
type: Classifier
type: NamedIndividual
is sub industry of: Computer Hardware & Storage
is anachronous version of: http://data.ga-group.nl/ics/bics/1910101211
is contemporary version of: http://data.ga-group.nl/ics/bics/18101311
is replaced by: http://data.ga-group.nl/ics/bics/2020/1910101211
is version of: http://data.ga-group.nl/ics/bics/18101311
is version of: http://data.ga-group.nl/ics/bics/1910101211
imported on: 2026-06-08T13:03:47.798Z
last refreshed on: 2026-06-08T13:03:47.798Z
source accessed on: 2019-12-03T20:05:01Z
source last accessed on: 2019-12-03T20:05:01Z
label: Almac eq de cómputo @es
label: Archiviaz computer @it
label: Armazg computador @pt
label: Computer-Speicher @de
label: Mémoire ordi @fr
label: Запомин. устройства @ru
label: 计算机存储 @zh
label: 電腦資料儲存 @zh-hant
label: 컴퓨터 저장장치 @ko
label: ｺﾝﾋﾟｭｰﾀｰ記憶装置 @ja
definition: This industry subgroup includes companies that design or manufacture computer storage devices. Includes hard drives, server-based storage, and flash drives.
notation: 18101311
valid from: 2014-08-08
valid till: 2020-10-03

Servers
type: BicsLevel4SubIndustry
type: Classifier
type: NamedIndividual
is sub industry of: Computer Hardware & Storage
is anachronous version of: http://data.ga-group.nl/ics/bics/1910101212
is contemporary version of: http://data.ga-group.nl/ics/bics/18101312
is replaced by: http://data.ga-group.nl/ics/bics/2020/1910101212
is version of: http://data.ga-group.nl/ics/bics/18101312
is version of: http://data.ga-group.nl/ics/bics/1910101212
imported on: 2026-06-08T13:03:47.798Z
last refreshed on: 2026-06-08T13:03:47.798Z
source accessed on: 2019-12-03T20:05:01Z
source last accessed on: 2019-12-03T20:05:01Z
label: Server @de
label: Serveurs @fr
label: Servidores @es
label: Серв��ры @ru
label: 伺服器 @zh-hant
label: 服务器 @zh
label: 서버 @ko
label: ｻｰﾊﾞｰ @ja
definition: This industry subgroup includes companies that design or manufacture computer servers.
notation: 18101312
valid from: 2014-08-08
valid till: 2020-10-03

Supercomputers
type: BicsLevel4SubIndustry
type: Classifier
type: NamedIndividual
is sub industry of: Computer Hardware & Storage
is anachronous version of: http://data.ga-group.nl/ics/bics/1910101213
is contemporary version of: http://data.ga-group.nl/ics/bics/18101313
is replaced by: http://data.ga-group.nl/ics/bics/2020/1910101213
is version of: http://data.ga-group.nl/ics/bics/18101313
is version of: http://data.ga-group.nl/ics/bics/1910101213
imported on: 2026-06-08T13:03:47.798Z
last refreshed on: 2026-06-08T13:03:47.798Z
source accessed on: 2019-12-03T20:05:01Z
source last accessed on: 2019-12-03T20:05:01Z
label: Super-ordinateurs @fr
label: Supercomputadores @pt
label: Supercomputer @de
label: Superordenadores @es
label: Суперкомпьютеры @ru
label: 超級電腦 @zh-hant
label: 高性能电脑/超级电脑 @zh
label: 수퍼컴퓨터 @ko
label: ｽｰﾊﾟｰｺﾝﾋﾟｭｰﾀｰ @ja
definition: This industry subgroup includes companies that manufacture high-performance and super computers.
notation: 18101313
valid from: 2014-08-08
valid till: 2020-10-03

Computer Hardware & Storage
type: BicsLevel3Industry
type: Classifier
type: NamedIndividual
is industry of: Articoli per ferramenta
is anachronous version of: http://data.ga-group.nl/ics/bics/19101012
is contemporary version of: http://data.ga-group.nl/ics/bics/181013
is replaced by: http://data.ga-group.nl/ics/bics/2020/19101012
is version of: http://data.ga-group.nl/ics/bics/181013
is version of: http://data.ga-group.nl/ics/bics/19101012
imported on: 2026-06-08T13:03:47.798Z
last refreshed on: 2026-06-08T13:03:47.798Z
source accessed on: 2019-12-03T20:05:01Z
source last accessed on: 2019-12-03T20:05:01Z
label: Computer Hardware @it
label: Computer-Hardware & Speicher @de
label: Hardware de ordenador @es
label: Hardware-Informát @pt
label: Matériel inform et stockage @fr
label: Компьют. аппаратура @ru
label: 电脑硬件 @zh
label: 電腦硬體 @zh-hant
label: 컴퓨터 하드웨어 @ko
label: ｺﾝﾋﾟｭｰﾀﾊｰﾄﾞｳｴｱ･ｽﾄﾚｰｼﾞ @ja
definition: This industry includes companies that design or manufacture computer systems as well as data storage devices. Computer systems include desktops, laptops, tablets, work stations, servers and supercomputers. Storage devices include hard disk drives, solid disk drives and other storage devices.
notation: 181013
valid from: 2014-08-08
valid till: 2020-10-03

ATM
type: BicsLevel4SubIndustry
type: Classifier
type: NamedIndividual
is sub industry of: Transaction Mgmt Systems
is anachronous version of: http://data.ga-group.nl/ics/bics/191010131410
is contemporary version of: http://data.ga-group.nl/ics/bics/18101410
is replaced by: http://data.ga-group.nl/ics/bics/2020/191010131410
is version of: http://data.ga-group.nl/ics/bics/18101410
is version of: http://data.ga-group.nl/ics/bics/191010131410
imported on: 2026-06-08T13:03:47.798Z
last refreshed on: 2026-06-08T13:03:47.798Z
source accessed on: 2019-12-03T20:05:01Z
source last accessed on: 2019-12-03T20:05:01Z
label: BANCOMAT @it
label: Guichet automatique @fr
label: 提款機 @zh-hant
label: 自动柜员机 @zh
definition: This industry subgroup includes companies that design or manufacture automated teller machines (ATMs).
notation: 18101410
valid from: 2014-08-08
valid till: 2020-10-03

POS Terminals
type: BicsLevel4SubIndustry
type: Classifier
type: NamedIndividual
is sub industry of: Transaction Mgmt Systems
is anachronous version of: http://data.ga-group.nl/ics/bics/191010131411
is contemporary version of: http://data.ga-group.nl/ics/bics/18101411
is replaced by: http://data.ga-group.nl/ics/bics/2020/191010131411
is version of: http://data.ga-group.nl/ics/bics/18101411
is version of: http://data.ga-group.nl/ics/bics/191010131411
imported on: 2026-06-08T13:03:47.798Z
last refreshed on: 2026-06-08T13:03:47.798Z
source accessed on: 2019-12-03T20:05:01Z
source last accessed on: 2019-12-03T20:05:01Z
label: Kassenterminals @de
label: POS 터미널 @ko
label: POS端末 @ja
label: Terminais POS @pt
label: Terminal point vente @fr
label: Terminales ptos vta @es
label: Terminali di vendita @it
label: Терминалы POS @ru
label: 銷售點終端機 @zh-hant
label: 销售点终端 @zh
definition: This industry subgroup includes companies that manufacture point-of-sale (POS) terminals. POS terminals help automate and track various transaction financial transactions typically done at checkout counters. Includes electronic cash registers, self-checkout kiosks and credit card readers.
notation: 18101411
valid from: 2014-08-08
valid till: 2020-10-03

Other Transaction Mgmt Sys
type: BicsLevel4SubIndustry
type: Classifier
type: Discontinued
type: NamedIndividual
is sub industry of: Transaction Mgmt Systems
is contemporary version of: http://data.ga-group.nl/ics/bics/18101412
is version of: http://data.ga-group.nl/ics/bics/18101412
imported on: 2026-06-08T13:03:47.798Z
last refreshed on: 2026-06-08T13:03:47.798Z
source accessed on: 2019-12-03T20:05:01Z
source last accessed on: 2019-12-03T20:05:01Z
label: Autres syst de gestion de transac @fr
label: Otros sistema de gestión de transacción @es
label: Outros sist gest transação @pt
label: Sis gest altre transazioni @it
label: Sonst. Transaktionsmanagementsyst. @de
label: Прочие системы управления транзакциями @ru
label: その他決済管理ｼｽﾃﾑ @ja
label: 其他交易管理系統 @zh-hant
label: 其他交易管理系统 @zh
label: 기타 거래관리시스템 @ko
definition: This industry subgroup includes companies that manufacture transaction management systems not elsewhere classified. Includes systems that track/process inventory transaction, process hotel room bookings, as well as other non-financial transactions.
notation: 18101412
valid from: 2014-08-08
valid till: 2020-10-03

Transaction Mgmt Systems
type: BicsLevel3Industry
type: Classifier
type: NamedIndividual
is industry of: Articoli per ferramenta
is anachronous version of: http://data.ga-group.nl/ics/bics/1910101314
is contemporary version of: http://data.ga-group.nl/ics/bics/181014
is replaced by: http://data.ga-group.nl/ics/bics/2020/1910101314
is version of: http://data.ga-group.nl/ics/bics/181014
is version of: http://data.ga-group.nl/ics/bics/1910101314
imported on: 2026-06-08T13:03:47.798Z
last refreshed on: 2026-06-08T13:03:47.798Z
source accessed on: 2019-12-03T20:05:01Z
source last accessed on: 2019-12-03T20:05:01Z
label: Sist gestión transac @es
label: Sist grcto transaç @pt
label: Sistemi gestione transazioni @it
label: Syst gestion de transac @fr
label: Transaktions-Mgmt-Systeme @de
label: Систе��ы управл. транз. @ru
label: 交易管理系統 @zh-hant
label: 交易管理系统 @zh
label: 決済管理ｼｽﾃﾑ @ja
label: 거래관리시스템 @ko
definition: This industry includes companies that design or manufacture transaction management systems. Transaction management systems are systems that assist in the processing, automation and monitoring of various financial and non-financial transactions. Includes ATMs, self-service kiosks, point-of-sale terminals and credit card readers.
notation: 181014
valid from: 2014-08-08
valid till: 2020-10-03

3D Printers
type: BicsLevel4SubIndustry
type: Classifier
type: NamedIndividual
is sub industry of: Other Hardware
is anachronous version of: http://data.ga-group.nl/ics/bics/1910101310
is contemporary version of: http://data.ga-group.nl/ics/bics/18101510
is replaced by: http://data.ga-group.nl/ics/bics/2020/1910101310
is version of: http://data.ga-group.nl/ics/bics/18101510
is version of: http://data.ga-group.nl/ics/bics/1910101310
imported on: 2026-06-08T13:03:47.798Z
last refreshed on: 2026-06-08T13:03:47.798Z
source accessed on: 2019-12-03T20:05:01Z
source last accessed on: 2019-12-03T20:05:01Z
label: 3D 프린터 @ko
label: 3D-Drucker @de
label: 3D印刷機 @ja
label: 3D印表機 @zh-hant
label: 3D打印机 @zh
label: Impresoras 3D @es
label: Impress 3D @pt
label: Imprimantes 3D @fr
label: Stampanti 3D @it
label: Принтеры 3D @ru
definition: This industry subgroup includes companies that design or manufacture 3D printers.
notation: 18101510
valid from: 2014-08-08
valid till: 2020-10-03

Biometric & ID Systems
type: BicsLevel4SubIndustry
type: Classifier
type: NamedIndividual
is sub industry of: Other Hardware
is anachronous version of: http://data.ga-group.nl/ics/bics/1910101311
is contemporary version of: http://data.ga-group.nl/ics/bics/18101511
is replaced by: http://data.ga-group.nl/ics/bics/2020/1910101311
is version of: http://data.ga-group.nl/ics/bics/18101511
is version of: http://data.ga-group.nl/ics/bics/1910101311
imported on: 2026-06-08T13:03:47.798Z
last refreshed on: 2026-06-08T13:03:47.798Z
source accessed on: 2019-12-03T20:05:01Z
source last accessed on: 2019-12-03T20:05:01Z
label: Biometrische Identifikationssysteme @de
label: Sistemas biométricos/de identificación @es
label: Sistemas de identificação/biométrico @pt
label: Sistemi identificazione/biometrici @it
label: Syst d'id et biométriques @fr
label: Биометрические/идентификационные системы @ru
label: 生物识别/辨识系统 @zh
label: 生物辨識/ID系統 @zh-hant
label: 생체인식&ID 시스템 @ko
label: ﾊﾞｲｵﾒﾄﾘｯｸ･識別ｼｽﾃﾑ @ja
definition: This industry subgroup includes companies that manufacture biometric and other identification systems.
notation: 18101511
valid from: 2014-08-08
valid till: 2020-10-03

Keyboards, Mice & Other Devices
type: BicsLevel4SubIndustry
type: Classifier
type: NamedIndividual
is sub industry of: Other Hardware
is anachronous version of: http://data.ga-group.nl/ics/bics/1910101114
is contemporary version of: http://data.ga-group.nl/ics/bics/18101512
is replaced by: http://data.ga-group.nl/ics/bics/2020/1910101114
is version of: http://data.ga-group.nl/ics/bics/18101512
is version of: http://data.ga-group.nl/ics/bics/1910101114
imported on: 2026-06-08T13:03:47.798Z
last refreshed on: 2026-06-08T13:03:47.798Z
source accessed on: 2019-12-03T20:05:01Z
source last accessed on: 2019-12-03T20:05:01Z
label: Claviers, souris et autres appareils @fr
label: Tastatur, Mäuse & sonstige Geräte @de
label: Tastiere, mouse e altri dispositivi @it
label: Teclado, mouse e outros dispositivos @pt
label: Teclados, ratones y otros dispositivos @es
label: Клавиатура, компьютерная мышь и пр. устройства @ru
label: 鍵盤/滑鼠/其他裝置 @zh-hant
label: 键盘、鼠标及其他装置 @zh
label: 키보드, 마우스 & 기타 기기 @ko
label: ｷｰﾎﾞｰﾄﾞ･ﾏｳｽ･その他装置 @ja
definition: This industry subgroup includes companies that design or manufacture keyboards, mice and other input/output computer devices.
notation: 18101512
valid from: 2014-08-08
valid till: 2020-10-03

Optical Instruments & Lens
type: BicsLevel4SubIndustry
type: Classifier
type: NamedIndividual
is sub industry of: Other Hardware
is anachronous version of: http://data.ga-group.nl/ics/bics/1910101312
is contemporary version of: http://data.ga-group.nl/ics/bics/18101513
is replaced by: http://data.ga-group.nl/ics/bics/2020/1910101312
is version of: http://data.ga-group.nl/ics/bics/18101513
is version of: http://data.ga-group.nl/ics/bics/1910101312
imported on: 2026-06-08T13:03:47.798Z
last refreshed on: 2026-06-08T13:03:47.798Z
source accessed on: 2019-12-03T20:05:01Z
source last accessed on: 2019-12-03T20:05:01Z
label: Instrumento óticos e lentes @pt
label: Instrumentos ópticos y lentes @es
label: Instruments d'optique et verres @fr
label: Optische Instrumente & Linsen @de
label: Strumenti e lenti ottiche @it
label: Оптические инструменты и линзы @ru
label: 光学仪器��镜头 @zh
label: 光学機器･光学ﾚﾝｽﾞ製造 @ja
label: 光學儀器及鏡片 @zh-hant
label: 광학장비 & 렌즈 @ko
definition: This industry subgroup includes companies that manufacture lenses (except ophthalmic lenses) and optical instruments. Products include telescopes, binoculars, microscopes, gun sights, prisms, night vision equipment, thermal imaging equipment, and crystals.
notation: 18101513
valid from: 2014-08-08
valid till: 2020-10-03

Surveil & Traffic Mgmt Systems
type: BicsLevel4SubIndustry
type: Classifier
type: NamedIndividual
is sub industry of: Other Hardware
is anachronous version of: http://data.ga-group.nl/ics/bics/1910101313
is contemporary version of: http://data.ga-group.nl/ics/bics/18101514
is replaced by: http://data.ga-group.nl/ics/bics/2020/1910101313
is version of: http://data.ga-group.nl/ics/bics/18101514
is version of: http://data.ga-group.nl/ics/bics/1910101313
imported on: 2026-06-08T13:03:47.798Z
last refreshed on: 2026-06-08T13:03:47.798Z
source accessed on: 2019-12-03T20:05:01Z
source last accessed on: 2019-12-03T20:05:01Z
label: Sistemas de gestão tráfico e vigilância @pt
label: Sistemas de vigilancia y regulación del tráfico @es
label: Sistemi gest traffico e sorveglianza @it
label: Syst surveillance/gestion du trafic @fr
label: Überwachungs-/Verkehrleitungssysteme @de
label: Системы наблюдения/управл. дор. движ. @ru
label: 监视与交通管理系统 @zh
label: 監視/交通管理系統 @zh-hant
label: 監視･交通管理ｼｽﾃﾑ @ja
label: 감시&교통관리시스템 @ko
definition: This industry subgroup includes companies that design or manufacture surveillance or traffic management systems.
notation: 18101514
valid from: 2014-08-08
valid till: 2020-10-03

Other Miscellaneous Hardware
type: BicsLevel4SubIndustry
type: Classifier
type: Discontinued
type: NamedIndividual
is sub industry of: Other Hardware
is contemporary version of: http://data.ga-group.nl/ics/bics/18101515
is version of: http://data.ga-group.nl/ics/bics/18101515
imported on: 2026-06-08T13:03:47.798Z
last refreshed on: 2026-06-08T13:03:47.798Z
source accessed on: 2019-12-03T20:05:01Z
source last accessed on: 2019-12-03T20:05:01Z
label: Altri Hardware vari @it
label: Autre matériel divers @fr
label: Otro Hardware varios @es
label: Outros diversos hardware @pt
label: Sonstige Verschiedene Hardware @de
label: Проч. разл. металлоизделия @ru
label: その他ﾊｰﾄﾞｳｴｱ @ja
label: 其他杂项 硬件 @zh
label: 其他雜項硬體 @zh-hant
label: 기타 각종 하드웨어 @ko
definition: This industry subgroup includes companies that design or manufacture miscellaneous hardware equipment not elsewhere classified.
notation: 18101515
valid from: 2014-08-08
valid till: 2020-10-03

Other Hardware
type: BicsLevel3Industry
type: Classifier
type: NamedIndividual
is industry of: Articoli per ferramenta
is anachronous version of: http://data.ga-group.nl/ics/bics/19101013
is contemporary version of: http://data.ga-group.nl/ics/bics/181015
is replaced by: http://data.ga-group.nl/ics/bics/2020/19101013
is version of: http://data.ga-group.nl/ics/bics/181015
is version of: http://data.ga-group.nl/ics/bics/19101013
imported on: 2026-06-08T13:03:47.798Z
last refreshed on: 2026-06-08T13:03:47.798Z
source accessed on: 2019-12-03T20:05:01Z
source last accessed on: 2019-12-03T20:05:01Z
label: Altri Hardware @it
label: Autre matériel @fr
label: Otro Hardware @es
label: Outros Hardware @pt
label: Sonstige Hardware @de
label: Проч. металлоизд. @ru
label: その他ﾊｰﾄﾞｳｴｱ @ja
label: 其他硬件 @zh
label: 其他硬體 @zh-hant
label: 기타 하드웨어 @ko
definition: This industry includes companies that design or manufacture hardware equipment not elsewhere classified. Includes biometrics, traffic management systems, embedded computing hardware and other miscellaneous hardware.
notation: 181015
valid from: 2014-08-08
valid till: 2020-10-03

Communication Equip Cmpnts
type: BicsLevel4SubIndustry
type: Classifier
type: NamedIndividual
is sub industry of: Electronics Components
is anachronous version of: http://data.ga-group.nl/ics/bics/1910101410
is contemporary version of: http://data.ga-group.nl/ics/bics/18101610
is replaced by: http://data.ga-group.nl/ics/bics/2020/1910101410
is version of: http://data.ga-group.nl/ics/bics/18101610
is version of: http://data.ga-group.nl/ics/bics/1910101410
imported on: 2026-06-08T13:03:47.798Z
last refreshed on: 2026-06-08T13:03:47.798Z
source accessed on: 2019-12-03T20:05:01Z
source last accessed on: 2019-12-03T20:05:01Z
label: Comp app comunicazione @it
label: Comp telefonia móvel @pt
label: Componentes equipo de comunicación @es
label: Compos équip communication @fr
label: Kommunikationgerätekomp. @de
label: Компоненты коммуникац. оборуд. @ru
label: 通信機器部品 @ja
label: 通訊設備組件 @zh-hant
label: 通讯设备零部件 @zh
label: 통신장비 부품 @ko
definition: This industry subgroup includes companies that design or manufacture communications equipment components.
notation: 18101610
valid from: 2014-08-08
valid till: 2020-10-03

Display Panels
type: BicsLevel5Segment
type: Classifier
type: NamedIndividual
is level5 segment of: Display Components
is anachronous version of: http://data.ga-group.nl/ics/bics/191010141110
is contemporary version of: http://data.ga-group.nl/ics/bics/1810161110
is replaced by: http://data.ga-group.nl/ics/bics/2020/191010141110
is version of: http://data.ga-group.nl/ics/bics/1810161110
is version of: http://data.ga-group.nl/ics/bics/191010141110
imported on: 2026-06-08T13:03:47.798Z
last refreshed on: 2026-06-08T13:03:47.798Z
source accessed on: 2019-12-03T20:05:01Z
source last accessed on: 2019-12-03T20:05:01Z
label: Anzeigetafeln @de
label: Mostrar paneles @es
label: Painéis de exibição @pt
label: Panneaux d'affichage @fr
label: Pannelli @it
label: Индикат. панели @ru
label: 显示屏 @zh
label: 顯示器面板 @zh-hant
label: 디스플���이패널 @ko
label: ﾃﾞｨｽﾌﾟﾚｲﾊﾟﾈﾙ @ja
definition: This segment includes companies that manufacture display panels. These display panels are the primary modules that produce the images in the display.
notation: 1810161110
valid from: 2014-08-08
valid till: 2020-10-03

Touch Solution
type: BicsLevel5Segment
type: Classifier
type: NamedIndividual
is level5 segment of: Display Components
is anachronous version of: http://data.ga-group.nl/ics/bics/191010141111
is contemporary version of: http://data.ga-group.nl/ics/bics/1810161111
is replaced by: http://data.ga-group.nl/ics/bics/2020/191010141111
is version of: http://data.ga-group.nl/ics/bics/1810161111
is version of: http://data.ga-group.nl/ics/bics/191010141111
imported on: 2026-06-08T13:03:47.798Z
last refreshed on: 2026-06-08T13:03:47.798Z
source accessed on: 2019-12-03T20:05:01Z
source last accessed on: 2019-12-03T20:05:01Z
label: Solução de toque @pt
label: Solución de contacto @es
label: Solution Touch @fr
label: Soluzione Touch @it
label: Touch-Lösung @de
label: Сенс. мониторы @ru
label: 触控解决方案 @zh
label: 觸控解決方案 @zh-hant
label: 터치 솔루션 @ko
label: ﾀｯﾁｽｸﾘｰﾝ @ja
definition: This segment includes companies that manufacture components utilized to detect touch for touchscreen displays.
notation: 1810161111
valid from: 2014-08-08
valid till: 2020-10-03

Electronic Glass
type: BicsLevel5Segment
type: Classifier
type: NamedIndividual
is level5 segment of: Display Components
is anachronous version of: http://data.ga-group.nl/ics/bics/191010141112
is contemporary version of: http://data.ga-group.nl/ics/bics/1810161112
is replaced by: http://data.ga-group.nl/ics/bics/2020/191010141112
is version of: http://data.ga-group.nl/ics/bics/1810161112
is version of: http://data.ga-group.nl/ics/bics/191010141112
imported on: 2026-06-08T13:03:47.798Z
last refreshed on: 2026-06-08T13:03:47.798Z
source accessed on: 2019-12-03T20:05:01Z
source last accessed on: 2019-12-03T20:05:01Z
label: Elektronisches Glas @de
label: Verre électronique @fr
label: Vetro elettronico @it
label: Vidrio electrónico @es
label: Vidro tela eletr @pt
label: Электр. (стекло) @ru
label: 电子玻璃 @zh
label: 電子玻璃 @zh-hant
label: 電子ｶﾞﾗｽ @ja
label: 전자 유리 @ko
definition: This segment includes companies that manufacture specialized glass involved in the production of a display.
notation: 1810161112
valid from: 2014-08-08
valid till: 2020-10-03

Misc. Display Components
type: BicsLevel5Segment
type: Classifier
type: Discontinued
type: NamedIndividual
is level5 segment of: Display Components
is contemporary version of: http://data.ga-group.nl/ics/bics/1810161113
is version of: http://data.ga-group.nl/ics/bics/1810161113
imported on: 2026-06-08T13:03:47.798Z
last refreshed on: 2026-06-08T13:03:47.798Z
source accessed on: 2019-12-03T20:05:01Z
source last accessed on: 2019-12-03T20:05:01Z
label: Composants d'affichage div. @fr
label: Div componentes de tela @pt
label: Sonstige Display-Komponenten @de
label: Vari componenti display @it
label: Varios componentes de pantallas @es
label: Разл. компон. сис. отображ. @ru
label: その他ﾃﾞｨｽ���ﾟﾚｲ部品 @ja
label: 其他显示元件 @zh
label: 其他顯示器組件 @zh-hant
label: 기타 디스플레이 부품 @ko
definition: This segment includes companies that manufacture display components not elsewhere classified.
notation: 1810161113
valid from: 2014-08-08
valid till: 2020-10-03

Display Components
type: BicsLevel4SubIndustry
type: Classifier
type: NamedIndividual
is sub industry of: Electronics Components
is anachronous version of: http://data.ga-group.nl/ics/bics/1910101411
is contemporary version of: http://data.ga-group.nl/ics/bics/18101611
is replaced by: http://data.ga-group.nl/ics/bics/2020/1910101411
is version of: http://data.ga-group.nl/ics/bics/18101611
is version of: http://data.ga-group.nl/ics/bics/1910101411
imported on: 2026-06-08T13:03:47.798Z
last refreshed on: 2026-06-08T13:03:47.798Z
source accessed on: 2019-12-03T20:05:01Z
source last accessed on: 2019-12-03T20:05:01Z
label: Componentes de pantalla @es
label: Composants d'affichage @fr
label: Exibir componentes @pt
label: Monitorkomponten @de
label: Visione componenti @it
label: Компоненты системы отображения информации @ru
label: 显示元件 @zh
label: 顯示元件 @zh-hant
label: 디스플레이 부품 @ko
label: ﾃﾞｨｽﾌﾟﾚｲ部品 @ja
definition: This industry subgroup includes companies that design or manufacture components for display purposes. These components can be utilized in various types of end products, such as cellphones, tablets and checkout machines.
notation: 18101611
valid from: 2014-08-08
valid till: 2020-10-03

Electronics Batteries
type: BicsLevel4SubIndustry
type: Classifier
type: NamedIndividual
is sub industry of: Electronics Components
is anachronous version of: http://data.ga-group.nl/ics/bics/1910101412
is contemporary version of: http://data.ga-group.nl/ics/bics/18101612
is replaced by: http://data.ga-group.nl/ics/bics/2020/1910101412
is version of: http://data.ga-group.nl/ics/bics/18101612
is version of: http://data.ga-group.nl/ics/bics/1910101412
imported on: 2026-06-08T13:03:47.798Z
last refreshed on: 2026-06-08T13:03:47.798Z
source accessed on: 2019-12-03T20:05:01Z
source last accessed on: 2019-12-03T20:05:01Z
label: Baterías para dispositivos electrónicos @es
label: Baterias eletrônicas @pt
label: Batterie elettroniche @it
label: Batterien für Elektronik @de
label: Electronique Batteries @fr
label: Электр. батареи @ru
label: 电器电池 @zh
label: 電子機器ﾊﾞｯﾃﾘｰ @ja
label: 電子產品電池 @zh-hant
label: 전자 배터리 @ko
definition: This industry subgroup includes companies that manufacture finished batteries or battery cells utilized for technology hardware products.
notation: 18101612
valid from: 2014-08-08
valid till: 2020-10-03

Passive Components
type: BicsLevel4SubIndustry
type: Classifier
type: NamedIndividual
is sub industry of: Electronics Components
is anachronous version of: http://data.ga-group.nl/ics/bics/1910101413
is contemporary version of: http://data.ga-group.nl/ics/bics/18101613
is replaced by: http://data.ga-group.nl/ics/bics/2020/1910101413
is version of: http://data.ga-group.nl/ics/bics/18101613
is version of: http://data.ga-group.nl/ics/bics/1910101413
imported on: 2026-06-08T13:03:47.798Z
last refreshed on: 2026-06-08T13:03:47.798Z
source accessed on: 2019-12-03T20:05:01Z
source last accessed on: 2019-12-03T20:05:01Z
label: Componentes pasivos @es
label: Componentes passivos @pt
label: Componenti passivi @it
label: Composants passifs @fr
label: Passive Komponenten @de
label: Пассивн. компон. @ru
label: 受動部品 @ja
label: 无源元件 @zh
label: 被動元件 @zh-hant
label: 수동 소자 @ko
definition: This industry subgroup includes companies that design or manufacture passive components for use in technology hardware products. Includes resistors, capacitors, inductors and transformers.
notation: 18101613
valid from: 2014-08-08
valid till: 2020-10-03

Carte circuit imprimé
type: BicsLevel4SubIndustry
type: Classifier
type: NamedIndividual
is sub industry of: Electronics Components
is anachronous version of: http://data.ga-group.nl/ics/bics/1910101414
is contemporary version of: http://data.ga-group.nl/ics/bics/18101614
is replaced by: http://data.ga-group.nl/ics/bics/2020/1910101414
is version of: http://data.ga-group.nl/ics/bics/18101614
is version of: http://data.ga-group.nl/ics/bics/1910101414
imported on: 2026-06-08T13:03:47.798Z
last refreshed on: 2026-06-08T13:03:47.798Z
source accessed on: 2019-12-03T20:05:01Z
source last accessed on: 2019-12-03T20:05:01Z
label: PCB @it
label: PCBs
label: Печатные платы @ru
label: 多氯联苯 @zh
definition: This industry subgroup includes companies that design or manufacture printed circuit boards (PCB) for use in technology hardware products.
notation: 18101614
valid from: 2014-08-08
valid till: 2020-10-03

Miscellaneous Components
type: BicsLevel4SubIndustry
type: Classifier
type: Discontinued
type: NamedIndividual
is sub industry of: Electronics Components
is contemporary version of: http://data.ga-group.nl/ics/bics/18101615
is version of: http://data.ga-group.nl/ics/bics/18101615
imported on: 2026-06-08T13:03:47.798Z
last refreshed on: 2026-06-08T13:03:47.798Z
source accessed on: 2019-12-03T20:05:01Z
source last accessed on: 2019-12-03T20:05:01Z
label: Compon. misti @it
label: Composants divers @fr
label: Diversos componentes @pt
label: Varios componentes @es
label: Verschiedenes Komponenten @de
label: Разл. компоненты @ru
label: その他部品 @ja
label: 其他元件 @zh-hant
label: 其他组件 @zh
label: 기타 부품 @ko
definition: This industry subgroup includes companies that design or manufacture miscellaneous components for use in technology hardware products not elsewhere classified.
notation: 18101615
valid from: 2014-08-08
valid till: 2020-10-03

Electronics Components
type: BicsLevel3Industry
type: Classifier
type: NamedIndividual
is industry of: Articoli per ferramenta
is anachronous version of: http://data.ga-group.nl/ics/bics/19101014
is contemporary version of: http://data.ga-group.nl/ics/bics/181016
is replaced by: http://data.ga-group.nl/ics/bics/2020/19101014
is version of: http://data.ga-group.nl/ics/bics/181016
is version of: http://data.ga-group.nl/ics/bics/19101014
imported on: 2026-06-08T13:03:47.798Z
last refreshed on: 2026-06-08T13:03:47.798Z
source accessed on: 2019-12-03T20:05:01Z
source last accessed on: 2019-12-03T20:05:01Z
label: Componentes @pt
label: Componenti elettronici @it
label: Composants électro @fr
label: Comps electrónicos @es
label: Elektr. Komponente @de
label: Компоненты @ru
label: 电子元件 @zh
label: 電子元件 @zh-hant
label: 電子部品 @ja
label: 전자 부품 @ko
definition: This industry includes companies that design or manufacture components used within technology hardware. Typically, these components are non-finished goods or semi-finished goods. Exclude components used for industrial products (see Electrical Components).
notation: 181016
valid from: 2014-08-08
valid till: 2020-10-03

Articoli per ferramenta
type: BicsLevel2IndustryGroup
type: Classifier
type: NamedIndividual
is industry group of: Technology
is anachronous version of: http://data.ga-group.nl/ics/bics/191010
is contemporary version of: http://data.ga-group.nl/ics/bics/1810
is replaced by: http://data.ga-group.nl/ics/bics/2020/191010
is version of: http://data.ga-group.nl/ics/bics/1810
is version of: http://data.ga-group.nl/ics/bics/191010
imported on: 2026-06-08T13:03:47.798Z
last refreshed on: 2026-06-08T13:03:47.798Z
source accessed on: 2019-12-03T20:05:01Z
source last accessed on: 2019-12-03T20:05:01Z
label: Hardware
label: Matériel @fr
label: Скобяные изделия @ru
label: 硬件 @zh
label: 硬體 @zh-hant
label: 하드웨어 @ko
label: ﾊｰﾄﾞｳｴｱ @ja
definition: This industry group includes companies that design or manufacture technology hardware products.
notation: 1810
valid from: 2014-08-08
valid till: 2020-10-03

Back End Capital Equipment
type: BicsLevel4SubIndustry
type: Classifier
type: NamedIndividual
is sub industry of: Semiconductor Mfg
is anachronous version of: http://data.ga-group.nl/ics/bics/1910111010
is contemporary version of: http://data.ga-group.nl/ics/bics/18111010
is replaced by: http://data.ga-group.nl/ics/bics/2020/1910111010
is version of: http://data.ga-group.nl/ics/bics/18111010
is version of: http://data.ga-group.nl/ics/bics/1910111010
imported on: 2026-06-08T13:03:47.798Z
last refreshed on: 2026-06-08T13:03:47.798Z
source accessed on: 2019-12-03T20:05:01Z
source last accessed on: 2019-12-03T20:05:01Z
label: Back-End-Kapitalgeräte @de
label: Equipagg capitale back end @it
label: Equipamento de capital back end @pt
label: Equipo de capital back-end @es
label: Immobilisations back end @fr
label: капитальное оборудование @ru
label: 后端资本设备 @zh
label: 後工程資本設備 @ja
label: 後端資本設備 @zh-hant
label: 백엔드 자본 설비 @ko
definition: This industry subgroup includes companies that manufacture back-end semiconductor capital equipment. Such equipment is used in the assembly and testing phase of semiconductor fabrication. Products include automated test equipment, wire bonders, die bonders and encapsulation products.
notation: 18111010
valid from: 2014-08-08
valid till: 2020-10-03

Front End Capital Equipment
type: BicsLevel4SubIndustry
type: Classifier
type: NamedIndividual
is sub industry of: Semiconductor Mfg
is anachronous version of: http://data.ga-group.nl/ics/bics/1910111011
is contemporary version of: http://data.ga-group.nl/ics/bics/18111011
is replaced by: http://data.ga-group.nl/ics/bics/2020/1910111011
is version of: http://data.ga-group.nl/ics/bics/18111011
is version of: http://data.ga-group.nl/ics/bics/1910111011
imported on: 2026-06-08T13:03:47.798Z
last refreshed on: 2026-06-08T13:03:47.798Z
source accessed on: 2019-12-03T20:05:01Z
source last accessed on: 2019-12-03T20:05:01Z
label: Equipagg capitali front end @it
label: Equipamento de capital front end @pt
label: Equipo de capital inicial @es
label: Front-End-Kapitalgeräte @de
label: Immobilisations front end @fr
label: Фронтальное капитальное оборудование @ru
label: 前工程資本設備 @ja
label: 前端資本設備 @zh-hant
label: 前端资本设备 @zh
label: 프론트엔드 자본 설비 @ko
definition: This industry subgroup includes companies that manufacture front-end semiconductor capital equipment or manufacture machinery used to make silicon wafers. Products include deposition equipment (ALD, CVD, PVD), etching equipment, cleaning systems, thermal processing equipment, chemical mechanical planarization equipment, ion implantation equipment and photolithography equipment.
notation: 18111011
valid from: 2014-08-08
valid till: 2020-10-03

Assembly Material & Solutions
type: BicsLevel4SubIndustry
type: Classifier
type: NamedIndividual
is sub industry of: Semiconductor Mfg
is anachronous version of: http://data.ga-group.nl/ics/bics/1910111012
is contemporary version of: http://data.ga-group.nl/ics/bics/18111012
is replaced by: http://data.ga-group.nl/ics/bics/2020/1910111012
is version of: http://data.ga-group.nl/ics/bics/18111012
is version of: http://data.ga-group.nl/ics/bics/1910111012
imported on: 2026-06-08T13:03:47.798Z
last refreshed on: 2026-06-08T13:03:47.798Z
source accessed on: 2019-12-03T20:05:01Z
source last accessed on: 2019-12-03T20:05:01Z
label: Matériaux/solutions assemblage @fr
label: Materiales y soluciones de ensamblaje @es
label: Materiali e soluzioni montaggio @it
label: Montagem de materiais e soluções @pt
label: Montagematerialien & -lösungen @de
label: Монтажные материалы и решения @ru
label: 処理材料･ｿﾘｭｰｼｮﾝ @ja
label: 組裝材料/解決方案 @zh-hant
label: 装配材料与解决方案 @zh
label: 조립 재료 및 솔루션 @ko
definition: This industry subgroup includes companies that manufacture assembly materials and solutions used in semiconductor integrated circuit (IC) manufacturing.
notation: 18111012
valid from: 2014-08-08
valid till: 2020-10-03

Assembly & Testing Services
type: BicsLevel4SubIndustry
type: Classifier
type: NamedIndividual
is sub industry of: Semiconductor Mfg
is anachronous version of: http://data.ga-group.nl/ics/bics/1910111013
is contemporary version of: http://data.ga-group.nl/ics/bics/18111013
is replaced by: http://data.ga-group.nl/ics/bics/2020/1910111013
is version of: http://data.ga-group.nl/ics/bics/18111013
is version of: http://data.ga-group.nl/ics/bics/1910111013
imported on: 2026-06-08T13:03:47.798Z
last refreshed on: 2026-06-08T13:03:47.798Z
source accessed on: 2019-12-03T20:05:01Z
source last accessed on: 2019-12-03T20:05:01Z
label: Montage- & Testdienste @de
label: Serviços de montagem e testes @pt
label: Services tests/assemblage @fr
label: Servicios de ensamblaje y pruebas @es
label: Servizi montaggio e test @it
label: Услуги сборки и тестирования @ru
label: 封裝及測試服務 @zh-hant
label: 組立･ﾃｽﾄｻｰﾋﾞｽ @ja
label: 组装与测试服务 @zh
label: 조립 & 테스팅 서비스 @ko
definition: This industry subgroup includes companies that provide outsourced assembly (or packaging) and testing services for designers of semiconductor integrated circuits (ICs).
notation: 18111013
valid from: 2014-08-08
valid till: 2020-10-03

Foundry Services
type: BicsLevel4SubIndustry
type: Classifier
type: NamedIndividual
is sub industry of: Semiconductor Mfg
is anachronous version of: http://data.ga-group.nl/ics/bics/1910111014
is contemporary version of: http://data.ga-group.nl/ics/bics/18111014
is replaced by: http://data.ga-group.nl/ics/bics/2020/1910111014
is version of: http://data.ga-group.nl/ics/bics/18111014
is version of: http://data.ga-group.nl/ics/bics/1910111014
imported on: 2026-06-08T13:03:47.798Z
last refreshed on: 2026-06-08T13:03:47.798Z
source accessed on: 2019-12-03T20:05:01Z
source last accessed on: 2019-12-03T20:05:01Z
label: Gießereidienste @de
label: Serviços de fundição @pt
label: Services de fonderie @fr
label: Servicios de fundición @es
label: Servizi fonderia @it
label: Литье @ru
label: 晶圓代工 @zh-hant
label: 鋳造 @ja
label: 铸造服务 @zh
label: 반도체수탁생산 @ko
definition: This industry subgroup includes companies that provide outsourced manufacturing for designers of semiconductor integrated circuits (ICs).
notation: 18111014
valid from: 2014-08-08
valid till: 2020-10-03

Silicon Products
type: BicsLevel4SubIndustry
type: Classifier
type: NamedIndividual
is sub industry of: Semiconductor Mfg
is anachronous version of: http://data.ga-group.nl/ics/bics/1910111015
is contemporary version of: http://data.ga-group.nl/ics/bics/18111015
is replaced by: http://data.ga-group.nl/ics/bics/2020/1910111015
is version of: http://data.ga-group.nl/ics/bics/18111015
is version of: http://data.ga-group.nl/ics/bics/1910111015
imported on: 2026-06-08T13:03:47.798Z
last refreshed on: 2026-06-08T13:03:47.798Z
source accessed on: 2019-12-03T20:05:01Z
source last accessed on: 2019-12-03T20:05:01Z
label: Prodotti di silicio @it
label: Productos de silicio @es
label: Produits de silicium @fr
label: Produtos de silicone @pt
label: Siliziumprodukte @de
label: Кремниевые продукты @ru
label: 矽產品 @zh-hant
label: 硅制品 @zh
label: 실리콘 제품 @ko
label: ｼﾘｺﾝ製��� @ja
definition: This industry subgroup includes companies that manufacture silicon products that are used as raw materials in semiconductor integrated circuit (IC) manufacturing.
notation: 18111015
valid from: 2014-08-08
valid till: 2020-10-03

Semiconductor Mfg
type: BicsLevel3Industry
type: Classifier
type: NamedIndividual
is industry of: Semiconductors
is anachronous version of: http://data.ga-group.nl/ics/bics/19101110
is contemporary version of: http://data.ga-group.nl/ics/bics/181110
is replaced by: http://data.ga-group.nl/ics/bics/2020/19101110
is version of: http://data.ga-group.nl/ics/bics/181110
is version of: http://data.ga-group.nl/ics/bics/19101110
imported on: 2026-06-08T13:03:47.798Z
last refreshed on: 2026-06-08T13:03:47.798Z
source accessed on: 2019-12-03T20:05:01Z
source last accessed on: 2019-12-03T20:05:01Z
label: Fab de semicondutor @pt
label: Fab semi-conducteurs @fr
label: Fabricación de semiconductores @es
label: Herstellung von Halbleitern @de
label: Prod semiconduttori @it
label: Пр-во полупроводн. @ru
label: 半导体制造 @zh
label: 半導体製造 @ja
label: 半導體製造 @zh-hant
label: 반도체 제조 @ko
definition: This industry includes companies that are involved in the manufacturing process, support or supply to the semiconductor industry. Includes companies that supplies capital equipment and materials, as well as providing outsourced manufacturing services. Excludes companies that design the semiconductor devices themselves (see Semiconductor Devices).
notation: 181110
valid from: 2014-08-08
valid till: 2020-10-03

App Specific Analog
type: BicsLevel5Segment
type: Classifier
type: NamedIndividual
is level5 segment of: Analog ICs
is anachronous version of: http://data.ga-group.nl/ics/bics/191011111010
is contemporary version of: http://data.ga-group.nl/ics/bics/1811111010
is replaced by: http://data.ga-group.nl/ics/bics/2020/191011111010
is version of: http://data.ga-group.nl/ics/bics/1811111010
is version of: http://data.ga-group.nl/ics/bics/191011111010
imported on: 2026-06-08T13:03:47.798Z
last refreshed on: 2026-06-08T13:03:47.798Z
source accessed on: 2019-12-03T20:05:01Z
source last accessed on: 2019-12-03T20:05:01Z
label: ASSP 특정 아날로그 @ko
label: Análogo específico de app @pt
label: Analogica spec applicazione @it
label: Anw.-spez. Analogon @de
label: Ap específica análogo @es
label: Application spécifique analogue @fr
label: Аналог специализир. применения @ru
label: 特定应用模拟 @zh
label: 特定用途向ｱﾅﾛｸﾞ機器 @ja
label: 特殊應用類比 @zh-hant
definition: This segment includes companies that design or manufacture analog semiconductor devices or integrated circuits (ICs) for application-specific standard products (products specific to certain industries).
notation: 1811111010
valid from: 2014-08-08
valid till: 2020-10-03

Power Management
type: BicsLevel5Segment
type: Classifier
type: NamedIndividual
is level5 segment of: Analog ICs
is anachronous version of: http://data.ga-group.nl/ics/bics/191011111011
is contemporary version of: http://data.ga-group.nl/ics/bics/1811111011
is replaced by: http://data.ga-group.nl/ics/bics/2020/191011111011
is version of: http://data.ga-group.nl/ics/bics/1811111011
is version of: http://data.ga-group.nl/ics/bics/191011111011
imported on: 2026-06-08T13:03:47.798Z
last refreshed on: 2026-06-08T13:03:47.798Z
source accessed on: 2019-12-03T20:05:01Z
source last accessed on: 2019-12-03T20:05:01Z
label: Gerenciamento de energia @pt
label: Gestión de electricidad @es
label: Gestion d'électricité @fr
label: Gestione energia @it
label: Strom-Management @de
label: Упр��вление энергопитанием @ru
label: 电源管理 @zh
label: 電力管理 @ja
label: 電源管理 @zh-hant
label: 전력 관리 @ko
definition: This segment includes companies that design or manufacture analog semiconductor devices or integrated circuits (ICs) for power management products.
notation: 1811111011
valid from: 2014-08-08
valid till: 2020-10-03

Standard Linear - General
type: BicsLevel5Segment
type: Classifier
type: NamedIndividual
is level5 segment of: Analog ICs
is anachronous version of: http://data.ga-group.nl/ics/bics/191011111012
is contemporary version of: http://data.ga-group.nl/ics/bics/1811111012
is replaced by: http://data.ga-group.nl/ics/bics/2020/191011111012
is version of: http://data.ga-group.nl/ics/bics/1811111012
is version of: http://data.ga-group.nl/ics/bics/191011111012
imported on: 2026-06-08T13:03:47.798Z
last refreshed on: 2026-06-08T13:03:47.798Z
source accessed on: 2019-12-03T20:05:01Z
source last accessed on: 2019-12-03T20:05:01Z
label: Linéaire standard - Général @fr
label: Lineal estándar - general @es
label: Linear padrão - Geral @pt
label: Lineare standard - Generale @it
label: Standard-Linear (Allg. Verwendung) @de
label: Стандартные линейные - общее назначение @ru
label: 标准线性-通用 @zh
label: 標準線形(一般用途) @ja
label: 標準線性-一般目的 @zh-hant
label: 표준선형-일반 @ko
definition: This segment includes companies that design or manufacture generic analog semiconductor devices or integrated circuits (ICs) that are used in multiple products in multiple industries.
notation: 1811111012
valid from: 2014-08-08
valid till: 2020-10-03

Analog ICs
type: BicsLevel4SubIndustry
type: Classifier
type: NamedIndividual
is sub industry of: Semiconductor Devices
is anachronous version of: http://data.ga-group.nl/ics/bics/1910111110
is contemporary version of: http://data.ga-group.nl/ics/bics/18111110
is replaced by: http://data.ga-group.nl/ics/bics/2020/1910111110
is version of: http://data.ga-group.nl/ics/bics/18111110
is version of: http://data.ga-group.nl/ics/bics/1910111110
imported on: 2026-06-08T13:03:47.798Z
last refreshed on: 2026-06-08T13:03:47.798Z
source accessed on: 2019-12-03T20:05:01Z
source last accessed on: 2019-12-03T20:05:01Z
label: Analoge ICs @de
label: CI análogo @pt
label: CI analogico @it
label: CI analogues @fr
label: ICs análogos @es
label: Аналогов. ИС @ru
label: 模拟IC @zh
label: 類比IC @zh-hant
label: ｱﾅﾛｸﾞIC @ja
label: ���날로그 IC @ko
definition: This industry subgroup includes companies that design or manufacture semiconductor devices or integrated circuits (ICs) for analog or mixed-signal circuitry.
notation: 18111110
valid from: 2014-08-08
valid till: 2020-10-03

Discretes, Sensors & Actuators
type: BicsLevel5Segment
type: Classifier
type: NamedIndividual
is level5 segment of: Discrete
is anachronous version of: http://data.ga-group.nl/ics/bics/191011111110
is contemporary version of: http://data.ga-group.nl/ics/bics/1811111110
is replaced by: http://data.ga-group.nl/ics/bics/2020/191011111110
is version of: http://data.ga-group.nl/ics/bics/1811111110
is version of: http://data.ga-group.nl/ics/bics/191011111110
imported on: 2026-06-08T13:03:47.798Z
last refreshed on: 2026-06-08T13:03:47.798Z
source accessed on: 2019-12-03T20:05:01Z
source last accessed on: 2019-12-03T20:05:01Z
label: Discreti, sensori e attuatori @it
label: Discretos, sensores e atuadores @pt
label: Discretos, sensores y accionadores @es
label: Diskrete Bauelemente, Sensoren & Aktuatoren @de
label: Données discrètes/capteurs/actionneurs @fr
label: Дискретные компоненты, сенсоры @ru
label: 個別部品･ｾﾝｻｰ･作動装置 @ja
label: 分立器件、传感器及执行器 @zh
label: 分離器/感應器/促動器 @zh-hant
label: 개별소자, 센서 & 구동장치 @ko
definition: This segment includes companies that design or manufacture sensors, actuators or other discrete semiconductor devices.
notation: 1811111110
valid from: 2014-08-08
valid till: 2020-10-03

LED
type: BicsLevel5Segment
type: Classifier
type: NamedIndividual
is level5 segment of: Discrete
is anachronous version of: http://data.ga-group.nl/ics/bics/191011111111
is contemporary version of: http://data.ga-group.nl/ics/bics/1811111111
is replaced by: http://data.ga-group.nl/ics/bics/2020/191011111111
is version of: http://data.ga-group.nl/ics/bics/1811111111
is version of: http://data.ga-group.nl/ics/bics/191011111111
imported on: 2026-06-08T13:03:47.798Z
last refreshed on: 2026-06-08T13:03:47.798Z
source accessed on: 2019-12-03T20:05:01Z
source last accessed on: 2019-12-03T20:05:01Z
label: Светодиоды @ru
label: 發光二極體 @zh-hant
definition: This segment includes companies that design or manufacture discrete semiconductor devices or discrete circuits for light emitting diodes (LEDs).
notation: 1811111111
valid from: 2014-08-08
valid till: 2020-10-03

Optical Components
type: BicsLevel5Segment
type: Classifier
type: NamedIndividual
is level5 segment of: Discrete
is anachronous version of: http://data.ga-group.nl/ics/bics/191011111112
is contemporary version of: http://data.ga-group.nl/ics/bics/1811111112
is replaced by: http://data.ga-group.nl/ics/bics/2020/191011111112
is version of: http://data.ga-group.nl/ics/bics/1811111112
is version of: http://data.ga-group.nl/ics/bics/191011111112
imported on: 2026-06-08T13:03:47.798Z
last refreshed on: 2026-06-08T13:03:47.798Z
source accessed on: 2019-12-03T20:05:01Z
source last accessed on: 2019-12-03T20:05:01Z
label: Componentes ópticos @es
label: Componentes óticos @pt
label: Componenti ottici @it
label: Composants optiques @fr
label: Optische Komponenten @de
label: Оптические компоненты @ru
label: 光学元件 @zh
label: 光学部品 @ja
label: 光電半導體 @zh-hant
label: 광학 부품 @ko
definition: This segment includes companies that design or manufacture discrete semiconductor devices or discrete circuits focused on optical components.
notation: 1811111112
valid from: 2014-08-08
valid till: 2020-10-03

Discrete
type: BicsLevel4SubIndustry
type: Classifier
type: NamedIndividual
is sub industry of: Semiconductor Devices
is anachronous version of: http://data.ga-group.nl/ics/bics/1910111111
is contemporary version of: http://data.ga-group.nl/ics/bics/18111111
is replaced by: http://data.ga-group.nl/ics/bics/2020/1910111111
is version of: http://data.ga-group.nl/ics/bics/18111111
is version of: http://data.ga-group.nl/ics/bics/1910111111
imported on: 2026-06-08T13:03:47.798Z
last refreshed on: 2026-06-08T13:03:47.798Z
source accessed on: 2019-12-03T20:05:01Z
source last accessed on: 2019-12-03T20:05:01Z
label: Discret @fr
label: Discreto @es
label: Diskret @de
label: Дискретные @ru
label: 非持续 @zh
label: 非連續 @zh-hant
label: 비연속 @ko
label: ﾃﾞｨｽｸﾘｰﾄ @ja
definition: This industry subgroup includes companies that design or manufacture discrete semiconductor devices or discrete circuits.
notation: 18111111
valid from: 2014-08-08
valid till: 2020-10-03

Intellectual Property - Semi
type: BicsLevel4SubIndustry
type: Classifier
type: NamedIndividual
is sub industry of: Semiconductor Devices
is anachronous version of: http://data.ga-group.nl/ics/bics/1910111112
is contemporary version of: http://data.ga-group.nl/ics/bics/18111112
is replaced by: http://data.ga-group.nl/ics/bics/2020/1910111112
is version of: http://data.ga-group.nl/ics/bics/18111112
is version of: http://data.ga-group.nl/ics/bics/1910111112
imported on: 2026-06-08T13:03:47.798Z
last refreshed on: 2026-06-08T13:03:47.798Z
source accessed on: 2019-12-03T20:05:01Z
source last accessed on: 2019-12-03T20:05:01Z
label: Geistiges Eigentum - Halbleiter @de
label: Ppté intellectuelle - Semi @fr
label: Propiedad intelectual - semi @es
label: Propriedade intelectual - Semi @pt
label: Proprietà Intellettuale - Semi @it
label: Интеллект. собств. - дизайн полупров. @ru
label: 智慧財產-半導體設計 @zh-hant
label: 知的財産-半導体 @ja
label: 知识产权-半导体 @zh
label: 지적재산권-반도체 @ko
definition: This industry subgroup includes companies that create, license and market semiconductor intellectual property.
notation: 18111112
valid from: 2014-08-08
valid till: 2020-10-03

NAND Flash
type: BicsLevel5Segment
type: Classifier
type: NamedIndividual
is level5 segment of: Memory ICs
is anachronous version of: http://data.ga-group.nl/ics/bics/191011111310
is contemporary version of: http://data.ga-group.nl/ics/bics/1811111310
is replaced by: http://data.ga-group.nl/ics/bics/2020/191011111310
is version of: http://data.ga-group.nl/ics/bics/1811111310
is version of: http://data.ga-group.nl/ics/bics/191011111310
imported on: 2026-06-08T13:03:47.798Z
last refreshed on: 2026-06-08T13:03:47.798Z
source accessed on: 2019-12-03T20:05:01Z
source last accessed on: 2019-12-03T20:05:01Z
label: Flash NAND @it
label: Flash NON-ET @fr
label: Memória flash NAND @pt
label: NAND Flash-Speicher @de
label: NAND 快閃記憶體 @zh-hant
label: NAND型ﾌﾗｯｼｭ @ja
label: NAND闪存 @zh
label: 낸드플래시 @ko
definition: This segment includes companies that design or manufacture NAND flash memory semiconductor devices or integrated circuits (ICs).
notation: 1811111310
valid from: 2014-08-08
valid till: 2020-10-03

NOR Flash
type: BicsLevel5Segment
type: Classifier
type: NamedIndividual
is level5 segment of: Memory ICs
is anachronous version of: http://data.ga-group.nl/ics/bics/191011111311
is contemporary version of: http://data.ga-group.nl/ics/bics/1811111311
is replaced by: http://data.ga-group.nl/ics/bics/2020/191011111311
is version of: http://data.ga-group.nl/ics/bics/1811111311
is version of: http://data.ga-group.nl/ics/bics/191011111311
imported on: 2026-06-08T13:03:47.798Z
last refreshed on: 2026-06-08T13:03:47.798Z
source accessed on: 2019-12-03T20:05:01Z
source last accessed on: 2019-12-03T20:05:01Z
label: Flash NON-OU @fr
label: Flash NOR @it
label: Memória flash NOR @pt
label: NOR Flash-Speicher @de
label: NOR 快閃記憶體 @zh-hant
label: NOR型ﾌﾗｯｼｭ @ja
label: NOR闪存 @zh
label: 노어플래시 @ko
definition: This segment includes companies that design or manufacture NOR flash memory semiconductor devices or integrated circuits (ICs).
notation: 1811111311
valid from: 2014-08-08
valid till: 2020-10-03

DRAM
type: BicsLevel5Segment
type: Classifier
type: NamedIndividual
is level5 segment of: Memory ICs
is anachronous version of: http://data.ga-group.nl/ics/bics/191011111312
is contemporary version of: http://data.ga-group.nl/ics/bics/1811111312
is replaced by: http://data.ga-group.nl/ics/bics/2020/191011111312
is version of: http://data.ga-group.nl/ics/bics/1811111312
is version of: http://data.ga-group.nl/ics/bics/191011111312
imported on: 2026-06-08T13:03:47.798Z
last refreshed on: 2026-06-08T13:03:47.798Z
source accessed on: 2019-12-03T20:05:01Z
source last accessed on: 2019-12-03T20:05:01Z
label: D램 @ko
label: Memória DRAM @pt
label: Память DRAM @ru
definition: This segment includes companies that design or manufacture dynamic random access memory (DRAM) semiconductor devices or integrated circuits (ICs). DRAM is a type of volatile memory used extensively in computer hardware.
notation: 1811111312
valid from: 2014-08-08
valid till: 2020-10-03

Memória SRAM
type: BicsLevel5Segment
type: Classifier
type: NamedIndividual
is level5 segment of: Memory ICs
is anachronous version of: http://data.ga-group.nl/ics/bics/191011111313
is contemporary version of: http://data.ga-group.nl/ics/bics/1811111313
is replaced by: http://data.ga-group.nl/ics/bics/2020/191011111313
is version of: http://data.ga-group.nl/ics/bics/1811111313
is version of: http://data.ga-group.nl/ics/bics/191011111313
imported on: 2026-06-08T13:03:47.798Z
last refreshed on: 2026-06-08T13:03:47.798Z
source accessed on: 2019-12-03T20:05:01Z
source last accessed on: 2019-12-03T20:05:01Z
label: SRAM
label: S램 @ko
label: Память SRAM @ru
definition: This segment includes companies that design or manufacture static random access memory (SRAM) semiconductor devices or integrated circuits (ICs). SRAMs are commonly used in electronic switches.
notation: 1811111313
valid from: 2014-08-08
valid till: 2020-10-03

Other Memory
type: BicsLevel5Segment
type: Classifier
type: Discontinued
type: NamedIndividual
is level5 segment of: Memory ICs
is contemporary version of: http://data.ga-group.nl/ics/bics/1811111314
is version of: http://data.ga-group.nl/ics/bics/1811111314
imported on: 2026-06-08T13:03:47.798Z
last refreshed on: 2026-06-08T13:03:47.798Z
source accessed on: 2019-12-03T20:05:01Z
source last accessed on: 2019-12-03T20:05:01Z
label: Altra memoria @it
label: Autre mémoire @fr
label: Otra memoria @es
label: Outras memórias @pt
label: Sonstige Speicher @de
label: Прочая память @ru
label: その他ﾒﾓﾘ @ja
label: 其他存储器 @zh
label: 其他記憶體 @zh-hant
label: 기타 메모리 @ko
definition: This segment includes companies that design or manufacture other non-volatile memory semiconductor devices or integrated circuits (ICs) not elsewhere classified.
notation: 1811111314
valid from: 2014-08-08
valid till: 2020-10-03

Memory ICs
type: BicsLevel4SubIndustry
type: Classifier
type: NamedIndividual
is sub industry of: Semiconductor Devices
is anachronous version of: http://data.ga-group.nl/ics/bics/1910111113
is contemporary version of: http://data.ga-group.nl/ics/bics/18111113
is replaced by: http://data.ga-group.nl/ics/bics/2020/1910111113
is version of: http://data.ga-group.nl/ics/bics/18111113
is version of: http://data.ga-group.nl/ics/bics/1910111113
imported on: 2026-06-08T13:03:47.798Z
last refreshed on: 2026-06-08T13:03:47.798Z
source accessed on: 2019-12-03T20:05:01Z
source last accessed on: 2019-12-03T20:05:01Z
label: CI mémoire @fr
label: CI memória @pt
label: CI memoria @it
label: ICs de memoria @es
label: Speicher-ICs @de
label: Память ИС @ru
label: 内存IC @zh
label: 記憶體IC @zh-hant
label: 메모리 IC @ko
label: ﾒﾓﾘｰIC @ja
definition: This industry subgroup includes companies that design or manufacture memory semiconductor devices or integrated circuits (ICs). Memory ICs are further divided into volatile and non-volatile types.
notation: 18111113
valid from: 2014-08-08
valid till: 2020-10-03

App Specific Communication
type: BicsLevel5Segment
type: Classifier
type: NamedIndividual
is level5 segment of: Logic, Processors & App Specific
is anachronous version of: http://data.ga-group.nl/ics/bics/191011111410
is contemporary version of: http://data.ga-group.nl/ics/bics/1811111410
is replaced by: http://data.ga-group.nl/ics/bics/2020/191011111410
is version of: http://data.ga-group.nl/ics/bics/1811111410
is version of: http://data.ga-group.nl/ics/bics/191011111410
imported on: 2026-06-08T13:03:47.798Z
last refreshed on: 2026-06-08T13:03:47.798Z
source accessed on: 2019-12-03T20:05:01Z
source last accessed on: 2019-12-03T20:05:01Z
label: Anw.-spezifische Kommunikation @de
label: Ap específica de comunicación @es
label: Communication app spécifique @fr
label: Comunicação específica para app @pt
label: Comunicazione specifica app @it
label: Коммуник. специализ. применения @ru
label: 特定应用通讯 @zh
label: 特定用途向け通信用IC @ja
label: 特殊用途通訊 @zh-hant
label: 앱 특정 통신 @ko
definition: This segment includes companies that design or manufacture analog or digital semiconductor devices or integrated circuits (ICs) for communications products.
notation: 1811111410
valid from: 2014-08-08
valid till: 2020-10-03

App Specific I/O & Storage
type: BicsLevel5Segment
type: Classifier
type: NamedIndividual
is level5 segment of: Logic, Processors & App Specific
is anachronous version of: http://data.ga-group.nl/ics/bics/191011111411
is contemporary version of: http://data.ga-group.nl/ics/bics/1811111411
is replaced by: http://data.ga-group.nl/ics/bics/2020/191011111411
is version of: http://data.ga-group.nl/ics/bics/1811111411
is version of: http://data.ga-group.nl/ics/bics/191011111411
imported on: 2026-06-08T13:03:47.798Z
last refreshed on: 2026-06-08T13:03:47.798Z
source accessed on: 2019-12-03T20:05:01Z
source last accessed on: 2019-12-03T20:05:01Z
label: AP específica y almacenamiento @es
label: Anw.-spezifische I/O & Speicherung @de
label: E/S et stockage app spécifique @fr
label: I/O e archiviazione specifica app @it
label: I/O e armazenagem específica para app @pt
label: Устройства ввода/вывода/хран. данных СП @ru
label: 特定应用输入输出与存储 @zh
label: 特定用途向けPCﾛｼﾞｯｸ @ja
label: 特殊用途I/O及儲存 @zh-hant
label: 앱 특정 I/O & 스토리지 @ko
definition: This segment includes companies that design or manufacture analog or digital computing and consumer semiconductor devices or integrated circuits (ICs) for personal computer logic products.
notation: 1811111411
valid from: 2014-08-08
valid till: 2020-10-03

App Specific Multimedia
type: BicsLevel5Segment
type: Classifier
type: NamedIndividual
is level5 segment of: Logic, Processors & App Specific
is anachronous version of: http://data.ga-group.nl/ics/bics/191011111412
is contemporary version of: http://data.ga-group.nl/ics/bics/1811111412
is replaced by: http://data.ga-group.nl/ics/bics/2020/191011111412
is version of: http://data.ga-group.nl/ics/bics/1811111412
is version of: http://data.ga-group.nl/ics/bics/191011111412
imported on: 2026-06-08T13:03:47.798Z
last refreshed on: 2026-06-08T13:03:47.798Z
source accessed on: 2019-12-03T20:05:01Z
source last accessed on: 2019-12-03T20:05:01Z
label: Anw.-spezifisches Multimedia @de
label: Ap específico de multimedia @es
label: Disp multimediali specifici app @it
label: Multimédia app spécifique @fr
label: Multimídia específica para app @pt
label: Мультимедиа специализ. применения @ru
label: 特定应用多媒体 @zh
label: 特定用途向けﾏﾙﾁﾒﾃﾞｨｱ @ja
label: 特殊用途多媒體 @zh-hant
label: 앱 특정 멀티미디어 @ko
definition: This segment includes companies that design or manufacture analog or digital computing and consumer semiconductor devices or integrated circuits (ICs) focused on multimedia functions. These include semiconductor devices, such as graphics ICs and audio codecs.
notation: 1811111412
valid from: 2014-08-08
valid till: 2020-10-03

App Specific Others
type: BicsLevel5Segment
type: Classifier
type: Discontinued
type: NamedIndividual
is level5 segment of: Logic, Processors & App Specific
is contemporary version of: http://data.ga-group.nl/ics/bics/1811111413
is version of: http://data.ga-group.nl/ics/bics/1811111413
imported on: 2026-06-08T13:03:47.798Z
last refreshed on: 2026-06-08T13:03:47.798Z
source accessed on: 2019-12-03T20:05:01Z
source last accessed on: 2019-12-03T20:05:01Z
label: Altro specifico app @it
label: Anw.-spezifisch, Sonstige @de
label: Autres app spécifiques @fr
label: Otra ap específica @es
label: Outros específicos para app @pt
label: Другие продукты специализ. применен��я @ru
label: 特定应用其他 @zh
label: 特定用途向けIC&標準製品 @ja
label: 特殊應用其他 @zh-hant
label: 앱 특정 기타 @ko
definition: This segment includes companies that design and manufacture logic semiconductor devices. Such companies include programmable logic devices (PLDs) companies, and logic companies that make application-specific integrated circuits (ASICs) and application-specific standard products (ASSPs) that are not elsewhere classified.
notation: 1811111413
valid from: 2014-08-08
valid till: 2020-10-03

Logic
type: BicsLevel5Segment
type: Classifier
type: NamedIndividual
is level5 segment of: Logic, Processors & App Specific
is anachronous version of: http://data.ga-group.nl/ics/bics/191011111413
is contemporary version of: http://data.ga-group.nl/ics/bics/1811111414
is replaced by: http://data.ga-group.nl/ics/bics/2020/191011111413
is version of: http://data.ga-group.nl/ics/bics/1811111414
is version of: http://data.ga-group.nl/ics/bics/191011111413
imported on: 2026-06-08T13:03:47.798Z
last refreshed on: 2026-06-08T13:03:47.798Z
source accessed on: 2019-12-03T20:05:01Z
source last accessed on: 2019-12-03T20:05:01Z
label: Lógica @es
label: Logica @it
label: Logik @de
label: Logique @fr
label: Логика @ru
label: 逻辑 @zh
label: 邏輯 @zh-hant
label: 로직 @ko
label: ﾛｼﾞｯｸ @ja
definition: This segment includes companies that design and manufacture programmable logic semiconductor devices. Programmable logic devices (PLDs) include field programmable gate arrays (FPGAs) and complex programmable logic devices (CPLDs).
notation: 1811111414
valid from: 2014-08-08
valid till: 2020-10-03

Microcontrollers
type: BicsLevel5Segment
type: Classifier
type: NamedIndividual
is level5 segment of: Logic, Processors & App Specific
is anachronous version of: http://data.ga-group.nl/ics/bics/191011111414
is contemporary version of: http://data.ga-group.nl/ics/bics/1811111415
is replaced by: http://data.ga-group.nl/ics/bics/2020/191011111414
is version of: http://data.ga-group.nl/ics/bics/1811111415
is version of: http://data.ga-group.nl/ics/bics/191011111414
imported on: 2026-06-08T13:03:47.798Z
last refreshed on: 2026-06-08T13:03:47.798Z
source accessed on: 2019-12-03T20:05:01Z
source last accessed on: 2019-12-03T20:05:01Z
label: Microcontrôleurs @fr
label: Microcontroladores @es
label: Microcontrollori @it
label: Mikrokontroller @de
label: Микроконтроллеры @ru
label: 微控制器 @zh
label: 마이크로컨트롤러 @ko
label: ﾏｲｸﾛｺﾝﾄﾛｰﾗｰ @ja
definition: This segment includes companies that design or manufacture analog or digital computing and consumer semiconductor devices or integrated circuits (ICs) for microcontroller products.
notation: 1811111415
valid from: 2014-08-08
valid till: 2020-10-03

Microprocessors
type: BicsLevel5Segment
type: Classifier
type: NamedIndividual
is level5 segment of: Logic, Processors & App Specific
is anachronous version of: http://data.ga-group.nl/ics/bics/191011111415
is contemporary version of: http://data.ga-group.nl/ics/bics/1811111416
is replaced by: http://data.ga-group.nl/ics/bics/2020/191011111415
is version of: http://data.ga-group.nl/ics/bics/1811111416
is version of: http://data.ga-group.nl/ics/bics/191011111415
imported on: 2026-06-08T13:03:47.798Z
last refreshed on: 2026-06-08T13:03:47.798Z
source accessed on: 2019-12-03T20:05:01Z
source last accessed on: 2019-12-03T20:05:01Z
label: Microprocesadores @es
label: Microprocessadores @pt
label: Microprocesseurs @fr
label: Microprocessori @it
label: Mikroprozessoren @de
label: Микропроцессоры @ru
label: 微处理器 @zh
label: 微處理器 @zh-hant
label: 마이크로프로세서 @ko
label: ﾏｲｸﾛﾌﾟﾛｾｯｻｰ @ja
definition: This segment includes companies that design or manufacture analog or digital computing and consumer semiconductor devices or integrated circuits (ICs) for microprocessor products.
notation: 1811111416
valid from: 2014-08-08
valid till: 2020-10-03

Logic, Processors & App Specific
type: BicsLevel4SubIndustry
type: Classifier
type: NamedIndividual
is sub industry of: Semiconductor Devices
is anachronous version of: http://data.ga-group.nl/ics/bics/1910111114
is contemporary version of: http://data.ga-group.nl/ics/bics/18111114
is replaced by: http://data.ga-group.nl/ics/bics/2020/1910111114
is version of: http://data.ga-group.nl/ics/bics/18111114
is version of: http://data.ga-group.nl/ics/bics/1910111114
imported on: 2026-06-08T13:03:47.798Z
last refreshed on: 2026-06-08T13:03:47.798Z
source accessed on: 2019-12-03T20:05:01Z
source last accessed on: 2019-12-03T20:05:01Z
label: Lógica, procesadores e IC esp ap @es
label: Lógica, processadores e ASIC @pt
label: Logica, processori e ASIC @it
label: Logik, Prozessoren & ASIC @de
label: Logiques/processeurs/app spéc @fr
label: Логич., процес. и специализ. ИС @ru
label: 逻辑、处理器及特定应用 @zh
label: 邏輯/處理器/特殊應用IC @zh-hant
label: 로직, 프로세서 & ASIC @ko
label: ﾛｼﾞｯｸ､ﾌﾟﾛｾｯｻｰ､特定用途用 @ja
definition: This industry subgroup includes companies that design or manufacture logic integrated circuits (ICs), processors and application-specific ICs.
notation: 18111114
valid from: 2014-08-08
valid till: 2020-10-03

Semiconductor Devices
type: BicsLevel3Industry
type: Classifier
type: NamedIndividual
is industry of: Semiconductors
is anachronous version of: http://data.ga-group.nl/ics/bics/19101111
is contemporary version of: http://data.ga-group.nl/ics/bics/181111
is replaced by: http://data.ga-group.nl/ics/bics/2020/19101111
is version of: http://data.ga-group.nl/ics/bics/181111
is version of: http://data.ga-group.nl/ics/bics/19101111
imported on: 2026-06-08T13:03:47.798Z
last refreshed on: 2026-06-08T13:03:47.798Z
source accessed on: 2019-12-03T20:05:01Z
source last accessed on: 2019-12-03T20:05:01Z
label: Aparelhos semicond @pt
label: Appareils semi-cond @fr
label: Dispositivi semiconduttori @it
label: Disps semiconduct @es
label: Halbleitergeräte @de
label: П/проводниковые устройства @ru
label: 半导体元件 @zh
label: 半導体素子 @ja
label: 半導體元件 @zh-hant
label: 반도체 장치 @ko
definition: This industry includes companies that design or manufacture semiconductor devices or integrated circuits (ICs). Excludes outsourced semiconductor manufacturing services for semiconductor design companies (see Foundries).
notation: 181111
valid from: 2014-08-08
valid till: 2020-10-03

Semiconductors
type: BicsLevel2IndustryGroup
type: Classifier
type: NamedIndividual
is industry group of: Technology
is anachronous version of: http://data.ga-group.nl/ics/bics/191011
is contemporary version of: http://data.ga-group.nl/ics/bics/1811
is replaced by: http://data.ga-group.nl/ics/bics/2020/191011
is version of: http://data.ga-group.nl/ics/bics/1811
is version of: http://data.ga-group.nl/ics/bics/191011
imported on: 2026-06-08T13:03:47.798Z
last refreshed on: 2026-06-08T13:03:47.798Z
source accessed on: 2019-12-03T20:05:01Z
source last accessed on: 2019-12-03T20:05:01Z
label: Halbleiter @de
label: Semi-conducteurs @fr
label: Semiconductores @es
label: Semicondutores @pt
label: Semiconduttori @it
label: Полупроводники @ru
label: 半导体 @zh
label: 半導体 @ja
label: 半導體 @zh-hant
label: 반도체 @ko
definition: This industry group includes companies that manufacture semiconductor integrated circuits (ICs) or its capital equipment.
notation: 1811
valid from: 2014-08-08
valid till: 2020-10-03

Content Applications
type: BicsLevel5Segment
type: Classifier
type: Discontinued
type: NamedIndividual
is level5 segment of: Contents Mgmt Software (CMS)
is contemporary version of: http://data.ga-group.nl/ics/bics/1812101010
is version of: http://data.ga-group.nl/ics/bics/1812101010
imported on: 2026-06-08T13:03:47.798Z
last refreshed on: 2026-06-08T13:03:47.798Z
source accessed on: 2019-12-03T20:05:01Z
source last accessed on: 2019-12-03T20:05:01Z
label: Aplicaciones de contenido @es
label: Aplicativos de conteúdo @pt
label: Applications de contenu @fr
label: Applicazioni contenuto @it
label: Content-Applikationen @de
label: Применение содерж. @ru
label: 內容應用程式 @zh-hant
label: 内容应用 @zh
label: 컨텐츠 애플리케이션 @ko
label: ｺﾝﾃﾝﾂ･ｱﾌﾟﾘｹｰｼｮﾝ @ja
definition: This segment includes companies that development content applications that are used to organize, manage and store data in an enterprise. Excludes management of document data (see document management software).
notation: 1812101010
valid from: 2014-08-08
valid till: 2020-10-03

Document Management Software
type: BicsLevel5Segment
type: Classifier
type: Discontinued
type: NamedIndividual
is level5 segment of: Contents Mgmt Software (CMS)
is contemporary version of: http://data.ga-group.nl/ics/bics/1812101011
is version of: http://data.ga-group.nl/ics/bics/1812101011
imported on: 2026-06-08T13:03:47.798Z
last refreshed on: 2026-06-08T13:03:47.798Z
source accessed on: 2019-12-03T20:05:01Z
source last accessed on: 2019-12-03T20:05:01Z
label: Logiciel gestion de document @fr
label: Software admin de documentos @es
label: Software de gerenciamento de documento @pt
label: Software gestione di documenti @it
label: Software: Dokumentenverwaltg @de
label: ПО для обеспеч. управл. документацией @ru
label: 文件管理軟體 @zh-hant
label: 文件管理软件 @zh
label: 調達･文書管理･印刷関連ｿﾌﾄｳｴｱ @ja
label: 문서관리소프트웨어 @ko
definition: This segment includes companies that develop software for documents, content management, printing procurement and text-imaging solutions.
notation: 1812101011
valid from: 2014-08-08
valid till: 2020-10-03

Contents Mgmt Software (CMS)
type: BicsLevel4SubIndustry
type: Classifier
type: NamedIndividual
is sub industry of: Application Software
is anachronous version of: http://data.ga-group.nl/ics/bics/1911101011
is contemporary version of: http://data.ga-group.nl/ics/bics/18121010
is replaced by: http://data.ga-group.nl/ics/bics/2020/1911101011
is version of: http://data.ga-group.nl/ics/bics/18121010
is version of: http://data.ga-group.nl/ics/bics/1911101011
imported on: 2026-06-08T13:03:47.798Z
last refreshed on: 2026-06-08T13:03:47.798Z
source accessed on: 2019-12-03T20:05:01Z
source last accessed on: 2019-12-03T20:05:01Z
label: Content-Management-Software (CMS) @de
label: Logiciel de gestion de contenu (CMS) @fr
label: Software de gestão de conteúdo (CMS) @pt
label: Software de gestión de contenido (CMS) @es
label: Software gestione contenuto (CMS) @it
label: Программное обеспечение для управл. содерж. @ru
label: 內容管理軟體（CMS） @zh-hant
label: 内容管理软件 (CMS) @zh
label: 컨텐츠 관리 소프트웨어(CMS) @ko
label: ｺﾝﾃﾝﾂ管理ｿﾌﾄｳｴｱ(CMS) @ja
definition: This industry subgroup includes companies that develop content management software. Content management software maintains and organizes data, as well as allows users the ability to publish and edit from a centralized system.
notation: 18121010
valid from: 2014-08-08
valid till: 2020-10-03

Graphic Software
type: BicsLevel5Segment
type: Classifier
type: Discontinued
type: NamedIndividual
is level5 segment of: Creative Software
is contemporary version of: http://data.ga-group.nl/ics/bics/1812101110
is version of: http://data.ga-group.nl/ics/bics/1812101110
imported on: 2026-06-08T13:03:47.798Z
last refreshed on: 2026-06-08T13:03:47.798Z
source accessed on: 2019-12-03T20:05:01Z
source last accessed on: 2019-12-03T20:05:01Z
label: Grafik-Software @de
label: Logiciel graphique @fr
label: Software gráfico @pt
label: Software gráficos @es
label: Software per grafici @it
label: Графическое прогр. обеспечение @ru
label: 繪圖軟體 @zh-hant
label: 绘图和创意软件 @zh
label: 그래픽 소프트웨어 @ko
label: ｸﾞﾗﾌｨｯｸ･ｿﾌﾄｳｴｱ @ja
definition: This segment includes companies that develop software for creative purposes, such as graphics design, animation, 3D modeling, visual effects and editing software.
notation: 1812101110
valid from: 2014-08-08
valid till: 2020-10-03

Creative Software
type: BicsLevel4SubIndustry
type: Classifier
type: Discontinued
type: NamedIndividual
is sub industry of: Application Software
is contemporary version of: http://data.ga-group.nl/ics/bics/18121011
is version of: http://data.ga-group.nl/ics/bics/18121011
imported on: 2026-06-08T13:03:47.798Z
last refreshed on: 2026-06-08T13:03:47.798Z
source accessed on: 2019-12-03T20:05:01Z
source last accessed on: 2019-12-03T20:05:01Z
label: Kreative Software @de
label: Logiciel graphique @fr
label: Software creativo @es
label: Software criativo @pt
label: Software per grafici @it
label: Креативное прогр. обеспечение @ru
label: 創意軟體 @zh-hant
label: 绘图和创意软件 @zh
label: 크리에이티브SW @ko
label: ｸﾘｴｲﾃｨﾌﾞ･ｿﾌﾄｳｴｱ @ja
definition: This industry subgroup includes companies that develop creative and digital media software, such as MP3 software, media players, 3D-modeling software, graphics design software and other media software.
notation: 18121011
valid from: 2014-08-08
valid till: 2020-10-03

Engenharia de software
type: BicsLevel4SubIndustry
type: Classifier
type: NamedIndividual
is sub industry of: Application Software
is anachronous version of: http://data.ga-group.nl/ics/bics/1911101012
is contemporary version of: http://data.ga-group.nl/ics/bics/18121012
is replaced by: http://data.ga-group.nl/ics/bics/2020/1911101012
is version of: http://data.ga-group.nl/ics/bics/18121012
is version of: http://data.ga-group.nl/ics/bics/1911101012
imported on: 2026-06-08T13:03:47.798Z
last refreshed on: 2026-06-08T13:03:47.798Z
source accessed on: 2019-12-03T20:05:01Z
source last accessed on: 2019-12-03T20:05:01Z
label: Engineering Software
label: Logiciels d'ingénierie @fr
label: Software de ingeniería @es
label: Software per l'ingegneria @it
label: Инженерное ПО @ru
label: 工程軟體 @zh-hant
label: 工程软件 @zh
label: 엔지니어링 소프트웨어 @ko
label: ｴﾝｼﾞﾆｱﾘﾝｸﾞｿﾌﾄｳｴｱ @ja
definition: This industry subgroup includes companies that develop software for the scientific, engineering, construction and manufacturing markets. Such software includes CAD (computer-aided design) software, digital prototyping software, and software designed to improve manufacturing processes.
notation: 18121012
valid from: 2014-08-08
valid till: 2020-10-03

Accounting Software
type: BicsLevel5Segment
type: Classifier
type: Discontinued
type: NamedIndividual
is level5 segment of: Enterprise Software
is contemporary version of: http://data.ga-group.nl/ics/bics/1812101310
is version of: http://data.ga-group.nl/ics/bics/1812101310
imported on: 2026-06-08T13:03:47.798Z
last refreshed on: 2026-06-08T13:03:47.798Z
source accessed on: 2019-12-03T20:05:01Z
source last accessed on: 2019-12-03T20:05:01Z
label: Accounting-Software @de
label: Logiciels de compta @fr
label: Software contabilità @it
label: Software contable @es
label: Software de contabilidade @pt
label: ПО для бух. учета @ru
label: 会計用ｿﾌﾄｳｴｱ @ja
label: 会计软件 @zh
label: 會計軟體 @zh-hant
label: 회계용 소프트웨어 @ko
definition: This segment includes companies that develop software designed for accounting purposes, both personal and professional.
notation: 1812101310
valid from: 2014-08-08
valid till: 2020-10-03

Customer Relation Mgmt (CRM)
type: BicsLevel5Segment
type: Classifier
type: Discontinued
type: NamedIndividual
is level5 segment of: Enterprise Software
is contemporary version of: http://data.ga-group.nl/ics/bics/1812101311
is version of: http://data.ga-group.nl/ics/bics/1812101311
imported on: 2026-06-08T13:03:47.798Z
last refreshed on: 2026-06-08T13:03:47.798Z
source accessed on: 2019-12-03T20:05:01Z
source last accessed on: 2019-12-03T20:05:01Z
label: Customer-Relationship-Management (CRM) @de
label: Gest rapporto clienti (CRM) @it
label: Gestão de relações com o consumidor (CRM) @pt
label: Gestión de relaciones entre clientes (CRM) @es
label: Gestion des relations clients (CRM) @fr
label: Управл. отношениями с клиентами (CRM) @ru
label: 客戶關係管理（CRM） @zh-hant
label: 客户关系管理 (CRM) @zh
label: 顧客関係管理(CRM) @ja
label: 고객상담 관리(CRM) @ko
definition: This segment includes companies that develop customer relationship management (CRM) software. CRM software organizes, stores, tracks and manages customer information as well as provides the ability to analyze the data allowing sales force and marketing automation capabilities.
notation: 1812101311
valid from: 2014-08-08
valid till: 2020-10-03

Data Proc & Transact Software
type: BicsLevel5Segment
type: Classifier
type: Discontinued
type: NamedIndividual
is level5 segment of: Enterprise Software
is contemporary version of: http://data.ga-group.nl/ics/bics/1812101312
is version of: http://data.ga-group.nl/ics/bics/1812101312
imported on: 2026-06-08T13:03:47.798Z
last refreshed on: 2026-06-08T13:03:47.798Z
source accessed on: 2019-12-03T20:05:01Z
source last accessed on: 2019-12-03T20:05:01Z
label: Datenverarb.- & Transaktionssoftware @de
label: Logiciels transac/traitement données @fr
label: Proceso de datos y software de transacciones @es
label: Software de transações e proc dados @pt
label: Software transaz e proc dati @it
label: 数据处理与交易软件 @zh
label: 資料處理/交易軟體 @zh-hant
label: 데이터 처리 & 거래처리 소프트웨어 @ko
label: ﾃﾞｰﾀ処理･決済ｿﾌﾄｳｴｱ @ja
label: ��О для обработки данных и транзакций @ru
definition: This segment includes companies that develop software used for data processing and transaction processing purposes.
notation: 1812101312
valid from: 2014-08-08
valid till: 2020-10-03

Enterprise Resource Mgmt (ERM)
type: BicsLevel5Segment
type: Classifier
type: Discontinued
type: NamedIndividual
is level5 segment of: Enterprise Software
is contemporary version of: http://data.ga-group.nl/ics/bics/1812101313
is version of: http://data.ga-group.nl/ics/bics/1812101313
imported on: 2026-06-08T13:03:47.798Z
last refreshed on: 2026-06-08T13:03:47.798Z
source accessed on: 2019-12-03T20:05:01Z
source last accessed on: 2019-12-03T20:05:01Z
label: Enterprise-Resource-Mgmt (ERM) @de
label: Gestão de recursos empresa (ERM) @pt
label: Gestión de recursos de empresa (ERM) @es
label: Gestion ress d'entreprises @fr
label: Управление ресурсами компании (ERM) @ru
label: 企业资源管理(ERM) @zh
label: 企業資源管理(ERM) @zh-hant
label: 経営資源管理(ERM) @ja
label: 기업자원 관리(ERM) @ko
definition: This segment includes companies that develop software designed to optimize, track and analyze resource allocation within an enterprise. Enterprise resource management (ERM) integrates various business activities and provides data in real time. Commonly tracked enterprise business resources include inventory, cash, marketing, financing and human resources.
notation: 1812101313
valid from: 2014-08-08
valid till: 2020-10-03

Human Capital Mgmt (HCM)
type: BicsLevel5Segment
type: Classifier
type: Discontinued
type: NamedIndividual
is level5 segment of: Enterprise Software
is contemporary version of: http://data.ga-group.nl/ics/bics/1812101314
is version of: http://data.ga-group.nl/ics/bics/1812101314
imported on: 2026-06-08T13:03:47.798Z
last refreshed on: 2026-06-08T13:03:47.798Z
source accessed on: 2019-12-03T20:05:01Z
source last accessed on: 2019-12-03T20:05:01Z
label: Gest capitale umano (HCM) @it
label: Gestão de capital humano @pt
label: Gestión de capital humano (HCM) @es
label: Gestion du capital humain (HCM) @fr
label: Human-Capital-Management (HCM) @de
label: Управл. трудовым капиталом (HCM) @ru
label: 人事管理(HCM) @ja
label: 人力資本管理（HCM） @zh-hant
label: 人力资源管理 (HCM) @zh
label: 인적자본 관리(HCM) @ko
definition: This segment includes companies that develop software designed to track, manage and analyze information related to the company's employees.
notation: 1812101314
valid from: 2014-08-08
valid till: 2020-10-03

Product Lifecycle Mgmt (PLM)
type: BicsLevel5Segment
type: Classifier
type: Discontinued
type: NamedIndividual
is level5 segment of: Enterprise Software
is contemporary version of: http://data.ga-group.nl/ics/bics/1812101315
is version of: http://data.ga-group.nl/ics/bics/1812101315
imported on: 2026-06-08T13:03:47.798Z
last refreshed on: 2026-06-08T13:03:47.798Z
source accessed on: 2019-12-03T20:05:01Z
source last accessed on: 2019-12-03T20:05:01Z
label: Gest ciclo vita prodotto (PLM) @it
label: Gestão de ciclo de vida do produto (PLM) @pt
label: Gestión del ciclo de vida de productos @es
label: Gestion de cycle de vie de produit (PLM) @fr
label: Produktlebenszyklusmanagement (PLM) @de
label: Управл. жизненным циклом продукта (PLM) @ru
label: 产品生命周期管理 (PLM) @zh
label: 產品生命周期管理（PLM） @zh-hant
label: 製品ﾗｲﾌｻｲｸﾙ管理(PLM) @ja
label: 상품 라이프사이클 관리(PLM) @ko
definition: This segment includes companies that develop software designed to track, manage and analyze information related to product life cycle.
notation: 1812101315
valid from: 2014-08-08
valid till: 2020-10-03

Productivity Software
type: BicsLevel5Segment
type: Classifier
type: Discontinued
type: NamedIndividual
is level5 segment of: Enterprise Software
is contemporary version of: http://data.ga-group.nl/ics/bics/1812101316
is version of: http://data.ga-group.nl/ics/bics/1812101316
imported on: 2026-06-08T13:03:47.798Z
last refreshed on: 2026-06-08T13:03:47.798Z
source accessed on: 2019-12-03T20:05:01Z
source last accessed on: 2019-12-03T20:05:01Z
label: Logi productivité @fr
label: Produktivitätssoftw. @de
label: Softw produttività @it
label: Software de produtividade @pt
label: Software productiv @es
label: ПО для повышения производит. @ru
label: 桌上型游戏软件 @zh
label: 生產力軟體 @zh-hant
label: 생산용소프트웨어 @ko
label: ﾌﾟﾛﾀﾞｸﾃｨﾋﾞﾃｨｿﾌﾄ @ja
definition: This segment includes companies that develop personal productivity software, such as word processors, spreadsheets and other office tools.
notation: 1812101316
valid from: 2014-08-08
valid till: 2020-10-03

Operations, Mfg & Supply Chain
type: BicsLevel5Segment
type: Classifier
type: Discontinued
type: NamedIndividual
is level5 segment of: Enterprise Software
is contemporary version of: http://data.ga-group.nl/ics/bics/1812101317
is version of: http://data.ga-group.nl/ics/bics/1812101317
imported on: 2026-06-08T13:03:47.798Z
last refreshed on: 2026-06-08T13:03:47.798Z
source accessed on: 2019-12-03T20:05:01Z
source last accessed on: 2019-12-03T20:05:01Z
label: Betrieb, Herstell. & Lieferkette @de
label: Exploi/fab/chaîne logistique @fr
label: Oper, fabricación y cadena de suministro @es
label: Operações, fabr e cadeia de suprimento @pt
label: Operazioni, manif e cate approv @it
label: Операции, пр-во и цепочка поставок @ru
label: 營運/製造/供應鏈 @zh-hant
label: 运营、制造与供应链 @zh
label: 영업, 관리 & 공급망 @ko
label: ｵﾍﾟﾚｰｼｮﾝ､製造､ｻﾌﾟﾗｲ･ﾁｪｰﾝ @ja
definition: This segment includes companies that develop software designed to track, manage and analyze information related to the production process and supply chain.
notation: 1812101317
valid from: 2014-08-08
valid till: 2020-10-03

Reporting & Analytics
type: BicsLevel5Segment
type: Classifier
type: NamedIndividual
is level5 segment of: Enterprise Software
is anachronous version of: http://data.ga-group.nl/ics/bics/1911101010
is contemporary version of: http://data.ga-group.nl/ics/bics/1812101318
is replaced by: http://data.ga-group.nl/ics/bics/2020/1911101010
is version of: http://data.ga-group.nl/ics/bics/1812101318
is version of: http://data.ga-group.nl/ics/bics/1911101010
imported on: 2026-06-08T13:03:47.798Z
last refreshed on: 2026-06-08T13:03:47.798Z
source accessed on: 2019-12-03T20:05:01Z
source last accessed on: 2019-12-03T20:05:01Z
label: Berichte & Analysen @de
label: Informes y análisis @es
label: Rapports et analyse @fr
label: Relatório e análise @pt
label: Report e analisi @it
label: Отчетность и аналитика @ru
label: 報告與分析 @zh-hant
label: 报告与分析 @zh
label: 리포팅 & 분석 @ko
label: ﾘﾎﾟｰﾄ&分析 @ja
definition: This segment includes companies that develop software designed to aggregate and analyze data. Reporting and analytics software typically aids in the generation and distribution of ad hoc reports.
notation: 1812101318
valid from: 2014-08-08
valid till: 2020-10-03

Enterprise Software
type: BicsLevel4SubIndustry
type: Classifier
type: NamedIndividual
is sub industry of: Application Software
is anachronous version of: http://data.ga-group.nl/ics/bics/1911101013
is contemporary version of: http://data.ga-group.nl/ics/bics/18121013
is replaced by: http://data.ga-group.nl/ics/bics/2020/1911101013
is version of: http://data.ga-group.nl/ics/bics/18121013
is version of: http://data.ga-group.nl/ics/bics/1911101013
imported on: 2026-06-08T13:03:47.798Z
last refreshed on: 2026-06-08T13:03:47.798Z
source accessed on: 2019-12-03T20:05:01Z
source last accessed on: 2019-12-03T20:05:01Z
label: Logiciels d'entreprise @fr
label: Software de empresa @es
label: Software per aziende @it
label: Unternehmens-Software @de
label: ПО для предприятий @ru
label: 企业软件 @zh
label: 企業向ｿﾌﾄｳｴｱ @ja
label: 企業軟體 @zh-hant
label: 기업용 소프트웨어 @ko
definition: This industry subgroup includes companies that develop enterprise software. Such software operates on top of an infrastructure software platform to provide business logic support functionality for organizations to improve their productivity and efficiency. Enterprise software includes software developed for enterprise resource planning (ERP), customer relationship management (CRM), supply chain management (SCM), inventory management, business intelligence, on-demand solutions, and related enterprise-wide solutions.
notation: 18121013
valid from: 2014-08-08
valid till: 2020-10-03

Mobile Software
type: BicsLevel4SubIndustry
type: Classifier
type: Discontinued
type: NamedIndividual
is sub industry of: Application Software
is contemporary version of: http://data.ga-group.nl/ics/bics/18121014
is version of: http://data.ga-group.nl/ics/bics/18121014
imported on: 2026-06-08T13:03:47.798Z
last refreshed on: 2026-06-08T13:03:47.798Z
source accessed on: 2019-12-03T20:05:01Z
source last accessed on: 2019-12-03T20:05:01Z
label: Logiciels - portable @fr
label: Mobilsoftware @de
label: Software celulares @es
label: Software móvel @pt
label: Software per mobile @it
label: ПО для мобильных телефонов @ru
label: 移动软件 @zh
label: 行動軟體 @zh-hant
label: 휴대전화소프트웨어 @ko
label: ﾓﾊﾞｲﾙ･ｿﾌﾄｳｴｱ @ja
definition: This industry subgroup includes companies that develop software for mobile phone devices. Includes applications that operate on a mobile phone device. Excludes video games that operate on a mobile phone device (see Mobile Games & Content).
notation: 18121014
valid from: 2014-08-08
valid till: 2020-10-03

Big Data Applications
type: BicsLevel5Segment
type: Classifier
type: Discontinued
type: NamedIndividual
is level5 segment of: Specialty Software
is contemporary version of: http://data.ga-group.nl/ics/bics/1812101510
is version of: http://data.ga-group.nl/ics/bics/1812101510
imported on: 2026-06-08T13:03:47.798Z
last refreshed on: 2026-06-08T13:03:47.798Z
source accessed on: 2019-12-03T20:05:01Z
source last accessed on: 2019-12-03T20:05:01Z
label: Aplicaciones para muchos datos @es
label: Aplicativos para muitos dados @pt
label: Applications Big Data @fr
label: Applicazioni per molti dati @it
label: Big-Data-Applikationen @de
label: Применение круп. данных @ru
label: 大量数据应用 @zh
label: 巨量資料應用程式 @zh-hant
label: 빅 데이터 ��플리케이션 @ko
label: ﾋﾞｯｸﾞﾃﾞｰﾀ･ｱﾌﾟﾘｹｰｼｮﾝ @ja
definition: This segment includes companies that develop software used for managing large volumes of unstructured and structured data.
notation: 1812101510
valid from: 2014-08-08
valid till: 2020-10-03

Communications Software
type: BicsLevel5Segment
type: Classifier
type: NamedIndividual
is level5 segment of: Specialty Software
is anachronous version of: http://data.ga-group.nl/ics/bics/191110101410
is contemporary version of: http://data.ga-group.nl/ics/bics/1812101511
is replaced by: http://data.ga-group.nl/ics/bics/2020/191110101410
is version of: http://data.ga-group.nl/ics/bics/1812101511
is version of: http://data.ga-group.nl/ics/bics/191110101410
imported on: 2026-06-08T13:03:47.798Z
last refreshed on: 2026-06-08T13:03:47.798Z
source accessed on: 2019-12-03T20:05:01Z
source last accessed on: 2019-12-03T20:05:01Z
label: Kommunik.-Software @de
label: Logiciel communica. @fr
label: Software comunicac @es
label: Software comunicaz @it
label: Software de comunicação @pt
label: Коммуникационное оборудование @ru
label: 通信用ｿﾌﾄｳｴｱ @ja
label: 通訊軟體 @zh-hant
label: 通讯软件 @zh
label: 통신용소프트웨어 @ko
definition: This segment includes companies that develop software for communication purposes. Such software includes telecommunications, wireless and other networking software.
notation: 1812101511
valid from: 2014-08-08
valid till: 2020-10-03

Education Software
type: BicsLevel5Segment
type: Classifier
type: NamedIndividual
is level5 segment of: Specialty Software
is anachronous version of: http://data.ga-group.nl/ics/bics/191110101411
is contemporary version of: http://data.ga-group.nl/ics/bics/1812101512
is replaced by: http://data.ga-group.nl/ics/bics/2020/191110101411
is version of: http://data.ga-group.nl/ics/bics/1812101512
is version of: http://data.ga-group.nl/ics/bics/191110101411
imported on: 2026-06-08T13:03:47.798Z
last refreshed on: 2026-06-08T13:03:47.798Z
source accessed on: 2019-12-03T20:05:01Z
source last accessed on: 2019-12-03T20:05:01Z
label: Bildungssoftware @de
label: Logiciels éducatifs @fr
label: Software de educação @pt
label: Software educativo @es
label: Software istruzione @it
label: Обучающее программн��е обеспечение @ru
label: 教育軟體 @zh-hant
label: 教育软件 @zh
label: 教育ｿﾌﾄｳｴｱ @ja
label: 교육 소프트웨어 @ko
definition: This segment includes companies that develop software for educational purposes. Such software is designed to integrate technology into education.
notation: 1812101512
valid from: 2014-08-08
valid till: 2020-10-03

Gambling Software
type: BicsLevel5Segment
type: Classifier
type: NamedIndividual
is level5 segment of: Specialty Software
is anachronous version of: http://data.ga-group.nl/ics/bics/191110101412
is contemporary version of: http://data.ga-group.nl/ics/bics/1812101513
is replaced by: http://data.ga-group.nl/ics/bics/2020/191110101412
is version of: http://data.ga-group.nl/ics/bics/1812101513
is version of: http://data.ga-group.nl/ics/bics/191110101412
imported on: 2026-06-08T13:03:47.798Z
last refreshed on: 2026-06-08T13:03:47.798Z
source accessed on: 2019-12-03T20:05:01Z
source last accessed on: 2019-12-03T20:05:01Z
label: Glücksspiel-Software @de
label: Logiciels de jeux @fr
label: Softw gioco azzardo @it
label: Software de aposta @pt
label: Software de apuestas @es
label: Программное обеспечение игр @ru
label: 博奕軟體 @zh-hant
label: 赌博软件 @zh
label: 도박 소프트웨어 @ko
label: ｷﾞｬﾝﾌﾞﾙ･ｿﾌﾄｳｴｱ @ja
definition: This segment includes companies that develop gambling software.
notation: 1812101513
valid from: 2014-08-08
valid till: 2020-10-03

Health Care Software
type: BicsLevel5Segment
type: Classifier
type: NamedIndividual
is level5 segment of: Specialty Software
is anachronous version of: http://data.ga-group.nl/ics/bics/191110101413
is contemporary version of: http://data.ga-group.nl/ics/bics/1812101514
is replaced by: http://data.ga-group.nl/ics/bics/2020/191110101413
is version of: http://data.ga-group.nl/ics/bics/1812101514
is version of: http://data.ga-group.nl/ics/bics/191110101413
imported on: 2026-06-08T13:03:47.798Z
last refreshed on: 2026-06-08T13:03:47.798Z
source accessed on: 2019-12-03T20:05:01Z
source last accessed on: 2019-12-03T20:05:01Z
label: Gesundheitssoftware @de
label: Logiciel - santé @fr
label: Software de saúde @pt
label: Software de salud @es
label: Software sanità @it
label: Медицинское прогр. обеспечение @ru
label: 医疗保健软件 @zh
label: 醫療保健軟體 @zh-hant
label: 헬스케어 소프트웨어 @ko
label: ﾍﾙｽｹｱ･ｿﾌﾄｳｴｱ @ja
definition: This segment includes companies that develop software for use in the health care sector.
notation: 1812101514
valid from: 2014-08-08
valid till: 2020-10-03

Navigation Software
type: BicsLevel5Segment
type: Classifier
type: Discontinued
type: NamedIndividual
is level5 segment of: Specialty Software
is contemporary version of: http://data.ga-group.nl/ics/bics/1812101515
is version of: http://data.ga-group.nl/ics/bics/1812101515
imported on: 2026-06-08T13:03:47.798Z
last refreshed on: 2026-06-08T13:03:47.798Z
source accessed on: 2019-12-03T20:05:01Z
source last accessed on: 2019-12-03T20:05:01Z
label: Logiciel navigation @fr
label: Navigationssoftware @de
label: Software de navegação @pt
label: Software navegación @es
label: Software navigazione @it
label: Навигационное прогр. обеспечение @ru
label: 导航软件 @zh
label: 導航軟體 @zh-hant
label: 네비게이션SW @ko
label: ﾅﾋﾞｹﾞｰｼｮﾝｿﾌﾄｳｴｱ @ja
definition: This segment includes companies that develop software for navigation systems. Such software includes databases and maps.
notation: 1812101515
valid from: 2014-08-08
valid till: 2020-10-03

Social Software
type: BicsLevel5Segment
type: Classifier
type: Discontinued
type: NamedIndividual
is level5 segment of: Specialty Software
is contemporary version of: http://data.ga-group.nl/ics/bics/1812101516
is version of: http://data.ga-group.nl/ics/bics/1812101516
imported on: 2026-06-08T13:03:47.798Z
last refreshed on: 2026-06-08T13:03:47.798Z
source accessed on: 2019-12-03T20:05:01Z
source last accessed on: 2019-12-03T20:05:01Z
label: Logiciel social @fr
label: Software social @es
label: Software sociale @it
label: Soziale Software @de
label: Социальное программное обеспечение @ru
label: 社会软件 @zh
label: 社會性軟體 @zh-hant
label: 소셜 소프트웨어 @ko
label: ｿｰｼｬﾙ･ｿﾌﾄｳｴｱ @ja
definition: This segment includes companies that develop software designed to facilitate communication, collaboration and project management within an enterprise.
notation: 1812101516
valid from: 2014-08-08
valid till: 2020-10-03

Logiciel comme service (SaaS)
type: BicsLevel5Segment
type: Classifier
type: Discontinued
type: NamedIndividual
is level5 segment of: Specialty Software
is contemporary version of: http://data.ga-group.nl/ics/bics/1812101517
is version of: http://data.ga-group.nl/ics/bics/1812101517
imported on: 2026-06-08T13:03:47.798Z
last refreshed on: 2026-06-08T13:03:47.798Z
source accessed on: 2019-12-03T20:05:01Z
source last accessed on: 2019-12-03T20:05:01Z
label: Software as a Service (SaaS)
label: Software come servizio (SaaS) @it
label: Software como servicio (Saas) @es
label: Software como um serviço (SaaS) @pt
label: программное обеспечение в виде услуги (SaaS) @ru
label: 軟體即服務（SaaS） @zh-hant
label: 软件运营服务 (SaaS) @zh
label: 서비스용 소프트웨어(SaaS) @ko
label: ｿﾌﾄｳｴｱ･ｱｽﾞ･ｱ･ｻｰﾋﾞｽ(SaaS) @ja
definition: This segment includes companies that provides services from application software based on cloud computing. Typically, these companies provide access to these services via websites, and revenue is realized on a subscription or a pay-per-use basis. This service outsources the maintenance costs of the underlying application software, infrastructure software and computing hardware.
notation: 1812101517
valid from: 2014-08-08
valid till: 2020-10-03

Specialty Software
type: BicsLevel4SubIndustry
type: Classifier
type: NamedIndividual
is sub industry of: Application Software
is anachronous version of: http://data.ga-group.nl/ics/bics/1911101014
is contemporary version of: http://data.ga-group.nl/ics/bics/18121015
is replaced by: http://data.ga-group.nl/ics/bics/2020/1911101014
is version of: http://data.ga-group.nl/ics/bics/18121015
is version of: http://data.ga-group.nl/ics/bics/1911101014
imported on: 2026-06-08T13:03:47.798Z
last refreshed on: 2026-06-08T13:03:47.798Z
source accessed on: 2019-12-03T20:05:01Z
source last accessed on: 2019-12-03T20:05:01Z
label: Logiciel spécialisé @fr
label: Software especialidade @pt
label: Software especializado @es
label: Software specializzato @it
label: Spezielle Software @de
label: Спец. программное обеспечение @ru
label: 専門ｿﾌﾄｳｴｱ @ja
label: 特殊軟體 @zh-hant
label: 特殊软件 @zh
label: 전문 소프트웨어 @ko
definition: This industry subgroup includes companies that develop gaming, education and health care software and caters to specific vertical and functions.
notation: 18121015
valid from: 2014-08-08
valid till: 2020-10-03

Console Game Downloads
type: BicsLevel6Segment
type: Classifier
type: Discontinued
type: NamedIndividual
is level6 segment of: Digital Games
is contemporary version of: http://data.ga-group.nl/ics/bics/181210161010
is version of: http://data.ga-group.nl/ics/bics/181210161010
imported on: 2026-06-08T13:03:47.798Z
last refreshed on: 2026-06-08T13:03:47.798Z
source accessed on: 2019-12-03T20:05:01Z
source last accessed on: 2019-12-03T20:05:01Z
label: Descargas de juegos para consolas @es
label: Download giochi per console @it
label: Downloads de jogos de consola @pt
label: Konsolenspiel-Downloads @de
label: Téléchargements de jeux de console @fr
label: Загрузки консольных игр @ru
label: 家庭用ｹﾞｰﾑ機ﾀﾞｳﾝﾛｰﾄﾞ @ja
label: 电视��戏下载 @zh
label: 電玩主機遊戲下載 @zh-hant
label: 콘솔 게임 다운로드 @ko
definition: This segment includes revenues derived from digital game downloads from console games.
notation: 181210161010
valid from: 2014-08-08
valid till: 2020-10-03

Mobile Games & Content
type: BicsLevel6Segment
type: Classifier
type: Discontinued
type: NamedIndividual
is level6 segment of: Digital Games
is contemporary version of: http://data.ga-group.nl/ics/bics/181210161011
is version of: http://data.ga-group.nl/ics/bics/181210161011
imported on: 2026-06-08T13:03:47.798Z
last refreshed on: 2026-06-08T13:03:47.798Z
source accessed on: 2019-12-03T20:05:01Z
source last accessed on: 2019-12-03T20:05:01Z
label: Contenu et jeux mobiles @fr
label: Giochi e contenuto mobile @it
label: Jogos de aparelhos móveis e conteúdo @pt
label: Juegos y contenido móviles @es
label: Mobile Spiele & Content @de
label: Игры на мобильных устройствах @ru
label: 手机游戏及内容 @zh
label: 行動裝置遊戲與內容 @zh-hant
label: 모바일 게임 & 컨텐츠 @ko
label: ﾓﾊﾞｲﾙ･ｹﾞｰﾑ&ｺﾝﾃﾝﾂ @ja
definition: This segment includes companies that develop video games and content for mobile phone devices.
notation: 181210161011
valid from: 2014-08-08
valid till: 2020-10-03

Online Games & Content
type: BicsLevel6Segment
type: Classifier
type: Discontinued
type: NamedIndividual
is level6 segment of: Digital Games
is contemporary version of: http://data.ga-group.nl/ics/bics/181210161012
is version of: http://data.ga-group.nl/ics/bics/181210161012
imported on: 2026-06-08T13:03:47.798Z
last refreshed on: 2026-06-08T13:03:47.798Z
source accessed on: 2019-12-03T20:05:01Z
source last accessed on: 2019-12-03T20:05:01Z
label: Contenu et jeux en ligne @fr
label: Giochi online e contenuto @it
label: Jogos e conteúdo online @pt
label: Juegos y contenido en línea @es
label: Mobile Spiele & Inhalte @de
label: Интернет-игры и контент @ru
label: 在��游戏与内容 @zh
label: 線上遊戲/內容 @zh-hant
label: 온라인 게임 & 컨텐츠 @ko
label: ｵﾝﾗｲﾝｹﾞｰﾑ･ｺﾝﾃﾝﾂ @ja
definition: This segment includes companies that produce video games on websites as well as subscription revenue derived from online game access.
notation: 181210161012
valid from: 2014-08-08
valid till: 2020-10-03

Other Digital Games
type: BicsLevel6Segment
type: Classifier
type: Discontinued
type: NamedIndividual
is level6 segment of: Digital Games
is contemporary version of: http://data.ga-group.nl/ics/bics/181210161013
is version of: http://data.ga-group.nl/ics/bics/181210161013
imported on: 2026-06-08T13:03:47.798Z
last refreshed on: 2026-06-08T13:03:47.798Z
source accessed on: 2019-12-03T20:05:01Z
source last accessed on: 2019-12-03T20:05:01Z
label: Altri giochi digitali @it
label: Autres jeux numériques @fr
label: Otros juegos digitales @es
label: Outros jogos digitais @pt
label: Sonstige digitale Spiele @de
label: Проч. игры на цифровых устройствах @ru
label: その他ﾃﾞｼﾞﾀﾙｹﾞｰﾑ @ja
label: 其他数码游戏 @zh
label: 其他數位遊戲 @zh-hant
label: 기타 디지털 게임 @ko
definition: This segment includes companies that publish and/or distribute games through digital distribution channels not elsewhere classified.
notation: 181210161013
valid from: 2014-08-08
valid till: 2020-10-03

Digital Games
type: BicsLevel5Segment
type: Classifier
type: NamedIndividual
is level5 segment of: Video Game Software
is anachronous version of: http://data.ga-group.nl/ics/bics/1010121210
is contemporary version of: http://data.ga-group.nl/ics/bics/1812101610
is replaced by: http://data.ga-group.nl/ics/bics/2020/1010121210
is version of: http://data.ga-group.nl/ics/bics/1010121210
is version of: http://data.ga-group.nl/ics/bics/1812101610
imported on: 2026-06-08T13:03:47.798Z
last refreshed on: 2026-06-08T13:03:47.798Z
source accessed on: 2019-12-03T20:05:01Z
source last accessed on: 2019-12-03T20:05:01Z
label: Digitale Spiele @de
label: Giochi digitali @it
label: Jeux numériques @fr
label: Jogos digitais @pt
label: Juegos digitales @es
label: Игры на цифровых устройствах @ru
label: 数码游戏 @zh
label: 數位遊戲 @zh-hant
label: 디지털 게임 @ko
label: ﾃﾞｼﾞﾀﾙｹﾞｰﾑ @ja
definition: This segment includes companies that publish and distribute video game software over a digital distribution channel. These video games are either digitally downloaded or accessible on the Internet.
notation: 1812101610
valid from: 2014-08-08
valid till: 2020-10-03

Console Games
type: BicsLevel6Segment
type: Classifier
type: Discontinued
type: NamedIndividual
is level6 segment of: Packaged Games
is contemporary version of: http://data.ga-group.nl/ics/bics/181210161110
is version of: http://data.ga-group.nl/ics/bics/181210161110
imported on: 2026-06-08T13:03:47.798Z
last refreshed on: 2026-06-08T13:03:47.798Z
source accessed on: 2019-12-03T20:05:01Z
source last accessed on: 2019-12-03T20:05:01Z
label: Console de jeux @fr
label: Console giochi @it
label: Jogos de console @pt
label: Juegos de consola @es
label: Spiele für Spielkonsolen @de
label: Игры для компьютерных приставок @ru
label: 家庭用ｹﾞｰﾑ機ｹﾞｰﾑ @ja
label: 游戏机游戏 @zh
label: 遊戲主機軟體 @zh-hant
label: 콘솔 게임 @ko
definition: This segment includes companies that publish and distribute video game software for console platforms over traditional retail channels.
notation: 181210161110
valid from: 2014-08-08
valid till: 2020-10-03

Handheld Games
type: BicsLevel6Segment
type: Classifier
type: Discontinued
type: NamedIndividual
is level6 segment of: Packaged Games
is contemporary version of: http://data.ga-group.nl/ics/bics/181210161111
is version of: http://data.ga-group.nl/ics/bics/181210161111
imported on: 2026-06-08T13:03:47.798Z
last refreshed on: 2026-06-08T13:03:47.798Z
source accessed on: 2019-12-03T20:05:01Z
source last accessed on: 2019-12-03T20:05:01Z
label: Giochi portatili @it
label: Jeux portables @fr
label: Jogos portáteis @pt
label: Juegos manuales @es
label: Software für Handheld-Geräte @de
label: Игры для мобильных телефонов и ПУ @ru
label: 手持游戏 @zh
label: 掌上型遊戲軟體 @zh-hant
label: 携帯型ｹﾞｰﾑ機ｹﾞｰﾑ @ja
label: 휴대용 게임 @ko
definition: This segment includes companies that publish and distribute video game software for handheld platforms over traditional retail channels.
notation: 181210161111
valid from: 2014-08-08
valid till: 2020-10-03

PC Games
type: BicsLevel6Segment
type: Classifier
type: Discontinued
type: NamedIndividual
is level6 segment of: Packaged Games
is contemporary version of: http://data.ga-group.nl/ics/bics/181210161112
is version of: http://data.ga-group.nl/ics/bics/181210161112
imported on: 2026-06-08T13:03:47.798Z
last refreshed on: 2026-06-08T13:03:47.798Z
source accessed on: 2019-12-03T20:05:01Z
source last accessed on: 2019-12-03T20:05:01Z
label: Giochi per PC @it
label: Jeux pour PC @fr
label: Jogos computador @pt
label: Juegos de CP @es
label: PC-Spiele @de
label: PC게임 @ko
label: ПО компьютерных игр @ru
label: 电脑游戏 @zh
label: 電腦遊戲軟體 @zh-hant
label: ﾊﾟｿｺﾝ用ｹﾞｰﾑ @ja
definition: This segment includes companies that publish and distribute video game software for PC platforms over traditional retail channels.
notation: 181210161112
valid from: 2014-08-08
valid till: 2020-10-03

Packaged Games
type: BicsLevel5Segment
type: Classifier
type: NamedIndividual
is level5 segment of: Video Game Software
is anachronous version of: http://data.ga-group.nl/ics/bics/1010121211
is contemporary version of: http://data.ga-group.nl/ics/bics/1812101611
is replaced by: http://data.ga-group.nl/ics/bics/2020/1010121211
is version of: http://data.ga-group.nl/ics/bics/1010121211
is version of: http://data.ga-group.nl/ics/bics/1812101611
imported on: 2026-06-08T13:03:47.798Z
last refreshed on: 2026-06-08T13:03:47.798Z
source accessed on: 2019-12-03T20:05:01Z
source last accessed on: 2019-12-03T20:05:01Z
label: Abgepackte Spiele @de
label: Giochi confezionati @it
label: Jeux emballés @fr
label: Jogos embalados @pt
label: Juegos embalados @es
label: Упак. игры @ru
label: 套裝遊戲 @zh-hant
label: 打包游戏 @zh
label: 패키지 게임 @ko
label: ﾊﾟｯｹｰｼﾞｹﾞｰﾑ @ja
definition: This segment includes companies that publish and distribute video game software over traditional retail channels. These video games are sold in a packaged case on a disc format.
notation: 1812101611
valid from: 2014-08-08
valid till: 2020-10-03

Game Distribution
type: BicsLevel5Segment
type: Classifier
type: Discontinued
type: NamedIndividual
is level5 segment of: Video Game Software
is contemporary version of: http://data.ga-group.nl/ics/bics/1812101612
is version of: http://data.ga-group.nl/ics/bics/1812101612
imported on: 2026-06-08T13:03:47.798Z
last refreshed on: 2026-06-08T13:03:47.798Z
source accessed on: 2019-12-03T20:05:01Z
source last accessed on: 2019-12-03T20:05:01Z
label: Distribución de juegos @es
label: Distribuição de jogos @pt
label: Distribution de jeux @fr
label: Distribuzione giochi @it
label: Spielvertrieb @de
label: Распространение игр @ru
label: 游戏代理 @zh
label: 遊戲經銷 @zh-hant
label: 게임 배급 @ko
label: ｹﾞｰﾑ卸売業 @ja
definition: This segment includes companies that wholesale and distribute video games. Excludes companies that develop their own video game software and distribute it.
notation: 1812101612
valid from: 2014-08-08
valid till: 2020-10-03

Video Game Software
type: BicsLevel4SubIndustry
type: Classifier
type: NamedIndividual
is sub industry of: Application Software
is anachronous version of: http://data.ga-group.nl/ics/bics/10101212
is contemporary version of: http://data.ga-group.nl/ics/bics/18121016
is replaced by: http://data.ga-group.nl/ics/bics/2020/10101212
is version of: http://data.ga-group.nl/ics/bics/10101212
is version of: http://data.ga-group.nl/ics/bics/18121016
imported on: 2026-06-08T13:03:47.798Z
last refreshed on: 2026-06-08T13:03:47.798Z
source accessed on: 2019-12-03T20:05:01Z
source last accessed on: 2019-12-03T20:05:01Z
label: Jeux vidéo @fr
label: Juegos de video @es
label: Prod software giochi @it
label: Software de jogos de vídeo @pt
label: Videospiel-Software @de
label: Прогр. обеспеч. видео игр @ru
label: 电子游戏软件 @zh
label: 電玩遊戲軟體 @zh-hant
label: 비디오게임SW @ko
label: ﾋﾞﾃﾞｵｹﾞｰﾑ･ｿﾌﾄｳｴｱ @ja
definition: This industry subgroup includes companies that publish and/or distribute video game software. Such software includes games developed for consoles, handhelds and personal computers.
notation: 18121016
valid from: 2014-08-08
valid till: 2020-10-03

Other Application Software
type: BicsLevel4SubIndustry
type: Classifier
type: Discontinued
type: NamedIndividual
is sub industry of: Application Software
is contemporary version of: http://data.ga-group.nl/ics/bics/18121017
is version of: http://data.ga-group.nl/ics/bics/18121017
imported on: 2026-06-08T13:03:47.798Z
last refreshed on: 2026-06-08T13:03:47.798Z
source accessed on: 2019-12-03T20:05:01Z
source last accessed on: 2019-12-03T20:05:01Z
label: Altri software applicativi @it
label: Autres logiciels d'applications @fr
label: Otro Software de aplicación @es
label: Software-Outras aplicações @pt
label: Sonstige Applikationssoftware @de
label: Другое программное обеспечение @ru
label: その他ｱﾌﾟﾘｹｰｼｮﾝｿﾌﾄｳｴｱ @ja
label: 其他应用软件 @zh
label: 其他應用軟體 @zh-hant
label: 기타 애플리케이션 소프트웨어 @ko
definition: This industry subgroup includes companies that develop speech recognition and optical character recognition systems.
notation: 18121017
valid from: 2014-08-08
valid till: 2020-10-03

Application Software
type: BicsLevel3Industry
type: Classifier
type: NamedIndividual
is industry of: Logiciel
is anachronous version of: http://data.ga-group.nl/ics/bics/19111010
is contemporary version of: http://data.ga-group.nl/ics/bics/181210
is replaced by: http://data.ga-group.nl/ics/bics/2020/19111010
is version of: http://data.ga-group.nl/ics/bics/181210
is version of: http://data.ga-group.nl/ics/bics/19111010
imported on: 2026-06-08T13:03:47.798Z
last refreshed on: 2026-06-08T13:03:47.798Z
source accessed on: 2019-12-03T20:05:01Z
source last accessed on: 2019-12-03T20:05:01Z
label: Anwendungssoftware @de
label: Logiciel application @fr
label: Software aplicação @pt
label: Software aplicación @es
label: Software applicativo @it
label: Прогр. обеспечение @ru
label: 应用软件 @zh
label: 應用軟體 @zh-hant
label: 애플리케이션SW @ko
label: ｱﾌﾟﾘｹｰｼｮﾝ･ｿﾌﾄｳｴｱ @ja
definition: This industry includes companies that develop application software. Typically, application software is designed to assist or perform a specific activity and require infrastructure software to operate.
notation: 181210
valid from: 2014-08-08
valid till: 2020-10-03

Infra as a Service (IaaS)
type: BicsLevel5Segment
type: Classifier
type: Discontinued
type: NamedIndividual
is level5 segment of: Cloud & Virtualization
is contemporary version of: http://data.ga-group.nl/ics/bics/1812111010
is version of: http://data.ga-group.nl/ics/bics/1812111010
imported on: 2026-06-08T13:03:47.798Z
last refreshed on: 2026-06-08T13:03:47.798Z
source accessed on: 2019-12-03T20:05:01Z
source last accessed on: 2019-12-03T20:05:01Z
label: Infra As A Service (IAAS) @de
label: Infra come servizio (IAAS) @it
label: Infra comme service (IAAS) @fr
label: Infra como serviço (IAAS) @pt
label: Infra como servicio (IAAS) @es
label: Инфраструктура в виде услуги (IAAS) @ru
label: 基础设施即服务 (IAAS) @zh
label: 基礎設施即服務（IAAS） @zh-hant
label: 서비스형 인프라(IAAS) @ko
label: ｲﾝﾌﾗ･ｱｽﾞ･ｱ･ｻｰﾋﾞｽ(IaaS) @ja
definition: This segment includes companies that provide customers access to hardware resources, such as virtual machines, raw block storage, firewalls, IP addresses and virtual local area networks (VLANs), via cloud computing. These companies own, maintain and operate the computer hardware underneath but allow customers to access these resources as a service. This service outsources the maintenance and costs of the computing hardware.
notation: 1812111010
valid from: 2014-08-08
valid till: 2020-10-03

Platform as a Service (PaaS)
type: BicsLevel5Segment
type: Classifier
type: Discontinued
type: NamedIndividual
is level5 segment of: Cloud & Virtualization
is contemporary version of: http://data.ga-group.nl/ics/bics/1812111011
is version of: http://data.ga-group.nl/ics/bics/1812111011
imported on: 2026-06-08T13:03:47.798Z
last refreshed on: 2026-06-08T13:03:47.798Z
source accessed on: 2019-12-03T20:05:01Z
source last accessed on: 2019-12-03T20:05:01Z
label: Piattaforma come servizio (PAAS) @it
label: Plataforma como servicio (PAAS) @es
label: Plataforma como um serviço (PAAS) @pt
label: Plate-forme comme service (PAAS) @fr
label: Platform As A Service (PAAS) @de
label: Платформа в виде услуги (PAAS) @ru
label: 平台即服务 (PAAS) @zh
label: 平台即服務（PAAS） @zh-hant
label: 서비스형 플랫폼 (PAAS) @ko
label: ﾌﾟﾗｯﾄﾌｫｰﾑ･ｱｽﾞ･ｱ･ｻｰﾋﾞｽ(PaaS) @ja
definition: This segment includes companies that provides services from infrastructure software based on cloud computing. These services provide application software developers an environment to develop and operate their software. This service outsources the maintenance and costs of the infrastructure software and computing hardware.
notation: 1812111011
valid from: 2014-08-08
valid till: 2020-10-03

Virtualization
type: BicsLevel5Segment
type: Classifier
type: Discontinued
type: NamedIndividual
is level5 segment of: Cloud & Virtualization
is contemporary version of: http://data.ga-group.nl/ics/bics/1812111012
is version of: http://data.ga-group.nl/ics/bics/1812111012
imported on: 2026-06-08T13:03:47.798Z
last refreshed on: 2026-06-08T13:03:47.798Z
source accessed on: 2019-12-03T20:05:01Z
source last accessed on: 2019-12-03T20:05:01Z
label: Virtual @es
label: Virtualisation @fr
label: Virtualisierung @de
label: Virtualização @pt
label: Virtualizzaz @it
label: Виртуализация @ru
label: 虚拟化 @zh
label: 虛擬化 @zh-hant
label: 가상화 @ko
label: ﾊﾞｰﾁｬﾘｾﾞｰｼｮﾝ @ja
definition: This segment includes companies that develop virtualization software.
notation: 1812111012
valid from: 2014-08-08
valid till: 2020-10-03

Cloud & Virtualization
type: BicsLevel4SubIndustry
type: Classifier
type: NamedIndividual
is sub industry of: Infrastructure Software
is anachronous version of: http://data.ga-group.nl/ics/bics/1911101110
is contemporary version of: http://data.ga-group.nl/ics/bics/18121110
is replaced by: http://data.ga-group.nl/ics/bics/2020/1911101110
is version of: http://data.ga-group.nl/ics/bics/18121110
is version of: http://data.ga-group.nl/ics/bics/1911101110
imported on: 2026-06-08T13:03:47.798Z
last refreshed on: 2026-06-08T13:03:47.798Z
source accessed on: 2019-12-03T20:05:01Z
source last accessed on: 2019-12-03T20:05:01Z
label: Cloud & Virtualisierung @de
label: Cloud e virtualização @pt
label: Cloud e virtualizzazione @it
label: Cloud y visualización @es
label: Nuage et virtualisation @fr
label: Удаленное хранилище данных и виртуализация @ru
label: 云及虚拟化 @zh
label: 雲端與虛擬化 @zh-hant
label: 클라우드 & 가상화 @ko
label: ｸﾗｳﾄﾞ&仮想化 @ja
definition: This industry subgroup includes companies that develop and operate cloud and virtualization services. Excludes services provided by application software using cloud computing (see Software as a Service).
notation: 18121110
valid from: 2014-08-08
valid till: 2020-10-03

Database Software
type: BicsLevel4SubIndustry
type: Classifier
type: NamedIndividual
is sub industry of: Infrastructure Software
is anachronous version of: http://data.ga-group.nl/ics/bics/1911101111
is contemporary version of: http://data.ga-group.nl/ics/bics/18121111
is replaced by: http://data.ga-group.nl/ics/bics/2020/1911101111
is version of: http://data.ga-group.nl/ics/bics/18121111
is version of: http://data.ga-group.nl/ics/bics/1911101111
imported on: 2026-06-08T13:03:47.798Z
last refreshed on: 2026-06-08T13:03:47.798Z
source accessed on: 2019-12-03T20:05:01Z
source last accessed on: 2019-12-03T20:05:01Z
label: Datenbank-Software @de
label: Logiciel base de données @fr
label: Software de banco de dados @pt
label: Software de base de datos @es
label: Программное обеспечение для баз данных @ru
label: 数据库软件 @zh
label: 資料庫軟體 @zh-hant
label: 데이터베이스 소프트웨어 @ko
label: ﾃﾞｰﾀﾍﾞｰｽ･ｿﾌﾄｳｴｱ @ja
definition: This industry subgroup includes companies that develop, license and maintain database software.
notation: 18121111
valid from: 2014-08-08
valid till: 2020-10-03

Middleware
type: BicsLevel4SubIndustry
type: Classifier
type: Discontinued
type: NamedIndividual
is sub industry of: Infrastructure Software
is contemporary version of: http://data.ga-group.nl/ics/bics/18121112
is version of: http://data.ga-group.nl/ics/bics/18121112
imported on: 2026-06-08T13:03:47.798Z
last refreshed on: 2026-06-08T13:03:47.798Z
source accessed on: 2019-12-03T20:05:01Z
source last accessed on: 2019-12-03T20:05:01Z
label: Программное обеспечение средней сложности @ru
label: 中介軟體 @zh-hant
label: 中间件 @zh
label: 미들웨어 @ko
label: ﾐﾄﾞﾙｳｴｱ @ja
definition: This industry subgroup includes companies that develop middleware software. Middleware connects various software components or applications. Includes Web servers, application servers and enterprise messaging systems.
notation: 18121112
valid from: 2014-08-08
valid till: 2020-10-03

Security
type: BicsLevel4SubIndustry
type: Classifier
type: NamedIndividual
is sub industry of: Infrastructure Software
is anachronous version of: http://data.ga-group.nl/ics/bics/1911101112
is contemporary version of: http://data.ga-group.nl/ics/bics/18121113
is replaced by: http://data.ga-group.nl/ics/bics/2020/1911101112
is version of: http://data.ga-group.nl/ics/bics/18121113
is version of: http://data.ga-group.nl/ics/bics/1911101112
imported on: 2026-06-08T13:03:47.798Z
last refreshed on: 2026-06-08T13:03:47.798Z
source accessed on: 2019-12-03T20:05:01Z
source last accessed on: 2019-12-03T20:05:01Z
label: Sécurité @fr
label: Segurança @pt
label: Seguridad @es
label: Sicherheit @de
label: Sicurezza @it
label: Бумага @ru
label: 保全 @zh-hant
label: 安全 @zh
label: 보안 @ko
label: ｾｷｭﾘﾃｨ @ja
definition: This industry subgroup includes companies that develop computer security and recovery software for consumer applications. Such software includes anti-virus software, system resource recovery software and system backup.
notation: 18121113
valid from: 2014-08-08
valid till: 2020-10-03

Storage Software
type: BicsLevel4SubIndustry
type: Classifier
type: Discontinued
type: NamedIndividual
is sub industry of: Infrastructure Software
is contemporary version of: http://data.ga-group.nl/ics/bics/18121114
is version of: http://data.ga-group.nl/ics/bics/18121114
imported on: 2026-06-08T13:03:47.798Z
last refreshed on: 2026-06-08T13:03:47.798Z
source accessed on: 2019-12-03T20:05:01Z
source last accessed on: 2019-12-03T20:05:01Z
label: Logiciel de stockage @fr
label: Software de almacenaje @es
label: Software de armazenagem @pt
label: Software di archiviazione @it
label: Speicher-Software @de
label: Архив. программное обеспечение @ru
label: 保存用ｿﾌﾄｳｴｱ @ja
label: 储存软件 @zh
label: 儲存軟體 @zh-hant
label: 스토리지 소프트웨어 @ko
definition: This industry subgroup includes companies that develop software design to optimize, configure or back up data for storage devices.
notation: 18121114
valid from: 2014-08-08
valid till: 2020-10-03

Network & Performance Mgmt
type: BicsLevel5Segment
type: Classifier
type: Discontinued
type: NamedIndividual
is level5 segment of: System Software
is contemporary version of: http://data.ga-group.nl/ics/bics/1812111510
is version of: http://data.ga-group.nl/ics/bics/1812111510
imported on: 2026-06-08T13:03:47.798Z
last refreshed on: 2026-06-08T13:03:47.798Z
source accessed on: 2019-12-03T20:05:01Z
source last accessed on: 2019-12-03T20:05:01Z
label: Gestão de rede e desempenho @pt
label: Gestión de red y desempeño @es
label: Gestion de réseau et performance @fr
label: Gestione rete e performance @it
label: Netzwerk- & Performance-Management @de
label: Управл. сетью и еффективн. @ru
label: 網路與效能管理 @zh-hant
label: 网络与性能管理 @zh
label: 네트워크 & 운용실적 관리 @ko
label: ﾈｯﾄﾜｰｸ&ﾊﾟﾌｫｰﾏﾝｽ管理 @ja
definition: This segment includes companies that develop software designed to optimize, configure or maintain computer networks.
notation: 1812111510
valid from: 2014-08-08
valid till: 2020-10-03

Operating Systems
type: BicsLevel5Segment
type: Classifier
type: Discontinued
type: NamedIndividual
is level5 segment of: System Software
is contemporary version of: http://data.ga-group.nl/ics/bics/1812111511
is version of: http://data.ga-group.nl/ics/bics/1812111511
imported on: 2026-06-08T13:03:47.798Z
last refreshed on: 2026-06-08T13:03:47.798Z
source accessed on: 2019-12-03T20:05:01Z
source last accessed on: 2019-12-03T20:05:01Z
label: Betriebssysteme @de
label: Sistema operativi @it
label: Sistemas operac @es
label: Sistemas operacionais @pt
label: Syst d'exploitation @fr
label: Операционные системы @ru
label: 操作系統 @zh-hant
label: 操作系统 @zh
label: 운영시스템 @ko
label: ｵﾍﾟﾚｰﾃｨﾝｸﾞｼｽﾃﾑ @ja
definition: This segment includes companies that develop operating systems.
notation: 1812111511
valid from: 2014-08-08
valid till: 2020-10-03

System Software
type: BicsLevel4SubIndustry
type: Classifier
type: NamedIndividual
is sub industry of: Infrastructure Software
is anachronous version of: http://data.ga-group.nl/ics/bics/1911101113
is contemporary version of: http://data.ga-group.nl/ics/bics/18121115
is replaced by: http://data.ga-group.nl/ics/bics/2020/1911101113
is version of: http://data.ga-group.nl/ics/bics/18121115
is version of: http://data.ga-group.nl/ics/bics/1911101113
imported on: 2026-06-08T13:03:47.798Z
last refreshed on: 2026-06-08T13:03:47.798Z
source accessed on: 2019-12-03T20:05:01Z
source last accessed on: 2019-12-03T20:05:01Z
label: Betriebssystem @de
label: Logiciel système @fr
label: Software de sistema @es
label: Software di sistema @it
label: Сист. программное обеспечение @ru
label: 系統軟體 @zh-hant
label: 系统软件 @zh
label: 시스템 소프트웨어 @ko
label: ｼｽﾃﾑ･ｿﾌﾄｳｴｱ @ja
definition: This industry subgroup includes companies that develop software that is designed to interface with hardware and provide a platform for application software to operate in.
notation: 18121115
valid from: 2014-08-08
valid till: 2020-10-03

Other Infra Software
type: BicsLevel4SubIndustry
type: Classifier
type: Discontinued
type: NamedIndividual
is sub industry of: Infrastructure Software
is contemporary version of: http://data.ga-group.nl/ics/bics/18121116
is version of: http://data.ga-group.nl/ics/bics/18121116
imported on: 2026-06-08T13:03:47.798Z
last refreshed on: 2026-06-08T13:03:47.798Z
source accessed on: 2019-12-03T20:05:01Z
source last accessed on: 2019-12-03T20:05:01Z
label: Altri software infra @it
label: Autres logiciels infra @fr
label: Otro Software de infraestructura @es
label: Outros software de infra @pt
label: Sonstige Infrastruktursoftware @de
label: Прочее ПО для инфраструктуры @ru
label: その他基盤ｿﾌﾄｳｴｱ @ja
label: 其他基础设施软件 @zh
label: 其他基礎建設軟體 @zh-hant
label: 기타 인프라소프트웨어 @ko
definition: This industry subgroup includes companies that develop infrastructure software not elsewhere classified.
notation: 18121116
valid from: 2014-08-08
valid till: 2020-10-03

Infrastructure Software
type: BicsLevel3Industry
type: Classifier
type: NamedIndividual
is industry of: Logiciel
is anachronous version of: http://data.ga-group.nl/ics/bics/19111011
is contemporary version of: http://data.ga-group.nl/ics/bics/181211
is replaced by: http://data.ga-group.nl/ics/bics/2020/19111011
is version of: http://data.ga-group.nl/ics/bics/181211
is version of: http://data.ga-group.nl/ics/bics/19111011
imported on: 2026-06-08T13:03:47.798Z
last refreshed on: 2026-06-08T13:03:47.798Z
source accessed on: 2019-12-03T20:05:01Z
source last accessed on: 2019-12-03T20:05:01Z
label: Infrastruktur-Software @de
label: Logiciel infrastruct @fr
label: Softw infrastrutture @it
label: Software infraest @pt
label: Software infraestr @es
label: Прогр. обеспеч. инфраструкт. @ru
label: 基础设施软件 @zh
label: 基礎建設軟體 @zh-hant
label: 인프라소프트웨어 @ko
label: ｲﾝﾌﾗ･ｿﾌﾄｳｴｱ @ja
definition: This industry includes companies that develop infrastructure as well as middleware software and cloud and virtualization services. Infrastructure software controls the operation and management of computing infrastructure resources and includes operating systems, virtualization software, database management systems, data protection and recovery systems for enterprises, and enterprise software development tools. Middleware connects various software components or applications and includes Web servers, application servers and enterprise messaging systems.
notation: 181211
valid from: 2014-08-08
valid till: 2020-10-03

Logiciel
type: BicsLevel2IndustryGroup
type: Classifier
type: NamedIndividual
is industry group of: Technology
is anachronous version of: http://data.ga-group.nl/ics/bics/191110
is contemporary version of: http://data.ga-group.nl/ics/bics/1812
is replaced by: http://data.ga-group.nl/ics/bics/2020/191110
is version of: http://data.ga-group.nl/ics/bics/1812
is version of: http://data.ga-group.nl/ics/bics/191110
imported on: 2026-06-08T13:03:47.798Z
last refreshed on: 2026-06-08T13:03:47.798Z
source accessed on: 2019-12-03T20:05:01Z
source last accessed on: 2019-12-03T20:05:01Z
label: Software
label: Программное обеспечение @ru
label: 軟體 @zh-hant
label: 软件 @zh
label: 소프트웨어 @ko
label: ｿﾌﾄｳｴｱ @ja
definition: This industry group includes companies in the software industry group.
notation: 1812
valid from: 2014-08-08
valid till: 2020-10-03

EMS
type: BicsLevel4SubIndustry
type: Classifier
type: NamedIndividual
is sub industry of: EMS/ODM
is anachronous version of: http://data.ga-group.nl/ics/bics/1910101510
is contemporary version of: http://data.ga-group.nl/ics/bics/18131010
is replaced by: http://data.ga-group.nl/ics/bics/2020/1910101510
is version of: http://data.ga-group.nl/ics/bics/18131010
is version of: http://data.ga-group.nl/ics/bics/1910101510
imported on: 2026-06-08T13:03:47.798Z
last refreshed on: 2026-06-08T13:03:47.798Z
source accessed on: 2019-12-03T20:05:01Z
source last accessed on: 2019-12-03T20:05:01Z
label: EMS(電子機器受託製造ｻｰﾋﾞｽ) @ja
definition: This industry subgroup includes companies that provide electronics manufacturing services (EMS). Such companies provide technology product manufacturing and assembly services on a contract basis.
notation: 18131010
valid from: 2014-08-08
valid till: 2020-10-03

ODM
type: BicsLevel4SubIndustry
type: Classifier
type: NamedIndividual
is sub industry of: EMS/ODM
is anachronous version of: http://data.ga-group.nl/ics/bics/1910101511
is contemporary version of: http://data.ga-group.nl/ics/bics/18131011
is replaced by: http://data.ga-group.nl/ics/bics/2020/1910101511
is version of: http://data.ga-group.nl/ics/bics/18131011
is version of: http://data.ga-group.nl/ics/bics/1910101511
imported on: 2026-06-08T13:03:47.798Z
last refreshed on: 2026-06-08T13:03:47.798Z
source accessed on: 2019-12-03T20:05:01Z
source last accessed on: 2019-12-03T20:05:01Z
label: ODM(設計製造受託ｻｰﾋ���ｽ) @ja
definition: This industry subgroup includes companies that provide original design manufacturing (ODM) services. Unlike pure contract manufacturers, ODM firms also design products that they may sell under their own brand name in addition to what is marketed under the original equipment manufacturer (OEM).
notation: 18131011
valid from: 2014-08-08
valid till: 2020-10-03

EMS/ODM
type: BicsLevel3Industry
type: Classifier
type: NamedIndividual
is industry of: Design, Mfg & Distribution
is anachronous version of: http://data.ga-group.nl/ics/bics/19101015
is contemporary version of: http://data.ga-group.nl/ics/bics/181310
is replaced by: http://data.ga-group.nl/ics/bics/2020/19101015
is version of: http://data.ga-group.nl/ics/bics/181310
is version of: http://data.ga-group.nl/ics/bics/19101015
imported on: 2026-06-08T13:03:47.798Z
last refreshed on: 2026-06-08T13:03:47.798Z
source accessed on: 2019-12-03T20:05:01Z
source last accessed on: 2019-12-03T20:05:01Z
label: EMS･ODM @ja
definition: This industry includes companies that provide electronics manufacturing services (EMS) or original design manufacturing (ODM) services. These companies are contract manufacturers that provide outsource manufacturing services for hardware companies and may manufacture their own brand-name products in addition to their outsourcing services.
notation: 181310
valid from: 2014-08-08
valid till: 2020-10-03

Technology Distributors
type: BicsLevel3Industry
type: Classifier
type: NamedIndividual
is industry of: Design, Mfg & Distribution
is anachronous version of: http://data.ga-group.nl/ics/bics/19101016
is contemporary version of: http://data.ga-group.nl/ics/bics/181311
is replaced by: http://data.ga-group.nl/ics/bics/2020/19101016
is version of: http://data.ga-group.nl/ics/bics/181311
is version of: http://data.ga-group.nl/ics/bics/19101016
imported on: 2026-06-08T13:03:47.798Z
last refreshed on: 2026-06-08T13:03:47.798Z
source accessed on: 2019-12-03T20:05:01Z
source last accessed on: 2019-12-03T20:05:01Z
label: Distr tecnologia @pt
label: Distrib de technologie @fr
label: Distrib tecnología @es
label: Distributori tecnologia @it
label: TechnVertrieb @de
label: Дистрибьюторы технологий @ru
label: 技术分销商 @zh
label: 科技經銷商 @zh-hant
label: 기술 공급업체 @ko
label: ﾃｸﾉﾛｼﾞｰﾃﾞｨｽﾄﾘﾋﾞｭｰﾀ @ja
definition: This industry includes companies who specialize in distributing hardware, electronics components, software and services utilized for technology products. Typically, these companies act as the suppliers to technology hardware manufacturers (OEM/EMS/ODM) sourcing components and parts that will be integrated into their final products.
notation: 181311
valid from: 2014-08-08
valid till: 2020-10-03

Design, Mfg & Distribution
type: BicsLevel2IndustryGroup
type: Classifier
type: Discontinued
type: NamedIndividual
is industry group of: Technology
is contemporary version of: http://data.ga-group.nl/ics/bics/1813
is version of: http://data.ga-group.nl/ics/bics/1813
imported on: 2026-06-08T13:03:47.798Z
last refreshed on: 2026-06-08T13:03:47.798Z
source accessed on: 2019-12-03T20:05:01Z
source last accessed on: 2019-12-03T20:05:01Z
label: Design, Fabrication et Distribution @fr
label: Design, Herstellung & Vertrieb @de
label: Design, manufatura e distribuição @pt
label: Diseño, fabricación y distribución @es
label: Progettaz, produz e distribuzione @it
label: Дизайн, производство и распространение @ru
label: 設計、製造及經銷 @zh-hant
label: 設計･製造･販売 @ja
label: 设计、制造与分销 @zh
label: 디자인, 제조 & 유통 @ko
definition: This industry group includes companies in the technology sector that design, manufacture or distribute technology hardware, software or services.
notation: 1813
valid from: 2014-08-08
valid till: 2020-10-03

Business Process Outsourcing
type: BicsLevel5Segment
type: Classifier
type: NamedIndividual
is level5 segment of: IT Services - Commercial
is anachronous version of: http://data.ga-group.nl/ics/bics/191111101010
is contemporary version of: http://data.ga-group.nl/ics/bics/1814101010
is replaced by: http://data.ga-group.nl/ics/bics/2020/191111101010
is version of: http://data.ga-group.nl/ics/bics/1814101010
is version of: http://data.ga-group.nl/ics/bics/191111101010
imported on: 2026-06-08T13:03:47.798Z
last refreshed on: 2026-06-08T13:03:47.798Z
source accessed on: 2019-12-03T20:05:01Z
source last accessed on: 2019-12-03T20:05:01Z
label: Contratação de serviços p/ processos empresariais @pt
label: Contratación de servicios con terceros para procesos empresariales @es
label: Esternalizzazione attività aziendali @it
label: Outsourcing: Geschäftsprozesse @de
label: Sous-trait processus d'entreprise @fr
label: Аутсорсинг бизнес-процессов (BPO) @ru
label: 业务流程外包 @zh
label: 商務流程委外 @zh-hant
label: 業務処理ｱｳﾄｿｰｼﾝｸﾞ @ja
label: 업무처리 외주업 @ko
definition: This segment includes companies that provide outsourced services related to operational business aspects and processes of the client company.
notation: 1814101010
valid from: 2014-08-08
valid till: 2020-10-03

IT Outsourcing
type: BicsLevel5Segment
type: Classifier
type: NamedIndividual
is level5 segment of: IT Services - Commercial
is anachronous version of: http://data.ga-group.nl/ics/bics/191111101011
is contemporary version of: http://data.ga-group.nl/ics/bics/1814101011
is replaced by: http://data.ga-group.nl/ics/bics/2020/191111101011
is version of: http://data.ga-group.nl/ics/bics/1814101011
is version of: http://data.ga-group.nl/ics/bics/191111101011
imported on: 2026-06-08T13:03:47.798Z
last refreshed on: 2026-06-08T13:03:47.798Z
source accessed on: 2019-12-03T20:05:01Z
source last accessed on: 2019-12-03T20:05:01Z
label: Esternalizzazione informatica @it
label: Externalisation IT @fr
label: IT 외주업 @ko
label: IT-Outsourcing @de
label: IT外包 @zh
label: IT業務委託 @ja
label: Serviços terceirizados de IT @pt
label: Subcontratación de tecnología de la información @es
label: Компьютерные усл. - Интегрированные решения @ru
label: 資訊科技外包 @zh-hant
definition: This segment includes companies that provide outsourced software development, IT administration and operations, network management, technology hardware maintenance and recovery activities.
notation: 1814101011
valid from: 2014-08-08
valid till: 2020-10-03

Network Integration Services
type: BicsLevel5Segment
type: Classifier
type: NamedIndividual
is level5 segment of: IT Services - Commercial
is anachronous version of: http://data.ga-group.nl/ics/bics/191111101012
is contemporary version of: http://data.ga-group.nl/ics/bics/1814101012
is replaced by: http://data.ga-group.nl/ics/bics/2020/191111101012
is version of: http://data.ga-group.nl/ics/bics/1814101012
is version of: http://data.ga-group.nl/ics/bics/191111101012
imported on: 2026-06-08T13:03:47.798Z
last refreshed on: 2026-06-08T13:03:47.798Z
source accessed on: 2019-12-03T20:05:01Z
source last accessed on: 2019-12-03T20:05:01Z
label: Netzwerkintegrationsdienste @de
label: Serviços de integração de rede @pt
label: Service d'intégration de réseaux @fr
label: Servicios de integración de redes @es
label: Servizi di reti integrate @it
label: Услуги сетевой интеграции @ru
label: 網路整合服務 @zh-hant
label: 网络集成服务 @zh
label: 네트워크 통합 서비스 @ko
label: ﾈｯﾄﾜｰｸ統合ｻｰﾋﾞｽ @ja
definition: This segment includes companies that design networks as well as install, manage and maintain network elements, such as transmission, switching and access systems.
notation: 1814101012
valid from: 2014-08-08
valid till: 2020-10-03

Technology Consulting
type: BicsLevel5Segment
type: Classifier
type: NamedIndividual
is level5 segment of: IT Services - Commercial
is anachronous version of: http://data.ga-group.nl/ics/bics/191111101013
is contemporary version of: http://data.ga-group.nl/ics/bics/1814101013
is replaced by: http://data.ga-group.nl/ics/bics/2020/191111101013
is version of: http://data.ga-group.nl/ics/bics/1814101013
is version of: http://data.ga-group.nl/ics/bics/191111101013
imported on: 2026-06-08T13:03:47.798Z
last refreshed on: 2026-06-08T13:03:47.798Z
source accessed on: 2019-12-03T20:05:01Z
source last accessed on: 2019-12-03T20:05:01Z
label: Asesoría de tecnología @es
label: Consulenza tecnologica @it
label: Services conseils Technologie @fr
label: Technologieberatung @de
label: Tecnologia e consultoria @pt
label: Консалтинг в области технологий @ru
label: 科技咨询 @zh
label: 科技顧問 @zh-hant
label: 기술 컨설팅 @ko
label: ﾃｸﾉﾛｼﾞｰ･ｺﾝｻﾙﾃｨﾝｸﾞ @ja
definition: This segment includes companies that provide IT design and strategy, IT operations assessment and IT maintenance planning.
notation: 1814101013
valid from: 2014-08-08
valid till: 2020-10-03

IT Services - Commercial
type: BicsLevel4SubIndustry
type: Classifier
type: NamedIndividual
is sub industry of: IT Services
is anachronous version of: http://data.ga-group.nl/ics/bics/1911111010
is contemporary version of: http://data.ga-group.nl/ics/bics/18141010
is replaced by: http://data.ga-group.nl/ics/bics/2020/1911111010
is version of: http://data.ga-group.nl/ics/bics/18141010
is version of: http://data.ga-group.nl/ics/bics/1911111010
imported on: 2026-06-08T13:03:47.798Z
last refreshed on: 2026-06-08T13:03:47.798Z
source accessed on: 2019-12-03T20:05:01Z
source last accessed on: 2019-12-03T20:05:01Z
label: IT 서비스 - 상업용 @ko
label: IT-Dienste - Gewerbe @de
label: IT服务-商业 @zh
label: ITｻｰﾋﾞｽ -商業 @ja
label: Serviços IT- Comercial @pt
label: Services IT - Commercial @fr
label: Servicios IT - Comerciales @es
label: Servizi IT - Commerciale @it
label: Услуги ИТ - Правительственные @ru
label: 資訊科技服務 - 商業 @zh-hant
definition: This industry subgroup includes companies that perform specialized IT functions for commercial companies. Services include IT outsourcing, technology consulting and business process outsourcing (BPO).
notation: 18141010
valid from: 2014-08-08
valid till: 2020-10-03

IT Services - Government
type: BicsLevel4SubIndustry
type: Classifier
type: NamedIndividual
is sub industry of: IT Services
is anachronous version of: http://data.ga-group.nl/ics/bics/1911111011
is contemporary version of: http://data.ga-group.nl/ics/bics/18141011
is replaced by: http://data.ga-group.nl/ics/bics/2020/1911111011
is version of: http://data.ga-group.nl/ics/bics/18141011
is version of: http://data.ga-group.nl/ics/bics/1911111011
imported on: 2026-06-08T13:03:47.798Z
last refreshed on: 2026-06-08T13:03:47.798Z
source accessed on: 2019-12-03T20:05:01Z
source last accessed on: 2019-12-03T20:05:01Z
label: IT 服务-政府 @zh
label: IT 서비스 - 정부 @ko
label: IT-Dienste - Staat @de
label: ITｻｰﾋﾞｽ-政府 @ja
label: Serviços IT - Governo @pt
label: Services IT - Gouvernement @fr
label: Servicios de información - Estado @es
label: Servizi informatici - Statali @it
label: ИТ услуги - Правительство @ru
label: 資訊科技服務 - 政府 @zh-hant
definition: This industry subgroup includes companies that provide IT services to government agencies.
notation: 18141011
valid from: 2014-08-08
valid till: 2020-10-03

IT Services
type: BicsLevel3Industry
type: Classifier
type: NamedIndividual
is industry of: Technology Services
is anachronous version of: http://data.ga-group.nl/ics/bics/19111110
is contemporary version of: http://data.ga-group.nl/ics/bics/181410
is replaced by: http://data.ga-group.nl/ics/bics/2020/19111110
is version of: http://data.ga-group.nl/ics/bics/181410
is version of: http://data.ga-group.nl/ics/bics/19111110
imported on: 2026-06-08T13:03:47.798Z
last refreshed on: 2026-06-08T13:03:47.798Z
source accessed on: 2019-12-03T20:05:01Z
source last accessed on: 2019-12-03T20:05:01Z
label: IT 服务 @zh
label: IT 서비스 @ko
label: IT-Dienste @de
label: ITｻｰﾋﾞｽ @ja
label: Serv informatica @es
label: Serviços IT @pt
label: Services IT @fr
label: Servizi IT @it
label: ИТ-услуги @ru
label: 資訊科技服務 @zh-hant
definition: This industry includes companies that provide IT services for commercial organizations and government agencies.
notation: 181410
valid from: 2014-08-08
valid till: 2020-10-03

Credit Agencies
type: BicsLevel5Segment
type: Classifier
type: NamedIndividual
is level5 segment of: Financial Info Services
is anachronous version of: http://data.ga-group.nl/ics/bics/141111131210
is anachronous version of: http://data.ga-group.nl/ics/bics/191111111010
is contemporary version of: http://data.ga-group.nl/ics/bics/1814111010
is replaced by: http://data.ga-group.nl/ics/bics/2020/191111111010
is version of: http://data.ga-group.nl/ics/bics/141111131210
is version of: http://data.ga-group.nl/ics/bics/1814111010
is version of: http://data.ga-group.nl/ics/bics/191111111010
imported on: 2026-06-08T13:03:47.798Z
last refreshed on: 2026-06-08T13:03:47.798Z
source accessed on: 2019-12-03T20:05:01Z
source last accessed on: 2019-12-03T20:05:01Z
label: Agências de crédito @pt
label: Agences de notation @fr
label: Agencias de crédito @es
label: Agenzie credito @it
label: Kreditbüros @de
label: Кредитные агентства @ru
label: 信用機構 @zh-hant
label: 信用調査 @ja
label: 信贷机构 @zh
label: 신용기관 @ko
definition: This segment includes companies that collect credit and employment information on individuals and businesses.
notation: 1814111010
valid from: 2014-08-08
valid till: 2020-10-03

Data & Analytics
type: BicsLevel5Segment
type: Classifier
type: NamedIndividual
is level5 segment of: Financial Info Services
is anachronous version of: http://data.ga-group.nl/ics/bics/141111131211
is anachronous version of: http://data.ga-group.nl/ics/bics/191111111011
is contemporary version of: http://data.ga-group.nl/ics/bics/1814111011
is replaced by: http://data.ga-group.nl/ics/bics/2020/191111111011
is version of: http://data.ga-group.nl/ics/bics/141111131211
is version of: http://data.ga-group.nl/ics/bics/1814111011
is version of: http://data.ga-group.nl/ics/bics/191111111011
imported on: 2026-06-08T13:03:47.798Z
last refreshed on: 2026-06-08T13:03:47.798Z
source accessed on: 2019-12-03T20:05:01Z
source last accessed on: 2019-12-03T20:05:01Z
label: Dados e análise @pt
label: Daten & Analyse @de
label: Dati e analisi @it
label: Datos y análisis @es
label: Données et analyses @fr
label: Данные и аналитика @ru
label: 数据和分析 @zh
label: 資料及分析 @zh-hant
label: 데이터 & 분석 @ko
label: ﾃﾞｰﾀ&分析 @ja
definition: This segment includes companies that provide pricing data, news and analytics along with trading capabilities across major asset classes.
notation: 1814111011
valid from: 2014-08-08
valid till: 2020-10-03

Indices
type: BicsLevel5Segment
type: Classifier
type: Discontinued
type: NamedIndividual
is level5 segment of: Financial Info Services
is contemporary version of: http://data.ga-group.nl/ics/bics/1814111012
is version of: http://data.ga-group.nl/ics/bics/1814111012
imported on: 2026-06-08T13:03:47.798Z
last refreshed on: 2026-06-08T13:03:47.798Z
source accessed on: 2019-12-03T20:05:01Z
source last accessed on: 2019-12-03T20:05:01Z
label: Indici @it
label: Indizes @de
label: Índices @es
label: Индексы @ru
label: 指数 @ja
label: 指數 @zh-hant
label: 지수 @ko
definition: This segment includes companies that create indices, exchange traded funds (ETFs) and portfolio analytics.
notation: 1814111012
valid from: 2014-08-08
valid till: 2020-10-03

Ratings Agencies
type: BicsLevel5Segment
type: Classifier
type: Discontinued
type: NamedIndividual
is level5 segment of: Financial Info Services
is contemporary version of: http://data.ga-group.nl/ics/bics/1814111013
is version of: http://data.ga-group.nl/ics/bics/1814111013
imported on: 2026-06-08T13:03:47.798Z
last refreshed on: 2026-06-08T13:03:47.798Z
source accessed on: 2019-12-03T20:05:01Z
source last accessed on: 2019-12-03T20:05:01Z
label: Agências de classificação @pt
label: Agences de rating @fr
label: Agencias de Ratings @es
label: Agenzie rating @it
label: Ratingagenturen @de
label: Рейтинговые агентства @ru
label: 格付機関 @ja
label: 評等機構 @zh-hant
label: 评级机构 @zh
label: 신용평가기관 @ko
definition: This segment includes companies that grade fixed income and other instruments.
notation: 1814111013
valid from: 2014-08-08
valid till: 2020-10-03

Financial Info Services
type: BicsLevel4SubIndustry
type: Classifier
type: NamedIndividual
is sub industry of: Information Services
is anachronous version of: http://data.ga-group.nl/ics/bics/1411111312
is anachronous version of: http://data.ga-group.nl/ics/bics/1911111110
is contemporary version of: http://data.ga-group.nl/ics/bics/18141110
is replaced by: http://data.ga-group.nl/ics/bics/2020/1911111110
is version of: http://data.ga-group.nl/ics/bics/1411111312
is version of: http://data.ga-group.nl/ics/bics/18141110
is version of: http://data.ga-group.nl/ics/bics/1911111110
imported on: 2026-06-08T13:03:47.798Z
last refreshed on: 2026-06-08T13:03:47.798Z
source accessed on: 2019-12-03T20:05:01Z
source last accessed on: 2019-12-03T20:05:01Z
label: Finanzieller Informationsservice @de
label: Serviços de informações financeiras @pt
label: Services d'information financière @fr
label: Servicios de información financiera @es
label: Servizi informazione finanziaria @it
label: Услуги финансовой информации @ru
label: 金融信息服务 @zh
label: 金融情報ｻｰﾋﾞｽ @ja
label: 金融資訊服務 @zh-hant
label: 금융 정보 서비스 @ko
definition: This industry subgroup includes companies that serve as credit or ratings agencies, provide pricing data, news and analytics, or create indices.
notation: 18141110
valid from: 2014-08-08
valid till: 2020-10-03

Energy Information
type: BicsLevel5Segment
type: Classifier
type: Discontinued
type: NamedIndividual
is level5 segment of: Non-Financial Info Services
is contemporary version of: http://data.ga-group.nl/ics/bics/1814111110
is version of: http://data.ga-group.nl/ics/bics/1814111110
imported on: 2026-06-08T13:03:47.798Z
last refreshed on: 2026-06-08T13:03:47.798Z
source accessed on: 2019-12-03T20:05:01Z
source last accessed on: 2019-12-03T20:05:01Z
label: Energieinformation @de
label: Informação de energia @pt
label: Información de energía @es
label: Information sur énergie @fr
label: Informaz energia @it
label: Информация об энергетике @ru
label: 能源信息 @zh
label: 能源資訊 @zh-hant
label: 에너지 정보 @ko
label: ｴﾈﾙｷﾞｰ情報 @ja
definition: This segment includes companies that provide industry information, data and analysis on the energy industry.
notation: 1814111110
valid from: 2014-08-08
valid till: 2020-10-03

Health Care Information
type: BicsLevel5Segment
type: Classifier
type: NamedIndividual
is level5 segment of: Non-Financial Info Services
is anachronous version of: http://data.ga-group.nl/ics/bics/191111111110
is contemporary version of: http://data.ga-group.nl/ics/bics/1814111111
is replaced by: http://data.ga-group.nl/ics/bics/2020/191111111110
is version of: http://data.ga-group.nl/ics/bics/1814111111
is version of: http://data.ga-group.nl/ics/bics/191111111110
imported on: 2026-06-08T13:03:47.798Z
last refreshed on: 2026-06-08T13:03:47.798Z
source accessed on: 2019-12-03T20:05:01Z
source last accessed on: 2019-12-03T20:05:01Z
label: Gesundheitsweseninformation @de
label: Informação sobre cuidados de saúde @pt
label: Información de salud @es
label: Information sur soins de santé @fr
label: Informazioni Sanità @it
label: Медицинская информация @ru
label: 医疗信息 @zh
label: 醫療保健資訊 @zh-hant
label: 헬스케어 정보 @ko
label: ﾍﾙｽｹｱ情報 @ja
definition: This segment includes companies that provide industry information, data and analysis on payers, providers and practitioners in the health care industry.
notation: 1814111111
valid from: 2014-08-08
valid till: 2020-10-03

Legal Information
type: BicsLevel5Segment
type: Classifier
type: NamedIndividual
is level5 segment of: Non-Financial Info Services
is anachronous version of: http://data.ga-group.nl/ics/bics/191111111111
is contemporary version of: http://data.ga-group.nl/ics/bics/1814111112
is replaced by: http://data.ga-group.nl/ics/bics/2020/191111111111
is version of: http://data.ga-group.nl/ics/bics/1814111112
is version of: http://data.ga-group.nl/ics/bics/191111111111
imported on: 2026-06-08T13:03:47.798Z
last refreshed on: 2026-06-08T13:03:47.798Z
source accessed on: 2019-12-03T20:05:01Z
source last accessed on: 2019-12-03T20:05:01Z
label: Informação legal @pt
label: Información jurídica @es
label: Information légale @fr
label: Informazioni legali @it
label: Juristische Information @de
label: Юридическая информация @ru
label: 法務情報 @ja
label: 法律信息 @zh
label: 法律資訊 @zh-hant
label: 법률 정보 @ko
definition: This segment includes companies that provide information, data and analysis in the legal industry.
notation: 1814111112
valid from: 2014-08-08
valid till: 2020-10-03

Real Estate Information
type: BicsLevel5Segment
type: Classifier
type: NamedIndividual
is level5 segment of: Non-Financial Info Services
is anachronous version of: http://data.ga-group.nl/ics/bics/191111111112
is contemporary version of: http://data.ga-group.nl/ics/bics/1814111113
is replaced by: http://data.ga-group.nl/ics/bics/2020/191111111112
is version of: http://data.ga-group.nl/ics/bics/1814111113
is version of: http://data.ga-group.nl/ics/bics/191111111112
imported on: 2026-06-08T13:03:47.798Z
last refreshed on: 2026-06-08T13:03:47.798Z
source accessed on: 2019-12-03T20:05:01Z
source last accessed on: 2019-12-03T20:05:01Z
label: Immobilieninformation @de
label: Informação imobiliária @pt
label: Información inmobiliaria @es
label: Information sur immobilier @fr
label: Informazioni immobili @it
label: Информация о недвижимости @ru
label: 不動產資訊 @zh-hant
label: 不動産情報 @ja
label: 房产信息 @zh
label: 부동산 정보 @ko
definition: This segment includes companies that provide information, data and analysis in the real estate industry.
notation: 1814111113
valid from: 2014-08-08
valid till: 2020-10-03

Scientific Information
type: BicsLevel5Segment
type: Classifier
type: NamedIndividual
is level5 segment of: Non-Financial Info Services
is anachronous version of: http://data.ga-group.nl/ics/bics/191111111113
is contemporary version of: http://data.ga-group.nl/ics/bics/1814111114
is replaced by: http://data.ga-group.nl/ics/bics/2020/191111111113
is version of: http://data.ga-group.nl/ics/bics/1814111114
is version of: http://data.ga-group.nl/ics/bics/191111111113
imported on: 2026-06-08T13:03:47.798Z
last refreshed on: 2026-06-08T13:03:47.798Z
source accessed on: 2019-12-03T20:05:01Z
source last accessed on: 2019-12-03T20:05:01Z
label: Informação científica @pt
label: Información científica @es
label: Information scientifique @fr
label: Informaz scientifica @it
label: Wissenschaftliche Information @de
label: Научная информация @ru
label: 科学信息 @zh
label: 科学情報 @ja
label: 科學資訊 @zh-hant
label: 과학 정보 @ko
definition: This segment includes companies that provide databases of research articles and scientific journals, news and analysis in the scientific industry.
notation: 1814111114
valid from: 2014-08-08
valid till: 2020-10-03

Technology Information
type: BicsLevel5Segment
type: Classifier
type: NamedIndividual
is level5 segment of: Non-Financial Info Services
is anachronous version of: http://data.ga-group.nl/ics/bics/191111111114
is contemporary version of: http://data.ga-group.nl/ics/bics/1814111115
is replaced by: http://data.ga-group.nl/ics/bics/2020/191111111114
is version of: http://data.ga-group.nl/ics/bics/1814111115
is version of: http://data.ga-group.nl/ics/bics/191111111114
imported on: 2026-06-08T13:03:47.798Z
last refreshed on: 2026-06-08T13:03:47.798Z
source accessed on: 2019-12-03T20:05:01Z
source last accessed on: 2019-12-03T20:05:01Z
label: Informação tecnológica @pt
label: Información de tecnología @es
label: Information sur technologie @fr
label: Technologie-Information @de
label: Tecnologia informazione @it
label: Технологическая информация @ru
label: 技術情報 @ja
label: 科技信息 @zh
label: 科技資訊 @zh-hant
label: 기술 정보 @ko
definition: This segment includes companies that provide information, data, news and analysis in the technology industry.
notation: 1814111115
valid from: 2014-08-08
valid till: 2020-10-03

Other Information
type: BicsLevel5Segment
type: Classifier
type: Discontinued
type: NamedIndividual
is level5 segment of: Non-Financial Info Services
is contemporary version of: http://data.ga-group.nl/ics/bics/1814111116
is version of: http://data.ga-group.nl/ics/bics/1814111116
imported on: 2026-06-08T13:03:47.798Z
last refreshed on: 2026-06-08T13:03:47.798Z
source accessed on: 2019-12-03T20:05:01Z
source last accessed on: 2019-12-03T20:05:01Z
label: Altre informazioni @it
label: Autre Information @fr
label: Otra información @es
label: Outras informações @pt
label: Sonstige Information @de
label: Прочая информация @ru
label: その他情報 @ja
label: 其他資訊 @zh-hant
label: 其他资料 @zh
label: 기타 정보 @ko
definition: This segment includes companies that provide information, data and analysis on other non-financial services industries not elsewhere classified.
notation: 1814111116
valid from: 2014-08-08
valid till: 2020-10-03

Non-Financial Info Services
type: BicsLevel4SubIndustry
type: Classifier
type: NamedIndividual
is sub industry of: Information Services
is anachronous version of: http://data.ga-group.nl/ics/bics/1911111111
is contemporary version of: http://data.ga-group.nl/ics/bics/18141111
is replaced by: http://data.ga-group.nl/ics/bics/2020/1911111111
is version of: http://data.ga-group.nl/ics/bics/18141111
is version of: http://data.ga-group.nl/ics/bics/1911111111
imported on: 2026-06-08T13:03:47.798Z
last refreshed on: 2026-06-08T13:03:47.798Z
source accessed on: 2019-12-03T20:05:01Z
source last accessed on: 2019-12-03T20:05:01Z
label: Nicht-finanz. Infoservice @de
label: Serv infos non financières @fr
label: Serviços de info não financeiras @pt
label: Servicios de información no financiera @es
label: Servizi info non finanziaria @it
label: Услуги нефинансовой информации @ru
label: 非金融信息服务 @zh
label: 非金融情報ｻｰﾋﾞｽ @ja
label: 非金融資訊服務 @zh-hant
label: 비금융 정보 서비스 @ko
definition: This industry subgroup includes companies that provide energy, health care, legal, real estate, scientific, technology and other information services.
notation: 18141111
valid from: 2014-08-08
valid till: 2020-10-03

Information Services
type: BicsLevel3Industry
type: Classifier
type: NamedIndividual
is industry of: Technology Services
is anachronous version of: http://data.ga-group.nl/ics/bics/19111111
is contemporary version of: http://data.ga-group.nl/ics/bics/181411
is replaced by: http://data.ga-group.nl/ics/bics/2020/19111111
is version of: http://data.ga-group.nl/ics/bics/181411
is version of: http://data.ga-group.nl/ics/bics/19111111
imported on: 2026-06-08T13:03:47.798Z
last refreshed on: 2026-06-08T13:03:47.798Z
source accessed on: 2019-12-03T20:05:01Z
source last accessed on: 2019-12-03T20:05:01Z
label: Informationsdienst @de
label: Serv informação @pt
label: Serv información @es
label: Services d'infos @fr
label: Servizi di informazione @it
label: Информац. услуги @ru
label: 信息服务 @zh
label: 情報ｻｰﾋﾞｽ @ja
label: 資訊服務 @zh-hant
label: 정보 서비스 @ko
definition: This industry includes companies that provide information services. These companies typically collect, store and/or create information. Customers access this information on a subscription or ad hoc basis.
notation: 181411
valid from: 2014-08-08
valid till: 2020-10-03

Data & Transact Processing
type: BicsLevel4SubIndustry
type: Classifier
type: NamedIndividual
is sub industry of: Payment & Data Processors
is anachronous version of: http://data.ga-group.nl/ics/bics/1911111211
is contemporary version of: http://data.ga-group.nl/ics/bics/18141210
is replaced by: http://data.ga-group.nl/ics/bics/2020/1911111211
is version of: http://data.ga-group.nl/ics/bics/18141210
is version of: http://data.ga-group.nl/ics/bics/1911111211
imported on: 2026-06-08T13:03:47.798Z
last refreshed on: 2026-06-08T13:03:47.798Z
source accessed on: 2019-12-03T20:05:01Z
source last accessed on: 2019-12-03T20:05:01Z
label: Daten- & Transaktionsverarbeiter @de
label: Dati e processori transazione @it
label: Procesadores de datos y transacciones @es
label: Processadores de dados e transações @pt
label: Traitement de données et transactions @fr
label: Обработка данных и сделок @ru
label: 数据与交易处理 @zh
label: 資料及交易處理商 @zh-hant
label: 데이터 & 거래 처리업 @ko
label: ﾃﾞｰﾀ･決済処理 @ja
definition: This industry subgroup includes companies that provide data processing services related to payroll and human resources information management. Such services include preparation of paychecks, summaries, earnings, payroll, tax returns, 401(k) recordkeeping, employee handbooks, and spending accounts.
notation: 18141210
valid from: 2014-08-08
valid till: 2020-10-03

Payment & Data Processors
type: BicsLevel3Industry
type: Classifier
type: NamedIndividual
is industry of: Technology Services
is anachronous version of: http://data.ga-group.nl/ics/bics/19111112
is contemporary version of: http://data.ga-group.nl/ics/bics/181412
is replaced by: http://data.ga-group.nl/ics/bics/2020/19111112
is version of: http://data.ga-group.nl/ics/bics/181412
is version of: http://data.ga-group.nl/ics/bics/19111112
imported on: 2026-06-08T13:03:47.798Z
last refreshed on: 2026-06-08T13:03:47.798Z
source accessed on: 2019-12-03T20:05:01Z
source last accessed on: 2019-12-03T20:05:01Z
label: Pagamenti e elaborazione dati @it
label: Proc dados e pgto @pt
label: Proces pagos y datos @es
label: Traitement paiements/données @fr
label: Zahlungs- & Datenverarbeitung @de
label: Обработка платежей и данных @ru
label: 付款及資料處理商 @zh-hant
label: 支付与数据处理 @zh
label: 決済･ﾃﾞｰﾀ処理 @ja
label: 결제 & 데이터 처리업체 @ko
definition: This industry includes companies that provide data and transaction processing services. Typically, these companies realize revenue on a fee basis and can include financial and non-financial transactions. Includes credit card processors, financial transaction processors and payroll processors. Excludes companies that hold underlying inventory risks related to transactions.
notation: 181412
valid from: 2014-08-08
valid till: 2020-10-03

Technology Services
type: BicsLevel2IndustryGroup
type: Classifier
type: NamedIndividual
is industry group of: Technology
is anachronous version of: http://data.ga-group.nl/ics/bics/191111
is contemporary version of: http://data.ga-group.nl/ics/bics/1814
is replaced by: http://data.ga-group.nl/ics/bics/2020/191111
is version of: http://data.ga-group.nl/ics/bics/1814
is version of: http://data.ga-group.nl/ics/bics/191111
imported on: 2026-06-08T13:03:47.798Z
last refreshed on: 2026-06-08T13:03:47.798Z
source accessed on: 2019-12-03T20:05:01Z
source last accessed on: 2019-12-03T20:05:01Z
label: Serviços de tecnologia @pt
label: Services technologiques @fr
label: Servicios de tecnología @es
label: Servizi tecnologici @it
label: Technologiedienste @de
label: Технологические услуги @ru
label: 技术服务 @zh
label: 技術ｻｰﾋﾞｽ @ja
label: 科技服務 @zh-hant
label: 기술 서비스 @ko
definition: This industry group includes companies that operate in information services, IT services and payment and data processors industries.
notation: 1814
valid from: 2014-08-08
valid till: 2020-10-03

Technology
type: BicsLevel1Sector
type: Classifier
type: NamedIndividual
is anachronous version of: http://data.ga-group.nl/ics/bics/19
is contemporary version of: http://data.ga-group.nl/ics/bics/18
is replaced by: http://data.ga-group.nl/ics/bics/2020/19
is version of: http://data.ga-group.nl/ics/bics/18
is version of: http://data.ga-group.nl/ics/bics/19
imported on: 2026-06-08T13:03:47.798Z
last refreshed on: 2026-06-08T13:03:47.798Z
source accessed on: 2019-12-03T20:05:01Z
source last accessed on: 2019-12-03T20:05:01Z
label: Technologie @de
label: Tecnología @es
label: Tecnologia @it
label: Технология @ru
label: 科技 @zh
label: 기술 @ko
label: ﾃｸﾉﾛｼﾞｰ @ja
definition: This sector includes companies that manufacture, design or develop technology related products and services.
notation: 18
valid from: 2014-08-08
valid till: 2020-10-03

Integrated Utilities
type: BicsLevel3Industry
type: Classifier
type: NamedIndividual
is industry of: Utilities
is anachronous version of: http://data.ga-group.nl/ics/bics/20101010
is contemporary version of: http://data.ga-group.nl/ics/bics/191010
is replaced by: http://data.ga-group.nl/ics/bics/2020/20101010
is version of: http://data.ga-group.nl/ics/bics/191010
is version of: http://data.ga-group.nl/ics/bics/20101010
imported on: 2026-06-08T13:03:47.798Z
last refreshed on: 2026-06-08T13:03:47.798Z
source accessed on: 2019-12-03T20:05:01Z
source last accessed on: 2019-12-03T20:05:01Z
label: Integrierte Versorgung @de
label: Serv coll intégrés @fr
label: Serv públ integr @pt
label: Serv pubbl integrati @it
label: Servs púb integrados @es
label: Интегрир. коммун. услуги @ru
label: 一体化公用事业 @zh
label: 整合型��用事業 @zh-hant
label: 総合公益事業 @ja
label: 통합 유틸리티 @ko
definition: This industry includes companies that operate across the electricity value chains from electricity generation to transmission/distribution networks.
notation: 191010
valid from: 2014-08-08
valid till: 2020-10-03

Coal & Lignite Electric - Reg
type: BicsLevel6Segment
type: Classifier
type: Discontinued
type: NamedIndividual
is level6 segment of: Fossil Electric - Regulated
is contemporary version of: http://data.ga-group.nl/ics/bics/191011101010
is version of: http://data.ga-group.nl/ics/bics/191011101010
imported on: 2026-06-08T13:03:47.798Z
last refreshed on: 2026-06-08T13:03:47.798Z
source accessed on: 2019-12-03T20:05:01Z
source last accessed on: 2019-12-03T20:05:01Z
label: Elec de carbón y lignito - reg @es
label: Elec lignite/charbon - Réglem @fr
label: Eletricidade a partir do carvão e lignite - Reg @pt
label: Elettricità carbone e lignite - Reg @it
label: Kohle- & Braunkohlestrom - reg. @de
label: Электр. посредством угля и черного угля - рег. @ru
label: 煤与褐煤发电-管制 @zh
label: 煤及褐煤發電-管制 @zh-hant
label: 石炭･褐炭発電-規制 @ja
label: 석탄 & 갈탄 전기-규제 @ko
definition: This segment includes companies that operate under regulated revenue arrangements to generate electricity from coal without utilizing carbon capture and storage (CCS).
notation: 191011101010
valid from: 2014-08-08
valid till: 2020-10-03

Gas Electric - Regulated
type: BicsLevel6Segment
type: Classifier
type: Discontinued
type: NamedIndividual
is level6 segment of: Fossil Electric - Regulated
is contemporary version of: http://data.ga-group.nl/ics/bics/191011101011
is version of: http://data.ga-group.nl/ics/bics/191011101011
imported on: 2026-06-08T13:03:47.798Z
last refreshed on: 2026-06-08T13:03:47.798Z
source accessed on: 2019-12-03T20:05:01Z
source last accessed on: 2019-12-03T20:05:01Z
label: Eléctrica de gas - regulada @es
label: Elec gaz - Réglem @fr
label: Eletricidade a partir do gás - Regulamentada @pt
label: Elettricità gas - Regolamentata @it
label: Gasstrom - reguliert @de
label: Газовое электричество - регулируемое @ru
label: 天然气发电-管制 @zh
label: 天然氣發電-管制 @zh-hant
label: 가스 전기-규제 @ko
label: ｶﾞｽ発電-規制 @ja
definition: This segment includes companies that operate under regulated revenue arrangements to generate electricity from natural gas without utilizing carbon capture and storage (CCS).
notation: 191011101011
valid from: 2014-08-08
valid till: 2020-10-03

Multi-Fuel Electric - Reg
type: BicsLevel6Segment
type: Classifier
type: Discontinued
type: NamedIndividual
is level6 segment of: Fossil Electric - Regulated
is contemporary version of: http://data.ga-group.nl/ics/bics/191011101012
is version of: http://data.ga-group.nl/ics/bics/191011101012
imported on: 2026-06-08T13:03:47.798Z
last refreshed on: 2026-06-08T13:03:47.798Z
source accessed on: 2019-12-03T20:05:01Z
source last accessed on: 2019-12-03T20:05:01Z
label: Dispositivos eléctricos multiceldas - reg @es
label: Elec multi-combu - Réglem @fr
label: Eletricidade a partir de vários combustíveis - Reg @pt
label: Elettricità multi combustibili - Reg @it
label: Strom aus mehr. Kraftstoffen - reg. @de
label: Эл-во на неск. видах топлива - регулир. @ru
label: 多燃料発電-規制 @ja
label: 多种燃料发电-管制 @zh
label: 多重燃料發電-管制 @zh-hant
label: 복합연료 전기-규제 @ko
definition: This segment includes companies that operate under regulated revenue arrangements to generate electricity from unspecified, or a variety of, fossil fuels without utilizing carbon capture and storage (CCS).
notation: 191011101012
valid from: 2014-08-08
valid till: 2020-10-03

Oil Electric - Regulated
type: BicsLevel6Segment
type: Classifier
type: Discontinued
type: NamedIndividual
is level6 segment of: Fossil Electric - Regulated
is contemporary version of: http://data.ga-group.nl/ics/bics/191011101013
is version of: http://data.ga-group.nl/ics/bics/191011101013
imported on: 2026-06-08T13:03:47.798Z
last refreshed on: 2026-06-08T13:03:47.798Z
source accessed on: 2019-12-03T20:05:01Z
source last accessed on: 2019-12-03T20:05:01Z
label: Eléctrica de petróleo - regulada @es
label: Elect pétrole - Réglem @fr
label: Eletricidade a partir do petróleo - Regulamentada @pt
label: Elettricità petrolio - Regolamentata @it
label: Ölstrom - reguliert @de
label: Электричеств�� на нефти - регулир. @ru
label: 石油发电-管制 @zh
label: 石油発電-規制 @ja
label: 石油發電-管制 @zh-hant
label: 석유 전기-규제 @ko
definition: This segment includes companies that operate under regulated revenue arrangements to generate electricity from liquid oil products without utilizing carbon capture and storage (CCS).
notation: 191011101013
valid from: 2014-08-08
valid till: 2020-10-03

Fossil Electric - Regulated
type: BicsLevel5Segment
type: Classifier
type: NamedIndividual
is level5 segment of: Fossil Electric Generation
is anachronous version of: http://data.ga-group.nl/ics/bics/201010111010
is contemporary version of: http://data.ga-group.nl/ics/bics/1910111010
is replaced by: http://data.ga-group.nl/ics/bics/2020/201010111010
is version of: http://data.ga-group.nl/ics/bics/1910111010
is version of: http://data.ga-group.nl/ics/bics/201010111010
imported on: 2026-06-08T13:03:47.798Z
last refreshed on: 2026-06-08T13:03:47.798Z
source accessed on: 2019-12-03T20:05:01Z
source last accessed on: 2019-12-03T20:05:01Z
label: Electricité fossile - Réglementée @fr
label: Eletricidade por combustível fóssil - regulamentada @pt
label: Elettrico fossile - regolato @it
label: Fósil eléctrico - Regulado @es
label: Strom aus fossilem Brennstoff - reguliert @de
label: Электричество на основе органич. топлива - Регулир. @ru
label: 化石燃料-規制 @ja
label: 化石燃料電力 - 管制 @zh-hant
label: 火电 - 管制 @zh
label: 화석 전기 - 규제 @ko
definition: This segment includes companies that operate under regulated revenue arrangements to generate electricity from fossil fuels, either with or without using carbon capture and storage (CCS).
notation: 1910111010
valid from: 2014-08-08
valid till: 2020-10-03

Coal & Lignite Elec - Unreg
type: BicsLevel6Segment
type: Classifier
type: Discontinued
type: NamedIndividual
is level6 segment of: Fossil Electric - Unreg
is contemporary version of: http://data.ga-group.nl/ics/bics/191011101110
is version of: http://data.ga-group.nl/ics/bics/191011101110
imported on: 2026-06-08T13:03:47.798Z
last refreshed on: 2026-06-08T13:03:47.798Z
source accessed on: 2019-12-03T20:05:01Z
source last accessed on: 2019-12-03T20:05:01Z
label: Elec charbon/lignite - Non réglem @fr
label: Elec de carbón y lignito - no reg @es
label: Eletricidade a partir do carvão e lignite - Não reg @pt
label: Elettricità carbone e lignite - Non reg @it
label: Kohle- & Braunkohlestrom - unreg. @de
label: Электр. посредством угля и черного угля - нерег. @ru
label: 煤与褐煤发电-非管制 @zh
label: 煤炭發電-非管制 @zh-hant
label: 石炭･褐炭発電-規制外 @ja
label: 석탄 & 갈탄 전기-비규제 @ko
definition: This segment includes companies that operate under unregulated revenue arrangements to generate electricity from coal without utilizing carbon capture and storage (CCS).
notation: 191011101110
valid from: 2014-08-08
valid till: 2020-10-03

Gas Electric - Unregulated
type: BicsLevel6Segment
type: Classifier
type: Discontinued
type: NamedIndividual
is level6 segment of: Fossil Electric - Unreg
is contemporary version of: http://data.ga-group.nl/ics/bics/191011101111
is version of: http://data.ga-group.nl/ics/bics/191011101111
imported on: 2026-06-08T13:03:47.798Z
last refreshed on: 2026-06-08T13:03:47.798Z
source accessed on: 2019-12-03T20:05:01Z
source last accessed on: 2019-12-03T20:05:01Z
label: Eléctrica de gas - no regulado @es
label: Elec gaz - Non réglementée @fr
label: Eletricidade a partir do gás - Não regulamentada @pt
label: Elettricità gas - Non regolamentata @it
label: Gasstrom - unreguliert @de
label: Газовое электричество - нерегулир. @ru
label: 天然气发电-非管制 @zh
label: 天然氣發電-非管制 @zh-hant
label: 가스 전기-비규제 @ko
label: ｶﾞｽ発電-規制外 @ja
definition: This segment includes companies that operate under unregulated revenue arrangements to generate electricity from natural gas without utilizing carbon capture and storage (CCS).
notation: 191011101111
valid from: 2014-08-08
valid till: 2020-10-03

Multi-Fuel Electric - Unreg
type: BicsLevel6Segment
type: Classifier
type: Discontinued
type: NamedIndividual
is level6 segment of: Fossil Electric - Unreg
is contemporary version of: http://data.ga-group.nl/ics/bics/191011101112
is version of: http://data.ga-group.nl/ics/bics/191011101112
imported on: 2026-06-08T13:03:47.798Z
last refreshed on: 2026-06-08T13:03:47.798Z
source accessed on: 2019-12-03T20:05:01Z
source last accessed on: 2019-12-03T20:05:01Z
label: Eléctrica multicelda - no reg @es
label: Elec multi-combu - Non réglem @fr
label: Eletricidade a partir de vários combustíveis - Não reg @pt
label: Elettricità multi combustibili - Non reg @it
label: Strom aus mehr. Kraftstoffen - unreg. @de
label: Эл-во на неск. видах топлива - нерегулир. @ru
label: 多燃料発電-規制外 @ja
label: 多种燃料发电-非管制 @zh
label: 多重燃料發電-非管制 @zh-hant
label: 복합연료 전기-비규제 @ko
definition: This segment includes companies that operate under unregulated revenue arrangements to generate electricity from unspecified, or a variety of, fossil fuels without utilizing carbon capture and storage (CCS).
notation: 191011101112
valid from: 2014-08-08
valid till: 2020-10-03

Oil Electric - Unregulated
type: BicsLevel6Segment
type: Classifier
type: Discontinued
type: NamedIndividual
is level6 segment of: Fossil Electric - Unreg
is contemporary version of: http://data.ga-group.nl/ics/bics/191011101113
is version of: http://data.ga-group.nl/ics/bics/191011101113
imported on: 2026-06-08T13:03:47.798Z
last refreshed on: 2026-06-08T13:03:47.798Z
source accessed on: 2019-12-03T20:05:01Z
source last accessed on: 2019-12-03T20:05:01Z
label: Eléctrica de petróleo - no regulado @es
label: Elec pétrole - Non réglementée @fr
label: Eletricidade a partir do petróleo - Não regulamentada @pt
label: Elettricità petrolio - Non regolamentata @it
label: Ölstrom - unreguliert @de
label: Электричество на нефти - нерегулир. @ru
label: 石油发电-非管制 @zh
label: 石油発電-規制外 @ja
label: 石油發電-非管制 @zh-hant
label: 석유 전기-비규제 @ko
definition: This segment includes companies that operate under unregulated revenue arrangements to generate electricity from liquid oil products without utilizing carbon capture and storage (CCS).
notation: 191011101113
valid from: 2014-08-08
valid till: 2020-10-03

Fossil Electric - Unreg
type: BicsLevel5Segment
type: Classifier
type: NamedIndividual
is level5 segment of: Fossil Electric Generation
is anachronous version of: http://data.ga-group.nl/ics/bics/201010111011
is contemporary version of: http://data.ga-group.nl/ics/bics/1910111011
is replaced by: http://data.ga-group.nl/ics/bics/2020/201010111011
is version of: http://data.ga-group.nl/ics/bics/1910111011
is version of: http://data.ga-group.nl/ics/bics/201010111011
imported on: 2026-06-08T13:03:47.798Z
last refreshed on: 2026-06-08T13:03:47.798Z
source accessed on: 2019-12-03T20:05:01Z
source last accessed on: 2019-12-03T20:05:01Z
label: Electricité fossile - Non réglementée @fr
label: Eletricidade por combustível fóssil - desregulamentada @pt
label: Elettricità fossile - non regol @it
label: Fósil eléctrico - No regulado @es
label: Strom aus fossilem Brennstoff - nicht reguliert @de
label: Электричество на основе органич. топлива - Нерегулир. @ru
label: 化石燃料-規制外 @ja
label: 化石燃料電力 - 非管制 @zh-hant
label: 火电 - 非管制 @zh
label: 화석 전기 - 비규제 @ko
definition: This segment includes companies that operate under unregulated revenue arrangements to generate electricity from fossil fuels.
notation: 1910111011
valid from: 2014-08-08
valid till: 2020-10-03

Fossil Electric Generation
type: BicsLevel4SubIndustry
type: Classifier
type: NamedIndividual
is sub industry of: Power Generation
is anachronous version of: http://data.ga-group.nl/ics/bics/2010101110
is contemporary version of: http://data.ga-group.nl/ics/bics/19101110
is replaced by: http://data.ga-group.nl/ics/bics/2020/2010101110
is version of: http://data.ga-group.nl/ics/bics/19101110
is version of: http://data.ga-group.nl/ics/bics/2010101110
imported on: 2026-06-08T13:03:47.798Z
last refreshed on: 2026-06-08T13:03:47.798Z
source accessed on: 2019-12-03T20:05:01Z
source last accessed on: 2019-12-03T20:05:01Z
label: Génération d'électricité fossile @fr
label: Generación de energía fósil @es
label: Generazione energia fossili @it
label: Geração eletricidade fóssil @pt
label: Stromerzeugung aus fossilem Brennstoff @de
label: Электричество на основе органич. топлива @ru
label: 化石燃料発電 @ja
label: 化石發電 @zh-hant
label: 火力发电 @zh
label: 화석연료 전기발전 @ko
definition: This industry subgroup includes companies that generate electricity from centralized power plants from fossil electric fuel resources.
notation: 19101110
valid from: 2014-08-08
valid till: 2020-10-03

Nuclear Power - Regulated
type: BicsLevel5Segment
type: Classifier
type: NamedIndividual
is level5 segment of: Nuclear Power Generation
is anachronous version of: http://data.ga-group.nl/ics/bics/201010111110
is contemporary version of: http://data.ga-group.nl/ics/bics/1910111110
is replaced by: http://data.ga-group.nl/ics/bics/2020/201010111110
is version of: http://data.ga-group.nl/ics/bics/1910111110
is version of: http://data.ga-group.nl/ics/bics/201010111110
imported on: 2026-06-08T13:03:47.798Z
last refreshed on: 2026-06-08T13:03:47.798Z
source accessed on: 2019-12-03T20:05:01Z
source last accessed on: 2019-12-03T20:05:01Z
label: Atomkraft - reguliert @de
label: Energía nuclear - Regulada @es
label: Energia nuclear - regulamentada @pt
label: Energia nucleare - regolato @it
label: Energie nucléaire - Réglementé @fr
label: Ядерная энергетика - Регулируемая @ru
label: 原子力-規制 @ja
label: 核能 - 管制 @zh
label: 核能-管制 @zh-hant
label: 원자력발전 - 규제 @ko
definition: This segment includes companies that generate electricity using heat supplied by nuclear reactors, where revenue is regulated by independent (elected) or political entities.
notation: 1910111110
valid from: 2014-08-08
valid till: 2020-10-03

Nuclear Power - Unregulated
type: BicsLevel5Segment
type: Classifier
type: NamedIndividual
is level5 segment of: Nuclear Power Generation
is anachronous version of: http://data.ga-group.nl/ics/bics/201010111111
is contemporary version of: http://data.ga-group.nl/ics/bics/1910111111
is replaced by: http://data.ga-group.nl/ics/bics/2020/201010111111
is version of: http://data.ga-group.nl/ics/bics/1910111111
is version of: http://data.ga-group.nl/ics/bics/201010111111
imported on: 2026-06-08T13:03:47.798Z
last refreshed on: 2026-06-08T13:03:47.798Z
source accessed on: 2019-12-03T20:05:01Z
source last accessed on: 2019-12-03T20:05:01Z
label: Atomkraft - nicht reguliert @de
label: Energía nuclear - No regulada @es
label: Energia nuclear - desregulamentada @pt
label: Energia nucleare - non regol @it
label: Energie nucléaire - Non réglementé @fr
label: Ядерная энергетика - Нерегулируемая @ru
label: 原子力-規制外 @ja
label: 核能 - 非管制 @zh
label: 核能-非管制 @zh-hant
label: 원자력발전 - 비규제 @ko
definition: This segment includes companies that operate under unregulated revenue arrangements to generate electricity using heat supplied by nuclear reactors.
notation: 1910111111
valid from: 2014-08-08
valid till: 2020-10-03

Nuclear Power Generation
type: BicsLevel4SubIndustry
type: Classifier
type: NamedIndividual
is sub industry of: Power Generation
is anachronous version of: http://data.ga-group.nl/ics/bics/2010101111
is contemporary version of: http://data.ga-group.nl/ics/bics/19101111
is replaced by: http://data.ga-group.nl/ics/bics/2020/2010101111
is version of: http://data.ga-group.nl/ics/bics/19101111
is version of: http://data.ga-group.nl/ics/bics/2010101111
imported on: 2026-06-08T13:03:47.798Z
last refreshed on: 2026-06-08T13:03:47.798Z
source accessed on: 2019-12-03T20:05:01Z
source last accessed on: 2019-12-03T20:05:01Z
label: Gén énerg nucléaire @fr
label: Generación eléctrica nuclear @es
label: Generazione energia nucleare @it
label: Geração de energia nuclear @pt
label: Kernkraftstromerzeugung @de
label: Ядерная энергия @ru
label: 原子力発電 @ja
label: 核能发电 @zh
label: 核能發電 @zh-hant
label: 원자력발전 @ko
definition: This industry subgroup includes companies that generate electricity using heat supplied by nuclear reactors.
notation: 19101111
valid from: 2014-08-08
valid till: 2020-10-03

Solar Energy - Regulated
type: BicsLevel6Segment
type: Classifier
type: NamedIndividual
is level6 segment of: Solar Energy Generation
is anachronous version of: http://data.ga-group.nl/ics/bics/20101011121010
is contemporary version of: http://data.ga-group.nl/ics/bics/191011121010
is replaced by: http://data.ga-group.nl/ics/bics/2020/20101011121010
is version of: http://data.ga-group.nl/ics/bics/191011121010
is version of: http://data.ga-group.nl/ics/bics/20101011121010
imported on: 2026-06-08T13:03:47.798Z
last refreshed on: 2026-06-08T13:03:47.798Z
source accessed on: 2019-12-03T20:05:01Z
source last accessed on: 2019-12-03T20:05:01Z
label: Energía solar - regulada @es
label: Energia solar - Regulamentada @pt
label: Energia solare - Regolamentata @it
label: Energie solaire - Réglementée @fr
label: Solarenergie - reguliert @de
label: Солнечная энергия - регулируемая @ru
label: 太阳能-管制 @zh
label: 太陽光発電-規制 @ja
label: 太陽能-管制 @zh-hant
label: 태양에너지 - 규제 @ko
definition: This segment includes companies that operate under regulated revenue arrangements to generate electricity from solar resources.
notation: 191011121010
valid from: 2014-08-08
valid till: 2020-10-03

Solar Energy - Unregulated
type: BicsLevel6Segment
type: Classifier
type: NamedIndividual
is level6 segment of: Solar Energy Generation
is anachronous version of: http://data.ga-group.nl/ics/bics/20101011121011
is contemporary version of: http://data.ga-group.nl/ics/bics/191011121011
is replaced by: http://data.ga-group.nl/ics/bics/2020/20101011121011
is version of: http://data.ga-group.nl/ics/bics/191011121011
is version of: http://data.ga-group.nl/ics/bics/20101011121011
imported on: 2026-06-08T13:03:47.798Z
last refreshed on: 2026-06-08T13:03:47.798Z
source accessed on: 2019-12-03T20:05:01Z
source last accessed on: 2019-12-03T20:05:01Z
label: Energía solar - no regulada @es
label: Energia solar - Não regulamentada @pt
label: Energia solare - Non regolamentata @it
label: Energie solaire - Non réglementée @fr
label: Solarenergie - unreguliert @de
label: Солнечная энергия - нерегулируемя @ru
label: 太阳能-非管制 @zh
label: 太陽光発電-規制外 @ja
label: 太陽能-非管制 @zh-hant
label: 태양에너지 - 비규제 @ko
definition: This segment includes companies that operate under unregulated revenue arrangements to generate electricity from solar resources.
notation: 191011121011
valid from: 2014-08-08
valid till: 2020-10-03

Solar Energy Generation
type: BicsLevel5Segment
type: Classifier
type: NamedIndividual
is level5 segment of: Renewable Energy Generation
is anachronous version of: http://data.ga-group.nl/ics/bics/201010111210
is contemporary version of: http://data.ga-group.nl/ics/bics/1910111210
is replaced by: http://data.ga-group.nl/ics/bics/2020/201010111210
is version of: http://data.ga-group.nl/ics/bics/1910111210
is version of: http://data.ga-group.nl/ics/bics/201010111210
imported on: 2026-06-08T13:03:47.798Z
last refreshed on: 2026-06-08T13:03:47.798Z
source accessed on: 2019-12-03T20:05:01Z
source last accessed on: 2019-12-03T20:05:01Z
label: Génération d'énergie solaire @fr
label: Generación de energía solar @es
label: Generazione energia solare @it
label: Geração de energia solar @pt
label: Solarenergieerzeugung @de
label: Солнечная энергия - генерирование @ru
label: 太阳能发电 @zh
label: 太陽光発電 @ja
label: 太陽能發電 @zh-hant
label: 태양에너지 발전 @ko
definition: This segment includes companies that generate electricity from solar energy resources.
notation: 1910111210
valid from: 2014-08-08
valid till: 2020-10-03

Wind Energy - Regulated
type: BicsLevel6Segment
type: Classifier
type: NamedIndividual
is level6 segment of: Wind Energy Generation
is anachronous version of: http://data.ga-group.nl/ics/bics/20101011121110
is contemporary version of: http://data.ga-group.nl/ics/bics/191011121110
is replaced by: http://data.ga-group.nl/ics/bics/2020/20101011121110
is version of: http://data.ga-group.nl/ics/bics/191011121110
is version of: http://data.ga-group.nl/ics/bics/20101011121110
imported on: 2026-06-08T13:03:47.798Z
last refreshed on: 2026-06-08T13:03:47.798Z
source accessed on: 2019-12-03T20:05:01Z
source last accessed on: 2019-12-03T20:05:01Z
label: Energía eólica - regulada @es
label: Energia eólica - Regulamentada @pt
label: Energia eolica - Regolamentata @it
label: Energie éolienne - Réglementée @fr
label: Windenergie - reguliert @de
label: Ветровая энергия - регулируемая @ru
label: 風力発電-規制 @ja
label: 風能-管制 @zh-hant
label: 风能-管制 @zh
label: 풍력에너지 - 규제 @ko
definition: This segment includes companies that generate electricity from wind resources where revenues are regulated by independent (elected) or political entities.
notation: 191011121110
valid from: 2014-08-08
valid till: 2020-10-03

Wind Energy - Unregulated
type: BicsLevel6Segment
type: Classifier
type: NamedIndividual
is level6 segment of: Wind Energy Generation
is anachronous version of: http://data.ga-group.nl/ics/bics/20101011121111
is contemporary version of: http://data.ga-group.nl/ics/bics/191011121111
is replaced by: http://data.ga-group.nl/ics/bics/2020/20101011121111
is version of: http://data.ga-group.nl/ics/bics/191011121111
is version of: http://data.ga-group.nl/ics/bics/20101011121111
imported on: 2026-06-08T13:03:47.798Z
last refreshed on: 2026-06-08T13:03:47.798Z
source accessed on: 2019-12-03T20:05:01Z
source last accessed on: 2019-12-03T20:05:01Z
label: Energía eólica - no regulada @es
label: Energia eólica - Não regulamentada @pt
label: Energia eolica - Non regolamentata @it
label: Energie éolienne - Non réglementée @fr
label: Windenergie - unreguliert @de
label: Ветровая энергия - нерегулируемая @ru
label: 風力発電-規制外 @ja
label: 風能-非管制 @zh-hant
label: 风能-非管制 @zh
label: 풍력에너지 - 비규제 @ko
definition: This segment includes companies that operate under unregulated revenue arrangements to generate electricity from wind resources.
notation: 191011121111
valid from: 2014-08-08
valid till: 2020-10-03

Wind Energy Generation
type: BicsLevel5Segment
type: Classifier
type: NamedIndividual
is level5 segment of: Renewable Energy Generation
is anachronous version of: http://data.ga-group.nl/ics/bics/201010111211
is contemporary version of: http://data.ga-group.nl/ics/bics/1910111211
is replaced by: http://data.ga-group.nl/ics/bics/2020/201010111211
is version of: http://data.ga-group.nl/ics/bics/1910111211
is version of: http://data.ga-group.nl/ics/bics/201010111211
imported on: 2026-06-08T13:03:47.798Z
last refreshed on: 2026-06-08T13:03:47.798Z
source accessed on: 2019-12-03T20:05:01Z
source last accessed on: 2019-12-03T20:05:01Z
label: Génération d'énergie éolienne @fr
label: Generación de energía eólica @es
label: Generazione energia eolica @it
label: Geração de energia eólica @pt
label: Windenergieerzeugung @de
label: Ветровая энергия - генерирование @ru
label: 風力発電 @ja
label: 風力能源發電 @zh-hant
label: 风能发电 @zh
label: 풍력에너지 발전 @ko
definition: This segment includes companies that generate electricity from wind resources.
notation: 1910111211
valid from: 2014-08-08
valid till: 2020-10-03

Geothermal - Regulated
type: BicsLevel6Segment
type: Classifier
type: NamedIndividual
is level6 segment of: Geothermal Energy Generation
is anachronous version of: http://data.ga-group.nl/ics/bics/20101011121210
is contemporary version of: http://data.ga-group.nl/ics/bics/191011121210
is replaced by: http://data.ga-group.nl/ics/bics/2020/20101011121210
is version of: http://data.ga-group.nl/ics/bics/191011121210
is version of: http://data.ga-group.nl/ics/bics/20101011121210
imported on: 2026-06-08T13:03:47.798Z
last refreshed on: 2026-06-08T13:03:47.798Z
source accessed on: 2019-12-03T20:05:01Z
source last accessed on: 2019-12-03T20:05:01Z
label: Géothermique - Réglementée @fr
label: Geotérmico - regulamentado @pt
label: Geotermal - Regulada @es
label: Geotermico - regolato @it
label: Geothermisch - reguliert @de
label: Геотермальная энергия - Регулируемые @ru
label: 地热能 - 管制 @zh
label: 地熱-管制 @zh-hant
label: 地熱-規制 @ja
label: 지열 - 규제 @ko
definition: This segment includes companies that generate electricity where the heat source to drive steam generators comes from geothermal resources under regulated revenue arrangements.
notation: 191011121210
valid from: 2014-08-08
valid till: 2020-10-03

Geothermal - Unregulated
type: BicsLevel6Segment
type: Classifier
type: NamedIndividual
is level6 segment of: Geothermal Energy Generation
is anachronous version of: http://data.ga-group.nl/ics/bics/20101011121211
is contemporary version of: http://data.ga-group.nl/ics/bics/191011121211
is replaced by: http://data.ga-group.nl/ics/bics/2020/20101011121211
is version of: http://data.ga-group.nl/ics/bics/191011121211
is version of: http://data.ga-group.nl/ics/bics/20101011121211
imported on: 2026-06-08T13:03:47.798Z
last refreshed on: 2026-06-08T13:03:47.798Z
source accessed on: 2019-12-03T20:05:01Z
source last accessed on: 2019-12-03T20:05:01Z
label: Géothermique - Non réglementée @fr
label: Geotérmico - desregulamentado @pt
label: Geotermal - No regulada @es
label: Geotermico - non regol @it
label: Geothermisch - unreguliert @de
label: Геотермальная энергия - Нерегулируемые @ru
label: 地热能 - 非管制 @zh
label: 地熱-規制外 @ja
label: 地熱-非管制 @zh-hant
label: 지열 - 비규제 @ko
definition: This segment includes companies that generate electricity where the heat source to drive steam generators comes from geothermal resources, and revenues are unregulated.
notation: 191011121211
valid from: 2014-08-08
valid till: 2020-10-03

Geothermal Energy Generation
type: BicsLevel5Segment
type: Classifier
type: NamedIndividual
is level5 segment of: Renewable Energy Generation
is anachronous version of: http://data.ga-group.nl/ics/bics/201010111212
is contemporary version of: http://data.ga-group.nl/ics/bics/1910111212
is replaced by: http://data.ga-group.nl/ics/bics/2020/201010111212
is version of: http://data.ga-group.nl/ics/bics/1910111212
is version of: http://data.ga-group.nl/ics/bics/201010111212
imported on: 2026-06-08T13:03:47.798Z
last refreshed on: 2026-06-08T13:03:47.798Z
source accessed on: 2019-12-03T20:05:01Z
source last accessed on: 2019-12-03T20:05:01Z
label: Génération d'énergie géothermique @fr
label: Generación de energía geotérmica @es
label: Generazione energia geotermica @it
label: Geothermieenergieerzeugung @de
label: Geração de energia geotérmica @pt
label: Геотермальная энергия - генерирование @ru
label: 地热能源发电 @zh
label: 地熱能源發電 @zh-hant
label: 地熱ｴﾈﾙｷﾞｰ発電 @ja
label: 지열에너지 발전 @ko
definition: This segment includes companies that generate electricity where the heat source to drive steam generators comes from geothermal resources.
notation: 1910111212
valid from: 2014-08-08
valid till: 2020-10-03

Hydropower Energy - Reg
type: BicsLevel6Segment
type: Classifier
type: NamedIndividual
is level6 segment of: Hydropower Generation
is anachronous version of: http://data.ga-group.nl/ics/bics/20101011121310
is contemporary version of: http://data.ga-group.nl/ics/bics/191011121310
is replaced by: http://data.ga-group.nl/ics/bics/2020/20101011121310
is version of: http://data.ga-group.nl/ics/bics/191011121310
is version of: http://data.ga-group.nl/ics/bics/20101011121310
imported on: 2026-06-08T13:03:47.798Z
last refreshed on: 2026-06-08T13:03:47.798Z
source accessed on: 2019-12-03T20:05:01Z
source last accessed on: 2019-12-03T20:05:01Z
label: Energía hidroeléctrica - reg @es
label: Energia hidroelétrica - Reg @pt
label: Energia idroelettrica - Reg @it
label: Energie hydraulique - Réglem @fr
label: Wasserkraftstrom - reg. @de
label: Гидроэнергия - регулируемая @ru
label: 水力-管制 @zh-hant
label: 水力発電-規制 @ja
label: 水电能源-管制 @zh
label: 수력에너지 - 규제 @ko
definition: This segment includes companies that operate under regulated revenue arrangements to generate electricity where turbines are driven by water flow. Such flow includes run-of-river, reservoir and pumped storage resources.
notation: 191011121310
valid from: 2014-08-08
valid till: 2020-10-03

Hydropower Energy - Unreg
type: BicsLevel6Segment
type: Classifier
type: NamedIndividual
is level6 segment of: Hydropower Generation
is anachronous version of: http://data.ga-group.nl/ics/bics/20101011121311
is contemporary version of: http://data.ga-group.nl/ics/bics/191011121311
is replaced by: http://data.ga-group.nl/ics/bics/2020/20101011121311
is version of: http://data.ga-group.nl/ics/bics/191011121311
is version of: http://data.ga-group.nl/ics/bics/20101011121311
imported on: 2026-06-08T13:03:47.798Z
last refreshed on: 2026-06-08T13:03:47.798Z
source accessed on: 2019-12-03T20:05:01Z
source last accessed on: 2019-12-03T20:05:01Z
label: Energía hidroeléctrica - no reg @es
label: Energia hidroelétrica - Não reg @pt
label: Energia idroelettrica - Non reg @it
label: Energie hydraulique - Non réglem @fr
label: Wasserkraftstrom - unreg. @de
label: Гидроэнергия - нерегулируемая @ru
label: 水力-非管制 @zh-hant
label: 水力発電-規制外 @ja
label: 水电能源-非管制 @zh
label: 수력에너지 - 비규제 @ko
definition: This segment includes companies that operate under unregulated revenue arrangements to generate electricity where turbines are driven by water flow. Such flow includes run-of-river, reservoir and pumped storage resources.
notation: 191011121311
valid from: 2014-08-08
valid till: 2020-10-03

Hydropower Generation
type: BicsLevel5Segment
type: Classifier
type: NamedIndividual
is level5 segment of: Renewable Energy Generation
is anachronous version of: http://data.ga-group.nl/ics/bics/201010111213
is contemporary version of: http://data.ga-group.nl/ics/bics/1910111213
is replaced by: http://data.ga-group.nl/ics/bics/2020/201010111213
is version of: http://data.ga-group.nl/ics/bics/1910111213
is version of: http://data.ga-group.nl/ics/bics/201010111213
imported on: 2026-06-08T13:03:47.798Z
last refreshed on: 2026-06-08T13:03:47.798Z
source accessed on: 2019-12-03T20:05:01Z
source last accessed on: 2019-12-03T20:05:01Z
label: Génération d'énergie hydraulique @fr
label: Generación de energía hidráulica @es
label: Generazione energia idroelettrica @it
label: Geração de hidroelétrica @pt
label: Wasserkraftstromerzeugung @de
label: Гидроэлектроэнергия - генерирование @ru
label: 水力発電 @ja
label: 水力發電 @zh-hant
label: 水能发电 @zh
label: 수력발전 @ko
definition: This segment includes companies that generate energy from falling or running water.
notation: 1910111213
valid from: 2014-08-08
valid till: 2020-10-03

Marine Energy - Regulated
type: BicsLevel6Segment
type: Classifier
type: NamedIndividual
is level6 segment of: Marine Energy Generation
is anachronous version of: http://data.ga-group.nl/ics/bics/20101011121410
is contemporary version of: http://data.ga-group.nl/ics/bics/191011121410
is replaced by: http://data.ga-group.nl/ics/bics/2020/20101011121410
is version of: http://data.ga-group.nl/ics/bics/191011121410
is version of: http://data.ga-group.nl/ics/bics/20101011121410
imported on: 2026-06-08T13:03:47.798Z
last refreshed on: 2026-06-08T13:03:47.798Z
source accessed on: 2019-12-03T20:05:01Z
source last accessed on: 2019-12-03T20:05:01Z
label: Energía marina - regulada @es
label: Energia marítimo - Regulamentada @pt
label: Energia marina - Regolamentata @it
label: Energie maritime -Réglementée @fr
label: Maritime Energie - reguliert @de
label: Морская энергия - регулируемая @ru
label: 海洋-管制 @zh-hant
label: 海洋能源-管制 @zh
label: 海洋ｴﾈﾙｷﾞｰ-規制 @ja
label: 해양에너지 - 규제 @ko
definition: This segment includes companies that operate under regulated revenue arrangements to generate electricity from marine water flows using tidal and wave-based technologies.
notation: 191011121410
valid from: 2014-08-08
valid till: 2020-10-03

Marine Energy - Unregulated
type: BicsLevel6Segment
type: Classifier
type: NamedIndividual
is level6 segment of: Marine Energy Generation
is anachronous version of: http://data.ga-group.nl/ics/bics/20101011121411
is contemporary version of: http://data.ga-group.nl/ics/bics/191011121411
is replaced by: http://data.ga-group.nl/ics/bics/2020/20101011121411
is version of: http://data.ga-group.nl/ics/bics/191011121411
is version of: http://data.ga-group.nl/ics/bics/20101011121411
imported on: 2026-06-08T13:03:47.798Z
last refreshed on: 2026-06-08T13:03:47.798Z
source accessed on: 2019-12-03T20:05:01Z
source last accessed on: 2019-12-03T20:05:01Z
label: Energía marina - no regulada @es
label: Energia marítima - Não regulamentada @pt
label: Energia marina - Non regolamentata @it
label: Energie maritime - Non réglementée @fr
label: Maritime Energie - unreguliert @de
label: Морская энергия - нерегулируемая @ru
label: 海洋-非管制 @zh-hant
label: 海洋能源-非管制 @zh
label: 海洋ｴﾈﾙｷﾞｰ-規制外 @ja
label: 해양��너지 - 비규제 @ko
definition: This segment includes companies that operate under unregulated revenue arrangements to generate electricity from marine water flows utilizing tidal and wave-based technologies.
notation: 191011121411
valid from: 2014-08-08
valid till: 2020-10-03

Marine Energy Generation
type: BicsLevel5Segment
type: Classifier
type: NamedIndividual
is level5 segment of: Renewable Energy Generation
is anachronous version of: http://data.ga-group.nl/ics/bics/201010111214
is contemporary version of: http://data.ga-group.nl/ics/bics/1910111214
is replaced by: http://data.ga-group.nl/ics/bics/2020/201010111214
is version of: http://data.ga-group.nl/ics/bics/1910111214
is version of: http://data.ga-group.nl/ics/bics/201010111214
imported on: 2026-06-08T13:03:47.798Z
last refreshed on: 2026-06-08T13:03:47.798Z
source accessed on: 2019-12-03T20:05:01Z
source last accessed on: 2019-12-03T20:05:01Z
label: Génération d'énergie maritime @fr
label: Generación de energía marina @es
label: Generazione energia marina @it
label: Geração de energia marítima @pt
label: Maritime Energieerzeugung @de
label: Морская энергия - генерирование @ru
label: 海洋能源 @zh-hant
label: 海洋能源发电 @zh
label: 海洋ｴﾈﾙｷﾞｰ発電 @ja
label: 해양에너지 발전 @ko
definition: This segment includes companies that generate energy from the kinetic motions of waves and tides. Energy can also be generated from temperature and salinity differences.
notation: 1910111214
valid from: 2014-08-08
valid till: 2020-10-03

Biomass & Waste - Regulated
type: BicsLevel6Segment
type: Classifier
type: NamedIndividual
is level6 segment of: Biomass & Waste Energy Gen
is anachronous version of: http://data.ga-group.nl/ics/bics/20101011121510
is contemporary version of: http://data.ga-group.nl/ics/bics/191011121510
is replaced by: http://data.ga-group.nl/ics/bics/2020/20101011121510
is version of: http://data.ga-group.nl/ics/bics/191011121510
is version of: http://data.ga-group.nl/ics/bics/20101011121510
imported on: 2026-06-08T13:03:47.798Z
last refreshed on: 2026-06-08T13:03:47.798Z
source accessed on: 2019-12-03T20:05:01Z
source last accessed on: 2019-12-03T20:05:01Z
label: Biomasa y desechos - Regulados @es
label: Biomassa e desperdícios - regulamentado @pt
label: Biomassa e rifiuti - regolata @it
label: Biomasse & Abfall - reguliert @de
label: Biomasse et déchets - Réglementé @fr
label: Биомассы и отходы - Регулируемые @ru
label: 生物质能及废弃物 - 管制 @zh
label: 生質能及廢棄物-管制 @zh-hant
label: 바이오매스 & 폐기물 - 규제 @ko
label: ﾊﾞｲｵﾏｽ･廃棄物-規制 @ja
definition: This segment includes companies that operate under regulated revenue arrangements to generate electricity from biomass or industrial/residential waste resources.
notation: 191011121510
valid from: 2014-08-08
valid till: 2020-10-03

Biomass & Waste - Unreg
type: BicsLevel6Segment
type: Classifier
type: NamedIndividual
is level6 segment of: Biomass & Waste Energy Gen
is anachronous version of: http://data.ga-group.nl/ics/bics/20101011121511
is contemporary version of: http://data.ga-group.nl/ics/bics/191011121511
is replaced by: http://data.ga-group.nl/ics/bics/2020/20101011121511
is version of: http://data.ga-group.nl/ics/bics/191011121511
is version of: http://data.ga-group.nl/ics/bics/20101011121511
imported on: 2026-06-08T13:03:47.798Z
last refreshed on: 2026-06-08T13:03:47.798Z
source accessed on: 2019-12-03T20:05:01Z
source last accessed on: 2019-12-03T20:05:01Z
label: Biomasa y desechos - No regulados @es
label: Biomassa e desperdícios - desregulamentados @pt
label: Biomasse & Abfall - nicht reguliert @de
label: Biomasse e rifiuti - non regol @it
label: Biomasse et déchets - Non réglementé @fr
label: Биомассы и отходы - Нерегулируемые @ru
label: 生物质能及废弃物 - 非管制 @zh
label: 生質能及廢棄物-非管制 @zh-hant
label: 바이오매스 & 폐기물 - 비규제 @ko
label: ﾊﾞｲｵﾏｽ･廃棄物-規制外 @ja
definition: This segment includes companies that operate under unregulated revenue arrangements to generate electricity from biomass or industrial/residential waste resources.
notation: 191011121511
valid from: 2014-08-08
valid till: 2020-10-03

Biomass & Waste Energy Gen
type: BicsLevel5Segment
type: Classifier
type: NamedIndividual
is level5 segment of: Renewable Energy Generation
is anachronous version of: http://data.ga-group.nl/ics/bics/201010111215
is contemporary version of: http://data.ga-group.nl/ics/bics/1910111215
is replaced by: http://data.ga-group.nl/ics/bics/2020/201010111215
is version of: http://data.ga-group.nl/ics/bics/1910111215
is version of: http://data.ga-group.nl/ics/bics/201010111215
imported on: 2026-06-08T13:03:47.798Z
last refreshed on: 2026-06-08T13:03:47.798Z
source accessed on: 2019-12-03T20:05:01Z
source last accessed on: 2019-12-03T20:05:01Z
label: Biomasa y desechos generación de energía @es
label: Biomasse- & Abfallenergieerzeugung @de
label: Gén énerg biomasse/déchets @fr
label: Gen energia biomassa e rifiuti @it
label: Ger de energia biomassa e resíduos @pt
label: Биомасса и отходы - генерирование @ru
label: 生物质能与废弃物能源发电 @zh
label: 生質與廢棄物發電 @zh-hant
label: 바이오매스 & 폐기물 에너지 발전 @ko
label: ﾊﾞｲｵﾏｽ&廃棄物ｴﾈﾙｷﾞｰ発電 @ja
definition: This segment includes companies that generate electricity from biomass or industrial/residential waste resources.
notation: 1910111215
valid from: 2014-08-08
valid till: 2020-10-03

Renewable Energy Generation
type: BicsLevel4SubIndustry
type: Classifier
type: NamedIndividual
is sub industry of: Power Generation
is anachronous version of: http://data.ga-group.nl/ics/bics/2010101112
is contemporary version of: http://data.ga-group.nl/ics/bics/19101112
is replaced by: http://data.ga-group.nl/ics/bics/2020/2010101112
is version of: http://data.ga-group.nl/ics/bics/19101112
is version of: http://data.ga-group.nl/ics/bics/2010101112
imported on: 2026-06-08T13:03:47.798Z
last refreshed on: 2026-06-08T13:03:47.798Z
source accessed on: 2019-12-03T20:05:01Z
source last accessed on: 2019-12-03T20:05:01Z
label: Gén énerg renouvelable @fr
label: Generación de energía renovable @es
label: Generazione energia rinnovabile @it
label: Geração de energia renovável @pt
label: Stromerzeugung durch Erneuerbare Energie @de
label: Возобновляемая энергия @ru
label: 再生可能ｴﾈﾙｷﾞｰ発電 @ja
label: 再生能源發電 @zh-hant
label: 可再生能源发电 @zh
label: 신재생에너지 발전 @ko
definition: This industry subgroup includes companies that generate electricity from centralized power plants from renewable energy resources.
notation: 19101112
valid from: 2014-08-08
valid till: 2020-10-03

Other Power Generation Oper
type: BicsLevel4SubIndustry
type: Classifier
type: Discontinued
type: NamedIndividual
is sub industry of: Power Generation
is contemporary version of: http://data.ga-group.nl/ics/bics/19101113
is version of: http://data.ga-group.nl/ics/bics/19101113
imported on: 2026-06-08T13:03:47.798Z
last refreshed on: 2026-06-08T13:03:47.798Z
source accessed on: 2019-12-03T20:05:01Z
source last accessed on: 2019-12-03T20:05:01Z
label: Altre operaz di generaz energia @it
label: Autres activités de génération d'électricité @fr
label: Otras operaciones de generación eléctrica @es
label: Outras operações de geração de energia @pt
label: Sonstige Energieerzeugungsoperationen @de
label: Др. операции генерирования электрич-ва @ru
label: その他発電事業 @ja
label: 其他发电经营 @zh
label: 其他發電經營 @zh-hant
label: 기타 전력 생산 운영 @ko
definition: This industry subgroup includes companies that generate power from operations not elsewhere classified.
notation: 19101113
valid from: 2014-08-08
valid till: 2020-10-03

Power Generation
type: BicsLevel3Industry
type: Classifier
type: NamedIndividual
is industry of: Utilities
is anachronous version of: http://data.ga-group.nl/ics/bics/20101011
is contemporary version of: http://data.ga-group.nl/ics/bics/191011
is replaced by: http://data.ga-group.nl/ics/bics/2020/20101011
is version of: http://data.ga-group.nl/ics/bics/191011
is version of: http://data.ga-group.nl/ics/bics/20101011
imported on: 2026-06-08T13:03:47.798Z
last refreshed on: 2026-06-08T13:03:47.798Z
source accessed on: 2019-12-03T20:05:01Z
source last accessed on: 2019-12-03T20:05:01Z
label: Generación eléctrica @es
label: Geração de energia @pt
label: Prod électrique @fr
label: Prod energia elett @it
label: Stromerzeugung @de
label: Выработка электроэн. @ru
label: 电力生产 @zh
label: 発電所 @ja
label: 發電業 @zh-hant
label: 전력 발전업 @ko
definition: This industry includes companies that generate electricity from centralized power plants.
notation: 191011
valid from: 2014-08-08
valid till: 2020-10-03

Electricity Transmission
type: BicsLevel5Segment
type: Classifier
type: NamedIndividual
is level5 segment of: Electricity Networks
is anachronous version of: http://data.ga-group.nl/ics/bics/2010101210
is contemporary version of: http://data.ga-group.nl/ics/bics/1910121010
is replaced by: http://data.ga-group.nl/ics/bics/2020/2010101210
is version of: http://data.ga-group.nl/ics/bics/1910121010
is version of: http://data.ga-group.nl/ics/bics/2010101210
imported on: 2026-06-08T13:03:47.798Z
last refreshed on: 2026-06-08T13:03:47.798Z
source accessed on: 2019-12-03T20:05:01Z
source last accessed on: 2019-12-03T20:05:01Z
label: Stromübertragung @de
label: Transmisión de electricidad @es
label: Transmissão de eletricidade @pt
label: Transmission d'électricité @fr
label: Trasmissione elettricità @it
label: Передача электроэнергии @ru
label: 输电 @zh
label: 送電 @ja
label: 電力傳輸 @zh-hant
label: 송전 @ko
definition: This segment includes companies that are operators and owners of regulated wide area, typically mid- and high-voltage electricity networks.
notation: 1910121010
valid from: 2014-08-08
valid till: 2020-10-03

Electricity Distribution
type: BicsLevel5Segment
type: Classifier
type: NamedIndividual
is level5 segment of: Electricity Networks
is anachronous version of: http://data.ga-group.nl/ics/bics/2010101211
is contemporary version of: http://data.ga-group.nl/ics/bics/1910121011
is replaced by: http://data.ga-group.nl/ics/bics/2020/2010101211
is version of: http://data.ga-group.nl/ics/bics/1910121011
is version of: http://data.ga-group.nl/ics/bics/2010101211
imported on: 2026-06-08T13:03:47.798Z
last refreshed on: 2026-06-08T13:03:47.798Z
source accessed on: 2019-12-03T20:05:01Z
source last accessed on: 2019-12-03T20:05:01Z
label: Distribución de electricidad @es
label: Distribuição de eletricidade @pt
label: Distribution d'électricité @fr
label: Distribuzione elettricità @it
label: Stromverteilung @de
label: Распределение электроэнергии @ru
label: 配电 @zh
label: 配電 @ja
label: 배전 @ko
definition: This segment includes companies that are operators and owners of regulated local area, typically low-voltage electricity networks.
notation: 1910121011
valid from: 2014-08-08
valid till: 2020-10-03

Electricity Networks
type: BicsLevel4SubIndustry
type: Classifier
type: NamedIndividual
is sub industry of: Utility Networks
is anachronous version of: http://data.ga-group.nl/ics/bics/20101012
is contemporary version of: http://data.ga-group.nl/ics/bics/19101210
is replaced by: http://data.ga-group.nl/ics/bics/2020/20101012
is version of: http://data.ga-group.nl/ics/bics/19101210
is version of: http://data.ga-group.nl/ics/bics/20101012
imported on: 2026-06-08T13:03:47.798Z
last refreshed on: 2026-06-08T13:03:47.798Z
source accessed on: 2019-12-03T20:05:01Z
source last accessed on: 2019-12-03T20:05:01Z
label: Elektrizitätsnetze @de
label: Réseaux d'électricité @fr
label: Redes de electricidad @es
label: Redes de eletricidade @pt
label: Reti elettriche @it
label: Передача и распределение электроэнергии @ru
label: 电力网络 @zh
label: 電力網 @ja
label: 전기 네트워크 @ko
definition: This industry subgroup includes companies that own and operate regulated electricity networks.
notation: 19101210
valid from: 2014-08-08
valid till: 2020-10-03

Pipeline Operations
type: BicsLevel6Segment
type: Classifier
type: NamedIndividual
is level6 segment of: Gas Transmission & Storage
is anachronous version of: http://data.ga-group.nl/ics/bics/201011101010
is contemporary version of: http://data.ga-group.nl/ics/bics/191012111010
is replaced by: http://data.ga-group.nl/ics/bics/2020/201011101010
is version of: http://data.ga-group.nl/ics/bics/191012111010
is version of: http://data.ga-group.nl/ics/bics/201011101010
imported on: 2026-06-08T13:03:47.798Z
last refreshed on: 2026-06-08T13:03:47.798Z
source accessed on: 2019-12-03T20:05:01Z
source last accessed on: 2019-12-03T20:05:01Z
label: Opérations de pipelines @fr
label: Operações de oleoduto @pt
label: Operaciones de ductos @es
label: Operazioni oleodotti @it
label: Pipeline-Tätigkeiten @de
label: Эксплуатация трубопровода @ru
label: 流水线作业 @zh
label: 管線營運 @zh-hant
label: 파이프라인 운영 @ko
label: ﾊﾟｲﾌﾟﾗｲﾝ輸送 @ja
definition: This segment includes operation and maintenance of natural gas transmission networks, both merchant and regulated revenue arrangements.
notation: 191012111010
valid from: 2014-08-08
valid till: 2020-10-03

Natural Gas Storage
type: BicsLevel6Segment
type: Classifier
type: NamedIndividual
is level6 segment of: Gas Transmission & Storage
is anachronous version of: http://data.ga-group.nl/ics/bics/201011101011
is contemporary version of: http://data.ga-group.nl/ics/bics/191012111011
is replaced by: http://data.ga-group.nl/ics/bics/2020/201011101011
is version of: http://data.ga-group.nl/ics/bics/191012111011
is version of: http://data.ga-group.nl/ics/bics/201011101011
imported on: 2026-06-08T13:03:47.798Z
last refreshed on: 2026-06-08T13:03:47.798Z
source accessed on: 2019-12-03T20:05:01Z
source last accessed on: 2019-12-03T20:05:01Z
label: Almacenamiento de gas natural @es
label: Armazém de gás natural @pt
label: Erdgaslager @de
label: Immagazz gas naturale @it
label: Stockage du gaz naturel @fr
label: Хранение природного газа @ru
label: 天然氣儲存 @zh-hant
label: 天然ｶﾞｽ貯蔵 @ja
label: 천연가스 저장 @ko
label: ���然气库存 @zh
definition: This segment includes natural gas storage facilities in saline caverns or depleted oil fields, connected to transmission network, both merchant and regulated revenue arrangements.
notation: 191012111011
valid from: 2014-08-08
valid till: 2020-10-03

Gas Transmission & Storage
type: BicsLevel5Segment
type: Classifier
type: NamedIndividual
is level5 segment of: Gas Utilities
is anachronous version of: http://data.ga-group.nl/ics/bics/2010111010
is contemporary version of: http://data.ga-group.nl/ics/bics/1910121110
is replaced by: http://data.ga-group.nl/ics/bics/2020/2010111010
is version of: http://data.ga-group.nl/ics/bics/1910121110
is version of: http://data.ga-group.nl/ics/bics/2010111010
imported on: 2026-06-08T13:03:47.798Z
last refreshed on: 2026-06-08T13:03:47.798Z
source accessed on: 2019-12-03T20:05:01Z
source last accessed on: 2019-12-03T20:05:01Z
label: Armazenagem e transmissão de gás @pt
label: Transmisión y almacenamiento de gas @es
label: Transport et stockage de gaz @fr
label: Trasmiss gas e immagazz @it
label: Übertragung & Lagerung von Erdgas @de
label: Передача и хранение газа @ru
label: 燃气传输与储存 @zh
label: 가스 수송 & 저장 @ko
label: ｶﾞｽ送出･貯蔵 @ja
label: ���然氣傳輸及儲存 @zh-hant
definition: This segment includes companies that provide natural gas transmission networks that operate at high pressure/national networks. It includes both regulated and merchant revenue streams.
notation: 1910121110
valid from: 2014-08-08
valid till: 2020-10-03

Propane Gas Distributors
type: BicsLevel6Segment
type: Classifier
type: NamedIndividual
is level6 segment of: Gas Distribution
is anachronous version of: http://data.ga-group.nl/ics/bics/201011101110
is contemporary version of: http://data.ga-group.nl/ics/bics/191012111110
is replaced by: http://data.ga-group.nl/ics/bics/2020/201011101110
is version of: http://data.ga-group.nl/ics/bics/191012111110
is version of: http://data.ga-group.nl/ics/bics/201011101110
imported on: 2026-06-08T13:03:47.798Z
last refreshed on: 2026-06-08T13:03:47.798Z
source accessed on: 2019-12-03T20:05:01Z
source last accessed on: 2019-12-03T20:05:01Z
label: Distr gas propano @es
label: Distrib de gás propano @pt
label: Distrib gaz propane @fr
label: Distrib propano @it
label: Propangasverteilung @de
label: Доставка пропана @ru
label: 丙烷气体配售 @zh
label: 丙烷氣配送 @zh-hant
label: 프로판가스 공급 @ko
label: ﾌﾟﾛﾊﾟﾝｶﾞｽ配給 @ja
definition: This segment includes companies that retail propane or liquid petroleum gas (LPG) distribution networks, which distribute gas in portable tanks and/or via tanker truck. These enterprises operate in competitive, unregulated markets.
notation: 191012111110
valid from: 2014-08-08
valid till: 2020-10-03

Natural Gas Distributors
type: BicsLevel6Segment
type: Classifier
type: NamedIndividual
is level6 segment of: Gas Distribution
is anachronous version of: http://data.ga-group.nl/ics/bics/201011101111
is contemporary version of: http://data.ga-group.nl/ics/bics/191012111111
is replaced by: http://data.ga-group.nl/ics/bics/2020/201011101111
is version of: http://data.ga-group.nl/ics/bics/191012111111
is version of: http://data.ga-group.nl/ics/bics/201011101111
imported on: 2026-06-08T13:03:47.798Z
last refreshed on: 2026-06-08T13:03:47.798Z
source accessed on: 2019-12-03T20:05:01Z
source last accessed on: 2019-12-03T20:05:01Z
label: Distr gas natural @es
label: Distrib de gás natural @pt
label: Distrib gas naturale @it
label: Distrib gaz naturel @fr
label: Erdgasverteilung @de
label: Распределение прир. газа @ru
label: 天然气配售 @zh
label: 天然氣配送 @zh-hant
label: 天然ｶﾞｽ供給所 @ja
label: 천연가스 배관공급 @ko
definition: This segment includes natural gas distribution networks that operate at low pressure / local area networks sending out methane. Revenues are normally regulated by an independent (elected) or politically appointed regulatory body.
notation: 191012111111
valid from: 2014-08-08
valid till: 2020-10-03

Gas Distribution
type: BicsLevel5Segment
type: Classifier
type: NamedIndividual
is level5 segment of: Gas Utilities
is anachronous version of: http://data.ga-group.nl/ics/bics/2010111011
is contemporary version of: http://data.ga-group.nl/ics/bics/1910121111
is replaced by: http://data.ga-group.nl/ics/bics/2020/2010111011
is version of: http://data.ga-group.nl/ics/bics/1910121111
is version of: http://data.ga-group.nl/ics/bics/2010111011
imported on: 2026-06-08T13:03:47.798Z
last refreshed on: 2026-06-08T13:03:47.798Z
source accessed on: 2019-12-03T20:05:01Z
source last accessed on: 2019-12-03T20:05:01Z
label: Distribución de gas @es
label: Distribuição de gás @pt
label: Distribution du gaz @fr
label: Distribuzione gas @it
label: Gasversorgung @de
label: Распределение газа @ru
label: 天然氣配送 @zh-hant
label: 气体分布 @zh
label: 가스 배급 @ko
label: ｶﾞｽ供給 @ja
definition: This segment includes natural gas distribution networks that operate at low pressure / local area networks sending out methane or propane. Revenues normally regulated by an independent (elected) or politically appointed regulatory body.
notation: 1910121111
valid from: 2014-08-08
valid till: 2020-10-03

Gas Utilities
type: BicsLevel4SubIndustry
type: Classifier
type: NamedIndividual
is sub industry of: Utility Networks
is anachronous version of: http://data.ga-group.nl/ics/bics/20101110
is contemporary version of: http://data.ga-group.nl/ics/bics/19101211
is replaced by: http://data.ga-group.nl/ics/bics/2020/20101110
is version of: http://data.ga-group.nl/ics/bics/19101211
is version of: http://data.ga-group.nl/ics/bics/20101110
imported on: 2026-06-08T13:03:47.798Z
last refreshed on: 2026-06-08T13:03:47.798Z
source accessed on: 2019-12-03T20:05:01Z
source last accessed on: 2019-12-03T20:05:01Z
label: Gasversorgung @de
label: Serv púb gás @pt
label: Serv pubb gas @it
label: Servicios gas @es
label: Srvces gaz collectvtés @fr
label: Ком. гзснбж @ru
label: 天然气公用事业 @zh
label: 天然氣公用事業 @zh-hant
label: 가스 유틸리티 @ko
label: ｶﾞｽ公益事業 @ja
definition: This industry subgroup includes companies that operate natural gas transmission and distribution networks under either regulated or unregulated revenue arrangements.
notation: 19101211
valid from: 2014-08-08
valid till: 2020-10-03

Water Sewage Networks
type: BicsLevel5Segment
type: Classifier
type: NamedIndividual
is level5 segment of: Water Networks
is anachronous version of: http://data.ga-group.nl/ics/bics/2010111110
is contemporary version of: http://data.ga-group.nl/ics/bics/1910121210
is replaced by: http://data.ga-group.nl/ics/bics/2020/2010111110
is version of: http://data.ga-group.nl/ics/bics/1910121210
is version of: http://data.ga-group.nl/ics/bics/2010111110
imported on: 2026-06-08T13:03:47.798Z
last refreshed on: 2026-06-08T13:03:47.798Z
source accessed on: 2019-12-03T20:05:01Z
source last accessed on: 2019-12-03T20:05:01Z
label: Netzwerke: Abwasser @de
label: Réseaux d'égouts @fr
label: Redes de água de esgoto @pt
label: Redes de drenaje @es
label: Reti acque fognatura @it
label: Канализационные сети @ru
label: 下水網 @ja
label: 排水网络 @zh
label: 污水網 @zh-hant
label: 수도 하수도 네트워크 @ko
definition: This segment includes companies that own or operate networks that focus on the pre-consumption components of the water cycle.
notation: 1910121210
valid from: 2014-08-08
valid till: 2020-10-03

Water Supply Networks
type: BicsLevel5Segment
type: Classifier
type: NamedIndividual
is level5 segment of: Water Networks
is anachronous version of: http://data.ga-group.nl/ics/bics/2010111111
is contemporary version of: http://data.ga-group.nl/ics/bics/1910121211
is replaced by: http://data.ga-group.nl/ics/bics/2020/2010111111
is version of: http://data.ga-group.nl/ics/bics/1910121211
is version of: http://data.ga-group.nl/ics/bics/2010111111
imported on: 2026-06-08T13:03:47.798Z
last refreshed on: 2026-06-08T13:03:47.798Z
source accessed on: 2019-12-03T20:05:01Z
source last accessed on: 2019-12-03T20:05:01Z
label: Netzwerke: Wasserversorgung @de
label: Réseaux de distribution de l'eau @fr
label: Redes de abastecimento de água @pt
label: Redes de suministro de agua @es
label: Reti fornitura idrica @it
label: Сети водоснабжения @ru
label: 上水網 @ja
label: 供水網 @zh-hant
label: 供水网络 @zh
label: 수도 공급 네트워크 @ko
definition: This segment includes companies that own or operate networks that focus on the post-consumption components of the water cycle.
notation: 1910121211
valid from: 2014-08-08
valid till: 2020-10-03

Contract Management Fees
type: BicsLevel5Segment
type: Classifier
type: Discontinued
type: NamedIndividual
is level5 segment of: Water Networks
is contemporary version of: http://data.ga-group.nl/ics/bics/1910121212
is version of: http://data.ga-group.nl/ics/bics/1910121212
imported on: 2026-06-08T13:03:47.798Z
last refreshed on: 2026-06-08T13:03:47.798Z
source accessed on: 2019-12-03T20:05:01Z
source last accessed on: 2019-12-03T20:05:01Z
label: Costi gestione contratti @it
label: Frais de gestion de contrats @fr
label: Tarifas de gestión de contratos @es
label: Taxas de gerenciamento de contrato @pt
label: Vertragsverwaltungsgebühren @de
label: Сборы за управление контрактами @ru
label: 合約管理費 @zh-hant
label: 工事管理手数料 @ja
label: 承包管理费 @zh
label: 계약관리 수수료 @ko
definition: This segment includes water assets managed under concession or contract, rather than by the owner.
notation: 1910121212
valid from: 2014-08-08
valid till: 2020-10-03

Water Networks
type: BicsLevel4SubIndustry
type: Classifier
type: NamedIndividual
is sub industry of: Utility Networks
is anachronous version of: http://data.ga-group.nl/ics/bics/20101111
is contemporary version of: http://data.ga-group.nl/ics/bics/19101212
is replaced by: http://data.ga-group.nl/ics/bics/2020/20101111
is version of: http://data.ga-group.nl/ics/bics/19101212
is version of: http://data.ga-group.nl/ics/bics/20101111
imported on: 2026-06-08T13:03:47.798Z
last refreshed on: 2026-06-08T13:03:47.798Z
source accessed on: 2019-12-03T20:05:01Z
source last accessed on: 2019-12-03T20:05:01Z
label: Réseaux d'aqueducs @fr
label: Redes de água @pt
label: Redes de agua @es
label: Reti idriche @it
label: Wassernetzwerke @de
label: Сети водоснабжения @ru
label: 水網 @zh-hant
label: 水网 @zh
label: 配水網 @ja
label: 수도 네트워크 @ko
definition: This industry subgroup includes companies that operate regulated water distribution networks and own treatment infrastructure.
notation: 19101212
valid from: 2014-08-08
valid till: 2020-10-03

Chilled Water
type: BicsLevel5Segment
type: Classifier
type: Discontinued
type: NamedIndividual
is level5 segment of: District Heating & Cooling
is contemporary version of: http://data.ga-group.nl/ics/bics/1910121310
is version of: http://data.ga-group.nl/ics/bics/1910121310
imported on: 2026-06-08T13:03:47.798Z
last refreshed on: 2026-06-08T13:03:47.798Z
source accessed on: 2019-12-03T20:05:01Z
source last accessed on: 2019-12-03T20:05:01Z
label: Acqua refrigerata @it
label: Agua congelada @es
label: Eaux refroidies @fr
label: Gekühltes Wasser @de
label: Água refrigerada @pt
label: Охлажденная вода @ru
label: 冰水 @zh-hant
label: 冷却水 @ja
label: 냉각수 @ko
definition: This segment includes companies that provide chilled water from centrally located refrigeration plants that are normally embedded in industrial parks or urban centers.
notation: 1910121310
valid from: 2014-08-08
valid till: 2020-10-03

Steam
type: BicsLevel5Segment
type: Classifier
type: Discontinued
type: NamedIndividual
is level5 segment of: District Heating & Cooling
is contemporary version of: http://data.ga-group.nl/ics/bics/1910121311
is version of: http://data.ga-group.nl/ics/bics/1910121311
imported on: 2026-06-08T13:03:47.798Z
last refreshed on: 2026-06-08T13:03:47.798Z
source accessed on: 2019-12-03T20:05:01Z
source last accessed on: 2019-12-03T20:05:01Z
label: Dampf @de
label: Vapeur @fr
label: Vapor @es
label: Vapore @it
label: Пар @ru
label: 蒸気 @ja
label: 蒸汽 @zh
label: 증기 @ko
definition: This segment includes companies that provide steam and heat energy from central generation facilities, most often in municipal (but also industrial) settings.
notation: 1910121311
valid from: 2014-08-08
valid till: 2020-10-03

District Heating & Cooling
type: BicsLevel4SubIndustry
type: Classifier
type: NamedIndividual
is sub industry of: Utility Networks
is anachronous version of: http://data.ga-group.nl/ics/bics/20101013
is contemporary version of: http://data.ga-group.nl/ics/bics/19101213
is replaced by: http://data.ga-group.nl/ics/bics/2020/20101013
is version of: http://data.ga-group.nl/ics/bics/19101213
is version of: http://data.ga-group.nl/ics/bics/20101013
imported on: 2026-06-08T13:03:47.798Z
last refreshed on: 2026-06-08T13:03:47.798Z
source accessed on: 2019-12-03T20:05:01Z
source last accessed on: 2019-12-03T20:05:01Z
label: Aquecimento e refrigeração de distrito @pt
label: Calefacción y aire acondicionado de Distrito @es
label: Conditionnement air @fr
label: Fernwärme & -kälte @de
label: Riscald distr e aria cond @it
label: Район. отопл. и кондиц. @ru
label: 区域供热和制冷 @zh
label: 地區增熱及冷卻度日 @zh-hant
label: 地域冷暖房 @ja
label: 지역 난방 & 냉방 @ko
definition: This industry subgroup includes companies that operate regulated district heating and cooling networks on both the municipal and industrial park level.
notation: 19101213
valid from: 2014-08-08
valid till: 2020-10-03

Power Storage
type: BicsLevel4SubIndustry
type: Classifier
type: NamedIndividual
is sub industry of: Utility Networks
is anachronous version of: http://data.ga-group.nl/ics/bics/2010101113
is contemporary version of: http://data.ga-group.nl/ics/bics/19101214
is replaced by: http://data.ga-group.nl/ics/bics/2020/2010101113
is version of: http://data.ga-group.nl/ics/bics/19101214
is version of: http://data.ga-group.nl/ics/bics/2010101113
imported on: 2026-06-08T13:03:47.798Z
last refreshed on: 2026-06-08T13:03:47.798Z
source accessed on: 2019-12-03T20:05:01Z
source last accessed on: 2019-12-03T20:05:01Z
label: Accumulo energia @it
label: Almacenamiento de electricidad @es
label: Armazenagem de energia @pt
label: Stockage d'électricité @fr
label: Stromspeicher @de
label: Хранение электроэнергии @ru
label: 电力储存 @zh
label: 蓄電 @zh-hant
label: 電力貯蔵 @ja
label: 에너지 저장 @ko
definition: This industry subgroup includes companies that store electricity via battery, compressed air and other emergent technologies. Relates specifically to equipment manufacturers and developers.
notation: 19101214
valid from: 2014-08-08
valid till: 2020-10-03

Utility Networks
type: BicsLevel3Industry
type: Classifier
type: Discontinued
type: NamedIndividual
is industry of: Utilities
is contemporary version of: http://data.ga-group.nl/ics/bics/191012
is version of: http://data.ga-group.nl/ics/bics/191012
imported on: 2026-06-08T13:03:47.798Z
last refreshed on: 2026-06-08T13:03:47.798Z
source accessed on: 2019-12-03T20:05:01Z
source last accessed on: 2019-12-03T20:05:01Z
label: Réseaux serv coll @fr
label: Redes de serv púb @es
label: Redes serv públ @pt
label: Reti servizi @it
label: Versorgungsnetzwerk @de
label: Инженерные сети @ru
label: 公用事業網 @zh-hant
label: 公用设施网络 @zh
label: 公益施設網 @ja
label: 유틸리티 네트워크 @ko
definition: This industry includes companies that operated regulated electricity, natural gas and water networks.
notation: 191012
valid from: 2014-08-08
valid till: 2020-10-03

Energy Trading
type: BicsLevel4SubIndustry
type: Classifier
type: Discontinued
type: NamedIndividual
is sub industry of: Elec & Gas Mktg & Trading
is contemporary version of: http://data.ga-group.nl/ics/bics/19101310
is version of: http://data.ga-group.nl/ics/bics/19101310
imported on: 2026-06-08T13:03:47.798Z
last refreshed on: 2026-06-08T13:03:47.798Z
source accessed on: 2019-12-03T20:05:01Z
source last accessed on: 2019-12-03T20:05:01Z
label: Comércio de eletricidade @pt
label: Comercio de energía @es
label: Energiehandel @de
label: Négociation en énergie @fr
label: Trading dell'energia @it
label: Торговля энергией @ru
label: 能源交易 @zh
label: 電力&取引 @ja
label: 에너지 거래 @ko
definition: This industry subgroup includes companies that conduct wholesale market trading of electricity, gas and related products for proprietary and portfolio optimization purposes.
notation: 19101310
valid from: 2014-08-08
valid till: 2020-10-03

Electricity Mktg - Retail
type: BicsLevel5Segment
type: Classifier
type: Discontinued
type: NamedIndividual
is level5 segment of: Electricity Marketing
is contemporary version of: http://data.ga-group.nl/ics/bics/1910131110
is version of: http://data.ga-group.nl/ics/bics/1910131110
imported on: 2026-06-08T13:03:47.798Z
last refreshed on: 2026-06-08T13:03:47.798Z
source accessed on: 2019-12-03T20:05:01Z
source last accessed on: 2019-12-03T20:05:01Z
label: Elektrizitäts-Marketing - Einzelhandel @de
label: Marketing de eletricidade - Varejo @pt
label: Marketing de l'électricité - Distribution @fr
label: Marketing elettricità - dettag @it
label: Mercadotecnia de electricidad - Al por menor @es
label: Продажа электричества - Розничная @ru
label: 电力营销-零售 @zh
label: 電力行銷-零售 @zh-hant
label: 電力販売-小売 @ja
label: 전기 마케팅-소매 @ko
definition: This segment includes companies that sell electricity to household and small and medium enterprise (SME) customers.
notation: 1910131110
valid from: 2014-08-08
valid till: 2020-10-03

Electricity Mktg - Wholesale
type: BicsLevel5Segment
type: Classifier
type: Discontinued
type: NamedIndividual
is level5 segment of: Electricity Marketing
is contemporary version of: http://data.ga-group.nl/ics/bics/1910131111
is version of: http://data.ga-group.nl/ics/bics/1910131111
imported on: 2026-06-08T13:03:47.798Z
last refreshed on: 2026-06-08T13:03:47.798Z
source accessed on: 2019-12-03T20:05:01Z
source last accessed on: 2019-12-03T20:05:01Z
label: Elektrizitäts-Marketing - Großhandel @de
label: Marketing de eletricidade - Atacado @pt
label: Marketing de l'électricité - Grossiste @fr
label: Marketing elettricità - ingrosso @it
label: Mercadotecnia de electricidad - Al por mayor @es
label: Рынок электричества - Оптовые продажи @ru
label: 电力营销-批发 @zh
label: 電力行銷-批發 @zh-hant
label: 電力販売-卸売 @ja
label: 전기 마케팅-도매 @ko
definition: This segment includes companies that sell electricity to commercial and industrial customers.
notation: 1910131111
valid from: 2014-08-08
valid till: 2020-10-03

Electricity Marketing
type: BicsLevel4SubIndustry
type: Classifier
type: NamedIndividual
is sub industry of: Elec & Gas Mktg & Trading
is anachronous version of: http://data.ga-group.nl/ics/bics/2010121010
is contemporary version of: http://data.ga-group.nl/ics/bics/19101311
is replaced by: http://data.ga-group.nl/ics/bics/2020/2010121010
is version of: http://data.ga-group.nl/ics/bics/19101311
is version of: http://data.ga-group.nl/ics/bics/2010121010
imported on: 2026-06-08T13:03:47.798Z
last refreshed on: 2026-06-08T13:03:47.798Z
source accessed on: 2019-12-03T20:05:01Z
source last accessed on: 2019-12-03T20:05:01Z
label: Elektrizitäts-Marketing @de
label: Marketing de eletricidade @pt
label: Marketing de l'électricité @fr
label: Marketing elettricità @it
label: Mercadotecnia de electricidad @es
label: Продажа электричества @ru
label: 电力营销 @zh
label: 電力行銷 @zh-hant
label: 電力販売 @ja
label: 전기 마케팅 @ko
definition: This industry subgroup includes companies that sell electricity to end users.
notation: 19101311
valid from: 2014-08-08
valid till: 2020-10-03

Gas Marketing - Retail & Whslr
type: BicsLevel5Segment
type: Classifier
type: Discontinued
type: NamedIndividual
is level5 segment of: Gas Marketing
is contemporary version of: http://data.ga-group.nl/ics/bics/1910131210
is version of: http://data.ga-group.nl/ics/bics/1910131210
imported on: 2026-06-08T13:03:47.798Z
last refreshed on: 2026-06-08T13:03:47.798Z
source accessed on: 2019-12-03T20:05:01Z
source last accessed on: 2019-12-03T20:05:01Z
label: Erdgas-Marketing - EH & GH @de
label: Marketing de gás - Varejo e atac @pt
label: Marketing gas - Dettaglio e ingrosso @it
label: Marketing gaz nat- Gros et détail @fr
label: Mercadotecnia de gas - al p/menor y al p/mayor @es
label: Газовый рынок - розничная и оптовая продажа @ru
label: 天然气营销-零售与批发 @zh
label: 天然氣行銷-零售/批發 @zh-hant
label: 가스 마케팅-소매&도매 @ko
label: ｶﾞｽ販売-小売･卸売 @ja
definition: This segment includes companies that sell natural gas to household and small and medium enterprise (SME) customers.
notation: 1910131210
valid from: 2014-08-08
valid till: 2020-10-03

Gas Midstream Wholesale
type: BicsLevel5Segment
type: Classifier
type: Discontinued
type: NamedIndividual
is level5 segment of: Gas Marketing
is contemporary version of: http://data.ga-group.nl/ics/bics/1910131211
is version of: http://data.ga-group.nl/ics/bics/1910131211
imported on: 2026-06-08T13:03:47.798Z
last refreshed on: 2026-06-08T13:03:47.798Z
source accessed on: 2019-12-03T20:05:01Z
source last accessed on: 2019-12-03T20:05:01Z
label: Erdgas-Midstream, Großhandel @de
label: Grossiste en gaz naturel midstream @fr
label: Midstream de gas al por mayor @es
label: Midstream gás - Atacado @pt
label: Midstream gas ingrosso @it
label: Транспортировка газа - Оптовые продажи @ru
label: 天然气中游批发 @zh
label: 天然氣中游批發 @zh-hant
label: 가스 미드스트림 도매 @ko
label: ｶﾞｽ･ﾐｯﾄﾞｽﾄﾘｰﾑ卸 @ja
definition: This segment includes wholesaling of natural gas from long-term contract, spot market and owned-asset resources to market counterparties and industrial users.
notation: 1910131211
valid from: 2014-08-08
valid till: 2020-10-03

Gas Marketing
type: BicsLevel4SubIndustry
type: Classifier
type: NamedIndividual
is sub industry of: Elec & Gas Mktg & Trading
is anachronous version of: http://data.ga-group.nl/ics/bics/2010121011
is contemporary version of: http://data.ga-group.nl/ics/bics/19101312
is replaced by: http://data.ga-group.nl/ics/bics/2020/2010121011
is version of: http://data.ga-group.nl/ics/bics/19101312
is version of: http://data.ga-group.nl/ics/bics/2010121011
imported on: 2026-06-08T13:03:47.798Z
last refreshed on: 2026-06-08T13:03:47.798Z
source accessed on: 2019-12-03T20:05:01Z
source last accessed on: 2019-12-03T20:05:01Z
label: Erdgas-Marketing @de
label: Marketing de gás @pt
label: Marketing du gaz naturel @fr
label: Marketing gas @it
label: Mercadotecnia de gas @es
label: Газовый рынок @ru
label: 天然气营销 @zh
label: 天然氣行銷 @zh-hant
label: 가스 마케팅 @ko
label: ｶﾞｽ販売 @ja
definition: This industry subgroup includes companies that sell natural gas to end users.
notation: 19101312
valid from: 2014-08-08
valid till: 2020-10-03

Other Elec & Gas Mktg &Trading
type: BicsLevel4SubIndustry
type: Classifier
type: Discontinued
type: NamedIndividual
is sub industry of: Elec & Gas Mktg & Trading
is contemporary version of: http://data.ga-group.nl/ics/bics/19101313
is version of: http://data.ga-group.nl/ics/bics/19101313
imported on: 2026-06-08T13:03:47.798Z
last refreshed on: 2026-06-08T13:03:47.798Z
source accessed on: 2019-12-03T20:05:01Z
source last accessed on: 2019-12-03T20:05:01Z
label: Autres mktg/négociation élect/gaz nat @fr
label: Mktg e trading altra elett e gas @it
label: Otra mercadotecnia y operaciones eléctricas y de gas @es
label: Outros mktg e comércio de elet e gás @pt
label: Sonst. Elek.- & Erdgas-Marketing & -Handel @de
label: Другие операции торговли/распр. электр., газа @ru
label: その他電力&ｶﾞｽ販売･取引 @ja
label: 其他电气营销与交易 @zh
label: 其他電力/天然氣行銷/交易 @zh-hant
label: 기타 전기 & 가스 마케팅 & 거래 @ko
definition: This industry subgroup includes companies that sell and trade electricity, natural gas and related commodities not elsewhere classified.
notation: 19101313
valid from: 2014-08-08
valid till: 2020-10-03

Elec & Gas Mktg & Trading
type: BicsLevel3Industry
type: Classifier
type: NamedIndividual
is industry of: Utilities
is anachronous version of: http://data.ga-group.nl/ics/bics/20101210
is contemporary version of: http://data.ga-group.nl/ics/bics/191013
is replaced by: http://data.ga-group.nl/ics/bics/2020/20101210
is version of: http://data.ga-group.nl/ics/bics/191013
is version of: http://data.ga-group.nl/ics/bics/20101210
imported on: 2026-06-08T13:03:47.798Z
last refreshed on: 2026-06-08T13:03:47.798Z
source accessed on: 2019-12-03T20:05:01Z
source last accessed on: 2019-12-03T20:05:01Z
label: Márk/ops elec/gas @es
label: Marketing & Handel v. Elektrizität & Gas @de
label: Marketing elettricità, gas e trading @it
label: Marketing/négo élec/gaz nat @fr
label: Mktg e neg elet e gás @pt
label: Продажа электричества и газа @ru
label: 电气营销与交易 @zh
label: 電力天然氣行銷交易 @zh-hant
label: 電力･ｶﾞｽ販売･取引 @ja
label: 전기 & 가스 마케팅 & 거래 @ko
definition: This industry includes companies that sell and trade electricity, natural gas and related commodities.
notation: 191013
valid from: 2014-08-08
valid till: 2020-10-03

Utilities
type: BicsLevel2IndustryGroup
type: Classifier
type: NamedIndividual
is industry group of: Utilities
is anachronous version of: http://data.ga-group.nl/ics/bics/2010
is contemporary version of: http://data.ga-group.nl/ics/bics/1910
is replaced by: http://data.ga-group.nl/ics/bics/2020/2010
is version of: http://data.ga-group.nl/ics/bics/1910
is version of: http://data.ga-group.nl/ics/bics/2010
imported on: 2026-06-08T13:03:47.798Z
last refreshed on: 2026-06-08T13:03:47.798Z
source accessed on: 2019-12-03T20:05:01Z
source last accessed on: 2019-12-03T20:05:01Z
label: Serv pubb @it
label: Serviços públicos @pt
label: Services à la collectivité @fr
label: Servicios públicos @es
label: Versorger @de
label: Энергоносители @ru
label: 公用事業 @zh-hant
label: 公用设施 @zh
label: 公益事業 @ja
label: 유틸리티 @ko
definition: This sector includes companies that generate, distribute or market electricity, water or natural gas resources to end consumers.
notation: 1910
valid from: 2014-08-08
valid till: 2020-10-03

Utilities
type: BicsLevel1Sector
type: Classifier
type: NamedIndividual
is anachronous version of: http://data.ga-group.nl/ics/bics/20
is contemporary version of: http://data.ga-group.nl/ics/bics/19
is replaced by: http://data.ga-group.nl/ics/bics/2020/20
is version of: http://data.ga-group.nl/ics/bics/19
is version of: http://data.ga-group.nl/ics/bics/20
imported on: 2026-06-08T13:03:47.798Z
last refreshed on: 2026-06-08T13:03:47.798Z
source accessed on: 2019-12-03T20:05:01Z
source last accessed on: 2019-12-03T20:05:01Z
label: Serv púb @es
label: Services aux collectivités @fr
label: Servizi pubblici @it
label: Versorgung @de
label: Коммунальные услуги @ru
label: 公用事业 @zh
label: 公用事業 @zh-hant
label: 公益事業 @ja
label: 시설 @ko
definition: This sector includes companies that generate, distribute or market electricity, water or natural gas resources to end consumers.
notation: 19
valid from: 2014-08-08
valid till: 2020-10-03

Corporate Adjustments
type: BicsLevel3Industry
type: Classifier
type: NamedIndividual
is industry of: Unclassifiable
is anachronous version of: http://data.ga-group.nl/ics/bics/99101010
is contemporary version of: http://data.ga-group.nl/ics/bics/201010
is replaced by: http://data.ga-group.nl/ics/bics/2020/99101010
is version of: http://data.ga-group.nl/ics/bics/201010
is version of: http://data.ga-group.nl/ics/bics/99101010
imported on: 2026-06-08T13:03:47.798Z
last refreshed on: 2026-06-08T13:03:47.798Z
source accessed on: 2019-12-03T20:05:01Z
source last accessed on: 2019-12-03T20:05:01Z
label: Ajustements d'entreprise @fr
label: Ajustes corp @es
label: Ajustes corporativos @pt
label: Rettifiche societarie @it
label: Unternehmensberichtigungen @de
label: Корп. корректировки @ru
label: 企業調整 @ja
label: 公司調整 @zh-hant
label: 公司调整 @zh
label: 기업 조정 @ko
definition: For segments that are reported for corporate adjustments or for administrative office activities. These segments are not considered a part of their business activities.
notation: 201010
valid from: 2014-08-08
valid till: 2020-10-03

Intersegment Adjustments
type: BicsLevel3Industry
type: Classifier
type: NamedIndividual
is industry of: Unclassifiable
is anachronous version of: http://data.ga-group.nl/ics/bics/99101012
is contemporary version of: http://data.ga-group.nl/ics/bics/201011
is replaced by: http://data.ga-group.nl/ics/bics/2020/99101012
is version of: http://data.ga-group.nl/ics/bics/201011
is version of: http://data.ga-group.nl/ics/bics/99101012
imported on: 2026-06-08T13:03:47.798Z
last refreshed on: 2026-06-08T13:03:47.798Z
source accessed on: 2019-12-03T20:05:01Z
source last accessed on: 2019-12-03T20:05:01Z
label: Ajustements d'intersegment @fr
label: Ajustes de intersegmentos @pt
label: Ajustes intersegmento @es
label: Intersegmentberichtigungen @de
label: Rettifiche intersegmento @it
label: Интерсегм. корректировки @ru
label: 跨分类调整 @zh
label: 跨分類調整 @zh-hant
label: 사업부문간 조정 @ko
label: ｾｸﾞﾒﾝﾄ間取引消去 @ja
definition: For segments that adjusts revenue to account for intersegment or non-external revenue sales. These segments are not considered a part of their business activities.
notation: 201011
valid from: 2014-08-08
valid till: 2020-10-03

Unknown
type: BicsLevel3Industry
type: Classifier
type: NamedIndividual
is industry of: Unclassifiable
is anachronous version of: http://data.ga-group.nl/ics/bics/99101010
is contemporary version of: http://data.ga-group.nl/ics/bics/201012
is replaced by: http://data.ga-group.nl/ics/bics/2020/99101010
is version of: http://data.ga-group.nl/ics/bics/201012
is version of: http://data.ga-group.nl/ics/bics/99101010
imported on: 2026-06-08T13:03:47.798Z
last refreshed on: 2026-06-08T13:03:47.798Z
source accessed on: 2019-12-03T20:05:01Z
source last accessed on: 2019-12-03T20:05:01Z
label: Deconocido @es
label: Desconhecido @pt
label: Ignoto @it
label: Inconnu @fr
label: Unbekannt @de
label: Нет данных @ru
label: 不明 @ja
label: 未知 @zh
label: 미확인 @ko
definition: For companies in cases where no available information is available to discern their business activities.
notation: 201012
valid from: 2014-08-08
valid till: 2020-10-03

Unclassifiable
type: BicsLevel2IndustryGroup
type: Classifier
type: NamedIndividual
is industry group of: Unclassifiable
is anachronous version of: http://data.ga-group.nl/ics/bics/991010
is contemporary version of: http://data.ga-group.nl/ics/bics/2010
is replaced by: http://data.ga-group.nl/ics/bics/2020/991010
is version of: http://data.ga-group.nl/ics/bics/2010
is version of: http://data.ga-group.nl/ics/bics/991010
imported on: 2026-06-08T13:03:47.798Z
last refreshed on: 2026-06-08T13:03:47.798Z
source accessed on: 2019-12-03T20:05:01Z
source last accessed on: 2019-12-03T20:05:01Z
label: Não classificado @pt
label: Nicht klassifiziert @de
label: No clasificado @es
label: Non classifié @fr
label: Non classificato @it
label: Неклассифицируемо @ru
label: 分類不能 @ja
label: 未分类 @zh
label: 未分類 @zh-hant
label: 미��류 @ko
definition: For special classification/segment purposes only.
notation: 2010
valid from: 2014-08-08
valid till: 2020-10-03

Unclassifiable
type: BicsLevel1Sector
type: Classifier
type: NamedIndividual
is anachronous version of: http://data.ga-group.nl/ics/bics/9910
is contemporary version of: http://data.ga-group.nl/ics/bics/20
is replaced by: http://data.ga-group.nl/ics/bics/2020/9910
is version of: http://data.ga-group.nl/ics/bics/20
is version of: http://data.ga-group.nl/ics/bics/9910
imported on: 2026-06-08T13:03:47.798Z
last refreshed on: 2026-06-08T13:03:47.798Z
source accessed on: 2019-12-03T20:05:01Z
source last accessed on: 2019-12-03T20:05:01Z
label: Não classificado @pt
label: Nicht klassifiziert @de
label: No clasificado @es
label: Non classifié @fr
label: Non classificato @it
label: Неклассифицируемо @ru
label: 分類不能 @ja
label: 未分类 @zh
label: 未分類 @zh-hant
label: 미분류 @ko
definition: For special classification/segment purposes only.
notation: 20
valid from: 2014-08-08
valid till: 2020-10-03