BICS individuals
type: Ontology
download URL: http://data.ga-group.nl/ics/bics.ttl
abstract: This ontology includes individuals representing the set of classification codes based on the principal business activity of the company. This graph contains all BICS classification codes that have ever been valid along with validity information.
creator: https://orcid.org/0000-0002-7352-2825
description: The Bloomberg Industry Classification Standard (BICS) is an industry classification taxonomy launched by Bloomberg in 2014. Codes are at least four-tiered, but up to eight tiers are possible. Codes are numeric but not prefix-free. The first tier is called sector, the second tier is the industry group, the third tier is the industry, and the fourth tier is the subindustry. Tiers five to eight are simply called segments. Bloomberg is responsible for assigning a BICS classification to all major public companies. Each company is allocated to the subindustry that most closely represents the nature of its business according to the BICS classification methodology.
format: text/turtle
issued: 2026-06-03T02:25:19Z
language: en
license: https://creativecommons.org/licenses/by-sa/4.0/
modified: 2026-06-03T02:25:19Z
publisher: https://orcid.org/0000-0002-7352-2825
has maturity level: Release
imports: classes
imports: ics
content language: owl2-quick-reference
label: BICS
contributor: PAMIYA Strategic Advisors GmbH
copyright: Copyright (c) 2014 Bloomberg LLC
copyright: Copyright (c) 2022-2026 PAMIYA Strategic Advisors GmbH
filename: bics.ttl
valid from: 2014
preferred namespace prefix: bics

Advertising Agencies
type: BicsLevel6Segment
type: Classifier
type: NamedIndividual
is level6 segment of: Advertising Agencies & Svcs
replaces: Advertising Agencies & Svcs
created with: infer-bics.sql
derived from: Advertising Agencies
  type: BicsLevel5Segment
  type: Classifier
  type: AnachronousDerivation
  derived from: http://data.ga-group.nl/ics/bics/2014/1010101010
  source accessed on: 2019-12-03T20:05:01Z
  source last accessed on: 2019-12-03T20:05:01Z
  definition: This segment includes companies that create advertising campaigns for use in newspapers, magazines, radio, television or other media.
  notation: 1010101010
  valid from: 2014-08-08
  valid till: 2020-10-03
derived from: Advertising Agencies
  type: BicsLevel6Segment
  type: Classifier
  type: ContemporaryDerivation
  derived from: http://data.ga-group.nl/ics/bics/2020/101010101010
  source accessed on: 2023-07-03T18:11:29Z
  source last accessed on: 2023-07-03T18:11:29Z
  definition: This segment includes companies that create advertising campaigns for use in newspapers, magazines, radio, television, or other media.
  notation: 101010101010
  valid from: 2020-10-03
  valid till: 2024-06-07
derived from: Advertising Agencies
  type: BicsLevel6Segment
  type: Classifier
  type: ContemporaryDerivation
  derived from: http://data.ga-group.nl/ics/bics/2024/101010101010
  source accessed on: 2024-06-05T14:42:36Z
  source last accessed on: 2024-06-05T14:42:36Z
  definition: This segment includes companies that create advertising campaigns for use in newspapers, magazines, radio, television or other media.
  notation: 101010101010
  valid from: 2024-06-07
source accessed on: 2023-07-03T18:11:29Z
source last accessed on: 2024-06-05T14:42:36Z
definition: This segment includes companies that create advertising campaigns for use in newspapers, magazines, radio, television or other media.
notation: 101010101010
valid from: 2020-10-03

E-Marketing
type: BicsLevel6Segment
type: Classifier
type: NamedIndividual
is level6 segment of: Advertising Agencies & Svcs
replaces: Direct Marketing
created with: infer-bics.sql
derived from: E-Marketing
  type: BicsLevel5Segment
  type: Classifier
  type: AnachronousDerivation
  derived from: http://data.ga-group.nl/ics/bics/2014/1010101011
  source accessed on: 2019-12-03T20:05:01Z
  source last accessed on: 2019-12-03T20:05:01Z
  definition: This segment includes companies that specialize in creating advertising campaigns via Internet media. Includes email marketing, mobile and website display advertising, search engine optimization, and social media marketing.
  notation: 1010101011
  valid from: 2014-08-08
  valid till: 2020-10-03
derived from: E-Marketing
  type: BicsLevel6Segment
  type: Classifier
  type: ContemporaryDerivation
  derived from: http://data.ga-group.nl/ics/bics/2020/101010101011
  derived from: http://data.ga-group.nl/ics/bics/2024/101010101011
  source accessed on: 2023-07-03T18:11:29Z
  source last accessed on: 2024-06-05T14:42:36Z
  definition: This segment includes companies that specialize in creating advertising campaigns via Internet media. Includes email marketing, mobile and website advertising, search engine optimization, and social media marketing.
  notation: 101010101011
  valid from: 2020-10-03
source accessed on: 2023-07-03T18:11:29Z
source last accessed on: 2024-06-05T14:42:36Z
definition: This segment includes companies that specialize in creating advertising campaigns via Internet media. Includes email marketing, mobile and website advertising, search engine optimization, and social media marketing.
notation: 101010101011
valid from: 2020-10-03

Marketing Consulting Services
type: BicsLevel7Segment
type: Classifier
type: NamedIndividual
is level7 segment of: Market Research & Consulting
replaces: Marketing Consulting Services
created with: infer-bics.sql
derived from: Marketing Consulting Services
  type: BicsLevel6Segment
  type: Classifier
  type: AnachronousDerivation
  derived from: http://data.ga-group.nl/ics/bics/2014/101010101210
  source accessed on: 2019-12-03T20:05:01Z
  source last accessed on: 2019-12-03T20:05:01Z
  definition: This segment includes companies that provide marketing consulting services.
  notation: 101010101210
  valid from: 2014-08-08
  valid till: 2020-10-03
derived from: Marketing Consulting Services
  type: BicsLevel7Segment
  type: Classifier
  type: ContemporaryDerivation
  derived from: http://data.ga-group.nl/ics/bics/2020/10101010101210
  derived from: http://data.ga-group.nl/ics/bics/2024/10101010101210
  source accessed on: 2023-07-03T18:11:29Z
  source last accessed on: 2024-06-05T14:42:36Z
  definition: This segment includes companies that provide marketing consulting services.
  notation: 10101010101210
  valid from: 2020-10-03
source accessed on: 2023-07-03T18:11:29Z
source last accessed on: 2024-06-05T14:42:36Z
definition: This segment includes companies that provide marketing consulting services.
notation: 10101010101210
valid from: 2020-10-03

Market Research
type: BicsLevel7Segment
type: Classifier
type: NamedIndividual
is level7 segment of: Market Research & Consulting
replaces: Mktg Res & Public Opinion Poll
created with: infer-bics.sql
derived from: Mktg Res & Public Opinion Poll
  type: BicsLevel6Segment
  type: Classifier
  type: AnachronousDerivation
  derived from: http://data.ga-group.nl/ics/bics/2014/101010101211
  source accessed on: 2019-12-03T20:05:01Z
  source last accessed on: 2019-12-03T20:05:01Z
  definition: This segment includes companies that provide market research and opinion polling.
  notation: 101010101211
  valid from: 2014-08-08
  valid till: 2020-10-03
derived from: Market Research
  type: BicsLevel7Segment
  type: Classifier
  type: ContemporaryDerivation
  derived from: http://data.ga-group.nl/ics/bics/2020/10101010101211
  derived from: http://data.ga-group.nl/ics/bics/2024/10101010101211
  source accessed on: 2023-07-03T18:11:29Z
  source last accessed on: 2024-06-05T14:42:36Z
  definition: This segment includes companies that provide market research and opinion polling.
  notation: 10101010101211
  valid from: 2020-10-03
source accessed on: 2023-07-03T18:11:29Z
source last accessed on: 2024-06-05T14:42:36Z
definition: This segment includes companies that provide market research and opinion polling.
notation: 10101010101211
valid from: 2020-10-03

Market Research & Consulting
type: BicsLevel6Segment
type: Classifier
type: NamedIndividual
is level6 segment of: Advertising Agencies & Svcs
replaces: Market Research & Consulting
created with: infer-bics.sql
derived from: Market Research & Consulting
  type: BicsLevel5Segment
  type: Classifier
  type: AnachronousDerivation
  derived from: http://data.ga-group.nl/ics/bics/2014/1010101012
  source accessed on: 2019-12-03T20:05:01Z
  source last accessed on: 2019-12-03T20:05:01Z
  definition: This segment includes companies that provide market research, opinion polling or marketing consulting services.
  notation: 1010101012
  valid from: 2014-08-08
  valid till: 2020-10-03
derived from: Market Research & Consulting
  type: BicsLevel6Segment
  type: Classifier
  type: ContemporaryDerivation
  derived from: http://data.ga-group.nl/ics/bics/2020/101010101012
  source accessed on: 2023-07-03T18:11:29Z
  source last accessed on: 2023-07-03T18:11:29Z
  definition: This segment includes companies that provide market research, opinion polling, or marketing consulting services.
  notation: 101010101012
  valid from: 2020-10-03
  valid till: 2024-06-07
derived from: Market Research & Consulting
  type: BicsLevel6Segment
  type: Classifier
  type: ContemporaryDerivation
  derived from: http://data.ga-group.nl/ics/bics/2024/101010101012
  source accessed on: 2024-06-05T14:42:36Z
  source last accessed on: 2024-06-05T14:42:36Z
  definition: This segment includes companies that provide market research, opinion polling or marketing consulting services.
  notation: 101010101012
  valid from: 2024-06-07
source accessed on: 2023-07-03T18:11:29Z
source last accessed on: 2024-06-05T14:42:36Z
definition: This segment includes companies that provide market research, opinion polling or marketing consulting services.
notation: 101010101012
valid from: 2020-10-03

Media Representatives
type: BicsLevel6Segment
type: Classifier
type: NamedIndividual
is level6 segment of: Advertising Agencies & Svcs
replaces: Media Representatives
created with: infer-bics.sql
derived from: Media Representatives
  type: BicsLevel5Segment
  type: Classifier
  type: AnachronousDerivation
  derived from: http://data.ga-group.nl/ics/bics/2014/1010101013
  source accessed on: 2019-12-03T20:05:01Z
  source last accessed on: 2019-12-03T20:05:01Z
  definition: This segment includes companies that sell media time or space on behalf media owners.
  notation: 1010101013
  valid from: 2014-08-08
  valid till: 2020-10-03
derived from: Media Representatives
  type: BicsLevel6Segment
  type: Classifier
  type: ContemporaryDerivation
  derived from: http://data.ga-group.nl/ics/bics/2020/101010101013
  derived from: http://data.ga-group.nl/ics/bics/2024/101010101013
  source accessed on: 2023-07-03T18:11:29Z
  source last accessed on: 2024-06-05T14:42:36Z
  definition: This segment includes companies that sell media time or space on behalf of media owners.
  notation: 101010101013
  valid from: 2020-10-03
source accessed on: 2023-07-03T18:11:29Z
source last accessed on: 2024-06-05T14:42:36Z
definition: This segment includes companies that sell media time or space on behalf of media owners.
notation: 101010101013
valid from: 2020-10-03

Public Relations Agencies
type: BicsLevel6Segment
type: Classifier
type: NamedIndividual
is level6 segment of: Advertising Agencies & Svcs
replaces: Public Relations Agencies
created with: infer-bics.sql
derived from: Public Relations Agencies
  type: BicsLevel5Segment
  type: Classifier
  type: AnachronousDerivation
  derived from: http://data.ga-group.nl/ics/bics/2014/1010101014
  source accessed on: 2019-12-03T20:05:01Z
  source last accessed on: 2019-12-03T20:05:01Z
  definition: This segment includes companies that provide public relations services. Public relations services manage the communication and the spread of information between their clients and the public.
  notation: 1010101014
  valid from: 2014-08-08
  valid till: 2020-10-03
derived from: Public Relations Agencies
  type: BicsLevel6Segment
  type: Classifier
  type: ContemporaryDerivation
  derived from: http://data.ga-group.nl/ics/bics/2020/101010101014
  source accessed on: 2023-07-03T18:11:29Z
  source last accessed on: 2023-07-03T18:11:29Z
  definition: This segment includes companies that provide public relations services.
  notation: 101010101014
  valid from: 2020-10-03
  valid till: 2024-06-07
derived from: Public Relations Agencies
  type: BicsLevel6Segment
  type: Classifier
  type: ContemporaryDerivation
  derived from: http://data.ga-group.nl/ics/bics/2024/101010101014
  source accessed on: 2024-06-05T14:42:36Z
  source last accessed on: 2024-06-05T14:42:36Z
  definition: This segment includes companies that provide public relations services. Public relations services manage the communication and spread of information between their clients and the public.
  notation: 101010101014
  valid from: 2024-06-07
source accessed on: 2023-07-03T18:11:29Z
source last accessed on: 2024-06-05T14:42:36Z
definition: This segment includes companies that provide public relations services. Public relations services manage the communication and spread of information between their clients and the public.
notation: 101010101014
valid from: 2020-10-03

Advertising Agencies & Svcs
type: BicsLevel5Segment
type: Classifier
type: NamedIndividual
is level5 segment of: Advertising & Marketing
is replaced by: Advertising Agencies
created with: infer-bics.sql
derived from: Advertising Agencies & Svcs
  type: BicsLevel4SubIndustry
  type: Classifier
  type: AnachronousDerivation
  derived from: http://data.ga-group.nl/ics/bics/2014/10101010
  source accessed on: 2019-12-03T20:05:01Z
  source last accessed on: 2019-12-03T20:05:01Z
  definition: This industry subgroup includes companies that create advertising campaigns for media use, provide market research or marketing consulting services, or act as public relations or media representatives.
  notation: 10101010
  valid from: 2014-08-08
  valid till: 2020-10-03
derived from: Advertising Agencies
  type: BicsLevel5Segment
  type: Classifier
  type: ContemporaryDerivation
  derived from: http://data.ga-group.nl/ics/bics/2014/1010101010
  source accessed on: 2019-12-03T20:05:01Z
  source last accessed on: 2019-12-03T20:05:01Z
  definition: This segment includes companies that create advertising campaigns for use in newspapers, magazines, radio, television or other media.
  notation: 1010101010
  valid from: 2014-08-08
  valid till: 2020-10-03
derived from: Advertising Agencies & Svcs
  type: BicsLevel5Segment
  type: Classifier
  type: ContemporaryDerivation
  derived from: http://data.ga-group.nl/ics/bics/2020/1010101010
  derived from: http://data.ga-group.nl/ics/bics/2024/1010101010
  source accessed on: 2023-07-03T18:11:29Z
  source last accessed on: 2024-06-05T14:42:36Z
  definition: This segment includes companies that create advertising campaigns for media use, provide market research or marketing consulting services, or act as public relations or media representatives.
  notation: 1010101010
  valid from: 2020-10-03
source accessed on: 2019-12-03T20:05:01Z
source last accessed on: 2024-06-05T14:42:36Z
definition: This segment includes companies that create advertising campaigns for media use, provide market research or marketing consulting services, or act as public relations or media representatives.
notation: 1010101010
valid from: 2014-08-08

Advertising Material Distr Svcs
type: BicsLevel6Segment
type: Classifier
type: NamedIndividual
is level6 segment of: Direct Marketing
replaces: Advertising Material Distr Svcs
created with: infer-bics.sql
derived from: Affiliate Marketing
  type: BicsLevel6Segment
  type: Classifier
  type: ContemporaryDerivation
  derived from: http://data.ga-group.nl/ics/bics/2014/101010101110
  source accessed on: 2019-12-03T20:05:01Z
  source last accessed on: 2019-12-03T20:05:01Z
  definition: This segment includes companies that operate affiliate marketing networks. Affiliates are compensated when a customer is brought to the merchant. These affiliate marketing networks process these transactions and provide the systems for merchants and affiliates to meet on a fee basis.
  notation: 101010101110
  valid from: 2014-08-08
  valid till: 2020-10-03
derived from: Advertising Material Distr Svcs
  type: BicsLevel5Segment
  type: Classifier
  type: AnachronousDerivation
  derived from: http://data.ga-group.nl/ics/bics/2014/1010101110
  source accessed on: 2019-12-03T20:05:01Z
  source last accessed on: 2019-12-03T20:05:01Z
  definition: This segment includes companies that direct distribute advertising materials or samples.
  notation: 1010101110
  valid from: 2014-08-08
  valid till: 2020-10-03
derived from: Advertising Material Distr Svcs
  type: BicsLevel6Segment
  type: Classifier
  type: ContemporaryDerivation
  derived from: http://data.ga-group.nl/ics/bics/2020/101010101110
  derived from: http://data.ga-group.nl/ics/bics/2024/101010101110
  source accessed on: 2023-07-03T18:11:29Z
  source last accessed on: 2024-06-05T14:42:36Z
  definition: This segment includes companies that direct distribute advertising materials or samples.
  notation: 101010101110
  valid from: 2020-10-03
source accessed on: 2019-12-03T20:05:01Z
source last accessed on: 2024-06-05T14:42:36Z
definition: This segment includes companies that direct distribute advertising materials or samples.
notation: 101010101110
valid from: 2014-08-08

Direct Mail Advertising
type: BicsLevel6Segment
type: Classifier
type: NamedIndividual
is level6 segment of: Direct Marketing
replaces: Direct Mail Advertising
created with: infer-bics.sql
derived from: Direct Mail Advertising
  type: BicsLevel5Segment
  type: Classifier
  type: AnachronousDerivation
  derived from: http://data.ga-group.nl/ics/bics/2014/1010101111
  source accessed on: 2019-12-03T20:05:01Z
  source last accessed on: 2019-12-03T20:05:01Z
  definition: This segment includes companies that create advertisements and campaigns that are distributed through mail services. Includes mail advertisements, fliers, pamphlets and coupons.
  notation: 1010101111
  valid from: 2014-08-08
  valid till: 2020-10-03
derived from: Direct Mail Advertising
  type: BicsLevel6Segment
  type: Classifier
  type: ContemporaryDerivation
  derived from: http://data.ga-group.nl/ics/bics/2020/101010101111
  derived from: http://data.ga-group.nl/ics/bics/2024/101010101111
  source accessed on: 2023-07-03T18:11:29Z
  source last accessed on: 2024-06-05T14:42:36Z
  definition: This segment includes companies that create advertisements and campaigns that are distributed through mail services. Includes mail advertisements, fliers, pamphlets, and coupons.
  notation: 101010101111
  valid from: 2020-10-03
source accessed on: 2023-07-03T18:11:29Z
source last accessed on: 2024-06-05T14:42:36Z
definition: This segment includes companies that create advertisements and campaigns that are distributed through mail services. Includes mail advertisements, fliers, pamphlets, and coupons.
notation: 101010101111
valid from: 2020-10-03

Direct Marketing
type: BicsLevel5Segment
type: Classifier
type: NamedIndividual
is level5 segment of: Advertising & Marketing
is replaced by: E-Marketing
created with: infer-bics.sql
derived from: E-Marketing
  type: BicsLevel5Segment
  type: Classifier
  type: ContemporaryDerivation
  derived from: http://data.ga-group.nl/ics/bics/2014/1010101011
  source accessed on: 2019-12-03T20:05:01Z
  source last accessed on: 2019-12-03T20:05:01Z
  definition: This segment includes companies that specialize in creating advertising campaigns via Internet media. Includes email marketing, mobile and website display advertising, search engine optimization, and social media marketing.
  notation: 1010101011
  valid from: 2014-08-08
  valid till: 2020-10-03
derived from: Direct Marketing
  type: BicsLevel4SubIndustry
  type: Classifier
  type: AnachronousDerivation
  derived from: http://data.ga-group.nl/ics/bics/2014/10101011
  source accessed on: 2019-12-03T20:05:01Z
  source last accessed on: 2019-12-03T20:05:01Z
  definition: This industry subgroup includes companies involved in the creation or distribution of direct marketing advertisements. Includes mail advertisements, telemarketing, coupons, and text (SMS) advertisements.
  notation: 10101011
  valid from: 2014-08-08
  valid till: 2020-10-03
derived from: Direct Marketing
  type: BicsLevel5Segment
  type: Classifier
  type: ContemporaryDerivation
  derived from: http://data.ga-group.nl/ics/bics/2020/1010101011
  derived from: http://data.ga-group.nl/ics/bics/2024/1010101011
  source accessed on: 2023-07-03T18:11:29Z
  source last accessed on: 2024-06-05T14:42:36Z
  definition: This segment includes companies involved in the creation or distribution of direct marketing advertisements. Includes mail advertisements, telemarketing, coupons, and text (SMS) advertisements.
  notation: 1010101011
  valid from: 2020-10-03
source accessed on: 2019-12-03T20:05:01Z
source last accessed on: 2024-06-05T14:42:36Z
definition: This segment includes companies involved in the creation or distribution of direct marketing advertisements. Includes mail advertisements, telemarketing, coupons, and text (SMS) advertisements.
notation: 1010101011
valid from: 2014-08-08

Marketing Consulting Services
type: BicsLevel6Segment
type: Classifier
type: NamedIndividual
is level6 segment of: Market Research & Consulting
is replaced by: Marketing Consulting Services
created with: infer-bics.sql
derived from: Marketing Consulting Services
  type: BicsLevel6Segment
  type: Classifier
  type: ContemporaryDerivation
  derived from: http://data.ga-group.nl/ics/bics/2014/101010101210
  source accessed on: 2019-12-03T20:05:01Z
  source last accessed on: 2019-12-03T20:05:01Z
  definition: This segment includes companies that provide marketing consulting services.
  notation: 101010101210
  valid from: 2014-08-08
  valid till: 2020-10-03
source accessed on: 2019-12-03T20:05:01Z
source last accessed on: 2019-12-03T20:05:01Z
definition: This segment includes companies that provide marketing consulting services.
notation: 101010101210
valid from: 2014-08-08
valid till: 2020-10-03

Mktg Res & Public Opinion Poll
type: BicsLevel6Segment
type: Classifier
type: NamedIndividual
is level6 segment of: Market Research & Consulting
is replaced by: Market Research
created with: infer-bics.sql
derived from: Mktg Res & Public Opinion Poll
  type: BicsLevel6Segment
  type: Classifier
  type: ContemporaryDerivation
  derived from: http://data.ga-group.nl/ics/bics/2014/101010101211
  source accessed on: 2019-12-03T20:05:01Z
  source last accessed on: 2019-12-03T20:05:01Z
  definition: This segment includes companies that provide market research and opinion polling.
  notation: 101010101211
  valid from: 2014-08-08
  valid till: 2020-10-03
source accessed on: 2019-12-03T20:05:01Z
source last accessed on: 2019-12-03T20:05:01Z
definition: This segment includes companies that provide market research and opinion polling.
notation: 101010101211
valid from: 2014-08-08
valid till: 2020-10-03

Market Research & Consulting
type: BicsLevel5Segment
type: Classifier
type: NamedIndividual
is level5 segment of: Advertising & Marketing
is replaced by: Market Research & Consulting
created with: infer-bics.sql
derived from: Market Research & Consulting
  type: BicsLevel5Segment
  type: Classifier
  type: ContemporaryDerivation
  derived from: http://data.ga-group.nl/ics/bics/2014/1010101012
  source accessed on: 2019-12-03T20:05:01Z
  source last accessed on: 2019-12-03T20:05:01Z
  definition: This segment includes companies that provide market research, opinion polling or marketing consulting services.
  notation: 1010101012
  valid from: 2014-08-08
  valid till: 2020-10-03
source accessed on: 2019-12-03T20:05:01Z
source last accessed on: 2019-12-03T20:05:01Z
definition: This segment includes companies that provide market research, opinion polling or marketing consulting services.
notation: 1010101012
valid from: 2014-08-08
valid till: 2020-10-03

Media Representatives
type: BicsLevel5Segment
type: Classifier
type: NamedIndividual
is level5 segment of: Advertising & Marketing
is replaced by: Media Representatives
created with: infer-bics.sql
derived from: Media Representatives
  type: BicsLevel5Segment
  type: Classifier
  type: ContemporaryDerivation
  derived from: http://data.ga-group.nl/ics/bics/2014/1010101013
  source accessed on: 2019-12-03T20:05:01Z
  source last accessed on: 2019-12-03T20:05:01Z
  definition: This segment includes companies that sell media time or space on behalf media owners.
  notation: 1010101013
  valid from: 2014-08-08
  valid till: 2020-10-03
source accessed on: 2019-12-03T20:05:01Z
source last accessed on: 2019-12-03T20:05:01Z
definition: This segment includes companies that sell media time or space on behalf media owners.
notation: 1010101013
valid from: 2014-08-08
valid till: 2020-10-03

Public Relations Agencies
type: BicsLevel5Segment
type: Classifier
type: NamedIndividual
is level5 segment of: Advertising & Marketing
is replaced by: Public Relations Agencies
created with: infer-bics.sql
derived from: Public Relations Agencies
  type: BicsLevel5Segment
  type: Classifier
  type: ContemporaryDerivation
  derived from: http://data.ga-group.nl/ics/bics/2014/1010101014
  source accessed on: 2019-12-03T20:05:01Z
  source last accessed on: 2019-12-03T20:05:01Z
  definition: This segment includes companies that provide public relations services. Public relations services manage the communication and the spread of information between their clients and the public.
  notation: 1010101014
  valid from: 2014-08-08
  valid till: 2020-10-03
source accessed on: 2019-12-03T20:05:01Z
source last accessed on: 2019-12-03T20:05:01Z
definition: This segment includes companies that provide public relations services. Public relations services manage the communication and the spread of information between their clients and the public.
notation: 1010101014
valid from: 2014-08-08
valid till: 2020-10-03

Advertising & Marketing
type: BicsLevel4SubIndustry
type: Classifier
type: NamedIndividual
replaces: Advertising & Marketing
created with: infer-bics.sql
derived from: Advertising & Marketing
  type: BicsLevel3Industry
  type: Classifier
  type: AnachronousDerivation
  derived from: http://data.ga-group.nl/ics/bics/2014/101010
  source accessed on: 2019-12-03T20:05:01Z
  source last accessed on: 2019-12-03T20:05:01Z
  definition: This industry includes companies that provide advertising and marketing services. These services include the creation of advertising campaigns for use in media, display, or direct mail advertising and other related services.
  notation: 101010
  valid from: 2014-08-08
  valid till: 2020-10-03
derived from: Advertising Agencies & Svcs
  type: BicsLevel4SubIndustry
  type: Classifier
  type: ContemporaryDerivation
  derived from: http://data.ga-group.nl/ics/bics/2014/10101010
  source accessed on: 2019-12-03T20:05:01Z
  source last accessed on: 2019-12-03T20:05:01Z
  definition: This industry subgroup includes companies that create advertising campaigns for media use, provide market research or marketing consulting services, or act as public relations or media representatives.
  notation: 10101010
  valid from: 2014-08-08
  valid till: 2020-10-03
derived from: Advertising & Marketing
  type: BicsLevel4SubIndustry
  type: Classifier
  type: ContemporaryDerivation
  derived from: http://data.ga-group.nl/ics/bics/2020/10101010
  derived from: http://data.ga-group.nl/ics/bics/2024/10101010
  source accessed on: 2023-07-03T18:11:29Z
  source last accessed on: 2024-06-05T14:42:36Z
  definition: This industry subgroup includes companies that provide advertising and marketing services. Includes the creation of advertising campaigns for use in media, display, or direct mail advertising and other related services.
  notation: 10101010
  valid from: 2020-10-03
source accessed on: 2019-12-03T20:05:01Z
source last accessed on: 2024-06-05T14:42:36Z
definition: This industry subgroup includes companies that provide advertising and marketing services. Includes the creation of advertising campaigns for use in media, display, or direct mail advertising and other related services.
notation: 10101010
valid from: 2014-08-08

Advertising Material Distr Svcs
type: BicsLevel5Segment
type: Classifier
type: NamedIndividual
is level5 segment of: Direct Marketing
is replaced by: Advertising Material Distr Svcs
created with: infer-bics.sql
derived from: Advertising Material Distr Svcs
  type: BicsLevel5Segment
  type: Classifier
  type: ContemporaryDerivation
  derived from: http://data.ga-group.nl/ics/bics/2014/1010101110
  source accessed on: 2019-12-03T20:05:01Z
  source last accessed on: 2019-12-03T20:05:01Z
  definition: This segment includes companies that direct distribute advertising materials or samples.
  notation: 1010101110
  valid from: 2014-08-08
  valid till: 2020-10-03
source accessed on: 2019-12-03T20:05:01Z
source last accessed on: 2019-12-03T20:05:01Z
definition: This segment includes companies that direct distribute advertising materials or samples.
notation: 1010101110
valid from: 2014-08-08
valid till: 2020-10-03

Direct Mail Advertising
type: BicsLevel5Segment
type: Classifier
type: NamedIndividual
is level5 segment of: Direct Marketing
is replaced by: Direct Mail Advertising
created with: infer-bics.sql
derived from: Direct Mail Advertising
  type: BicsLevel5Segment
  type: Classifier
  type: ContemporaryDerivation
  derived from: http://data.ga-group.nl/ics/bics/2014/1010101111
  source accessed on: 2019-12-03T20:05:01Z
  source last accessed on: 2019-12-03T20:05:01Z
  definition: This segment includes companies that create advertisements and campaigns that are distributed through mail services. Includes mail advertisements, fliers, pamphlets and coupons.
  notation: 1010101111
  valid from: 2014-08-08
  valid till: 2020-10-03
source accessed on: 2019-12-03T20:05:01Z
source last accessed on: 2019-12-03T20:05:01Z
definition: This segment includes companies that create advertisements and campaigns that are distributed through mail services. Includes mail advertisements, fliers, pamphlets and coupons.
notation: 1010101111
valid from: 2014-08-08
valid till: 2020-10-03

Direct Marketing
type: BicsLevel4SubIndustry
type: Classifier
type: NamedIndividual
created with: infer-bics.sql
derived from: Direct Marketing
  type: BicsLevel4SubIndustry
  type: Classifier
  type: ContemporaryDerivation
  derived from: http://data.ga-group.nl/ics/bics/2014/10101011
  source accessed on: 2019-12-03T20:05:01Z
  source last accessed on: 2019-12-03T20:05:01Z
  definition: This industry subgroup includes companies involved in the creation or distribution of direct marketing advertisements. Includes mail advertisements, telemarketing, coupons, and text (SMS) advertisements.
  notation: 10101011
  valid from: 2014-08-08
  valid till: 2020-10-03
source accessed on: 2019-12-03T20:05:01Z
source last accessed on: 2019-12-03T20:05:01Z
definition: This industry subgroup includes companies involved in the creation or distribution of direct marketing advertisements. Includes mail advertisements, telemarketing, coupons, and text (SMS) advertisements.
notation: 10101011
valid from: 2014-08-08
valid till: 2020-10-03

Directory & Mail List Publishers
type: BicsLevel5Segment
type: Classifier
type: NamedIndividual
is level5 segment of: Other Advertising Services
created with: infer-bics.sql
derived from: Directory & Mail List Publishers
  type: BicsLevel5Segment
  type: Classifier
  type: ContemporaryDerivation
  derived from: http://data.ga-group.nl/ics/bics/2014/1010101210
  source accessed on: 2019-12-03T20:05:01Z
  source last accessed on: 2019-12-03T20:05:01Z
  definition: This segment includes companies that publish telephone and business directories or mailing lists.
  notation: 1010101210
  valid from: 2014-08-08
  valid till: 2020-10-03
source accessed on: 2019-12-03T20:05:01Z
source last accessed on: 2019-12-03T20:05:01Z
definition: This segment includes companies that publish telephone and business directories or mailing lists.
notation: 1010101210
valid from: 2014-08-08
valid till: 2020-10-03

Other Advertising Services
type: BicsLevel5Segment
type: Classifier
type: NamedIndividual
is level5 segment of: Other Advertising Services
created with: infer-bics.sql
derived from: Other Advertising Services
  type: BicsLevel5Segment
  type: Classifier
  type: ContemporaryDerivation
  derived from: http://data.ga-group.nl/ics/bics/2014/1010101211
  source accessed on: 2019-12-03T20:05:01Z
  source last accessed on: 2019-12-03T20:05:01Z
  definition: This segment includes companies that provide miscellaneous advertising services not elsewhere classified.
  notation: 1010101211
  valid from: 2014-08-08
  valid till: 2020-10-03
source accessed on: 2019-12-03T20:05:01Z
source last accessed on: 2019-12-03T20:05:01Z
definition: This segment includes companies that provide miscellaneous advertising services not elsewhere classified.
notation: 1010101211
valid from: 2014-08-08
valid till: 2020-10-03

Other Advertising Services
type: BicsLevel4SubIndustry
type: Classifier
type: NamedIndividual
created with: infer-bics.sql
derived from: Other Advertising Services
  type: BicsLevel4SubIndustry
  type: Classifier
  type: ContemporaryDerivation
  derived from: http://data.ga-group.nl/ics/bics/2014/10101012
  source accessed on: 2019-12-03T20:05:01Z
  source last accessed on: 2019-12-03T20:05:01Z
  definition: This industry subgroup includes companies that publish directories or mailing lists and provide other miscellaneous advertising services that are not elsewhere classified.
  notation: 10101012
  valid from: 2014-08-08
  valid till: 2020-10-03
source accessed on: 2019-12-03T20:05:01Z
source last accessed on: 2019-12-03T20:05:01Z
definition: This industry subgroup includes companies that publish directories or mailing lists and provide other miscellaneous advertising services that are not elsewhere classified.
notation: 10101012
valid from: 2014-08-08
valid till: 2020-10-03

Advertising & Marketing
type: BicsLevel3Industry
type: Classifier
type: NamedIndividual
is industry of: Media
is replaced by: Advertising & Marketing
created with: infer-bics.sql
derived from: Advertising & Marketing
  type: BicsLevel3Industry
  type: Classifier
  type: ContemporaryDerivation
  derived from: http://data.ga-group.nl/ics/bics/2014/101010
  source accessed on: 2019-12-03T20:05:01Z
  source last accessed on: 2019-12-03T20:05:01Z
  definition: This industry includes companies that provide advertising and marketing services. These services include the creation of advertising campaigns for use in media, display, or direct mail advertising and other related services.
  notation: 101010
  valid from: 2014-08-08
  valid till: 2020-10-03
derived from: Advertising & Marketing
  type: BicsLevel3Industry
  type: Classifier
  type: ContemporaryDerivation
  derived from: http://data.ga-group.nl/ics/bics/2020/101010
  derived from: http://data.ga-group.nl/ics/bics/2024/101010
  source accessed on: 2023-07-03T18:11:29Z
  source last accessed on: 2024-06-05T14:42:36Z
  definition: This industry includes companies that provide advertising and marketing services. Includes the creation of advertising campaigns for use in media, display, or direct mail advertising and other related services.
  notation: 101010
  valid from: 2020-10-03
source accessed on: 2019-12-03T20:05:01Z
source last accessed on: 2024-06-05T14:42:36Z
definition: This industry includes companies that provide advertising and marketing services. Includes the creation of advertising campaigns for use in media, display, or direct mail advertising and other related services.
notation: 101010
valid from: 2014-08-08

Cable & Satellite Video Svcs
type: BicsLevel5Segment
type: Classifier
type: NamedIndividual
is level5 segment of: Cable & Satellite
created with: infer-bics.sql
derived from: Cable Video Services
  type: BicsLevel4SubIndustry
  type: Classifier
  type: AnachronousDerivation
  derived from: http://data.ga-group.nl/ics/bics/2014/10101110
  source accessed on: 2019-12-03T20:05:01Z
  source last accessed on: 2019-12-03T20:05:01Z
  definition: This industry subgroup includes companies that offer cable or satellite television access. Access is usually provided to the customer through a set-top box.
  notation: 10101110
  valid from: 2014-08-08
  valid till: 2020-10-03
derived from: Cable & Satellite Video Svcs
  type: BicsLevel5Segment
  type: Classifier
  type: ContemporaryDerivation
  derived from: http://data.ga-group.nl/ics/bics/2020/1010111010
  source accessed on: 2023-07-03T18:11:29Z
  source last accessed on: 2023-07-03T18:11:29Z
  definition: This segment includes companies that offer cable or satellite television access.
  notation: 1010111010
  valid from: 2020-10-03
  valid till: 2024-06-07
derived from: Cable & Satellite Video Svcs
  type: BicsLevel5Segment
  type: Classifier
  type: ContemporaryDerivation
  derived from: http://data.ga-group.nl/ics/bics/2024/1010111010
  source accessed on: 2024-06-05T14:42:36Z
  source last accessed on: 2024-06-05T14:42:36Z
  definition: This segment includes companies that offer cable or satellite television access. Access is usually provided to the customer through a set-top box.
  notation: 1010111010
  valid from: 2024-06-07
source accessed on: 2023-07-03T18:11:29Z
source last accessed on: 2024-06-05T14:42:36Z
definition: This segment includes companies that offer cable or satellite television access. Access is usually provided to the customer through a set-top box.
notation: 1010111010
valid from: 2020-10-03

Cable & Satellite Internet Svcs
type: BicsLevel5Segment
type: Classifier
type: NamedIndividual
is level5 segment of: Cable & Satellite
created with: infer-bics.sql
derived from: Wired Internet Services - Media
  type: BicsLevel4SubIndustry
  type: Classifier
  type: AnachronousDerivation
  derived from: http://data.ga-group.nl/ics/bics/2014/10101111
  source accessed on: 2019-12-03T20:05:01Z
  source last accessed on: 2019-12-03T20:05:01Z
  definition: This industry subgroup includes cable companies that provide Internet and broadband services.
  notation: 10101111
  valid from: 2014-08-08
  valid till: 2020-10-03
derived from: Cable & Satellite Internet Svcs
  type: BicsLevel5Segment
  type: Classifier
  type: ContemporaryDerivation
  derived from: http://data.ga-group.nl/ics/bics/2020/1010111011
  derived from: http://data.ga-group.nl/ics/bics/2024/1010111011
  source accessed on: 2023-07-03T18:11:29Z
  source last accessed on: 2024-06-05T14:42:36Z
  definition: This segment includes cable companies that provide Internet and broadband services.
  notation: 1010111011
  valid from: 2020-10-03
source accessed on: 2023-07-03T18:11:29Z
source last accessed on: 2024-06-05T14:42:36Z
definition: This segment includes cable companies that provide Internet and broadband services.
notation: 1010111011
valid from: 2020-10-03

Cable & Satellite Phone Svcs
type: BicsLevel5Segment
type: Classifier
type: NamedIndividual
is level5 segment of: Cable & Satellite
created with: infer-bics.sql
derived from: Wired Phone Services - Media
  type: BicsLevel4SubIndustry
  type: Classifier
  type: AnachronousDerivation
  derived from: http://data.ga-group.nl/ics/bics/2014/10101112
  source accessed on: 2019-12-03T20:05:01Z
  source last accessed on: 2019-12-03T20:05:01Z
  definition: This industry subgroup includes cable companies that provide phone services.
  notation: 10101112
  valid from: 2014-08-08
  valid till: 2020-10-03
derived from: Cable & Satellite Phone Svcs
  type: BicsLevel5Segment
  type: Classifier
  type: ContemporaryDerivation
  derived from: http://data.ga-group.nl/ics/bics/2020/1010111012
  derived from: http://data.ga-group.nl/ics/bics/2024/1010111012
  source accessed on: 2023-07-03T18:11:29Z
  source last accessed on: 2024-06-05T14:42:36Z
  definition: This segment includes cable companies that provide phone services.
  notation: 1010111012
  valid from: 2020-10-03
source accessed on: 2023-07-03T18:11:29Z
source last accessed on: 2024-06-05T14:42:36Z
definition: This segment includes cable companies that provide phone services.
notation: 1010111012
valid from: 2020-10-03

Cable & Satellite
type: BicsLevel4SubIndustry
type: Classifier
type: NamedIndividual
replaces: Cable & Satellite
created with: infer-bics.sql
derived from: Cable & Satellite
  type: BicsLevel3Industry
  type: Classifier
  type: AnachronousDerivation
  derived from: http://data.ga-group.nl/ics/bics/2014/101011
  source accessed on: 2019-12-03T20:05:01Z
  source last accessed on: 2019-12-03T20:05:01Z
  definition: This industry includes companies that provide subscription television services delivered by coaxial cable or receiving signals from a satellite dish. Cable companies may also provide Internet and phone service through a cable.
  notation: 101011
  valid from: 2014-08-08
  valid till: 2020-10-03
derived from: Cable Video Services
  type: BicsLevel4SubIndustry
  type: Classifier
  type: ContemporaryDerivation
  derived from: http://data.ga-group.nl/ics/bics/2014/10101110
  source accessed on: 2019-12-03T20:05:01Z
  source last accessed on: 2019-12-03T20:05:01Z
  definition: This industry subgroup includes companies that offer cable or satellite television access. Access is usually provided to the customer through a set-top box.
  notation: 10101110
  valid from: 2014-08-08
  valid till: 2020-10-03
derived from: Cable & Satellite
  type: BicsLevel4SubIndustry
  type: Classifier
  type: ContemporaryDerivation
  derived from: http://data.ga-group.nl/ics/bics/2020/10101110
  source accessed on: 2023-07-03T18:11:29Z
  source last accessed on: 2023-07-03T18:11:29Z
  definition: This industry subgroup includes companies that provide subscription television or radio services delivered by coaxial cable, fiber optic cable, or satellite dish. Cable companies may also provide Internet and phone service through a cable.
  notation: 10101110
  valid from: 2020-10-03
  valid till: 2024-06-07
derived from: Cable & Satellite
  type: BicsLevel4SubIndustry
  type: Classifier
  type: ContemporaryDerivation
  derived from: http://data.ga-group.nl/ics/bics/2024/10101110
  source accessed on: 2024-06-05T14:42:36Z
  source last accessed on: 2024-06-05T14:42:36Z
  definition: This industry subgroup includes companies that provide subscription television or radio services delivered by coaxial cable or satellite dish. Cable companies may also provide Internet and phone service through a cable.
  notation: 10101110
  valid from: 2024-06-07
source accessed on: 2019-12-03T20:05:01Z
source last accessed on: 2024-06-05T14:42:36Z
definition: This industry subgroup includes companies that provide subscription television or radio services delivered by coaxial cable or satellite dish. Cable companies may also provide Internet and phone service through a cable.
notation: 10101110
valid from: 2014-08-08

Wired Internet Services - Media
type: BicsLevel4SubIndustry
type: Classifier
type: NamedIndividual
created with: infer-bics.sql
derived from: Wired Internet Services - Media
  type: BicsLevel4SubIndustry
  type: Classifier
  type: ContemporaryDerivation
  derived from: http://data.ga-group.nl/ics/bics/2014/10101111
  source accessed on: 2019-12-03T20:05:01Z
  source last accessed on: 2019-12-03T20:05:01Z
  definition: This industry subgroup includes cable companies that provide Internet and broadband services.
  notation: 10101111
  valid from: 2014-08-08
  valid till: 2020-10-03
source accessed on: 2019-12-03T20:05:01Z
source last accessed on: 2019-12-03T20:05:01Z
definition: This industry subgroup includes cable companies that provide Internet and broadband services.
notation: 10101111
valid from: 2014-08-08
valid till: 2020-10-03

Wired Phone Services - Media
type: BicsLevel4SubIndustry
type: Classifier
type: NamedIndividual
created with: infer-bics.sql
derived from: Wired Phone Services - Media
  type: BicsLevel4SubIndustry
  type: Classifier
  type: ContemporaryDerivation
  derived from: http://data.ga-group.nl/ics/bics/2014/10101112
  source accessed on: 2019-12-03T20:05:01Z
  source last accessed on: 2019-12-03T20:05:01Z
  definition: This industry subgroup includes cable companies that provide phone services.
  notation: 10101112
  valid from: 2014-08-08
  valid till: 2020-10-03
source accessed on: 2019-12-03T20:05:01Z
source last accessed on: 2019-12-03T20:05:01Z
definition: This industry subgroup includes cable companies that provide phone services.
notation: 10101112
valid from: 2014-08-08
valid till: 2020-10-03

Cable & Satellite
type: BicsLevel3Industry
type: Classifier
type: NamedIndividual
is industry of: Media
is replaced by: Cable & Satellite
created with: infer-bics.sql
derived from: Cable & Satellite
  type: BicsLevel3Industry
  type: Classifier
  type: ContemporaryDerivation
  derived from: http://data.ga-group.nl/ics/bics/2014/101011
  source accessed on: 2019-12-03T20:05:01Z
  source last accessed on: 2019-12-03T20:05:01Z
  definition: This industry includes companies that provide subscription television services delivered by coaxial cable or receiving signals from a satellite dish. Cable companies may also provide Internet and phone service through a cable.
  notation: 101011
  valid from: 2014-08-08
  valid till: 2020-10-03
derived from: Cable & Satellite
  type: BicsLevel3Industry
  type: Classifier
  type: ContemporaryDerivation
  derived from: http://data.ga-group.nl/ics/bics/2020/101011
  source accessed on: 2023-07-03T18:11:29Z
  source last accessed on: 2023-07-03T18:11:29Z
  definition: This industry includes companies that provide subscription television or radio services delivered by coaxial cable, fiber optic cable, or satellite dish. Cable companies may also provide Internet and phone service through a cable.
  notation: 101011
  valid from: 2020-10-03
  valid till: 2024-06-07
derived from: Cable & Satellite
  type: BicsLevel3Industry
  type: Classifier
  type: ContemporaryDerivation
  derived from: http://data.ga-group.nl/ics/bics/2024/101011
  source accessed on: 2024-06-05T14:42:36Z
  source last accessed on: 2024-06-05T14:42:36Z
  definition: This industry includes companies that provide subscription television or radio services delivered by coaxial cable or satellite dish. Cable companies may also provide Internet and phone service through a cable.
  notation: 101011
  valid from: 2024-06-07
source accessed on: 2019-12-03T20:05:01Z
source last accessed on: 2024-06-05T14:42:36Z
definition: This industry includes companies that provide subscription television or radio services delivered by coaxial cable or satellite dish. Cable companies may also provide Internet and phone service through a cable.
notation: 101011
valid from: 2014-08-08

Film Production
type: BicsLevel7Segment
type: Classifier
type: NamedIndividual
is level7 segment of: Film & TV Production
replaces: Film & TV Production
created with: infer-bics.sql
derived from: Film Production
  type: BicsLevel6Segment
  type: Classifier
  type: AnachronousDerivation
  derived from: http://data.ga-group.nl/ics/bics/2014/101012101010
  source accessed on: 2019-12-03T20:05:01Z
  source last accessed on: 2019-12-03T20:05:01Z
  definition: This segment includes companies that produce, or produce and distribute, films.
  notation: 101012101010
  valid from: 2014-08-08
  valid till: 2020-10-03
derived from: Film Production (w/o Distr)
  type: BicsLevel7Segment
  type: Classifier
  type: ContemporaryDerivation
  derived from: http://data.ga-group.nl/ics/bics/2014/10101210101010
  source accessed on: 2019-12-03T20:05:01Z
  source last accessed on: 2019-12-03T20:05:01Z
  definition: This segment includes companies that produce, but do not distribute, films.
  notation: 10101210101010
  valid from: 2014-08-08
  valid till: 2020-10-03
derived from: Film Production
  type: BicsLevel7Segment
  type: Classifier
  type: ContemporaryDerivation
  derived from: http://data.ga-group.nl/ics/bics/2020/10101210101010
  derived from: http://data.ga-group.nl/ics/bics/2024/10101210101010
  source accessed on: 2023-07-03T18:11:29Z
  source last accessed on: 2024-06-05T14:42:36Z
  definition: This segment includes companies that produce films.
  notation: 10101210101010
  valid from: 2020-10-03
source accessed on: 2019-12-03T20:05:01Z
source last accessed on: 2024-06-05T14:42:36Z
definition: This segment includes companies that produce films.
notation: 10101210101010
valid from: 2014-08-08

TV & Video Production
type: BicsLevel7Segment
type: Classifier
type: NamedIndividual
is level7 segment of: Film & TV Production
replaces: Film & Video Distribution
created with: infer-bics.sql
derived from: Film Production (with Distr)
  type: BicsLevel7Segment
  type: Classifier
  type: ContemporaryDerivation
  derived from: http://data.ga-group.nl/ics/bics/2014/10101210101011
  source accessed on: 2019-12-03T20:05:01Z
  source last accessed on: 2019-12-03T20:05:01Z
  definition: This segment includes companies that produce and distribute films.
  notation: 10101210101011
  valid from: 2014-08-08
  valid till: 2020-10-03
derived from: TV & Video Production
  type: BicsLevel6Segment
  type: Classifier
  type: AnachronousDerivation
  derived from: http://data.ga-group.nl/ics/bics/2014/101012101011
  source accessed on: 2019-12-03T20:05:01Z
  source last accessed on: 2019-12-03T20:05:01Z
  definition: This segment includes companies that produce television programs and other videos.
  notation: 101012101011
  valid from: 2014-08-08
  valid till: 2020-10-03
derived from: TV & Video Production
  type: BicsLevel7Segment
  type: Classifier
  type: ContemporaryDerivation
  derived from: http://data.ga-group.nl/ics/bics/2020/10101210101011
  derived from: http://data.ga-group.nl/ics/bics/2024/10101210101011
  source accessed on: 2023-07-03T18:11:29Z
  source last accessed on: 2024-06-05T14:42:36Z
  definition: This segment includes companies that produce television programs and other videos.
  notation: 10101210101011
  valid from: 2020-10-03
source accessed on: 2019-12-03T20:05:01Z
source last accessed on: 2024-06-05T14:42:36Z
definition: This segment includes companies that produce television programs and other videos.
notation: 10101210101011
valid from: 2014-08-08

Film & TV Production
type: BicsLevel6Segment
type: Classifier
type: NamedIndividual
is level6 segment of: Film & TV Production & Distr
is replaced by: Film Production
replaces: Film & TV Production & Distr
created with: infer-bics.sql
derived from: Film & TV Production
  type: BicsLevel5Segment
  type: Classifier
  type: AnachronousDerivation
  derived from: http://data.ga-group.nl/ics/bics/2014/1010121010
  source accessed on: 2019-12-03T20:05:01Z
  source last accessed on: 2019-12-03T20:05:01Z
  definition: This segment includes companies that produce, or produce and distribute, film, videos, television programs or television commercials.
  notation: 1010121010
  valid from: 2014-08-08
  valid till: 2020-10-03
derived from: Film Production
  type: BicsLevel6Segment
  type: Classifier
  type: ContemporaryDerivation
  derived from: http://data.ga-group.nl/ics/bics/2014/101012101010
  source accessed on: 2019-12-03T20:05:01Z
  source last accessed on: 2019-12-03T20:05:01Z
  definition: This segment includes companies that produce, or produce and distribute, films.
  notation: 101012101010
  valid from: 2014-08-08
  valid till: 2020-10-03
derived from: Film & TV Production
  type: BicsLevel6Segment
  type: Classifier
  type: ContemporaryDerivation
  derived from: http://data.ga-group.nl/ics/bics/2020/101012101010
  derived from: http://data.ga-group.nl/ics/bics/2024/101012101010
  source accessed on: 2023-07-03T18:11:29Z
  source last accessed on: 2024-06-05T14:42:36Z
  definition: This segment includes companies that produce film, videos, television programs, or television commercials.
  notation: 101012101010
  valid from: 2020-10-03
source accessed on: 2019-12-03T20:05:01Z
source last accessed on: 2024-06-05T14:42:36Z
definition: This segment includes companies that produce film, videos, television programs, or television commercials.
notation: 101012101010
valid from: 2014-08-08

Film Distribution
type: BicsLevel7Segment
type: Classifier
type: NamedIndividual
is level7 segment of: Film & Video Distribution
replaces: Cable Networks
created with: infer-bics.sql
derived from: Cartoon & Animation Production
  type: BicsLevel7Segment
  type: Classifier
  type: ContemporaryDerivation
  derived from: http://data.ga-group.nl/ics/bics/2014/10101210101110
  source accessed on: 2019-12-03T20:05:01Z
  source last accessed on: 2019-12-03T20:05:01Z
  definition: This segment includes companies that produce cartoons and animation for both movies and television shows.
  notation: 10101210101110
  valid from: 2014-08-08
  valid till: 2020-10-03
derived from: Film Distribution
  type: BicsLevel6Segment
  type: Classifier
  type: AnachronousDerivation
  derived from: http://data.ga-group.nl/ics/bics/2014/101012101110
  source accessed on: 2019-12-03T20:05:01Z
  source last accessed on: 2019-12-03T20:05:01Z
  definition: This segment includes companies that acquire film distribution rights and distribute videotapes, DVDs and other formats to movie theaters, television networks and TV stations.
  notation: 101012101110
  valid from: 2014-08-08
  valid till: 2020-10-03
derived from: Film Distribution
  type: BicsLevel7Segment
  type: Classifier
  type: ContemporaryDerivation
  derived from: http://data.ga-group.nl/ics/bics/2020/10101210101110
  derived from: http://data.ga-group.nl/ics/bics/2024/10101210101110
  source accessed on: 2023-07-03T18:11:29Z
  source last accessed on: 2024-06-05T14:42:36Z
  definition: This segment includes companies that acquire film distribution rights and distribute videotapes, DVDs and other formats to movie theaters, television networks and TV stations.
  notation: 10101210101110
  valid from: 2020-10-03
source accessed on: 2019-12-03T20:05:01Z
source last accessed on: 2024-06-05T14:42:36Z
definition: This segment includes companies that acquire film distribution rights and distribute videotapes, DVDs and other formats to movie theaters, television networks and TV stations.
notation: 10101210101110
valid from: 2014-08-08

TV Show Syndication
type: BicsLevel7Segment
type: Classifier
type: NamedIndividual
is level7 segment of: Film & Video Distribution
replaces: TV Broadcast Networks
created with: infer-bics.sql
derived from: Commercial Production
  type: BicsLevel7Segment
  type: Classifier
  type: ContemporaryDerivation
  derived from: http://data.ga-group.nl/ics/bics/2014/10101210101111
  source accessed on: 2019-12-03T20:05:01Z
  source last accessed on: 2019-12-03T20:05:01Z
  definition: This segment includes companies that produce commercials for movies or television.
  notation: 10101210101111
  valid from: 2014-08-08
  valid till: 2020-10-03
derived from: TV Show Syndication
  type: BicsLevel6Segment
  type: Classifier
  type: AnachronousDerivation
  derived from: http://data.ga-group.nl/ics/bics/2014/101012101111
  source accessed on: 2019-12-03T20:05:01Z
  source last accessed on: 2019-12-03T20:05:01Z
  definition: This segment includes companies that acquire TV show distribution rights and distribute to television networks and stations.
  notation: 101012101111
  valid from: 2014-08-08
  valid till: 2020-10-03
derived from: TV Show Syndication
  type: BicsLevel7Segment
  type: Classifier
  type: ContemporaryDerivation
  derived from: http://data.ga-group.nl/ics/bics/2020/10101210101111
  derived from: http://data.ga-group.nl/ics/bics/2024/10101210101111
  source accessed on: 2023-07-03T18:11:29Z
  source last accessed on: 2024-06-05T14:42:36Z
  definition: This segment includes companies that acquire TV show distribution rights and distribute to television networks and stations.
  notation: 10101210101111
  valid from: 2020-10-03
source accessed on: 2019-12-03T20:05:01Z
source last accessed on: 2024-06-05T14:42:36Z
definition: This segment includes companies that acquire TV show distribution rights and distribute to television networks and stations.
notation: 10101210101111
valid from: 2014-08-08

Music Video Production
type: BicsLevel7Segment
type: Classifier
type: NamedIndividual
is level7 segment of: Film & Video Distribution
created with: infer-bics.sql
derived from: Music Video Production
  type: BicsLevel7Segment
  type: Classifier
  type: ContemporaryDerivation
  derived from: http://data.ga-group.nl/ics/bics/2014/10101210101112
  source accessed on: 2019-12-03T20:05:01Z
  source last accessed on: 2019-12-03T20:05:01Z
  definition: This segment includes companies that produce music videos.
  notation: 10101210101112
  valid from: 2014-08-08
  valid till: 2020-10-03
source accessed on: 2019-12-03T20:05:01Z
source last accessed on: 2019-12-03T20:05:01Z
definition: This segment includes companies that produce music videos.
notation: 10101210101112
valid from: 2014-08-08
valid till: 2020-10-03

TV Show Production
type: BicsLevel7Segment
type: Classifier
type: NamedIndividual
is level7 segment of: Film & Video Distribution
created with: infer-bics.sql
derived from: TV Show Production
  type: BicsLevel7Segment
  type: Classifier
  type: ContemporaryDerivation
  derived from: http://data.ga-group.nl/ics/bics/2014/10101210101113
  source accessed on: 2019-12-03T20:05:01Z
  source last accessed on: 2019-12-03T20:05:01Z
  definition: This segment includes companies that produce television and serialized programming.
  notation: 10101210101113
  valid from: 2014-08-08
  valid till: 2020-10-03
source accessed on: 2019-12-03T20:05:01Z
source last accessed on: 2019-12-03T20:05:01Z
definition: This segment includes companies that produce television and serialized programming.
notation: 10101210101113
valid from: 2014-08-08
valid till: 2020-10-03

Film & Video Distribution
type: BicsLevel6Segment
type: Classifier
type: NamedIndividual
is level6 segment of: Film & TV Production & Distr
is replaced by: TV & Video Production
replaces: TV Media Networks
created with: infer-bics.sql
derived from: TV & Video Production
  type: BicsLevel6Segment
  type: Classifier
  type: ContemporaryDerivation
  derived from: http://data.ga-group.nl/ics/bics/2014/101012101011
  source accessed on: 2019-12-03T20:05:01Z
  source last accessed on: 2019-12-03T20:05:01Z
  definition: This segment includes companies that produce television programs and other videos.
  notation: 101012101011
  valid from: 2014-08-08
  valid till: 2020-10-03
derived from: Film & Video Distribution
  type: BicsLevel5Segment
  type: Classifier
  type: AnachronousDerivation
  derived from: http://data.ga-group.nl/ics/bics/2014/1010121011
  source accessed on: 2019-12-03T20:05:01Z
  source last accessed on: 2019-12-03T20:05:01Z
  definition: This segment includes companies that acquire video distribution rights and distribute film, videotapes, DVDs and other formats to movie theaters, television networks and TV stations.
  notation: 1010121011
  valid from: 2014-08-08
  valid till: 2020-10-03
derived from: Film & Video Distribution
  type: BicsLevel6Segment
  type: Classifier
  type: ContemporaryDerivation
  derived from: http://data.ga-group.nl/ics/bics/2020/101012101011
  derived from: http://data.ga-group.nl/ics/bics/2024/101012101011
  source accessed on: 2023-07-03T18:11:29Z
  source last accessed on: 2024-06-05T14:42:36Z
  definition: This segment includes companies that acquire film and video distribution rights and distribute film, videotapes, DVDs and other formats to movie theaters, television networks and TV stations.
  notation: 101012101011
  valid from: 2020-10-03
source accessed on: 2019-12-03T20:05:01Z
source last accessed on: 2024-06-05T14:42:36Z
definition: This segment includes companies that acquire film and video distribution rights and distribute film, videotapes, DVDs and other formats to movie theaters, television networks and TV stations.
notation: 101012101011
valid from: 2014-08-08

Teleprod & Postprod Services
type: BicsLevel6Segment
type: Classifier
type: NamedIndividual
is level6 segment of: Film & TV Production & Distr
replaces: Teleprod & Postprod Services
created with: infer-bics.sql
derived from: Teleprod & Postprod Services
  type: BicsLevel5Segment
  type: Classifier
  type: AnachronousDerivation
  derived from: http://data.ga-group.nl/ics/bics/2014/1010121013
  source accessed on: 2019-12-03T20:05:01Z
  source last accessed on: 2019-12-03T20:05:01Z
  definition: This segment includes companies that provide teleproduction and postproduction services for film and TV. Includes editing film and adding titling, subtitling, credits and closed captioning.
  notation: 1010121013
  valid from: 2014-08-08
  valid till: 2020-10-03
derived from: Teleprod & Postprod Services
  type: BicsLevel6Segment
  type: Classifier
  type: ContemporaryDerivation
  derived from: http://data.ga-group.nl/ics/bics/2020/101012101012
  derived from: http://data.ga-group.nl/ics/bics/2024/101012101012
  source accessed on: 2023-07-03T18:11:29Z
  source last accessed on: 2024-06-05T14:42:36Z
  definition: This segment includes companies that provide postproduction services for film and TV. Includes editing film, titling, subtitling, credits, and closed captioning.
  notation: 101012101012
  valid from: 2020-10-03
source accessed on: 2023-07-03T18:11:29Z
source last accessed on: 2024-06-05T14:42:36Z
definition: This segment includes companies that provide postproduction services for film and TV. Includes editing film, titling, subtitling, credits, and closed captioning.
notation: 101012101012
valid from: 2020-10-03

Online Film & TV Streaming
type: BicsLevel6Segment
type: Classifier
type: NamedIndividual
is level6 segment of: Film & TV Production & Distr
created with: infer-bics.sql
derived from: Online Film & TV Streaming
  type: BicsLevel6Segment
  type: Classifier
  type: ContemporaryDerivation
  derived from: http://data.ga-group.nl/ics/bics/2024/101012101013
  source accessed on: 2024-06-05T14:42:36Z
  source last accessed on: 2024-06-05T14:42:36Z
  definition: This segment includes companies that create, acquire distribution rights, and distribute film and television shows directly to consumers online via websites or mobile applications. Excludes companies that do not produce content.
  notation: 101012101013
  valid from: 2024-06-07
source accessed on: 2024-06-05T14:42:36Z
source last accessed on: 2024-06-05T14:42:36Z
definition: This segment includes companies that create, acquire distribution rights, and distribute film and television shows directly to consumers online via websites or mobile applications. Excludes companies that do not produce content.
notation: 101012101013
valid from: 2024-06-07

Film & TV Production & Distr
type: BicsLevel5Segment
type: Classifier
type: NamedIndividual
is level5 segment of: Film & TV
is replaced by: Film & TV Production
created with: infer-bics.sql
derived from: Film & TV Production & Distr
  type: BicsLevel4SubIndustry
  type: Classifier
  type: AnachronousDerivation
  derived from: http://data.ga-group.nl/ics/bics/2014/10101210
  source accessed on: 2019-12-03T20:05:01Z
  source last accessed on: 2019-12-03T20:05:01Z
  definition: This industry subgroup includes companies that produce, or produce and distribute, film, videos, television programs or television commercials.
  notation: 10101210
  valid from: 2014-08-08
  valid till: 2020-10-03
derived from: Film & TV Production
  type: BicsLevel5Segment
  type: Classifier
  type: ContemporaryDerivation
  derived from: http://data.ga-group.nl/ics/bics/2014/1010121010
  source accessed on: 2019-12-03T20:05:01Z
  source last accessed on: 2019-12-03T20:05:01Z
  definition: This segment includes companies that produce, or produce and distribute, film, videos, television programs or television commercials.
  notation: 1010121010
  valid from: 2014-08-08
  valid till: 2020-10-03
derived from: Film & TV Production & Distr
  type: BicsLevel5Segment
  type: Classifier
  type: ContemporaryDerivation
  derived from: http://data.ga-group.nl/ics/bics/2020/1010121010
  derived from: http://data.ga-group.nl/ics/bics/2024/1010121010
  source accessed on: 2023-07-03T18:11:29Z
  source last accessed on: 2024-06-05T14:42:36Z
  definition: This segment includes companies that produce and/or distribute film, videos, television programs, or television commercials.
  notation: 1010121010
  valid from: 2020-10-03
source accessed on: 2019-12-03T20:05:01Z
source last accessed on: 2024-06-05T14:42:36Z
definition: This segment includes companies that produce and/or distribute film, videos, television programs, or television commercials.
notation: 1010121010
valid from: 2014-08-08

Adv Rev - Cable Networks
type: BicsLevel7Segment
type: Classifier
type: NamedIndividual
is level7 segment of: Cable Networks
replaces: Adv Rev - Cable Networks
created with: infer-bics.sql
derived from: Adv Rev - Cable Networks
  type: BicsLevel6Segment
  type: Classifier
  type: AnachronousDerivation
  derived from: http://data.ga-group.nl/ics/bics/2014/101012111010
  source accessed on: 2019-12-03T20:05:01Z
  source last accessed on: 2019-12-03T20:05:01Z
  definition: This segment includes revenue that cable networks generate from advertising.
  notation: 101012111010
  valid from: 2014-08-08
  valid till: 2020-10-03
derived from: Adv Rev - Cable Networks
  type: BicsLevel7Segment
  type: Classifier
  type: ContemporaryDerivation
  derived from: http://data.ga-group.nl/ics/bics/2020/10101210111010
  derived from: http://data.ga-group.nl/ics/bics/2024/10101210111010
  source accessed on: 2023-07-03T18:11:29Z
  source last accessed on: 2024-06-05T14:42:36Z
  definition: This segment includes revenue that cable networks generate from advertising.
  notation: 10101210111010
  valid from: 2020-10-03
source accessed on: 2023-07-03T18:11:29Z
source last accessed on: 2024-06-05T14:42:36Z
definition: This segment includes revenue that cable networks generate from advertising.
notation: 10101210111010
valid from: 2020-10-03

Other Rev - Cable Networks
type: BicsLevel7Segment
type: Classifier
type: NamedIndividual
is level7 segment of: Cable Networks
replaces: Other Rev - Cable Networks
created with: infer-bics.sql
derived from: Other Rev - Cable Networks
  type: BicsLevel6Segment
  type: Classifier
  type: AnachronousDerivation
  derived from: http://data.ga-group.nl/ics/bics/2014/101012111011
  source accessed on: 2019-12-03T20:05:01Z
  source last accessed on: 2019-12-03T20:05:01Z
  definition: This segment includes revenue that cable networks generate from other than advertising.
  notation: 101012111011
  valid from: 2014-08-08
  valid till: 2020-10-03
derived from: Other Rev - Cable Networks
  type: BicsLevel7Segment
  type: Classifier
  type: ContemporaryDerivation
  derived from: http://data.ga-group.nl/ics/bics/2020/10101210111011
  derived from: http://data.ga-group.nl/ics/bics/2024/10101210111011
  source accessed on: 2023-07-03T18:11:29Z
  source last accessed on: 2024-06-05T14:42:36Z
  definition: This segment includes revenue that cable networks generate from sources other than advertising.
  notation: 10101210111011
  valid from: 2020-10-03
source accessed on: 2023-07-03T18:11:29Z
source last accessed on: 2024-06-05T14:42:36Z
definition: This segment includes revenue that cable networks generate from sources other than advertising.
notation: 10101210111011
valid from: 2020-10-03

Cable Networks
type: BicsLevel6Segment
type: Classifier
type: NamedIndividual
is level6 segment of: TV Media Networks
is replaced by: Film Distribution
replaces: Integrated Record Prod & Distr
created with: infer-bics.sql
derived from: Film Distribution
  type: BicsLevel6Segment
  type: Classifier
  type: ContemporaryDerivation
  derived from: http://data.ga-group.nl/ics/bics/2014/101012101110
  source accessed on: 2019-12-03T20:05:01Z
  source last accessed on: 2019-12-03T20:05:01Z
  definition: This segment includes companies that acquire film distribution rights and distribute videotapes, DVDs and other formats to movie theaters, television networks and TV stations.
  notation: 101012101110
  valid from: 2014-08-08
  valid till: 2020-10-03
derived from: Cable Networks
  type: BicsLevel5Segment
  type: Classifier
  type: AnachronousDerivation
  derived from: http://data.ga-group.nl/ics/bics/2014/1010121110
  source accessed on: 2019-12-03T20:05:01Z
  source last accessed on: 2019-12-03T20:05:01Z
  definition: This segment includes companies that aggregate, market and distribute television programs to cable companies, satellite companies and wireline telecommunications companies. These cable networks negotiate with local and international distributors for broadcasting of the programming on a subscription or fee basis. Typically, the programming content would be viewed on branded cable TV channels.
  notation: 1010121110
  valid from: 2014-08-08
  valid till: 2020-10-03
derived from: Cable Networks
  type: BicsLevel6Segment
  type: Classifier
  type: ContemporaryDerivation
  derived from: http://data.ga-group.nl/ics/bics/2020/101012101110
  derived from: http://data.ga-group.nl/ics/bics/2024/101012101110
  source accessed on: 2023-07-03T18:11:29Z
  source last accessed on: 2024-06-05T14:42:36Z
  definition: This segment includes companies that aggregate, market, and distribute television programs to cable companies, satellite companies, and wireline telecommunications companies. These networks negotiate with local and international distributors to broadcast programming on a subscription or fee basis.
  notation: 101012101110
  valid from: 2020-10-03
source accessed on: 2019-12-03T20:05:01Z
source last accessed on: 2024-06-05T14:42:36Z
definition: This segment includes companies that aggregate, market, and distribute television programs to cable companies, satellite companies, and wireline telecommunications companies. These networks negotiate with local and international distributors to broadcast programming on a subscription or fee basis.
notation: 101012101110
valid from: 2014-08-08

Adv Rev - TV Broadcast Netw
type: BicsLevel7Segment
type: Classifier
type: NamedIndividual
is level7 segment of: TV Broadcast Networks
replaces: Adv Rev - TV Broadcast Netw
created with: infer-bics.sql
derived from: Adv Rev - TV Broadcast Netw
  type: BicsLevel6Segment
  type: Classifier
  type: AnachronousDerivation
  derived from: http://data.ga-group.nl/ics/bics/2014/101012111110
  source accessed on: 2019-12-03T20:05:01Z
  source last accessed on: 2019-12-03T20:05:01Z
  definition: This segment includes revenue that TV broadcast networks generates from advertising.
  notation: 101012111110
  valid from: 2014-08-08
  valid till: 2020-10-03
derived from: Adv Rev - TV Broadcast Netw
  type: BicsLevel7Segment
  type: Classifier
  type: ContemporaryDerivation
  derived from: http://data.ga-group.nl/ics/bics/2020/10101210111110
  derived from: http://data.ga-group.nl/ics/bics/2024/10101210111110
  source accessed on: 2023-07-03T18:11:29Z
  source last accessed on: 2024-06-05T14:42:36Z
  definition: This segment includes revenue that TV broadcast networks generates from advertising.
  notation: 10101210111110
  valid from: 2020-10-03
source accessed on: 2023-07-03T18:11:29Z
source last accessed on: 2024-06-05T14:42:36Z
definition: This segment includes revenue that TV broadcast networks generates from advertising.
notation: 10101210111110
valid from: 2020-10-03

Other Rev - TV Broadcast Netw
type: BicsLevel7Segment
type: Classifier
type: NamedIndividual
is level7 segment of: TV Broadcast Networks
replaces: Other Rev - TV Broadcast Netw
created with: infer-bics.sql
derived from: Other Rev - TV Broadcast Netw
  type: BicsLevel6Segment
  type: Classifier
  type: AnachronousDerivation
  derived from: http://data.ga-group.nl/ics/bics/2014/101012111111
  source accessed on: 2019-12-03T20:05:01Z
  source last accessed on: 2019-12-03T20:05:01Z
  definition: This segment includes revenue that TV broadcast networks generate from other than advertising.
  notation: 101012111111
  valid from: 2014-08-08
  valid till: 2020-10-03
derived from: Other Rev - TV Broadcast Netw
  type: BicsLevel7Segment
  type: Classifier
  type: ContemporaryDerivation
  derived from: http://data.ga-group.nl/ics/bics/2020/10101210111111
  source accessed on: 2023-07-03T18:11:29Z
  source last accessed on: 2023-07-03T18:11:29Z
  definition: This segment includes revenue that cable networks generate from sources other than advertising.
  notation: 10101210111111
  valid from: 2020-10-03
  valid till: 2024-06-07
derived from: Other Rev - TV Broadcast Netw
  type: BicsLevel7Segment
  type: Classifier
  type: ContemporaryDerivation
  derived from: http://data.ga-group.nl/ics/bics/2024/10101210111111
  source accessed on: 2024-06-05T14:42:36Z
  source last accessed on: 2024-06-05T14:42:36Z
  definition: This segment includes revenue that TV broadcast networks generate from sources other than advertising.
  notation: 10101210111111
  valid from: 2024-06-07
source accessed on: 2023-07-03T18:11:29Z
source last accessed on: 2024-06-05T14:42:36Z
definition: This segment includes revenue that TV broadcast networks generate from sources other than advertising.
notation: 10101210111111
valid from: 2020-10-03

TV Broadcast Networks
type: BicsLevel6Segment
type: Classifier
type: NamedIndividual
is level6 segment of: TV Media Networks
is replaced by: TV Show Syndication
replaces: Music Publishers
created with: infer-bics.sql
derived from: TV Show Syndication
  type: BicsLevel6Segment
  type: Classifier
  type: ContemporaryDerivation
  derived from: http://data.ga-group.nl/ics/bics/2014/101012101111
  source accessed on: 2019-12-03T20:05:01Z
  source last accessed on: 2019-12-03T20:05:01Z
  definition: This segment includes companies that acquire TV show distribution rights and distribute to television networks and stations.
  notation: 101012101111
  valid from: 2014-08-08
  valid till: 2020-10-03
derived from: TV Broadcast Networks
  type: BicsLevel5Segment
  type: Classifier
  type: AnachronousDerivation
  derived from: http://data.ga-group.nl/ics/bics/2014/1010121111
  source accessed on: 2019-12-03T20:05:01Z
  source last accessed on: 2019-12-03T20:05:01Z
  definition: This segment includes companies that aggregate, market and distribute television programs to affiliate TV broadcasting stations. These TV broadcasting stations in turn transmit the programming material to viewers over public airways. Typically, the programming content would be viewed on branded antenna TV channels.
  notation: 1010121111
  valid from: 2014-08-08
  valid till: 2020-10-03
derived from: TV Broadcast Networks
  type: BicsLevel6Segment
  type: Classifier
  type: ContemporaryDerivation
  derived from: http://data.ga-group.nl/ics/bics/2020/101012101111
  derived from: http://data.ga-group.nl/ics/bics/2024/101012101111
  source accessed on: 2023-07-03T18:11:29Z
  source last accessed on: 2024-06-05T14:42:36Z
  definition: This segment includes companies that aggregate, market, and distribute television programs to affiliate TV broadcasting stations. These stations then transmit the programming to viewers over public airways.
  notation: 101012101111
  valid from: 2020-10-03
source accessed on: 2019-12-03T20:05:01Z
source last accessed on: 2024-06-05T14:42:36Z
definition: This segment includes companies that aggregate, market, and distribute television programs to affiliate TV broadcasting stations. These stations then transmit the programming to viewers over public airways.
notation: 101012101111
valid from: 2014-08-08

TV Media Networks
type: BicsLevel5Segment
type: Classifier
type: NamedIndividual
is level5 segment of: Film & TV
is replaced by: Film & Video Distribution
created with: infer-bics.sql
derived from: Film & Video Distribution
  type: BicsLevel5Segment
  type: Classifier
  type: ContemporaryDerivation
  derived from: http://data.ga-group.nl/ics/bics/2014/1010121011
  source accessed on: 2019-12-03T20:05:01Z
  source last accessed on: 2019-12-03T20:05:01Z
  definition: This segment includes companies that acquire video distribution rights and distribute film, videotapes, DVDs and other formats to movie theaters, television networks and TV stations.
  notation: 1010121011
  valid from: 2014-08-08
  valid till: 2020-10-03
derived from: TV Media Networks
  type: BicsLevel4SubIndustry
  type: Classifier
  type: AnachronousDerivation
  derived from: http://data.ga-group.nl/ics/bics/2014/10101211
  source accessed on: 2019-12-03T20:05:01Z
  source last accessed on: 2019-12-03T20:05:01Z
  definition: This industry subgroup includes companies that aggregate, market and distribute television programs to TV broadcasting stations, cable companies, satellite companies and wireline telecommunications companies. The programming is typically narrowcast in nature (e.g., limited format, such as news, sports, education, or youth-oriented). These establishments produce programming in their own facilities or acquire programming from external sources.
  notation: 10101211
  valid from: 2014-08-08
  valid till: 2020-10-03
derived from: TV Media Networks
  type: BicsLevel5Segment
  type: Classifier
  type: ContemporaryDerivation
  derived from: http://data.ga-group.nl/ics/bics/2020/1010121011
  source accessed on: 2023-07-03T18:11:29Z
  source last accessed on: 2023-07-03T18:11:29Z
  definition: This segment includes companies that aggregate, market, and distribute television programs to TV broadcasting stations, cable companies, satellite companies, and wireline telecommunications companies. Programming may be produced in-house or acquired from external sources.
  notation: 1010121011
  valid from: 2020-10-03
  valid till: 2024-06-07
derived from: TV Media Networks
  type: BicsLevel5Segment
  type: Classifier
  type: ContemporaryDerivation
  derived from: http://data.ga-group.nl/ics/bics/2024/1010121011
  source accessed on: 2024-06-05T14:42:36Z
  source last accessed on: 2024-06-05T14:42:36Z
  definition: This segment includes companies that aggregate, market, and distribute television programs to TV broadcasting stations, cable companies, satellite companies, and wireline telecommunications companies. Programming may be produced in-house or acquired from external sources.
  notation: 1010121011
  valid from: 2024-06-07
source accessed on: 2019-12-03T20:05:01Z
source last accessed on: 2024-06-05T14:42:36Z
definition: This segment includes companies that aggregate, market, and distribute television programs to TV broadcasting stations, cable companies, satellite companies, and wireline telecommunications companies. Programming may be produced in-house or acquired from external sources.
notation: 1010121011
valid from: 2014-08-08

Royalty Income - Film & TV
type: BicsLevel5Segment
type: Classifier
type: NamedIndividual
is level5 segment of: Film & TV
created with: infer-bics.sql
derived from: Other Film & Video Production
  type: BicsLevel5Segment
  type: Classifier
  type: ContemporaryDerivation
  derived from: http://data.ga-group.nl/ics/bics/2014/1010121012
  source accessed on: 2019-12-03T20:05:01Z
  source last accessed on: 2019-12-03T20:05:01Z
  definition: This segment includes companies that provide film and video services not elsewhere classified.
  notation: 1010121012
  valid from: 2014-08-08
  valid till: 2020-10-03
derived from: Royalty Income - Media
  type: BicsLevel4SubIndustry
  type: Classifier
  type: AnachronousDerivation
  derived from: http://data.ga-group.nl/ics/bics/2014/10101213
  source accessed on: 2019-12-03T20:05:01Z
  source last accessed on: 2019-12-03T20:05:01Z
  definition: This industry subgroup includes companies that generate revenue from their rights to assets (such as trademarks, brand names and/or agreements) for which a royalty payment or licensing fee is paid by others.
  notation: 10101213
  valid from: 2014-08-08
  valid till: 2020-10-03
derived from: Royalty Income - Film & TV
  type: BicsLevel5Segment
  type: Classifier
  type: ContemporaryDerivation
  derived from: http://data.ga-group.nl/ics/bics/2020/1010121012
  derived from: http://data.ga-group.nl/ics/bics/2024/1010121012
  source accessed on: 2023-07-03T18:11:29Z
  source last accessed on: 2024-06-05T14:42:36Z
  definition: This segment includes companies that generate revenue from their film and television assets (such as trademarks, brand names and/or agreements) for which a royalty payment or licensing fee is paid by others.
  notation: 1010121012
  valid from: 2020-10-03
source accessed on: 2019-12-03T20:05:01Z
source last accessed on: 2024-06-05T14:42:36Z
definition: This segment includes companies that generate revenue from their film and television assets (such as trademarks, brand names and/or agreements) for which a royalty payment or licensing fee is paid by others.
notation: 1010121012
valid from: 2014-08-08

Teleprod & Postprod Services
type: BicsLevel5Segment
type: Classifier
type: NamedIndividual
is level5 segment of: Film & TV
is replaced by: Teleprod & Postprod Services
created with: infer-bics.sql
derived from: Teleprod & Postprod Services
  type: BicsLevel5Segment
  type: Classifier
  type: ContemporaryDerivation
  derived from: http://data.ga-group.nl/ics/bics/2014/1010121013
  source accessed on: 2019-12-03T20:05:01Z
  source last accessed on: 2019-12-03T20:05:01Z
  definition: This segment includes companies that provide teleproduction and postproduction services for film and TV. Includes editing film and adding titling, subtitling, credits and closed captioning.
  notation: 1010121013
  valid from: 2014-08-08
  valid till: 2020-10-03
source accessed on: 2019-12-03T20:05:01Z
source last accessed on: 2019-12-03T20:05:01Z
definition: This segment includes companies that provide teleproduction and postproduction services for film and TV. Includes editing film and adding titling, subtitling, credits and closed captioning.
notation: 1010121013
valid from: 2014-08-08
valid till: 2020-10-03

Film & TV
type: BicsLevel4SubIndustry
type: Classifier
type: NamedIndividual
created with: infer-bics.sql
derived from: Film & TV Production & Distr
  type: BicsLevel4SubIndustry
  type: Classifier
  type: ContemporaryDerivation
  derived from: http://data.ga-group.nl/ics/bics/2014/10101210
  source accessed on: 2019-12-03T20:05:01Z
  source last accessed on: 2019-12-03T20:05:01Z
  definition: This industry subgroup includes companies that produce, or produce and distribute, film, videos, television programs or television commercials.
  notation: 10101210
  valid from: 2014-08-08
  valid till: 2020-10-03
derived from: Film & TV
  type: BicsLevel4SubIndustry
  type: Classifier
  type: ContemporaryDerivation
  derived from: http://data.ga-group.nl/ics/bics/2020/10101210
  derived from: http://data.ga-group.nl/ics/bics/2024/10101210
  source accessed on: 2023-07-03T18:11:29Z
  source last accessed on: 2024-06-05T14:42:36Z
  definition: This industry subgroup includes companies that create, acquire, distribute, or broadcast film and television content.
  notation: 10101210
  valid from: 2020-10-03
source accessed on: 2019-12-03T20:05:01Z
source last accessed on: 2024-06-05T14:42:36Z
definition: This industry subgroup includes companies that create, acquire, distribute, or broadcast film and television content.
notation: 10101210
valid from: 2014-08-08

Adv Rev - Cable Networks
type: BicsLevel6Segment
type: Classifier
type: NamedIndividual
is level6 segment of: Integrated Record Prod & Distr
is replaced by: Adv Rev - Cable Networks
created with: infer-bics.sql
derived from: Adv Rev - Cable Networks
  type: BicsLevel6Segment
  type: Classifier
  type: ContemporaryDerivation
  derived from: http://data.ga-group.nl/ics/bics/2014/101012111010
  source accessed on: 2019-12-03T20:05:01Z
  source last accessed on: 2019-12-03T20:05:01Z
  definition: This segment includes revenue that cable networks generate from advertising.
  notation: 101012111010
  valid from: 2014-08-08
  valid till: 2020-10-03
source accessed on: 2019-12-03T20:05:01Z
source last accessed on: 2019-12-03T20:05:01Z
definition: This segment includes revenue that cable networks generate from advertising.
notation: 101012111010
valid from: 2014-08-08
valid till: 2020-10-03

Other Rev - Cable Networks
type: BicsLevel6Segment
type: Classifier
type: NamedIndividual
is level6 segment of: Integrated Record Prod & Distr
is replaced by: Other Rev - Cable Networks
created with: infer-bics.sql
derived from: Other Rev - Cable Networks
  type: BicsLevel6Segment
  type: Classifier
  type: ContemporaryDerivation
  derived from: http://data.ga-group.nl/ics/bics/2014/101012111011
  source accessed on: 2019-12-03T20:05:01Z
  source last accessed on: 2019-12-03T20:05:01Z
  definition: This segment includes revenue that cable networks generate from other than advertising.
  notation: 101012111011
  valid from: 2014-08-08
  valid till: 2020-10-03
source accessed on: 2019-12-03T20:05:01Z
source last accessed on: 2019-12-03T20:05:01Z
definition: This segment includes revenue that cable networks generate from other than advertising.
notation: 101012111011
valid from: 2014-08-08
valid till: 2020-10-03

Integrated Record Prod & Distr
type: BicsLevel5Segment
type: Classifier
type: NamedIndividual
is level5 segment of: Music
is replaced by: Cable Networks
replaces: Mobile & Online Games
created with: infer-bics.sql
derived from: Cable Networks
  type: BicsLevel5Segment
  type: Classifier
  type: ContemporaryDerivation
  derived from: http://data.ga-group.nl/ics/bics/2014/1010121110
  source accessed on: 2019-12-03T20:05:01Z
  source last accessed on: 2019-12-03T20:05:01Z
  definition: This segment includes companies that aggregate, market and distribute television programs to cable companies, satellite companies and wireline telecommunications companies. These cable networks negotiate with local and international distributors for broadcasting of the programming on a subscription or fee basis. Typically, the programming content would be viewed on branded cable TV channels.
  notation: 1010121110
  valid from: 2014-08-08
  valid till: 2020-10-03
derived from: Integrated Record Prod & Distr
  type: BicsLevel5Segment
  type: Classifier
  type: AnachronousDerivation
  derived from: http://data.ga-group.nl/ics/bics/2014/1010121210
  source accessed on: 2019-12-03T20:05:01Z
  source last accessed on: 2019-12-03T20:05:01Z
  definition: This segment includes companies that release, promote and distribute sound recordings. These companies manufacture, or arrange for the manufacture of, recordings, such as audio tapes/cassettes and compact discs, and promote and distribute these products to wholesalers, retailers, or directly to the public. Companies in this segment produce master recordings themselves or obtain reproduction and distribution rights to master recordings produced by record production companies or other integrated record companies.
  notation: 1010121210
  valid from: 2014-08-08
  valid till: 2020-10-03
derived from: Integrated Record Prod & Distr
  type: BicsLevel5Segment
  type: Classifier
  type: ContemporaryDerivation
  derived from: http://data.ga-group.nl/ics/bics/2020/1010121110
  derived from: http://data.ga-group.nl/ics/bics/2024/1010121110
  source accessed on: 2023-07-03T18:11:29Z
  source last accessed on: 2024-06-05T14:42:36Z
  definition: This segment includes companies that release, promote, and distribute sound recordings. These companies manufacture, or arrange for the manufacture of recordings, such as audio tapes/cassettes and compact discs, and promote and distribute these products to wholesalers, retailers, or directly to the public. Companies in this segment produce master recordings themselves or obtain reproduction and distribution rights to master recordings produced by record production companies or other integrated record companies.
  notation: 1010121110
  valid from: 2020-10-03
source accessed on: 2019-12-03T20:05:01Z
source last accessed on: 2024-06-05T14:42:36Z
definition: This segment includes companies that release, promote, and distribute sound recordings. These companies manufacture, or arrange for the manufacture of recordings, such as audio tapes/cassettes and compact discs, and promote and distribute these products to wholesalers, retailers, or directly to the public. Companies in this segment produce master recordings themselves or obtain reproduction and distribution rights to master recordings produced by record production companies or other integrated record companies.
notation: 1010121110
valid from: 2014-08-08

Adv Rev - TV Broadcast Netw
type: BicsLevel6Segment
type: Classifier
type: NamedIndividual
is level6 segment of: Music Publishers
is replaced by: Adv Rev - TV Broadcast Netw
created with: infer-bics.sql
derived from: Adv Rev - TV Broadcast Netw
  type: BicsLevel6Segment
  type: Classifier
  type: ContemporaryDerivation
  derived from: http://data.ga-group.nl/ics/bics/2014/101012111110
  source accessed on: 2019-12-03T20:05:01Z
  source last accessed on: 2019-12-03T20:05:01Z
  definition: This segment includes revenue that TV broadcast networks generates from advertising.
  notation: 101012111110
  valid from: 2014-08-08
  valid till: 2020-10-03
source accessed on: 2019-12-03T20:05:01Z
source last accessed on: 2019-12-03T20:05:01Z
definition: This segment includes revenue that TV broadcast networks generates from advertising.
notation: 101012111110
valid from: 2014-08-08
valid till: 2020-10-03

Other Rev - TV Broadcast Netw
type: BicsLevel6Segment
type: Classifier
type: NamedIndividual
is level6 segment of: Music Publishers
is replaced by: Other Rev - TV Broadcast Netw
created with: infer-bics.sql
derived from: Other Rev - TV Broadcast Netw
  type: BicsLevel6Segment
  type: Classifier
  type: ContemporaryDerivation
  derived from: http://data.ga-group.nl/ics/bics/2014/101012111111
  source accessed on: 2019-12-03T20:05:01Z
  source last accessed on: 2019-12-03T20:05:01Z
  definition: This segment includes revenue that TV broadcast networks generate from other than advertising.
  notation: 101012111111
  valid from: 2014-08-08
  valid till: 2020-10-03
source accessed on: 2019-12-03T20:05:01Z
source last accessed on: 2019-12-03T20:05:01Z
definition: This segment includes revenue that TV broadcast networks generate from other than advertising.
notation: 101012111111
valid from: 2014-08-08
valid till: 2020-10-03

Music Publishers
type: BicsLevel5Segment
type: Classifier
type: NamedIndividual
is level5 segment of: Music
is replaced by: TV Broadcast Networks
replaces: Console & PC Games
created with: infer-bics.sql
derived from: TV Broadcast Networks
  type: BicsLevel5Segment
  type: Classifier
  type: ContemporaryDerivation
  derived from: http://data.ga-group.nl/ics/bics/2014/1010121111
  source accessed on: 2019-12-03T20:05:01Z
  source last accessed on: 2019-12-03T20:05:01Z
  definition: This segment includes companies that aggregate, market and distribute television programs to affiliate TV broadcasting stations. These TV broadcasting stations in turn transmit the programming material to viewers over public airways. Typically, the programming content would be viewed on branded antenna TV channels.
  notation: 1010121111
  valid from: 2014-08-08
  valid till: 2020-10-03
derived from: Music Publishers
  type: BicsLevel5Segment
  type: Classifier
  type: AnachronousDerivation
  derived from: http://data.ga-group.nl/ics/bics/2014/1010121211
  source accessed on: 2019-12-03T20:05:01Z
  source last accessed on: 2019-12-03T20:05:01Z
  definition: This segment includes companies that acquire and register copyrights for musical compositions, and promote and authorize the use of these compositions in recordings, radio, television, motion pictures, live performances, print or other media. Companies in this segment represent the interests of the songwriter or other owners of musical compositions to produce revenues from the use of such works, generally through licensing agreements. These companies may own the copyright or act as administrator of the music copyrights on behalf of copyright owners. Publishers of music books and sheet music are included in this segment.
  notation: 1010121211
  valid from: 2014-08-08
  valid till: 2020-10-03
derived from: Music Publishers
  type: BicsLevel5Segment
  type: Classifier
  type: ContemporaryDerivation
  derived from: http://data.ga-group.nl/ics/bics/2020/1010121111
  derived from: http://data.ga-group.nl/ics/bics/2024/1010121111
  source accessed on: 2023-07-03T18:11:29Z
  source last accessed on: 2024-06-05T14:42:36Z
  definition: This segment includes companies that acquire and register copyrights for musical compositions, and promote and authorize the use of these compositions in recordings, radio, television, motion pictures, live performances, print or other media. Companies in this segment represent the interests of the songwriter or other owners of musical compositions to produce revenues from the use of such works, generally through licensing agreements. These companies may own the copyright or act as administrator of the music copyrights on behalf of copyright owners. Publishers of music books and sheet music are included in this segment.
  notation: 1010121111
  valid from: 2020-10-03
source accessed on: 2019-12-03T20:05:01Z
source last accessed on: 2024-06-05T14:42:36Z
definition: This segment includes companies that acquire and register copyrights for musical compositions, and promote and authorize the use of these compositions in recordings, radio, television, motion pictures, live performances, print or other media. Companies in this segment represent the interests of the songwriter or other owners of musical compositions to produce revenues from the use of such works, generally through licensing agreements. These companies may own the copyright or act as administrator of the music copyrights on behalf of copyright owners. Publishers of music books and sheet music are included in this segment.
notation: 1010121111
valid from: 2014-08-08

Record Production
type: BicsLevel5Segment
type: Classifier
type: NamedIndividual
is level5 segment of: Music
replaces: Record Production
created with: infer-bics.sql
derived from: Record Production
  type: BicsLevel5Segment
  type: Classifier
  type: AnachronousDerivation
  derived from: http://data.ga-group.nl/ics/bics/2014/1010121212
  source accessed on: 2019-12-03T20:05:01Z
  source last accessed on: 2019-12-03T20:05:01Z
  definition: This segment includes companies that produce records, such as tapes and compact discs. These companies contract with artists and arrange and finance the production of original master recordings. These companies also hold the copyright to the master recording and derive most of their revenues from the sales, leasing and licensing of master recordings. Such companies do not have their own duplication or distribution capabilities.
  notation: 1010121212
  valid from: 2014-08-08
  valid till: 2020-10-03
derived from: Record Production
  type: BicsLevel5Segment
  type: Classifier
  type: ContemporaryDerivation
  derived from: http://data.ga-group.nl/ics/bics/2020/1010121112
  derived from: http://data.ga-group.nl/ics/bics/2024/1010121112
  source accessed on: 2023-07-03T18:11:29Z
  source last accessed on: 2024-06-05T14:42:36Z
  definition: This segment includes companies that produce records, tapes, and compact discs. These companies contract with artists and arrange and finance the production of original master recordings. These companies also hold the copyright to the master recording and derive most of their revenues from the sales, leasing, and licensing of master recordings. Such companies do not have their own duplication or distribution capabilities.
  notation: 1010121112
  valid from: 2020-10-03
source accessed on: 2023-07-03T18:11:29Z
source last accessed on: 2024-06-05T14:42:36Z
definition: This segment includes companies that produce records, tapes, and compact discs. These companies contract with artists and arrange and finance the production of original master recordings. These companies also hold the copyright to the master recording and derive most of their revenues from the sales, leasing, and licensing of master recordings. Such companies do not have their own duplication or distribution capabilities.
notation: 1010121112
valid from: 2020-10-03

Music
type: BicsLevel4SubIndustry
type: Classifier
type: NamedIndividual
created with: infer-bics.sql
derived from: TV Media Networks
  type: BicsLevel4SubIndustry
  type: Classifier
  type: ContemporaryDerivation
  derived from: http://data.ga-group.nl/ics/bics/2014/10101211
  source accessed on: 2019-12-03T20:05:01Z
  source last accessed on: 2019-12-03T20:05:01Z
  definition: This industry subgroup includes companies that aggregate, market and distribute television programs to TV broadcasting stations, cable companies, satellite companies and wireline telecommunications companies. The programming is typically narrowcast in nature (e.g., limited format, such as news, sports, education, or youth-oriented). These establishments produce programming in their own facilities or acquire programming from external sources.
  notation: 10101211
  valid from: 2014-08-08
  valid till: 2020-10-03
derived from: Music Production & Distribution
  type: BicsLevel4SubIndustry
  type: Classifier
  type: AnachronousDerivation
  derived from: http://data.ga-group.nl/ics/bics/2014/10101212
  source accessed on: 2019-12-03T20:05:01Z
  source last accessed on: 2019-12-03T20:05:01Z
  definition: This industry subgroup includes companies that acquire distribution rights and distribute music productions.
  notation: 10101212
  valid from: 2014-08-08
  valid till: 2020-10-03
derived from: Music
  type: BicsLevel4SubIndustry
  type: Classifier
  type: ContemporaryDerivation
  derived from: http://data.ga-group.nl/ics/bics/2020/10101211
  derived from: http://data.ga-group.nl/ics/bics/2024/10101211
  source accessed on: 2023-07-03T18:11:29Z
  source last accessed on: 2024-06-05T14:42:36Z
  definition: This industry subgroup includes companies that acquire, produce, and distribute music content.
  notation: 10101211
  valid from: 2020-10-03
source accessed on: 2019-12-03T20:05:01Z
source last accessed on: 2024-06-05T14:42:36Z
definition: This industry subgroup includes companies that acquire, produce, and distribute music content.
notation: 10101211
valid from: 2014-08-08

Mobile & Online Games
type: BicsLevel5Segment
type: Classifier
type: NamedIndividual
is level5 segment of: Video Games
is replaced by: Integrated Record Prod & Distr
replaces: http://data.ga-group.nl/ics/bics/1812101610
created with: infer-bics.sql
derived from: Integrated Record Prod & Distr
  type: BicsLevel5Segment
  type: Classifier
  type: ContemporaryDerivation
  derived from: http://data.ga-group.nl/ics/bics/2014/1010121210
  source accessed on: 2019-12-03T20:05:01Z
  source last accessed on: 2019-12-03T20:05:01Z
  definition: This segment includes companies that release, promote and distribute sound recordings. These companies manufacture, or arrange for the manufacture of, recordings, such as audio tapes/cassettes and compact discs, and promote and distribute these products to wholesalers, retailers, or directly to the public. Companies in this segment produce master recordings themselves or obtain reproduction and distribution rights to master recordings produced by record production companies or other integrated record companies.
  notation: 1010121210
  valid from: 2014-08-08
  valid till: 2020-10-03
derived from: Digital Games
  type: BicsLevel5Segment
  type: Classifier
  type: AnachronousDerivation
  derived from: http://data.ga-group.nl/ics/bics/2014/1812101610
  source accessed on: 2019-12-03T20:05:01Z
  source last accessed on: 2019-12-03T20:05:01Z
  definition: This segment includes companies that publish and distribute video game software over a digital distribution channel. These video games are either digitally downloaded or accessible on the Internet.
  notation: 1812101610
  valid from: 2014-08-08
  valid till: 2020-10-03
derived from: Mobile & Online Games
  type: BicsLevel5Segment
  type: Classifier
  type: ContemporaryDerivation
  derived from: http://data.ga-group.nl/ics/bics/2020/1010121210
  derived from: http://data.ga-group.nl/ics/bics/2024/1010121210
  source accessed on: 2023-07-03T18:11:29Z
  source last accessed on: 2024-06-05T14:42:36Z
  definition: This segment includes companies that primarily publish and distribute video game software for mobile phones or websites.
  notation: 1010121210
  valid from: 2020-10-03
source accessed on: 2019-12-03T20:05:01Z
source last accessed on: 2024-06-05T14:42:36Z
definition: This segment includes companies that primarily publish and distribute video game software for mobile phones or websites.
notation: 1010121210
valid from: 2014-08-08

Console & PC Games
type: BicsLevel5Segment
type: Classifier
type: NamedIndividual
is level5 segment of: Video Games
is replaced by: Music Publishers
replaces: http://data.ga-group.nl/ics/bics/1812101611
created with: infer-bics.sql
derived from: Music Publishers
  type: BicsLevel5Segment
  type: Classifier
  type: ContemporaryDerivation
  derived from: http://data.ga-group.nl/ics/bics/2014/1010121211
  source accessed on: 2019-12-03T20:05:01Z
  source last accessed on: 2019-12-03T20:05:01Z
  definition: This segment includes companies that acquire and register copyrights for musical compositions, and promote and authorize the use of these compositions in recordings, radio, television, motion pictures, live performances, print or other media. Companies in this segment represent the interests of the songwriter or other owners of musical compositions to produce revenues from the use of such works, generally through licensing agreements. These companies may own the copyright or act as administrator of the music copyrights on behalf of copyright owners. Publishers of music books and sheet music are included in this segment.
  notation: 1010121211
  valid from: 2014-08-08
  valid till: 2020-10-03
derived from: Packaged Games
  type: BicsLevel5Segment
  type: Classifier
  type: AnachronousDerivation
  derived from: http://data.ga-group.nl/ics/bics/2014/1812101611
  source accessed on: 2019-12-03T20:05:01Z
  source last accessed on: 2019-12-03T20:05:01Z
  definition: This segment includes companies that publish and distribute video game software over traditional retail channels. These video games are sold in a packaged case on a disc format.
  notation: 1812101611
  valid from: 2014-08-08
  valid till: 2020-10-03
derived from: Console & PC Games
  type: BicsLevel5Segment
  type: Classifier
  type: ContemporaryDerivation
  derived from: http://data.ga-group.nl/ics/bics/2020/1010121211
  derived from: http://data.ga-group.nl/ics/bics/2024/1010121211
  source accessed on: 2023-07-03T18:11:29Z
  source last accessed on: 2024-06-05T14:42:36Z
  definition: This segment includes companies that publish and distribute video game software for personal computers or video game consoles.
  notation: 1010121211
  valid from: 2020-10-03
source accessed on: 2019-12-03T20:05:01Z
source last accessed on: 2024-06-05T14:42:36Z
definition: This segment includes companies that publish and distribute video game software for personal computers or video game consoles.
notation: 1010121211
valid from: 2014-08-08

Record Production
type: BicsLevel5Segment
type: Classifier
type: NamedIndividual
is level5 segment of: Video Games
is replaced by: Record Production
created with: infer-bics.sql
derived from: Record Production
  type: BicsLevel5Segment
  type: Classifier
  type: ContemporaryDerivation
  derived from: http://data.ga-group.nl/ics/bics/2014/1010121212
  source accessed on: 2019-12-03T20:05:01Z
  source last accessed on: 2019-12-03T20:05:01Z
  definition: This segment includes companies that produce records, such as tapes and compact discs. These companies contract with artists and arrange and finance the production of original master recordings. These companies also hold the copyright to the master recording and derive most of their revenues from the sales, leasing and licensing of master recordings. Such companies do not have their own duplication or distribution capabilities.
  notation: 1010121212
  valid from: 2014-08-08
  valid till: 2020-10-03
source accessed on: 2019-12-03T20:05:01Z
source last accessed on: 2019-12-03T20:05:01Z
definition: This segment includes companies that produce records, such as tapes and compact discs. These companies contract with artists and arrange and finance the production of original master recordings. These companies also hold the copyright to the master recording and derive most of their revenues from the sales, leasing and licensing of master recordings. Such companies do not have their own duplication or distribution capabilities.
notation: 1010121212
valid from: 2014-08-08
valid till: 2020-10-03

Sound Recording Studios
type: BicsLevel5Segment
type: Classifier
type: NamedIndividual
is level5 segment of: Video Games
created with: infer-bics.sql
derived from: Sound Recording Studios
  type: BicsLevel5Segment
  type: Classifier
  type: ContemporaryDerivation
  derived from: http://data.ga-group.nl/ics/bics/2014/1010121213
  source accessed on: 2019-12-03T20:05:01Z
  source last accessed on: 2019-12-03T20:05:01Z
  definition: This segment includes companies that provide the facilities and technical expertise for sound recording in a studio. These companies provide audio production and postproduction services to produce master recordings. They may provide audio services for film, television and video productions.
  notation: 1010121213
  valid from: 2014-08-08
  valid till: 2020-10-03
source accessed on: 2019-12-03T20:05:01Z
source last accessed on: 2019-12-03T20:05:01Z
definition: This segment includes companies that provide the facilities and technical expertise for sound recording in a studio. These companies provide audio production and postproduction services to produce master recordings. They may provide audio services for film, television and video productions.
notation: 1010121213
valid from: 2014-08-08
valid till: 2020-10-03

Video Games
type: BicsLevel4SubIndustry
type: Classifier
type: NamedIndividual
created with: infer-bics.sql
derived from: Music Production & Distribution
  type: BicsLevel4SubIndustry
  type: Classifier
  type: ContemporaryDerivation
  derived from: http://data.ga-group.nl/ics/bics/2014/10101212
  source accessed on: 2019-12-03T20:05:01Z
  source last accessed on: 2019-12-03T20:05:01Z
  definition: This industry subgroup includes companies that acquire distribution rights and distribute music productions.
  notation: 10101212
  valid from: 2014-08-08
  valid till: 2020-10-03
derived from: Video Game Software
  type: BicsLevel4SubIndustry
  type: Classifier
  type: AnachronousDerivation
  derived from: http://data.ga-group.nl/ics/bics/2014/18121016
  source accessed on: 2019-12-03T20:05:01Z
  source last accessed on: 2019-12-03T20:05:01Z
  definition: This industry subgroup includes companies that publish and/or distribute video game software. Such software includes games developed for consoles, handhelds and personal computers.
  notation: 18121016
  valid from: 2014-08-08
  valid till: 2020-10-03
derived from: Video Games
  type: BicsLevel4SubIndustry
  type: Classifier
  type: ContemporaryDerivation
  derived from: http://data.ga-group.nl/ics/bics/2020/10101212
  derived from: http://data.ga-group.nl/ics/bics/2024/10101212
  source accessed on: 2023-07-03T18:11:29Z
  source last accessed on: 2024-06-05T14:42:36Z
  definition: This industry subgroup includes companies that publish and/or distribute video game software.
  notation: 10101212
  valid from: 2020-10-03
source accessed on: 2019-12-03T20:05:01Z
source last accessed on: 2024-06-05T14:42:36Z
definition: This industry subgroup includes companies that publish and/or distribute video game software.
notation: 10101212
valid from: 2014-08-08

Royalty Income - Media
type: BicsLevel4SubIndustry
type: Classifier
type: NamedIndividual
created with: infer-bics.sql
derived from: Royalty Income - Media
  type: BicsLevel4SubIndustry
  type: Classifier
  type: ContemporaryDerivation
  derived from: http://data.ga-group.nl/ics/bics/2014/10101213
  source accessed on: 2019-12-03T20:05:01Z
  source last accessed on: 2019-12-03T20:05:01Z
  definition: This industry subgroup includes companies that generate revenue from their rights to assets (such as trademarks, brand names and/or agreements) for which a royalty payment or licensing fee is paid by others.
  notation: 10101213
  valid from: 2014-08-08
  valid till: 2020-10-03
source accessed on: 2019-12-03T20:05:01Z
source last accessed on: 2019-12-03T20:05:01Z
definition: This industry subgroup includes companies that generate revenue from their rights to assets (such as trademarks, brand names and/or agreements) for which a royalty payment or licensing fee is paid by others.
notation: 10101213
valid from: 2014-08-08
valid till: 2020-10-03

Entertainment Content
type: BicsLevel3Industry
type: Classifier
type: NamedIndividual
is industry of: Media
created with: infer-bics.sql
derived from: Entertainment Content
  type: BicsLevel3Industry
  type: Classifier
  type: ContemporaryDerivation
  derived from: http://data.ga-group.nl/ics/bics/2014/101012
  source accessed on: 2019-12-03T20:05:01Z
  source last accessed on: 2019-12-03T20:05:01Z
  definition: This industry includes companies that create content or acquire the right to distribute content and sell advertising over cable or broadcast media, such as television or radio. Entertainment content includes entertainment programs, news, sports, and educational and children's television programming, as well as the creation of music. Excludes content distributed via the Internet (see Internet Media).
  notation: 101012
  valid from: 2014-08-08
  valid till: 2020-10-03
derived from: Entertainment Content
  type: BicsLevel3Industry
  type: Classifier
  type: ContemporaryDerivation
  derived from: http://data.ga-group.nl/ics/bics/2020/101012
  derived from: http://data.ga-group.nl/ics/bics/2024/101012
  source accessed on: 2023-07-03T18:11:29Z
  source last accessed on: 2024-06-05T14:42:36Z
  definition: This industry includes companies that create entertainment content or acquire the right to distribute content and sell advertising over cable or broadcast media, such as television or radio. Includes entertainment programs, news, sports, and educational and children's television programming, as well as the creation of music and video games. Excludes content distributed via the Internet (see Internet Media).
  notation: 101012
  valid from: 2020-10-03
source accessed on: 2019-12-03T20:05:01Z
source last accessed on: 2024-06-05T14:42:36Z
definition: This industry includes companies that create entertainment content or acquire the right to distribute content and sell advertising over cable or broadcast media, such as television or radio. Includes entertainment programs, news, sports, and educational and children's television programming, as well as the creation of music and video games. Excludes content distributed via the Internet (see Internet Media).
notation: 101012
valid from: 2014-08-08

Professional Book Publishers
type: BicsLevel6Segment
type: Classifier
type: NamedIndividual
is level6 segment of: Book Publishers
replaces: Professional Book Publishers
created with: infer-bics.sql
derived from: Dictionary & Ency Publishers
  type: BicsLevel6Segment
  type: Classifier
  type: ContemporaryDerivation
  derived from: http://data.ga-group.nl/ics/bics/2014/101013101010
  source accessed on: 2019-12-03T20:05:01Z
  source last accessed on: 2019-12-03T20:05:01Z
  definition: This segment includes companies that publish dictionaries and encyclopedias.
  notation: 101013101010
  valid from: 2014-08-08
  valid till: 2020-10-03
derived from: Professional Book Publishers
  type: BicsLevel6Segment
  type: Classifier
  type: AnachronousDerivation
  derived from: http://data.ga-group.nl/ics/bics/2014/101013101013
  source accessed on: 2019-12-03T20:05:01Z
  source last accessed on: 2019-12-03T20:05:01Z
  definition: This segment includes companies that publish books used by specific professions.
  notation: 101013101013
  valid from: 2014-08-08
  valid till: 2020-10-03
derived from: Professional Book Publishers
  type: BicsLevel6Segment
  type: Classifier
  type: ContemporaryDerivation
  derived from: http://data.ga-group.nl/ics/bics/2020/101013101010
  derived from: http://data.ga-group.nl/ics/bics/2024/101013101010
  source accessed on: 2023-07-03T18:11:29Z
  source last accessed on: 2024-06-05T14:42:36Z
  definition: This segment includes companies that publish books used by specific professions.
  notation: 101013101010
  valid from: 2020-10-03
source accessed on: 2019-12-03T20:05:01Z
source last accessed on: 2024-06-05T14:42:36Z
definition: This segment includes companies that publish books used by specific professions.
notation: 101013101010
valid from: 2014-08-08

School Textbook Publishers
type: BicsLevel6Segment
type: Classifier
type: NamedIndividual
is level6 segment of: Book Publishers
replaces: School Textbook Publishers
created with: infer-bics.sql
derived from: Fiction Book Publishers
  type: BicsLevel6Segment
  type: Classifier
  type: ContemporaryDerivation
  derived from: http://data.ga-group.nl/ics/bics/2014/101013101011
  source accessed on: 2019-12-03T20:05:01Z
  source last accessed on: 2019-12-03T20:05:01Z
  definition: This segment includes companies that publish fiction books.
  notation: 101013101011
  valid from: 2014-08-08
  valid till: 2020-10-03
derived from: School Textbook Publishers
  type: BicsLevel6Segment
  type: Classifier
  type: AnachronousDerivation
  derived from: http://data.ga-group.nl/ics/bics/2014/101013101014
  source accessed on: 2019-12-03T20:05:01Z
  source last accessed on: 2019-12-03T20:05:01Z
  definition: This segment includes companies that publish, design, edit and market school textbooks.
  notation: 101013101014
  valid from: 2014-08-08
  valid till: 2020-10-03
derived from: School Textbook Publishers
  type: BicsLevel6Segment
  type: Classifier
  type: ContemporaryDerivation
  derived from: http://data.ga-group.nl/ics/bics/2020/101013101011
  derived from: http://data.ga-group.nl/ics/bics/2024/101013101011
  source accessed on: 2023-07-03T18:11:29Z
  source last accessed on: 2024-06-05T14:42:36Z
  definition: This segment includes companies that publish school textbooks.
  notation: 101013101011
  valid from: 2020-10-03
source accessed on: 2019-12-03T20:05:01Z
source last accessed on: 2024-06-05T14:42:36Z
definition: This segment includes companies that publish school textbooks.
notation: 101013101011
valid from: 2014-08-08

Nonfiction Book Publishers
type: BicsLevel6Segment
type: Classifier
type: NamedIndividual
is level6 segment of: Book Publishers
created with: infer-bics.sql
derived from: Nonfiction Book Publishers
  type: BicsLevel6Segment
  type: Classifier
  type: ContemporaryDerivation
  derived from: http://data.ga-group.nl/ics/bics/2014/101013101012
  source accessed on: 2019-12-03T20:05:01Z
  source last accessed on: 2019-12-03T20:05:01Z
  definition: This segment includes companies that publish nonfiction books.
  notation: 101013101012
  valid from: 2014-08-08
  valid till: 2020-10-03
source accessed on: 2019-12-03T20:05:01Z
source last accessed on: 2019-12-03T20:05:01Z
definition: This segment includes companies that publish nonfiction books.
notation: 101013101012
valid from: 2014-08-08
valid till: 2020-10-03

Professional Book Publishers
type: BicsLevel6Segment
type: Classifier
type: NamedIndividual
is level6 segment of: Book Publishers
is replaced by: Professional Book Publishers
created with: infer-bics.sql
derived from: Professional Book Publishers
  type: BicsLevel6Segment
  type: Classifier
  type: ContemporaryDerivation
  derived from: http://data.ga-group.nl/ics/bics/2014/101013101013
  source accessed on: 2019-12-03T20:05:01Z
  source last accessed on: 2019-12-03T20:05:01Z
  definition: This segment includes companies that publish books used by specific professions.
  notation: 101013101013
  valid from: 2014-08-08
  valid till: 2020-10-03
source accessed on: 2019-12-03T20:05:01Z
source last accessed on: 2019-12-03T20:05:01Z
definition: This segment includes companies that publish books used by specific professions.
notation: 101013101013
valid from: 2014-08-08
valid till: 2020-10-03

School Textbook Publishers
type: BicsLevel6Segment
type: Classifier
type: NamedIndividual
is level6 segment of: Book Publishers
is replaced by: School Textbook Publishers
created with: infer-bics.sql
derived from: School Textbook Publishers
  type: BicsLevel6Segment
  type: Classifier
  type: ContemporaryDerivation
  derived from: http://data.ga-group.nl/ics/bics/2014/101013101014
  source accessed on: 2019-12-03T20:05:01Z
  source last accessed on: 2019-12-03T20:05:01Z
  definition: This segment includes companies that publish, design, edit and market school textbooks.
  notation: 101013101014
  valid from: 2014-08-08
  valid till: 2020-10-03
source accessed on: 2019-12-03T20:05:01Z
source last accessed on: 2019-12-03T20:05:01Z
definition: This segment includes companies that publish, design, edit and market school textbooks.
notation: 101013101014
valid from: 2014-08-08
valid till: 2020-10-03

Other Book Publishers
type: BicsLevel6Segment
type: Classifier
type: NamedIndividual
is level6 segment of: Book Publishers
created with: infer-bics.sql
derived from: Other Book Publishers
  type: BicsLevel6Segment
  type: Classifier
  type: ContemporaryDerivation
  derived from: http://data.ga-group.nl/ics/bics/2014/101013101015
  source accessed on: 2019-12-03T20:05:01Z
  source last accessed on: 2019-12-03T20:05:01Z
  definition: This segment includes companies that publish other books not elsewhere classified, such as travel guides.
  notation: 101013101015
  valid from: 2014-08-08
  valid till: 2020-10-03
source accessed on: 2019-12-03T20:05:01Z
source last accessed on: 2019-12-03T20:05:01Z
definition: This segment includes companies that publish other books not elsewhere classified, such as travel guides.
notation: 101013101015
valid from: 2014-08-08
valid till: 2020-10-03

Book Publishers
type: BicsLevel5Segment
type: Classifier
type: NamedIndividual
is level5 segment of: Publishing
created with: infer-bics.sql
derived from: Book Publishers
  type: BicsLevel5Segment
  type: Classifier
  type: ContemporaryDerivation
  derived from: http://data.ga-group.nl/ics/bics/2014/1010131010
  derived from: http://data.ga-group.nl/ics/bics/2020/1010131010
  derived from: http://data.ga-group.nl/ics/bics/2024/1010131010
  source accessed on: 2019-12-03T20:05:01Z
  source last accessed on: 2024-06-05T14:42:36Z
  definition: This segment includes companies that publish and distribute books. These companies provide book design, editing and marketing activities.
  notation: 1010131010
  valid from: 2014-08-08
source accessed on: 2019-12-03T20:05:01Z
source last accessed on: 2024-06-05T14:42:36Z
definition: This segment includes companies that publish and distribute books. These companies provide book design, editing and marketing activities.
notation: 1010131010
valid from: 2014-08-08

Advertising Rev - Newspaper
type: BicsLevel6Segment
type: Classifier
type: NamedIndividual
is level6 segment of: Newspaper Publishers
created with: infer-bics.sql
derived from: Advertising Rev - Newspaper
  type: BicsLevel6Segment
  type: Classifier
  type: ContemporaryDerivation
  derived from: http://data.ga-group.nl/ics/bics/2014/101013101110
  derived from: http://data.ga-group.nl/ics/bics/2020/101013101110
  derived from: http://data.ga-group.nl/ics/bics/2024/101013101110
  source accessed on: 2019-12-03T20:05:01Z
  source last accessed on: 2024-06-05T14:42:36Z
  definition: This segment includes revenue that newspaper publishers generate from advertising.
  notation: 101013101110
  valid from: 2014-08-08
source accessed on: 2019-12-03T20:05:01Z
source last accessed on: 2024-06-05T14:42:36Z
definition: This segment includes revenue that newspaper publishers generate from advertising.
notation: 101013101110
valid from: 2014-08-08

Circulation Rev - Newspaper
type: BicsLevel6Segment
type: Classifier
type: NamedIndividual
is level6 segment of: Newspaper Publishers
created with: infer-bics.sql
derived from: Circulation Rev - Newspaper
  type: BicsLevel6Segment
  type: Classifier
  type: ContemporaryDerivation
  derived from: http://data.ga-group.nl/ics/bics/2014/101013101111
  derived from: http://data.ga-group.nl/ics/bics/2020/101013101111
  derived from: http://data.ga-group.nl/ics/bics/2024/101013101111
  source accessed on: 2019-12-03T20:05:01Z
  source last accessed on: 2024-06-05T14:42:36Z
  definition: This segment includes revenue that newspaper publishers generate from circulation.
  notation: 101013101111
  valid from: 2014-08-08
source accessed on: 2019-12-03T20:05:01Z
source last accessed on: 2024-06-05T14:42:36Z
definition: This segment includes revenue that newspaper publishers generate from circulation.
notation: 101013101111
valid from: 2014-08-08

Other Revenue - Newspaper
type: BicsLevel6Segment
type: Classifier
type: NamedIndividual
is level6 segment of: Newspaper Publishers
created with: infer-bics.sql
derived from: Other Revenue - Newspaper
  type: BicsLevel6Segment
  type: Classifier
  type: ContemporaryDerivation
  derived from: http://data.ga-group.nl/ics/bics/2014/101013101112
  derived from: http://data.ga-group.nl/ics/bics/2020/101013101112
  derived from: http://data.ga-group.nl/ics/bics/2024/101013101112
  source accessed on: 2019-12-03T20:05:01Z
  source last accessed on: 2024-06-05T14:42:36Z
  definition: This segment includes revenue that newspaper publishers generate from sources other than advertising and circulation.
  notation: 101013101112
  valid from: 2014-08-08
source accessed on: 2019-12-03T20:05:01Z
source last accessed on: 2024-06-05T14:42:36Z
definition: This segment includes revenue that newspaper publishers generate from sources other than advertising and circulation.
notation: 101013101112
valid from: 2014-08-08

Newspaper Publishers
type: BicsLevel5Segment
type: Classifier
type: NamedIndividual
is level5 segment of: Publishing
created with: infer-bics.sql
derived from: Newspaper Publishers
  type: BicsLevel5Segment
  type: Classifier
  type: ContemporaryDerivation
  derived from: http://data.ga-group.nl/ics/bics/2014/1010131011
  source accessed on: 2019-12-03T20:05:01Z
  source last accessed on: 2019-12-03T20:05:01Z
  definition: This segment includes companies that produce and distribute newspapers. These companies gather news and write news columns, features stories and editorials, as well as sell and prepare advertisements.
  notation: 1010131011
  valid from: 2014-08-08
  valid till: 2020-10-03
derived from: Newspaper Publishers
  type: BicsLevel5Segment
  type: Classifier
  type: ContemporaryDerivation
  derived from: http://data.ga-group.nl/ics/bics/2020/1010131011
  derived from: http://data.ga-group.nl/ics/bics/2024/1010131011
  source accessed on: 2023-07-03T18:11:29Z
  source last accessed on: 2024-06-05T14:42:36Z
  definition: This segment includes companies that produce and distribute newspapers.
  notation: 1010131011
  valid from: 2020-10-03
source accessed on: 2019-12-03T20:05:01Z
source last accessed on: 2024-06-05T14:42:36Z
definition: This segment includes companies that produce and distribute newspapers.
notation: 1010131011
valid from: 2014-08-08

Advertising Rev - Periodical
type: BicsLevel6Segment
type: Classifier
type: NamedIndividual
is level6 segment of: Periodical Publishers
created with: infer-bics.sql
derived from: Advertising Rev - Periodical
  type: BicsLevel6Segment
  type: Classifier
  type: ContemporaryDerivation
  derived from: http://data.ga-group.nl/ics/bics/2014/101013101210
  derived from: http://data.ga-group.nl/ics/bics/2020/101013101210
  derived from: http://data.ga-group.nl/ics/bics/2024/101013101210
  source accessed on: 2019-12-03T20:05:01Z
  source last accessed on: 2024-06-05T14:42:36Z
  definition: This segment includes revenue that periodical publishers generate from advertising.
  notation: 101013101210
  valid from: 2014-08-08
source accessed on: 2019-12-03T20:05:01Z
source last accessed on: 2024-06-05T14:42:36Z
definition: This segment includes revenue that periodical publishers generate from advertising.
notation: 101013101210
valid from: 2014-08-08

Circulation Rev - Periodical
type: BicsLevel6Segment
type: Classifier
type: NamedIndividual
is level6 segment of: Periodical Publishers
created with: infer-bics.sql
derived from: Circulation Rev - Periodical
  type: BicsLevel6Segment
  type: Classifier
  type: ContemporaryDerivation
  derived from: http://data.ga-group.nl/ics/bics/2014/101013101211
  derived from: http://data.ga-group.nl/ics/bics/2020/101013101211
  derived from: http://data.ga-group.nl/ics/bics/2024/101013101211
  source accessed on: 2019-12-03T20:05:01Z
  source last accessed on: 2024-06-05T14:42:36Z
  definition: This segment includes revenue that periodical publishers generate from circulation.
  notation: 101013101211
  valid from: 2014-08-08
source accessed on: 2019-12-03T20:05:01Z
source last accessed on: 2024-06-05T14:42:36Z
definition: This segment includes revenue that periodical publishers generate from circulation.
notation: 101013101211
valid from: 2014-08-08

Other Revenue - Periodical
type: BicsLevel6Segment
type: Classifier
type: NamedIndividual
is level6 segment of: Periodical Publishers
created with: infer-bics.sql
derived from: Other Revenue - Periodical
  type: BicsLevel6Segment
  type: Classifier
  type: ContemporaryDerivation
  derived from: http://data.ga-group.nl/ics/bics/2014/101013101212
  derived from: http://data.ga-group.nl/ics/bics/2020/101013101212
  derived from: http://data.ga-group.nl/ics/bics/2024/101013101212
  source accessed on: 2019-12-03T20:05:01Z
  source last accessed on: 2024-06-05T14:42:36Z
  definition: This segment includes revenue that periodical publishers generate from sources other than advertising and circulation.
  notation: 101013101212
  valid from: 2014-08-08
source accessed on: 2019-12-03T20:05:01Z
source last accessed on: 2024-06-05T14:42:36Z
definition: This segment includes revenue that periodical publishers generate from sources other than advertising and circulation.
notation: 101013101212
valid from: 2014-08-08

Periodical Publishers
type: BicsLevel5Segment
type: Classifier
type: NamedIndividual
is level5 segment of: Publishing
created with: infer-bics.sql
derived from: Periodical Publishers
  type: BicsLevel5Segment
  type: Classifier
  type: ContemporaryDerivation
  derived from: http://data.ga-group.nl/ics/bics/2014/1010131012
  source accessed on: 2019-12-03T20:05:01Z
  source last accessed on: 2019-12-03T20:05:01Z
  definition: This segment includes companies that produce and distribute magazines as well as other periodicals. These companies gather, write and edit articles.
  notation: 1010131012
  valid from: 2014-08-08
  valid till: 2020-10-03
derived from: Periodical Publishers
  type: BicsLevel5Segment
  type: Classifier
  type: ContemporaryDerivation
  derived from: http://data.ga-group.nl/ics/bics/2020/1010131012
  derived from: http://data.ga-group.nl/ics/bics/2024/1010131012
  source accessed on: 2023-07-03T18:11:29Z
  source last accessed on: 2024-06-05T14:42:36Z
  definition: This segment includes companies that produce and distribute magazines and other periodicals.
  notation: 1010131012
  valid from: 2020-10-03
source accessed on: 2019-12-03T20:05:01Z
source last accessed on: 2024-06-05T14:42:36Z
definition: This segment includes companies that produce and distribute magazines and other periodicals.
notation: 1010131012
valid from: 2014-08-08

Publishing
type: BicsLevel4SubIndustry
type: Classifier
type: NamedIndividual
created with: infer-bics.sql
derived from: Publishing
  type: BicsLevel4SubIndustry
  type: Classifier
  type: ContemporaryDerivation
  derived from: http://data.ga-group.nl/ics/bics/2014/10101310
  source accessed on: 2019-12-03T20:05:01Z
  source last accessed on: 2019-12-03T20:05:01Z
  definition: This industry subgroup includes companies that produce and distribute printed media content such as newspapers, periodicals and books.
  notation: 10101310
  valid from: 2014-08-08
  valid till: 2020-10-03
derived from: Publishing
  type: BicsLevel4SubIndustry
  type: Classifier
  type: ContemporaryDerivation
  derived from: http://data.ga-group.nl/ics/bics/2020/10101310
  derived from: http://data.ga-group.nl/ics/bics/2024/10101310
  source accessed on: 2023-07-03T18:11:29Z
  source last accessed on: 2024-06-05T14:42:36Z
  definition: This industry subgroup includes companies that produce and distribute printed media content such as newspapers, periodicals, and books.
  notation: 10101310
  valid from: 2020-10-03
source accessed on: 2019-12-03T20:05:01Z
source last accessed on: 2024-06-05T14:42:36Z
definition: This industry subgroup includes companies that produce and distribute printed media content such as newspapers, periodicals, and books.
notation: 10101310
valid from: 2014-08-08

Adv Rev - Local TV Broadcast
type: BicsLevel6Segment
type: Classifier
type: NamedIndividual
is level6 segment of: Local TV Broadcasting
created with: infer-bics.sql
derived from: Adv Rev - Local TV Broadcast
  type: BicsLevel6Segment
  type: Classifier
  type: ContemporaryDerivation
  derived from: http://data.ga-group.nl/ics/bics/2014/101013111010
  derived from: http://data.ga-group.nl/ics/bics/2020/101013111010
  derived from: http://data.ga-group.nl/ics/bics/2024/101013111010
  source accessed on: 2019-12-03T20:05:01Z
  source last accessed on: 2024-06-05T14:42:36Z
  definition: This segment includes revenue that television broadcasters generate from advertising.
  notation: 101013111010
  valid from: 2014-08-08
source accessed on: 2019-12-03T20:05:01Z
source last accessed on: 2024-06-05T14:42:36Z
definition: This segment includes revenue that television broadcasters generate from advertising.
notation: 101013111010
valid from: 2014-08-08

Other Rev - Local TV Broadcast
type: BicsLevel6Segment
type: Classifier
type: NamedIndividual
is level6 segment of: Local TV Broadcasting
created with: infer-bics.sql
derived from: Other Rev - Local TV Broadcast
  type: BicsLevel6Segment
  type: Classifier
  type: ContemporaryDerivation
  derived from: http://data.ga-group.nl/ics/bics/2014/101013111011
  derived from: http://data.ga-group.nl/ics/bics/2020/101013111011
  derived from: http://data.ga-group.nl/ics/bics/2024/101013111011
  source accessed on: 2019-12-03T20:05:01Z
  source last accessed on: 2024-06-05T14:42:36Z
  definition: This segment includes revenue that television broadcasters generate from sources other than advertising.
  notation: 101013111011
  valid from: 2014-08-08
source accessed on: 2019-12-03T20:05:01Z
source last accessed on: 2024-06-05T14:42:36Z
definition: This segment includes revenue that television broadcasters generate from sources other than advertising.
notation: 101013111011
valid from: 2014-08-08

Local TV Broadcasting
type: BicsLevel5Segment
type: Classifier
type: NamedIndividual
is level5 segment of: Local TV & Radio Broadcast
created with: infer-bics.sql
derived from: Local TV Broadcasting
  type: BicsLevel5Segment
  type: Classifier
  type: ContemporaryDerivation
  derived from: http://data.ga-group.nl/ics/bics/2014/1010131110
  source accessed on: 2019-12-03T20:05:01Z
  source last accessed on: 2019-12-03T20:05:01Z
  definition: This segment includes companies that operate broadcasting studios, stations and facilities for the transmission of television programming over public airwaves. Such programming may originate in their own studio, from an affiliated network or from external sources.
  notation: 1010131110
  valid from: 2014-08-08
  valid till: 2020-10-03
derived from: Local TV Broadcasting
  type: BicsLevel5Segment
  type: Classifier
  type: ContemporaryDerivation
  derived from: http://data.ga-group.nl/ics/bics/2020/1010131110
  derived from: http://data.ga-group.nl/ics/bics/2024/1010131110
  source accessed on: 2023-07-03T18:11:29Z
  source last accessed on: 2024-06-05T14:42:36Z
  definition: This segment includes companies that operate broadcasting studios, stations, and facilities for the transmission of local television programming over public airwaves. Such programming may originate in their own studio, from an affiliated network, or from external sources.
  notation: 1010131110
  valid from: 2020-10-03
source accessed on: 2019-12-03T20:05:01Z
source last accessed on: 2024-06-05T14:42:36Z
definition: This segment includes companies that operate broadcasting studios, stations, and facilities for the transmission of local television programming over public airwaves. Such programming may originate in their own studio, from an affiliated network, or from external sources.
notation: 1010131110
valid from: 2014-08-08

Adv Revenue - Radio Networks
type: BicsLevel7Segment
type: Classifier
type: NamedIndividual
is level7 segment of: Radio Networks
created with: infer-bics.sql
derived from: Adv Revenue - Radio Networks
  type: BicsLevel7Segment
  type: Classifier
  type: ContemporaryDerivation
  derived from: http://data.ga-group.nl/ics/bics/2014/10101311111010
  source accessed on: 2019-12-03T20:05:01Z
  source last accessed on: 2019-12-03T20:05:01Z
  definition: This segment includes revenue that radio networks generate from advertising.
  notation: 10101311111010
  valid from: 2014-08-08
  valid till: 2020-10-03
source accessed on: 2019-12-03T20:05:01Z
source last accessed on: 2019-12-03T20:05:01Z
definition: This segment includes revenue that radio networks generate from advertising.
notation: 10101311111010
valid from: 2014-08-08
valid till: 2020-10-03

Other Rev - Radio Networks
type: BicsLevel7Segment
type: Classifier
type: NamedIndividual
is level7 segment of: Radio Networks
created with: infer-bics.sql
derived from: Other Rev - Radio Networks
  type: BicsLevel7Segment
  type: Classifier
  type: ContemporaryDerivation
  derived from: http://data.ga-group.nl/ics/bics/2014/10101311111011
  source accessed on: 2019-12-03T20:05:01Z
  source last accessed on: 2019-12-03T20:05:01Z
  definition: This segment includes revenue that radio networks generate from sources other than advertising, such as revenue generated from selling programs to radio stations.
  notation: 10101311111011
  valid from: 2014-08-08
  valid till: 2020-10-03
source accessed on: 2019-12-03T20:05:01Z
source last accessed on: 2019-12-03T20:05:01Z
definition: This segment includes revenue that radio networks generate from sources other than advertising, such as revenue generated from selling programs to radio stations.
notation: 10101311111011
valid from: 2014-08-08
valid till: 2020-10-03

Radio Networks
type: BicsLevel6Segment
type: Classifier
type: NamedIndividual
is level6 segment of: Radio Broadcasting
created with: infer-bics.sql
derived from: Radio Networks
  type: BicsLevel6Segment
  type: Classifier
  type: ContemporaryDerivation
  derived from: http://data.ga-group.nl/ics/bics/2014/101013111110
  source accessed on: 2019-12-03T20:05:01Z
  source last accessed on: 2019-12-03T20:05:01Z
  definition: This segment includes companies that distribute programming to multiple stations simultaneously or slightly delayed, to extend total coverage beyond the limits of a single broadcast signal. A radio network has two sales departments, one to package and sell programs to radio stations, and one to sell the audience of those programs to advertisers.
  notation: 101013111110
  valid from: 2014-08-08
  valid till: 2020-10-03
derived from: Radio Networks
  type: BicsLevel6Segment
  type: Classifier
  type: ContemporaryDerivation
  derived from: http://data.ga-group.nl/ics/bics/2020/101013111110
  derived from: http://data.ga-group.nl/ics/bics/2024/101013111110
  source accessed on: 2023-07-03T18:11:29Z
  source last accessed on: 2024-06-05T14:42:36Z
  definition: This segment includes companies that distribute programming to multiple stations simultaneously or slightly delayed, to extend total coverage beyond the limits of a single broadcast signal.
  notation: 101013111110
  valid from: 2020-10-03
source accessed on: 2019-12-03T20:05:01Z
source last accessed on: 2024-06-05T14:42:36Z
definition: This segment includes companies that distribute programming to multiple stations simultaneously or slightly delayed, to extend total coverage beyond the limits of a single broadcast signal.
notation: 101013111110
valid from: 2014-08-08

Adv Revenue - Radio Stations
type: BicsLevel7Segment
type: Classifier
type: NamedIndividual
is level7 segment of: Radio Stations
created with: infer-bics.sql
derived from: Adv Revenue - Radio Stations
  type: BicsLevel7Segment
  type: Classifier
  type: ContemporaryDerivation
  derived from: http://data.ga-group.nl/ics/bics/2014/10101311111110
  source accessed on: 2019-12-03T20:05:01Z
  source last accessed on: 2019-12-03T20:05:01Z
  definition: This segment includes revenue that radio stations generate from advertising.
  notation: 10101311111110
  valid from: 2014-08-08
  valid till: 2020-10-03
source accessed on: 2019-12-03T20:05:01Z
source last accessed on: 2019-12-03T20:05:01Z
definition: This segment includes revenue that radio stations generate from advertising.
notation: 10101311111110
valid from: 2014-08-08
valid till: 2020-10-03

Other Rev - Radio Stations
type: BicsLevel7Segment
type: Classifier
type: NamedIndividual
is level7 segment of: Radio Stations
created with: infer-bics.sql
derived from: Other Rev - Radio Stations
  type: BicsLevel7Segment
  type: Classifier
  type: ContemporaryDerivation
  derived from: http://data.ga-group.nl/ics/bics/2014/10101311111111
  source accessed on: 2019-12-03T20:05:01Z
  source last accessed on: 2019-12-03T20:05:01Z
  definition: This segment includes revenue that radio stations generate from sources other than advertising.
  notation: 10101311111111
  valid from: 2014-08-08
  valid till: 2020-10-03
source accessed on: 2019-12-03T20:05:01Z
source last accessed on: 2019-12-03T20:05:01Z
definition: This segment includes revenue that radio stations generate from sources other than advertising.
notation: 10101311111111
valid from: 2014-08-08
valid till: 2020-10-03

Radio Stations
type: BicsLevel6Segment
type: Classifier
type: NamedIndividual
is level6 segment of: Radio Broadcasting
created with: infer-bics.sql
derived from: Radio Stations
  type: BicsLevel6Segment
  type: Classifier
  type: ContemporaryDerivation
  derived from: http://data.ga-group.nl/ics/bics/2014/101013111111
  source accessed on: 2019-12-03T20:05:01Z
  source last accessed on: 2019-12-03T20:05:01Z
  definition: This segment includes companies that operate broadcasting studios, stations and facilities for the transmission of radio programming over public airwaves. Such programming may originate in their own studio, from an affiliated network or from external sources.
  notation: 101013111111
  valid from: 2014-08-08
  valid till: 2020-10-03
derived from: Radio Stations
  type: BicsLevel6Segment
  type: Classifier
  type: ContemporaryDerivation
  derived from: http://data.ga-group.nl/ics/bics/2020/101013111111
  derived from: http://data.ga-group.nl/ics/bics/2024/101013111111
  source accessed on: 2023-07-03T18:11:29Z
  source last accessed on: 2024-06-05T14:42:36Z
  definition: This segment includes companies that operate broadcasting studios, stations, and facilities for the transmission of radio programming over public airwaves. Such programming may originate in their own studio, from an affiliated network or from external sources.
  notation: 101013111111
  valid from: 2020-10-03
source accessed on: 2019-12-03T20:05:01Z
source last accessed on: 2024-06-05T14:42:36Z
definition: This segment includes companies that operate broadcasting studios, stations, and facilities for the transmission of radio programming over public airwaves. Such programming may originate in their own studio, from an affiliated network or from external sources.
notation: 101013111111
valid from: 2014-08-08

Radio Broadcasting
type: BicsLevel5Segment
type: Classifier
type: NamedIndividual
is level5 segment of: Local TV & Radio Broadcast
created with: infer-bics.sql
derived from: Radio Broadcasting
  type: BicsLevel5Segment
  type: Classifier
  type: ContemporaryDerivation
  derived from: http://data.ga-group.nl/ics/bics/2014/1010131111
  source accessed on: 2019-12-03T20:05:01Z
  source last accessed on: 2019-12-03T20:05:01Z
  definition: This segment includes companies that produce, acquire, distribute or broadcast radio programming.
  notation: 1010131111
  valid from: 2014-08-08
  valid till: 2020-10-03
derived from: Radio Broadcasting
  type: BicsLevel5Segment
  type: Classifier
  type: ContemporaryDerivation
  derived from: http://data.ga-group.nl/ics/bics/2020/1010131111
  derived from: http://data.ga-group.nl/ics/bics/2024/1010131111
  source accessed on: 2023-07-03T18:11:29Z
  source last accessed on: 2024-06-05T14:42:36Z
  definition: This segment includes companies that produce, acquire, distribute, or broadcast radio programming. Excludes satellite radio (see "Cable & Satellite").
  notation: 1010131111
  valid from: 2020-10-03
source accessed on: 2019-12-03T20:05:01Z
source last accessed on: 2024-06-05T14:42:36Z
definition: This segment includes companies that produce, acquire, distribute, or broadcast radio programming. Excludes satellite radio (see "Cable & Satellite").
notation: 1010131111
valid from: 2014-08-08

Local TV & Radio Broadcast
type: BicsLevel4SubIndustry
type: Classifier
type: NamedIndividual
created with: infer-bics.sql
derived from: Local TV & Radio Broadcast
  type: BicsLevel4SubIndustry
  type: Classifier
  type: ContemporaryDerivation
  derived from: http://data.ga-group.nl/ics/bics/2014/10101311
  source accessed on: 2019-12-03T20:05:01Z
  source last accessed on: 2019-12-03T20:05:01Z
  definition: This industry subgroup includes companies that provide television and radio broadcasting.
  notation: 10101311
  valid from: 2014-08-08
  valid till: 2020-10-03
derived from: Local TV & Radio Broadcast
  type: BicsLevel4SubIndustry
  type: Classifier
  type: ContemporaryDerivation
  derived from: http://data.ga-group.nl/ics/bics/2020/10101311
  derived from: http://data.ga-group.nl/ics/bics/2024/10101311
  source accessed on: 2023-07-03T18:11:29Z
  source last accessed on: 2024-06-05T14:42:36Z
  definition: This industry subgroup includes companies that provide television and radio broadcasting typically via public airwaves
  notation: 10101311
  valid from: 2020-10-03
source accessed on: 2019-12-03T20:05:01Z
source last accessed on: 2024-06-05T14:42:36Z
definition: This industry subgroup includes companies that provide television and radio broadcasting typically via public airwaves
notation: 10101311
valid from: 2014-08-08

Out-of-Home Display Advertising
type: BicsLevel4SubIndustry
type: Classifier
type: NamedIndividual
created with: infer-bics.sql
derived from: Out-of-Home Display Advertising
  type: BicsLevel4SubIndustry
  type: Classifier
  type: ContemporaryDerivation
  derived from: http://data.ga-group.nl/ics/bics/2014/10101312
  source accessed on: 2019-12-03T20:05:01Z
  source last accessed on: 2019-12-03T20:05:01Z
  definition: This industry subgroup includes companies that own and operate public display advertising, such as billboards, shopping mall and retail displays, bus advertisements and other public displays.
  notation: 10101312
  valid from: 2014-08-08
  valid till: 2020-10-03
derived from: Out-of-Home Display Advertising
  type: BicsLevel4SubIndustry
  type: Classifier
  type: ContemporaryDerivation
  derived from: http://data.ga-group.nl/ics/bics/2020/10101312
  derived from: http://data.ga-group.nl/ics/bics/2024/10101312
  source accessed on: 2023-07-03T18:11:29Z
  source last accessed on: 2024-06-05T14:42:36Z
  definition: This industry subgroup includes companies that own and operate public display advertising, such as billboards, shopping mall and retail displays, bus advertisements, and other public displays.
  notation: 10101312
  valid from: 2020-10-03
source accessed on: 2019-12-03T20:05:01Z
source last accessed on: 2024-06-05T14:42:36Z
definition: This industry subgroup includes companies that own and operate public display advertising, such as billboards, shopping mall and retail displays, bus advertisements, and other public displays.
notation: 10101312
valid from: 2014-08-08

Publishing & Broadcasting
type: BicsLevel3Industry
type: Classifier
type: NamedIndividual
is industry of: Media
created with: infer-bics.sql
derived from: Publishing & Broadcasting
  type: BicsLevel3Industry
  type: Classifier
  type: ContemporaryDerivation
  derived from: http://data.ga-group.nl/ics/bics/2014/101013
  source accessed on: 2019-12-03T20:05:01Z
  source last accessed on: 2019-12-03T20:05:01Z
  definition: This industry includes companies that publish books, newspapers and periodicals. It also includes UHF broadcast television and radio broadcast stations and networks.
  notation: 101013
  valid from: 2014-08-08
  valid till: 2020-10-03
derived from: Publishing & Broadcasting
  type: BicsLevel3Industry
  type: Classifier
  type: ContemporaryDerivation
  derived from: http://data.ga-group.nl/ics/bics/2020/101013
  source accessed on: 2023-07-03T18:11:29Z
  source last accessed on: 2023-07-03T18:11:29Z
  definition: This industry includes companies that publish books, newspapers and periodicals, television and radio stations, and networks broadcast via antennas.
  notation: 101013
  valid from: 2020-10-03
  valid till: 2024-06-07
derived from: Publishing & Broadcasting
  type: BicsLevel3Industry
  type: Classifier
  type: ContemporaryDerivation
  derived from: http://data.ga-group.nl/ics/bics/2024/101013
  source accessed on: 2024-06-05T14:42:36Z
  source last accessed on: 2024-06-05T14:42:36Z
  definition: This industry includes companies that publish books, newspapers, and periodicals, television and radio stations, and networks broadcast via antennas.
  notation: 101013
  valid from: 2024-06-07
source accessed on: 2019-12-03T20:05:01Z
source last accessed on: 2024-06-05T14:42:36Z
definition: This industry includes companies that publish books, newspapers, and periodicals, television and radio stations, and networks broadcast via antennas.
notation: 101013
valid from: 2014-08-08

Adv Rev - Automotive Web
type: BicsLevel6Segment
type: Classifier
type: NamedIndividual
is level6 segment of: Automotive Web
replaces: Automotive Web
created with: infer-bics.sql
derived from: Adv Rev - Automotive Web
  type: BicsLevel5Segment
  type: Classifier
  type: AnachronousDerivation
  derived from: http://data.ga-group.nl/ics/bics/2014/1010141010
  source accessed on: 2019-12-03T20:05:01Z
  source last accessed on: 2019-12-03T20:05:01Z
  definition: This segment includes revenue that the automotive websites generate from advertising.
  notation: 1010141010
  valid from: 2014-08-08
  valid till: 2020-10-03
derived from: Adv Rev - Automotive Web
  type: BicsLevel6Segment
  type: Classifier
  type: ContemporaryDerivation
  derived from: http://data.ga-group.nl/ics/bics/2020/101014101010
  derived from: http://data.ga-group.nl/ics/bics/2024/101014101010
  source accessed on: 2023-07-03T18:11:29Z
  source last accessed on: 2024-06-05T14:42:36Z
  definition: This segment includes revenue that automotive websites generate from advertising.
  notation: 101014101010
  valid from: 2020-10-03
source accessed on: 2023-07-03T18:11:29Z
source last accessed on: 2024-06-05T14:42:36Z
definition: This segment includes revenue that automotive websites generate from advertising.
notation: 101014101010
valid from: 2020-10-03

Other Rev - Automotive Web
type: BicsLevel6Segment
type: Classifier
type: NamedIndividual
is level6 segment of: Automotive Web
replaces: Dating Services Web
created with: infer-bics.sql
derived from: Other Rev - Automotive Web
  type: BicsLevel5Segment
  type: Classifier
  type: AnachronousDerivation
  derived from: http://data.ga-group.nl/ics/bics/2014/1010141011
  source accessed on: 2019-12-03T20:05:01Z
  source last accessed on: 2019-12-03T20:05:01Z
  definition: This segment includes revenue that the automotive websites generate from other than advertising.
  notation: 1010141011
  valid from: 2014-08-08
  valid till: 2020-10-03
derived from: Other Rev - Automotive Web
  type: BicsLevel6Segment
  type: Classifier
  type: ContemporaryDerivation
  derived from: http://data.ga-group.nl/ics/bics/2020/101014101011
  derived from: http://data.ga-group.nl/ics/bics/2024/101014101011
  source accessed on: 2023-07-03T18:11:29Z
  source last accessed on: 2024-06-05T14:42:36Z
  definition: This segment includes revenue that automotive websites generate from sources other than advertising.
  notation: 101014101011
  valid from: 2020-10-03
source accessed on: 2023-07-03T18:11:29Z
source last accessed on: 2024-06-05T14:42:36Z
definition: This segment includes revenue that automotive websites generate from sources other than advertising.
notation: 101014101011
valid from: 2020-10-03

Automotive Web
type: BicsLevel5Segment
type: Classifier
type: NamedIndividual
is level5 segment of: Internet Media & Services
is replaced by: Adv Rev - Automotive Web
created with: infer-bics.sql
derived from: Automotive Web
  type: BicsLevel4SubIndustry
  type: Classifier
  type: AnachronousDerivation
  derived from: http://data.ga-group.nl/ics/bics/2014/10101410
  source accessed on: 2019-12-03T20:05:01Z
  source last accessed on: 2019-12-03T20:05:01Z
  definition: This industry subgroup includes companies that provide automotive information and classified listings online.
  notation: 10101410
  valid from: 2014-08-08
  valid till: 2020-10-03
derived from: Adv Rev - Automotive Web
  type: BicsLevel5Segment
  type: Classifier
  type: ContemporaryDerivation
  derived from: http://data.ga-group.nl/ics/bics/2014/1010141010
  source accessed on: 2019-12-03T20:05:01Z
  source last accessed on: 2019-12-03T20:05:01Z
  definition: This segment includes revenue that the automotive websites generate from advertising.
  notation: 1010141010
  valid from: 2014-08-08
  valid till: 2020-10-03
derived from: Automotive Web
  type: BicsLevel5Segment
  type: Classifier
  type: ContemporaryDerivation
  derived from: http://data.ga-group.nl/ics/bics/2020/1010141010
  derived from: http://data.ga-group.nl/ics/bics/2024/1010141010
  source accessed on: 2023-07-03T18:11:29Z
  source last accessed on: 2024-06-05T14:42:36Z
  definition: This segment includes companies that provide automotive information and classified listings online.
  notation: 1010141010
  valid from: 2020-10-03
source accessed on: 2019-12-03T20:05:01Z
source last accessed on: 2024-06-05T14:42:36Z
definition: This segment includes companies that provide automotive information and classified listings online.
notation: 1010141010
valid from: 2014-08-08

Adv Rev - Dating Services Web
type: BicsLevel6Segment
type: Classifier
type: NamedIndividual
is level6 segment of: Dating Services Web
replaces: Adv Rev - Dating Services Web
created with: infer-bics.sql
derived from: Adv Rev - Dating Services Web
  type: BicsLevel5Segment
  type: Classifier
  type: AnachronousDerivation
  derived from: http://data.ga-group.nl/ics/bics/2014/1010141110
  source accessed on: 2019-12-03T20:05:01Z
  source last accessed on: 2019-12-03T20:05:01Z
  definition: This segment includes revenue that online dating services generate from advertising.
  notation: 1010141110
  valid from: 2014-08-08
  valid till: 2020-10-03
derived from: Adv Rev - Dating Services Web
  type: BicsLevel6Segment
  type: Classifier
  type: ContemporaryDerivation
  derived from: http://data.ga-group.nl/ics/bics/2020/101014101110
  derived from: http://data.ga-group.nl/ics/bics/2024/101014101110
  source accessed on: 2023-07-03T18:11:29Z
  source last accessed on: 2024-06-05T14:42:36Z
  definition: This segment includes revenue that online dating services generate from advertising.
  notation: 101014101110
  valid from: 2020-10-03
source accessed on: 2023-07-03T18:11:29Z
source last accessed on: 2024-06-05T14:42:36Z
definition: This segment includes revenue that online dating services generate from advertising.
notation: 101014101110
valid from: 2020-10-03

Other Rev - Dating Svcs Web
type: BicsLevel6Segment
type: Classifier
type: NamedIndividual
is level6 segment of: Dating Services Web
replaces: Other Rev - Dating Svcs Web
created with: infer-bics.sql
derived from: Other Rev - Dating Svcs Web
  type: BicsLevel5Segment
  type: Classifier
  type: AnachronousDerivation
  derived from: http://data.ga-group.nl/ics/bics/2014/1010141111
  source accessed on: 2019-12-03T20:05:01Z
  source last accessed on: 2019-12-03T20:05:01Z
  definition: This segment includes revenue that online dating services generate from sources other than advertising.
  notation: 1010141111
  valid from: 2014-08-08
  valid till: 2020-10-03
derived from: Other Rev - Dating Svcs Web
  type: BicsLevel6Segment
  type: Classifier
  type: ContemporaryDerivation
  derived from: http://data.ga-group.nl/ics/bics/2020/101014101111
  derived from: http://data.ga-group.nl/ics/bics/2024/101014101111
  source accessed on: 2023-07-03T18:11:29Z
  source last accessed on: 2024-06-05T14:42:36Z
  definition: This segment includes revenue that online dating services generate from sources other than advertising.
  notation: 101014101111
  valid from: 2020-10-03
source accessed on: 2023-07-03T18:11:29Z
source last accessed on: 2024-06-05T14:42:36Z
definition: This segment includes revenue that online dating services generate from sources other than advertising.
notation: 101014101111
valid from: 2020-10-03

Dating Services Web
type: BicsLevel5Segment
type: Classifier
type: NamedIndividual
is level5 segment of: Internet Media & Services
is replaced by: Other Rev - Automotive Web
created with: infer-bics.sql
derived from: Other Rev - Automotive Web
  type: BicsLevel5Segment
  type: Classifier
  type: ContemporaryDerivation
  derived from: http://data.ga-group.nl/ics/bics/2014/1010141011
  source accessed on: 2019-12-03T20:05:01Z
  source last accessed on: 2019-12-03T20:05:01Z
  definition: This segment includes revenue that the automotive websites generate from other than advertising.
  notation: 1010141011
  valid from: 2014-08-08
  valid till: 2020-10-03
derived from: Dating Services Web
  type: BicsLevel4SubIndustry
  type: Classifier
  type: AnachronousDerivation
  derived from: http://data.ga-group.nl/ics/bics/2014/10101411
  source accessed on: 2019-12-03T20:05:01Z
  source last accessed on: 2019-12-03T20:05:01Z
  definition: This industry subgroup includes companies that offer dating services and other matchmaking services online.
  notation: 10101411
  valid from: 2014-08-08
  valid till: 2020-10-03
derived from: Dating Services Web
  type: BicsLevel5Segment
  type: Classifier
  type: ContemporaryDerivation
  derived from: http://data.ga-group.nl/ics/bics/2020/1010141011
  derived from: http://data.ga-group.nl/ics/bics/2024/1010141011
  source accessed on: 2023-07-03T18:11:29Z
  source last accessed on: 2024-06-05T14:42:36Z
  definition: This segment includes companies that offer dating services and other matchmaking services online.
  notation: 1010141011
  valid from: 2020-10-03
source accessed on: 2019-12-03T20:05:01Z
source last accessed on: 2024-06-05T14:42:36Z
definition: This segment includes companies that offer dating services and other matchmaking services online.
notation: 1010141011
valid from: 2014-08-08

Adv Rev - Domain Registrar
type: BicsLevel6Segment
type: Classifier
type: NamedIndividual
is level6 segment of: Domain Registrar
replaces: Adv Rev - Domain Registrar
created with: infer-bics.sql
derived from: Adv Rev - Domain Registrar
  type: BicsLevel5Segment
  type: Classifier
  type: AnachronousDerivation
  derived from: http://data.ga-group.nl/ics/bics/2014/1010141210
  source accessed on: 2019-12-03T20:05:01Z
  source last accessed on: 2019-12-03T20:05:01Z
  definition: This segment includes revenue that domain registrars generate from advertising on their websites.
  notation: 1010141210
  valid from: 2014-08-08
  valid till: 2020-10-03
derived from: Adv Rev - Domain Registrar
  type: BicsLevel6Segment
  type: Classifier
  type: ContemporaryDerivation
  derived from: http://data.ga-group.nl/ics/bics/2020/101014101210
  derived from: http://data.ga-group.nl/ics/bics/2024/101014101210
  source accessed on: 2023-07-03T18:11:29Z
  source last accessed on: 2024-06-05T14:42:36Z
  definition: This segment includes revenue that domain registrars generate from advertising.
  notation: 101014101210
  valid from: 2020-10-03
source accessed on: 2023-07-03T18:11:29Z
source last accessed on: 2024-06-05T14:42:36Z
definition: This segment includes revenue that domain registrars generate from advertising.
notation: 101014101210
valid from: 2020-10-03

Other Rev - Domain Registrar
type: BicsLevel6Segment
type: Classifier
type: NamedIndividual
is level6 segment of: Domain Registrar
replaces: Other Rev - Domain Registrar
created with: infer-bics.sql
derived from: Other Rev - Domain Registrar
  type: BicsLevel5Segment
  type: Classifier
  type: AnachronousDerivation
  derived from: http://data.ga-group.nl/ics/bics/2014/1010141211
  source accessed on: 2019-12-03T20:05:01Z
  source last accessed on: 2019-12-03T20:05:01Z
  definition: This segment includes revenue that domain registrars generate from sources other than advertising.
  notation: 1010141211
  valid from: 2014-08-08
  valid till: 2020-10-03
derived from: Other Rev - Domain Registrar
  type: BicsLevel6Segment
  type: Classifier
  type: ContemporaryDerivation
  derived from: http://data.ga-group.nl/ics/bics/2020/101014101211
  derived from: http://data.ga-group.nl/ics/bics/2024/101014101211
  source accessed on: 2023-07-03T18:11:29Z
  source last accessed on: 2024-06-05T14:42:36Z
  definition: This segment includes revenue that domain registrars generate from sources other than advertising.
  notation: 101014101211
  valid from: 2020-10-03
source accessed on: 2023-07-03T18:11:29Z
source last accessed on: 2024-06-05T14:42:36Z
definition: This segment includes revenue that domain registrars generate from sources other than advertising.
notation: 101014101211
valid from: 2020-10-03

Domain Registrar
type: BicsLevel5Segment
type: Classifier
type: NamedIndividual
is level5 segment of: Internet Media & Services
created with: infer-bics.sql
derived from: Domain Registrar
  type: BicsLevel4SubIndustry
  type: Classifier
  type: AnachronousDerivation
  derived from: http://data.ga-group.nl/ics/bics/2014/10101412
  source accessed on: 2019-12-03T20:05:01Z
  source last accessed on: 2019-12-03T20:05:01Z
  definition: This industry subgroup includes companies that primarily register Internet domain names.
  notation: 10101412
  valid from: 2014-08-08
  valid till: 2020-10-03
derived from: Domain Registrar
  type: BicsLevel5Segment
  type: Classifier
  type: ContemporaryDerivation
  derived from: http://data.ga-group.nl/ics/bics/2020/1010141012
  derived from: http://data.ga-group.nl/ics/bics/2024/1010141012
  source accessed on: 2023-07-03T18:11:29Z
  source last accessed on: 2024-06-05T14:42:36Z
  definition: This segment includes companies that primarily register Internet domain names.
  notation: 1010141012
  valid from: 2020-10-03
source accessed on: 2023-07-03T18:11:29Z
source last accessed on: 2024-06-05T14:42:36Z
definition: This segment includes companies that primarily register Internet domain names.
notation: 1010141012
valid from: 2020-10-03

Adv Rev-Entmt Evt Ticket Online
type: BicsLevel6Segment
type: Classifier
type: NamedIndividual
is level6 segment of: Entmt Event Ticket Online
replaces: Adv Rev-Entmt Evt Ticket Online
created with: infer-bics.sql
derived from: Adv Rev-Entmt Evt Ticket Online
  type: BicsLevel5Segment
  type: Classifier
  type: AnachronousDerivation
  derived from: http://data.ga-group.nl/ics/bics/2014/1010141310
  source accessed on: 2019-12-03T20:05:01Z
  source last accessed on: 2019-12-03T20:05:01Z
  definition: This segment includes revenue that entertainment event ticket sales websites generate from advertising.
  notation: 1010141310
  valid from: 2014-08-08
  valid till: 2020-10-03
derived from: Adv Rev-Entmt Evt Ticket Online
  type: BicsLevel6Segment
  type: Classifier
  type: ContemporaryDerivation
  derived from: http://data.ga-group.nl/ics/bics/2020/101014101310
  derived from: http://data.ga-group.nl/ics/bics/2024/101014101310
  source accessed on: 2023-07-03T18:11:29Z
  source last accessed on: 2024-06-05T14:42:36Z
  definition: This segment includes revenue that entertainment event ticket sales websites generate from advertising.
  notation: 101014101310
  valid from: 2020-10-03
source accessed on: 2023-07-03T18:11:29Z
source last accessed on: 2024-06-05T14:42:36Z
definition: This segment includes revenue that entertainment event ticket sales websites generate from advertising.
notation: 101014101310
valid from: 2020-10-03

Other-Entmt Evt Ticket Online
type: BicsLevel6Segment
type: Classifier
type: NamedIndividual
is level6 segment of: Entmt Event Ticket Online
replaces: Other-Entmt Evt Ticket Online
created with: infer-bics.sql
derived from: Other-Entmt Evt Ticket Online
  type: BicsLevel5Segment
  type: Classifier
  type: AnachronousDerivation
  derived from: http://data.ga-group.nl/ics/bics/2014/1010141311
  source accessed on: 2019-12-03T20:05:01Z
  source last accessed on: 2019-12-03T20:05:01Z
  definition: This segment includes revenue that entertainment event ticket sales websites generate from sources other than advertising.
  notation: 1010141311
  valid from: 2014-08-08
  valid till: 2020-10-03
derived from: Other-Entmt Evt Ticket Online
  type: BicsLevel6Segment
  type: Classifier
  type: ContemporaryDerivation
  derived from: http://data.ga-group.nl/ics/bics/2020/101014101311
  derived from: http://data.ga-group.nl/ics/bics/2024/101014101311
  source accessed on: 2023-07-03T18:11:29Z
  source last accessed on: 2024-06-05T14:42:36Z
  definition: This segment includes revenue that entertainment event ticket sales websites generate from sources other than advertising.
  notation: 101014101311
  valid from: 2020-10-03
source accessed on: 2023-07-03T18:11:29Z
source last accessed on: 2024-06-05T14:42:36Z
definition: This segment includes revenue that entertainment event ticket sales websites generate from sources other than advertising.
notation: 101014101311
valid from: 2020-10-03

Entmt Event Ticket Online
type: BicsLevel5Segment
type: Classifier
type: NamedIndividual
is level5 segment of: Internet Media & Services
created with: infer-bics.sql
derived from: Entmt Event Ticket Online
  type: BicsLevel4SubIndustry
  type: Classifier
  type: AnachronousDerivation
  derived from: http://data.ga-group.nl/ics/bics/2014/10101413
  source accessed on: 2019-12-03T20:05:01Z
  source last accessed on: 2019-12-03T20:05:01Z
  definition: This industry subgroup includes companies that retail tickets online for entertainment events, such as musical events, sporting events and theatrical shows.
  notation: 10101413
  valid from: 2014-08-08
  valid till: 2020-10-03
derived from: Entmt Event Ticket Online
  type: BicsLevel5Segment
  type: Classifier
  type: ContemporaryDerivation
  derived from: http://data.ga-group.nl/ics/bics/2020/1010141013
  derived from: http://data.ga-group.nl/ics/bics/2024/1010141013
  source accessed on: 2023-07-03T18:11:29Z
  source last accessed on: 2024-06-05T14:42:36Z
  definition: This segment includes companies that retail tickets online for entertainment events, such as musical events, sporting events, and theatrical shows.
  notation: 1010141013
  valid from: 2020-10-03
source accessed on: 2023-07-03T18:11:29Z
source last accessed on: 2024-06-05T14:42:36Z
definition: This segment includes companies that retail tickets online for entertainment events, such as musical events, sporting events, and theatrical shows.
notation: 1010141013
valid from: 2020-10-03

Adv Rev - Photography Web
type: BicsLevel6Segment
type: Classifier
type: NamedIndividual
is level6 segment of: Photography Web
replaces: Adv Rev - Photography Web
created with: infer-bics.sql
derived from: Adv Rev - Photography Web
  type: BicsLevel5Segment
  type: Classifier
  type: AnachronousDerivation
  derived from: http://data.ga-group.nl/ics/bics/2014/1010141410
  source accessed on: 2019-12-03T20:05:01Z
  source last accessed on: 2019-12-03T20:05:01Z
  definition: This segment includes revenue that photo sharing and finishing websites generate from advertising.
  notation: 1010141410
  valid from: 2014-08-08
  valid till: 2020-10-03
derived from: Adv Rev - Photography Web
  type: BicsLevel6Segment
  type: Classifier
  type: ContemporaryDerivation
  derived from: http://data.ga-group.nl/ics/bics/2020/101014101410
  derived from: http://data.ga-group.nl/ics/bics/2024/101014101410
  source accessed on: 2023-07-03T18:11:29Z
  source last accessed on: 2024-06-05T14:42:36Z
  definition: This segment includes revenue that photo sharing and finishing websites generate from advertising.
  notation: 101014101410
  valid from: 2020-10-03
source accessed on: 2023-07-03T18:11:29Z
source last accessed on: 2024-06-05T14:42:36Z
definition: This segment includes revenue that photo sharing and finishing websites generate from advertising.
notation: 101014101410
valid from: 2020-10-03

Other Rev - Photography Web
type: BicsLevel6Segment
type: Classifier
type: NamedIndividual
is level6 segment of: Photography Web
replaces: Other Rev - Photography Web
created with: infer-bics.sql
derived from: Other Rev - Photography Web
  type: BicsLevel5Segment
  type: Classifier
  type: AnachronousDerivation
  derived from: http://data.ga-group.nl/ics/bics/2014/1010141411
  source accessed on: 2019-12-03T20:05:01Z
  source last accessed on: 2019-12-03T20:05:01Z
  definition: This segment includes revenue that photo sharing and finishing websites generate from sources other than advertising.
  notation: 1010141411
  valid from: 2014-08-08
  valid till: 2020-10-03
derived from: Other Rev - Photography Web
  type: BicsLevel6Segment
  type: Classifier
  type: ContemporaryDerivation
  derived from: http://data.ga-group.nl/ics/bics/2020/101014101411
  derived from: http://data.ga-group.nl/ics/bics/2024/101014101411
  source accessed on: 2023-07-03T18:11:29Z
  source last accessed on: 2024-06-05T14:42:36Z
  definition: This segment includes revenue that photo sharing and finishing websites generate from sources other than advertising.
  notation: 101014101411
  valid from: 2020-10-03
source accessed on: 2023-07-03T18:11:29Z
source last accessed on: 2024-06-05T14:42:36Z
definition: This segment includes revenue that photo sharing and finishing websites generate from sources other than advertising.
notation: 101014101411
valid from: 2020-10-03

Photography Web
type: BicsLevel5Segment
type: Classifier
type: NamedIndividual
is level5 segment of: Internet Media & Services
created with: infer-bics.sql
derived from: Photography Web
  type: BicsLevel4SubIndustry
  type: Classifier
  type: AnachronousDerivation
  derived from: http://data.ga-group.nl/ics/bics/2014/10101414
  source accessed on: 2019-12-03T20:05:01Z
  source last accessed on: 2019-12-03T20:05:01Z
  definition: This industry subgroup includes companies that provide photo posting, printing, and collating services online.
  notation: 10101414
  valid from: 2014-08-08
  valid till: 2020-10-03
derived from: Photography Web
  type: BicsLevel5Segment
  type: Classifier
  type: ContemporaryDerivation
  derived from: http://data.ga-group.nl/ics/bics/2020/1010141014
  derived from: http://data.ga-group.nl/ics/bics/2024/1010141014
  source accessed on: 2023-07-03T18:11:29Z
  source last accessed on: 2024-06-05T14:42:36Z
  definition: This segment includes companies that provide photo posting, printing, and collating services online.
  notation: 1010141014
  valid from: 2020-10-03
source accessed on: 2023-07-03T18:11:29Z
source last accessed on: 2024-06-05T14:42:36Z
definition: This segment includes companies that provide photo posting, printing, and collating services online.
notation: 1010141014
valid from: 2020-10-03

Adv Rev-Price & Svc Comp Web
type: BicsLevel6Segment
type: Classifier
type: NamedIndividual
is level6 segment of: Price & Svc Comparison Web
replaces: Adv Rev-Price & Svc Comp Web
created with: infer-bics.sql
derived from: Adv Rev-Price & Svc Comp Web
  type: BicsLevel5Segment
  type: Classifier
  type: AnachronousDerivation
  derived from: http://data.ga-group.nl/ics/bics/2014/1010141510
  source accessed on: 2019-12-03T20:05:01Z
  source last accessed on: 2019-12-03T20:05:01Z
  definition: This segment includes revenue that price and service comparison websites generate from advertising.
  notation: 1010141510
  valid from: 2014-08-08
  valid till: 2020-10-03
derived from: Adv Rev-Price & Svc Comp Web
  type: BicsLevel6Segment
  type: Classifier
  type: ContemporaryDerivation
  derived from: http://data.ga-group.nl/ics/bics/2020/101014101510
  derived from: http://data.ga-group.nl/ics/bics/2024/101014101510
  source accessed on: 2023-07-03T18:11:29Z
  source last accessed on: 2024-06-05T14:42:36Z
  definition: This segment includes revenue that price and service comparison websites generate from advertising.
  notation: 101014101510
  valid from: 2020-10-03
source accessed on: 2023-07-03T18:11:29Z
source last accessed on: 2024-06-05T14:42:36Z
definition: This segment includes revenue that price and service comparison websites generate from advertising.
notation: 101014101510
valid from: 2020-10-03

Other-Price & Svc Comp Web
type: BicsLevel6Segment
type: Classifier
type: NamedIndividual
is level6 segment of: Price & Svc Comparison Web
replaces: Other-Price & Svc Comp Web
created with: infer-bics.sql
derived from: Other-Price & Svc Comp Web
  type: BicsLevel5Segment
  type: Classifier
  type: AnachronousDerivation
  derived from: http://data.ga-group.nl/ics/bics/2014/1010141511
  source accessed on: 2019-12-03T20:05:01Z
  source last accessed on: 2019-12-03T20:05:01Z
  definition: This segment includes revenue that price and service comparison websites generate from sources other than advertising.
  notation: 1010141511
  valid from: 2014-08-08
  valid till: 2020-10-03
derived from: Other-Price & Svc Comp Web
  type: BicsLevel6Segment
  type: Classifier
  type: ContemporaryDerivation
  derived from: http://data.ga-group.nl/ics/bics/2020/101014101511
  derived from: http://data.ga-group.nl/ics/bics/2024/101014101511
  source accessed on: 2023-07-03T18:11:29Z
  source last accessed on: 2024-06-05T14:42:36Z
  definition: This segment includes revenue that price and service comparison websites generate from sources other than advertising.
  notation: 101014101511
  valid from: 2020-10-03
source accessed on: 2023-07-03T18:11:29Z
source last accessed on: 2024-06-05T14:42:36Z
definition: This segment includes revenue that price and service comparison websites generate from sources other than advertising.
notation: 101014101511
valid from: 2020-10-03

Price & Svc Comparison Web
type: BicsLevel5Segment
type: Classifier
type: NamedIndividual
is level5 segment of: Internet Media & Services
created with: infer-bics.sql
derived from: Price & Svc Comparison Web
  type: BicsLevel4SubIndustry
  type: Classifier
  type: AnachronousDerivation
  derived from: http://data.ga-group.nl/ics/bics/2014/10101415
  source accessed on: 2019-12-03T20:05:01Z
  source last accessed on: 2019-12-03T20:05:01Z
  definition: This industry subgroup includes companies that provide product price comparison services online. Such products include credit card rates, mobile phone rates, holiday prices, flights, digital cameras and printers.
  notation: 10101415
  valid from: 2014-08-08
  valid till: 2020-10-03
derived from: Price & Svc Comparison Web
  type: BicsLevel5Segment
  type: Classifier
  type: ContemporaryDerivation
  derived from: http://data.ga-group.nl/ics/bics/2020/1010141015
  derived from: http://data.ga-group.nl/ics/bics/2024/1010141015
  source accessed on: 2023-07-03T18:11:29Z
  source last accessed on: 2024-06-05T14:42:36Z
  definition: This segment includes companies that provide product price comparison services online. Such products include credit card rates, mobile phone rates, holiday prices, flights, digital cameras, and printers.
  notation: 1010141015
  valid from: 2020-10-03
source accessed on: 2023-07-03T18:11:29Z
source last accessed on: 2024-06-05T14:42:36Z
definition: This segment includes companies that provide product price comparison services online. Such products include credit card rates, mobile phone rates, holiday prices, flights, digital cameras, and printers.
notation: 1010141015
valid from: 2020-10-03

Adv Rev - Real Estate Web
type: BicsLevel6Segment
type: Classifier
type: NamedIndividual
is level6 segment of: Real Estate & Property Web
replaces: Adv Rev - Real Estate Web
created with: infer-bics.sql
derived from: Adv Rev - Real Estate Web
  type: BicsLevel5Segment
  type: Classifier
  type: AnachronousDerivation
  derived from: http://data.ga-group.nl/ics/bics/2014/1010141610
  source accessed on: 2019-12-03T20:05:01Z
  source last accessed on: 2019-12-03T20:05:01Z
  definition: This segment includes revenue that real estate and property websites generate from advertising.
  notation: 1010141610
  valid from: 2014-08-08
  valid till: 2020-10-03
derived from: Adv Rev - Real Estate Web
  type: BicsLevel6Segment
  type: Classifier
  type: ContemporaryDerivation
  derived from: http://data.ga-group.nl/ics/bics/2020/101014101610
  derived from: http://data.ga-group.nl/ics/bics/2024/101014101610
  source accessed on: 2023-07-03T18:11:29Z
  source last accessed on: 2024-06-05T14:42:36Z
  definition: This segment includes revenue that real estate and property websites generate from advertising.
  notation: 101014101610
  valid from: 2020-10-03
source accessed on: 2023-07-03T18:11:29Z
source last accessed on: 2024-06-05T14:42:36Z
definition: This segment includes revenue that real estate and property websites generate from advertising.
notation: 101014101610
valid from: 2020-10-03

Other Rev - Real Estate Web
type: BicsLevel6Segment
type: Classifier
type: NamedIndividual
is level6 segment of: Real Estate & Property Web
replaces: Other Rev - Real Estate Web
created with: infer-bics.sql
derived from: Other Rev - Real Estate Web
  type: BicsLevel5Segment
  type: Classifier
  type: AnachronousDerivation
  derived from: http://data.ga-group.nl/ics/bics/2014/1010141611
  source accessed on: 2019-12-03T20:05:01Z
  source last accessed on: 2019-12-03T20:05:01Z
  definition: This segment includes revenue that real estate and property websites generate from sources other than advertising.
  notation: 1010141611
  valid from: 2014-08-08
  valid till: 2020-10-03
derived from: Other Rev - Real Estate Web
  type: BicsLevel6Segment
  type: Classifier
  type: ContemporaryDerivation
  derived from: http://data.ga-group.nl/ics/bics/2020/101014101611
  derived from: http://data.ga-group.nl/ics/bics/2024/101014101611
  source accessed on: 2023-07-03T18:11:29Z
  source last accessed on: 2024-06-05T14:42:36Z
  definition: This segment includes revenue that real estate and property websites generate from sources other than advertising.
  notation: 101014101611
  valid from: 2020-10-03
source accessed on: 2023-07-03T18:11:29Z
source last accessed on: 2024-06-05T14:42:36Z
definition: This segment includes revenue that real estate and property websites generate from sources other than advertising.
notation: 101014101611
valid from: 2020-10-03

Real Estate & Property Web
type: BicsLevel5Segment
type: Classifier
type: NamedIndividual
is level5 segment of: Internet Media & Services
created with: infer-bics.sql
derived from: Real Estate & Property Web
  type: BicsLevel4SubIndustry
  type: Classifier
  type: AnachronousDerivation
  derived from: http://data.ga-group.nl/ics/bics/2014/10101416
  source accessed on: 2019-12-03T20:05:01Z
  source last accessed on: 2019-12-03T20:05:01Z
  definition: This industry subgroup includes companies that provide real estate and property information and listings online.
  notation: 10101416
  valid from: 2014-08-08
  valid till: 2020-10-03
derived from: Real Estate & Property Web
  type: BicsLevel5Segment
  type: Classifier
  type: ContemporaryDerivation
  derived from: http://data.ga-group.nl/ics/bics/2020/1010141016
  derived from: http://data.ga-group.nl/ics/bics/2024/1010141016
  source accessed on: 2023-07-03T18:11:29Z
  source last accessed on: 2024-06-05T14:42:36Z
  definition: This segment includes companies that provide real estate and property information and listings online.
  notation: 1010141016
  valid from: 2020-10-03
source accessed on: 2023-07-03T18:11:29Z
source last accessed on: 2024-06-05T14:42:36Z
definition: This segment includes companies that provide real estate and property information and listings online.
notation: 1010141016
valid from: 2020-10-03

Adv Rev - Recruit Svcs Web
type: BicsLevel6Segment
type: Classifier
type: NamedIndividual
is level6 segment of: Recruitment Services Web
replaces: Adv Rev - Recruit Svcs Web
created with: infer-bics.sql
derived from: Adv Rev - Recruit Svcs Web
  type: BicsLevel5Segment
  type: Classifier
  type: AnachronousDerivation
  derived from: http://data.ga-group.nl/ics/bics/2014/1010141710
  source accessed on: 2019-12-03T20:05:01Z
  source last accessed on: 2019-12-03T20:05:01Z
  definition: This segment includes revenue that recruitment services websites generate from advertising.
  notation: 1010141710
  valid from: 2014-08-08
  valid till: 2020-10-03
derived from: Adv Rev - Recruit Svcs Web
  type: BicsLevel6Segment
  type: Classifier
  type: ContemporaryDerivation
  derived from: http://data.ga-group.nl/ics/bics/2020/101014101710
  derived from: http://data.ga-group.nl/ics/bics/2024/101014101710
  source accessed on: 2023-07-03T18:11:29Z
  source last accessed on: 2024-06-05T14:42:36Z
  definition: This segment includes revenue that recruitment services websites generate from advertising.
  notation: 101014101710
  valid from: 2020-10-03
source accessed on: 2023-07-03T18:11:29Z
source last accessed on: 2024-06-05T14:42:36Z
definition: This segment includes revenue that recruitment services websites generate from advertising.
notation: 101014101710
valid from: 2020-10-03

Other Rev - Recruit Svc Web
type: BicsLevel6Segment
type: Classifier
type: NamedIndividual
is level6 segment of: Recruitment Services Web
replaces: Other Rev - Recruit Svc Web
created with: infer-bics.sql
derived from: Other Rev - Recruit Svc Web
  type: BicsLevel5Segment
  type: Classifier
  type: AnachronousDerivation
  derived from: http://data.ga-group.nl/ics/bics/2014/1010141711
  source accessed on: 2019-12-03T20:05:01Z
  source last accessed on: 2019-12-03T20:05:01Z
  definition: This segment includes revenue that recruitment services websites generate from sources other than advertising.
  notation: 1010141711
  valid from: 2014-08-08
  valid till: 2020-10-03
derived from: Other Rev - Recruit Svc Web
  type: BicsLevel6Segment
  type: Classifier
  type: ContemporaryDerivation
  derived from: http://data.ga-group.nl/ics/bics/2020/101014101711
  derived from: http://data.ga-group.nl/ics/bics/2024/101014101711
  source accessed on: 2023-07-03T18:11:29Z
  source last accessed on: 2024-06-05T14:42:36Z
  definition: This segment includes revenue that recruitment services websites generate from sources other than advertising.
  notation: 101014101711
  valid from: 2020-10-03
source accessed on: 2023-07-03T18:11:29Z
source last accessed on: 2024-06-05T14:42:36Z
definition: This segment includes revenue that recruitment services websites generate from sources other than advertising.
notation: 101014101711
valid from: 2020-10-03

Recruitment Services Web
type: BicsLevel5Segment
type: Classifier
type: NamedIndividual
is level5 segment of: Internet Media & Services
created with: infer-bics.sql
derived from: Recruitment Services Web
  type: BicsLevel4SubIndustry
  type: Classifier
  type: AnachronousDerivation
  derived from: http://data.ga-group.nl/ics/bics/2014/10101417
  source accessed on: 2019-12-03T20:05:01Z
  source last accessed on: 2019-12-03T20:05:01Z
  definition: This industry subgroup includes companies that provide recruitment services and listings online for both employers and potential employees.
  notation: 10101417
  valid from: 2014-08-08
  valid till: 2020-10-03
derived from: Recruitment Services Web
  type: BicsLevel5Segment
  type: Classifier
  type: ContemporaryDerivation
  derived from: http://data.ga-group.nl/ics/bics/2020/1010141017
  derived from: http://data.ga-group.nl/ics/bics/2024/1010141017
  source accessed on: 2023-07-03T18:11:29Z
  source last accessed on: 2024-06-05T14:42:36Z
  definition: This segment includes companies that provide recruitment services and online listings for both employers and potential employees.
  notation: 1010141017
  valid from: 2020-10-03
source accessed on: 2023-07-03T18:11:29Z
source last accessed on: 2024-06-05T14:42:36Z
definition: This segment includes companies that provide recruitment services and online listings for both employers and potential employees.
notation: 1010141017
valid from: 2020-10-03

Adv Rev - Travel & Booking Web
type: BicsLevel6Segment
type: Classifier
type: NamedIndividual
is level6 segment of: Travel Info & Booking Web
replaces: Adv Rev - Travel & Booking Web
created with: infer-bics.sql
derived from: Adv Rev - Travel & Booking Web
  type: BicsLevel5Segment
  type: Classifier
  type: AnachronousDerivation
  derived from: http://data.ga-group.nl/ics/bics/2014/1010141810
  source accessed on: 2019-12-03T20:05:01Z
  source last accessed on: 2019-12-03T20:05:01Z
  definition: This segment includes revenue that travel information and booking websites generate from advertising.
  notation: 1010141810
  valid from: 2014-08-08
  valid till: 2020-10-03
derived from: Adv Rev - Travel & Booking Web
  type: BicsLevel6Segment
  type: Classifier
  type: ContemporaryDerivation
  derived from: http://data.ga-group.nl/ics/bics/2020/101014101810
  derived from: http://data.ga-group.nl/ics/bics/2024/101014101810
  source accessed on: 2023-07-03T18:11:29Z
  source last accessed on: 2024-06-05T14:42:36Z
  definition: This segment includes revenue that travel information and booking websites generate from advertising.
  notation: 101014101810
  valid from: 2020-10-03
source accessed on: 2023-07-03T18:11:29Z
source last accessed on: 2024-06-05T14:42:36Z
definition: This segment includes revenue that travel information and booking websites generate from advertising.
notation: 101014101810
valid from: 2020-10-03

Other - Travel & Booking Web
type: BicsLevel6Segment
type: Classifier
type: NamedIndividual
is level6 segment of: Travel Info & Booking Web
replaces: Other - Travel & Booking Web
created with: infer-bics.sql
derived from: Other - Travel & Booking Web
  type: BicsLevel5Segment
  type: Classifier
  type: AnachronousDerivation
  derived from: http://data.ga-group.nl/ics/bics/2014/1010141811
  source accessed on: 2019-12-03T20:05:01Z
  source last accessed on: 2019-12-03T20:05:01Z
  definition: This segment includes revenue that travel information and booking websites generate from sources other than advertising.
  notation: 1010141811
  valid from: 2014-08-08
  valid till: 2020-10-03
derived from: Other - Travel & Booking Web
  type: BicsLevel6Segment
  type: Classifier
  type: ContemporaryDerivation
  derived from: http://data.ga-group.nl/ics/bics/2020/101014101811
  derived from: http://data.ga-group.nl/ics/bics/2024/101014101811
  source accessed on: 2023-07-03T18:11:29Z
  source last accessed on: 2024-06-05T14:42:36Z
  definition: This segment includes revenue that travel information and booking websites generate from sources other than advertising.
  notation: 101014101811
  valid from: 2020-10-03
source accessed on: 2023-07-03T18:11:29Z
source last accessed on: 2024-06-05T14:42:36Z
definition: This segment includes revenue that travel information and booking websites generate from sources other than advertising.
notation: 101014101811
valid from: 2020-10-03

Travel Info & Booking Web
type: BicsLevel5Segment
type: Classifier
type: NamedIndividual
is level5 segment of: Internet Media & Services
created with: infer-bics.sql
derived from: Travel Info & Booking Web
  type: BicsLevel4SubIndustry
  type: Classifier
  type: AnachronousDerivation
  derived from: http://data.ga-group.nl/ics/bics/2014/10101418
  source accessed on: 2019-12-03T20:05:01Z
  source last accessed on: 2019-12-03T20:05:01Z
  definition: This industry subgroup includes companies that offer travel information and booking services online.
  notation: 10101418
  valid from: 2014-08-08
  valid till: 2020-10-03
derived from: Travel Info & Booking Web
  type: BicsLevel5Segment
  type: Classifier
  type: ContemporaryDerivation
  derived from: http://data.ga-group.nl/ics/bics/2020/1010141018
  derived from: http://data.ga-group.nl/ics/bics/2024/1010141018
  source accessed on: 2023-07-03T18:11:29Z
  source last accessed on: 2024-06-05T14:42:36Z
  definition: This segment includes companies that offer travel information and booking services online.
  notation: 1010141018
  valid from: 2020-10-03
source accessed on: 2023-07-03T18:11:29Z
source last accessed on: 2024-06-05T14:42:36Z
definition: This segment includes companies that offer travel information and booking services online.
notation: 1010141018
valid from: 2020-10-03

Adv Rev - Education Info Web
type: BicsLevel6Segment
type: Classifier
type: NamedIndividual
is level6 segment of: Education Information Web
replaces: Adv Rev - Education Info Web
created with: infer-bics.sql
derived from: Adv Rev - Education Info Web
  type: BicsLevel5Segment
  type: Classifier
  type: AnachronousDerivation
  derived from: http://data.ga-group.nl/ics/bics/2014/1010151010
  source accessed on: 2019-12-03T20:05:01Z
  source last accessed on: 2019-12-03T20:05:01Z
  definition: This segment includes revenue that educational information websites generate from advertising.
  notation: 1010151010
  valid from: 2014-08-08
  valid till: 2020-10-03
derived from: Adv Rev - Education Info Web
  type: BicsLevel6Segment
  type: Classifier
  type: ContemporaryDerivation
  derived from: http://data.ga-group.nl/ics/bics/2020/101014101910
  derived from: http://data.ga-group.nl/ics/bics/2024/101014101910
  source accessed on: 2023-07-03T18:11:29Z
  source last accessed on: 2024-06-05T14:42:36Z
  definition: This segment includes revenue that educational information websites generate from advertising.
  notation: 101014101910
  valid from: 2020-10-03
source accessed on: 2023-07-03T18:11:29Z
source last accessed on: 2024-06-05T14:42:36Z
definition: This segment includes revenue that educational information websites generate from advertising.
notation: 101014101910
valid from: 2020-10-03

Other - Education Info Web
type: BicsLevel6Segment
type: Classifier
type: NamedIndividual
is level6 segment of: Education Information Web
replaces: Other - Education Info Web
created with: infer-bics.sql
derived from: Other - Education Info Web
  type: BicsLevel5Segment
  type: Classifier
  type: AnachronousDerivation
  derived from: http://data.ga-group.nl/ics/bics/2014/1010151011
  source accessed on: 2019-12-03T20:05:01Z
  source last accessed on: 2019-12-03T20:05:01Z
  definition: This segment includes revenue that educational information websites generate from sources other than advertising.
  notation: 1010151011
  valid from: 2014-08-08
  valid till: 2020-10-03
derived from: Other - Education Info Web
  type: BicsLevel6Segment
  type: Classifier
  type: ContemporaryDerivation
  derived from: http://data.ga-group.nl/ics/bics/2020/101014101911
  derived from: http://data.ga-group.nl/ics/bics/2024/101014101911
  source accessed on: 2023-07-03T18:11:29Z
  source last accessed on: 2024-06-05T14:42:36Z
  definition: This segment includes revenue that educational information websites generate from sources other than advertising.
  notation: 101014101911
  valid from: 2020-10-03
source accessed on: 2023-07-03T18:11:29Z
source last accessed on: 2024-06-05T14:42:36Z
definition: This segment includes revenue that educational information websites generate from sources other than advertising.
notation: 101014101911
valid from: 2020-10-03

Education Information Web
type: BicsLevel5Segment
type: Classifier
type: NamedIndividual
is level5 segment of: Internet Media & Services
created with: infer-bics.sql
derived from: Education Information Web
  type: BicsLevel4SubIndustry
  type: Classifier
  type: AnachronousDerivation
  derived from: http://data.ga-group.nl/ics/bics/2014/10101510
  source accessed on: 2019-12-03T20:05:01Z
  source last accessed on: 2019-12-03T20:05:01Z
  definition: This industry subgroup includes companies that provide educational information online.
  notation: 10101510
  valid from: 2014-08-08
  valid till: 2020-10-03
derived from: Education Information Web
  type: BicsLevel5Segment
  type: Classifier
  type: ContemporaryDerivation
  derived from: http://data.ga-group.nl/ics/bics/2020/1010141019
  derived from: http://data.ga-group.nl/ics/bics/2024/1010141019
  source accessed on: 2023-07-03T18:11:29Z
  source last accessed on: 2024-06-05T14:42:36Z
  definition: This segment includes companies that provide educational information online.
  notation: 1010141019
  valid from: 2020-10-03
source accessed on: 2023-07-03T18:11:29Z
source last accessed on: 2024-06-05T14:42:36Z
definition: This segment includes companies that provide educational information online.
notation: 1010141019
valid from: 2020-10-03

Display Advertising
type: BicsLevel7Segment
type: Classifier
type: NamedIndividual
is level7 segment of: Adv Rev - Internet Portals
replaces: Display Advertising
created with: infer-bics.sql
derived from: Display Advertising
  type: BicsLevel6Segment
  type: Classifier
  type: AnachronousDerivation
  derived from: http://data.ga-group.nl/ics/bics/2014/101015111010
  source accessed on: 2019-12-03T20:05:01Z
  source last accessed on: 2019-12-03T20:05:01Z
  definition: This segment includes revenue generated by the display of graphical advertisements on an online page that the user views.
  notation: 101015111010
  valid from: 2014-08-08
  valid till: 2020-10-03
derived from: Display Advertising
  type: BicsLevel7Segment
  type: Classifier
  type: ContemporaryDerivation
  derived from: http://data.ga-group.nl/ics/bics/2020/10101410201010
  derived from: http://data.ga-group.nl/ics/bics/2024/10101410201010
  source accessed on: 2023-07-03T18:11:29Z
  source last accessed on: 2024-06-05T14:42:36Z
  definition: This segment includes revenue generated by the display of graphical advertisements on a webpage.
  notation: 10101410201010
  valid from: 2020-10-03
source accessed on: 2023-07-03T18:11:29Z
source last accessed on: 2024-06-05T14:42:36Z
definition: This segment includes revenue generated by the display of graphical advertisements on a webpage.
notation: 10101410201010
valid from: 2020-10-03

Search Advertising
type: BicsLevel7Segment
type: Classifier
type: NamedIndividual
is level7 segment of: Adv Rev - Internet Portals
replaces: Search Advertising
created with: infer-bics.sql
derived from: Search Advertising
  type: BicsLevel6Segment
  type: Classifier
  type: AnachronousDerivation
  derived from: http://data.ga-group.nl/ics/bics/2014/101015111011
  source accessed on: 2019-12-03T20:05:01Z
  source last accessed on: 2019-12-03T20:05:01Z
  definition: This segment includes revenue generated from text-based links to an advertiser's website from Web searches conducted on an Internet search engine.
  notation: 101015111011
  valid from: 2014-08-08
  valid till: 2020-10-03
derived from: Search Advertising
  type: BicsLevel7Segment
  type: Classifier
  type: ContemporaryDerivation
  derived from: http://data.ga-group.nl/ics/bics/2020/10101410201011
  derived from: http://data.ga-group.nl/ics/bics/2024/10101410201011
  source accessed on: 2023-07-03T18:11:29Z
  source last accessed on: 2024-06-05T14:42:36Z
  definition: This segment includes revenue generated from text-based links to an advertiser's website from Web searches conducted on an Internet search engine.
  notation: 10101410201011
  valid from: 2020-10-03
source accessed on: 2023-07-03T18:11:29Z
source last accessed on: 2024-06-05T14:42:36Z
definition: This segment includes revenue generated from text-based links to an advertiser's website from Web searches conducted on an Internet search engine.
notation: 10101410201011
valid from: 2020-10-03

Adv Rev - Internet Portals
type: BicsLevel6Segment
type: Classifier
type: NamedIndividual
is level6 segment of: Internet Advertising Portals
replaces: Adv Rev - Internet Portals
created with: infer-bics.sql
derived from: Adv Rev - Internet Portals
  type: BicsLevel5Segment
  type: Classifier
  type: AnachronousDerivation
  derived from: http://data.ga-group.nl/ics/bics/2014/1010151110
  source accessed on: 2019-12-03T20:05:01Z
  source last accessed on: 2019-12-03T20:05:01Z
  definition: This segment includes revenue that Internet search engines generate from advertising.
  notation: 1010151110
  valid from: 2014-08-08
  valid till: 2020-10-03
derived from: Adv Rev - Internet Portals
  type: BicsLevel6Segment
  type: Classifier
  type: ContemporaryDerivation
  derived from: http://data.ga-group.nl/ics/bics/2020/101014102010
  derived from: http://data.ga-group.nl/ics/bics/2024/101014102010
  source accessed on: 2023-07-03T18:11:29Z
  source last accessed on: 2024-06-05T14:42:36Z
  definition: This segment includes revenue that Internet search engines generate from advertising.
  notation: 101014102010
  valid from: 2020-10-03
source accessed on: 2023-07-03T18:11:29Z
source last accessed on: 2024-06-05T14:42:36Z
definition: This segment includes revenue that Internet search engines generate from advertising.
notation: 101014102010
valid from: 2020-10-03

Other Rev - Internet Portals
type: BicsLevel6Segment
type: Classifier
type: NamedIndividual
is level6 segment of: Internet Advertising Portals
replaces: Other Rev - Internet Portals
created with: infer-bics.sql
derived from: Other Rev - Internet Portals
  type: BicsLevel5Segment
  type: Classifier
  type: AnachronousDerivation
  derived from: http://data.ga-group.nl/ics/bics/2014/1010151111
  source accessed on: 2019-12-03T20:05:01Z
  source last accessed on: 2019-12-03T20:05:01Z
  definition: This segment includes revenue that Internet search engines generate from sources other than advertising.
  notation: 1010151111
  valid from: 2014-08-08
  valid till: 2020-10-03
derived from: Other Rev - Internet Portals
  type: BicsLevel6Segment
  type: Classifier
  type: ContemporaryDerivation
  derived from: http://data.ga-group.nl/ics/bics/2020/101014102011
  derived from: http://data.ga-group.nl/ics/bics/2024/101014102011
  source accessed on: 2023-07-03T18:11:29Z
  source last accessed on: 2024-06-05T14:42:36Z
  definition: This segment includes revenue that Internet search engines generate from sources other than advertising.
  notation: 101014102011
  valid from: 2020-10-03
source accessed on: 2023-07-03T18:11:29Z
source last accessed on: 2024-06-05T14:42:36Z
definition: This segment includes revenue that Internet search engines generate from sources other than advertising.
notation: 101014102011
valid from: 2020-10-03

Internet Advertising Portals
type: BicsLevel5Segment
type: Classifier
type: NamedIndividual
is level5 segment of: Internet Media & Services
created with: infer-bics.sql
derived from: Internet Advertising Portals
  type: BicsLevel4SubIndustry
  type: Classifier
  type: AnachronousDerivation
  derived from: http://data.ga-group.nl/ics/bics/2014/10101511
  source accessed on: 2019-12-03T20:05:01Z
  source last accessed on: 2019-12-03T20:05:01Z
  definition: This industry subgroup includes companies that operate websites that use a search engine to generate and maintain extensive databases of Internet addresses and content in an easily searchable format.
  notation: 10101511
  valid from: 2014-08-08
  valid till: 2020-10-03
derived from: Internet Advertising Portals
  type: BicsLevel5Segment
  type: Classifier
  type: ContemporaryDerivation
  derived from: http://data.ga-group.nl/ics/bics/2020/1010141020
  derived from: http://data.ga-group.nl/ics/bics/2024/1010141020
  source accessed on: 2023-07-03T18:11:29Z
  source last accessed on: 2024-06-05T14:42:36Z
  definition: This segment includes companies that operate websites that use a search engine to generate and maintain extensive databases of Internet addresses and content in an easily searchable format.
  notation: 1010141020
  valid from: 2020-10-03
source accessed on: 2023-07-03T18:11:29Z
source last accessed on: 2024-06-05T14:42:36Z
definition: This segment includes companies that operate websites that use a search engine to generate and maintain extensive databases of Internet addresses and content in an easily searchable format.
notation: 1010141020
valid from: 2020-10-03

Adv Rev - Medical & Health Web
type: BicsLevel6Segment
type: Classifier
type: NamedIndividual
is level6 segment of: Medical & Health Web
replaces: Adv Rev - Medical & Health Web
created with: infer-bics.sql
derived from: Adv Rev - Medical & Health Web
  type: BicsLevel5Segment
  type: Classifier
  type: AnachronousDerivation
  derived from: http://data.ga-group.nl/ics/bics/2014/1010151210
  source accessed on: 2019-12-03T20:05:01Z
  source last accessed on: 2019-12-03T20:05:01Z
  definition: This segment includes revenue that medical, health and fitness websites generate from advertising.
  notation: 1010151210
  valid from: 2014-08-08
  valid till: 2020-10-03
derived from: Adv Rev - Medical & Health Web
  type: BicsLevel6Segment
  type: Classifier
  type: ContemporaryDerivation
  derived from: http://data.ga-group.nl/ics/bics/2020/101014102110
  derived from: http://data.ga-group.nl/ics/bics/2024/101014102110
  source accessed on: 2023-07-03T18:11:29Z
  source last accessed on: 2024-06-05T14:42:36Z
  definition: This segment includes revenue that medical, health, and fitness websites generate from advertising.
  notation: 101014102110
  valid from: 2020-10-03
source accessed on: 2023-07-03T18:11:29Z
source last accessed on: 2024-06-05T14:42:36Z
definition: This segment includes revenue that medical, health, and fitness websites generate from advertising.
notation: 101014102110
valid from: 2020-10-03

Other - Medical & Health Web
type: BicsLevel6Segment
type: Classifier
type: NamedIndividual
is level6 segment of: Medical & Health Web
replaces: Other - Medical & Health Web
created with: infer-bics.sql
derived from: Other - Medical & Health Web
  type: BicsLevel5Segment
  type: Classifier
  type: AnachronousDerivation
  derived from: http://data.ga-group.nl/ics/bics/2014/1010151211
  source accessed on: 2019-12-03T20:05:01Z
  source last accessed on: 2019-12-03T20:05:01Z
  definition: This segment includes revenue that medical, health and fitness websites generate from sources other than advertising.
  notation: 1010151211
  valid from: 2014-08-08
  valid till: 2020-10-03
derived from: Other - Medical & Health Web
  type: BicsLevel6Segment
  type: Classifier
  type: ContemporaryDerivation
  derived from: http://data.ga-group.nl/ics/bics/2020/101014102111
  derived from: http://data.ga-group.nl/ics/bics/2024/101014102111
  source accessed on: 2023-07-03T18:11:29Z
  source last accessed on: 2024-06-05T14:42:36Z
  definition: This segment includes revenue that medical, health, and fitness websites generate from sources other than advertising.
  notation: 101014102111
  valid from: 2020-10-03
source accessed on: 2023-07-03T18:11:29Z
source last accessed on: 2024-06-05T14:42:36Z
definition: This segment includes revenue that medical, health, and fitness websites generate from sources other than advertising.
notation: 101014102111
valid from: 2020-10-03

Medical & Health Web
type: BicsLevel5Segment
type: Classifier
type: NamedIndividual
is level5 segment of: Internet Media & Services
created with: infer-bics.sql
derived from: Medical & Health Web
  type: BicsLevel4SubIndustry
  type: Classifier
  type: AnachronousDerivation
  derived from: http://data.ga-group.nl/ics/bics/2014/10101512
  source accessed on: 2019-12-03T20:05:01Z
  source last accessed on: 2019-12-03T20:05:01Z
  definition: This industry subgroup includes companies that provide medical, health and fitness content online in an easily searchable format.
  notation: 10101512
  valid from: 2014-08-08
  valid till: 2020-10-03
derived from: Medical & Health Web
  type: BicsLevel5Segment
  type: Classifier
  type: ContemporaryDerivation
  derived from: http://data.ga-group.nl/ics/bics/2020/1010141021
  derived from: http://data.ga-group.nl/ics/bics/2024/1010141021
  source accessed on: 2023-07-03T18:11:29Z
  source last accessed on: 2024-06-05T14:42:36Z
  definition: This segment includes companies that provide medical, health, and fitness content online in an easily searchable format.
  notation: 1010141021
  valid from: 2020-10-03
source accessed on: 2023-07-03T18:11:29Z
source last accessed on: 2024-06-05T14:42:36Z
definition: This segment includes companies that provide medical, health, and fitness content online in an easily searchable format.
notation: 1010141021
valid from: 2020-10-03

Adv Rev-News/Sport/Entmt Web
type: BicsLevel6Segment
type: Classifier
type: NamedIndividual
is level6 segment of: News, Sports & Entmt Web
replaces: Adv Rev-News/Sport/Entmt Web
created with: infer-bics.sql
derived from: Adv Rev-News/Sport/Entmt Web
  type: BicsLevel5Segment
  type: Classifier
  type: AnachronousDerivation
  derived from: http://data.ga-group.nl/ics/bics/2014/1010151310
  source accessed on: 2019-12-03T20:05:01Z
  source last accessed on: 2019-12-03T20:05:01Z
  definition: This segment includes revenue that news, sports and entertainment portals generate from advertising.
  notation: 1010151310
  valid from: 2014-08-08
  valid till: 2020-10-03
derived from: Adv Rev-News/Sport/Entmt Web
  type: BicsLevel6Segment
  type: Classifier
  type: ContemporaryDerivation
  derived from: http://data.ga-group.nl/ics/bics/2020/101014102210
  derived from: http://data.ga-group.nl/ics/bics/2024/101014102210
  source accessed on: 2023-07-03T18:11:29Z
  source last accessed on: 2024-06-05T14:42:36Z
  definition: This segment includes revenue that news, sports, and entertainment portals generate from advertising.
  notation: 101014102210
  valid from: 2020-10-03
source accessed on: 2023-07-03T18:11:29Z
source last accessed on: 2024-06-05T14:42:36Z
definition: This segment includes revenue that news, sports, and entertainment portals generate from advertising.
notation: 101014102210
valid from: 2020-10-03

Other-News/Sport/Entmt Web
type: BicsLevel6Segment
type: Classifier
type: NamedIndividual
is level6 segment of: News, Sports & Entmt Web
replaces: Other-News/Sport/Entmt Web
created with: infer-bics.sql
derived from: Other-News/Sport/Entmt Web
  type: BicsLevel5Segment
  type: Classifier
  type: AnachronousDerivation
  derived from: http://data.ga-group.nl/ics/bics/2014/1010151311
  source accessed on: 2019-12-03T20:05:01Z
  source last accessed on: 2019-12-03T20:05:01Z
  definition: This segment includes revenue that news, sports and entertainment websites generate from sources other than advertising.
  notation: 1010151311
  valid from: 2014-08-08
  valid till: 2020-10-03
derived from: Other-News/Sport/Entmt Web
  type: BicsLevel6Segment
  type: Classifier
  type: ContemporaryDerivation
  derived from: http://data.ga-group.nl/ics/bics/2020/101014102211
  derived from: http://data.ga-group.nl/ics/bics/2024/101014102211
  source accessed on: 2023-07-03T18:11:29Z
  source last accessed on: 2024-06-05T14:42:36Z
  definition: This segment includes revenue that news, sports, and entertainment websites generate from sources other than advertising.
  notation: 101014102211
  valid from: 2020-10-03
source accessed on: 2023-07-03T18:11:29Z
source last accessed on: 2024-06-05T14:42:36Z
definition: This segment includes revenue that news, sports, and entertainment websites generate from sources other than advertising.
notation: 101014102211
valid from: 2020-10-03

News, Sports & Entmt Web
type: BicsLevel5Segment
type: Classifier
type: NamedIndividual
is level5 segment of: Internet Media & Services
created with: infer-bics.sql
derived from: News, Sports & Entmt Web
  type: BicsLevel4SubIndustry
  type: Classifier
  type: AnachronousDerivation
  derived from: http://data.ga-group.nl/ics/bics/2014/10101513
  source accessed on: 2019-12-03T20:05:01Z
  source last accessed on: 2019-12-03T20:05:01Z
  definition: This industry subgroup includes companies that provide news, sports and entertainment content online in an easily searchable format.
  notation: 10101513
  valid from: 2014-08-08
  valid till: 2020-10-03
derived from: News, Sports & Entmt Web
  type: BicsLevel5Segment
  type: Classifier
  type: ContemporaryDerivation
  derived from: http://data.ga-group.nl/ics/bics/2020/1010141022
  derived from: http://data.ga-group.nl/ics/bics/2024/1010141022
  source accessed on: 2023-07-03T18:11:29Z
  source last accessed on: 2024-06-05T14:42:36Z
  definition: This segment includes companies that provide news, sports, and entertainment content online in an easily searchable format.
  notation: 1010141022
  valid from: 2020-10-03
source accessed on: 2023-07-03T18:11:29Z
source last accessed on: 2024-06-05T14:42:36Z
definition: This segment includes companies that provide news, sports, and entertainment content online in an easily searchable format.
notation: 1010141022
valid from: 2020-10-03

Adv Rev - Social Networking Web
type: BicsLevel6Segment
type: Classifier
type: NamedIndividual
is level6 segment of: Social Networking Web
replaces: Adv Rev - Online Communities
created with: infer-bics.sql
derived from: Adv Rev - Online Communities
  type: BicsLevel5Segment
  type: Classifier
  type: AnachronousDerivation
  derived from: http://data.ga-group.nl/ics/bics/2014/1010151410
  source accessed on: 2019-12-03T20:05:01Z
  source last accessed on: 2019-12-03T20:05:01Z
  definition: This segment includes revenue that online communities’ websites generate from advertising.
  notation: 1010151410
  valid from: 2014-08-08
  valid till: 2020-10-03
derived from: Adv Rev - Social Networking Web
  type: BicsLevel6Segment
  type: Classifier
  type: ContemporaryDerivation
  derived from: http://data.ga-group.nl/ics/bics/2020/101014102310
  derived from: http://data.ga-group.nl/ics/bics/2024/101014102310
  source accessed on: 2023-07-03T18:11:29Z
  source last accessed on: 2024-06-05T14:42:36Z
  definition: This segment includes revenue that social networking websites generate from advertising.
  notation: 101014102310
  valid from: 2020-10-03
source accessed on: 2023-07-03T18:11:29Z
source last accessed on: 2024-06-05T14:42:36Z
definition: This segment includes revenue that social networking websites generate from advertising.
notation: 101014102310
valid from: 2020-10-03

Other Rev - Social Networking Web
type: BicsLevel6Segment
type: Classifier
type: NamedIndividual
is level6 segment of: Social Networking Web
replaces: Other Rev - Online Communities
created with: infer-bics.sql
derived from: Other Rev - Online Communities
  type: BicsLevel5Segment
  type: Classifier
  type: AnachronousDerivation
  derived from: http://data.ga-group.nl/ics/bics/2014/1010151411
  source accessed on: 2019-12-03T20:05:01Z
  source last accessed on: 2019-12-03T20:05:01Z
  definition: This segment includes revenue that online communities’ websites generate from sources other than advertising.
  notation: 1010151411
  valid from: 2014-08-08
  valid till: 2020-10-03
derived from: Other Rev - Social Networking Web
  type: BicsLevel6Segment
  type: Classifier
  type: ContemporaryDerivation
  derived from: http://data.ga-group.nl/ics/bics/2020/101014102311
  derived from: http://data.ga-group.nl/ics/bics/2024/101014102311
  source accessed on: 2023-07-03T18:11:29Z
  source last accessed on: 2024-06-05T14:42:36Z
  definition: This segment includes revenue that social networking websites generate from sources other than advertising.
  notation: 101014102311
  valid from: 2020-10-03
source accessed on: 2023-07-03T18:11:29Z
source last accessed on: 2024-06-05T14:42:36Z
definition: This segment includes revenue that social networking websites generate from sources other than advertising.
notation: 101014102311
valid from: 2020-10-03

Social Networking Web
type: BicsLevel5Segment
type: Classifier
type: NamedIndividual
is level5 segment of: Internet Media & Services
created with: infer-bics.sql
derived from: Online Communities
  type: BicsLevel4SubIndustry
  type: Classifier
  type: AnachronousDerivation
  derived from: http://data.ga-group.nl/ics/bics/2014/10101514
  source accessed on: 2019-12-03T20:05:01Z
  source last accessed on: 2019-12-03T20:05:01Z
  definition: This industry subgroup includes companies that provide Web communities online. A Web community may take the form of a social network service, an Internet forum or a group of blogs.
  notation: 10101514
  valid from: 2014-08-08
  valid till: 2020-10-03
derived from: Social Networking Web
  type: BicsLevel5Segment
  type: Classifier
  type: ContemporaryDerivation
  derived from: http://data.ga-group.nl/ics/bics/2020/1010141023
  derived from: http://data.ga-group.nl/ics/bics/2024/1010141023
  source accessed on: 2023-07-03T18:11:29Z
  source last accessed on: 2024-06-05T14:42:36Z
  definition: This segment includes companies that provide Web communities online, including social network services, an Internet forum, or a group of blogs.
  notation: 1010141023
  valid from: 2020-10-03
source accessed on: 2023-07-03T18:11:29Z
source last accessed on: 2024-06-05T14:42:36Z
definition: This segment includes companies that provide Web communities online, including social network services, an Internet forum, or a group of blogs.
notation: 1010141023
valid from: 2020-10-03

Online Food Delivery Svcs
type: BicsLevel6Segment
type: Classifier
type: NamedIndividual
is level6 segment of: Online Transport & Delivery Svcs
created with: infer-bics.sql
derived from: Online Food Delivery Svcs
  type: BicsLevel6Segment
  type: Classifier
  type: ContemporaryDerivation
  derived from: http://data.ga-group.nl/ics/bics/2024/101014102410
  source accessed on: 2024-06-05T14:42:36Z
  source last accessed on: 2024-06-05T14:42:36Z
  definition: This segment includes companies that offer food delivery services online or via applications. These companies do not own the mode of transportation.
  notation: 101014102410
  valid from: 2024-06-07
source accessed on: 2024-06-05T14:42:36Z
source last accessed on: 2024-06-05T14:42:36Z
definition: This segment includes companies that offer food delivery services online or via applications. These companies do not own the mode of transportation.
notation: 101014102410
valid from: 2024-06-07

Ridesharing Svcs
type: BicsLevel6Segment
type: Classifier
type: NamedIndividual
is level6 segment of: Online Transport & Delivery Svcs
created with: infer-bics.sql
derived from: Ridesharing Svcs
  type: BicsLevel6Segment
  type: Classifier
  type: ContemporaryDerivation
  derived from: http://data.ga-group.nl/ics/bics/2024/101014102411
  source accessed on: 2024-06-05T14:42:36Z
  source last accessed on: 2024-06-05T14:42:36Z
  definition: This segment includes companies that offer ridesharing or other services for the transportation of individuals online or via applications. These companies do not own the mode of transportation.
  notation: 101014102411
  valid from: 2024-06-07
source accessed on: 2024-06-05T14:42:36Z
source last accessed on: 2024-06-05T14:42:36Z
definition: This segment includes companies that offer ridesharing or other services for the transportation of individuals online or via applications. These companies do not own the mode of transportation.
notation: 101014102411
valid from: 2024-06-07

Online Transport & Delivery Svcs
type: BicsLevel5Segment
type: Classifier
type: NamedIndividual
is level5 segment of: Internet Media & Services
created with: infer-bics.sql
derived from: Online Transport & Delivery Svcs
  type: BicsLevel5Segment
  type: Classifier
  type: ContemporaryDerivation
  derived from: http://data.ga-group.nl/ics/bics/2024/1010141024
  source accessed on: 2024-06-05T14:42:36Z
  source last accessed on: 2024-06-05T14:42:36Z
  definition: This segment includes companies that offer transportation or delivery services online or via applications. These companies do not own the mode of transportation.
  notation: 1010141024
  valid from: 2024-06-07
source accessed on: 2024-06-05T14:42:36Z
source last accessed on: 2024-06-05T14:42:36Z
definition: This segment includes companies that offer transportation or delivery services online or via applications. These companies do not own the mode of transportation.
notation: 1010141024
valid from: 2024-06-07

Internet Media & Services
type: BicsLevel4SubIndustry
type: Classifier
type: NamedIndividual
replaces: Internet Media & Services
replaces: Internet Media
created with: infer-bics.sql
derived from: Internet Based Services
  type: BicsLevel3Industry
  type: Classifier
  type: AnachronousDerivation
  derived from: http://data.ga-group.nl/ics/bics/2014/101014
  source accessed on: 2019-12-03T20:05:01Z
  source last accessed on: 2019-12-03T20:05:01Z
  definition: This industry includes websites that provide a variety of services including dating services, travel information and booking, real estate listings, car classifieds, photo sharing, and job postings.
  notation: 101014
  valid from: 2014-08-08
  valid till: 2020-10-03
derived from: Automotive Web
  type: BicsLevel4SubIndustry
  type: Classifier
  type: ContemporaryDerivation
  derived from: http://data.ga-group.nl/ics/bics/2014/10101410
  source accessed on: 2019-12-03T20:05:01Z
  source last accessed on: 2019-12-03T20:05:01Z
  definition: This industry subgroup includes companies that provide automotive information and classified listings online.
  notation: 10101410
  valid from: 2014-08-08
  valid till: 2020-10-03
derived from: Internet Media
  type: BicsLevel3Industry
  type: Classifier
  type: AnachronousDerivation
  derived from: http://data.ga-group.nl/ics/bics/2014/101015
  source accessed on: 2019-12-03T20:05:01Z
  source last accessed on: 2019-12-03T20:05:01Z
  definition: This industry includes websites that create or distribute content. Typically, these websites derive revenue from advertisements. Excludes companies that provide services through websites (see Internet Based Services).
  notation: 101015
  valid from: 2014-08-08
  valid till: 2020-10-03
derived from: Internet Media & Services
  type: BicsLevel4SubIndustry
  type: Classifier
  type: ContemporaryDerivation
  derived from: http://data.ga-group.nl/ics/bics/2020/10101410
  source accessed on: 2023-07-03T18:11:29Z
  source last accessed on: 2023-07-03T18:11:29Z
  definition: This industry subgroup includes websites that create and distribute content or provide services online.
  notation: 10101410
  valid from: 2020-10-03
  valid till: 2024-06-07
derived from: Internet Media & Services
  type: BicsLevel4SubIndustry
  type: Classifier
  type: ContemporaryDerivation
  derived from: http://data.ga-group.nl/ics/bics/2024/10101410
  source accessed on: 2024-06-05T14:42:36Z
  source last accessed on: 2024-06-05T14:42:36Z
  definition: This industry subgroup includes websites that create and distribute content, or provide services online.
  notation: 10101410
  valid from: 2024-06-07
source accessed on: 2019-12-03T20:05:01Z
source last accessed on: 2024-06-05T14:42:36Z
definition: This industry subgroup includes websites that create and distribute content, or provide services online.
notation: 10101410
valid from: 2014-08-08

Adv Rev - Dating Services Web
type: BicsLevel5Segment
type: Classifier
type: NamedIndividual
is level5 segment of: Dating Services Web
is replaced by: Adv Rev - Dating Services Web
created with: infer-bics.sql
derived from: Adv Rev - Dating Services Web
  type: BicsLevel5Segment
  type: Classifier
  type: ContemporaryDerivation
  derived from: http://data.ga-group.nl/ics/bics/2014/1010141110
  source accessed on: 2019-12-03T20:05:01Z
  source last accessed on: 2019-12-03T20:05:01Z
  definition: This segment includes revenue that online dating services generate from advertising.
  notation: 1010141110
  valid from: 2014-08-08
  valid till: 2020-10-03
source accessed on: 2019-12-03T20:05:01Z
source last accessed on: 2019-12-03T20:05:01Z
definition: This segment includes revenue that online dating services generate from advertising.
notation: 1010141110
valid from: 2014-08-08
valid till: 2020-10-03

Other Rev - Dating Svcs Web
type: BicsLevel5Segment
type: Classifier
type: NamedIndividual
is level5 segment of: Dating Services Web
is replaced by: Other Rev - Dating Svcs Web
created with: infer-bics.sql
derived from: Other Rev - Dating Svcs Web
  type: BicsLevel5Segment
  type: Classifier
  type: ContemporaryDerivation
  derived from: http://data.ga-group.nl/ics/bics/2014/1010141111
  source accessed on: 2019-12-03T20:05:01Z
  source last accessed on: 2019-12-03T20:05:01Z
  definition: This segment includes revenue that online dating services generate from sources other than advertising.
  notation: 1010141111
  valid from: 2014-08-08
  valid till: 2020-10-03
source accessed on: 2019-12-03T20:05:01Z
source last accessed on: 2019-12-03T20:05:01Z
definition: This segment includes revenue that online dating services generate from sources other than advertising.
notation: 1010141111
valid from: 2014-08-08
valid till: 2020-10-03

Dating Services Web
type: BicsLevel4SubIndustry
type: Classifier
type: NamedIndividual
created with: infer-bics.sql
derived from: Dating Services Web
  type: BicsLevel4SubIndustry
  type: Classifier
  type: ContemporaryDerivation
  derived from: http://data.ga-group.nl/ics/bics/2014/10101411
  source accessed on: 2019-12-03T20:05:01Z
  source last accessed on: 2019-12-03T20:05:01Z
  definition: This industry subgroup includes companies that offer dating services and other matchmaking services online.
  notation: 10101411
  valid from: 2014-08-08
  valid till: 2020-10-03
source accessed on: 2019-12-03T20:05:01Z
source last accessed on: 2019-12-03T20:05:01Z
definition: This industry subgroup includes companies that offer dating services and other matchmaking services online.
notation: 10101411
valid from: 2014-08-08
valid till: 2020-10-03

Adv Rev - Domain Registrar
type: BicsLevel5Segment
type: Classifier
type: NamedIndividual
is level5 segment of: Domain Registrar
is replaced by: Adv Rev - Domain Registrar
created with: infer-bics.sql
derived from: Adv Rev - Domain Registrar
  type: BicsLevel5Segment
  type: Classifier
  type: ContemporaryDerivation
  derived from: http://data.ga-group.nl/ics/bics/2014/1010141210
  source accessed on: 2019-12-03T20:05:01Z
  source last accessed on: 2019-12-03T20:05:01Z
  definition: This segment includes revenue that domain registrars generate from advertising on their websites.
  notation: 1010141210
  valid from: 2014-08-08
  valid till: 2020-10-03
source accessed on: 2019-12-03T20:05:01Z
source last accessed on: 2019-12-03T20:05:01Z
definition: This segment includes revenue that domain registrars generate from advertising on their websites.
notation: 1010141210
valid from: 2014-08-08
valid till: 2020-10-03

Other Rev - Domain Registrar
type: BicsLevel5Segment
type: Classifier
type: NamedIndividual
is level5 segment of: Domain Registrar
is replaced by: Other Rev - Domain Registrar
created with: infer-bics.sql
derived from: Other Rev - Domain Registrar
  type: BicsLevel5Segment
  type: Classifier
  type: ContemporaryDerivation
  derived from: http://data.ga-group.nl/ics/bics/2014/1010141211
  source accessed on: 2019-12-03T20:05:01Z
  source last accessed on: 2019-12-03T20:05:01Z
  definition: This segment includes revenue that domain registrars generate from sources other than advertising.
  notation: 1010141211
  valid from: 2014-08-08
  valid till: 2020-10-03
source accessed on: 2019-12-03T20:05:01Z
source last accessed on: 2019-12-03T20:05:01Z
definition: This segment includes revenue that domain registrars generate from sources other than advertising.
notation: 1010141211
valid from: 2014-08-08
valid till: 2020-10-03

Domain Registrar
type: BicsLevel4SubIndustry
type: Classifier
type: NamedIndividual
created with: infer-bics.sql
derived from: Domain Registrar
  type: BicsLevel4SubIndustry
  type: Classifier
  type: ContemporaryDerivation
  derived from: http://data.ga-group.nl/ics/bics/2014/10101412
  source accessed on: 2019-12-03T20:05:01Z
  source last accessed on: 2019-12-03T20:05:01Z
  definition: This industry subgroup includes companies that primarily register Internet domain names.
  notation: 10101412
  valid from: 2014-08-08
  valid till: 2020-10-03
source accessed on: 2019-12-03T20:05:01Z
source last accessed on: 2019-12-03T20:05:01Z
definition: This industry subgroup includes companies that primarily register Internet domain names.
notation: 10101412
valid from: 2014-08-08
valid till: 2020-10-03

Adv Rev-Entmt Evt Ticket Online
type: BicsLevel5Segment
type: Classifier
type: NamedIndividual
is level5 segment of: Entmt Event Ticket Online
is replaced by: Adv Rev-Entmt Evt Ticket Online
created with: infer-bics.sql
derived from: Adv Rev-Entmt Evt Ticket Online
  type: BicsLevel5Segment
  type: Classifier
  type: ContemporaryDerivation
  derived from: http://data.ga-group.nl/ics/bics/2014/1010141310
  source accessed on: 2019-12-03T20:05:01Z
  source last accessed on: 2019-12-03T20:05:01Z
  definition: This segment includes revenue that entertainment event ticket sales websites generate from advertising.
  notation: 1010141310
  valid from: 2014-08-08
  valid till: 2020-10-03
source accessed on: 2019-12-03T20:05:01Z
source last accessed on: 2019-12-03T20:05:01Z
definition: This segment includes revenue that entertainment event ticket sales websites generate from advertising.
notation: 1010141310
valid from: 2014-08-08
valid till: 2020-10-03

Other-Entmt Evt Ticket Online
type: BicsLevel5Segment
type: Classifier
type: NamedIndividual
is level5 segment of: Entmt Event Ticket Online
is replaced by: Other-Entmt Evt Ticket Online
created with: infer-bics.sql
derived from: Other-Entmt Evt Ticket Online
  type: BicsLevel5Segment
  type: Classifier
  type: ContemporaryDerivation
  derived from: http://data.ga-group.nl/ics/bics/2014/1010141311
  source accessed on: 2019-12-03T20:05:01Z
  source last accessed on: 2019-12-03T20:05:01Z
  definition: This segment includes revenue that entertainment event ticket sales websites generate from sources other than advertising.
  notation: 1010141311
  valid from: 2014-08-08
  valid till: 2020-10-03
source accessed on: 2019-12-03T20:05:01Z
source last accessed on: 2019-12-03T20:05:01Z
definition: This segment includes revenue that entertainment event ticket sales websites generate from sources other than advertising.
notation: 1010141311
valid from: 2014-08-08
valid till: 2020-10-03

Entmt Event Ticket Online
type: BicsLevel4SubIndustry
type: Classifier
type: NamedIndividual
created with: infer-bics.sql
derived from: Entmt Event Ticket Online
  type: BicsLevel4SubIndustry
  type: Classifier
  type: ContemporaryDerivation
  derived from: http://data.ga-group.nl/ics/bics/2014/10101413
  source accessed on: 2019-12-03T20:05:01Z
  source last accessed on: 2019-12-03T20:05:01Z
  definition: This industry subgroup includes companies that retail tickets online for entertainment events, such as musical events, sporting events and theatrical shows.
  notation: 10101413
  valid from: 2014-08-08
  valid till: 2020-10-03
source accessed on: 2019-12-03T20:05:01Z
source last accessed on: 2019-12-03T20:05:01Z
definition: This industry subgroup includes companies that retail tickets online for entertainment events, such as musical events, sporting events and theatrical shows.
notation: 10101413
valid from: 2014-08-08
valid till: 2020-10-03

Adv Rev - Photography Web
type: BicsLevel5Segment
type: Classifier
type: NamedIndividual
is level5 segment of: Photography Web
is replaced by: Adv Rev - Photography Web
created with: infer-bics.sql
derived from: Adv Rev - Photography Web
  type: BicsLevel5Segment
  type: Classifier
  type: ContemporaryDerivation
  derived from: http://data.ga-group.nl/ics/bics/2014/1010141410
  source accessed on: 2019-12-03T20:05:01Z
  source last accessed on: 2019-12-03T20:05:01Z
  definition: This segment includes revenue that photo sharing and finishing websites generate from advertising.
  notation: 1010141410
  valid from: 2014-08-08
  valid till: 2020-10-03
source accessed on: 2019-12-03T20:05:01Z
source last accessed on: 2019-12-03T20:05:01Z
definition: This segment includes revenue that photo sharing and finishing websites generate from advertising.
notation: 1010141410
valid from: 2014-08-08
valid till: 2020-10-03

Other Rev - Photography Web
type: BicsLevel5Segment
type: Classifier
type: NamedIndividual
is level5 segment of: Photography Web
is replaced by: Other Rev - Photography Web
created with: infer-bics.sql
derived from: Other Rev - Photography Web
  type: BicsLevel5Segment
  type: Classifier
  type: ContemporaryDerivation
  derived from: http://data.ga-group.nl/ics/bics/2014/1010141411
  source accessed on: 2019-12-03T20:05:01Z
  source last accessed on: 2019-12-03T20:05:01Z
  definition: This segment includes revenue that photo sharing and finishing websites generate from sources other than advertising.
  notation: 1010141411
  valid from: 2014-08-08
  valid till: 2020-10-03
source accessed on: 2019-12-03T20:05:01Z
source last accessed on: 2019-12-03T20:05:01Z
definition: This segment includes revenue that photo sharing and finishing websites generate from sources other than advertising.
notation: 1010141411
valid from: 2014-08-08
valid till: 2020-10-03

Photography Web
type: BicsLevel4SubIndustry
type: Classifier
type: NamedIndividual
created with: infer-bics.sql
derived from: Photography Web
  type: BicsLevel4SubIndustry
  type: Classifier
  type: ContemporaryDerivation
  derived from: http://data.ga-group.nl/ics/bics/2014/10101414
  source accessed on: 2019-12-03T20:05:01Z
  source last accessed on: 2019-12-03T20:05:01Z
  definition: This industry subgroup includes companies that provide photo posting, printing, and collating services online.
  notation: 10101414
  valid from: 2014-08-08
  valid till: 2020-10-03
source accessed on: 2019-12-03T20:05:01Z
source last accessed on: 2019-12-03T20:05:01Z
definition: This industry subgroup includes companies that provide photo posting, printing, and collating services online.
notation: 10101414
valid from: 2014-08-08
valid till: 2020-10-03

Adv Rev-Price & Svc Comp Web
type: BicsLevel5Segment
type: Classifier
type: NamedIndividual
is level5 segment of: Price & Svc Comparison Web
is replaced by: Adv Rev-Price & Svc Comp Web
created with: infer-bics.sql
derived from: Adv Rev-Price & Svc Comp Web
  type: BicsLevel5Segment
  type: Classifier
  type: ContemporaryDerivation
  derived from: http://data.ga-group.nl/ics/bics/2014/1010141510
  source accessed on: 2019-12-03T20:05:01Z
  source last accessed on: 2019-12-03T20:05:01Z
  definition: This segment includes revenue that price and service comparison websites generate from advertising.
  notation: 1010141510
  valid from: 2014-08-08
  valid till: 2020-10-03
source accessed on: 2019-12-03T20:05:01Z
source last accessed on: 2019-12-03T20:05:01Z
definition: This segment includes revenue that price and service comparison websites generate from advertising.
notation: 1010141510
valid from: 2014-08-08
valid till: 2020-10-03

Other-Price & Svc Comp Web
type: BicsLevel5Segment
type: Classifier
type: NamedIndividual
is level5 segment of: Price & Svc Comparison Web
is replaced by: Other-Price & Svc Comp Web
created with: infer-bics.sql
derived from: Other-Price & Svc Comp Web
  type: BicsLevel5Segment
  type: Classifier
  type: ContemporaryDerivation
  derived from: http://data.ga-group.nl/ics/bics/2014/1010141511
  source accessed on: 2019-12-03T20:05:01Z
  source last accessed on: 2019-12-03T20:05:01Z
  definition: This segment includes revenue that price and service comparison websites generate from sources other than advertising.
  notation: 1010141511
  valid from: 2014-08-08
  valid till: 2020-10-03
source accessed on: 2019-12-03T20:05:01Z
source last accessed on: 2019-12-03T20:05:01Z
definition: This segment includes revenue that price and service comparison websites generate from sources other than advertising.
notation: 1010141511
valid from: 2014-08-08
valid till: 2020-10-03

Price & Svc Comparison Web
type: BicsLevel4SubIndustry
type: Classifier
type: NamedIndividual
created with: infer-bics.sql
derived from: Price & Svc Comparison Web
  type: BicsLevel4SubIndustry
  type: Classifier
  type: ContemporaryDerivation
  derived from: http://data.ga-group.nl/ics/bics/2014/10101415
  source accessed on: 2019-12-03T20:05:01Z
  source last accessed on: 2019-12-03T20:05:01Z
  definition: This industry subgroup includes companies that provide product price comparison services online. Such products include credit card rates, mobile phone rates, holiday prices, flights, digital cameras and printers.
  notation: 10101415
  valid from: 2014-08-08
  valid till: 2020-10-03
source accessed on: 2019-12-03T20:05:01Z
source last accessed on: 2019-12-03T20:05:01Z
definition: This industry subgroup includes companies that provide product price comparison services online. Such products include credit card rates, mobile phone rates, holiday prices, flights, digital cameras and printers.
notation: 10101415
valid from: 2014-08-08
valid till: 2020-10-03

Adv Rev - Real Estate Web
type: BicsLevel5Segment
type: Classifier
type: NamedIndividual
is level5 segment of: Real Estate & Property Web
is replaced by: Adv Rev - Real Estate Web
created with: infer-bics.sql
derived from: Adv Rev - Real Estate Web
  type: BicsLevel5Segment
  type: Classifier
  type: ContemporaryDerivation
  derived from: http://data.ga-group.nl/ics/bics/2014/1010141610
  source accessed on: 2019-12-03T20:05:01Z
  source last accessed on: 2019-12-03T20:05:01Z
  definition: This segment includes revenue that real estate and property websites generate from advertising.
  notation: 1010141610
  valid from: 2014-08-08
  valid till: 2020-10-03
source accessed on: 2019-12-03T20:05:01Z
source last accessed on: 2019-12-03T20:05:01Z
definition: This segment includes revenue that real estate and property websites generate from advertising.
notation: 1010141610
valid from: 2014-08-08
valid till: 2020-10-03

Other Rev - Real Estate Web
type: BicsLevel5Segment
type: Classifier
type: NamedIndividual
is level5 segment of: Real Estate & Property Web
is replaced by: Other Rev - Real Estate Web
created with: infer-bics.sql
derived from: Other Rev - Real Estate Web
  type: BicsLevel5Segment
  type: Classifier
  type: ContemporaryDerivation
  derived from: http://data.ga-group.nl/ics/bics/2014/1010141611
  source accessed on: 2019-12-03T20:05:01Z
  source last accessed on: 2019-12-03T20:05:01Z
  definition: This segment includes revenue that real estate and property websites generate from sources other than advertising.
  notation: 1010141611
  valid from: 2014-08-08
  valid till: 2020-10-03
source accessed on: 2019-12-03T20:05:01Z
source last accessed on: 2019-12-03T20:05:01Z
definition: This segment includes revenue that real estate and property websites generate from sources other than advertising.
notation: 1010141611
valid from: 2014-08-08
valid till: 2020-10-03

Real Estate & Property Web
type: BicsLevel4SubIndustry
type: Classifier
type: NamedIndividual
created with: infer-bics.sql
derived from: Real Estate & Property Web
  type: BicsLevel4SubIndustry
  type: Classifier
  type: ContemporaryDerivation
  derived from: http://data.ga-group.nl/ics/bics/2014/10101416
  source accessed on: 2019-12-03T20:05:01Z
  source last accessed on: 2019-12-03T20:05:01Z
  definition: This industry subgroup includes companies that provide real estate and property information and listings online.
  notation: 10101416
  valid from: 2014-08-08
  valid till: 2020-10-03
source accessed on: 2019-12-03T20:05:01Z
source last accessed on: 2019-12-03T20:05:01Z
definition: This industry subgroup includes companies that provide real estate and property information and listings online.
notation: 10101416
valid from: 2014-08-08
valid till: 2020-10-03

Adv Rev - Recruit Svcs Web
type: BicsLevel5Segment
type: Classifier
type: NamedIndividual
is level5 segment of: Recruitment Services Web
is replaced by: Adv Rev - Recruit Svcs Web
created with: infer-bics.sql
derived from: Adv Rev - Recruit Svcs Web
  type: BicsLevel5Segment
  type: Classifier
  type: ContemporaryDerivation
  derived from: http://data.ga-group.nl/ics/bics/2014/1010141710
  source accessed on: 2019-12-03T20:05:01Z
  source last accessed on: 2019-12-03T20:05:01Z
  definition: This segment includes revenue that recruitment services websites generate from advertising.
  notation: 1010141710
  valid from: 2014-08-08
  valid till: 2020-10-03
source accessed on: 2019-12-03T20:05:01Z
source last accessed on: 2019-12-03T20:05:01Z
definition: This segment includes revenue that recruitment services websites generate from advertising.
notation: 1010141710
valid from: 2014-08-08
valid till: 2020-10-03

Other Rev - Recruit Svc Web
type: BicsLevel5Segment
type: Classifier
type: NamedIndividual
is level5 segment of: Recruitment Services Web
is replaced by: Other Rev - Recruit Svc Web
created with: infer-bics.sql
derived from: Other Rev - Recruit Svc Web
  type: BicsLevel5Segment
  type: Classifier
  type: ContemporaryDerivation
  derived from: http://data.ga-group.nl/ics/bics/2014/1010141711
  source accessed on: 2019-12-03T20:05:01Z
  source last accessed on: 2019-12-03T20:05:01Z
  definition: This segment includes revenue that recruitment services websites generate from sources other than advertising.
  notation: 1010141711
  valid from: 2014-08-08
  valid till: 2020-10-03
source accessed on: 2019-12-03T20:05:01Z
source last accessed on: 2019-12-03T20:05:01Z
definition: This segment includes revenue that recruitment services websites generate from sources other than advertising.
notation: 1010141711
valid from: 2014-08-08
valid till: 2020-10-03

Recruitment Services Web
type: BicsLevel4SubIndustry
type: Classifier
type: NamedIndividual
created with: infer-bics.sql
derived from: Recruitment Services Web
  type: BicsLevel4SubIndustry
  type: Classifier
  type: ContemporaryDerivation
  derived from: http://data.ga-group.nl/ics/bics/2014/10101417
  source accessed on: 2019-12-03T20:05:01Z
  source last accessed on: 2019-12-03T20:05:01Z
  definition: This industry subgroup includes companies that provide recruitment services and listings online for both employers and potential employees.
  notation: 10101417
  valid from: 2014-08-08
  valid till: 2020-10-03
source accessed on: 2019-12-03T20:05:01Z
source last accessed on: 2019-12-03T20:05:01Z
definition: This industry subgroup includes companies that provide recruitment services and listings online for both employers and potential employees.
notation: 10101417
valid from: 2014-08-08
valid till: 2020-10-03

Adv Rev - Travel & Booking Web
type: BicsLevel5Segment
type: Classifier
type: NamedIndividual
is level5 segment of: Travel Info & Booking Web
is replaced by: Adv Rev - Travel & Booking Web
created with: infer-bics.sql
derived from: Adv Rev - Travel & Booking Web
  type: BicsLevel5Segment
  type: Classifier
  type: ContemporaryDerivation
  derived from: http://data.ga-group.nl/ics/bics/2014/1010141810
  source accessed on: 2019-12-03T20:05:01Z
  source last accessed on: 2019-12-03T20:05:01Z
  definition: This segment includes revenue that travel information and booking websites generate from advertising.
  notation: 1010141810
  valid from: 2014-08-08
  valid till: 2020-10-03
source accessed on: 2019-12-03T20:05:01Z
source last accessed on: 2019-12-03T20:05:01Z
definition: This segment includes revenue that travel information and booking websites generate from advertising.
notation: 1010141810
valid from: 2014-08-08
valid till: 2020-10-03

Other - Travel & Booking Web
type: BicsLevel5Segment
type: Classifier
type: NamedIndividual
is level5 segment of: Travel Info & Booking Web
is replaced by: Other - Travel & Booking Web
created with: infer-bics.sql
derived from: Other - Travel & Booking Web
  type: BicsLevel5Segment
  type: Classifier
  type: ContemporaryDerivation
  derived from: http://data.ga-group.nl/ics/bics/2014/1010141811
  source accessed on: 2019-12-03T20:05:01Z
  source last accessed on: 2019-12-03T20:05:01Z
  definition: This segment includes revenue that travel information and booking websites generate from sources other than advertising.
  notation: 1010141811
  valid from: 2014-08-08
  valid till: 2020-10-03
source accessed on: 2019-12-03T20:05:01Z
source last accessed on: 2019-12-03T20:05:01Z
definition: This segment includes revenue that travel information and booking websites generate from sources other than advertising.
notation: 1010141811
valid from: 2014-08-08
valid till: 2020-10-03

Travel Info & Booking Web
type: BicsLevel4SubIndustry
type: Classifier
type: NamedIndividual
created with: infer-bics.sql
derived from: Travel Info & Booking Web
  type: BicsLevel4SubIndustry
  type: Classifier
  type: ContemporaryDerivation
  derived from: http://data.ga-group.nl/ics/bics/2014/10101418
  source accessed on: 2019-12-03T20:05:01Z
  source last accessed on: 2019-12-03T20:05:01Z
  definition: This industry subgroup includes companies that offer travel information and booking services online.
  notation: 10101418
  valid from: 2014-08-08
  valid till: 2020-10-03
source accessed on: 2019-12-03T20:05:01Z
source last accessed on: 2019-12-03T20:05:01Z
definition: This industry subgroup includes companies that offer travel information and booking services online.
notation: 10101418
valid from: 2014-08-08
valid till: 2020-10-03

Other Internet Based Services
type: BicsLevel4SubIndustry
type: Classifier
type: NamedIndividual
created with: infer-bics.sql
derived from: Other Internet Based Services
  type: BicsLevel4SubIndustry
  type: Classifier
  type: ContemporaryDerivation
  derived from: http://data.ga-group.nl/ics/bics/2014/10101419
  source accessed on: 2019-12-03T20:05:01Z
  source last accessed on: 2019-12-03T20:05:01Z
  definition: This industry subgroup includes companies that provide services through the Internet, which are not elsewhere classified.
  notation: 10101419
  valid from: 2014-08-08
  valid till: 2020-10-03
source accessed on: 2019-12-03T20:05:01Z
source last accessed on: 2019-12-03T20:05:01Z
definition: This industry subgroup includes companies that provide services through the Internet, which are not elsewhere classified.
notation: 10101419
valid from: 2014-08-08
valid till: 2020-10-03

Internet Media & Services
type: BicsLevel3Industry
type: Classifier
type: NamedIndividual
is industry of: Media
is replaced by: Internet Media & Services
created with: infer-bics.sql
derived from: Internet Based Services
  type: BicsLevel3Industry
  type: Classifier
  type: ContemporaryDerivation
  derived from: http://data.ga-group.nl/ics/bics/2014/101014
  source accessed on: 2019-12-03T20:05:01Z
  source last accessed on: 2019-12-03T20:05:01Z
  definition: This industry includes websites that provide a variety of services including dating services, travel information and booking, real estate listings, car classifieds, photo sharing, and job postings.
  notation: 101014
  valid from: 2014-08-08
  valid till: 2020-10-03
derived from: Internet Media & Services
  type: BicsLevel3Industry
  type: Classifier
  type: ContemporaryDerivation
  derived from: http://data.ga-group.nl/ics/bics/2020/101014
  source accessed on: 2023-07-03T18:11:29Z
  source last accessed on: 2023-07-03T18:11:29Z
  definition: This industry includes websites that create and distribute content or provide services online.
  notation: 101014
  valid from: 2020-10-03
  valid till: 2024-06-07
derived from: Internet Media & Services
  type: BicsLevel3Industry
  type: Classifier
  type: ContemporaryDerivation
  derived from: http://data.ga-group.nl/ics/bics/2024/101014
  source accessed on: 2024-06-05T14:42:36Z
  source last accessed on: 2024-06-05T14:42:36Z
  definition: This industry includes websites that create and distribute content, or provide services online.
  notation: 101014
  valid from: 2024-06-07
source accessed on: 2019-12-03T20:05:01Z
source last accessed on: 2024-06-05T14:42:36Z
definition: This industry includes websites that create and distribute content, or provide services online.
notation: 101014
valid from: 2014-08-08

Adv Rev - Education Info Web
type: BicsLevel5Segment
type: Classifier
type: NamedIndividual
is level5 segment of: Education Information Web
is replaced by: Adv Rev - Education Info Web
created with: infer-bics.sql
derived from: Adv Rev - Education Info Web
  type: BicsLevel5Segment
  type: Classifier
  type: ContemporaryDerivation
  derived from: http://data.ga-group.nl/ics/bics/2014/1010151010
  source accessed on: 2019-12-03T20:05:01Z
  source last accessed on: 2019-12-03T20:05:01Z
  definition: This segment includes revenue that educational information websites generate from advertising.
  notation: 1010151010
  valid from: 2014-08-08
  valid till: 2020-10-03
source accessed on: 2019-12-03T20:05:01Z
source last accessed on: 2019-12-03T20:05:01Z
definition: This segment includes revenue that educational information websites generate from advertising.
notation: 1010151010
valid from: 2014-08-08
valid till: 2020-10-03

Other - Education Info Web
type: BicsLevel5Segment
type: Classifier
type: NamedIndividual
is level5 segment of: Education Information Web
is replaced by: Other - Education Info Web
created with: infer-bics.sql
derived from: Other - Education Info Web
  type: BicsLevel5Segment
  type: Classifier
  type: ContemporaryDerivation
  derived from: http://data.ga-group.nl/ics/bics/2014/1010151011
  source accessed on: 2019-12-03T20:05:01Z
  source last accessed on: 2019-12-03T20:05:01Z
  definition: This segment includes revenue that educational information websites generate from sources other than advertising.
  notation: 1010151011
  valid from: 2014-08-08
  valid till: 2020-10-03
source accessed on: 2019-12-03T20:05:01Z
source last accessed on: 2019-12-03T20:05:01Z
definition: This segment includes revenue that educational information websites generate from sources other than advertising.
notation: 1010151011
valid from: 2014-08-08
valid till: 2020-10-03

Education Information Web
type: BicsLevel4SubIndustry
type: Classifier
type: NamedIndividual
created with: infer-bics.sql
derived from: Education Information Web
  type: BicsLevel4SubIndustry
  type: Classifier
  type: ContemporaryDerivation
  derived from: http://data.ga-group.nl/ics/bics/2014/10101510
  source accessed on: 2019-12-03T20:05:01Z
  source last accessed on: 2019-12-03T20:05:01Z
  definition: This industry subgroup includes companies that provide educational information online.
  notation: 10101510
  valid from: 2014-08-08
  valid till: 2020-10-03
source accessed on: 2019-12-03T20:05:01Z
source last accessed on: 2019-12-03T20:05:01Z
definition: This industry subgroup includes companies that provide educational information online.
notation: 10101510
valid from: 2014-08-08
valid till: 2020-10-03

Display Advertising
type: BicsLevel6Segment
type: Classifier
type: NamedIndividual
is level6 segment of: Adv Rev - Internet Portals
is replaced by: Display Advertising
created with: infer-bics.sql
derived from: Display Advertising
  type: BicsLevel6Segment
  type: Classifier
  type: ContemporaryDerivation
  derived from: http://data.ga-group.nl/ics/bics/2014/101015111010
  source accessed on: 2019-12-03T20:05:01Z
  source last accessed on: 2019-12-03T20:05:01Z
  definition: This segment includes revenue generated by the display of graphical advertisements on an online page that the user views.
  notation: 101015111010
  valid from: 2014-08-08
  valid till: 2020-10-03
source accessed on: 2019-12-03T20:05:01Z
source last accessed on: 2019-12-03T20:05:01Z
definition: This segment includes revenue generated by the display of graphical advertisements on an online page that the user views.
notation: 101015111010
valid from: 2014-08-08
valid till: 2020-10-03

Search Advertising
type: BicsLevel6Segment
type: Classifier
type: NamedIndividual
is level6 segment of: Adv Rev - Internet Portals
is replaced by: Search Advertising
created with: infer-bics.sql
derived from: Search Advertising
  type: BicsLevel6Segment
  type: Classifier
  type: ContemporaryDerivation
  derived from: http://data.ga-group.nl/ics/bics/2014/101015111011
  source accessed on: 2019-12-03T20:05:01Z
  source last accessed on: 2019-12-03T20:05:01Z
  definition: This segment includes revenue generated from text-based links to an advertiser's website from Web searches conducted on an Internet search engine.
  notation: 101015111011
  valid from: 2014-08-08
  valid till: 2020-10-03
source accessed on: 2019-12-03T20:05:01Z
source last accessed on: 2019-12-03T20:05:01Z
definition: This segment includes revenue generated from text-based links to an advertiser's website from Web searches conducted on an Internet search engine.
notation: 101015111011
valid from: 2014-08-08
valid till: 2020-10-03

Adv Rev - Internet Portals
type: BicsLevel5Segment
type: Classifier
type: NamedIndividual
is level5 segment of: Internet Advertising Portals
is replaced by: Adv Rev - Internet Portals
created with: infer-bics.sql
derived from: Adv Rev - Internet Portals
  type: BicsLevel5Segment
  type: Classifier
  type: ContemporaryDerivation
  derived from: http://data.ga-group.nl/ics/bics/2014/1010151110
  source accessed on: 2019-12-03T20:05:01Z
  source last accessed on: 2019-12-03T20:05:01Z
  definition: This segment includes revenue that Internet search engines generate from advertising.
  notation: 1010151110
  valid from: 2014-08-08
  valid till: 2020-10-03
source accessed on: 2019-12-03T20:05:01Z
source last accessed on: 2019-12-03T20:05:01Z
definition: This segment includes revenue that Internet search engines generate from advertising.
notation: 1010151110
valid from: 2014-08-08
valid till: 2020-10-03

Other Rev - Internet Portals
type: BicsLevel5Segment
type: Classifier
type: NamedIndividual
is level5 segment of: Internet Advertising Portals
is replaced by: Other Rev - Internet Portals
created with: infer-bics.sql
derived from: Other Rev - Internet Portals
  type: BicsLevel5Segment
  type: Classifier
  type: ContemporaryDerivation
  derived from: http://data.ga-group.nl/ics/bics/2014/1010151111
  source accessed on: 2019-12-03T20:05:01Z
  source last accessed on: 2019-12-03T20:05:01Z
  definition: This segment includes revenue that Internet search engines generate from sources other than advertising.
  notation: 1010151111
  valid from: 2014-08-08
  valid till: 2020-10-03
source accessed on: 2019-12-03T20:05:01Z
source last accessed on: 2019-12-03T20:05:01Z
definition: This segment includes revenue that Internet search engines generate from sources other than advertising.
notation: 1010151111
valid from: 2014-08-08
valid till: 2020-10-03

Internet Advertising Portals
type: BicsLevel4SubIndustry
type: Classifier
type: NamedIndividual
created with: infer-bics.sql
derived from: Internet Advertising Portals
  type: BicsLevel4SubIndustry
  type: Classifier
  type: ContemporaryDerivation
  derived from: http://data.ga-group.nl/ics/bics/2014/10101511
  source accessed on: 2019-12-03T20:05:01Z
  source last accessed on: 2019-12-03T20:05:01Z
  definition: This industry subgroup includes companies that operate websites that use a search engine to generate and maintain extensive databases of Internet addresses and content in an easily searchable format.
  notation: 10101511
  valid from: 2014-08-08
  valid till: 2020-10-03
source accessed on: 2019-12-03T20:05:01Z
source last accessed on: 2019-12-03T20:05:01Z
definition: This industry subgroup includes companies that operate websites that use a search engine to generate and maintain extensive databases of Internet addresses and content in an easily searchable format.
notation: 10101511
valid from: 2014-08-08
valid till: 2020-10-03

Adv Rev - Medical & Health Web
type: BicsLevel5Segment
type: Classifier
type: NamedIndividual
is level5 segment of: Medical & Health Web
is replaced by: Adv Rev - Medical & Health Web
created with: infer-bics.sql
derived from: Adv Rev - Medical & Health Web
  type: BicsLevel5Segment
  type: Classifier
  type: ContemporaryDerivation
  derived from: http://data.ga-group.nl/ics/bics/2014/1010151210
  source accessed on: 2019-12-03T20:05:01Z
  source last accessed on: 2019-12-03T20:05:01Z
  definition: This segment includes revenue that medical, health and fitness websites generate from advertising.
  notation: 1010151210
  valid from: 2014-08-08
  valid till: 2020-10-03
source accessed on: 2019-12-03T20:05:01Z
source last accessed on: 2019-12-03T20:05:01Z
definition: This segment includes revenue that medical, health and fitness websites generate from advertising.
notation: 1010151210
valid from: 2014-08-08
valid till: 2020-10-03

Other - Medical & Health Web
type: BicsLevel5Segment
type: Classifier
type: NamedIndividual
is level5 segment of: Medical & Health Web
is replaced by: Other - Medical & Health Web
created with: infer-bics.sql
derived from: Other - Medical & Health Web
  type: BicsLevel5Segment
  type: Classifier
  type: ContemporaryDerivation
  derived from: http://data.ga-group.nl/ics/bics/2014/1010151211
  source accessed on: 2019-12-03T20:05:01Z
  source last accessed on: 2019-12-03T20:05:01Z
  definition: This segment includes revenue that medical, health and fitness websites generate from sources other than advertising.
  notation: 1010151211
  valid from: 2014-08-08
  valid till: 2020-10-03
source accessed on: 2019-12-03T20:05:01Z
source last accessed on: 2019-12-03T20:05:01Z
definition: This segment includes revenue that medical, health and fitness websites generate from sources other than advertising.
notation: 1010151211
valid from: 2014-08-08
valid till: 2020-10-03

Medical & Health Web
type: BicsLevel4SubIndustry
type: Classifier
type: NamedIndividual
created with: infer-bics.sql
derived from: Medical & Health Web
  type: BicsLevel4SubIndustry
  type: Classifier
  type: ContemporaryDerivation
  derived from: http://data.ga-group.nl/ics/bics/2014/10101512
  source accessed on: 2019-12-03T20:05:01Z
  source last accessed on: 2019-12-03T20:05:01Z
  definition: This industry subgroup includes companies that provide medical, health and fitness content online in an easily searchable format.
  notation: 10101512
  valid from: 2014-08-08
  valid till: 2020-10-03
source accessed on: 2019-12-03T20:05:01Z
source last accessed on: 2019-12-03T20:05:01Z
definition: This industry subgroup includes companies that provide medical, health and fitness content online in an easily searchable format.
notation: 10101512
valid from: 2014-08-08
valid till: 2020-10-03

Adv Rev-News/Sport/Entmt Web
type: BicsLevel5Segment
type: Classifier
type: NamedIndividual
is level5 segment of: News, Sports & Entmt Web
is replaced by: Adv Rev-News/Sport/Entmt Web
created with: infer-bics.sql
derived from: Adv Rev-News/Sport/Entmt Web
  type: BicsLevel5Segment
  type: Classifier
  type: ContemporaryDerivation
  derived from: http://data.ga-group.nl/ics/bics/2014/1010151310
  source accessed on: 2019-12-03T20:05:01Z
  source last accessed on: 2019-12-03T20:05:01Z
  definition: This segment includes revenue that news, sports and entertainment portals generate from advertising.
  notation: 1010151310
  valid from: 2014-08-08
  valid till: 2020-10-03
source accessed on: 2019-12-03T20:05:01Z
source last accessed on: 2019-12-03T20:05:01Z
definition: This segment includes revenue that news, sports and entertainment portals generate from advertising.
notation: 1010151310
valid from: 2014-08-08
valid till: 2020-10-03

Other-News/Sport/Entmt Web
type: BicsLevel5Segment
type: Classifier
type: NamedIndividual
is level5 segment of: News, Sports & Entmt Web
is replaced by: Other-News/Sport/Entmt Web
created with: infer-bics.sql
derived from: Other-News/Sport/Entmt Web
  type: BicsLevel5Segment
  type: Classifier
  type: ContemporaryDerivation
  derived from: http://data.ga-group.nl/ics/bics/2014/1010151311
  source accessed on: 2019-12-03T20:05:01Z
  source last accessed on: 2019-12-03T20:05:01Z
  definition: This segment includes revenue that news, sports and entertainment websites generate from sources other than advertising.
  notation: 1010151311
  valid from: 2014-08-08
  valid till: 2020-10-03
source accessed on: 2019-12-03T20:05:01Z
source last accessed on: 2019-12-03T20:05:01Z
definition: This segment includes revenue that news, sports and entertainment websites generate from sources other than advertising.
notation: 1010151311
valid from: 2014-08-08
valid till: 2020-10-03

News, Sports & Entmt Web
type: BicsLevel4SubIndustry
type: Classifier
type: NamedIndividual
created with: infer-bics.sql
derived from: News, Sports & Entmt Web
  type: BicsLevel4SubIndustry
  type: Classifier
  type: ContemporaryDerivation
  derived from: http://data.ga-group.nl/ics/bics/2014/10101513
  source accessed on: 2019-12-03T20:05:01Z
  source last accessed on: 2019-12-03T20:05:01Z
  definition: This industry subgroup includes companies that provide news, sports and entertainment content online in an easily searchable format.
  notation: 10101513
  valid from: 2014-08-08
  valid till: 2020-10-03
source accessed on: 2019-12-03T20:05:01Z
source last accessed on: 2019-12-03T20:05:01Z
definition: This industry subgroup includes companies that provide news, sports and entertainment content online in an easily searchable format.
notation: 10101513
valid from: 2014-08-08
valid till: 2020-10-03

Adv Rev - Online Communities
type: BicsLevel5Segment
type: Classifier
type: NamedIndividual
is level5 segment of: Online Communities
is replaced by: Adv Rev - Social Networking Web
created with: infer-bics.sql
derived from: Adv Rev - Online Communities
  type: BicsLevel5Segment
  type: Classifier
  type: ContemporaryDerivation
  derived from: http://data.ga-group.nl/ics/bics/2014/1010151410
  source accessed on: 2019-12-03T20:05:01Z
  source last accessed on: 2019-12-03T20:05:01Z
  definition: This segment includes revenue that online communities’ websites generate from advertising.
  notation: 1010151410
  valid from: 2014-08-08
  valid till: 2020-10-03
source accessed on: 2019-12-03T20:05:01Z
source last accessed on: 2019-12-03T20:05:01Z
definition: This segment includes revenue that online communities’ websites generate from advertising.
notation: 1010151410
valid from: 2014-08-08
valid till: 2020-10-03

Other Rev - Online Communities
type: BicsLevel5Segment
type: Classifier
type: NamedIndividual
is level5 segment of: Online Communities
is replaced by: Other Rev - Social Networking Web
created with: infer-bics.sql
derived from: Other Rev - Online Communities
  type: BicsLevel5Segment
  type: Classifier
  type: ContemporaryDerivation
  derived from: http://data.ga-group.nl/ics/bics/2014/1010151411
  source accessed on: 2019-12-03T20:05:01Z
  source last accessed on: 2019-12-03T20:05:01Z
  definition: This segment includes revenue that online communities’ websites generate from sources other than advertising.
  notation: 1010151411
  valid from: 2014-08-08
  valid till: 2020-10-03
source accessed on: 2019-12-03T20:05:01Z
source last accessed on: 2019-12-03T20:05:01Z
definition: This segment includes revenue that online communities’ websites generate from sources other than advertising.
notation: 1010151411
valid from: 2014-08-08
valid till: 2020-10-03

Online Communities
type: BicsLevel4SubIndustry
type: Classifier
type: NamedIndividual
created with: infer-bics.sql
derived from: Online Communities
  type: BicsLevel4SubIndustry
  type: Classifier
  type: ContemporaryDerivation
  derived from: http://data.ga-group.nl/ics/bics/2014/10101514
  source accessed on: 2019-12-03T20:05:01Z
  source last accessed on: 2019-12-03T20:05:01Z
  definition: This industry subgroup includes companies that provide Web communities online. A Web community may take the form of a social network service, an Internet forum or a group of blogs.
  notation: 10101514
  valid from: 2014-08-08
  valid till: 2020-10-03
source accessed on: 2019-12-03T20:05:01Z
source last accessed on: 2019-12-03T20:05:01Z
definition: This industry subgroup includes companies that provide Web communities online. A Web community may take the form of a social network service, an Internet forum or a group of blogs.
notation: 10101514
valid from: 2014-08-08
valid till: 2020-10-03

Adv Rev - Miscellaneous Web
type: BicsLevel5Segment
type: Classifier
type: NamedIndividual
is level5 segment of: Miscellaneous Web
created with: infer-bics.sql
derived from: Adv Rev - Miscellaneous Web
  type: BicsLevel5Segment
  type: Classifier
  type: ContemporaryDerivation
  derived from: http://data.ga-group.nl/ics/bics/2014/1010151510
  source accessed on: 2019-12-03T20:05:01Z
  source last accessed on: 2019-12-03T20:05:01Z
  definition: This segment includes revenue that miscellaneous websites generate from advertising.
  notation: 1010151510
  valid from: 2014-08-08
  valid till: 2020-10-03
source accessed on: 2019-12-03T20:05:01Z
source last accessed on: 2019-12-03T20:05:01Z
definition: This segment includes revenue that miscellaneous websites generate from advertising.
notation: 1010151510
valid from: 2014-08-08
valid till: 2020-10-03

Other Rev - Miscellaneous Web
type: BicsLevel5Segment
type: Classifier
type: NamedIndividual
is level5 segment of: Miscellaneous Web
created with: infer-bics.sql
derived from: Other Rev - Miscellaneous Web
  type: BicsLevel5Segment
  type: Classifier
  type: ContemporaryDerivation
  derived from: http://data.ga-group.nl/ics/bics/2014/1010151511
  source accessed on: 2019-12-03T20:05:01Z
  source last accessed on: 2019-12-03T20:05:01Z
  definition: This segment includes revenue that miscellaneous websites generate from sources other than advertising.
  notation: 1010151511
  valid from: 2014-08-08
  valid till: 2020-10-03
source accessed on: 2019-12-03T20:05:01Z
source last accessed on: 2019-12-03T20:05:01Z
definition: This segment includes revenue that miscellaneous websites generate from sources other than advertising.
notation: 1010151511
valid from: 2014-08-08
valid till: 2020-10-03

Miscellaneous Web
type: BicsLevel4SubIndustry
type: Classifier
type: NamedIndividual
created with: infer-bics.sql
derived from: Miscellaneous Web
  type: BicsLevel4SubIndustry
  type: Classifier
  type: ContemporaryDerivation
  derived from: http://data.ga-group.nl/ics/bics/2014/10101515
  source accessed on: 2019-12-03T20:05:01Z
  source last accessed on: 2019-12-03T20:05:01Z
  definition: This industry subgroup includes companies that operate websites that provide Internet media not elsewhere classified.
  notation: 10101515
  valid from: 2014-08-08
  valid till: 2020-10-03
source accessed on: 2019-12-03T20:05:01Z
source last accessed on: 2019-12-03T20:05:01Z
definition: This industry subgroup includes companies that operate websites that provide Internet media not elsewhere classified.
notation: 10101515
valid from: 2014-08-08
valid till: 2020-10-03

Internet Media
type: BicsLevel3Industry
type: Classifier
type: NamedIndividual
is industry of: Media
is replaced by: Internet Media & Services
created with: infer-bics.sql
derived from: Internet Media
  type: BicsLevel3Industry
  type: Classifier
  type: ContemporaryDerivation
  derived from: http://data.ga-group.nl/ics/bics/2014/101015
  source accessed on: 2019-12-03T20:05:01Z
  source last accessed on: 2019-12-03T20:05:01Z
  definition: This industry includes websites that create or distribute content. Typically, these websites derive revenue from advertisements. Excludes companies that provide services through websites (see Internet Based Services).
  notation: 101015
  valid from: 2014-08-08
  valid till: 2020-10-03
source accessed on: 2019-12-03T20:05:01Z
source last accessed on: 2019-12-03T20:05:01Z
definition: This industry includes websites that create or distribute content. Typically, these websites derive revenue from advertisements. Excludes companies that provide services through websites (see Internet Based Services).
notation: 101015
valid from: 2014-08-08
valid till: 2020-10-03

Media
type: BicsLevel2IndustryGroup
type: Classifier
type: NamedIndividual
is industry group of: Communications
created with: infer-bics.sql
derived from: Media
  type: BicsLevel2IndustryGroup
  type: Classifier
  type: ContemporaryDerivation
  derived from: http://data.ga-group.nl/ics/bics/2014/1010
  source accessed on: 2019-12-03T20:05:01Z
  source last accessed on: 2019-12-03T20:05:01Z
  definition: This industry group includes companies that create, distribute or publish media content. Media content exists in a wide variety of forms, such as print, advertisements, motion picture, television, music, radio and Internet websites. Also included are cable and satellite providers.
  notation: 1010
  valid from: 2014-08-08
  valid till: 2020-10-03
derived from: Media
  type: BicsLevel2IndustryGroup
  type: Classifier
  type: ContemporaryDerivation
  derived from: http://data.ga-group.nl/ics/bics/2020/1010
  derived from: http://data.ga-group.nl/ics/bics/2024/1010
  source accessed on: 2023-07-03T18:11:29Z
  source last accessed on: 2024-06-05T14:42:36Z
  definition: This industry group includes companies that create, distribute, or publish media content. Media content includes many formats, such as print, advertisements, motion pictures, television, music, radio, and Internet websites. Also included are cable and satellite providers.
  notation: 1010
  valid from: 2020-10-03
source accessed on: 2019-12-03T20:05:01Z
source last accessed on: 2024-06-05T14:42:36Z
definition: This industry group includes companies that create, distribute, or publish media content. Media content includes many formats, such as print, advertisements, motion pictures, television, music, radio, and Internet websites. Also included are cable and satellite providers.
notation: 1010
valid from: 2014-08-08

Mobile Phone Services
type: BicsLevel6Segment
type: Classifier
type: NamedIndividual
is level6 segment of: Wireless Service Providers
created with: infer-bics.sql
derived from: Mobile Voice Services
  type: BicsLevel6Segment
  type: Classifier
  type: ContemporaryDerivation
  derived from: http://data.ga-group.nl/ics/bics/2014/101110101010
  source accessed on: 2019-12-03T20:05:01Z
  source last accessed on: 2019-12-03T20:05:01Z
  definition: This segment includes wireless carriers that offer mobile voice services.
  notation: 101110101010
  valid from: 2014-08-08
  valid till: 2020-10-03
derived from: Mobile Phone Services
  type: BicsLevel6Segment
  type: Classifier
  type: ContemporaryDerivation
  derived from: http://data.ga-group.nl/ics/bics/2020/101110101010
  derived from: http://data.ga-group.nl/ics/bics/2024/101110101010
  source accessed on: 2023-07-03T18:11:29Z
  source last accessed on: 2024-06-05T14:42:36Z
  definition: This segment includes wireless carriers that offer mobile voice services.
  notation: 101110101010
  valid from: 2020-10-03
source accessed on: 2019-12-03T20:05:01Z
source last accessed on: 2024-06-05T14:42:36Z
definition: This segment includes wireless carriers that offer mobile voice services.
notation: 101110101010
valid from: 2014-08-08

Mobile Data Services
type: BicsLevel6Segment
type: Classifier
type: NamedIndividual
is level6 segment of: Wireless Service Providers
created with: infer-bics.sql
derived from: Mobile Data Services
  type: BicsLevel6Segment
  type: Classifier
  type: ContemporaryDerivation
  derived from: http://data.ga-group.nl/ics/bics/2014/101110101011
  source accessed on: 2019-12-03T20:05:01Z
  source last accessed on: 2019-12-03T20:05:01Z
  definition: This segment includes wireless carriers that provide a broad range of mobile data services, such as wireless Internet access, video, games, ring tones, music and other services.
  notation: 101110101011
  valid from: 2014-08-08
  valid till: 2020-10-03
derived from: Mobile Data Services
  type: BicsLevel6Segment
  type: Classifier
  type: ContemporaryDerivation
  derived from: http://data.ga-group.nl/ics/bics/2020/101110101011
  derived from: http://data.ga-group.nl/ics/bics/2024/101110101011
  source accessed on: 2023-07-03T18:11:29Z
  source last accessed on: 2024-06-05T14:42:36Z
  definition: This segment includes wireless carriers that provide a broad range of mobile data services, such as wireless Internet access, video, games, ring tones, and music.
  notation: 101110101011
  valid from: 2020-10-03
source accessed on: 2019-12-03T20:05:01Z
source last accessed on: 2024-06-05T14:42:36Z
definition: This segment includes wireless carriers that provide a broad range of mobile data services, such as wireless Internet access, video, games, ring tones, and music.
notation: 101110101011
valid from: 2014-08-08

Mobile Text Messaging (SMS)
type: BicsLevel6Segment
type: Classifier
type: NamedIndividual
is level6 segment of: Wireless Service Providers
created with: infer-bics.sql
derived from: Mobile Text Messaging (SMS)
  type: BicsLevel6Segment
  type: Classifier
  type: ContemporaryDerivation
  derived from: http://data.ga-group.nl/ics/bics/2014/101110101012
  derived from: http://data.ga-group.nl/ics/bics/2020/101110101012
  derived from: http://data.ga-group.nl/ics/bics/2024/101110101012
  source accessed on: 2019-12-03T20:05:01Z
  source last accessed on: 2024-06-05T14:42:36Z
  definition: This segment includes wireless carriers that offer mobile short message service (SMS), also known as text messaging.
  notation: 101110101012
  valid from: 2014-08-08
source accessed on: 2019-12-03T20:05:01Z
source last accessed on: 2024-06-05T14:42:36Z
definition: This segment includes wireless carriers that offer mobile short message service (SMS), also known as text messaging.
notation: 101110101012
valid from: 2014-08-08

Mobile Roaming Services
type: BicsLevel6Segment
type: Classifier
type: NamedIndividual
is level6 segment of: Wireless Service Providers
created with: infer-bics.sql
derived from: Mobile Roaming Services
  type: BicsLevel6Segment
  type: Classifier
  type: ContemporaryDerivation
  derived from: http://data.ga-group.nl/ics/bics/2014/101110101013
  source accessed on: 2019-12-03T20:05:01Z
  source last accessed on: 2019-12-03T20:05:01Z
  definition: This segment includes wireless carriers that provide mobile roaming services. Such services allow subscribers from other carriers' networks to make and receive calls over its own network.
  notation: 101110101013
  valid from: 2014-08-08
  valid till: 2020-10-03
derived from: Mobile Roaming Services
  type: BicsLevel6Segment
  type: Classifier
  type: ContemporaryDerivation
  derived from: http://data.ga-group.nl/ics/bics/2020/101110101013
  derived from: http://data.ga-group.nl/ics/bics/2024/101110101013
  source accessed on: 2023-07-03T18:11:29Z
  source last accessed on: 2024-06-05T14:42:36Z
  definition: This segment includes wireless carriers that provide mobile roaming services. Such services allow subscribers from other carriers' networks to make and receive calls over its network.
  notation: 101110101013
  valid from: 2020-10-03
source accessed on: 2019-12-03T20:05:01Z
source last accessed on: 2024-06-05T14:42:36Z
definition: This segment includes wireless carriers that provide mobile roaming services. Such services allow subscribers from other carriers' networks to make and receive calls over its network.
notation: 101110101013
valid from: 2014-08-08

Wireless Infra Access Revenue
type: BicsLevel6Segment
type: Classifier
type: NamedIndividual
is level6 segment of: Wireless Service Providers
created with: infer-bics.sql
derived from: Wireless Infra Access Revenue
  type: BicsLevel6Segment
  type: Classifier
  type: ContemporaryDerivation
  derived from: http://data.ga-group.nl/ics/bics/2014/101110101014
  derived from: http://data.ga-group.nl/ics/bics/2020/101110101014
  derived from: http://data.ga-group.nl/ics/bics/2024/101110101014
  source accessed on: 2019-12-03T20:05:01Z
  source last accessed on: 2024-06-05T14:42:36Z
  definition: This segment includes carriers that sell wireless network capacity on a wholesale basis to other wireless service providers who, in turn, use this network capacity to market branded mobile services to their customers.
  notation: 101110101014
  valid from: 2014-08-08
source accessed on: 2019-12-03T20:05:01Z
source last accessed on: 2024-06-05T14:42:36Z
definition: This segment includes carriers that sell wireless network capacity on a wholesale basis to other wireless service providers who, in turn, use this network capacity to market branded mobile services to their customers.
notation: 101110101014
valid from: 2014-08-08

Wireless Service Providers
type: BicsLevel5Segment
type: Classifier
type: NamedIndividual
is level5 segment of: Wireless Telecommunications
created with: infer-bics.sql
derived from: Wireless Service Providers
  type: BicsLevel5Segment
  type: Classifier
  type: ContemporaryDerivation
  derived from: http://data.ga-group.nl/ics/bics/2014/1011101010
  source accessed on: 2019-12-03T20:05:01Z
  source last accessed on: 2019-12-03T20:05:01Z
  definition: This segment includes companies that provide mobile phone services, such as telephone voice services, data services, text messaging services and roaming services.
  notation: 1011101010
  valid from: 2014-08-08
  valid till: 2020-10-03
derived from: Wireless Service Providers
  type: BicsLevel5Segment
  type: Classifier
  type: ContemporaryDerivation
  derived from: http://data.ga-group.nl/ics/bics/2020/1011101010
  derived from: http://data.ga-group.nl/ics/bics/2024/1011101010
  source accessed on: 2023-07-03T18:11:29Z
  source last accessed on: 2024-06-05T14:42:36Z
  definition: This segment includes companies that provide mobile phone services, such as telephone voice services, data services, text messaging services, and roaming services.
  notation: 1011101010
  valid from: 2020-10-03
source accessed on: 2019-12-03T20:05:01Z
source last accessed on: 2024-06-05T14:42:36Z
definition: This segment includes companies that provide mobile phone services, such as telephone voice services, data services, text messaging services, and roaming services.
notation: 1011101010
valid from: 2014-08-08

Satellite Operators
type: BicsLevel5Segment
type: Classifier
type: NamedIndividual
is level5 segment of: Wireless Telecommunications
created with: infer-bics.sql
derived from: Satellite Telecom (exclude TV)
  type: BicsLevel5Segment
  type: Classifier
  type: ContemporaryDerivation
  derived from: http://data.ga-group.nl/ics/bics/2014/1011101011
  source accessed on: 2019-12-03T20:05:01Z
  source last accessed on: 2019-12-03T20:05:01Z
  definition: This segment includes companies that provide telecommunications services via satellite. Also includes resellers, which are carriers that buy satellite capacity on a wholesale basis and resell it as a branded service to their customers as well as owners and operators of satellites.
  notation: 1011101011
  valid from: 2014-08-08
  valid till: 2020-10-03
derived from: Satellite Operators
  type: BicsLevel5Segment
  type: Classifier
  type: ContemporaryDerivation
  derived from: http://data.ga-group.nl/ics/bics/2020/1011101011
  derived from: http://data.ga-group.nl/ics/bics/2024/1011101011
  source accessed on: 2023-07-03T18:11:29Z
  source last accessed on: 2024-06-05T14:42:36Z
  definition: This segment includes companies that own and operate satellites. Typically, these satellite operators offer satellite capacity for telecommunication networks or provide geospatial data for their clients.
  notation: 1011101011
  valid from: 2020-10-03
source accessed on: 2019-12-03T20:05:01Z
source last accessed on: 2024-06-05T14:42:36Z
definition: This segment includes companies that own and operate satellites. Typically, these satellite operators offer satellite capacity for telecommunication networks or provide geospatial data for their clients.
notation: 1011101011
valid from: 2014-08-08

Mobile Comm Device Revenue
type: BicsLevel5Segment
type: Classifier
type: NamedIndividual
is level5 segment of: Wireless Telecommunications
created with: infer-bics.sql
derived from: Mobile Comm Device Revenue
  type: BicsLevel5Segment
  type: Classifier
  type: ContemporaryDerivation
  derived from: http://data.ga-group.nl/ics/bics/2014/1011101012
  source accessed on: 2019-12-03T20:05:01Z
  source last accessed on: 2019-12-03T20:05:01Z
  definition: This segment includes carriers that generate revenue from the sale of mobile handsets and other wireless devices, such as tablet personal computers. These devices are frequently sold along with a prepaid or postpaid wireless subscription.
  notation: 1011101012
  valid from: 2014-08-08
  valid till: 2020-10-03
derived from: Mobile Comm Device Revenue
  type: BicsLevel5Segment
  type: Classifier
  type: ContemporaryDerivation
  derived from: http://data.ga-group.nl/ics/bics/2020/1011101012
  derived from: http://data.ga-group.nl/ics/bics/2024/1011101012
  source accessed on: 2023-07-03T18:11:29Z
  source last accessed on: 2024-06-05T14:42:36Z
  definition: This segment includes revenue that telecom carriers generate from the sale of mobile handsets and other wireless devices. These devices are frequently sold along with a prepaid or postpaid wireless subscription.
  notation: 1011101012
  valid from: 2020-10-03
source accessed on: 2019-12-03T20:05:01Z
source last accessed on: 2024-06-05T14:42:36Z
definition: This segment includes revenue that telecom carriers generate from the sale of mobile handsets and other wireless devices. These devices are frequently sold along with a prepaid or postpaid wireless subscription.
notation: 1011101012
valid from: 2014-08-08

Wireless Telecommunications
type: BicsLevel4SubIndustry
type: Classifier
type: NamedIndividual
created with: infer-bics.sql
derived from: Wireless Telecom Services
  type: BicsLevel4SubIndustry
  type: Classifier
  type: ContemporaryDerivation
  derived from: http://data.ga-group.nl/ics/bics/2014/10111010
  source accessed on: 2019-12-03T20:05:01Z
  source last accessed on: 2019-12-03T20:05:01Z
  definition: This industry subgroup includes companies that use a wireless infrastructure to provide a variety of services, such as wireless telephony services, wireless data services, text messaging/short messaging services (SMS), roaming, wireless Internet services and satellite telecommunications. These companies have spectrum licenses and provide services using that spectrum.
  notation: 10111010
  valid from: 2014-08-08
  valid till: 2020-10-03
derived from: Wireless Telecommunications
  type: BicsLevel4SubIndustry
  type: Classifier
  type: ContemporaryDerivation
  derived from: http://data.ga-group.nl/ics/bics/2020/10111010
  derived from: http://data.ga-group.nl/ics/bics/2024/10111010
  source accessed on: 2023-07-03T18:11:29Z
  source last accessed on: 2024-06-05T14:42:36Z
  definition: This industry subgroup includes companies that use a wireless infrastructure to provide a variety of services, such as wireless telephony services, wireless data services, text messaging/short messaging services (SMS), roaming, wireless Internet services, and satellite telecommunications. These companies have spectrum licenses and provide services using that spectrum.
  notation: 10111010
  valid from: 2020-10-03
source accessed on: 2019-12-03T20:05:01Z
source last accessed on: 2024-06-05T14:42:36Z
definition: This industry subgroup includes companies that use a wireless infrastructure to provide a variety of services, such as wireless telephony services, wireless data services, text messaging/short messaging services (SMS), roaming, wireless Internet services, and satellite telecommunications. These companies have spectrum licenses and provide services using that spectrum.
notation: 10111010
valid from: 2014-08-08

VOIP Services
type: BicsLevel6Segment
type: Classifier
type: NamedIndividual
is level6 segment of: Wireline Phone Services
created with: infer-bics.sql
derived from: VOIP Services
  type: BicsLevel6Segment
  type: Classifier
  type: ContemporaryDerivation
  derived from: http://data.ga-group.nl/ics/bics/2014/101110111010
  source accessed on: 2019-12-03T20:05:01Z
  source last accessed on: 2019-12-03T20:05:01Z
  definition: This segment includes carriers that offer voice-over-IP (VoIP) through a wired Internet or broadband connection. Such service entails the transmission of voice over the Internet or through another packet-switched network.
  notation: 101110111010
  valid from: 2014-08-08
  valid till: 2020-10-03
derived from: VOIP Services
  type: BicsLevel6Segment
  type: Classifier
  type: ContemporaryDerivation
  derived from: http://data.ga-group.nl/ics/bics/2020/101110111010
  derived from: http://data.ga-group.nl/ics/bics/2024/101110111010
  source accessed on: 2023-07-03T18:11:29Z
  source last accessed on: 2024-06-05T14:42:36Z
  definition: This segment includes carriers that offer voice-over-IP (VoIP) through a wired Internet or broadband connection. Includes the transmission of voice over the Internet or through another packet-switched network.
  notation: 101110111010
  valid from: 2020-10-03
source accessed on: 2019-12-03T20:05:01Z
source last accessed on: 2024-06-05T14:42:36Z
definition: This segment includes carriers that offer voice-over-IP (VoIP) through a wired Internet or broadband connection. Includes the transmission of voice over the Internet or through another packet-switched network.
notation: 101110111010
valid from: 2014-08-08

Wireline Local Services
type: BicsLevel6Segment
type: Classifier
type: NamedIndividual
is level6 segment of: Wireline Phone Services
created with: infer-bics.sql
derived from: Wireline Local Services
  type: BicsLevel6Segment
  type: Classifier
  type: ContemporaryDerivation
  derived from: http://data.ga-group.nl/ics/bics/2014/101110111011
  derived from: http://data.ga-group.nl/ics/bics/2020/101110111011
  derived from: http://data.ga-group.nl/ics/bics/2024/101110111011
  source accessed on: 2019-12-03T20:05:01Z
  source last accessed on: 2024-06-05T14:42:36Z
  definition: This segment includes wireline carriers that offer fixed-line local phone service to business and residential customers.
  notation: 101110111011
  valid from: 2014-08-08
source accessed on: 2019-12-03T20:05:01Z
source last accessed on: 2024-06-05T14:42:36Z
definition: This segment includes wireline carriers that offer fixed-line local phone service to business and residential customers.
notation: 101110111011
valid from: 2014-08-08

Wireline Long Distance Services
type: BicsLevel6Segment
type: Classifier
type: NamedIndividual
is level6 segment of: Wireline Phone Services
created with: infer-bics.sql
derived from: Wireline Long Distance Services
  type: BicsLevel6Segment
  type: Classifier
  type: ContemporaryDerivation
  derived from: http://data.ga-group.nl/ics/bics/2014/101110111012
  derived from: http://data.ga-group.nl/ics/bics/2020/101110111012
  derived from: http://data.ga-group.nl/ics/bics/2024/101110111012
  source accessed on: 2019-12-03T20:05:01Z
  source last accessed on: 2024-06-05T14:42:36Z
  definition: This segment includes carriers that offer domestic and international long-distance services over a wireline network.
  notation: 101110111012
  valid from: 2014-08-08
source accessed on: 2019-12-03T20:05:01Z
source last accessed on: 2024-06-05T14:42:36Z
definition: This segment includes carriers that offer domestic and international long-distance services over a wireline network.
notation: 101110111012
valid from: 2014-08-08

Wireline Rental
type: BicsLevel6Segment
type: Classifier
type: NamedIndividual
is level6 segment of: Wireline Phone Services
created with: infer-bics.sql
derived from: Wireline Rental
  type: BicsLevel6Segment
  type: Classifier
  type: ContemporaryDerivation
  derived from: http://data.ga-group.nl/ics/bics/2014/101110111013
  derived from: http://data.ga-group.nl/ics/bics/2020/101110111013
  derived from: http://data.ga-group.nl/ics/bics/2024/101110111013
  source accessed on: 2019-12-03T20:05:01Z
  source last accessed on: 2024-06-05T14:42:36Z
  definition: This segment includes revenue that fixed-line carriers generate from leasing lines.
  notation: 101110111013
  valid from: 2014-08-08
source accessed on: 2019-12-03T20:05:01Z
source last accessed on: 2024-06-05T14:42:36Z
definition: This segment includes revenue that fixed-line carriers generate from leasing lines.
notation: 101110111013
valid from: 2014-08-08

Other Wireline Revenue
type: BicsLevel6Segment
type: Classifier
type: NamedIndividual
is level6 segment of: Wireline Phone Services
created with: infer-bics.sql
derived from: Other Wireline Revenue
  type: BicsLevel6Segment
  type: Classifier
  type: ContemporaryDerivation
  derived from: http://data.ga-group.nl/ics/bics/2014/101110111014
  source accessed on: 2019-12-03T20:05:01Z
  source last accessed on: 2019-12-03T20:05:01Z
  definition: This segment includes revenue that fixed-line carriers generate from all services, excluding revenue from leased line, local and long-distance services.
  notation: 101110111014
  valid from: 2014-08-08
  valid till: 2020-10-03
source accessed on: 2019-12-03T20:05:01Z
source last accessed on: 2019-12-03T20:05:01Z
definition: This segment includes revenue that fixed-line carriers generate from all services, excluding revenue from leased line, local and long-distance services.
notation: 101110111014
valid from: 2014-08-08
valid till: 2020-10-03

Wireline Phone Services
type: BicsLevel5Segment
type: Classifier
type: NamedIndividual
is level5 segment of: Wireline Telecommunications
created with: infer-bics.sql
derived from: Wireline Voice Svcs - Telecom
  type: BicsLevel5Segment
  type: Classifier
  type: ContemporaryDerivation
  derived from: http://data.ga-group.nl/ics/bics/2014/1011101110
  source accessed on: 2019-12-03T20:05:01Z
  source last accessed on: 2019-12-03T20:05:01Z
  definition: This segment includes wireline network operators that offer voice services over a fixed-line network. Such services include wireline local and long-distance services as well as voice-over-IP (VoIP) to residential and business customers.
  notation: 1011101110
  valid from: 2014-08-08
  valid till: 2020-10-03
derived from: Wireline Phone Services
  type: BicsLevel5Segment
  type: Classifier
  type: ContemporaryDerivation
  derived from: http://data.ga-group.nl/ics/bics/2020/1011101110
  derived from: http://data.ga-group.nl/ics/bics/2024/1011101110
  source accessed on: 2023-07-03T18:11:29Z
  source last accessed on: 2024-06-05T14:42:36Z
  definition: This segment includes wireline network operators that offer voice services over a fixed-line network. Includes wireline local and long-distance services as well as voice-over-IP (VoIP) to residential and business customers.
  notation: 1011101110
  valid from: 2020-10-03
source accessed on: 2019-12-03T20:05:01Z
source last accessed on: 2024-06-05T14:42:36Z
definition: This segment includes wireline network operators that offer voice services over a fixed-line network. Includes wireline local and long-distance services as well as voice-over-IP (VoIP) to residential and business customers.
notation: 1011101110
valid from: 2014-08-08

Wireline Internet Services
type: BicsLevel5Segment
type: Classifier
type: NamedIndividual
is level5 segment of: Wireline Telecommunications
created with: infer-bics.sql
derived from: Wireline ISPs - Telecom
  type: BicsLevel5Segment
  type: Classifier
  type: ContemporaryDerivation
  derived from: http://data.ga-group.nl/ics/bics/2014/1011101111
  source accessed on: 2019-12-03T20:05:01Z
  source last accessed on: 2019-12-03T20:05:01Z
  definition: This segment includes companies that offer Internet access (including broadband) through a wireline network connection.
  notation: 1011101111
  valid from: 2014-08-08
  valid till: 2020-10-03
derived from: Wireline Internet Services
  type: BicsLevel5Segment
  type: Classifier
  type: ContemporaryDerivation
  derived from: http://data.ga-group.nl/ics/bics/2020/1011101111
  derived from: http://data.ga-group.nl/ics/bics/2024/1011101111
  source accessed on: 2023-07-03T18:11:29Z
  source last accessed on: 2024-06-05T14:42:36Z
  definition: This segment includes companies that offer Internet access (including broadband) through a wireline network connection.
  notation: 1011101111
  valid from: 2020-10-03
source accessed on: 2019-12-03T20:05:01Z
source last accessed on: 2024-06-05T14:42:36Z
definition: This segment includes companies that offer Internet access (including broadband) through a wireline network connection.
notation: 1011101111
valid from: 2014-08-08

Wireline Video Services
type: BicsLevel5Segment
type: Classifier
type: NamedIndividual
is level5 segment of: Wireline Telecommunications
created with: infer-bics.sql
derived from: Wireline Video Svcs - Telecom
  type: BicsLevel5Segment
  type: Classifier
  type: ContemporaryDerivation
  derived from: http://data.ga-group.nl/ics/bics/2014/1011101112
  source accessed on: 2019-12-03T20:05:01Z
  source last accessed on: 2019-12-03T20:05:01Z
  definition: This segment includes wireline network operators that offer voice services over a fixed-line network. Wireline phone services include wireline local and long-distance services as well as voice-over-IP (VoIP) to residential and business customers.
  notation: 1011101112
  valid from: 2014-08-08
  valid till: 2020-10-03
derived from: Wireline Video Services
  type: BicsLevel5Segment
  type: Classifier
  type: ContemporaryDerivation
  derived from: http://data.ga-group.nl/ics/bics/2020/1011101112
  derived from: http://data.ga-group.nl/ics/bics/2024/1011101112
  source accessed on: 2023-07-03T18:11:29Z
  source last accessed on: 2024-06-05T14:42:36Z
  definition: This segment includes wireline network operators that offer video services over a fixed-line network.
  notation: 1011101112
  valid from: 2020-10-03
source accessed on: 2019-12-03T20:05:01Z
source last accessed on: 2024-06-05T14:42:36Z
definition: This segment includes wireline network operators that offer video services over a fixed-line network.
notation: 1011101112
valid from: 2014-08-08

Wholesale Telecom Services
type: BicsLevel5Segment
type: Classifier
type: NamedIndividual
is level5 segment of: Wireline Telecommunications
created with: infer-bics.sql
derived from: Wholesale Telecom Svcs
  type: BicsLevel5Segment
  type: Classifier
  type: ContemporaryDerivation
  derived from: http://data.ga-group.nl/ics/bics/2014/1011101113
  source accessed on: 2019-12-03T20:05:01Z
  source last accessed on: 2019-12-03T20:05:01Z
  definition: This segment includes network operators that either sell network capacity to resellers or lease their network facilities on a wholesale basis to other carriers and/or resellers.
  notation: 1011101113
  valid from: 2014-08-08
  valid till: 2020-10-03
derived from: Wholesale Telecom Services
  type: BicsLevel5Segment
  type: Classifier
  type: ContemporaryDerivation
  derived from: http://data.ga-group.nl/ics/bics/2020/1011101113
  derived from: http://data.ga-group.nl/ics/bics/2024/1011101113
  source accessed on: 2023-07-03T18:11:29Z
  source last accessed on: 2024-06-05T14:42:36Z
  definition: This segment includes network operators that either sell network capacity to resellers or lease their network facilities on a wholesale basis to other carriers and/or resellers.
  notation: 1011101113
  valid from: 2020-10-03
source accessed on: 2019-12-03T20:05:01Z
source last accessed on: 2024-06-05T14:42:36Z
definition: This segment includes network operators that either sell network capacity to resellers or lease their network facilities on a wholesale basis to other carriers and/or resellers.
notation: 1011101113
valid from: 2014-08-08

Data Centers
type: BicsLevel5Segment
type: Classifier
type: NamedIndividual
is level5 segment of: Wireline Telecommunications
created with: infer-bics.sql
derived from: Data Centers
  type: BicsLevel5Segment
  type: Classifier
  type: ContemporaryDerivation
  derived from: http://data.ga-group.nl/ics/bics/2014/1011101114
  source accessed on: 2019-12-03T20:05:01Z
  source last accessed on: 2019-12-03T20:05:01Z
  definition: This segment includes companies that offer hosting and/or data processing services. Hosting companies offer a broad range of services including Web hosting, streaming services or applications hosting. Other services include application service provisioning and general use of mainframe facilities through time-share agreements. Data-processing companies typically offer complete data processing, data-entry and reporting services.
  notation: 1011101114
  valid from: 2014-08-08
  valid till: 2020-10-03
derived from: Data Centers
  type: BicsLevel5Segment
  type: Classifier
  type: ContemporaryDerivation
  derived from: http://data.ga-group.nl/ics/bics/2020/1011101114
  source accessed on: 2023-07-03T18:11:29Z
  source last accessed on: 2023-07-03T18:11:29Z
  definition: This segment includes companies that offer hosting and/or data processing services. Includes Web hosting, streaming services or applications hosting, data processing, data-entry, and reporting services.
  notation: 1011101114
  valid from: 2020-10-03
  valid till: 2024-06-07
derived from: Data Centers
  type: BicsLevel5Segment
  type: Classifier
  type: ContemporaryDerivation
  derived from: http://data.ga-group.nl/ics/bics/2024/1011101114
  source accessed on: 2024-06-05T14:42:36Z
  source last accessed on: 2024-06-05T14:42:36Z
  definition: This segment includes companies that own data centers, which store computing and data storage equipment.
  notation: 1011101114
  valid from: 2024-06-07
source accessed on: 2019-12-03T20:05:01Z
source last accessed on: 2024-06-05T14:42:36Z
definition: This segment includes companies that own data centers, which store computing and data storage equipment.
notation: 1011101114
valid from: 2014-08-08

Wireline Telecommunications
type: BicsLevel4SubIndustry
type: Classifier
type: NamedIndividual
created with: infer-bics.sql
derived from: Wireline Telecom Services
  type: BicsLevel4SubIndustry
  type: Classifier
  type: ContemporaryDerivation
  derived from: http://data.ga-group.nl/ics/bics/2014/10111011
  source accessed on: 2019-12-03T20:05:01Z
  source last accessed on: 2019-12-03T20:05:01Z
  definition: This industry subgroup includes companies that operate facilities and infrastructure that supplies voice, data, text and sound using wired switching and transmission networks.
  notation: 10111011
  valid from: 2014-08-08
  valid till: 2020-10-03
derived from: Wireline Telecommunications
  type: BicsLevel4SubIndustry
  type: Classifier
  type: ContemporaryDerivation
  derived from: http://data.ga-group.nl/ics/bics/2020/10111011
  derived from: http://data.ga-group.nl/ics/bics/2024/10111011
  source accessed on: 2023-07-03T18:11:29Z
  source last accessed on: 2024-06-05T14:42:36Z
  definition: This industry subgroup includes companies that operate facilities and infrastructure that supplies voice, data, text, and sound using wired switching and transmission networks.
  notation: 10111011
  valid from: 2020-10-03
source accessed on: 2019-12-03T20:05:01Z
source last accessed on: 2024-06-05T14:42:36Z
definition: This industry subgroup includes companies that operate facilities and infrastructure that supplies voice, data, text, and sound using wired switching and transmission networks.
notation: 10111011
valid from: 2014-08-08

Telecommunications
type: BicsLevel3Industry
type: Classifier
type: NamedIndividual
is industry of: Telecommunications
created with: infer-bics.sql
derived from: Telecom Carriers
  type: BicsLevel3Industry
  type: Classifier
  type: ContemporaryDerivation
  derived from: http://data.ga-group.nl/ics/bics/2014/101110
  source accessed on: 2019-12-03T20:05:01Z
  source last accessed on: 2019-12-03T20:05:01Z
  definition: This industry includes companies that provide a broad range of telecommunications services including wireless and wireline services as well as satellite services including voice, video and/or data. Also includes companies that sell wholesale access to other service providers. Excludes cable multiple system operators (MSOs).
  notation: 101110
  valid from: 2014-08-08
  valid till: 2020-10-03
derived from: Telecommunications
  type: BicsLevel3Industry
  type: Classifier
  type: ContemporaryDerivation
  derived from: http://data.ga-group.nl/ics/bics/2020/101110
  derived from: http://data.ga-group.nl/ics/bics/2024/101110
  source accessed on: 2023-07-03T18:11:29Z
  source last accessed on: 2024-06-05T14:42:36Z
  definition: This industry includes companies that provide a broad range of telecommunications services including wireless and wireline services and satellite services including voice, video and/or data. Also includes companies that sell wholesale access to other service providers. Excludes cable multiple system operators (MSOs). (See Cable Cable & Satellite)
  notation: 101110
  valid from: 2020-10-03
source accessed on: 2019-12-03T20:05:01Z
source last accessed on: 2024-06-05T14:42:36Z
definition: This industry includes companies that provide a broad range of telecommunications services including wireless and wireline services and satellite services including voice, video and/or data. Also includes companies that sell wholesale access to other service providers. Excludes cable multiple system operators (MSOs). (See Cable Cable & Satellite)
notation: 101110
valid from: 2014-08-08

Telecom Resellers
type: BicsLevel3Industry
type: Classifier
type: NamedIndividual
is industry of: Telecommunications
created with: infer-bics.sql
derived from: Telecom Resellers
  type: BicsLevel3Industry
  type: Classifier
  type: ContemporaryDerivation
  derived from: http://data.ga-group.nl/ics/bics/2014/101111
  source accessed on: 2019-12-03T20:05:01Z
  source last accessed on: 2019-12-03T20:05:01Z
  definition: This industry includes companies that purchase network capacity and/or facilities on a wholesale basis from network operators and resell wired and wireless telecom services (except satellite) to businesses and households. Such companies are often referred to as resellers, because they do not operate network facilities and infrastructure. Instead, they market and resell services using other carriers' networks. Mobile virtual network operators (MVNOs) and carriers that sell prepaid calling cards are good examples of resellers.
  notation: 101111
  valid from: 2014-08-08
  valid till: 2020-10-03
source accessed on: 2019-12-03T20:05:01Z
source last accessed on: 2019-12-03T20:05:01Z
definition: This industry includes companies that purchase network capacity and/or facilities on a wholesale basis from network operators and resell wired and wireless telecom services (except satellite) to businesses and households. Such companies are often referred to as resellers, because they do not operate network facilities and infrastructure. Instead, they market and resell services using other carriers' networks. Mobile virtual network operators (MVNOs) and carriers that sell prepaid calling cards are good examples of resellers.
notation: 101111
valid from: 2014-08-08
valid till: 2020-10-03

Telecommunications
type: BicsLevel2IndustryGroup
type: Classifier
type: NamedIndividual
is industry group of: Communications
created with: infer-bics.sql
derived from: Telecom
  type: BicsLevel2IndustryGroup
  type: Classifier
  type: ContemporaryDerivation
  derived from: http://data.ga-group.nl/ics/bics/2014/1011
  source accessed on: 2019-12-03T20:05:01Z
  source last accessed on: 2019-12-03T20:05:01Z
  definition: This industry group includes companies that provide telecommunication services. Excludes cable companies that offer telecommunication services.
  notation: 1011
  valid from: 2014-08-08
  valid till: 2020-10-03
derived from: Telecommunications
  type: BicsLevel2IndustryGroup
  type: Classifier
  type: ContemporaryDerivation
  derived from: http://data.ga-group.nl/ics/bics/2020/1011
  derived from: http://data.ga-group.nl/ics/bics/2024/1011
  source accessed on: 2023-07-03T18:11:29Z
  source last accessed on: 2024-06-05T14:42:36Z
  definition: This industry group includes companies that provide telecommunication services. Excludes cable companies that offer telecommunication services.
  notation: 1011
  valid from: 2020-10-03
source accessed on: 2019-12-03T20:05:01Z
source last accessed on: 2024-06-05T14:42:36Z
definition: This industry group includes companies that provide telecommunication services. Excludes cable companies that offer telecommunication services.
notation: 1011
valid from: 2014-08-08

Communications
type: BicsLevel1Sector
type: Classifier
type: NamedIndividual
created with: infer-bics.sql
derived from: Communications
  type: BicsLevel1Sector
  type: Classifier
  type: ContemporaryDerivation
  derived from: http://data.ga-group.nl/ics/bics/2014/10
  source accessed on: 2019-12-03T20:05:01Z
  source last accessed on: 2019-12-03T20:05:01Z
  definition: This sector includes companies that create or distribute content. Includes media and advertising firms, Internet service providers, cable television multiple system operators (MSOs) and telecommunications operators.
  notation: 10
  valid from: 2014-08-08
  valid till: 2020-10-03
derived from: Communications
  type: BicsLevel1Sector
  type: Classifier
  type: ContemporaryDerivation
  derived from: http://data.ga-group.nl/ics/bics/2020/10
  derived from: http://data.ga-group.nl/ics/bics/2024/10
  source accessed on: 2023-07-03T18:11:29Z
  source last accessed on: 2024-06-05T14:42:36Z
  definition: This sector includes companies facilitating communication or creating and distributing content.
  notation: 10
  valid from: 2020-10-03
source accessed on: 2019-12-03T20:05:01Z
source last accessed on: 2024-06-05T14:42:36Z
definition: This sector includes companies facilitating communication or creating and distributing content.
notation: 10
valid from: 2014-08-08

Children's Apparel
type: BicsLevel6Segment
type: Classifier
type: NamedIndividual
is level6 segment of: Apparel Design
replaces: Apparel Design
created with: infer-bics.sql
derived from: Children's Apparel
  type: BicsLevel5Segment
  type: Classifier
  type: AnachronousDerivation
  derived from: http://data.ga-group.nl/ics/bics/2014/1110101010
  source accessed on: 2019-12-03T20:05:01Z
  source last accessed on: 2019-12-03T20:05:01Z
  definition: This segment includes companies that design and market children's apparel products.
  notation: 1110101010
  valid from: 2014-08-08
  valid till: 2020-10-03
derived from: Children's Apparel
  type: BicsLevel6Segment
  type: Classifier
  type: ContemporaryDerivation
  derived from: http://data.ga-group.nl/ics/bics/2020/111010101010
  derived from: http://data.ga-group.nl/ics/bics/2024/111010101010
  source accessed on: 2023-07-03T18:11:29Z
  source last accessed on: 2024-06-05T14:42:36Z
  definition: This segment includes companies that design children's apparel.
  notation: 111010101010
  valid from: 2020-10-03
source accessed on: 2023-07-03T18:11:29Z
source last accessed on: 2024-06-05T14:42:36Z
definition: This segment includes companies that design children's apparel.
notation: 111010101010
valid from: 2020-10-03

Men's Apparel
type: BicsLevel6Segment
type: Classifier
type: NamedIndividual
is level6 segment of: Apparel Design
replaces: Apparel Brand Licensing
created with: infer-bics.sql
derived from: Men's Apparel
  type: BicsLevel5Segment
  type: Classifier
  type: AnachronousDerivation
  derived from: http://data.ga-group.nl/ics/bics/2014/1110101011
  source accessed on: 2019-12-03T20:05:01Z
  source last accessed on: 2019-12-03T20:05:01Z
  definition: This segment includes companies that design and market men's apparel products.
  notation: 1110101011
  valid from: 2014-08-08
  valid till: 2020-10-03
derived from: Men's Apparel
  type: BicsLevel6Segment
  type: Classifier
  type: ContemporaryDerivation
  derived from: http://data.ga-group.nl/ics/bics/2020/111010101011
  derived from: http://data.ga-group.nl/ics/bics/2024/111010101011
  source accessed on: 2023-07-03T18:11:29Z
  source last accessed on: 2024-06-05T14:42:36Z
  definition: This segment includes companies that design men's apparel.
  notation: 111010101011
  valid from: 2020-10-03
source accessed on: 2023-07-03T18:11:29Z
source last accessed on: 2024-06-05T14:42:36Z
definition: This segment includes companies that design men's apparel.
notation: 111010101011
valid from: 2020-10-03

Women's Apparel
type: BicsLevel6Segment
type: Classifier
type: NamedIndividual
is level6 segment of: Apparel Design
replaces: Bags, Leather Goods & Acc Design
created with: infer-bics.sql
derived from: Women's Apparel
  type: BicsLevel5Segment
  type: Classifier
  type: AnachronousDerivation
  derived from: http://data.ga-group.nl/ics/bics/2014/1110101012
  source accessed on: 2019-12-03T20:05:01Z
  source last accessed on: 2019-12-03T20:05:01Z
  definition: This segment includes companies that design and market women's apparel products.
  notation: 1110101012
  valid from: 2014-08-08
  valid till: 2020-10-03
derived from: Women's Apparel
  type: BicsLevel6Segment
  type: Classifier
  type: ContemporaryDerivation
  derived from: http://data.ga-group.nl/ics/bics/2020/111010101012
  derived from: http://data.ga-group.nl/ics/bics/2024/111010101012
  source accessed on: 2023-07-03T18:11:29Z
  source last accessed on: 2024-06-05T14:42:36Z
  definition: This segment includes companies that design women's apparel.
  notation: 111010101012
  valid from: 2020-10-03
source accessed on: 2023-07-03T18:11:29Z
source last accessed on: 2024-06-05T14:42:36Z
definition: This segment includes companies that design women's apparel.
notation: 111010101012
valid from: 2020-10-03

Lingerie
type: BicsLevel6Segment
type: Classifier
type: NamedIndividual
is level6 segment of: Apparel Design
replaces: Footwear Design
created with: infer-bics.sql
derived from: Women's Lingerie
  type: BicsLevel5Segment
  type: Classifier
  type: AnachronousDerivation
  derived from: http://data.ga-group.nl/ics/bics/2014/1110101013
  source accessed on: 2019-12-03T20:05:01Z
  source last accessed on: 2019-12-03T20:05:01Z
  definition: This segment includes companies that design and market women's lingerie products.
  notation: 1110101013
  valid from: 2014-08-08
  valid till: 2020-10-03
derived from: Lingerie
  type: BicsLevel6Segment
  type: Classifier
  type: ContemporaryDerivation
  derived from: http://data.ga-group.nl/ics/bics/2020/111010101013
  derived from: http://data.ga-group.nl/ics/bics/2024/111010101013
  source accessed on: 2023-07-03T18:11:29Z
  source last accessed on: 2024-06-05T14:42:36Z
  definition: This segment includes companies that design women's lingerie.
  notation: 111010101013
  valid from: 2020-10-03
source accessed on: 2023-07-03T18:11:29Z
source last accessed on: 2024-06-05T14:42:36Z
definition: This segment includes companies that design women's lingerie.
notation: 111010101013
valid from: 2020-10-03

Sports Apparel
type: BicsLevel6Segment
type: Classifier
type: NamedIndividual
is level6 segment of: Apparel Design
replaces: Sports Apparel
created with: infer-bics.sql
derived from: Sports Apparel
  type: BicsLevel5Segment
  type: Classifier
  type: AnachronousDerivation
  derived from: http://data.ga-group.nl/ics/bics/2014/1110101511
  source accessed on: 2019-12-03T20:05:01Z
  source last accessed on: 2019-12-03T20:05:01Z
  definition: This segment includes companies that design and market sports apparel products.
  notation: 1110101511
  valid from: 2014-08-08
  valid till: 2020-10-03
derived from: Sports Apparel
  type: BicsLevel6Segment
  type: Classifier
  type: ContemporaryDerivation
  derived from: http://data.ga-group.nl/ics/bics/2020/111010101014
  derived from: http://data.ga-group.nl/ics/bics/2024/111010101014
  source accessed on: 2023-07-03T18:11:29Z
  source last accessed on: 2024-06-05T14:42:36Z
  definition: This segment includes companies that design sports apparel.
  notation: 111010101014
  valid from: 2020-10-03
source accessed on: 2023-07-03T18:11:29Z
source last accessed on: 2024-06-05T14:42:36Z
definition: This segment includes companies that design sports apparel.
notation: 111010101014
valid from: 2020-10-03

Fur & Leather Apparel
type: BicsLevel6Segment
type: Classifier
type: NamedIndividual
is level6 segment of: Apparel Design
replaces: Fur & Leather Apparel
created with: infer-bics.sql
derived from: Fur & Leather Apparel
  type: BicsLevel5Segment
  type: Classifier
  type: AnachronousDerivation
  derived from: http://data.ga-group.nl/ics/bics/2014/1110101711
  source accessed on: 2019-12-03T20:05:01Z
  source last accessed on: 2019-12-03T20:05:01Z
  definition: This segment includes companies that design and market fur and leather products.
  notation: 1110101711
  valid from: 2014-08-08
  valid till: 2020-10-03
derived from: Fur & Leather Apparel
  type: BicsLevel6Segment
  type: Classifier
  type: ContemporaryDerivation
  derived from: http://data.ga-group.nl/ics/bics/2020/111010101015
  derived from: http://data.ga-group.nl/ics/bics/2024/111010101015
  source accessed on: 2023-07-03T18:11:29Z
  source last accessed on: 2024-06-05T14:42:36Z
  definition: This segment includes companies that design fur and leather products.
  notation: 111010101015
  valid from: 2020-10-03
source accessed on: 2023-07-03T18:11:29Z
source last accessed on: 2024-06-05T14:42:36Z
definition: This segment includes companies that design fur and leather products.
notation: 111010101015
valid from: 2020-10-03

Outerwear Apparel
type: BicsLevel6Segment
type: Classifier
type: NamedIndividual
is level6 segment of: Apparel Design
replaces: Outerwear Apparel
created with: infer-bics.sql
derived from: Outerwear Apparel
  type: BicsLevel5Segment
  type: Classifier
  type: AnachronousDerivation
  derived from: http://data.ga-group.nl/ics/bics/2014/1110101712
  source accessed on: 2019-12-03T20:05:01Z
  source last accessed on: 2019-12-03T20:05:01Z
  definition: This segment includes companies that design and market outerwear apparel products.
  notation: 1110101712
  valid from: 2014-08-08
  valid till: 2020-10-03
derived from: Outerwear Apparel
  type: BicsLevel6Segment
  type: Classifier
  type: ContemporaryDerivation
  derived from: http://data.ga-group.nl/ics/bics/2020/111010101016
  derived from: http://data.ga-group.nl/ics/bics/2024/111010101016
  source accessed on: 2023-07-03T18:11:29Z
  source last accessed on: 2024-06-05T14:42:36Z
  definition: This segment includes companies that design outerwear apparel.
  notation: 111010101016
  valid from: 2020-10-03
source accessed on: 2023-07-03T18:11:29Z
source last accessed on: 2024-06-05T14:42:36Z
definition: This segment includes companies that design outerwear apparel.
notation: 111010101016
valid from: 2020-10-03

Professional Uniforms
type: BicsLevel6Segment
type: Classifier
type: NamedIndividual
is level6 segment of: Apparel Design
replaces: Professional Uniforms
created with: infer-bics.sql
derived from: Professional Uniforms
  type: BicsLevel5Segment
  type: Classifier
  type: AnachronousDerivation
  derived from: http://data.ga-group.nl/ics/bics/2014/1110101713
  source accessed on: 2019-12-03T20:05:01Z
  source last accessed on: 2019-12-03T20:05:01Z
  definition: This segment includes companies that design and market professional uniforms products.
  notation: 1110101713
  valid from: 2014-08-08
  valid till: 2020-10-03
derived from: Professional Uniforms
  type: BicsLevel6Segment
  type: Classifier
  type: ContemporaryDerivation
  derived from: http://data.ga-group.nl/ics/bics/2020/111010101017
  derived from: http://data.ga-group.nl/ics/bics/2024/111010101017
  source accessed on: 2023-07-03T18:11:29Z
  source last accessed on: 2024-06-05T14:42:36Z
  definition: This segment includes companies that design apparel for specific professions, companies, or schools.
  notation: 111010101017
  valid from: 2020-10-03
source accessed on: 2023-07-03T18:11:29Z
source last accessed on: 2024-06-05T14:42:36Z
definition: This segment includes companies that design apparel for specific professions, companies, or schools.
notation: 111010101017
valid from: 2020-10-03

Apparel Design
type: BicsLevel5Segment
type: Classifier
type: NamedIndividual
is level5 segment of: Apparel, Footwear & Acc Design
is replaced by: Children's Apparel
created with: infer-bics.sql
derived from: Apparel Design
  type: BicsLevel4SubIndustry
  type: Classifier
  type: AnachronousDerivation
  derived from: http://data.ga-group.nl/ics/bics/2014/11101010
  source accessed on: 2019-12-03T20:05:01Z
  source last accessed on: 2019-12-03T20:05:01Z
  definition: This industry subgroup includes companies that design and market men's, women's and children's apparel products.
  notation: 11101010
  valid from: 2014-08-08
  valid till: 2020-10-03
derived from: Children's Apparel
  type: BicsLevel5Segment
  type: Classifier
  type: ContemporaryDerivation
  derived from: http://data.ga-group.nl/ics/bics/2014/1110101010
  source accessed on: 2019-12-03T20:05:01Z
  source last accessed on: 2019-12-03T20:05:01Z
  definition: This segment includes companies that design and market children's apparel products.
  notation: 1110101010
  valid from: 2014-08-08
  valid till: 2020-10-03
derived from: Apparel Design
  type: BicsLevel5Segment
  type: Classifier
  type: ContemporaryDerivation
  derived from: http://data.ga-group.nl/ics/bics/2020/1110101010
  derived from: http://data.ga-group.nl/ics/bics/2024/1110101010
  source accessed on: 2023-07-03T18:11:29Z
  source last accessed on: 2024-06-05T14:42:36Z
  definition: This segment includes companies that design apparel.
  notation: 1110101010
  valid from: 2020-10-03
source accessed on: 2019-12-03T20:05:01Z
source last accessed on: 2024-06-05T14:42:36Z
definition: This segment includes companies that design apparel.
notation: 1110101010
valid from: 2014-08-08

Apparel Brand Licensing
type: BicsLevel5Segment
type: Classifier
type: NamedIndividual
is level5 segment of: Apparel, Footwear & Acc Design
is replaced by: Men's Apparel
created with: infer-bics.sql
derived from: Men's Apparel
  type: BicsLevel5Segment
  type: Classifier
  type: ContemporaryDerivation
  derived from: http://data.ga-group.nl/ics/bics/2014/1110101011
  source accessed on: 2019-12-03T20:05:01Z
  source last accessed on: 2019-12-03T20:05:01Z
  definition: This segment includes companies that design and market men's apparel products.
  notation: 1110101011
  valid from: 2014-08-08
  valid till: 2020-10-03
derived from: Apparel Brand Licensing
  type: BicsLevel4SubIndustry
  type: Classifier
  type: AnachronousDerivation
  derived from: http://data.ga-group.nl/ics/bics/2014/11101011
  source accessed on: 2019-12-03T20:05:01Z
  source last accessed on: 2019-12-03T20:05:01Z
  definition: This industry subgroup includes companies that design and market apparel, footwear and accessories products.
  notation: 11101011
  valid from: 2014-08-08
  valid till: 2020-10-03
derived from: Apparel Brand Licensing
  type: BicsLevel5Segment
  type: Classifier
  type: ContemporaryDerivation
  derived from: http://data.ga-group.nl/ics/bics/2020/1110101011
  derived from: http://data.ga-group.nl/ics/bics/2024/1110101011
  source accessed on: 2023-07-03T18:11:29Z
  source last accessed on: 2024-06-05T14:42:36Z
  definition: This segment includes companies that generate revenue from licensing rights to their apparel, such as trademarks, brand names, or agreements for which a royalty payment or licensing fee is paid by others.
  notation: 1110101011
  valid from: 2020-10-03
source accessed on: 2019-12-03T20:05:01Z
source last accessed on: 2024-06-05T14:42:36Z
definition: This segment includes companies that generate revenue from licensing rights to their apparel, such as trademarks, brand names, or agreements for which a royalty payment or licensing fee is paid by others.
notation: 1110101011
valid from: 2014-08-08

Luggage
type: BicsLevel6Segment
type: Classifier
type: NamedIndividual
is level6 segment of: Bags, Leather Goods & Acc Design
replaces: Luggage
created with: infer-bics.sql
derived from: Luggage
  type: BicsLevel5Segment
  type: Classifier
  type: AnachronousDerivation
  derived from: http://data.ga-group.nl/ics/bics/2014/1110101210
  source accessed on: 2019-12-03T20:05:01Z
  source last accessed on: 2019-12-03T20:05:01Z
  definition: This segment includes companies that design and market luggage products.
  notation: 1110101210
  valid from: 2014-08-08
  valid till: 2020-10-03
derived from: Luggage
  type: BicsLevel6Segment
  type: Classifier
  type: ContemporaryDerivation
  derived from: http://data.ga-group.nl/ics/bics/2020/111010101210
  derived from: http://data.ga-group.nl/ics/bics/2024/111010101210
  source accessed on: 2023-07-03T18:11:29Z
  source last accessed on: 2024-06-05T14:42:36Z
  definition: This segment includes companies that design luggage products typically used for travel.
  notation: 111010101210
  valid from: 2020-10-03
source accessed on: 2023-07-03T18:11:29Z
source last accessed on: 2024-06-05T14:42:36Z
definition: This segment includes companies that design luggage products typically used for travel.
notation: 111010101210
valid from: 2020-10-03

Personal Leather Goods
type: BicsLevel6Segment
type: Classifier
type: NamedIndividual
is level6 segment of: Bags, Leather Goods & Acc Design
replaces: Personal Leather Goods
created with: infer-bics.sql
derived from: Personal Leather Goods
  type: BicsLevel5Segment
  type: Classifier
  type: AnachronousDerivation
  derived from: http://data.ga-group.nl/ics/bics/2014/1110101211
  source accessed on: 2019-12-03T20:05:01Z
  source last accessed on: 2019-12-03T20:05:01Z
  definition: This segment includes companies that design and market personal leather good products.
  notation: 1110101211
  valid from: 2014-08-08
  valid till: 2020-10-03
derived from: Personal Leather Goods
  type: BicsLevel6Segment
  type: Classifier
  type: ContemporaryDerivation
  derived from: http://data.ga-group.nl/ics/bics/2020/111010101211
  derived from: http://data.ga-group.nl/ics/bics/2024/111010101211
  source accessed on: 2023-07-03T18:11:29Z
  source last accessed on: 2024-06-05T14:42:36Z
  definition: This segment includes companies that design personal leather good products such as leather wallets, belts, and briefcases.
  notation: 111010101211
  valid from: 2020-10-03
source accessed on: 2023-07-03T18:11:29Z
source last accessed on: 2024-06-05T14:42:36Z
definition: This segment includes companies that design personal leather good products such as leather wallets, belts, and briefcases.
notation: 111010101211
valid from: 2020-10-03

Handbags & Purses
type: BicsLevel6Segment
type: Classifier
type: NamedIndividual
is level6 segment of: Bags, Leather Goods & Acc Design
replaces: Women's Handbag
created with: infer-bics.sql
derived from: Women's Handbag
  type: BicsLevel5Segment
  type: Classifier
  type: AnachronousDerivation
  derived from: http://data.ga-group.nl/ics/bics/2014/1110101212
  source accessed on: 2019-12-03T20:05:01Z
  source last accessed on: 2019-12-03T20:05:01Z
  definition: This segment includes companies that design and market women's handbags products.
  notation: 1110101212
  valid from: 2014-08-08
  valid till: 2020-10-03
derived from: Handbags & Purses
  type: BicsLevel6Segment
  type: Classifier
  type: ContemporaryDerivation
  derived from: http://data.ga-group.nl/ics/bics/2020/111010101212
  derived from: http://data.ga-group.nl/ics/bics/2024/111010101212
  source accessed on: 2023-07-03T18:11:29Z
  source last accessed on: 2024-06-05T14:42:36Z
  definition: This segment includes companies that design handbags.
  notation: 111010101212
  valid from: 2020-10-03
source accessed on: 2023-07-03T18:11:29Z
source last accessed on: 2024-06-05T14:42:36Z
definition: This segment includes companies that design handbags.
notation: 111010101212
valid from: 2020-10-03

Bags, Leather Goods & Acc Design
type: BicsLevel5Segment
type: Classifier
type: NamedIndividual
is level5 segment of: Apparel, Footwear & Acc Design
is replaced by: Women's Apparel
created with: infer-bics.sql
derived from: Women's Apparel
  type: BicsLevel5Segment
  type: Classifier
  type: ContemporaryDerivation
  derived from: http://data.ga-group.nl/ics/bics/2014/1110101012
  source accessed on: 2019-12-03T20:05:01Z
  source last accessed on: 2019-12-03T20:05:01Z
  definition: This segment includes companies that design and market women's apparel products.
  notation: 1110101012
  valid from: 2014-08-08
  valid till: 2020-10-03
derived from: Bags & Leather Goods Design
  type: BicsLevel4SubIndustry
  type: Classifier
  type: AnachronousDerivation
  derived from: http://data.ga-group.nl/ics/bics/2014/11101012
  source accessed on: 2019-12-03T20:05:01Z
  source last accessed on: 2019-12-03T20:05:01Z
  definition: This industry subgroup includes companies that design and market luggage, personal leather goods and women's handbags products.
  notation: 11101012
  valid from: 2014-08-08
  valid till: 2020-10-03
derived from: Bags, Leather Goods & Acc Design
  type: BicsLevel5Segment
  type: Classifier
  type: ContemporaryDerivation
  derived from: http://data.ga-group.nl/ics/bics/2020/1110101012
  derived from: http://data.ga-group.nl/ics/bics/2024/1110101012
  source accessed on: 2023-07-03T18:11:29Z
  source last accessed on: 2024-06-05T14:42:36Z
  definition: This segment includes companies that design luggage, personal leather goods, and handbags.
  notation: 1110101012
  valid from: 2020-10-03
source accessed on: 2019-12-03T20:05:01Z
source last accessed on: 2024-06-05T14:42:36Z
definition: This segment includes companies that design luggage, personal leather goods, and handbags.
notation: 1110101012
valid from: 2014-08-08

Athletic Footwear
type: BicsLevel6Segment
type: Classifier
type: NamedIndividual
is level6 segment of: Footwear Design
replaces: Athletic Footwear
created with: infer-bics.sql
derived from: Athletic Footwear
  type: BicsLevel5Segment
  type: Classifier
  type: AnachronousDerivation
  derived from: http://data.ga-group.nl/ics/bics/2014/1110101310
  source accessed on: 2019-12-03T20:05:01Z
  source last accessed on: 2019-12-03T20:05:01Z
  definition: This segment includes companies that design and market athletic footwear products.
  notation: 1110101310
  valid from: 2014-08-08
  valid till: 2020-10-03
derived from: Athletic Footwear
  type: BicsLevel6Segment
  type: Classifier
  type: ContemporaryDerivation
  derived from: http://data.ga-group.nl/ics/bics/2020/111010101310
  derived from: http://data.ga-group.nl/ics/bics/2024/111010101310
  source accessed on: 2023-07-03T18:11:29Z
  source last accessed on: 2024-06-05T14:42:36Z
  definition: This segment includes companies that design footwear for athletic purposes, including specific sports or recreational activities.
  notation: 111010101310
  valid from: 2020-10-03
source accessed on: 2023-07-03T18:11:29Z
source last accessed on: 2024-06-05T14:42:36Z
definition: This segment includes companies that design footwear for athletic purposes, including specific sports or recreational activities.
notation: 111010101310
valid from: 2020-10-03

Men's Footwear
type: BicsLevel7Segment
type: Classifier
type: NamedIndividual
is level7 segment of: Non-Athletic Footwear
replaces: Men's Footwear
created with: infer-bics.sql
derived from: Men's Footwear
  type: BicsLevel6Segment
  type: Classifier
  type: AnachronousDerivation
  derived from: http://data.ga-group.nl/ics/bics/2014/111010131111
  source accessed on: 2019-12-03T20:05:01Z
  source last accessed on: 2019-12-03T20:05:01Z
  definition: This segment includes companies that design and market men's footwear products.
  notation: 111010131111
  valid from: 2014-08-08
  valid till: 2020-10-03
derived from: Men's Footwear
  type: BicsLevel7Segment
  type: Classifier
  type: ContemporaryDerivation
  derived from: http://data.ga-group.nl/ics/bics/2020/11101010131110
  derived from: http://data.ga-group.nl/ics/bics/2024/11101010131110
  source accessed on: 2023-07-03T18:11:29Z
  source last accessed on: 2024-06-05T14:42:36Z
  definition: This segment includes companies that design men's non-athletic footwear.
  notation: 11101010131110
  valid from: 2020-10-03
source accessed on: 2023-07-03T18:11:29Z
source last accessed on: 2024-06-05T14:42:36Z
definition: This segment includes companies that design men's non-athletic footwear.
notation: 11101010131110
valid from: 2020-10-03

Women's Footwear
type: BicsLevel7Segment
type: Classifier
type: NamedIndividual
is level7 segment of: Non-Athletic Footwear
replaces: Women's Footwear
created with: infer-bics.sql
derived from: Women's Footwear
  type: BicsLevel6Segment
  type: Classifier
  type: AnachronousDerivation
  derived from: http://data.ga-group.nl/ics/bics/2014/111010131112
  source accessed on: 2019-12-03T20:05:01Z
  source last accessed on: 2019-12-03T20:05:01Z
  definition: This segment includes companies that design and market women's footwear products.
  notation: 111010131112
  valid from: 2014-08-08
  valid till: 2020-10-03
derived from: Women's Footwear
  type: BicsLevel7Segment
  type: Classifier
  type: ContemporaryDerivation
  derived from: http://data.ga-group.nl/ics/bics/2020/11101010131111
  derived from: http://data.ga-group.nl/ics/bics/2024/11101010131111
  source accessed on: 2023-07-03T18:11:29Z
  source last accessed on: 2024-06-05T14:42:36Z
  definition: This segment includes companies that design women's non-athletic footwear.
  notation: 11101010131111
  valid from: 2020-10-03
source accessed on: 2023-07-03T18:11:29Z
source last accessed on: 2024-06-05T14:42:36Z
definition: This segment includes companies that design women's non-athletic footwear.
notation: 11101010131111
valid from: 2020-10-03

Non-Athletic Footwear
type: BicsLevel6Segment
type: Classifier
type: NamedIndividual
is level6 segment of: Footwear Design
replaces: Non-Athletic Footwear
created with: infer-bics.sql
derived from: Non-Athletic Footwear
  type: BicsLevel5Segment
  type: Classifier
  type: AnachronousDerivation
  derived from: http://data.ga-group.nl/ics/bics/2014/1110101311
  source accessed on: 2019-12-03T20:05:01Z
  source last accessed on: 2019-12-03T20:05:01Z
  definition: This segment includes companies that design and market house slippers as well as men's and women's footwear products.
  notation: 1110101311
  valid from: 2014-08-08
  valid till: 2020-10-03
derived from: Non-Athletic Footwear
  type: BicsLevel6Segment
  type: Classifier
  type: ContemporaryDerivation
  derived from: http://data.ga-group.nl/ics/bics/2020/111010101311
  derived from: http://data.ga-group.nl/ics/bics/2024/111010101311
  source accessed on: 2023-07-03T18:11:29Z
  source last accessed on: 2024-06-05T14:42:36Z
  definition: This segment includes companies that design footwear for fashion purposes.
  notation: 111010101311
  valid from: 2020-10-03
source accessed on: 2023-07-03T18:11:29Z
source last accessed on: 2024-06-05T14:42:36Z
definition: This segment includes companies that design footwear for fashion purposes.
notation: 111010101311
valid from: 2020-10-03

Footwear Design
type: BicsLevel5Segment
type: Classifier
type: NamedIndividual
is level5 segment of: Apparel, Footwear & Acc Design
is replaced by: Lingerie
created with: infer-bics.sql
derived from: Women's Lingerie
  type: BicsLevel5Segment
  type: Classifier
  type: ContemporaryDerivation
  derived from: http://data.ga-group.nl/ics/bics/2014/1110101013
  source accessed on: 2019-12-03T20:05:01Z
  source last accessed on: 2019-12-03T20:05:01Z
  definition: This segment includes companies that design and market women's lingerie products.
  notation: 1110101013
  valid from: 2014-08-08
  valid till: 2020-10-03
derived from: Footwear Design
  type: BicsLevel4SubIndustry
  type: Classifier
  type: AnachronousDerivation
  derived from: http://data.ga-group.nl/ics/bics/2014/11101013
  source accessed on: 2019-12-03T20:05:01Z
  source last accessed on: 2019-12-03T20:05:01Z
  definition: This industry subgroup includes companies that design and market athletic and non-athletic footwear products.
  notation: 11101013
  valid from: 2014-08-08
  valid till: 2020-10-03
derived from: Footwear Design
  type: BicsLevel5Segment
  type: Classifier
  type: ContemporaryDerivation
  derived from: http://data.ga-group.nl/ics/bics/2020/1110101013
  derived from: http://data.ga-group.nl/ics/bics/2024/1110101013
  source accessed on: 2023-07-03T18:11:29Z
  source last accessed on: 2024-06-05T14:42:36Z
  definition: This segment includes companies that design athletic and non-athletic footwear.
  notation: 1110101013
  valid from: 2020-10-03
source accessed on: 2019-12-03T20:05:01Z
source last accessed on: 2024-06-05T14:42:36Z
definition: This segment includes companies that design athletic and non-athletic footwear.
notation: 1110101013
valid from: 2014-08-08

Garment Outsourcing
type: BicsLevel5Segment
type: Classifier
type: NamedIndividual
is level5 segment of: Apparel, Footwear & Acc Design
created with: infer-bics.sql
derived from: Garment Outsourcing
  type: BicsLevel4SubIndustry
  type: Classifier
  type: AnachronousDerivation
  derived from: http://data.ga-group.nl/ics/bics/2014/11101014
  source accessed on: 2019-12-03T20:05:01Z
  source last accessed on: 2019-12-03T20:05:01Z
  definition: This industry subgroup includes companies that provide outsourced manufacturing services for apparel, footwear and accessory designers. These companies manufacture under other brand names.
  notation: 11101014
  valid from: 2014-08-08
  valid till: 2020-10-03
derived from: Garment Outsourcing
  type: BicsLevel5Segment
  type: Classifier
  type: ContemporaryDerivation
  derived from: http://data.ga-group.nl/ics/bics/2020/1110101014
  derived from: http://data.ga-group.nl/ics/bics/2024/1110101014
  source accessed on: 2023-07-03T18:11:29Z
  source last accessed on: 2024-06-05T14:42:36Z
  definition: This segment includes companies that provide outsourced manufacturing services for apparel, footwear, and accessory designers. These companies manufacture under other brand names.
  notation: 1110101014
  valid from: 2020-10-03
source accessed on: 2023-07-03T18:11:29Z
source last accessed on: 2024-06-05T14:42:36Z
definition: This segment includes companies that provide outsourced manufacturing services for apparel, footwear, and accessory designers. These companies manufacture under other brand names.
notation: 1110101014
valid from: 2020-10-03

Jewelry
type: BicsLevel6Segment
type: Classifier
type: NamedIndividual
is level6 segment of: Watch & Jewelry Design
replaces: Jewelry
created with: infer-bics.sql
derived from: Jewelry
  type: BicsLevel5Segment
  type: Classifier
  type: AnachronousDerivation
  derived from: http://data.ga-group.nl/ics/bics/2014/1110101610
  source accessed on: 2019-12-03T20:05:01Z
  source last accessed on: 2019-12-03T20:05:01Z
  definition: This segment includes companies that design, market and/or manufacture jewelry of all types.
  notation: 1110101610
  valid from: 2014-08-08
  valid till: 2020-10-03
derived from: Jewelry
  type: BicsLevel6Segment
  type: Classifier
  type: ContemporaryDerivation
  derived from: http://data.ga-group.nl/ics/bics/2020/111010101510
  derived from: http://data.ga-group.nl/ics/bics/2024/111010101510
  source accessed on: 2023-07-03T18:11:29Z
  source last accessed on: 2024-06-05T14:42:36Z
  definition: This segment includes companies that design, market, and/or manufacture jewelry of all types.
  notation: 111010101510
  valid from: 2020-10-03
source accessed on: 2023-07-03T18:11:29Z
source last accessed on: 2024-06-05T14:42:36Z
definition: This segment includes companies that design, market, and/or manufacture jewelry of all types.
notation: 111010101510
valid from: 2020-10-03

Watch
type: BicsLevel6Segment
type: Classifier
type: NamedIndividual
is level6 segment of: Watch & Jewelry Design
replaces: Watch
created with: infer-bics.sql
derived from: Watch
  type: BicsLevel5Segment
  type: Classifier
  type: AnachronousDerivation
  derived from: http://data.ga-group.nl/ics/bics/2014/1110101612
  source accessed on: 2019-12-03T20:05:01Z
  source last accessed on: 2019-12-03T20:05:01Z
  definition: This segment includes companies that design and market watches.
  notation: 1110101612
  valid from: 2014-08-08
  valid till: 2020-10-03
derived from: Watch
  type: BicsLevel6Segment
  type: Classifier
  type: ContemporaryDerivation
  derived from: http://data.ga-group.nl/ics/bics/2020/111010101511
  derived from: http://data.ga-group.nl/ics/bics/2024/111010101511
  source accessed on: 2023-07-03T18:11:29Z
  source last accessed on: 2024-06-05T14:42:36Z
  definition: This segment includes companies that design and market watches.
  notation: 111010101511
  valid from: 2020-10-03
source accessed on: 2023-07-03T18:11:29Z
source last accessed on: 2024-06-05T14:42:36Z
definition: This segment includes companies that design and market watches.
notation: 111010101511
valid from: 2020-10-03

Watch & Jewelry Design
type: BicsLevel5Segment
type: Classifier
type: NamedIndividual
is level5 segment of: Apparel, Footwear & Acc Design
created with: infer-bics.sql
derived from: Watch & Jewelry Design
  type: BicsLevel4SubIndustry
  type: Classifier
  type: AnachronousDerivation
  derived from: http://data.ga-group.nl/ics/bics/2014/11101016
  source accessed on: 2019-12-03T20:05:01Z
  source last accessed on: 2019-12-03T20:05:01Z
  definition: This industry subgroup includes companies that design and market watch and jewelry products.
  notation: 11101016
  valid from: 2014-08-08
  valid till: 2020-10-03
derived from: Watch & Jewelry Design
  type: BicsLevel5Segment
  type: Classifier
  type: ContemporaryDerivation
  derived from: http://data.ga-group.nl/ics/bics/2020/1110101015
  derived from: http://data.ga-group.nl/ics/bics/2024/1110101015
  source accessed on: 2023-07-03T18:11:29Z
  source last accessed on: 2024-06-05T14:42:36Z
  definition: This segment includes companies that design and market watches and jewelry.
  notation: 1110101015
  valid from: 2020-10-03
source accessed on: 2023-07-03T18:11:29Z
source last accessed on: 2024-06-05T14:42:36Z
definition: This segment includes companies that design and market watches and jewelry.
notation: 1110101015
valid from: 2020-10-03

Apparel, Footwear & Acc Design
type: BicsLevel4SubIndustry
type: Classifier
type: NamedIndividual
replaces: Apparel & Textile Products
created with: infer-bics.sql
derived from: Apparel, Footwear & Acc Design
  type: BicsLevel3Industry
  type: Classifier
  type: AnachronousDerivation
  derived from: http://data.ga-group.nl/ics/bics/2014/111010
  source accessed on: 2019-12-03T20:05:01Z
  source last accessed on: 2019-12-03T20:05:01Z
  definition: This industry includes companies that design and market apparel, footwear and accessories products. Excludes designers who own and operate their own retail store and the majority of their revenue comes from retail operations (see Specialty Apparel Stores).
  notation: 111010
  valid from: 2014-08-08
  valid till: 2020-10-03
derived from: Apparel Design
  type: BicsLevel4SubIndustry
  type: Classifier
  type: ContemporaryDerivation
  derived from: http://data.ga-group.nl/ics/bics/2014/11101010
  source accessed on: 2019-12-03T20:05:01Z
  source last accessed on: 2019-12-03T20:05:01Z
  definition: This industry subgroup includes companies that design and market men's, women's and children's apparel products.
  notation: 11101010
  valid from: 2014-08-08
  valid till: 2020-10-03
derived from: Apparel, Footwear & Acc Design
  type: BicsLevel4SubIndustry
  type: Classifier
  type: ContemporaryDerivation
  derived from: http://data.ga-group.nl/ics/bics/2020/11101010
  derived from: http://data.ga-group.nl/ics/bics/2024/11101010
  source accessed on: 2023-07-03T18:11:29Z
  source last accessed on: 2024-06-05T14:42:36Z
  definition: This industry subgroup includes companies that design and manufacturer apparel, footwear, and accessories. Excludes designers who own and operate their own retail store and the majority of their revenue comes from retail operations (see Specialty Apparel Stores).
  notation: 11101010
  valid from: 2020-10-03
source accessed on: 2019-12-03T20:05:01Z
source last accessed on: 2024-06-05T14:42:36Z
definition: This industry subgroup includes companies that design and manufacturer apparel, footwear, and accessories. Excludes designers who own and operate their own retail store and the majority of their revenue comes from retail operations (see Specialty Apparel Stores).
notation: 11101010
valid from: 2014-08-08

Leather, Hide Tan & Finishing
type: BicsLevel5Segment
type: Classifier
type: NamedIndividual
is level5 segment of: Textile & Textile Products
created with: infer-bics.sql
derived from: Leather, Hide Tan & Finishing
  type: BicsLevel4SubIndustry
  type: Classifier
  type: AnachronousDerivation
  derived from: http://data.ga-group.nl/ics/bics/2014/11101110
  source accessed on: 2019-12-03T20:05:01Z
  source last accessed on: 2019-12-03T20:05:01Z
  definition: This industry subgroup includes companies that create leather from hides and skins.
  notation: 11101110
  valid from: 2014-08-08
  valid till: 2020-10-03
derived from: Leather, Hide Tan & Finishing
  type: BicsLevel5Segment
  type: Classifier
  type: ContemporaryDerivation
  derived from: http://data.ga-group.nl/ics/bics/2020/1110101110
  derived from: http://data.ga-group.nl/ics/bics/2024/1110101110
  source accessed on: 2023-07-03T18:11:29Z
  source last accessed on: 2024-06-05T14:42:36Z
  definition: This segment includes companies that create leather from hides and skins.
  notation: 1110101110
  valid from: 2020-10-03
source accessed on: 2023-07-03T18:11:29Z
source last accessed on: 2024-06-05T14:42:36Z
definition: This segment includes companies that create leather from hides and skins.
notation: 1110101110
valid from: 2020-10-03

Fabric Coating Mills
type: BicsLevel7Segment
type: Classifier
type: NamedIndividual
is level7 segment of: Fabric Finishing
replaces: Fabric Coating Mills
created with: infer-bics.sql
derived from: Fabric Coating Mills
  type: BicsLevel6Segment
  type: Classifier
  type: AnachronousDerivation
  derived from: http://data.ga-group.nl/ics/bics/2014/111011111010
  source accessed on: 2019-12-03T20:05:01Z
  source last accessed on: 2019-12-03T20:05:01Z
  definition: This segment includes companies that provide fabric coating, such as coating fabrics in wax to improve strength.
  notation: 111011111010
  valid from: 2014-08-08
  valid till: 2020-10-03
derived from: Fabric Coating Mills
  type: BicsLevel7Segment
  type: Classifier
  type: ContemporaryDerivation
  derived from: http://data.ga-group.nl/ics/bics/2020/11101011111010
  derived from: http://data.ga-group.nl/ics/bics/2024/11101011111010
  source accessed on: 2023-07-03T18:11:29Z
  source last accessed on: 2024-06-05T14:42:36Z
  definition: This segment includes companies that provide fabric coating, such as coating fabrics in wax to improve strength.
  notation: 11101011111010
  valid from: 2020-10-03
source accessed on: 2023-07-03T18:11:29Z
source last accessed on: 2024-06-05T14:42:36Z
definition: This segment includes companies that provide fabric coating, such as coating fabrics in wax to improve strength.
notation: 11101011111010
valid from: 2020-10-03

Nonwoven Textile & Fabric Finish
type: BicsLevel7Segment
type: Classifier
type: NamedIndividual
is level7 segment of: Fabric Finishing
replaces: Nonwoven Textile & Fabric Finish
created with: infer-bics.sql
derived from: Nonwoven Textile & Fabric Finish
  type: BicsLevel6Segment
  type: Classifier
  type: AnachronousDerivation
  derived from: http://data.ga-group.nl/ics/bics/2014/111011111011
  source accessed on: 2019-12-03T20:05:01Z
  source last accessed on: 2019-12-03T20:05:01Z
  definition: This segment includes companies that provide finishing touches to non-fabric textile products.
  notation: 111011111011
  valid from: 2014-08-08
  valid till: 2020-10-03
derived from: Nonwoven Textile & Fabric Finish
  type: BicsLevel7Segment
  type: Classifier
  type: ContemporaryDerivation
  derived from: http://data.ga-group.nl/ics/bics/2020/11101011111011
  derived from: http://data.ga-group.nl/ics/bics/2024/11101011111011
  source accessed on: 2023-07-03T18:11:29Z
  source last accessed on: 2024-06-05T14:42:36Z
  definition: This segment includes companies that provide finishing touches to non-fabric textile products.
  notation: 11101011111011
  valid from: 2020-10-03
source accessed on: 2023-07-03T18:11:29Z
source last accessed on: 2024-06-05T14:42:36Z
definition: This segment includes companies that provide finishing touches to non-fabric textile products.
notation: 11101011111011
valid from: 2020-10-03

Woven Fabric Finishing Mills
type: BicsLevel7Segment
type: Classifier
type: NamedIndividual
is level7 segment of: Fabric Finishing
replaces: Woven Fabric Finishing Mills
created with: infer-bics.sql
derived from: Woven Fabric Finishing Mills
  type: BicsLevel6Segment
  type: Classifier
  type: AnachronousDerivation
  derived from: http://data.ga-group.nl/ics/bics/2014/111011111012
  source accessed on: 2019-12-03T20:05:01Z
  source last accessed on: 2019-12-03T20:05:01Z
  definition: This segment includes companies that finish woven fabrics by providing basic stitching and other finishing touches.
  notation: 111011111012
  valid from: 2014-08-08
  valid till: 2020-10-03
derived from: Woven Fabric Finishing Mills
  type: BicsLevel7Segment
  type: Classifier
  type: ContemporaryDerivation
  derived from: http://data.ga-group.nl/ics/bics/2020/11101011111012
  derived from: http://data.ga-group.nl/ics/bics/2024/11101011111012
  source accessed on: 2023-07-03T18:11:29Z
  source last accessed on: 2024-06-05T14:42:36Z
  definition: This segment includes companies that finish woven fabrics by providing basic stitching and other finishing touches.
  notation: 11101011111012
  valid from: 2020-10-03
source accessed on: 2023-07-03T18:11:29Z
source last accessed on: 2024-06-05T14:42:36Z
definition: This segment includes companies that finish woven fabrics by providing basic stitching and other finishing touches.
notation: 11101011111012
valid from: 2020-10-03

Fabric Finishing
type: BicsLevel6Segment
type: Classifier
type: NamedIndividual
is level6 segment of: Textile
replaces: Alternative Vehicle Parts
created with: infer-bics.sql
derived from: Fabric Finishing
  type: BicsLevel5Segment
  type: Classifier
  type: AnachronousDerivation
  derived from: http://data.ga-group.nl/ics/bics/2014/1110111110
  source accessed on: 2019-12-03T20:05:01Z
  source last accessed on: 2019-12-03T20:05:01Z
  definition: This segment includes mills that finish fabric, which may involve stitching or coating of fabric or other textiles.
  notation: 1110111110
  valid from: 2014-08-08
  valid till: 2020-10-03
derived from: Fabric Finishing
  type: BicsLevel6Segment
  type: Classifier
  type: ContemporaryDerivation
  derived from: http://data.ga-group.nl/ics/bics/2020/111010111110
  derived from: http://data.ga-group.nl/ics/bics/2024/111010111110
  source accessed on: 2023-07-03T18:11:29Z
  source last accessed on: 2024-06-05T14:42:36Z
  definition: This segment includes mills that finish fabric, which may involve stitching or coating of fabric or other textiles.
  notation: 111010111110
  valid from: 2020-10-03
source accessed on: 2023-07-03T18:11:29Z
source last accessed on: 2024-06-05T14:42:36Z
definition: This segment includes mills that finish fabric, which may involve stitching or coating of fabric or other textiles.
notation: 111010111110
valid from: 2020-10-03

Nonwoven Fabric Mill
type: BicsLevel7Segment
type: Classifier
type: NamedIndividual
is level7 segment of: Fabric
replaces: Auto Light Equipment
created with: infer-bics.sql
derived from: Nonwoven Fabric Mill
  type: BicsLevel6Segment
  type: Classifier
  type: AnachronousDerivation
  derived from: http://data.ga-group.nl/ics/bics/2014/111011111110
  source accessed on: 2019-12-03T20:05:01Z
  source last accessed on: 2019-12-03T20:05:01Z
  definition: This segment includes mills that manufacture nonwoven fabric material. Nonwoven fabric is created by thermal, mechanical or chemical bonding rather than weaving or knitting. Nonwoven fabric materials are used in a host of industries not limited to apparel and textile products.
  notation: 111011111110
  valid from: 2014-08-08
  valid till: 2020-10-03
derived from: Nonwoven Fabric Mill
  type: BicsLevel7Segment
  type: Classifier
  type: ContemporaryDerivation
  derived from: http://data.ga-group.nl/ics/bics/2020/11101011111110
  source accessed on: 2023-07-03T18:11:29Z
  source last accessed on: 2023-07-03T18:11:29Z
  definition: This segment includes mills that manufacture nonwoven fabric material.
  notation: 11101011111110
  valid from: 2020-10-03
  valid till: 2024-06-07
derived from: Nonwoven Fabric Mill
  type: BicsLevel7Segment
  type: Classifier
  type: ContemporaryDerivation
  derived from: http://data.ga-group.nl/ics/bics/2024/11101011111110
  source accessed on: 2024-06-05T14:42:36Z
  source last accessed on: 2024-06-05T14:42:36Z
  definition: This segment includes mills that manufacture nonwoven fabric material. Nonwoven fabric is created by thermal, mechanical or chemical bonding rather than weaving or knitting.
  notation: 11101011111110
  valid from: 2024-06-07
source accessed on: 2023-07-03T18:11:29Z
source last accessed on: 2024-06-05T14:42:36Z
definition: This segment includes mills that manufacture nonwoven fabric material. Nonwoven fabric is created by thermal, mechanical or chemical bonding rather than weaving or knitting.
notation: 11101011111110
valid from: 2020-10-03

Woven Fabric Mills
type: BicsLevel7Segment
type: Classifier
type: NamedIndividual
is level7 segment of: Fabric
replaces: Auto Electronics
created with: infer-bics.sql
derived from: Woven Fabric Mills
  type: BicsLevel6Segment
  type: Classifier
  type: AnachronousDerivation
  derived from: http://data.ga-group.nl/ics/bics/2014/111011111111
  source accessed on: 2019-12-03T20:05:01Z
  source last accessed on: 2019-12-03T20:05:01Z
  definition: This segment includes companies that take fiber, yarn and thread and weave them into fabrics used to make garments.
  notation: 111011111111
  valid from: 2014-08-08
  valid till: 2020-10-03
derived from: Woven Fabric Mills
  type: BicsLevel7Segment
  type: Classifier
  type: ContemporaryDerivation
  derived from: http://data.ga-group.nl/ics/bics/2020/11101011111111
  derived from: http://data.ga-group.nl/ics/bics/2024/11101011111111
  source accessed on: 2023-07-03T18:11:29Z
  source last accessed on: 2024-06-05T14:42:36Z
  definition: This segment includes companies that take fiber, yarn, and thread and weave them into fabrics used to make garments.
  notation: 11101011111111
  valid from: 2020-10-03
source accessed on: 2023-07-03T18:11:29Z
source last accessed on: 2024-06-05T14:42:36Z
definition: This segment includes companies that take fiber, yarn, and thread and weave them into fabrics used to make garments.
notation: 11101011111111
valid from: 2020-10-03

Fabric
type: BicsLevel6Segment
type: Classifier
type: NamedIndividual
is level6 segment of: Textile
replaces: Auto Electrical & Electronics
created with: infer-bics.sql
derived from: Fabric
  type: BicsLevel5Segment
  type: Classifier
  type: AnachronousDerivation
  derived from: http://data.ga-group.nl/ics/bics/2014/1110111111
  source accessed on: 2019-12-03T20:05:01Z
  source last accessed on: 2019-12-03T20:05:01Z
  definition: This segment includes mills that produce fabric or cloth used to make garments or other textile products.
  notation: 1110111111
  valid from: 2014-08-08
  valid till: 2020-10-03
derived from: Fabric
  type: BicsLevel6Segment
  type: Classifier
  type: ContemporaryDerivation
  derived from: http://data.ga-group.nl/ics/bics/2020/111010111111
  derived from: http://data.ga-group.nl/ics/bics/2024/111010111111
  source accessed on: 2023-07-03T18:11:29Z
  source last accessed on: 2024-06-05T14:42:36Z
  definition: This segment includes mills that produce fabric or cloth used to make garments or other textile products.
  notation: 111010111111
  valid from: 2020-10-03
source accessed on: 2023-07-03T18:11:29Z
source last accessed on: 2024-06-05T14:42:36Z
definition: This segment includes mills that produce fabric or cloth used to make garments or other textile products.
notation: 111010111111
valid from: 2020-10-03

Synthetic Fiber & Thread
type: BicsLevel7Segment
type: Classifier
type: NamedIndividual
is level7 segment of: Fiber, Yarn & Thread
replaces: Synthetic Fiber & Thread
created with: infer-bics.sql
derived from: Synthetic Fiber & Thread
  type: BicsLevel6Segment
  type: Classifier
  type: AnachronousDerivation
  derived from: http://data.ga-group.nl/ics/bics/2014/111011111210
  source accessed on: 2019-12-03T20:05:01Z
  source last accessed on: 2019-12-03T20:05:01Z
  definition: This segment includes companies that manufacture synthetic fibers and threads, such as polyester, nylon and acrylics, among others. These synthetic materials are used in a host of industries not limited to apparel and textile products.
  notation: 111011111210
  valid from: 2014-08-08
  valid till: 2020-10-03
derived from: Synthetic Fiber & Thread
  type: BicsLevel7Segment
  type: Classifier
  type: ContemporaryDerivation
  derived from: http://data.ga-group.nl/ics/bics/2020/11101011111210
  derived from: http://data.ga-group.nl/ics/bics/2024/11101011111210
  source accessed on: 2023-07-03T18:11:29Z
  source last accessed on: 2024-06-05T14:42:36Z
  definition: This segment includes companies that manufacture synthetic fibers and threads, such as polyester, nylon, and acrylics.
  notation: 11101011111210
  valid from: 2020-10-03
source accessed on: 2023-07-03T18:11:29Z
source last accessed on: 2024-06-05T14:42:36Z
definition: This segment includes companies that manufacture synthetic fibers and threads, such as polyester, nylon, and acrylics.
notation: 11101011111210
valid from: 2020-10-03

Thread Mills
type: BicsLevel7Segment
type: Classifier
type: NamedIndividual
is level7 segment of: Fiber, Yarn & Thread
replaces: Thread Mills
created with: infer-bics.sql
derived from: Thread Mills
  type: BicsLevel6Segment
  type: Classifier
  type: AnachronousDerivation
  derived from: http://data.ga-group.nl/ics/bics/2014/111011111211
  source accessed on: 2019-12-03T20:05:01Z
  source last accessed on: 2019-12-03T20:05:01Z
  definition: This segment includes companies that produce threads, which are a thin type of yarn used to stitch fabrics.
  notation: 111011111211
  valid from: 2014-08-08
  valid till: 2020-10-03
derived from: Thread Mills
  type: BicsLevel7Segment
  type: Classifier
  type: ContemporaryDerivation
  derived from: http://data.ga-group.nl/ics/bics/2020/11101011111211
  derived from: http://data.ga-group.nl/ics/bics/2024/11101011111211
  source accessed on: 2023-07-03T18:11:29Z
  source last accessed on: 2024-06-05T14:42:36Z
  definition: This segment includes companies that produce threads, a thin type of yarn used to stitch fabrics.
  notation: 11101011111211
  valid from: 2020-10-03
source accessed on: 2023-07-03T18:11:29Z
source last accessed on: 2024-06-05T14:42:36Z
definition: This segment includes companies that produce threads, a thin type of yarn used to stitch fabrics.
notation: 11101011111211
valid from: 2020-10-03

Yarn Spinning Mills
type: BicsLevel7Segment
type: Classifier
type: NamedIndividual
is level7 segment of: Fiber, Yarn & Thread
replaces: Yarn Spinning Mills
created with: infer-bics.sql
derived from: Yarn Spinning Mills
  type: BicsLevel6Segment
  type: Classifier
  type: AnachronousDerivation
  derived from: http://data.ga-group.nl/ics/bics/2014/111011111212
  source accessed on: 2019-12-03T20:05:01Z
  source last accessed on: 2019-12-03T20:05:01Z
  definition: This segment includes companies that spin yarn from the fiber materials, such as cotton.
  notation: 111011111212
  valid from: 2014-08-08
  valid till: 2020-10-03
derived from: Yarn Spinning Mills
  type: BicsLevel7Segment
  type: Classifier
  type: ContemporaryDerivation
  derived from: http://data.ga-group.nl/ics/bics/2020/11101011111212
  derived from: http://data.ga-group.nl/ics/bics/2024/11101011111212
  source accessed on: 2023-07-03T18:11:29Z
  source last accessed on: 2024-06-05T14:42:36Z
  definition: This segment includes companies that spin yarn from fiber materials, such as cotton.
  notation: 11101011111212
  valid from: 2020-10-03
source accessed on: 2023-07-03T18:11:29Z
source last accessed on: 2024-06-05T14:42:36Z
definition: This segment includes companies that spin yarn from fiber materials, such as cotton.
notation: 11101011111212
valid from: 2020-10-03

Yarn Texturizing, Throw & Twist
type: BicsLevel7Segment
type: Classifier
type: NamedIndividual
is level7 segment of: Fiber, Yarn & Thread
replaces: Yarn Texturizing, Throw & Twist
created with: infer-bics.sql
derived from: Yarn Texturizing, Throw & Twist
  type: BicsLevel6Segment
  type: Classifier
  type: AnachronousDerivation
  derived from: http://data.ga-group.nl/ics/bics/2014/111011111213
  source accessed on: 2019-12-03T20:05:01Z
  source last accessed on: 2019-12-03T20:05:01Z
  definition: This segment includes companies that texturize yarn, which is a process in which multiple filament yarns are combined to create a strong, spun yarn.
  notation: 111011111213
  valid from: 2014-08-08
  valid till: 2020-10-03
derived from: Yarn Texturizing, Throw & Twist
  type: BicsLevel7Segment
  type: Classifier
  type: ContemporaryDerivation
  derived from: http://data.ga-group.nl/ics/bics/2020/11101011111213
  source accessed on: 2023-07-03T18:11:29Z
  source last accessed on: 2023-07-03T18:11:29Z
  definition: This segment includes companies that texturize yarn.
  notation: 11101011111213
  valid from: 2020-10-03
  valid till: 2024-06-07
derived from: Yarn Texturizing, Throw & Twist
  type: BicsLevel7Segment
  type: Classifier
  type: ContemporaryDerivation
  derived from: http://data.ga-group.nl/ics/bics/2024/11101011111213
  source accessed on: 2024-06-05T14:42:36Z
  source last accessed on: 2024-06-05T14:42:36Z
  definition: This segment includes companies that texturize yarn, which is a process in which multiple filament yarns are combined to create a strong, spun yarn.
  notation: 11101011111213
  valid from: 2024-06-07
source accessed on: 2023-07-03T18:11:29Z
source last accessed on: 2024-06-05T14:42:36Z
definition: This segment includes companies that texturize yarn, which is a process in which multiple filament yarns are combined to create a strong, spun yarn.
notation: 11101011111213
valid from: 2020-10-03

Fiber, Yarn & Thread
type: BicsLevel6Segment
type: Classifier
type: NamedIndividual
is level6 segment of: Textile
replaces: Auto Glass
created with: infer-bics.sql
derived from: Fiber, Yarn & Thread
  type: BicsLevel5Segment
  type: Classifier
  type: AnachronousDerivation
  derived from: http://data.ga-group.nl/ics/bics/2014/1110111112
  source accessed on: 2019-12-03T20:05:01Z
  source last accessed on: 2019-12-03T20:05:01Z
  definition: This segment includes mills that spin, throw and manufacture yarns, threads and fibers that can then be woven into fabric.
  notation: 1110111112
  valid from: 2014-08-08
  valid till: 2020-10-03
derived from: Fiber, Yarn & Thread
  type: BicsLevel6Segment
  type: Classifier
  type: ContemporaryDerivation
  derived from: http://data.ga-group.nl/ics/bics/2020/111010111112
  derived from: http://data.ga-group.nl/ics/bics/2024/111010111112
  source accessed on: 2023-07-03T18:11:29Z
  source last accessed on: 2024-06-05T14:42:36Z
  definition: This segment includes mills that spin, throw, or manufacture yarns, threads, or fibers.
  notation: 111010111112
  valid from: 2020-10-03
source accessed on: 2023-07-03T18:11:29Z
source last accessed on: 2024-06-05T14:42:36Z
definition: This segment includes mills that spin, throw, or manufacture yarns, threads, or fibers.
notation: 111010111112
valid from: 2020-10-03

Textile
type: BicsLevel5Segment
type: Classifier
type: NamedIndividual
is level5 segment of: Textile & Textile Products
created with: infer-bics.sql
derived from: Textile
  type: BicsLevel4SubIndustry
  type: Classifier
  type: AnachronousDerivation
  derived from: http://data.ga-group.nl/ics/bics/2014/11101111
  source accessed on: 2019-12-03T20:05:01Z
  source last accessed on: 2019-12-03T20:05:01Z
  definition: This industry subgroup includes mills that manufacture and finish textiles.
  notation: 11101111
  valid from: 2014-08-08
  valid till: 2020-10-03
derived from: Textile
  type: BicsLevel5Segment
  type: Classifier
  type: ContemporaryDerivation
  derived from: http://data.ga-group.nl/ics/bics/2020/1110101111
  derived from: http://data.ga-group.nl/ics/bics/2024/1110101111
  source accessed on: 2023-07-03T18:11:29Z
  source last accessed on: 2024-06-05T14:42:36Z
  definition: This segment includes mills that manufacture and finish textiles.
  notation: 1110101111
  valid from: 2020-10-03
source accessed on: 2023-07-03T18:11:29Z
source last accessed on: 2024-06-05T14:42:36Z
definition: This segment includes mills that manufacture and finish textiles.
notation: 1110101111
valid from: 2020-10-03

Canvas & Related Prods Mills
type: BicsLevel6Segment
type: Classifier
type: NamedIndividual
is level6 segment of: Textile Products
replaces: Canvas & Related Prods Mills
created with: infer-bics.sql
derived from: Canvas & Related Prods Mills
  type: BicsLevel6Segment
  type: Classifier
  type: AnachronousDerivation
  derived from: http://data.ga-group.nl/ics/bics/2014/111011121110
  source accessed on: 2019-12-03T20:05:01Z
  source last accessed on: 2019-12-03T20:05:01Z
  definition: This segment includes companies that produce canvas products.
  notation: 111011121110
  valid from: 2014-08-08
  valid till: 2020-10-03
derived from: Canvas & Related Prods Mills
  type: BicsLevel6Segment
  type: Classifier
  type: ContemporaryDerivation
  derived from: http://data.ga-group.nl/ics/bics/2020/111010111210
  derived from: http://data.ga-group.nl/ics/bics/2024/111010111210
  source accessed on: 2023-07-03T18:11:29Z
  source last accessed on: 2024-06-05T14:42:36Z
  definition: This segment includes companies that produce canvas products.
  notation: 111010111210
  valid from: 2020-10-03
source accessed on: 2023-07-03T18:11:29Z
source last accessed on: 2024-06-05T14:42:36Z
definition: This segment includes companies that produce canvas products.
notation: 111010111210
valid from: 2020-10-03

Cotton Farming
type: BicsLevel6Segment
type: Classifier
type: NamedIndividual
is level6 segment of: Textile Products
replaces: Cotton Farming
created with: infer-bics.sql
derived from: Cotton Farming
  type: BicsLevel6Segment
  type: Classifier
  type: AnachronousDerivation
  derived from: http://data.ga-group.nl/ics/bics/2014/111011121111
  source accessed on: 2019-12-03T20:05:01Z
  source last accessed on: 2019-12-03T20:05:01Z
  definition: This segment includes companies that grow cotton plants.
  notation: 111011121111
  valid from: 2014-08-08
  valid till: 2020-10-03
derived from: Cotton Farming
  type: BicsLevel6Segment
  type: Classifier
  type: ContemporaryDerivation
  derived from: http://data.ga-group.nl/ics/bics/2020/111010111211
  derived from: http://data.ga-group.nl/ics/bics/2024/111010111211
  source accessed on: 2023-07-03T18:11:29Z
  source last accessed on: 2024-06-05T14:42:36Z
  definition: This segment includes companies that grow cotton plants.
  notation: 111010111211
  valid from: 2020-10-03
source accessed on: 2023-07-03T18:11:29Z
source last accessed on: 2024-06-05T14:42:36Z
definition: This segment includes companies that grow cotton plants.
notation: 111010111211
valid from: 2020-10-03

Rope, Cordage & Twine Mills
type: BicsLevel6Segment
type: Classifier
type: NamedIndividual
is level6 segment of: Textile Products
replaces: Rope, Cordage & Twine Mills
created with: infer-bics.sql
derived from: Rope, Cordage & Twine Mills
  type: BicsLevel6Segment
  type: Classifier
  type: AnachronousDerivation
  derived from: http://data.ga-group.nl/ics/bics/2014/111011121112
  source accessed on: 2019-12-03T20:05:01Z
  source last accessed on: 2019-12-03T20:05:01Z
  definition: This segment includes companies that spin fibers into rope, cordage or twine.
  notation: 111011121112
  valid from: 2014-08-08
  valid till: 2020-10-03
derived from: Rope, Cordage & Twine Mills
  type: BicsLevel6Segment
  type: Classifier
  type: ContemporaryDerivation
  derived from: http://data.ga-group.nl/ics/bics/2020/111010111212
  derived from: http://data.ga-group.nl/ics/bics/2024/111010111212
  source accessed on: 2023-07-03T18:11:29Z
  source last accessed on: 2024-06-05T14:42:36Z
  definition: This segment includes companies that spin fibers into rope, cordage, or twine.
  notation: 111010111212
  valid from: 2020-10-03
source accessed on: 2023-07-03T18:11:29Z
source last accessed on: 2024-06-05T14:42:36Z
definition: This segment includes companies that spin fibers into rope, cordage, or twine.
notation: 111010111212
valid from: 2020-10-03

Textile Bag Mills
type: BicsLevel6Segment
type: Classifier
type: NamedIndividual
is level6 segment of: Textile Products
replaces: Textile Bag Mills
created with: infer-bics.sql
derived from: Textile Bag Mills
  type: BicsLevel6Segment
  type: Classifier
  type: AnachronousDerivation
  derived from: http://data.ga-group.nl/ics/bics/2014/111011121113
  source accessed on: 2019-12-03T20:05:01Z
  source last accessed on: 2019-12-03T20:05:01Z
  definition: This segment includes companies that manufacture textile bags. This is primarily comprised of non-branded bags, such as generic brown bags used for bulk transport of grains and other substances.
  notation: 111011121113
  valid from: 2014-08-08
  valid till: 2020-10-03
derived from: Textile Bag Mills
  type: BicsLevel6Segment
  type: Classifier
  type: ContemporaryDerivation
  derived from: http://data.ga-group.nl/ics/bics/2020/111010111213
  derived from: http://data.ga-group.nl/ics/bics/2024/111010111213
  source accessed on: 2023-07-03T18:11:29Z
  source last accessed on: 2024-06-05T14:42:36Z
  definition: This segment includes companies that manufacture textile bags.
  notation: 111010111213
  valid from: 2020-10-03
source accessed on: 2023-07-03T18:11:29Z
source last accessed on: 2024-06-05T14:42:36Z
definition: This segment includes companies that manufacture textile bags.
notation: 111010111213
valid from: 2020-10-03

Tire Cord & Tire Fabrics Mills
type: BicsLevel6Segment
type: Classifier
type: NamedIndividual
is level6 segment of: Textile Products
replaces: Tire Cord & Tire Fabrics Mills
created with: infer-bics.sql
derived from: Tire Cord & Tire Fabrics Mills
  type: BicsLevel6Segment
  type: Classifier
  type: AnachronousDerivation
  derived from: http://data.ga-group.nl/ics/bics/2014/111011121114
  source accessed on: 2019-12-03T20:05:01Z
  source last accessed on: 2019-12-03T20:05:01Z
  definition: This segment includes companies that produce tire cord.
  notation: 111011121114
  valid from: 2014-08-08
  valid till: 2020-10-03
derived from: Tire Cord & Tire Fabrics Mills
  type: BicsLevel6Segment
  type: Classifier
  type: ContemporaryDerivation
  derived from: http://data.ga-group.nl/ics/bics/2020/111010111214
  derived from: http://data.ga-group.nl/ics/bics/2024/111010111214
  source accessed on: 2023-07-03T18:11:29Z
  source last accessed on: 2024-06-05T14:42:36Z
  definition: This segment includes companies that produce tire cord.
  notation: 111010111214
  valid from: 2020-10-03
source accessed on: 2023-07-03T18:11:29Z
source last accessed on: 2024-06-05T14:42:36Z
definition: This segment includes companies that produce tire cord.
notation: 111010111214
valid from: 2020-10-03

Textile Products
type: BicsLevel5Segment
type: Classifier
type: NamedIndividual
is level5 segment of: Textile & Textile Products
created with: infer-bics.sql
derived from: Textile Products
  type: BicsLevel4SubIndustry
  type: Classifier
  type: AnachronousDerivation
  derived from: http://data.ga-group.nl/ics/bics/2014/11101112
  source accessed on: 2019-12-03T20:05:01Z
  source last accessed on: 2019-12-03T20:05:01Z
  definition: This industry subgroup includes companies that produce finished, non-apparel textile products.
  notation: 11101112
  valid from: 2014-08-08
  valid till: 2020-10-03
derived from: Textile Products
  type: BicsLevel5Segment
  type: Classifier
  type: ContemporaryDerivation
  derived from: http://data.ga-group.nl/ics/bics/2020/1110101112
  derived from: http://data.ga-group.nl/ics/bics/2024/1110101112
  source accessed on: 2023-07-03T18:11:29Z
  source last accessed on: 2024-06-05T14:42:36Z
  definition: This segment includes companies that produce finished, non-apparel textile products.
  notation: 1110101112
  valid from: 2020-10-03
source accessed on: 2023-07-03T18:11:29Z
source last accessed on: 2024-06-05T14:42:36Z
definition: This segment includes companies that produce finished, non-apparel textile products.
notation: 1110101112
valid from: 2020-10-03

Textile & Textile Products
type: BicsLevel4SubIndustry
type: Classifier
type: NamedIndividual
replaces: Automotive
created with: infer-bics.sql
derived from: Apparel Brand Licensing
  type: BicsLevel4SubIndustry
  type: Classifier
  type: ContemporaryDerivation
  derived from: http://data.ga-group.nl/ics/bics/2014/11101011
  source accessed on: 2019-12-03T20:05:01Z
  source last accessed on: 2019-12-03T20:05:01Z
  definition: This industry subgroup includes companies that design and market apparel, footwear and accessories products.
  notation: 11101011
  valid from: 2014-08-08
  valid till: 2020-10-03
derived from: Textile & Textile Products
  type: BicsLevel3Industry
  type: Classifier
  type: AnachronousDerivation
  derived from: http://data.ga-group.nl/ics/bics/2014/111011
  source accessed on: 2019-12-03T20:05:01Z
  source last accessed on: 2019-12-03T20:05:01Z
  definition: This industry includes companies that produce textiles, such as yarns, threads, fabrics and leather goods.
  notation: 111011
  valid from: 2014-08-08
  valid till: 2020-10-03
derived from: Textile & Textile Products
  type: BicsLevel4SubIndustry
  type: Classifier
  type: ContemporaryDerivation
  derived from: http://data.ga-group.nl/ics/bics/2020/11101011
  derived from: http://data.ga-group.nl/ics/bics/2024/11101011
  source accessed on: 2023-07-03T18:11:29Z
  source last accessed on: 2024-06-05T14:42:36Z
  definition: This industry subgroup includes companies that produce textiles, such as yarns, threads, fabrics, and leather.
  notation: 11101011
  valid from: 2020-10-03
source accessed on: 2019-12-03T20:05:01Z
source last accessed on: 2024-06-05T14:42:36Z
definition: This industry subgroup includes companies that produce textiles, such as yarns, threads, fabrics, and leather.
notation: 11101011
valid from: 2014-08-08

Luggage
type: BicsLevel5Segment
type: Classifier
type: NamedIndividual
is level5 segment of: Bags & Leather Goods Design
is replaced by: Luggage
created with: infer-bics.sql
derived from: Luggage
  type: BicsLevel5Segment
  type: Classifier
  type: ContemporaryDerivation
  derived from: http://data.ga-group.nl/ics/bics/2014/1110101210
  source accessed on: 2019-12-03T20:05:01Z
  source last accessed on: 2019-12-03T20:05:01Z
  definition: This segment includes companies that design and market luggage products.
  notation: 1110101210
  valid from: 2014-08-08
  valid till: 2020-10-03
source accessed on: 2019-12-03T20:05:01Z
source last accessed on: 2019-12-03T20:05:01Z
definition: This segment includes companies that design and market luggage products.
notation: 1110101210
valid from: 2014-08-08
valid till: 2020-10-03

Personal Leather Goods
type: BicsLevel5Segment
type: Classifier
type: NamedIndividual
is level5 segment of: Bags & Leather Goods Design
is replaced by: Personal Leather Goods
created with: infer-bics.sql
derived from: Personal Leather Goods
  type: BicsLevel5Segment
  type: Classifier
  type: ContemporaryDerivation
  derived from: http://data.ga-group.nl/ics/bics/2014/1110101211
  source accessed on: 2019-12-03T20:05:01Z
  source last accessed on: 2019-12-03T20:05:01Z
  definition: This segment includes companies that design and market personal leather good products.
  notation: 1110101211
  valid from: 2014-08-08
  valid till: 2020-10-03
source accessed on: 2019-12-03T20:05:01Z
source last accessed on: 2019-12-03T20:05:01Z
definition: This segment includes companies that design and market personal leather good products.
notation: 1110101211
valid from: 2014-08-08
valid till: 2020-10-03

Women's Handbag
type: BicsLevel5Segment
type: Classifier
type: NamedIndividual
is level5 segment of: Bags & Leather Goods Design
is replaced by: Handbags & Purses
created with: infer-bics.sql
derived from: Women's Handbag
  type: BicsLevel5Segment
  type: Classifier
  type: ContemporaryDerivation
  derived from: http://data.ga-group.nl/ics/bics/2014/1110101212
  source accessed on: 2019-12-03T20:05:01Z
  source last accessed on: 2019-12-03T20:05:01Z
  definition: This segment includes companies that design and market women's handbags products.
  notation: 1110101212
  valid from: 2014-08-08
  valid till: 2020-10-03
source accessed on: 2019-12-03T20:05:01Z
source last accessed on: 2019-12-03T20:05:01Z
definition: This segment includes companies that design and market women's handbags products.
notation: 1110101212
valid from: 2014-08-08
valid till: 2020-10-03

Bags & Leather Goods Design
type: BicsLevel4SubIndustry
type: Classifier
type: NamedIndividual
created with: infer-bics.sql
derived from: Bags & Leather Goods Design
  type: BicsLevel4SubIndustry
  type: Classifier
  type: ContemporaryDerivation
  derived from: http://data.ga-group.nl/ics/bics/2014/11101012
  source accessed on: 2019-12-03T20:05:01Z
  source last accessed on: 2019-12-03T20:05:01Z
  definition: This industry subgroup includes companies that design and market luggage, personal leather goods and women's handbags products.
  notation: 11101012
  valid from: 2014-08-08
  valid till: 2020-10-03
source accessed on: 2019-12-03T20:05:01Z
source last accessed on: 2019-12-03T20:05:01Z
definition: This industry subgroup includes companies that design and market luggage, personal leather goods and women's handbags products.
notation: 11101012
valid from: 2014-08-08
valid till: 2020-10-03

Athletic Footwear
type: BicsLevel5Segment
type: Classifier
type: NamedIndividual
is level5 segment of: Footwear Design
is replaced by: Athletic Footwear
created with: infer-bics.sql
derived from: Athletic Footwear
  type: BicsLevel5Segment
  type: Classifier
  type: ContemporaryDerivation
  derived from: http://data.ga-group.nl/ics/bics/2014/1110101310
  source accessed on: 2019-12-03T20:05:01Z
  source last accessed on: 2019-12-03T20:05:01Z
  definition: This segment includes companies that design and market athletic footwear products.
  notation: 1110101310
  valid from: 2014-08-08
  valid till: 2020-10-03
source accessed on: 2019-12-03T20:05:01Z
source last accessed on: 2019-12-03T20:05:01Z
definition: This segment includes companies that design and market athletic footwear products.
notation: 1110101310
valid from: 2014-08-08
valid till: 2020-10-03

House Slipper
type: BicsLevel6Segment
type: Classifier
type: NamedIndividual
is level6 segment of: Non-Athletic Footwear
created with: infer-bics.sql
derived from: House Slipper
  type: BicsLevel6Segment
  type: Classifier
  type: ContemporaryDerivation
  derived from: http://data.ga-group.nl/ics/bics/2014/111010131110
  source accessed on: 2019-12-03T20:05:01Z
  source last accessed on: 2019-12-03T20:05:01Z
  definition: This segment includes companies that design and market house slipper products.
  notation: 111010131110
  valid from: 2014-08-08
  valid till: 2020-10-03
source accessed on: 2019-12-03T20:05:01Z
source last accessed on: 2019-12-03T20:05:01Z
definition: This segment includes companies that design and market house slipper products.
notation: 111010131110
valid from: 2014-08-08
valid till: 2020-10-03

Men's Footwear
type: BicsLevel6Segment
type: Classifier
type: NamedIndividual
is level6 segment of: Non-Athletic Footwear
is replaced by: Men's Footwear
created with: infer-bics.sql
derived from: Men's Footwear
  type: BicsLevel6Segment
  type: Classifier
  type: ContemporaryDerivation
  derived from: http://data.ga-group.nl/ics/bics/2014/111010131111
  source accessed on: 2019-12-03T20:05:01Z
  source last accessed on: 2019-12-03T20:05:01Z
  definition: This segment includes companies that design and market men's footwear products.
  notation: 111010131111
  valid from: 2014-08-08
  valid till: 2020-10-03
source accessed on: 2019-12-03T20:05:01Z
source last accessed on: 2019-12-03T20:05:01Z
definition: This segment includes companies that design and market men's footwear products.
notation: 111010131111
valid from: 2014-08-08
valid till: 2020-10-03

Women's Footwear
type: BicsLevel6Segment
type: Classifier
type: NamedIndividual
is level6 segment of: Non-Athletic Footwear
is replaced by: Women's Footwear
created with: infer-bics.sql
derived from: Women's Footwear
  type: BicsLevel6Segment
  type: Classifier
  type: ContemporaryDerivation
  derived from: http://data.ga-group.nl/ics/bics/2014/111010131112
  source accessed on: 2019-12-03T20:05:01Z
  source last accessed on: 2019-12-03T20:05:01Z
  definition: This segment includes companies that design and market women's footwear products.
  notation: 111010131112
  valid from: 2014-08-08
  valid till: 2020-10-03
source accessed on: 2019-12-03T20:05:01Z
source last accessed on: 2019-12-03T20:05:01Z
definition: This segment includes companies that design and market women's footwear products.
notation: 111010131112
valid from: 2014-08-08
valid till: 2020-10-03

Non-Athletic Footwear
type: BicsLevel5Segment
type: Classifier
type: NamedIndividual
is level5 segment of: Footwear Design
is replaced by: Non-Athletic Footwear
created with: infer-bics.sql
derived from: Non-Athletic Footwear
  type: BicsLevel5Segment
  type: Classifier
  type: ContemporaryDerivation
  derived from: http://data.ga-group.nl/ics/bics/2014/1110101311
  source accessed on: 2019-12-03T20:05:01Z
  source last accessed on: 2019-12-03T20:05:01Z
  definition: This segment includes companies that design and market house slippers as well as men's and women's footwear products.
  notation: 1110101311
  valid from: 2014-08-08
  valid till: 2020-10-03
source accessed on: 2019-12-03T20:05:01Z
source last accessed on: 2019-12-03T20:05:01Z
definition: This segment includes companies that design and market house slippers as well as men's and women's footwear products.
notation: 1110101311
valid from: 2014-08-08
valid till: 2020-10-03

Footwear Design
type: BicsLevel4SubIndustry
type: Classifier
type: NamedIndividual
created with: infer-bics.sql
derived from: Footwear Design
  type: BicsLevel4SubIndustry
  type: Classifier
  type: ContemporaryDerivation
  derived from: http://data.ga-group.nl/ics/bics/2014/11101013
  source accessed on: 2019-12-03T20:05:01Z
  source last accessed on: 2019-12-03T20:05:01Z
  definition: This industry subgroup includes companies that design and market athletic and non-athletic footwear products.
  notation: 11101013
  valid from: 2014-08-08
  valid till: 2020-10-03
source accessed on: 2019-12-03T20:05:01Z
source last accessed on: 2019-12-03T20:05:01Z
definition: This industry subgroup includes companies that design and market athletic and non-athletic footwear products.
notation: 11101013
valid from: 2014-08-08
valid till: 2020-10-03

Garment Outsourcing
type: BicsLevel4SubIndustry
type: Classifier
type: NamedIndividual
created with: infer-bics.sql
derived from: Garment Outsourcing
  type: BicsLevel4SubIndustry
  type: Classifier
  type: ContemporaryDerivation
  derived from: http://data.ga-group.nl/ics/bics/2014/11101014
  source accessed on: 2019-12-03T20:05:01Z
  source last accessed on: 2019-12-03T20:05:01Z
  definition: This industry subgroup includes companies that provide outsourced manufacturing services for apparel, footwear and accessory designers. These companies manufacture under other brand names.
  notation: 11101014
  valid from: 2014-08-08
  valid till: 2020-10-03
source accessed on: 2019-12-03T20:05:01Z
source last accessed on: 2019-12-03T20:05:01Z
definition: This industry subgroup includes companies that provide outsourced manufacturing services for apparel, footwear and accessory designers. These companies manufacture under other brand names.
notation: 11101014
valid from: 2014-08-08
valid till: 2020-10-03

Athletic Accessories
type: BicsLevel5Segment
type: Classifier
type: NamedIndividual
is level5 segment of: Sporting & Athletic Apparel
created with: infer-bics.sql
derived from: Athletic Accessories
  type: BicsLevel5Segment
  type: Classifier
  type: ContemporaryDerivation
  derived from: http://data.ga-group.nl/ics/bics/2014/1110101510
  source accessed on: 2019-12-03T20:05:01Z
  source last accessed on: 2019-12-03T20:05:01Z
  definition: This segment includes companies that design and market athletic accessories products.
  notation: 1110101510
  valid from: 2014-08-08
  valid till: 2020-10-03
source accessed on: 2019-12-03T20:05:01Z
source last accessed on: 2019-12-03T20:05:01Z
definition: This segment includes companies that design and market athletic accessories products.
notation: 1110101510
valid from: 2014-08-08
valid till: 2020-10-03

Sports Apparel
type: BicsLevel5Segment
type: Classifier
type: NamedIndividual
is level5 segment of: Sporting & Athletic Apparel
is replaced by: Sports Apparel
created with: infer-bics.sql
derived from: Sports Apparel
  type: BicsLevel5Segment
  type: Classifier
  type: ContemporaryDerivation
  derived from: http://data.ga-group.nl/ics/bics/2014/1110101511
  source accessed on: 2019-12-03T20:05:01Z
  source last accessed on: 2019-12-03T20:05:01Z
  definition: This segment includes companies that design and market sports apparel products.
  notation: 1110101511
  valid from: 2014-08-08
  valid till: 2020-10-03
source accessed on: 2019-12-03T20:05:01Z
source last accessed on: 2019-12-03T20:05:01Z
definition: This segment includes companies that design and market sports apparel products.
notation: 1110101511
valid from: 2014-08-08
valid till: 2020-10-03

Sporting & Athletic Apparel
type: BicsLevel4SubIndustry
type: Classifier
type: NamedIndividual
created with: infer-bics.sql
derived from: Sporting & Athletic Apparel
  type: BicsLevel4SubIndustry
  type: Classifier
  type: ContemporaryDerivation
  derived from: http://data.ga-group.nl/ics/bics/2014/11101015
  source accessed on: 2019-12-03T20:05:01Z
  source last accessed on: 2019-12-03T20:05:01Z
  definition: This industry subgroup includes companies that design and market sporting and athletic apparel products.
  notation: 11101015
  valid from: 2014-08-08
  valid till: 2020-10-03
source accessed on: 2019-12-03T20:05:01Z
source last accessed on: 2019-12-03T20:05:01Z
definition: This industry subgroup includes companies that design and market sporting and athletic apparel products.
notation: 11101015
valid from: 2014-08-08
valid till: 2020-10-03

Costume Jewelry
type: BicsLevel6Segment
type: Classifier
type: NamedIndividual
is level6 segment of: Jewelry
created with: infer-bics.sql
derived from: Costume Jewelry
  type: BicsLevel6Segment
  type: Classifier
  type: ContemporaryDerivation
  derived from: http://data.ga-group.nl/ics/bics/2014/111010161010
  source accessed on: 2019-12-03T20:05:01Z
  source last accessed on: 2019-12-03T20:05:01Z
  definition: This segment includes companies that design and market costume jewelry products.
  notation: 111010161010
  valid from: 2014-08-08
  valid till: 2020-10-03
source accessed on: 2019-12-03T20:05:01Z
source last accessed on: 2019-12-03T20:05:01Z
definition: This segment includes companies that design and market costume jewelry products.
notation: 111010161010
valid from: 2014-08-08
valid till: 2020-10-03

Jewelry (excluding Costume)
type: BicsLevel6Segment
type: Classifier
type: NamedIndividual
is level6 segment of: Jewelry
created with: infer-bics.sql
derived from: Jewelry (excluding Costume)
  type: BicsLevel6Segment
  type: Classifier
  type: ContemporaryDerivation
  derived from: http://data.ga-group.nl/ics/bics/2014/111010161011
  source accessed on: 2019-12-03T20:05:01Z
  source last accessed on: 2019-12-03T20:05:01Z
  definition: This segment includes companies that design and market jewelry products, except costume jewelry.
  notation: 111010161011
  valid from: 2014-08-08
  valid till: 2020-10-03
source accessed on: 2019-12-03T20:05:01Z
source last accessed on: 2019-12-03T20:05:01Z
definition: This segment includes companies that design and market jewelry products, except costume jewelry.
notation: 111010161011
valid from: 2014-08-08
valid till: 2020-10-03

Jewelry
type: BicsLevel5Segment
type: Classifier
type: NamedIndividual
is level5 segment of: Watch & Jewelry Design
is replaced by: Jewelry
created with: infer-bics.sql
derived from: Jewelry
  type: BicsLevel5Segment
  type: Classifier
  type: ContemporaryDerivation
  derived from: http://data.ga-group.nl/ics/bics/2014/1110101610
  source accessed on: 2019-12-03T20:05:01Z
  source last accessed on: 2019-12-03T20:05:01Z
  definition: This segment includes companies that design, market and/or manufacture jewelry of all types.
  notation: 1110101610
  valid from: 2014-08-08
  valid till: 2020-10-03
source accessed on: 2019-12-03T20:05:01Z
source last accessed on: 2019-12-03T20:05:01Z
definition: This segment includes companies that design, market and/or manufacture jewelry of all types.
notation: 1110101610
valid from: 2014-08-08
valid till: 2020-10-03

Metal Accessories
type: BicsLevel5Segment
type: Classifier
type: NamedIndividual
is level5 segment of: Watch & Jewelry Design
created with: infer-bics.sql
derived from: Metal Accessories
  type: BicsLevel5Segment
  type: Classifier
  type: ContemporaryDerivation
  derived from: http://data.ga-group.nl/ics/bics/2014/1110101611
  source accessed on: 2019-12-03T20:05:01Z
  source last accessed on: 2019-12-03T20:05:01Z
  definition: This segment includes companies that design and market any type of metal accessories.
  notation: 1110101611
  valid from: 2014-08-08
  valid till: 2020-10-03
source accessed on: 2019-12-03T20:05:01Z
source last accessed on: 2019-12-03T20:05:01Z
definition: This segment includes companies that design and market any type of metal accessories.
notation: 1110101611
valid from: 2014-08-08
valid till: 2020-10-03

General Watch
type: BicsLevel6Segment
type: Classifier
type: NamedIndividual
is level6 segment of: Watch
created with: infer-bics.sql
derived from: General Watch
  type: BicsLevel6Segment
  type: Classifier
  type: ContemporaryDerivation
  derived from: http://data.ga-group.nl/ics/bics/2014/111010161210
  source accessed on: 2019-12-03T20:05:01Z
  source last accessed on: 2019-12-03T20:05:01Z
  definition: This segment includes companies that design and market general watches.
  notation: 111010161210
  valid from: 2014-08-08
  valid till: 2020-10-03
source accessed on: 2019-12-03T20:05:01Z
source last accessed on: 2019-12-03T20:05:01Z
definition: This segment includes companies that design and market general watches.
notation: 111010161210
valid from: 2014-08-08
valid till: 2020-10-03

Luxury Watch
type: BicsLevel6Segment
type: Classifier
type: NamedIndividual
is level6 segment of: Watch
created with: infer-bics.sql
derived from: Luxury Watch
  type: BicsLevel6Segment
  type: Classifier
  type: ContemporaryDerivation
  derived from: http://data.ga-group.nl/ics/bics/2014/111010161211
  source accessed on: 2019-12-03T20:05:01Z
  source last accessed on: 2019-12-03T20:05:01Z
  definition: This segment includes companies that design and market luxury watches that target high-end customers.
  notation: 111010161211
  valid from: 2014-08-08
  valid till: 2020-10-03
source accessed on: 2019-12-03T20:05:01Z
source last accessed on: 2019-12-03T20:05:01Z
definition: This segment includes companies that design and market luxury watches that target high-end customers.
notation: 111010161211
valid from: 2014-08-08
valid till: 2020-10-03

Watch
type: BicsLevel5Segment
type: Classifier
type: NamedIndividual
is level5 segment of: Watch & Jewelry Design
is replaced by: Watch
created with: infer-bics.sql
derived from: Watch
  type: BicsLevel5Segment
  type: Classifier
  type: ContemporaryDerivation
  derived from: http://data.ga-group.nl/ics/bics/2014/1110101612
  source accessed on: 2019-12-03T20:05:01Z
  source last accessed on: 2019-12-03T20:05:01Z
  definition: This segment includes companies that design and market watches.
  notation: 1110101612
  valid from: 2014-08-08
  valid till: 2020-10-03
source accessed on: 2019-12-03T20:05:01Z
source last accessed on: 2019-12-03T20:05:01Z
definition: This segment includes companies that design and market watches.
notation: 1110101612
valid from: 2014-08-08
valid till: 2020-10-03

Watch & Jewelry Design
type: BicsLevel4SubIndustry
type: Classifier
type: NamedIndividual
created with: infer-bics.sql
derived from: Watch & Jewelry Design
  type: BicsLevel4SubIndustry
  type: Classifier
  type: ContemporaryDerivation
  derived from: http://data.ga-group.nl/ics/bics/2014/11101016
  source accessed on: 2019-12-03T20:05:01Z
  source last accessed on: 2019-12-03T20:05:01Z
  definition: This industry subgroup includes companies that design and market watch and jewelry products.
  notation: 11101016
  valid from: 2014-08-08
  valid till: 2020-10-03
source accessed on: 2019-12-03T20:05:01Z
source last accessed on: 2019-12-03T20:05:01Z
definition: This industry subgroup includes companies that design and market watch and jewelry products.
notation: 11101016
valid from: 2014-08-08
valid till: 2020-10-03

Bathing Suit
type: BicsLevel5Segment
type: Classifier
type: NamedIndividual
is level5 segment of: Other Specialty Apparel Design
created with: infer-bics.sql
derived from: Bathing Suit
  type: BicsLevel5Segment
  type: Classifier
  type: ContemporaryDerivation
  derived from: http://data.ga-group.nl/ics/bics/2014/1110101710
  source accessed on: 2019-12-03T20:05:01Z
  source last accessed on: 2019-12-03T20:05:01Z
  definition: This segment includes companies that design and market bathing suits.
  notation: 1110101710
  valid from: 2014-08-08
  valid till: 2020-10-03
source accessed on: 2019-12-03T20:05:01Z
source last accessed on: 2019-12-03T20:05:01Z
definition: This segment includes companies that design and market bathing suits.
notation: 1110101710
valid from: 2014-08-08
valid till: 2020-10-03

Fur & Leather Apparel
type: BicsLevel5Segment
type: Classifier
type: NamedIndividual
is level5 segment of: Other Specialty Apparel Design
is replaced by: Fur & Leather Apparel
created with: infer-bics.sql
derived from: Fur & Leather Apparel
  type: BicsLevel5Segment
  type: Classifier
  type: ContemporaryDerivation
  derived from: http://data.ga-group.nl/ics/bics/2014/1110101711
  source accessed on: 2019-12-03T20:05:01Z
  source last accessed on: 2019-12-03T20:05:01Z
  definition: This segment includes companies that design and market fur and leather products.
  notation: 1110101711
  valid from: 2014-08-08
  valid till: 2020-10-03
source accessed on: 2019-12-03T20:05:01Z
source last accessed on: 2019-12-03T20:05:01Z
definition: This segment includes companies that design and market fur and leather products.
notation: 1110101711
valid from: 2014-08-08
valid till: 2020-10-03

Outerwear Apparel
type: BicsLevel5Segment
type: Classifier
type: NamedIndividual
is level5 segment of: Other Specialty Apparel Design
is replaced by: Outerwear Apparel
created with: infer-bics.sql
derived from: Outerwear Apparel
  type: BicsLevel5Segment
  type: Classifier
  type: ContemporaryDerivation
  derived from: http://data.ga-group.nl/ics/bics/2014/1110101712
  source accessed on: 2019-12-03T20:05:01Z
  source last accessed on: 2019-12-03T20:05:01Z
  definition: This segment includes companies that design and market outerwear apparel products.
  notation: 1110101712
  valid from: 2014-08-08
  valid till: 2020-10-03
source accessed on: 2019-12-03T20:05:01Z
source last accessed on: 2019-12-03T20:05:01Z
definition: This segment includes companies that design and market outerwear apparel products.
notation: 1110101712
valid from: 2014-08-08
valid till: 2020-10-03

Professional Uniforms
type: BicsLevel5Segment
type: Classifier
type: NamedIndividual
is level5 segment of: Other Specialty Apparel Design
is replaced by: Professional Uniforms
created with: infer-bics.sql
derived from: Professional Uniforms
  type: BicsLevel5Segment
  type: Classifier
  type: ContemporaryDerivation
  derived from: http://data.ga-group.nl/ics/bics/2014/1110101713
  source accessed on: 2019-12-03T20:05:01Z
  source last accessed on: 2019-12-03T20:05:01Z
  definition: This segment includes companies that design and market professional uniforms products.
  notation: 1110101713
  valid from: 2014-08-08
  valid till: 2020-10-03
source accessed on: 2019-12-03T20:05:01Z
source last accessed on: 2019-12-03T20:05:01Z
definition: This segment includes companies that design and market professional uniforms products.
notation: 1110101713
valid from: 2014-08-08
valid till: 2020-10-03

Other Apparel Accessories
type: BicsLevel5Segment
type: Classifier
type: NamedIndividual
is level5 segment of: Other Specialty Apparel Design
created with: infer-bics.sql
derived from: Other Apparel Accessories
  type: BicsLevel5Segment
  type: Classifier
  type: ContemporaryDerivation
  derived from: http://data.ga-group.nl/ics/bics/2014/1110101714
  source accessed on: 2019-12-03T20:05:01Z
  source last accessed on: 2019-12-03T20:05:01Z
  definition: This segment includes companies that design and market other apparel accessories products not elsewhere classified.
  notation: 1110101714
  valid from: 2014-08-08
  valid till: 2020-10-03
source accessed on: 2019-12-03T20:05:01Z
source last accessed on: 2019-12-03T20:05:01Z
definition: This segment includes companies that design and market other apparel accessories products not elsewhere classified.
notation: 1110101714
valid from: 2014-08-08
valid till: 2020-10-03

Other Specialty Apparel Design
type: BicsLevel4SubIndustry
type: Classifier
type: NamedIndividual
created with: infer-bics.sql
derived from: Other Specialty Apparel Design
  type: BicsLevel4SubIndustry
  type: Classifier
  type: ContemporaryDerivation
  derived from: http://data.ga-group.nl/ics/bics/2014/11101017
  source accessed on: 2019-12-03T20:05:01Z
  source last accessed on: 2019-12-03T20:05:01Z
  definition: This industry subgroup includes companies that design and market apparel products not elsewhere classified.
  notation: 11101017
  valid from: 2014-08-08
  valid till: 2020-10-03
source accessed on: 2019-12-03T20:05:01Z
source last accessed on: 2019-12-03T20:05:01Z
definition: This industry subgroup includes companies that design and market apparel products not elsewhere classified.
notation: 11101017
valid from: 2014-08-08
valid till: 2020-10-03

Apparel & Textile Products
type: BicsLevel3Industry
type: Classifier
type: NamedIndividual
is industry of: Consumer Discretionary Products
is replaced by: Apparel, Footwear & Acc Design
replaces: Consumer Discretionary Products
created with: infer-bics.sql
derived from: Apparel & Textile Products
  type: BicsLevel2IndustryGroup
  type: Classifier
  type: AnachronousDerivation
  derived from: http://data.ga-group.nl/ics/bics/2014/1110
  source accessed on: 2019-12-03T20:05:01Z
  source last accessed on: 2019-12-03T20:05:01Z
  definition: This industry group includes companies that design, manufacture and market apparel and textile products.
  notation: 1110
  valid from: 2014-08-08
  valid till: 2020-10-03
derived from: Apparel, Footwear & Acc Design
  type: BicsLevel3Industry
  type: Classifier
  type: ContemporaryDerivation
  derived from: http://data.ga-group.nl/ics/bics/2014/111010
  source accessed on: 2019-12-03T20:05:01Z
  source last accessed on: 2019-12-03T20:05:01Z
  definition: This industry includes companies that design and market apparel, footwear and accessories products. Excludes designers who own and operate their own retail store and the majority of their revenue comes from retail operations (see Specialty Apparel Stores).
  notation: 111010
  valid from: 2014-08-08
  valid till: 2020-10-03
derived from: Apparel & Textile Products
  type: BicsLevel3Industry
  type: Classifier
  type: ContemporaryDerivation
  derived from: http://data.ga-group.nl/ics/bics/2020/111010
  derived from: http://data.ga-group.nl/ics/bics/2024/111010
  source accessed on: 2023-07-03T18:11:29Z
  source last accessed on: 2024-06-05T14:42:36Z
  definition: This industry includes companies that design and manufacture apparel and textile products.
  notation: 111010
  valid from: 2020-10-03
source accessed on: 2019-12-03T20:05:01Z
source last accessed on: 2024-06-05T14:42:36Z
definition: This industry includes companies that design and manufacture apparel and textile products.
notation: 111010
valid from: 2014-08-08

Cars - Electric
type: BicsLevel6Segment
type: Classifier
type: NamedIndividual
is level6 segment of: Cars
created with: infer-bics.sql
derived from: Passenger Vehicles - Electric
  type: BicsLevel6Segment
  type: Classifier
  type: ContemporaryDerivation
  derived from: http://data.ga-group.nl/ics/bics/2020/111011101010
  source accessed on: 2023-07-03T18:11:29Z
  source last accessed on: 2023-07-03T18:11:29Z
  definition: This segment includes companies that manufacture electric passenger vehicles.
  notation: 111011101010
  valid from: 2020-10-03
  valid till: 2024-06-07
derived from: Cars - Electric
  type: BicsLevel6Segment
  type: Classifier
  type: ContemporaryDerivation
  derived from: http://data.ga-group.nl/ics/bics/2024/111011101010
  source accessed on: 2024-06-05T14:42:36Z
  source last accessed on: 2024-06-05T14:42:36Z
  definition: This segment includes companies that manufacture electric passenger cars.
  notation: 111011101010
  valid from: 2024-06-07
source accessed on: 2023-07-03T18:11:29Z
source last accessed on: 2024-06-05T14:42:36Z
definition: This segment includes companies that manufacture electric passenger cars.
notation: 111011101010
valid from: 2020-10-03

Cars - Fossil Fuels
type: BicsLevel6Segment
type: Classifier
type: NamedIndividual
is level6 segment of: Cars
created with: infer-bics.sql
derived from: Passenger Vehicles - Fossil Fuels
  type: BicsLevel6Segment
  type: Classifier
  type: ContemporaryDerivation
  derived from: http://data.ga-group.nl/ics/bics/2020/111011101011
  source accessed on: 2023-07-03T18:11:29Z
  source last accessed on: 2023-07-03T18:11:29Z
  definition: This segment includes companies that manufacture fossil fuel passenger vehicles.
  notation: 111011101011
  valid from: 2020-10-03
  valid till: 2024-06-07
derived from: Cars - Fossil Fuels
  type: BicsLevel6Segment
  type: Classifier
  type: ContemporaryDerivation
  derived from: http://data.ga-group.nl/ics/bics/2024/111011101011
  source accessed on: 2024-06-05T14:42:36Z
  source last accessed on: 2024-06-05T14:42:36Z
  definition: This segment includes companies that manufacture fossil fuel passenger cars.
  notation: 111011101011
  valid from: 2024-06-07
source accessed on: 2023-07-03T18:11:29Z
source last accessed on: 2024-06-05T14:42:36Z
definition: This segment includes companies that manufacture fossil fuel passenger cars.
notation: 111011101011
valid from: 2020-10-03

Cars
type: BicsLevel5Segment
type: Classifier
type: NamedIndividual
is level5 segment of: Automobiles
created with: infer-bics.sql
derived from: Passenger Vehicles
  type: BicsLevel4SubIndustry
  type: Classifier
  type: AnachronousDerivation
  derived from: http://data.ga-group.nl/ics/bics/2014/11111010
  source accessed on: 2019-12-03T20:05:01Z
  source last accessed on: 2019-12-03T20:05:01Z
  definition: This industry subgroup includes companies that manufacture passenger cars. Such vehicles include sports cars, sedans, station wagons, hatchbacks, and microcars.
  notation: 11111010
  valid from: 2014-08-08
  valid till: 2020-10-03
derived from: Passenger Vehicles
  type: BicsLevel5Segment
  type: Classifier
  type: ContemporaryDerivation
  derived from: http://data.ga-group.nl/ics/bics/2020/1110111010
  source accessed on: 2023-07-03T18:11:29Z
  source last accessed on: 2023-07-03T18:11:29Z
  definition: This segment includes companies that manufacture passenger cars. Such vehicles include sports cars, sedans, station wagons, hatchbacks, and microcars.
  notation: 1110111010
  valid from: 2020-10-03
  valid till: 2024-06-07
derived from: Cars
  type: BicsLevel5Segment
  type: Classifier
  type: ContemporaryDerivation
  derived from: http://data.ga-group.nl/ics/bics/2024/1110111010
  source accessed on: 2024-06-05T14:42:36Z
  source last accessed on: 2024-06-05T14:42:36Z
  definition: This segment includes companies that manufacture passenger cars. Such cars include sports cars, sedans, station wagons, hatchbacks, and microcars.
  notation: 1110111010
  valid from: 2024-06-07
source accessed on: 2023-07-03T18:11:29Z
source last accessed on: 2024-06-05T14:42:36Z
definition: This segment includes companies that manufacture passenger cars. Such cars include sports cars, sedans, station wagons, hatchbacks, and microcars.
notation: 1110111010
valid from: 2020-10-03

Light Trucks - Electric
type: BicsLevel6Segment
type: Classifier
type: NamedIndividual
is level6 segment of: Light Trucks
created with: infer-bics.sql
derived from: Light Trucks - Electric
  type: BicsLevel6Segment
  type: Classifier
  type: ContemporaryDerivation
  derived from: http://data.ga-group.nl/ics/bics/2020/111011101110
  derived from: http://data.ga-group.nl/ics/bics/2024/111011101110
  source accessed on: 2023-07-03T18:11:29Z
  source last accessed on: 2024-06-05T14:42:36Z
  definition: This segment includes companies that manufacture electric light duty trucks and utility vehicles.
  notation: 111011101110
  valid from: 2020-10-03
source accessed on: 2023-07-03T18:11:29Z
source last accessed on: 2024-06-05T14:42:36Z
definition: This segment includes companies that manufacture electric light duty trucks and utility vehicles.
notation: 111011101110
valid from: 2020-10-03

Light Trucks - Fossil Fuels
type: BicsLevel6Segment
type: Classifier
type: NamedIndividual
is level6 segment of: Light Trucks
created with: infer-bics.sql
derived from: Light Trucks - Fossil Fuels
  type: BicsLevel6Segment
  type: Classifier
  type: ContemporaryDerivation
  derived from: http://data.ga-group.nl/ics/bics/2020/111011101111
  derived from: http://data.ga-group.nl/ics/bics/2024/111011101111
  source accessed on: 2023-07-03T18:11:29Z
  source last accessed on: 2024-06-05T14:42:36Z
  definition: This segment includes companies that manufacture fossil fuel light duty trucks and utility vehicles.
  notation: 111011101111
  valid from: 2020-10-03
source accessed on: 2023-07-03T18:11:29Z
source last accessed on: 2024-06-05T14:42:36Z
definition: This segment includes companies that manufacture fossil fuel light duty trucks and utility vehicles.
notation: 111011101111
valid from: 2020-10-03

Light Trucks
type: BicsLevel5Segment
type: Classifier
type: NamedIndividual
is level5 segment of: Automobiles
created with: infer-bics.sql
derived from: Light Trucks
  type: BicsLevel4SubIndustry
  type: Classifier
  type: AnachronousDerivation
  derived from: http://data.ga-group.nl/ics/bics/2014/11111011
  source accessed on: 2019-12-03T20:05:01Z
  source last accessed on: 2019-12-03T20:05:01Z
  definition: This industry subgroup includes companies that manufacture light duty trucks and utility vehicles. Such vehicles include light trucks, pickup trucks, cabs, light duty vans, minivans and sport utility vehicles.
  notation: 11111011
  valid from: 2014-08-08
  valid till: 2020-10-03
derived from: Light Trucks
  type: BicsLevel5Segment
  type: Classifier
  type: ContemporaryDerivation
  derived from: http://data.ga-group.nl/ics/bics/2020/1110111011
  source accessed on: 2023-07-03T18:11:29Z
  source last accessed on: 2023-07-03T18:11:29Z
  definition: This segment includes companies that manufacture light duty trucks and utility vehicles, including light trucks, pickup trucks, cabs, light duty vans, minivans and sport utility vehicles.
  notation: 1110111011
  valid from: 2020-10-03
  valid till: 2024-06-07
derived from: Light Trucks
  type: BicsLevel5Segment
  type: Classifier
  type: ContemporaryDerivation
  derived from: http://data.ga-group.nl/ics/bics/2024/1110111011
  source accessed on: 2024-06-05T14:42:36Z
  source last accessed on: 2024-06-05T14:42:36Z
  definition: This segment includes companies that manufacture light duty trucks and utility vehicles, including light trucks, pickup trucks, cabs, light duty vans, minivans, crossovers, and sport utility vehicles.
  notation: 1110111011
  valid from: 2024-06-07
source accessed on: 2023-07-03T18:11:29Z
source last accessed on: 2024-06-05T14:42:36Z
definition: This segment includes companies that manufacture light duty trucks and utility vehicles, including light trucks, pickup trucks, cabs, light duty vans, minivans, crossovers, and sport utility vehicles.
notation: 1110111011
valid from: 2020-10-03

Motorcycles - Electric
type: BicsLevel6Segment
type: Classifier
type: NamedIndividual
is level6 segment of: Motorcycles
created with: infer-bics.sql
derived from: Motorcycles - Electric
  type: BicsLevel6Segment
  type: Classifier
  type: ContemporaryDerivation
  derived from: http://data.ga-group.nl/ics/bics/2020/111011101210
  source accessed on: 2023-07-03T18:11:29Z
  source last accessed on: 2023-07-03T18:11:29Z
  definition: This segment includes companies that manufacture electric motorcycles and scooters.
  notation: 111011101210
  valid from: 2020-10-03
  valid till: 2024-06-07
derived from: Motorcycles - Electric
  type: BicsLevel6Segment
  type: Classifier
  type: ContemporaryDerivation
  derived from: http://data.ga-group.nl/ics/bics/2024/111011101210
  source accessed on: 2024-06-05T14:42:36Z
  source last accessed on: 2024-06-05T14:42:36Z
  definition: This segment includes companies that manufacture electric motorcycles and scooters as well as parts specifically designed for electric motorcycles and scooters.
  notation: 111011101210
  valid from: 2024-06-07
source accessed on: 2023-07-03T18:11:29Z
source last accessed on: 2024-06-05T14:42:36Z
definition: This segment includes companies that manufacture electric motorcycles and scooters as well as parts specifically designed for electric motorcycles and scooters.
notation: 111011101210
valid from: 2020-10-03

Motorcycles - Fossil Fuels
type: BicsLevel6Segment
type: Classifier
type: NamedIndividual
is level6 segment of: Motorcycles
created with: infer-bics.sql
derived from: Motorcycles - Fossil Fuels
  type: BicsLevel6Segment
  type: Classifier
  type: ContemporaryDerivation
  derived from: http://data.ga-group.nl/ics/bics/2020/111011101211
  source accessed on: 2023-07-03T18:11:29Z
  source last accessed on: 2023-07-03T18:11:29Z
  definition: This segment includes companies that manufacture fossil fuel motorcycles and scooters.
  notation: 111011101211
  valid from: 2020-10-03
  valid till: 2024-06-07
derived from: Motorcycles - Fossil Fuels
  type: BicsLevel6Segment
  type: Classifier
  type: ContemporaryDerivation
  derived from: http://data.ga-group.nl/ics/bics/2024/111011101211
  source accessed on: 2024-06-05T14:42:36Z
  source last accessed on: 2024-06-05T14:42:36Z
  definition: This segment includes companies that manufacture fossil fuel motorcycles and scooters as well as parts specifically designed for fossil fuel motorcycles and scooters.
  notation: 111011101211
  valid from: 2024-06-07
source accessed on: 2023-07-03T18:11:29Z
source last accessed on: 2024-06-05T14:42:36Z
definition: This segment includes companies that manufacture fossil fuel motorcycles and scooters as well as parts specifically designed for fossil fuel motorcycles and scooters.
notation: 111011101211
valid from: 2020-10-03

Motorcycles
type: BicsLevel5Segment
type: Classifier
type: NamedIndividual
is level5 segment of: Automobiles
created with: infer-bics.sql
derived from: Motorbikes & Parts
  type: BicsLevel4SubIndustry
  type: Classifier
  type: AnachronousDerivation
  derived from: http://data.ga-group.nl/ics/bics/2014/11111012
  source accessed on: 2019-12-03T20:05:01Z
  source last accessed on: 2019-12-03T20:05:01Z
  definition: This industry subgroup includes companies that manufacture motorcycles and scooters as well as parts specifically designed for motorcycles and scooters.
  notation: 11111012
  valid from: 2014-08-08
  valid till: 2020-10-03
derived from: Motorcycles
  type: BicsLevel5Segment
  type: Classifier
  type: ContemporaryDerivation
  derived from: http://data.ga-group.nl/ics/bics/2020/1110111012
  derived from: http://data.ga-group.nl/ics/bics/2024/1110111012
  source accessed on: 2023-07-03T18:11:29Z
  source last accessed on: 2024-06-05T14:42:36Z
  definition: This segment includes companies that manufacture motorcycles and scooters as well as parts specifically designed for motorcycles and scooters.
  notation: 1110111012
  valid from: 2020-10-03
source accessed on: 2023-07-03T18:11:29Z
source last accessed on: 2024-06-05T14:42:36Z
definition: This segment includes companies that manufacture motorcycles and scooters as well as parts specifically designed for motorcycles and scooters.
notation: 1110111012
valid from: 2020-10-03

Automobiles
type: BicsLevel4SubIndustry
type: Classifier
type: NamedIndividual
replaces: Consumer Services
created with: infer-bics.sql
derived from: Leather, Hide Tan & Finishing
  type: BicsLevel4SubIndustry
  type: Classifier
  type: ContemporaryDerivation
  derived from: http://data.ga-group.nl/ics/bics/2014/11101110
  source accessed on: 2019-12-03T20:05:01Z
  source last accessed on: 2019-12-03T20:05:01Z
  definition: This industry subgroup includes companies that create leather from hides and skins.
  notation: 11101110
  valid from: 2014-08-08
  valid till: 2020-10-03
derived from: Automobiles
  type: BicsLevel3Industry
  type: Classifier
  type: AnachronousDerivation
  derived from: http://data.ga-group.nl/ics/bics/2014/111110
  source accessed on: 2019-12-03T20:05:01Z
  source last accessed on: 2019-12-03T20:05:01Z
  definition: This industry includes companies that manufacture automobiles (passenger cars), light trucks, motorcycles and sport utility vehicles. Excludes passenger vehicles manufactured for commercial use, medium duty trucks and heavy duty trucks.
  notation: 111110
  valid from: 2014-08-08
  valid till: 2020-10-03
derived from: Automobiles
  type: BicsLevel4SubIndustry
  type: Classifier
  type: ContemporaryDerivation
  derived from: http://data.ga-group.nl/ics/bics/2020/11101110
  derived from: http://data.ga-group.nl/ics/bics/2024/11101110
  source accessed on: 2023-07-03T18:11:29Z
  source last accessed on: 2024-06-05T14:42:36Z
  definition: This industry subgroup includes companies that manufacture automobiles (passenger cars), light trucks, motorcycles and sport utility vehicles. Excludes passenger vehicles manufactured for commercial use, medium duty trucks and heavy duty trucks.
  notation: 11101110
  valid from: 2020-10-03
source accessed on: 2019-12-03T20:05:01Z
source last accessed on: 2024-06-05T14:42:36Z
definition: This industry subgroup includes companies that manufacture automobiles (passenger cars), light trucks, motorcycles and sport utility vehicles. Excludes passenger vehicles manufactured for commercial use, medium duty trucks and heavy duty trucks.
notation: 11101110
valid from: 2014-08-08

Fabric Coating Mills
type: BicsLevel6Segment
type: Classifier
type: NamedIndividual
is level6 segment of: Alternative Vehicle Parts
is replaced by: Fabric Coating Mills
created with: infer-bics.sql
derived from: Fabric Coating Mills
  type: BicsLevel6Segment
  type: Classifier
  type: ContemporaryDerivation
  derived from: http://data.ga-group.nl/ics/bics/2014/111011111010
  source accessed on: 2019-12-03T20:05:01Z
  source last accessed on: 2019-12-03T20:05:01Z
  definition: This segment includes companies that provide fabric coating, such as coating fabrics in wax to improve strength.
  notation: 111011111010
  valid from: 2014-08-08
  valid till: 2020-10-03
source accessed on: 2019-12-03T20:05:01Z
source last accessed on: 2019-12-03T20:05:01Z
definition: This segment includes companies that provide fabric coating, such as coating fabrics in wax to improve strength.
notation: 111011111010
valid from: 2014-08-08
valid till: 2020-10-03

Nonwoven Textile & Fabric Finish
type: BicsLevel6Segment
type: Classifier
type: NamedIndividual
is level6 segment of: Alternative Vehicle Parts
is replaced by: Nonwoven Textile & Fabric Finish
created with: infer-bics.sql
derived from: Nonwoven Textile & Fabric Finish
  type: BicsLevel6Segment
  type: Classifier
  type: ContemporaryDerivation
  derived from: http://data.ga-group.nl/ics/bics/2014/111011111011
  source accessed on: 2019-12-03T20:05:01Z
  source last accessed on: 2019-12-03T20:05:01Z
  definition: This segment includes companies that provide finishing touches to non-fabric textile products.
  notation: 111011111011
  valid from: 2014-08-08
  valid till: 2020-10-03
source accessed on: 2019-12-03T20:05:01Z
source last accessed on: 2019-12-03T20:05:01Z
definition: This segment includes companies that provide finishing touches to non-fabric textile products.
notation: 111011111011
valid from: 2014-08-08
valid till: 2020-10-03

Woven Fabric Finishing Mills
type: BicsLevel6Segment
type: Classifier
type: NamedIndividual
is level6 segment of: Alternative Vehicle Parts
is replaced by: Woven Fabric Finishing Mills
created with: infer-bics.sql
derived from: Woven Fabric Finishing Mills
  type: BicsLevel6Segment
  type: Classifier
  type: ContemporaryDerivation
  derived from: http://data.ga-group.nl/ics/bics/2014/111011111012
  source accessed on: 2019-12-03T20:05:01Z
  source last accessed on: 2019-12-03T20:05:01Z
  definition: This segment includes companies that finish woven fabrics by providing basic stitching and other finishing touches.
  notation: 111011111012
  valid from: 2014-08-08
  valid till: 2020-10-03
source accessed on: 2019-12-03T20:05:01Z
source last accessed on: 2019-12-03T20:05:01Z
definition: This segment includes companies that finish woven fabrics by providing basic stitching and other finishing touches.
notation: 111011111012
valid from: 2014-08-08
valid till: 2020-10-03

Alternative Vehicle Parts
type: BicsLevel5Segment
type: Classifier
type: NamedIndividual
is level5 segment of: Auto Parts
is replaced by: Fabric Finishing
created with: infer-bics.sql
derived from: Fabric Finishing
  type: BicsLevel5Segment
  type: Classifier
  type: ContemporaryDerivation
  derived from: http://data.ga-group.nl/ics/bics/2014/1110111110
  source accessed on: 2019-12-03T20:05:01Z
  source last accessed on: 2019-12-03T20:05:01Z
  definition: This segment includes mills that finish fabric, which may involve stitching or coating of fabric or other textiles.
  notation: 1110111110
  valid from: 2014-08-08
  valid till: 2020-10-03
derived from: Alternative Vehicle Parts
  type: BicsLevel4SubIndustry
  type: Classifier
  type: AnachronousDerivation
  derived from: http://data.ga-group.nl/ics/bics/2014/11111110
  source accessed on: 2019-12-03T20:05:01Z
  source last accessed on: 2019-12-03T20:05:01Z
  definition: This industry subgroup includes companies that manufacture alternative drivetrain and hybrid systems and parts for automobiles.
  notation: 11111110
  valid from: 2014-08-08
  valid till: 2020-10-03
derived from: Alternative Vehicle Parts
  type: BicsLevel5Segment
  type: Classifier
  type: ContemporaryDerivation
  derived from: http://data.ga-group.nl/ics/bics/2020/1110111110
  source accessed on: 2023-07-03T18:11:29Z
  source last accessed on: 2023-07-03T18:11:29Z
  definition: This segment includes companies that manufacture alternative drivetrain and hybrid systems and parts for automobiles. Includes electric vehicle batteries, motors, and other components specifically for alternative energy systems.
  notation: 1110111110
  valid from: 2020-10-03
  valid till: 2024-06-07
derived from: Alternative Vehicle Parts
  type: BicsLevel5Segment
  type: Classifier
  type: ContemporaryDerivation
  derived from: http://data.ga-group.nl/ics/bics/2024/1110111110
  source accessed on: 2024-06-05T14:42:36Z
  source last accessed on: 2024-06-05T14:42:36Z
  definition: This segment includes companies that manufacture alternative drivetrain and hybrid systems and parts for automobiles. Includes motors and other components specifically for alternative energy systems.
  notation: 1110111110
  valid from: 2024-06-07
source accessed on: 2019-12-03T20:05:01Z
source last accessed on: 2024-06-05T14:42:36Z
definition: This segment includes companies that manufacture alternative drivetrain and hybrid systems and parts for automobiles. Includes motors and other components specifically for alternative energy systems.
notation: 1110111110
valid from: 2014-08-08

Auto Light Equipment
type: BicsLevel6Segment
type: Classifier
type: NamedIndividual
is level6 segment of: Auto Electrical & Electronics
is replaced by: Nonwoven Fabric Mill
replaces: Auto Light Equipment
created with: infer-bics.sql
derived from: Nonwoven Fabric Mill
  type: BicsLevel6Segment
  type: Classifier
  type: ContemporaryDerivation
  derived from: http://data.ga-group.nl/ics/bics/2014/111011111110
  source accessed on: 2019-12-03T20:05:01Z
  source last accessed on: 2019-12-03T20:05:01Z
  definition: This segment includes mills that manufacture nonwoven fabric material. Nonwoven fabric is created by thermal, mechanical or chemical bonding rather than weaving or knitting. Nonwoven fabric materials are used in a host of industries not limited to apparel and textile products.
  notation: 111011111110
  valid from: 2014-08-08
  valid till: 2020-10-03
derived from: Auto Light Equipment
  type: BicsLevel5Segment
  type: Classifier
  type: AnachronousDerivation
  derived from: http://data.ga-group.nl/ics/bics/2014/1111111111
  source accessed on: 2019-12-03T20:05:01Z
  source last accessed on: 2019-12-03T20:05:01Z
  definition: This segment includes companies that manufacture onboard electrical lighting products.
  notation: 1111111111
  valid from: 2014-08-08
  valid till: 2020-10-03
derived from: Auto Light Equipment
  type: BicsLevel6Segment
  type: Classifier
  type: ContemporaryDerivation
  derived from: http://data.ga-group.nl/ics/bics/2020/111011111110
  derived from: http://data.ga-group.nl/ics/bics/2024/111011111110
  source accessed on: 2023-07-03T18:11:29Z
  source last accessed on: 2024-06-05T14:42:36Z
  definition: This segment includes companies that manufacture onboard electrical lighting products.
  notation: 111011111110
  valid from: 2020-10-03
source accessed on: 2019-12-03T20:05:01Z
source last accessed on: 2024-06-05T14:42:36Z
definition: This segment includes companies that manufacture onboard electrical lighting products.
notation: 111011111110
valid from: 2014-08-08

Auto Electronics
type: BicsLevel6Segment
type: Classifier
type: NamedIndividual
is level6 segment of: Auto Electrical & Electronics
is replaced by: Woven Fabric Mills
replaces: Other Electrical Equipment
created with: infer-bics.sql
derived from: Woven Fabric Mills
  type: BicsLevel6Segment
  type: Classifier
  type: ContemporaryDerivation
  derived from: http://data.ga-group.nl/ics/bics/2014/111011111111
  source accessed on: 2019-12-03T20:05:01Z
  source last accessed on: 2019-12-03T20:05:01Z
  definition: This segment includes companies that take fiber, yarn and thread and weave them into fabrics used to make garments.
  notation: 111011111111
  valid from: 2014-08-08
  valid till: 2020-10-03
derived from: Other Electrical Equipment
  type: BicsLevel5Segment
  type: Classifier
  type: AnachronousDerivation
  derived from: http://data.ga-group.nl/ics/bics/2014/1111111112
  source accessed on: 2019-12-03T20:05:01Z
  source last accessed on: 2019-12-03T20:05:01Z
  definition: This segment includes companies that manufacture electrical and electronic equipment, except lighting systems and audio/video equipment. Includes automotive systems, cruise control systems, power window systems, alternators, starters, engine control units, sensors, and wiper systems.
  notation: 1111111112
  valid from: 2014-08-08
  valid till: 2020-10-03
derived from: Auto Electronics
  type: BicsLevel6Segment
  type: Classifier
  type: ContemporaryDerivation
  derived from: http://data.ga-group.nl/ics/bics/2020/111011111111
  derived from: http://data.ga-group.nl/ics/bics/2024/111011111111
  source accessed on: 2023-07-03T18:11:29Z
  source last accessed on: 2024-06-05T14:42:36Z
  definition: This segment includes companies that manufacture electrical and electronic equipment. Includes automotive systems, cruise control systems, power window systems, alternators, starters, engine control units, sensors, and wiper systems. Excludes car audio equipment (see Home & Car Audio Equipment).
  notation: 111011111111
  valid from: 2020-10-03
source accessed on: 2019-12-03T20:05:01Z
source last accessed on: 2024-06-05T14:42:36Z
definition: This segment includes companies that manufacture electrical and electronic equipment. Includes automotive systems, cruise control systems, power window systems, alternators, starters, engine control units, sensors, and wiper systems. Excludes car audio equipment (see Home & Car Audio Equipment).
notation: 111011111111
valid from: 2014-08-08

Other Knit Fabric & Lace Mills
type: BicsLevel6Segment
type: Classifier
type: NamedIndividual
is level6 segment of: Auto Electrical & Electronics
created with: infer-bics.sql
derived from: Other Knit Fabric & Lace Mills
  type: BicsLevel6Segment
  type: Classifier
  type: ContemporaryDerivation
  derived from: http://data.ga-group.nl/ics/bics/2014/111011111112
  source accessed on: 2019-12-03T20:05:01Z
  source last accessed on: 2019-12-03T20:05:01Z
  definition: This segment includes companies that knit yarns used in sweaters, hats and other knit products not elsewhere classified.
  notation: 111011111112
  valid from: 2014-08-08
  valid till: 2020-10-03
source accessed on: 2019-12-03T20:05:01Z
source last accessed on: 2019-12-03T20:05:01Z
definition: This segment includes companies that knit yarns used in sweaters, hats and other knit products not elsewhere classified.
notation: 111011111112
valid from: 2014-08-08
valid till: 2020-10-03

Auto Electrical & Electronics
type: BicsLevel5Segment
type: Classifier
type: NamedIndividual
is level5 segment of: Auto Parts
is replaced by: Fabric
created with: infer-bics.sql
derived from: Fabric
  type: BicsLevel5Segment
  type: Classifier
  type: ContemporaryDerivation
  derived from: http://data.ga-group.nl/ics/bics/2014/1110111111
  source accessed on: 2019-12-03T20:05:01Z
  source last accessed on: 2019-12-03T20:05:01Z
  definition: This segment includes mills that produce fabric or cloth used to make garments or other textile products.
  notation: 1110111111
  valid from: 2014-08-08
  valid till: 2020-10-03
derived from: Auto Electrical
  type: BicsLevel4SubIndustry
  type: Classifier
  type: AnachronousDerivation
  derived from: http://data.ga-group.nl/ics/bics/2014/11111111
  source accessed on: 2019-12-03T20:05:01Z
  source last accessed on: 2019-12-03T20:05:01Z
  definition: This industry subgroup includes companies that manufacture onboard electrical and electronic equipment for the automobile industry.
  notation: 11111111
  valid from: 2014-08-08
  valid till: 2020-10-03
derived from: Auto Electrical & Electronics
  type: BicsLevel5Segment
  type: Classifier
  type: ContemporaryDerivation
  derived from: http://data.ga-group.nl/ics/bics/2020/1110111111
  derived from: http://data.ga-group.nl/ics/bics/2024/1110111111
  source accessed on: 2023-07-03T18:11:29Z
  source last accessed on: 2024-06-05T14:42:36Z
  definition: This segment includes companies that manufacture onboard electrical and electronic equipment for the automobile industry.
  notation: 1110111111
  valid from: 2020-10-03
source accessed on: 2019-12-03T20:05:01Z
source last accessed on: 2024-06-05T14:42:36Z
definition: This segment includes companies that manufacture onboard electrical and electronic equipment for the automobile industry.
notation: 1110111111
valid from: 2014-08-08

Synthetic Fiber & Thread
type: BicsLevel6Segment
type: Classifier
type: NamedIndividual
is level6 segment of: Auto Glass
is replaced by: Synthetic Fiber & Thread
created with: infer-bics.sql
derived from: Synthetic Fiber & Thread
  type: BicsLevel6Segment
  type: Classifier
  type: ContemporaryDerivation
  derived from: http://data.ga-group.nl/ics/bics/2014/111011111210
  source accessed on: 2019-12-03T20:05:01Z
  source last accessed on: 2019-12-03T20:05:01Z
  definition: This segment includes companies that manufacture synthetic fibers and threads, such as polyester, nylon and acrylics, among others. These synthetic materials are used in a host of industries not limited to apparel and textile products.
  notation: 111011111210
  valid from: 2014-08-08
  valid till: 2020-10-03
source accessed on: 2019-12-03T20:05:01Z
source last accessed on: 2019-12-03T20:05:01Z
definition: This segment includes companies that manufacture synthetic fibers and threads, such as polyester, nylon and acrylics, among others. These synthetic materials are used in a host of industries not limited to apparel and textile products.
notation: 111011111210
valid from: 2014-08-08
valid till: 2020-10-03

Thread Mills
type: BicsLevel6Segment
type: Classifier
type: NamedIndividual
is level6 segment of: Auto Glass
is replaced by: Thread Mills
created with: infer-bics.sql
derived from: Thread Mills
  type: BicsLevel6Segment
  type: Classifier
  type: ContemporaryDerivation
  derived from: http://data.ga-group.nl/ics/bics/2014/111011111211
  source accessed on: 2019-12-03T20:05:01Z
  source last accessed on: 2019-12-03T20:05:01Z
  definition: This segment includes companies that produce threads, which are a thin type of yarn used to stitch fabrics.
  notation: 111011111211
  valid from: 2014-08-08
  valid till: 2020-10-03
source accessed on: 2019-12-03T20:05:01Z
source last accessed on: 2019-12-03T20:05:01Z
definition: This segment includes companies that produce threads, which are a thin type of yarn used to stitch fabrics.
notation: 111011111211
valid from: 2014-08-08
valid till: 2020-10-03

Yarn Spinning Mills
type: BicsLevel6Segment
type: Classifier
type: NamedIndividual
is level6 segment of: Auto Glass
is replaced by: Yarn Spinning Mills
created with: infer-bics.sql
derived from: Yarn Spinning Mills
  type: BicsLevel6Segment
  type: Classifier
  type: ContemporaryDerivation
  derived from: http://data.ga-group.nl/ics/bics/2014/111011111212
  source accessed on: 2019-12-03T20:05:01Z
  source last accessed on: 2019-12-03T20:05:01Z
  definition: This segment includes companies that spin yarn from the fiber materials, such as cotton.
  notation: 111011111212
  valid from: 2014-08-08
  valid till: 2020-10-03
source accessed on: 2019-12-03T20:05:01Z
source last accessed on: 2019-12-03T20:05:01Z
definition: This segment includes companies that spin yarn from the fiber materials, such as cotton.
notation: 111011111212
valid from: 2014-08-08
valid till: 2020-10-03

Yarn Texturizing, Throw & Twist
type: BicsLevel6Segment
type: Classifier
type: NamedIndividual
is level6 segment of: Auto Glass
is replaced by: Yarn Texturizing, Throw & Twist
created with: infer-bics.sql
derived from: Yarn Texturizing, Throw & Twist
  type: BicsLevel6Segment
  type: Classifier
  type: ContemporaryDerivation
  derived from: http://data.ga-group.nl/ics/bics/2014/111011111213
  source accessed on: 2019-12-03T20:05:01Z
  source last accessed on: 2019-12-03T20:05:01Z
  definition: This segment includes companies that texturize yarn, which is a process in which multiple filament yarns are combined to create a strong, spun yarn.
  notation: 111011111213
  valid from: 2014-08-08
  valid till: 2020-10-03
source accessed on: 2019-12-03T20:05:01Z
source last accessed on: 2019-12-03T20:05:01Z
definition: This segment includes companies that texturize yarn, which is a process in which multiple filament yarns are combined to create a strong, spun yarn.
notation: 111011111213
valid from: 2014-08-08
valid till: 2020-10-03

Auto Glass
type: BicsLevel5Segment
type: Classifier
type: NamedIndividual
is level5 segment of: Auto Parts
is replaced by: Fiber, Yarn & Thread
created with: infer-bics.sql
derived from: Fiber, Yarn & Thread
  type: BicsLevel5Segment
  type: Classifier
  type: ContemporaryDerivation
  derived from: http://data.ga-group.nl/ics/bics/2014/1110111112
  source accessed on: 2019-12-03T20:05:01Z
  source last accessed on: 2019-12-03T20:05:01Z
  definition: This segment includes mills that spin, throw and manufacture yarns, threads and fibers that can then be woven into fabric.
  notation: 1110111112
  valid from: 2014-08-08
  valid till: 2020-10-03
derived from: Auto Glass
  type: BicsLevel4SubIndustry
  type: Classifier
  type: AnachronousDerivation
  derived from: http://data.ga-group.nl/ics/bics/2014/11111112
  source accessed on: 2019-12-03T20:05:01Z
  source last accessed on: 2019-12-03T20:05:01Z
  definition: This industry subgroup includes companies that manufacture automobile glass. Products include tinted and tintless windshields, windows and sun and moon roofs.
  notation: 11111112
  valid from: 2014-08-08
  valid till: 2020-10-03
derived from: Auto Glass
  type: BicsLevel5Segment
  type: Classifier
  type: ContemporaryDerivation
  derived from: http://data.ga-group.nl/ics/bics/2020/1110111112
  derived from: http://data.ga-group.nl/ics/bics/2024/1110111112
  source accessed on: 2023-07-03T18:11:29Z
  source last accessed on: 2024-06-05T14:42:36Z
  definition: This segment includes companies that manufacture automobile glass. Includes tinted and tintless windshields, windows, and sun and moon roofs.
  notation: 1110111112
  valid from: 2020-10-03
source accessed on: 2019-12-03T20:05:01Z
source last accessed on: 2024-06-05T14:42:36Z
definition: This segment includes companies that manufacture automobile glass. Includes tinted and tintless windshields, windows, and sun and moon roofs.
notation: 1110111112
valid from: 2014-08-08

Auto HVAC Systems
type: BicsLevel5Segment
type: Classifier
type: NamedIndividual
is level5 segment of: Auto Parts
created with: infer-bics.sql
derived from: Auto HVAC Systems
  type: BicsLevel4SubIndustry
  type: Classifier
  type: AnachronousDerivation
  derived from: http://data.ga-group.nl/ics/bics/2014/11111121
  source accessed on: 2019-12-03T20:05:01Z
  source last accessed on: 2019-12-03T20:05:01Z
  definition: This industry subgroup includes companies that manufacture heating, ventilation and air conditioning (HVAC) systems and their components.
  notation: 11111121
  valid from: 2014-08-08
  valid till: 2020-10-03
derived from: Auto HVAC Systems
  type: BicsLevel5Segment
  type: Classifier
  type: ContemporaryDerivation
  derived from: http://data.ga-group.nl/ics/bics/2020/1110111113
  derived from: http://data.ga-group.nl/ics/bics/2024/1110111113
  source accessed on: 2023-07-03T18:11:29Z
  source last accessed on: 2024-06-05T14:42:36Z
  definition: This segment includes companies that manufacture heating, ventilation, and air conditioning (HVAC) systems and their components.
  notation: 1110111113
  valid from: 2020-10-03
source accessed on: 2023-07-03T18:11:29Z
source last accessed on: 2024-06-05T14:42:36Z
definition: This segment includes companies that manufacture heating, ventilation, and air conditioning (HVAC) systems and their components.
notation: 1110111113
valid from: 2020-10-03

Auto Metal Stamping
type: BicsLevel5Segment
type: Classifier
type: NamedIndividual
is level5 segment of: Auto Parts
created with: infer-bics.sql
derived from: Auto Metal Stamping
  type: BicsLevel4SubIndustry
  type: Classifier
  type: AnachronousDerivation
  derived from: http://data.ga-group.nl/ics/bics/2014/11111113
  source accessed on: 2019-12-03T20:05:01Z
  source last accessed on: 2019-12-03T20:05:01Z
  definition: This industry subgroup includes companies that manufacture automobile metal stampings. Products include body parts, fenders, hubcaps and tops.
  notation: 11111113
  valid from: 2014-08-08
  valid till: 2020-10-03
derived from: Auto Metal Stamping
  type: BicsLevel5Segment
  type: Classifier
  type: ContemporaryDerivation
  derived from: http://data.ga-group.nl/ics/bics/2020/1110111114
  derived from: http://data.ga-group.nl/ics/bics/2024/1110111114
  source accessed on: 2023-07-03T18:11:29Z
  source last accessed on: 2024-06-05T14:42:36Z
  definition: This segment includes companies that manufacture auto parts primarily produced by the metal stamping fabrication process. Includes body parts, fenders, hubcaps, and tops.
  notation: 1110111114
  valid from: 2020-10-03
source accessed on: 2023-07-03T18:11:29Z
source last accessed on: 2024-06-05T14:42:36Z
definition: This segment includes companies that manufacture auto parts primarily produced by the metal stamping fabrication process. Includes body parts, fenders, hubcaps, and tops.
notation: 1110111114
valid from: 2020-10-03

Auto Safety Equipment
type: BicsLevel5Segment
type: Classifier
type: NamedIndividual
is level5 segment of: Auto Parts
created with: infer-bics.sql
derived from: Auto Safety Equipment
  type: BicsLevel4SubIndustry
  type: Classifier
  type: AnachronousDerivation
  derived from: http://data.ga-group.nl/ics/bics/2014/11111114
  source accessed on: 2019-12-03T20:05:01Z
  source last accessed on: 2019-12-03T20:05:01Z
  definition: This industry subgroup includes companies that manufacture automotive safety equipment. Products include airbags and seatbelts.
  notation: 11111114
  valid from: 2014-08-08
  valid till: 2020-10-03
derived from: Auto Safety Equipment
  type: BicsLevel5Segment
  type: Classifier
  type: ContemporaryDerivation
  derived from: http://data.ga-group.nl/ics/bics/2020/1110111115
  derived from: http://data.ga-group.nl/ics/bics/2024/1110111115
  source accessed on: 2023-07-03T18:11:29Z
  source last accessed on: 2024-06-05T14:42:36Z
  definition: This segment includes companies that manufacture automotive safety equipment. Includes airbags and seatbelts.
  notation: 1110111115
  valid from: 2020-10-03
source accessed on: 2023-07-03T18:11:29Z
source last accessed on: 2024-06-05T14:42:36Z
definition: This segment includes companies that manufacture automotive safety equipment. Includes airbags and seatbelts.
notation: 1110111115
valid from: 2020-10-03

Automotive Engineering & Tech
type: BicsLevel5Segment
type: Classifier
type: NamedIndividual
is level5 segment of: Auto Parts
created with: infer-bics.sql
derived from: Automotive Engineering & Tech
  type: BicsLevel4SubIndustry
  type: Classifier
  type: AnachronousDerivation
  derived from: http://data.ga-group.nl/ics/bics/2014/11111115
  source accessed on: 2019-12-03T20:05:01Z
  source last accessed on: 2019-12-03T20:05:01Z
  definition: This industry subgroup includes companies that develop, license or sell technology applied in the automobile industry but are not involved in the manufacturing process.
  notation: 11111115
  valid from: 2014-08-08
  valid till: 2020-10-03
derived from: Automotive Engineering & Tech
  type: BicsLevel5Segment
  type: Classifier
  type: ContemporaryDerivation
  derived from: http://data.ga-group.nl/ics/bics/2020/1110111116
  derived from: http://data.ga-group.nl/ics/bics/2024/1110111116
  source accessed on: 2023-07-03T18:11:29Z
  source last accessed on: 2024-06-05T14:42:36Z
  definition: This segment includes companies that develop, license, or sell technology applied in the automobile industry but are not involved in the manufacturing process.
  notation: 1110111116
  valid from: 2020-10-03
source accessed on: 2023-07-03T18:11:29Z
source last accessed on: 2024-06-05T14:42:36Z
definition: This segment includes companies that develop, license, or sell technology applied in the automobile industry but are not involved in the manufacturing process.
notation: 1110111116
valid from: 2020-10-03

Body & Chassis
type: BicsLevel5Segment
type: Classifier
type: NamedIndividual
is level5 segment of: Auto Parts
created with: infer-bics.sql
derived from: Body & Chassis
  type: BicsLevel4SubIndustry
  type: Classifier
  type: AnachronousDerivation
  derived from: http://data.ga-group.nl/ics/bics/2014/11111116
  source accessed on: 2019-12-03T20:05:01Z
  source last accessed on: 2019-12-03T20:05:01Z
  definition: This industry subgroup includes companies that manufacture body and chassis structures, such as frames, roll cages, and joints.
  notation: 11111116
  valid from: 2014-08-08
  valid till: 2020-10-03
derived from: Body & Chassis
  type: BicsLevel5Segment
  type: Classifier
  type: ContemporaryDerivation
  derived from: http://data.ga-group.nl/ics/bics/2020/1110111117
  derived from: http://data.ga-group.nl/ics/bics/2024/1110111117
  source accessed on: 2023-07-03T18:11:29Z
  source last accessed on: 2024-06-05T14:42:36Z
  definition: This segment includes companies that manufacture body and chassis structures, such as frames, roll cages, and joints.
  notation: 1110111117
  valid from: 2020-10-03
source accessed on: 2023-07-03T18:11:29Z
source last accessed on: 2024-06-05T14:42:36Z
definition: This segment includes companies that manufacture body and chassis structures, such as frames, roll cages, and joints.
notation: 1110111117
valid from: 2020-10-03

Brake Systems
type: BicsLevel5Segment
type: Classifier
type: NamedIndividual
is level5 segment of: Auto Parts
created with: infer-bics.sql
derived from: Brake Systems
  type: BicsLevel4SubIndustry
  type: Classifier
  type: AnachronousDerivation
  derived from: http://data.ga-group.nl/ics/bics/2014/11111117
  source accessed on: 2019-12-03T20:05:01Z
  source last accessed on: 2019-12-03T20:05:01Z
  definition: This industry subgroup includes companies that manufacture automobile braking systems and related components.
  notation: 11111117
  valid from: 2014-08-08
  valid till: 2020-10-03
derived from: Brake Systems
  type: BicsLevel5Segment
  type: Classifier
  type: ContemporaryDerivation
  derived from: http://data.ga-group.nl/ics/bics/2020/1110111118
  derived from: http://data.ga-group.nl/ics/bics/2024/1110111118
  source accessed on: 2023-07-03T18:11:29Z
  source last accessed on: 2024-06-05T14:42:36Z
  definition: This segment includes companies that manufacture automobile braking systems and related components.
  notation: 1110111118
  valid from: 2020-10-03
source accessed on: 2023-07-03T18:11:29Z
source last accessed on: 2024-06-05T14:42:36Z
definition: This segment includes companies that manufacture automobile braking systems and related components.
notation: 1110111118
valid from: 2020-10-03

Drivetrain Components
type: BicsLevel5Segment
type: Classifier
type: NamedIndividual
is level5 segment of: Auto Parts
created with: infer-bics.sql
derived from: Drivetrain Components
  type: BicsLevel4SubIndustry
  type: Classifier
  type: AnachronousDerivation
  derived from: http://data.ga-group.nl/ics/bics/2014/11111118
  source accessed on: 2019-12-03T20:05:01Z
  source last accessed on: 2019-12-03T20:05:01Z
  definition: This industry subgroup includes companies that manufacture automobile transmission and powertrain parts.
  notation: 11111118
  valid from: 2014-08-08
  valid till: 2020-10-03
derived from: Drivetrain Components
  type: BicsLevel5Segment
  type: Classifier
  type: ContemporaryDerivation
  derived from: http://data.ga-group.nl/ics/bics/2020/1110111119
  derived from: http://data.ga-group.nl/ics/bics/2024/1110111119
  source accessed on: 2023-07-03T18:11:29Z
  source last accessed on: 2024-06-05T14:42:36Z
  definition: This segment includes companies that manufacture automobile transmission and powertrain parts.
  notation: 1110111119
  valid from: 2020-10-03
source accessed on: 2023-07-03T18:11:29Z
source last accessed on: 2024-06-05T14:42:36Z
definition: This segment includes companies that manufacture automobile transmission and powertrain parts.
notation: 1110111119
valid from: 2020-10-03

Diesel Engines & Engine Parts
type: BicsLevel6Segment
type: Classifier
type: NamedIndividual
is level6 segment of: Engines & Parts
replaces: Diesel Engines & Engine Parts
created with: infer-bics.sql
derived from: Diesel Engines & Engine Parts
  type: BicsLevel5Segment
  type: Classifier
  type: AnachronousDerivation
  derived from: http://data.ga-group.nl/ics/bics/2014/1111111910
  source accessed on: 2019-12-03T20:05:01Z
  source last accessed on: 2019-12-03T20:05:01Z
  definition: This segment includes companies that manufacture diesel engines and engine parts for automobiles.
  notation: 1111111910
  valid from: 2014-08-08
  valid till: 2020-10-03
derived from: Diesel Engines & Engine Parts
  type: BicsLevel6Segment
  type: Classifier
  type: ContemporaryDerivation
  derived from: http://data.ga-group.nl/ics/bics/2020/111011112010
  derived from: http://data.ga-group.nl/ics/bics/2024/111011112010
  source accessed on: 2023-07-03T18:11:29Z
  source last accessed on: 2024-06-05T14:42:36Z
  definition: This segment includes companies that manufacture diesel engines and engine parts for automobiles.
  notation: 111011112010
  valid from: 2020-10-03
source accessed on: 2023-07-03T18:11:29Z
source last accessed on: 2024-06-05T14:42:36Z
definition: This segment includes companies that manufacture diesel engines and engine parts for automobiles.
notation: 111011112010
valid from: 2020-10-03

Gasoline Engines & Eng Parts
type: BicsLevel6Segment
type: Classifier
type: NamedIndividual
is level6 segment of: Engines & Parts
replaces: Gasoline Engines & Eng Parts
created with: infer-bics.sql
derived from: Gasoline Engines & Eng Parts
  type: BicsLevel5Segment
  type: Classifier
  type: AnachronousDerivation
  derived from: http://data.ga-group.nl/ics/bics/2014/1111111911
  source accessed on: 2019-12-03T20:05:01Z
  source last accessed on: 2019-12-03T20:05:01Z
  definition: This segment includes companies that manufacture gasoline engines and engine parts for automobiles.
  notation: 1111111911
  valid from: 2014-08-08
  valid till: 2020-10-03
derived from: Gasoline Engines & Eng Parts
  type: BicsLevel6Segment
  type: Classifier
  type: ContemporaryDerivation
  derived from: http://data.ga-group.nl/ics/bics/2020/111011112011
  derived from: http://data.ga-group.nl/ics/bics/2024/111011112011
  source accessed on: 2023-07-03T18:11:29Z
  source last accessed on: 2024-06-05T14:42:36Z
  definition: This segment includes companies that manufacture gasoline engines and engine parts for automobiles.
  notation: 111011112011
  valid from: 2020-10-03
source accessed on: 2023-07-03T18:11:29Z
source last accessed on: 2024-06-05T14:42:36Z
definition: This segment includes companies that manufacture gasoline engines and engine parts for automobiles.
notation: 111011112011
valid from: 2020-10-03

Engines & Parts
type: BicsLevel5Segment
type: Classifier
type: NamedIndividual
is level5 segment of: Auto Parts
created with: infer-bics.sql
derived from: Engines & Parts
  type: BicsLevel4SubIndustry
  type: Classifier
  type: AnachronousDerivation
  derived from: http://data.ga-group.nl/ics/bics/2014/11111119
  source accessed on: 2019-12-03T20:05:01Z
  source last accessed on: 2019-12-03T20:05:01Z
  definition: This industry subgroup includes companies that manufacture automobile engines and engine parts. Products include gasoline and diesel engines and engine parts.
  notation: 11111119
  valid from: 2014-08-08
  valid till: 2020-10-03
derived from: Engines & Parts
  type: BicsLevel5Segment
  type: Classifier
  type: ContemporaryDerivation
  derived from: http://data.ga-group.nl/ics/bics/2020/1110111120
  derived from: http://data.ga-group.nl/ics/bics/2024/1110111120
  source accessed on: 2023-07-03T18:11:29Z
  source last accessed on: 2024-06-05T14:42:36Z
  definition: This segment includes companies that manufacture automobile engines and engine parts. Includes gasoline and diesel engines and engine parts.
  notation: 1110111120
  valid from: 2020-10-03
source accessed on: 2023-07-03T18:11:29Z
source last accessed on: 2024-06-05T14:42:36Z
definition: This segment includes companies that manufacture automobile engines and engine parts. Includes gasoline and diesel engines and engine parts.
notation: 1110111120
valid from: 2020-10-03

Exhausts & Emissions
type: BicsLevel5Segment
type: Classifier
type: NamedIndividual
is level5 segment of: Auto Parts
created with: infer-bics.sql
derived from: Exhausts & Emissions
  type: BicsLevel4SubIndustry
  type: Classifier
  type: AnachronousDerivation
  derived from: http://data.ga-group.nl/ics/bics/2014/11111120
  source accessed on: 2019-12-03T20:05:01Z
  source last accessed on: 2019-12-03T20:05:01Z
  definition: This industry subgroup includes companies that manufacture exhaust and emissions systems. Products include exhaust manifolds, exhaust pipes and catalytic converters.
  notation: 11111120
  valid from: 2014-08-08
  valid till: 2020-10-03
derived from: Exhausts & Emissions
  type: BicsLevel5Segment
  type: Classifier
  type: ContemporaryDerivation
  derived from: http://data.ga-group.nl/ics/bics/2020/1110111121
  derived from: http://data.ga-group.nl/ics/bics/2024/1110111121
  source accessed on: 2023-07-03T18:11:29Z
  source last accessed on: 2024-06-05T14:42:36Z
  definition: This segment includes companies that manufacture exhaust and emissions systems. Includes exhaust manifolds, exhaust pipes, and catalytic converters.
  notation: 1110111121
  valid from: 2020-10-03
source accessed on: 2023-07-03T18:11:29Z
source last accessed on: 2024-06-05T14:42:36Z
definition: This segment includes companies that manufacture exhaust and emissions systems. Includes exhaust manifolds, exhaust pipes, and catalytic converters.
notation: 1110111121
valid from: 2020-10-03

Seating & Trim
type: BicsLevel5Segment
type: Classifier
type: NamedIndividual
is level5 segment of: Auto Parts
created with: infer-bics.sql
derived from: Seating & Trim
  type: BicsLevel4SubIndustry
  type: Classifier
  type: AnachronousDerivation
  derived from: http://data.ga-group.nl/ics/bics/2014/11111122
  source accessed on: 2019-12-03T20:05:01Z
  source last accessed on: 2019-12-03T20:05:01Z
  definition: This industry subgroup includes companies that manufacture automobile seating equipment and interiors trims. Products include seats, panels, headliners and textiles.
  notation: 11111122
  valid from: 2014-08-08
  valid till: 2020-10-03
derived from: Seating & Trim
  type: BicsLevel5Segment
  type: Classifier
  type: ContemporaryDerivation
  derived from: http://data.ga-group.nl/ics/bics/2020/1110111122
  derived from: http://data.ga-group.nl/ics/bics/2024/1110111122
  source accessed on: 2023-07-03T18:11:29Z
  source last accessed on: 2024-06-05T14:42:36Z
  definition: This segment includes companies that manufacture automobile seating equipment and interiors trims. Includes seats, panels, headliners, and textiles.
  notation: 1110111122
  valid from: 2020-10-03
source accessed on: 2023-07-03T18:11:29Z
source last accessed on: 2024-06-05T14:42:36Z
definition: This segment includes companies that manufacture automobile seating equipment and interiors trims. Includes seats, panels, headliners, and textiles.
notation: 1110111122
valid from: 2020-10-03

Steering & Suspension
type: BicsLevel5Segment
type: Classifier
type: NamedIndividual
is level5 segment of: Auto Parts
created with: infer-bics.sql
derived from: Steering & Suspension
  type: BicsLevel4SubIndustry
  type: Classifier
  type: AnachronousDerivation
  derived from: http://data.ga-group.nl/ics/bics/2014/11111123
  source accessed on: 2019-12-03T20:05:01Z
  source last accessed on: 2019-12-03T20:05:01Z
  definition: This industry subgroup includes companies that manufacture steering, suspension parts, and shock absorbers, excluding springs.
  notation: 11111123
  valid from: 2014-08-08
  valid till: 2020-10-03
derived from: Steering & Suspension
  type: BicsLevel5Segment
  type: Classifier
  type: ContemporaryDerivation
  derived from: http://data.ga-group.nl/ics/bics/2020/1110111123
  derived from: http://data.ga-group.nl/ics/bics/2024/1110111123
  source accessed on: 2023-07-03T18:11:29Z
  source last accessed on: 2024-06-05T14:42:36Z
  definition: This segment includes companies that manufacture steering, suspension parts, and shock absorbers. Excludes springs.
  notation: 1110111123
  valid from: 2020-10-03
source accessed on: 2023-07-03T18:11:29Z
source last accessed on: 2024-06-05T14:42:36Z
definition: This segment includes companies that manufacture steering, suspension parts, and shock absorbers. Excludes springs.
notation: 1110111123
valid from: 2020-10-03

Tire
type: BicsLevel5Segment
type: Classifier
type: NamedIndividual
is level5 segment of: Auto Parts
created with: infer-bics.sql
derived from: Tire
  type: BicsLevel4SubIndustry
  type: Classifier
  type: AnachronousDerivation
  derived from: http://data.ga-group.nl/ics/bics/2014/11111124
  source accessed on: 2019-12-03T20:05:01Z
  source last accessed on: 2019-12-03T20:05:01Z
  definition: This industry subgroup includes companies that manufacture tires and inner tubes from natural and synthetic rubber.
  notation: 11111124
  valid from: 2014-08-08
  valid till: 2020-10-03
derived from: Tire
  type: BicsLevel5Segment
  type: Classifier
  type: ContemporaryDerivation
  derived from: http://data.ga-group.nl/ics/bics/2020/1110111124
  derived from: http://data.ga-group.nl/ics/bics/2024/1110111124
  source accessed on: 2023-07-03T18:11:29Z
  source last accessed on: 2024-06-05T14:42:36Z
  definition: This segment includes companies that manufacture tires and inner tubes from natural and synthetic rubber.
  notation: 1110111124
  valid from: 2020-10-03
source accessed on: 2023-07-03T18:11:29Z
source last accessed on: 2024-06-05T14:42:36Z
definition: This segment includes companies that manufacture tires and inner tubes from natural and synthetic rubber.
notation: 1110111124
valid from: 2020-10-03

Electric Vehicle Batteries
type: BicsLevel6Segment
type: Classifier
type: NamedIndividual
is level6 segment of: Vehicle Batteries
created with: infer-bics.sql
derived from: Electric Vehicle Batteries
  type: BicsLevel6Segment
  type: Classifier
  type: ContemporaryDerivation
  derived from: http://data.ga-group.nl/ics/bics/2024/111011112510
  source accessed on: 2024-06-05T14:42:36Z
  source last accessed on: 2024-06-05T14:42:36Z
  definition: This segment includes companies that manufacture batteries which power the motors of electric vehicles. Excludes batteries for hybrid electric vehicles (HEV).
  notation: 111011112510
  valid from: 2024-06-07
source accessed on: 2024-06-05T14:42:36Z
source last accessed on: 2024-06-05T14:42:36Z
definition: This segment includes companies that manufacture batteries which power the motors of electric vehicles. Excludes batteries for hybrid electric vehicles (HEV).
notation: 111011112510
valid from: 2024-06-07

Starter Batteries
type: BicsLevel6Segment
type: Classifier
type: NamedIndividual
is level6 segment of: Vehicle Batteries
created with: infer-bics.sql
derived from: Starter Batteries
  type: BicsLevel6Segment
  type: Classifier
  type: ContemporaryDerivation
  derived from: http://data.ga-group.nl/ics/bics/2024/111011112511
  source accessed on: 2024-06-05T14:42:36Z
  source last accessed on: 2024-06-05T14:42:36Z
  definition: This segment includes companies that manufacture batteries which are used to start the motors of internal combustion engine vehicles (ICEV).
  notation: 111011112511
  valid from: 2024-06-07
source accessed on: 2024-06-05T14:42:36Z
source last accessed on: 2024-06-05T14:42:36Z
definition: This segment includes companies that manufacture batteries which are used to start the motors of internal combustion engine vehicles (ICEV).
notation: 111011112511
valid from: 2024-06-07

Vehicle Batteries
type: BicsLevel5Segment
type: Classifier
type: NamedIndividual
is level5 segment of: Auto Parts
created with: infer-bics.sql
derived from: Vehicle Batteries
  type: BicsLevel4SubIndustry
  type: Classifier
  type: AnachronousDerivation
  derived from: http://data.ga-group.nl/ics/bics/2014/11111125
  source accessed on: 2019-12-03T20:05:01Z
  source last accessed on: 2019-12-03T20:05:01Z
  definition: This industry subgroup includes companies that manufacture batteries to power automobiles.
  notation: 11111125
  valid from: 2014-08-08
  valid till: 2020-10-03
derived from: Vehicle Batteries
  type: BicsLevel5Segment
  type: Classifier
  type: ContemporaryDerivation
  derived from: http://data.ga-group.nl/ics/bics/2020/1110111125
  source accessed on: 2023-07-03T18:11:29Z
  source last accessed on: 2023-07-03T18:11:29Z
  definition: This segment includes companies that manufacture batteries for automobiles. Excludes batteries that power electric or hybrid electric automobiles.
  notation: 1110111125
  valid from: 2020-10-03
  valid till: 2024-06-07
derived from: Vehicle Batteries
  type: BicsLevel5Segment
  type: Classifier
  type: ContemporaryDerivation
  derived from: http://data.ga-group.nl/ics/bics/2024/1110111125
  source accessed on: 2024-06-05T14:42:36Z
  source last accessed on: 2024-06-05T14:42:36Z
  definition: This segment includes companies that manufacture batteries for automobiles.
  notation: 1110111125
  valid from: 2024-06-07
source accessed on: 2023-07-03T18:11:29Z
source last accessed on: 2024-06-05T14:42:36Z
definition: This segment includes companies that manufacture batteries for automobiles.
notation: 1110111125
valid from: 2020-10-03

Vehicle Wheels
type: BicsLevel5Segment
type: Classifier
type: NamedIndividual
is level5 segment of: Auto Parts
created with: infer-bics.sql
derived from: Vehicle Wheels
  type: BicsLevel4SubIndustry
  type: Classifier
  type: AnachronousDerivation
  derived from: http://data.ga-group.nl/ics/bics/2014/11111126
  source accessed on: 2019-12-03T20:05:01Z
  source last accessed on: 2019-12-03T20:05:01Z
  definition: This industry subgroup includes companies that manufacture automobile wheels and rims. Products include steel, aluminum and alloy wheels.
  notation: 11111126
  valid from: 2014-08-08
  valid till: 2020-10-03
derived from: Vehicle Wheels
  type: BicsLevel5Segment
  type: Classifier
  type: ContemporaryDerivation
  derived from: http://data.ga-group.nl/ics/bics/2020/1110111126
  derived from: http://data.ga-group.nl/ics/bics/2024/1110111126
  source accessed on: 2023-07-03T18:11:29Z
  source last accessed on: 2024-06-05T14:42:36Z
  definition: This segment includes companies that manufacture automobile wheels and rims. Products include steel, aluminum, and alloy wheels.
  notation: 1110111126
  valid from: 2020-10-03
source accessed on: 2023-07-03T18:11:29Z
source last accessed on: 2024-06-05T14:42:36Z
definition: This segment includes companies that manufacture automobile wheels and rims. Products include steel, aluminum, and alloy wheels.
notation: 1110111126
valid from: 2020-10-03

Auto Parts
type: BicsLevel4SubIndustry
type: Classifier
type: NamedIndividual
replaces: Leisure Facilities & Services
created with: infer-bics.sql
derived from: Textile
  type: BicsLevel4SubIndustry
  type: Classifier
  type: ContemporaryDerivation
  derived from: http://data.ga-group.nl/ics/bics/2014/11101111
  source accessed on: 2019-12-03T20:05:01Z
  source last accessed on: 2019-12-03T20:05:01Z
  definition: This industry subgroup includes mills that manufacture and finish textiles.
  notation: 11101111
  valid from: 2014-08-08
  valid till: 2020-10-03
derived from: Auto Parts
  type: BicsLevel3Industry
  type: Classifier
  type: AnachronousDerivation
  derived from: http://data.ga-group.nl/ics/bics/2014/111111
  source accessed on: 2019-12-03T20:05:01Z
  source last accessed on: 2019-12-03T20:05:01Z
  definition: This industry includes companies that manufacture various types of automotive parts. Excludes companies that manufactures parts for commercial vehicles (see Commercial Vehicles) and motorcycles (see Motorbikes & Parts).
  notation: 111111
  valid from: 2014-08-08
  valid till: 2020-10-03
derived from: Auto Parts
  type: BicsLevel4SubIndustry
  type: Classifier
  type: ContemporaryDerivation
  derived from: http://data.ga-group.nl/ics/bics/2020/11101111
  source accessed on: 2023-07-03T18:11:29Z
  source last accessed on: 2023-07-03T18:11:29Z
  definition: This industry subgroup includes companies that manufacture various types of automotive parts. Excludes companies that manufacture parts for commercial vehicles (see Commercial Vehicles) and motorcycles (see Motorbikes & Parts).
  notation: 11101111
  valid from: 2020-10-03
  valid till: 2024-06-07
derived from: Auto Parts
  type: BicsLevel4SubIndustry
  type: Classifier
  type: ContemporaryDerivation
  derived from: http://data.ga-group.nl/ics/bics/2024/11101111
  source accessed on: 2024-06-05T14:42:36Z
  source last accessed on: 2024-06-05T14:42:36Z
  definition: This industry subgroup includes companies that manufacture various types of automotive parts. Excludes companies that manufacture parts for commercial vehicles (see Commercial Vehicles) and motorcycles (see Motorcycles).
  notation: 11101111
  valid from: 2024-06-07
source accessed on: 2019-12-03T20:05:01Z
source last accessed on: 2024-06-05T14:42:36Z
definition: This industry subgroup includes companies that manufacture various types of automotive parts. Excludes companies that manufacture parts for commercial vehicles (see Commercial Vehicles) and motorcycles (see Motorcycles).
notation: 11101111
valid from: 2014-08-08

Curtain & Drapery Mills
type: BicsLevel6Segment
type: Classifier
type: NamedIndividual
is level6 segment of: Textile Furnish
created with: infer-bics.sql
derived from: Curtain & Drapery Mills
  type: BicsLevel6Segment
  type: Classifier
  type: ContemporaryDerivation
  derived from: http://data.ga-group.nl/ics/bics/2014/111011121010
  source accessed on: 2019-12-03T20:05:01Z
  source last accessed on: 2019-12-03T20:05:01Z
  definition: This segment includes companies that mill curtains and drapery.
  notation: 111011121010
  valid from: 2014-08-08
  valid till: 2020-10-03
source accessed on: 2019-12-03T20:05:01Z
source last accessed on: 2019-12-03T20:05:01Z
definition: This segment includes companies that mill curtains and drapery.
notation: 111011121010
valid from: 2014-08-08
valid till: 2020-10-03

Other Household Textile Prods
type: BicsLevel6Segment
type: Classifier
type: NamedIndividual
is level6 segment of: Textile Furnish
created with: infer-bics.sql
derived from: Other Household Textile Prods
  type: BicsLevel6Segment
  type: Classifier
  type: ContemporaryDerivation
  derived from: http://data.ga-group.nl/ics/bics/2014/111011121011
  source accessed on: 2019-12-03T20:05:01Z
  source last accessed on: 2019-12-03T20:05:01Z
  definition: This segment includes companies that mill other household textiles not elsewhere classified, such as tablecloths.
  notation: 111011121011
  valid from: 2014-08-08
  valid till: 2020-10-03
source accessed on: 2019-12-03T20:05:01Z
source last accessed on: 2019-12-03T20:05:01Z
definition: This segment includes companies that mill other household textiles not elsewhere classified, such as tablecloths.
notation: 111011121011
valid from: 2014-08-08
valid till: 2020-10-03

Textile Furnish
type: BicsLevel5Segment
type: Classifier
type: NamedIndividual
is level5 segment of: Textile Products
created with: infer-bics.sql
derived from: Textile Furnish
  type: BicsLevel5Segment
  type: Classifier
  type: ContemporaryDerivation
  derived from: http://data.ga-group.nl/ics/bics/2014/1110111210
  source accessed on: 2019-12-03T20:05:01Z
  source last accessed on: 2019-12-03T20:05:01Z
  definition: This segment includes companies that produce textiles used in furniture and home decorations.
  notation: 1110111210
  valid from: 2014-08-08
  valid till: 2020-10-03
source accessed on: 2019-12-03T20:05:01Z
source last accessed on: 2019-12-03T20:05:01Z
definition: This segment includes companies that produce textiles used in furniture and home decorations.
notation: 1110111210
valid from: 2014-08-08
valid till: 2020-10-03

Canvas & Related Prods Mills
type: BicsLevel6Segment
type: Classifier
type: NamedIndividual
is level6 segment of: Other Textile Products
is replaced by: Canvas & Related Prods Mills
created with: infer-bics.sql
derived from: Canvas & Related Prods Mills
  type: BicsLevel6Segment
  type: Classifier
  type: ContemporaryDerivation
  derived from: http://data.ga-group.nl/ics/bics/2014/111011121110
  source accessed on: 2019-12-03T20:05:01Z
  source last accessed on: 2019-12-03T20:05:01Z
  definition: This segment includes companies that produce canvas products.
  notation: 111011121110
  valid from: 2014-08-08
  valid till: 2020-10-03
source accessed on: 2019-12-03T20:05:01Z
source last accessed on: 2019-12-03T20:05:01Z
definition: This segment includes companies that produce canvas products.
notation: 111011121110
valid from: 2014-08-08
valid till: 2020-10-03

Cotton Farming
type: BicsLevel6Segment
type: Classifier
type: NamedIndividual
is level6 segment of: Other Textile Products
is replaced by: Cotton Farming
created with: infer-bics.sql
derived from: Cotton Farming
  type: BicsLevel6Segment
  type: Classifier
  type: ContemporaryDerivation
  derived from: http://data.ga-group.nl/ics/bics/2014/111011121111
  source accessed on: 2019-12-03T20:05:01Z
  source last accessed on: 2019-12-03T20:05:01Z
  definition: This segment includes companies that grow cotton plants.
  notation: 111011121111
  valid from: 2014-08-08
  valid till: 2020-10-03
source accessed on: 2019-12-03T20:05:01Z
source last accessed on: 2019-12-03T20:05:01Z
definition: This segment includes companies that grow cotton plants.
notation: 111011121111
valid from: 2014-08-08
valid till: 2020-10-03

Rope, Cordage & Twine Mills
type: BicsLevel6Segment
type: Classifier
type: NamedIndividual
is level6 segment of: Other Textile Products
is replaced by: Rope, Cordage & Twine Mills
created with: infer-bics.sql
derived from: Rope, Cordage & Twine Mills
  type: BicsLevel6Segment
  type: Classifier
  type: ContemporaryDerivation
  derived from: http://data.ga-group.nl/ics/bics/2014/111011121112
  source accessed on: 2019-12-03T20:05:01Z
  source last accessed on: 2019-12-03T20:05:01Z
  definition: This segment includes companies that spin fibers into rope, cordage or twine.
  notation: 111011121112
  valid from: 2014-08-08
  valid till: 2020-10-03
source accessed on: 2019-12-03T20:05:01Z
source last accessed on: 2019-12-03T20:05:01Z
definition: This segment includes companies that spin fibers into rope, cordage or twine.
notation: 111011121112
valid from: 2014-08-08
valid till: 2020-10-03

Textile Bag Mills
type: BicsLevel6Segment
type: Classifier
type: NamedIndividual
is level6 segment of: Other Textile Products
is replaced by: Textile Bag Mills
created with: infer-bics.sql
derived from: Textile Bag Mills
  type: BicsLevel6Segment
  type: Classifier
  type: ContemporaryDerivation
  derived from: http://data.ga-group.nl/ics/bics/2014/111011121113
  source accessed on: 2019-12-03T20:05:01Z
  source last accessed on: 2019-12-03T20:05:01Z
  definition: This segment includes companies that manufacture textile bags. This is primarily comprised of non-branded bags, such as generic brown bags used for bulk transport of grains and other substances.
  notation: 111011121113
  valid from: 2014-08-08
  valid till: 2020-10-03
source accessed on: 2019-12-03T20:05:01Z
source last accessed on: 2019-12-03T20:05:01Z
definition: This segment includes companies that manufacture textile bags. This is primarily comprised of non-branded bags, such as generic brown bags used for bulk transport of grains and other substances.
notation: 111011121113
valid from: 2014-08-08
valid till: 2020-10-03

Tire Cord & Tire Fabrics Mills
type: BicsLevel6Segment
type: Classifier
type: NamedIndividual
is level6 segment of: Other Textile Products
is replaced by: Tire Cord & Tire Fabrics Mills
created with: infer-bics.sql
derived from: Tire Cord & Tire Fabrics Mills
  type: BicsLevel6Segment
  type: Classifier
  type: ContemporaryDerivation
  derived from: http://data.ga-group.nl/ics/bics/2014/111011121114
  source accessed on: 2019-12-03T20:05:01Z
  source last accessed on: 2019-12-03T20:05:01Z
  definition: This segment includes companies that produce tire cord.
  notation: 111011121114
  valid from: 2014-08-08
  valid till: 2020-10-03
source accessed on: 2019-12-03T20:05:01Z
source last accessed on: 2019-12-03T20:05:01Z
definition: This segment includes companies that produce tire cord.
notation: 111011121114
valid from: 2014-08-08
valid till: 2020-10-03

Other Textile Prods Mills
type: BicsLevel6Segment
type: Classifier
type: NamedIndividual
is level6 segment of: Other Textile Products
created with: infer-bics.sql
derived from: Other Textile Prods Mills
  type: BicsLevel6Segment
  type: Classifier
  type: ContemporaryDerivation
  derived from: http://data.ga-group.nl/ics/bics/2014/111011121115
  source accessed on: 2019-12-03T20:05:01Z
  source last accessed on: 2019-12-03T20:05:01Z
  definition: This segment includes companies that produce any other type of textile product not elsewhere classified.
  notation: 111011121115
  valid from: 2014-08-08
  valid till: 2020-10-03
source accessed on: 2019-12-03T20:05:01Z
source last accessed on: 2019-12-03T20:05:01Z
definition: This segment includes companies that produce any other type of textile product not elsewhere classified.
notation: 111011121115
valid from: 2014-08-08
valid till: 2020-10-03

Other Textile Products
type: BicsLevel5Segment
type: Classifier
type: NamedIndividual
is level5 segment of: Textile Products
created with: infer-bics.sql
derived from: Other Textile Products
  type: BicsLevel5Segment
  type: Classifier
  type: ContemporaryDerivation
  derived from: http://data.ga-group.nl/ics/bics/2014/1110111211
  source accessed on: 2019-12-03T20:05:01Z
  source last accessed on: 2019-12-03T20:05:01Z
  definition: This segment includes companies that provide other textile products not elsewhere classified.
  notation: 1110111211
  valid from: 2014-08-08
  valid till: 2020-10-03
source accessed on: 2019-12-03T20:05:01Z
source last accessed on: 2019-12-03T20:05:01Z
definition: This segment includes companies that provide other textile products not elsewhere classified.
notation: 1110111211
valid from: 2014-08-08
valid till: 2020-10-03

Textile Products
type: BicsLevel4SubIndustry
type: Classifier
type: NamedIndividual
created with: infer-bics.sql
derived from: Textile Products
  type: BicsLevel4SubIndustry
  type: Classifier
  type: ContemporaryDerivation
  derived from: http://data.ga-group.nl/ics/bics/2014/11101112
  source accessed on: 2019-12-03T20:05:01Z
  source last accessed on: 2019-12-03T20:05:01Z
  definition: This industry subgroup includes companies that produce finished, non-apparel textile products.
  notation: 11101112
  valid from: 2014-08-08
  valid till: 2020-10-03
source accessed on: 2019-12-03T20:05:01Z
source last accessed on: 2019-12-03T20:05:01Z
definition: This industry subgroup includes companies that produce finished, non-apparel textile products.
notation: 11101112
valid from: 2014-08-08
valid till: 2020-10-03

Automotive
type: BicsLevel3Industry
type: Classifier
type: NamedIndividual
is industry of: Consumer Discretionary Products
is replaced by: Textile & Textile Products
replaces: Consumer Discretionary Services
created with: infer-bics.sql
derived from: Textile & Textile Products
  type: BicsLevel3Industry
  type: Classifier
  type: ContemporaryDerivation
  derived from: http://data.ga-group.nl/ics/bics/2014/111011
  source accessed on: 2019-12-03T20:05:01Z
  source last accessed on: 2019-12-03T20:05:01Z
  definition: This industry includes companies that produce textiles, such as yarns, threads, fabrics and leather goods.
  notation: 111011
  valid from: 2014-08-08
  valid till: 2020-10-03
derived from: Automotive
  type: BicsLevel2IndustryGroup
  type: Classifier
  type: AnachronousDerivation
  derived from: http://data.ga-group.nl/ics/bics/2014/1111
  source accessed on: 2019-12-03T20:05:01Z
  source last accessed on: 2019-12-03T20:05:01Z
  definition: This industry group includes companies that manufacture automobiles or automobile parts.
  notation: 1111
  valid from: 2014-08-08
  valid till: 2020-10-03
derived from: Automotive
  type: BicsLevel3Industry
  type: Classifier
  type: ContemporaryDerivation
  derived from: http://data.ga-group.nl/ics/bics/2020/111011
  derived from: http://data.ga-group.nl/ics/bics/2024/111011
  source accessed on: 2023-07-03T18:11:29Z
  source last accessed on: 2024-06-05T14:42:36Z
  definition: This industry includes companies that manufacture automobiles or automobile parts.
  notation: 111011
  valid from: 2020-10-03
source accessed on: 2019-12-03T20:05:01Z
source last accessed on: 2024-06-05T14:42:36Z
definition: This industry includes companies that manufacture automobiles or automobile parts.
notation: 111011
valid from: 2014-08-08

Single Family Homebuilding
type: BicsLevel5Segment
type: Classifier
type: NamedIndividual
is level5 segment of: Homebuilding
created with: infer-bics.sql
derived from: Single Family Home Const
  type: BicsLevel4SubIndustry
  type: Classifier
  type: AnachronousDerivation
  derived from: http://data.ga-group.nl/ics/bics/2014/11121010
  source accessed on: 2019-12-03T20:05:01Z
  source last accessed on: 2019-12-03T20:05:01Z
  definition: This industry subgroup includes companies that build and sell single family homes.
  notation: 11121010
  valid from: 2014-08-08
  valid till: 2020-10-03
derived from: Single Family Homebuilding
  type: BicsLevel5Segment
  type: Classifier
  type: ContemporaryDerivation
  derived from: http://data.ga-group.nl/ics/bics/2020/1110121010
  derived from: http://data.ga-group.nl/ics/bics/2024/1110121010
  source accessed on: 2023-07-03T18:11:29Z
  source last accessed on: 2024-06-05T14:42:36Z
  definition: This segment includes companies that build and sell single family homes.
  notation: 1110121010
  valid from: 2020-10-03
source accessed on: 2023-07-03T18:11:29Z
source last accessed on: 2024-06-05T14:42:36Z
definition: This segment includes companies that build and sell single family homes.
notation: 1110121010
valid from: 2020-10-03

Multifamily Homebuilding
type: BicsLevel5Segment
type: Classifier
type: NamedIndividual
is level5 segment of: Homebuilding
created with: infer-bics.sql
derived from: Multifamily Home Construction
  type: BicsLevel4SubIndustry
  type: Classifier
  type: AnachronousDerivation
  derived from: http://data.ga-group.nl/ics/bics/2014/11121011
  source accessed on: 2019-12-03T20:05:01Z
  source last accessed on: 2019-12-03T20:05:01Z
  definition: This industry subgroup includes companies that build and sell multifamily homes. Includes townhouses, condominiums and duplexes.
  notation: 11121011
  valid from: 2014-08-08
  valid till: 2020-10-03
derived from: Multifamily Homebuilding
  type: BicsLevel5Segment
  type: Classifier
  type: ContemporaryDerivation
  derived from: http://data.ga-group.nl/ics/bics/2020/1110121011
  derived from: http://data.ga-group.nl/ics/bics/2024/1110121011
  source accessed on: 2023-07-03T18:11:29Z
  source last accessed on: 2024-06-05T14:42:36Z
  definition: This segment includes companies that build and sell multifamily homes. Includes townhouses, condominiums, and duplexes.
  notation: 1110121011
  valid from: 2020-10-03
source accessed on: 2023-07-03T18:11:29Z
source last accessed on: 2024-06-05T14:42:36Z
definition: This segment includes companies that build and sell multifamily homes. Includes townhouses, condominiums, and duplexes.
notation: 1110121011
valid from: 2020-10-03

Manufactured Home (Mobile)
type: BicsLevel5Segment
type: Classifier
type: NamedIndividual
is level5 segment of: Homebuilding
created with: infer-bics.sql
derived from: Manufactured (Mobile) Home
  type: BicsLevel4SubIndustry
  type: Classifier
  type: AnachronousDerivation
  derived from: http://data.ga-group.nl/ics/bics/2014/11121012
  source accessed on: 2019-12-03T20:05:01Z
  source last accessed on: 2019-12-03T20:05:01Z
  definition: This industry subgroup includes companies that build and sell manufactured or mobile homes and other buildings.
  notation: 11121012
  valid from: 2014-08-08
  valid till: 2020-10-03
derived from: Manufactured Home (Mobile)
  type: BicsLevel5Segment
  type: Classifier
  type: ContemporaryDerivation
  derived from: http://data.ga-group.nl/ics/bics/2020/1110121012
  derived from: http://data.ga-group.nl/ics/bics/2024/1110121012
  source accessed on: 2023-07-03T18:11:29Z
  source last accessed on: 2024-06-05T14:42:36Z
  definition: This segment includes companies that build and sell manufactured or mobile homes and other buildings.
  notation: 1110121012
  valid from: 2020-10-03
source accessed on: 2023-07-03T18:11:29Z
source last accessed on: 2024-06-05T14:42:36Z
definition: This segment includes companies that build and sell manufactured or mobile homes and other buildings.
notation: 1110121012
valid from: 2020-10-03

Land Sales
type: BicsLevel5Segment
type: Classifier
type: NamedIndividual
is level5 segment of: Homebuilding
created with: infer-bics.sql
derived from: Land Sales
  type: BicsLevel4SubIndustry
  type: Classifier
  type: AnachronousDerivation
  derived from: http://data.ga-group.nl/ics/bics/2014/11121013
  source accessed on: 2019-12-03T20:05:01Z
  source last accessed on: 2019-12-03T20:05:01Z
  definition: This industry subgroup includes revenue derived from land sales by homebuilders.
  notation: 11121013
  valid from: 2014-08-08
  valid till: 2020-10-03
derived from: Land Sales
  type: BicsLevel5Segment
  type: Classifier
  type: ContemporaryDerivation
  derived from: http://data.ga-group.nl/ics/bics/2020/1110121013
  derived from: http://data.ga-group.nl/ics/bics/2024/1110121013
  source accessed on: 2023-07-03T18:11:29Z
  source last accessed on: 2024-06-05T14:42:36Z
  definition: This segment includes revenue derived from land sales by homebuilders.
  notation: 1110121013
  valid from: 2020-10-03
source accessed on: 2023-07-03T18:11:29Z
source last accessed on: 2024-06-05T14:42:36Z
definition: This segment includes revenue derived from land sales by homebuilders.
notation: 1110121013
valid from: 2020-10-03

Homebuilding
type: BicsLevel4SubIndustry
type: Classifier
type: NamedIndividual
replaces: Wholesale - Discretionary
created with: infer-bics.sql
derived from: Homebuilders
  type: BicsLevel3Industry
  type: Classifier
  type: AnachronousDerivation
  derived from: http://data.ga-group.nl/ics/bics/2014/111210
  source accessed on: 2019-12-03T20:05:01Z
  source last accessed on: 2019-12-03T20:05:01Z
  definition: This industry includes companies that build and sell residential buildings, including single and multifamily homes, apartments and condominiums. Excludes companies that rent properties.
  notation: 111210
  valid from: 2014-08-08
  valid till: 2020-10-03
derived from: Homebuilding
  type: BicsLevel4SubIndustry
  type: Classifier
  type: ContemporaryDerivation
  derived from: http://data.ga-group.nl/ics/bics/2020/11101210
  derived from: http://data.ga-group.nl/ics/bics/2024/11101210
  source accessed on: 2023-07-03T18:11:29Z
  source last accessed on: 2024-06-05T14:42:36Z
  definition: This industry subgroup includes companies that build and sell single family homes, townhouses, and other similar residential homes. Excludes companies that rent properties.
  notation: 11101210
  valid from: 2020-10-03
source accessed on: 2023-07-03T18:11:29Z
source last accessed on: 2024-06-05T14:42:36Z
definition: This industry subgroup includes companies that build and sell single family homes, townhouses, and other similar residential homes. Excludes companies that rent properties.
notation: 11101210
valid from: 2020-10-03

Carpet Flooring
type: BicsLevel6Segment
type: Classifier
type: NamedIndividual
is level6 segment of: Flooring
replaces: Mail Catalog Retailers
created with: infer-bics.sql
derived from: Carpets & Rugs
  type: BicsLevel5Segment
  type: Classifier
  type: AnachronousDerivation
  derived from: http://data.ga-group.nl/ics/bics/2014/1112111110
  source accessed on: 2019-12-03T20:05:01Z
  source last accessed on: 2019-12-03T20:05:01Z
  definition: This segment includes companies that mill carpets and rugs.
  notation: 1112111110
  valid from: 2014-08-08
  valid till: 2020-10-03
derived from: Carpet Flooring
  type: BicsLevel6Segment
  type: Classifier
  type: ContemporaryDerivation
  derived from: http://data.ga-group.nl/ics/bics/2020/111012111010
  derived from: http://data.ga-group.nl/ics/bics/2024/111012111010
  source accessed on: 2023-07-03T18:11:29Z
  source last accessed on: 2024-06-05T14:42:36Z
  definition: This segment includes companies that mill carpets and rugs.
  notation: 111012111010
  valid from: 2020-10-03
source accessed on: 2023-07-03T18:11:29Z
source last accessed on: 2024-06-05T14:42:36Z
definition: This segment includes companies that mill carpets and rugs.
notation: 111012111010
valid from: 2020-10-03

Tile Flooring
type: BicsLevel6Segment
type: Classifier
type: NamedIndividual
is level6 segment of: Flooring
replaces: Multi-Level Marketing
created with: infer-bics.sql
derived from: Ceramic Wall & Floor Tiles
  type: BicsLevel5Segment
  type: Classifier
  type: AnachronousDerivation
  derived from: http://data.ga-group.nl/ics/bics/2014/1112111111
  source accessed on: 2019-12-03T20:05:01Z
  source last accessed on: 2019-12-03T20:05:01Z
  definition: This segment includes companies that manufacture ceramic wall and floor tiles.
  notation: 1112111111
  valid from: 2014-08-08
  valid till: 2020-10-03
derived from: Tile Flooring
  type: BicsLevel6Segment
  type: Classifier
  type: ContemporaryDerivation
  derived from: http://data.ga-group.nl/ics/bics/2020/111012111011
  derived from: http://data.ga-group.nl/ics/bics/2024/111012111011
  source accessed on: 2023-07-03T18:11:29Z
  source last accessed on: 2024-06-05T14:42:36Z
  definition: This segment includes companies that manufacture wall and floor tiles.
  notation: 111012111011
  valid from: 2020-10-03
source accessed on: 2023-07-03T18:11:29Z
source last accessed on: 2024-06-05T14:42:36Z
definition: This segment includes companies that manufacture wall and floor tiles.
notation: 111012111011
valid from: 2020-10-03

Laminate & Wood Flooring
type: BicsLevel6Segment
type: Classifier
type: NamedIndividual
is level6 segment of: Flooring
replaces: TV Based Retailers
created with: infer-bics.sql
derived from: Hardwood Flooring
  type: BicsLevel5Segment
  type: Classifier
  type: AnachronousDerivation
  derived from: http://data.ga-group.nl/ics/bics/2014/1112111112
  source accessed on: 2019-12-03T20:05:01Z
  source last accessed on: 2019-12-03T20:05:01Z
  definition: This segment includes companies that plane and finish wood strips for unassembled wood flooring.
  notation: 1112111112
  valid from: 2014-08-08
  valid till: 2020-10-03
derived from: Laminate & Wood Flooring
  type: BicsLevel6Segment
  type: Classifier
  type: ContemporaryDerivation
  derived from: http://data.ga-group.nl/ics/bics/2020/111012111012
  derived from: http://data.ga-group.nl/ics/bics/2024/111012111012
  source accessed on: 2023-07-03T18:11:29Z
  source last accessed on: 2024-06-05T14:42:36Z
  definition: This segment includes companies that plane and finish wood strips for unassembled wood flooring.
  notation: 111012111012
  valid from: 2020-10-03
source accessed on: 2023-07-03T18:11:29Z
source last accessed on: 2024-06-05T14:42:36Z
definition: This segment includes companies that plane and finish wood strips for unassembled wood flooring.
notation: 111012111012
valid from: 2020-10-03

Vinyl Flooring
type: BicsLevel6Segment
type: Classifier
type: NamedIndividual
is level6 segment of: Flooring
replaces: Resilient Floor Covering
created with: infer-bics.sql
derived from: Resilient Floor Covering
  type: BicsLevel5Segment
  type: Classifier
  type: AnachronousDerivation
  derived from: http://data.ga-group.nl/ics/bics/2014/1112111113
  source accessed on: 2019-12-03T20:05:01Z
  source last accessed on: 2019-12-03T20:05:01Z
  definition: This segment includes companies that manufacture vinyl and linoleum floor covering.
  notation: 1112111113
  valid from: 2014-08-08
  valid till: 2020-10-03
derived from: Vinyl Flooring
  type: BicsLevel6Segment
  type: Classifier
  type: ContemporaryDerivation
  derived from: http://data.ga-group.nl/ics/bics/2020/111012111013
  derived from: http://data.ga-group.nl/ics/bics/2024/111012111013
  source accessed on: 2023-07-03T18:11:29Z
  source last accessed on: 2024-06-05T14:42:36Z
  definition: This segment includes companies that manufacture vinyl and linoleum floor covering.
  notation: 111012111013
  valid from: 2020-10-03
source accessed on: 2023-07-03T18:11:29Z
source last accessed on: 2024-06-05T14:42:36Z
definition: This segment includes companies that manufacture vinyl and linoleum floor covering.
notation: 111012111013
valid from: 2020-10-03

Flooring
type: BicsLevel5Segment
type: Classifier
type: NamedIndividual
is level5 segment of: Building Products
created with: infer-bics.sql
derived from: Flooring Products
  type: BicsLevel4SubIndustry
  type: Classifier
  type: AnachronousDerivation
  derived from: http://data.ga-group.nl/ics/bics/2014/11121111
  source accessed on: 2019-12-03T20:05:01Z
  source last accessed on: 2019-12-03T20:05:01Z
  definition: This industry subgroup includes companies that manufacture flooring products. Products include carpet, hardwood, tile, resilient, vinyl and laminate flooring.
  notation: 11121111
  valid from: 2014-08-08
  valid till: 2020-10-03
derived from: Flooring
  type: BicsLevel5Segment
  type: Classifier
  type: ContemporaryDerivation
  derived from: http://data.ga-group.nl/ics/bics/2020/1110121110
  derived from: http://data.ga-group.nl/ics/bics/2024/1110121110
  source accessed on: 2023-07-03T18:11:29Z
  source last accessed on: 2024-06-05T14:42:36Z
  definition: This segment includes companies that manufacture flooring products. Includes carpet, hardwood, tile, vinyl, and laminate flooring.
  notation: 1110121110
  valid from: 2020-10-03
source accessed on: 2023-07-03T18:11:29Z
source last accessed on: 2024-06-05T14:42:36Z
definition: This segment includes companies that manufacture flooring products. Includes carpet, hardwood, tile, vinyl, and laminate flooring.
notation: 1110121110
valid from: 2020-10-03

Cabinets & Countertops
type: BicsLevel5Segment
type: Classifier
type: NamedIndividual
is level5 segment of: Building Products
created with: infer-bics.sql
derived from: Kitchen Cabinets & Countertops
  type: BicsLevel4SubIndustry
  type: Classifier
  type: AnachronousDerivation
  derived from: http://data.ga-group.nl/ics/bics/2014/11121113
  source accessed on: 2019-12-03T20:05:01Z
  source last accessed on: 2019-12-03T20:05:01Z
  definition: This industry subgroup includes companies that manufacture wood cabinets and countertops for kitchens and bathrooms.
  notation: 11121113
  valid from: 2014-08-08
  valid till: 2020-10-03
derived from: Cabinets & Countertops
  type: BicsLevel5Segment
  type: Classifier
  type: ContemporaryDerivation
  derived from: http://data.ga-group.nl/ics/bics/2020/1110121111
  derived from: http://data.ga-group.nl/ics/bics/2024/1110121111
  source accessed on: 2023-07-03T18:11:29Z
  source last accessed on: 2024-06-05T14:42:36Z
  definition: This segment includes companies that manufacture cabinets and countertops for kitchens and bathrooms.
  notation: 1110121111
  valid from: 2020-10-03
source accessed on: 2023-07-03T18:11:29Z
source last accessed on: 2024-06-05T14:42:36Z
definition: This segment includes companies that manufacture cabinets and countertops for kitchens and bathrooms.
notation: 1110121111
valid from: 2020-10-03

Plumbing Fixtures
type: BicsLevel5Segment
type: Classifier
type: NamedIndividual
is level5 segment of: Building Products
created with: infer-bics.sql
derived from: Plumbing Products
  type: BicsLevel4SubIndustry
  type: Classifier
  type: AnachronousDerivation
  derived from: http://data.ga-group.nl/ics/bics/2014/11121115
  source accessed on: 2019-12-03T20:05:01Z
  source last accessed on: 2019-12-03T20:05:01Z
  definition: This industry subgroup includes companies that manufacture plumbing fixtures and bathroom accessories, such as sinks, bathtubs, faucets and hot tubs.
  notation: 11121115
  valid from: 2014-08-08
  valid till: 2020-10-03
derived from: Plumbing Fixtures
  type: BicsLevel5Segment
  type: Classifier
  type: ContemporaryDerivation
  derived from: http://data.ga-group.nl/ics/bics/2020/1110121112
  derived from: http://data.ga-group.nl/ics/bics/2024/1110121112
  source accessed on: 2023-07-03T18:11:29Z
  source last accessed on: 2024-06-05T14:42:36Z
  definition: This segment includes companies that manufacture plumbing fixtures and bathroom accessories, such as sinks, bathtubs, faucets and hot tubs.
  notation: 1110121112
  valid from: 2020-10-03
source accessed on: 2023-07-03T18:11:29Z
source last accessed on: 2024-06-05T14:42:36Z
definition: This segment includes companies that manufacture plumbing fixtures and bathroom accessories, such as sinks, bathtubs, faucets and hot tubs.
notation: 1110121112
valid from: 2020-10-03

Windows
type: BicsLevel6Segment
type: Classifier
type: NamedIndividual
is level6 segment of: Windows & Doors
replaces: Arts & Crafts Stores
created with: infer-bics.sql
derived from: Metal Windows & Doors
  type: BicsLevel5Segment
  type: Classifier
  type: AnachronousDerivation
  derived from: http://data.ga-group.nl/ics/bics/2014/1112111810
  source accessed on: 2019-12-03T20:05:01Z
  source last accessed on: 2019-12-03T20:05:01Z
  definition: This segment includes companies that manufacture metal windows and doors, sashes, windows and door frames.
  notation: 1112111810
  valid from: 2014-08-08
  valid till: 2020-10-03
derived from: Windows
  type: BicsLevel6Segment
  type: Classifier
  type: ContemporaryDerivation
  derived from: http://data.ga-group.nl/ics/bics/2020/111012111310
  derived from: http://data.ga-group.nl/ics/bics/2024/111012111310
  source accessed on: 2023-07-03T18:11:29Z
  source last accessed on: 2024-06-05T14:42:36Z
  definition: This segment includes companies that manufacture windows.
  notation: 111012111310
  valid from: 2020-10-03
source accessed on: 2023-07-03T18:11:29Z
source last accessed on: 2024-06-05T14:42:36Z
definition: This segment includes companies that manufacture windows.
notation: 111012111310
valid from: 2020-10-03

Doors
type: BicsLevel6Segment
type: Classifier
type: NamedIndividual
is level6 segment of: Windows & Doors
replaces: Cosmetics & Beauty Stores
created with: infer-bics.sql
derived from: Wood Window Doors
  type: BicsLevel5Segment
  type: Classifier
  type: AnachronousDerivation
  derived from: http://data.ga-group.nl/ics/bics/2014/1112111812
  source accessed on: 2019-12-03T20:05:01Z
  source last accessed on: 2019-12-03T20:05:01Z
  definition: This segment includes companies that manufacture wood windows and doors, sashes, windows and door frames.
  notation: 1112111812
  valid from: 2014-08-08
  valid till: 2020-10-03
derived from: Doors
  type: BicsLevel6Segment
  type: Classifier
  type: ContemporaryDerivation
  derived from: http://data.ga-group.nl/ics/bics/2020/111012111311
  derived from: http://data.ga-group.nl/ics/bics/2024/111012111311
  source accessed on: 2023-07-03T18:11:29Z
  source last accessed on: 2024-06-05T14:42:36Z
  definition: This segment includes companies that manufacture doors.
  notation: 111012111311
  valid from: 2020-10-03
source accessed on: 2023-07-03T18:11:29Z
source last accessed on: 2024-06-05T14:42:36Z
definition: This segment includes companies that manufacture doors.
notation: 111012111311
valid from: 2020-10-03

Windows & Doors
type: BicsLevel5Segment
type: Classifier
type: NamedIndividual
is level5 segment of: Building Products
created with: infer-bics.sql
derived from: Windows & Doors - Bldg Prods
  type: BicsLevel4SubIndustry
  type: Classifier
  type: AnachronousDerivation
  derived from: http://data.ga-group.nl/ics/bics/2014/11121118
  source accessed on: 2019-12-03T20:05:01Z
  source last accessed on: 2019-12-03T20:05:01Z
  definition: This industry subgroup includes companies that manufacture wood, metal and vinyl windows and doors, sashes, windows and door frames.
  notation: 11121118
  valid from: 2014-08-08
  valid till: 2020-10-03
derived from: Windows & Doors
  type: BicsLevel5Segment
  type: Classifier
  type: ContemporaryDerivation
  derived from: http://data.ga-group.nl/ics/bics/2020/1110121113
  derived from: http://data.ga-group.nl/ics/bics/2024/1110121113
  source accessed on: 2023-07-03T18:11:29Z
  source last accessed on: 2024-06-05T14:42:36Z
  definition: This segment includes companies that manufacture wood, metal and vinyl windows and doors, sashes, windows and door frames.
  notation: 1110121113
  valid from: 2020-10-03
source accessed on: 2023-07-03T18:11:29Z
source last accessed on: 2024-06-05T14:42:36Z
definition: This segment includes companies that manufacture wood, metal and vinyl windows and doors, sashes, windows and door frames.
notation: 1110121113
valid from: 2020-10-03

Building Products
type: BicsLevel4SubIndustry
type: Classifier
type: NamedIndividual
replaces: Retail - Discretionary
created with: infer-bics.sql
derived from: Home Improvement
  type: BicsLevel3Industry
  type: Classifier
  type: AnachronousDerivation
  derived from: http://data.ga-group.nl/ics/bics/2014/111211
  source accessed on: 2019-12-03T20:05:01Z
  source last accessed on: 2019-12-03T20:05:01Z
  definition: This industry includes companies that manufacture building products, appliances, tools, and lawn and garden supplies. Typically, these products are for decorative purposes and are affixed within the home. Excludes products utilized for structural integrity.
  notation: 111211
  valid from: 2014-08-08
  valid till: 2020-10-03
derived from: Building Products
  type: BicsLevel4SubIndustry
  type: Classifier
  type: ContemporaryDerivation
  derived from: http://data.ga-group.nl/ics/bics/2020/11101211
  derived from: http://data.ga-group.nl/ics/bics/2024/11101211
  source accessed on: 2023-07-03T18:11:29Z
  source last accessed on: 2024-06-05T14:42:36Z
  definition: This industry subgroup includes companies that manufacture building products, appliances, tools, and lawn and garden supplies. Excludes all raw materials classified under Materials.
  notation: 11101211
  valid from: 2020-10-03
source accessed on: 2023-07-03T18:11:29Z
source last accessed on: 2024-06-05T14:42:36Z
definition: This industry subgroup includes companies that manufacture building products, appliances, tools, and lawn and garden supplies. Excludes all raw materials classified under Materials.
notation: 11101211
valid from: 2020-10-03

Home Construction
type: BicsLevel3Industry
type: Classifier
type: NamedIndividual
is industry of: Consumer Discretionary Products
created with: infer-bics.sql
derived from: Home Construction
  type: BicsLevel3Industry
  type: Classifier
  type: ContemporaryDerivation
  derived from: http://data.ga-group.nl/ics/bics/2020/111012
  derived from: http://data.ga-group.nl/ics/bics/2024/111012
  source accessed on: 2023-07-03T18:11:29Z
  source last accessed on: 2024-06-05T14:42:36Z
  definition: This industry includes companies involved in the construction and building of homes.
  notation: 111012
  valid from: 2020-10-03
source accessed on: 2023-07-03T18:11:29Z
source last accessed on: 2024-06-05T14:42:36Z
definition: This industry includes companies involved in the construction and building of homes.
notation: 111012
valid from: 2020-10-03

Heating & Cooling Appliances
type: BicsLevel5Segment
type: Classifier
type: NamedIndividual
is level5 segment of: Household Appliances
replaces: Consumer Electronics Stores
created with: infer-bics.sql
derived from: Electric Housewares & Fans
  type: BicsLevel5Segment
  type: Classifier
  type: AnachronousDerivation
  derived from: http://data.ga-group.nl/ics/bics/2014/1112111210
  source accessed on: 2019-12-03T20:05:01Z
  source last accessed on: 2019-12-03T20:05:01Z
  definition: This segment includes companies that manufacture small household electrical appliances and housewares.
  notation: 1112111210
  valid from: 2014-08-08
  valid till: 2020-10-03
derived from: Heating & Cooling Appliances
  type: BicsLevel5Segment
  type: Classifier
  type: ContemporaryDerivation
  derived from: http://data.ga-group.nl/ics/bics/2020/1110131010
  derived from: http://data.ga-group.nl/ics/bics/2024/1110131010
  source accessed on: 2023-07-03T18:11:29Z
  source last accessed on: 2024-06-05T14:42:36Z
  definition: This segment includes companies that manufacture portable appliances used for heating or cooling. Includes desk fans, window air conditioners, and space heaters.
  notation: 1110131010
  valid from: 2020-10-03
source accessed on: 2023-07-03T18:11:29Z
source last accessed on: 2024-06-05T14:42:36Z
definition: This segment includes companies that manufacture portable appliances used for heating or cooling. Includes desk fans, window air conditioners, and space heaters.
notation: 1110131010
valid from: 2020-10-03

Cooking Appliances
type: BicsLevel5Segment
type: Classifier
type: NamedIndividual
is level5 segment of: Household Appliances
replaces: Household Appliance Stores
created with: infer-bics.sql
derived from: Household Cooking Appliances
  type: BicsLevel5Segment
  type: Classifier
  type: AnachronousDerivation
  derived from: http://data.ga-group.nl/ics/bics/2014/1112111211
  source accessed on: 2019-12-03T20:05:01Z
  source last accessed on: 2019-12-03T20:05:01Z
  definition: This segment includes companies that manufacture household cooking equipment.
  notation: 1112111211
  valid from: 2014-08-08
  valid till: 2020-10-03
derived from: Cooking Appliances
  type: BicsLevel5Segment
  type: Classifier
  type: ContemporaryDerivation
  derived from: http://data.ga-group.nl/ics/bics/2020/1110131011
  derived from: http://data.ga-group.nl/ics/bics/2024/1110131011
  source accessed on: 2023-07-03T18:11:29Z
  source last accessed on: 2024-06-05T14:42:36Z
  definition: This segment includes companies that manufacture household cooking equipment.
  notation: 1110131011
  valid from: 2020-10-03
source accessed on: 2023-07-03T18:11:29Z
source last accessed on: 2024-06-05T14:42:36Z
definition: This segment includes companies that manufacture household cooking equipment.
notation: 1110131011
valid from: 2020-10-03

Washers & Dryers
type: BicsLevel5Segment
type: Classifier
type: NamedIndividual
is level5 segment of: Household Appliances
replaces: Household Laundry Equipment
created with: infer-bics.sql
derived from: Household Laundry Equipment
  type: BicsLevel5Segment
  type: Classifier
  type: AnachronousDerivation
  derived from: http://data.ga-group.nl/ics/bics/2014/1112111212
  source accessed on: 2019-12-03T20:05:01Z
  source last accessed on: 2019-12-03T20:05:01Z
  definition: This segment includes companies that manufacture household laundry equipment.
  notation: 1112111212
  valid from: 2014-08-08
  valid till: 2020-10-03
derived from: Washers & Dryers
  type: BicsLevel5Segment
  type: Classifier
  type: ContemporaryDerivation
  derived from: http://data.ga-group.nl/ics/bics/2020/1110131012
  derived from: http://data.ga-group.nl/ics/bics/2024/1110131012
  source accessed on: 2023-07-03T18:11:29Z
  source last accessed on: 2024-06-05T14:42:36Z
  definition: This segment includes companies that manufacture household laundry equipment.
  notation: 1110131012
  valid from: 2020-10-03
source accessed on: 2023-07-03T18:11:29Z
source last accessed on: 2024-06-05T14:42:36Z
definition: This segment includes companies that manufacture household laundry equipment.
notation: 1110131012
valid from: 2020-10-03

Refrigerators & Freezers
type: BicsLevel5Segment
type: Classifier
type: NamedIndividual
is level5 segment of: Household Appliances
replaces: Household Fridges & Freezers
created with: infer-bics.sql
derived from: Household Fridges & Freezers
  type: BicsLevel5Segment
  type: Classifier
  type: AnachronousDerivation
  derived from: http://data.ga-group.nl/ics/bics/2014/1112111213
  source accessed on: 2019-12-03T20:05:01Z
  source last accessed on: 2019-12-03T20:05:01Z
  definition: This segment includes companies that manufacture household refrigerators and freezers.
  notation: 1112111213
  valid from: 2014-08-08
  valid till: 2020-10-03
derived from: Refrigerators & Freezers
  type: BicsLevel5Segment
  type: Classifier
  type: ContemporaryDerivation
  derived from: http://data.ga-group.nl/ics/bics/2020/1110131013
  derived from: http://data.ga-group.nl/ics/bics/2024/1110131013
  source accessed on: 2023-07-03T18:11:29Z
  source last accessed on: 2024-06-05T14:42:36Z
  definition: This segment includes companies that manufacture household refrigerators and freezers. Excludes industrial or walk-in freezers (see A/C Heating & Fridge Equip).
  notation: 1110131013
  valid from: 2020-10-03
source accessed on: 2023-07-03T18:11:29Z
source last accessed on: 2024-06-05T14:42:36Z
definition: This segment includes companies that manufacture household refrigerators and freezers. Excludes industrial or walk-in freezers (see A/C Heating & Fridge Equip).
notation: 1110131013
valid from: 2020-10-03

Vacuum Cleaners
type: BicsLevel5Segment
type: Classifier
type: NamedIndividual
is level5 segment of: Household Appliances
replaces: Household Vacuum Cleaners
created with: infer-bics.sql
derived from: Household Vacuum Cleaners
  type: BicsLevel5Segment
  type: Classifier
  type: AnachronousDerivation
  derived from: http://data.ga-group.nl/ics/bics/2014/1112111214
  source accessed on: 2019-12-03T20:05:01Z
  source last accessed on: 2019-12-03T20:05:01Z
  definition: This segment includes companies that manufacture household vacuum cleaners and floor waxing and carpet cleaning machines.
  notation: 1112111214
  valid from: 2014-08-08
  valid till: 2020-10-03
derived from: Vacuum Cleaners
  type: BicsLevel5Segment
  type: Classifier
  type: ContemporaryDerivation
  derived from: http://data.ga-group.nl/ics/bics/2020/1110131014
  derived from: http://data.ga-group.nl/ics/bics/2024/1110131014
  source accessed on: 2023-07-03T18:11:29Z
  source last accessed on: 2024-06-05T14:42:36Z
  definition: This segment includes companies that manufacture household vacuum cleaners, floor waxing, and carpet cleaning machines.
  notation: 1110131014
  valid from: 2020-10-03
source accessed on: 2023-07-03T18:11:29Z
source last accessed on: 2024-06-05T14:42:36Z
definition: This segment includes companies that manufacture household vacuum cleaners, floor waxing, and carpet cleaning machines.
notation: 1110131014
valid from: 2020-10-03

Household Appliances
type: BicsLevel4SubIndustry
type: Classifier
type: NamedIndividual
created with: infer-bics.sql
derived from: Household Appliances
  type: BicsLevel4SubIndustry
  type: Classifier
  type: AnachronousDerivation
  derived from: http://data.ga-group.nl/ics/bics/2014/11121112
  source accessed on: 2019-12-03T20:05:01Z
  source last accessed on: 2019-12-03T20:05:01Z
  definition: This industry subgroup includes companies that manufacture electric housewares, fans, vacuum cleaners, cooking appliances, and major household appliances including refrigerators, freezers, and laundry equipment.
  notation: 11121112
  valid from: 2014-08-08
  valid till: 2020-10-03
derived from: Household Appliances
  type: BicsLevel4SubIndustry
  type: Classifier
  type: ContemporaryDerivation
  derived from: http://data.ga-group.nl/ics/bics/2020/11101310
  derived from: http://data.ga-group.nl/ics/bics/2024/11101310
  source accessed on: 2023-07-03T18:11:29Z
  source last accessed on: 2024-06-05T14:42:36Z
  definition: This industry subgroup includes companies that manufacture electric housewares, fans, vacuum cleaners, cooking appliances, and major household appliances including refrigerators, freezers, and laundry equipment.
  notation: 11101310
  valid from: 2020-10-03
source accessed on: 2023-07-03T18:11:29Z
source last accessed on: 2024-06-05T14:42:36Z
definition: This industry subgroup includes companies that manufacture electric housewares, fans, vacuum cleaners, cooking appliances, and major household appliances including refrigerators, freezers, and laundry equipment.
notation: 11101310
valid from: 2020-10-03

Metal Furniture
type: BicsLevel6Segment
type: Classifier
type: NamedIndividual
is level6 segment of: Home Furniture
replaces: Metal Household Furniture
created with: infer-bics.sql
derived from: Metal Household Furniture
  type: BicsLevel6Segment
  type: Classifier
  type: AnachronousDerivation
  derived from: http://data.ga-group.nl/ics/bics/2014/111212101111
  source accessed on: 2019-12-03T20:05:01Z
  source last accessed on: 2019-12-03T20:05:01Z
  definition: This segment includes companies that manufacture metal household furniture and stand-alone cabinets.
  notation: 111212101111
  valid from: 2014-08-08
  valid till: 2020-10-03
derived from: Metal Furniture
  type: BicsLevel6Segment
  type: Classifier
  type: ContemporaryDerivation
  derived from: http://data.ga-group.nl/ics/bics/2020/111013111010
  derived from: http://data.ga-group.nl/ics/bics/2024/111013111010
  source accessed on: 2023-07-03T18:11:29Z
  source last accessed on: 2024-06-05T14:42:36Z
  definition: This segment includes companies that manufacture metal household furniture.
  notation: 111013111010
  valid from: 2020-10-03
source accessed on: 2023-07-03T18:11:29Z
source last accessed on: 2024-06-05T14:42:36Z
definition: This segment includes companies that manufacture metal household furniture.
notation: 111013111010
valid from: 2020-10-03

Upholstered Wood Furniture
type: BicsLevel7Segment
type: Classifier
type: NamedIndividual
is level7 segment of: Wood Furniture
replaces: Upholstered Wood Furniture
created with: infer-bics.sql
derived from: Upholstered Wood Furniture
  type: BicsLevel7Segment
  type: Classifier
  type: AnachronousDerivation
  derived from: http://data.ga-group.nl/ics/bics/2014/11121210111211
  source accessed on: 2019-12-03T20:05:01Z
  source last accessed on: 2019-12-03T20:05:01Z
  definition: This segment includes companies that manufacture upholstered household furniture and stand-alone cabinets.
  notation: 11121210111211
  valid from: 2014-08-08
  valid till: 2020-10-03
derived from: Upholstered Wood Furniture
  type: BicsLevel7Segment
  type: Classifier
  type: ContemporaryDerivation
  derived from: http://data.ga-group.nl/ics/bics/2020/11101311101110
  derived from: http://data.ga-group.nl/ics/bics/2024/11101311101110
  source accessed on: 2023-07-03T18:11:29Z
  source last accessed on: 2024-06-05T14:42:36Z
  definition: This segment includes companies that manufacture upholstered wood household furniture.
  notation: 11101311101110
  valid from: 2020-10-03
source accessed on: 2023-07-03T18:11:29Z
source last accessed on: 2024-06-05T14:42:36Z
definition: This segment includes companies that manufacture upholstered wood household furniture.
notation: 11101311101110
valid from: 2020-10-03

Nonupholstered Wood Furniture
type: BicsLevel7Segment
type: Classifier
type: NamedIndividual
is level7 segment of: Wood Furniture
replaces: Nonupholstered Wood Furniture
created with: infer-bics.sql
derived from: Nonupholstered Wood Furniture
  type: BicsLevel7Segment
  type: Classifier
  type: AnachronousDerivation
  derived from: http://data.ga-group.nl/ics/bics/2014/11121210111210
  source accessed on: 2019-12-03T20:05:01Z
  source last accessed on: 2019-12-03T20:05:01Z
  definition: This segment includes companies that manufacture non-upholstered wood household furniture. Products include stand-alone cabinets.
  notation: 11121210111210
  valid from: 2014-08-08
  valid till: 2020-10-03
derived from: Nonupholstered Wood Furniture
  type: BicsLevel7Segment
  type: Classifier
  type: ContemporaryDerivation
  derived from: http://data.ga-group.nl/ics/bics/2020/11101311101111
  derived from: http://data.ga-group.nl/ics/bics/2024/11101311101111
  source accessed on: 2023-07-03T18:11:29Z
  source last accessed on: 2024-06-05T14:42:36Z
  definition: This segment includes companies that manufacture non-upholstered wood household furniture.
  notation: 11101311101111
  valid from: 2020-10-03
source accessed on: 2023-07-03T18:11:29Z
source last accessed on: 2024-06-05T14:42:36Z
definition: This segment includes companies that manufacture non-upholstered wood household furniture.
notation: 11101311101111
valid from: 2020-10-03

Wood Furniture
type: BicsLevel6Segment
type: Classifier
type: NamedIndividual
is level6 segment of: Home Furniture
replaces: Wood Household Furniture
created with: infer-bics.sql
derived from: Wood Household Furniture
  type: BicsLevel6Segment
  type: Classifier
  type: AnachronousDerivation
  derived from: http://data.ga-group.nl/ics/bics/2014/111212101112
  source accessed on: 2019-12-03T20:05:01Z
  source last accessed on: 2019-12-03T20:05:01Z
  definition: This segment includes companies that manufacture upholstered, non-upholstered, and stand-alone wood cabinets for the home.
  notation: 111212101112
  valid from: 2014-08-08
  valid till: 2020-10-03
derived from: Wood Furniture
  type: BicsLevel6Segment
  type: Classifier
  type: ContemporaryDerivation
  derived from: http://data.ga-group.nl/ics/bics/2020/111013111011
  derived from: http://data.ga-group.nl/ics/bics/2024/111013111011
  source accessed on: 2023-07-03T18:11:29Z
  source last accessed on: 2024-06-05T14:42:36Z
  definition: This segment includes companies that manufacture upholstered, non-upholstered, and stand-alone wood furniture.
  notation: 111013111011
  valid from: 2020-10-03
source accessed on: 2023-07-03T18:11:29Z
source last accessed on: 2024-06-05T14:42:36Z
definition: This segment includes companies that manufacture upholstered, non-upholstered, and stand-alone wood furniture.
notation: 111013111011
valid from: 2020-10-03

Home Furniture
type: BicsLevel5Segment
type: Classifier
type: NamedIndividual
is level5 segment of: Furniture
replaces: Household Furniture
created with: infer-bics.sql
derived from: Household Furniture
  type: BicsLevel5Segment
  type: Classifier
  type: AnachronousDerivation
  derived from: http://data.ga-group.nl/ics/bics/2014/1112121011
  source accessed on: 2019-12-03T20:05:01Z
  source last accessed on: 2019-12-03T20:05:01Z
  definition: This segment includes companies that manufacture wood, metal and composite household furniture.
  notation: 1112121011
  valid from: 2014-08-08
  valid till: 2020-10-03
derived from: Home Furniture
  type: BicsLevel5Segment
  type: Classifier
  type: ContemporaryDerivation
  derived from: http://data.ga-group.nl/ics/bics/2020/1110131110
  derived from: http://data.ga-group.nl/ics/bics/2024/1110131110
  source accessed on: 2023-07-03T18:11:29Z
  source last accessed on: 2024-06-05T14:42:36Z
  definition: This segment includes companies that manufacture furniture for home use.
  notation: 1110131110
  valid from: 2020-10-03
source accessed on: 2023-07-03T18:11:29Z
source last accessed on: 2024-06-05T14:42:36Z
definition: This segment includes companies that manufacture furniture for home use.
notation: 1110131110
valid from: 2020-10-03

Office Furniture
type: BicsLevel5Segment
type: Classifier
type: NamedIndividual
is level5 segment of: Furniture
created with: infer-bics.sql
derived from: Office Furniture
  type: BicsLevel4SubIndustry
  type: Classifier
  type: AnachronousDerivation
  derived from: http://data.ga-group.nl/ics/bics/2014/11121212
  source accessed on: 2019-12-03T20:05:01Z
  source last accessed on: 2019-12-03T20:05:01Z
  definition: This industry subgroup includes companies that manufacture nonresidential furniture. Products include office-type cabinets, chairs, desks, tables, showcases, partitions and shelving units.
  notation: 11121212
  valid from: 2014-08-08
  valid till: 2020-10-03
derived from: Office Furniture
  type: BicsLevel5Segment
  type: Classifier
  type: ContemporaryDerivation
  derived from: http://data.ga-group.nl/ics/bics/2020/1110131111
  derived from: http://data.ga-group.nl/ics/bics/2024/1110131111
  source accessed on: 2023-07-03T18:11:29Z
  source last accessed on: 2024-06-05T14:42:36Z
  definition: This segment includes companies that manufacture nonresidential furniture.
  notation: 1110131111
  valid from: 2020-10-03
source accessed on: 2023-07-03T18:11:29Z
source last accessed on: 2024-06-05T14:42:36Z
definition: This segment includes companies that manufacture nonresidential furniture.
notation: 1110131111
valid from: 2020-10-03

Mattress
type: BicsLevel5Segment
type: Classifier
type: NamedIndividual
is level5 segment of: Furniture
replaces: Mattress
created with: infer-bics.sql
derived from: Mattress
  type: BicsLevel5Segment
  type: Classifier
  type: AnachronousDerivation
  derived from: http://data.ga-group.nl/ics/bics/2014/1112121012
  source accessed on: 2019-12-03T20:05:01Z
  source last accessed on: 2019-12-03T20:05:01Z
  definition: This segment includes companies that manufacture foam rubber, memory material, innerspring, and non-innerspring mattresses, box springs and waterbeds.
  notation: 1112121012
  valid from: 2014-08-08
  valid till: 2020-10-03
derived from: Mattress
  type: BicsLevel5Segment
  type: Classifier
  type: ContemporaryDerivation
  derived from: http://data.ga-group.nl/ics/bics/2020/1110131112
  derived from: http://data.ga-group.nl/ics/bics/2024/1110131112
  source accessed on: 2023-07-03T18:11:29Z
  source last accessed on: 2024-06-05T14:42:36Z
  definition: This segment includes companies that manufacture foam rubber, memory material, innerspring, and non-innerspring mattresses, box springs and waterbeds.
  notation: 1110131112
  valid from: 2020-10-03
source accessed on: 2023-07-03T18:11:29Z
source last accessed on: 2024-06-05T14:42:36Z
definition: This segment includes companies that manufacture foam rubber, memory material, innerspring, and non-innerspring mattresses, box springs and waterbeds.
notation: 1110131112
valid from: 2020-10-03

Furniture
type: BicsLevel4SubIndustry
type: Classifier
type: NamedIndividual
created with: infer-bics.sql
derived from: Home Furniture
  type: BicsLevel4SubIndustry
  type: Classifier
  type: AnachronousDerivation
  derived from: http://data.ga-group.nl/ics/bics/2014/11121210
  source accessed on: 2019-12-03T20:05:01Z
  source last accessed on: 2019-12-03T20:05:01Z
  definition: This industry subgroup includes companies that manufacture household furniture, office furniture, institutional furniture, mattresses, shades and blinds.
  notation: 11121210
  valid from: 2014-08-08
  valid till: 2020-10-03
derived from: Furniture
  type: BicsLevel4SubIndustry
  type: Classifier
  type: ContemporaryDerivation
  derived from: http://data.ga-group.nl/ics/bics/2020/11101311
  derived from: http://data.ga-group.nl/ics/bics/2024/11101311
  source accessed on: 2023-07-03T18:11:29Z
  source last accessed on: 2024-06-05T14:42:36Z
  definition: This industry subgroup includes companies that manufacture household furniture, office furniture, institutional furniture, mattresses, shades, and blinds.
  notation: 11101311
  valid from: 2020-10-03
source accessed on: 2023-07-03T18:11:29Z
source last accessed on: 2024-06-05T14:42:36Z
definition: This industry subgroup includes companies that manufacture household furniture, office furniture, institutional furniture, mattresses, shades, and blinds.
notation: 11101311
valid from: 2020-10-03

Cookware & Tableware
type: BicsLevel5Segment
type: Classifier
type: NamedIndividual
is level5 segment of: Housewares
replaces: Consumer Electronics - Online
created with: infer-bics.sql
derived from: Cutlery & Flatware
  type: BicsLevel5Segment
  type: Classifier
  type: AnachronousDerivation
  derived from: http://data.ga-group.nl/ics/bics/2014/1112121111
  source accessed on: 2019-12-03T20:05:01Z
  source last accessed on: 2019-12-03T20:05:01Z
  definition: This segment includes companies that manufacture plated metal cutlery and flatware. Includes forks, knives and spoons.
  notation: 1112121111
  valid from: 2014-08-08
  valid till: 2020-10-03
derived from: Cookware & Tableware
  type: BicsLevel5Segment
  type: Classifier
  type: ContemporaryDerivation
  derived from: http://data.ga-group.nl/ics/bics/2020/1110131210
  derived from: http://data.ga-group.nl/ics/bics/2024/1110131210
  source accessed on: 2023-07-03T18:11:29Z
  source last accessed on: 2024-06-05T14:42:36Z
  definition: This segment includes companies that manufacture plated metal cutlery and flatware, tableware, cookware, and other kitchen tools.
  notation: 1110131210
  valid from: 2020-10-03
source accessed on: 2023-07-03T18:11:29Z
source last accessed on: 2024-06-05T14:42:36Z
definition: This segment includes companies that manufacture plated metal cutlery and flatware, tableware, cookware, and other kitchen tools.
notation: 1110131210
valid from: 2020-10-03

Home Decoration Products
type: BicsLevel5Segment
type: Classifier
type: NamedIndividual
is level5 segment of: Housewares
replaces: Cosmetics & Beauty - Online
created with: infer-bics.sql
derived from: Home Decoration Products
  type: BicsLevel5Segment
  type: Classifier
  type: AnachronousDerivation
  derived from: http://data.ga-group.nl/ics/bics/2014/1112121115
  source accessed on: 2019-12-03T20:05:01Z
  source last accessed on: 2019-12-03T20:05:01Z
  definition: This segment includes companies that manufacture home decoration products.
  notation: 1112121115
  valid from: 2014-08-08
  valid till: 2020-10-03
derived from: Home Decoration Products
  type: BicsLevel5Segment
  type: Classifier
  type: ContemporaryDerivation
  derived from: http://data.ga-group.nl/ics/bics/2020/1110131211
  derived from: http://data.ga-group.nl/ics/bics/2024/1110131211
  source accessed on: 2023-07-03T18:11:29Z
  source last accessed on: 2024-06-05T14:42:36Z
  definition: This segment includes companies that manufacture products for interior and exterior home decoration.
  notation: 1110131211
  valid from: 2020-10-03
source accessed on: 2023-07-03T18:11:29Z
source last accessed on: 2024-06-05T14:42:36Z
definition: This segment includes companies that manufacture products for interior and exterior home decoration.
notation: 1110131211
valid from: 2020-10-03

Housewares
type: BicsLevel4SubIndustry
type: Classifier
type: NamedIndividual
created with: infer-bics.sql
derived from: Housewares
  type: BicsLevel4SubIndustry
  type: Classifier
  type: AnachronousDerivation
  derived from: http://data.ga-group.nl/ics/bics/2014/11121211
  source accessed on: 2019-12-03T20:05:01Z
  source last accessed on: 2019-12-03T20:05:01Z
  definition: This industry subgroup includes companies that manufacture kitchen utensils, pots, pans, cutlery and flatware.
  notation: 11121211
  valid from: 2014-08-08
  valid till: 2020-10-03
derived from: Housewares
  type: BicsLevel4SubIndustry
  type: Classifier
  type: ContemporaryDerivation
  derived from: http://data.ga-group.nl/ics/bics/2020/11101312
  derived from: http://data.ga-group.nl/ics/bics/2024/11101312
  source accessed on: 2023-07-03T18:11:29Z
  source last accessed on: 2024-06-05T14:42:36Z
  definition: This industry subgroup includes companies that manufacture small, durable household goods not elsewhere classifiable.
  notation: 11101312
  valid from: 2020-10-03
source accessed on: 2023-07-03T18:11:29Z
source last accessed on: 2024-06-05T14:42:36Z
definition: This industry subgroup includes companies that manufacture small, durable household goods not elsewhere classifiable.
notation: 11101312
valid from: 2020-10-03

Stationery
type: BicsLevel5Segment
type: Classifier
type: NamedIndividual
is level5 segment of: Office Supplies
created with: infer-bics.sql
derived from: Stationery & Note Books
  type: BicsLevel4SubIndustry
  type: Classifier
  type: AnachronousDerivation
  derived from: http://data.ga-group.nl/ics/bics/2014/11121313
  source accessed on: 2019-12-03T20:05:01Z
  source last accessed on: 2019-12-03T20:05:01Z
  definition: This industry subgroup includes companies that manufacture stationery and related office supplies, such as stationary tablets and notebooks.
  notation: 11121313
  valid from: 2014-08-08
  valid till: 2020-10-03
derived from: Stationary
  type: BicsLevel5Segment
  type: Classifier
  type: ContemporaryDerivation
  derived from: http://data.ga-group.nl/ics/bics/2020/1110131310
  source accessed on: 2023-07-03T18:11:29Z
  source last accessed on: 2023-07-03T18:11:29Z
  definition: This segment includes companies that manufacture stationery and related office supplies, such as pads and notebooks.
  notation: 1110131310
  valid from: 2020-10-03
  valid till: 2024-06-07
derived from: Stationery
  type: BicsLevel5Segment
  type: Classifier
  type: ContemporaryDerivation
  derived from: http://data.ga-group.nl/ics/bics/2024/1110131310
  source accessed on: 2024-06-05T14:42:36Z
  source last accessed on: 2024-06-05T14:42:36Z
  definition: This segment includes companies that manufacture stationery and related office supplies, such as pads and notebooks.
  notation: 1110131310
  valid from: 2024-06-07
source accessed on: 2023-07-03T18:11:29Z
source last accessed on: 2024-06-05T14:42:36Z
definition: This segment includes companies that manufacture stationery and related office supplies, such as pads and notebooks.
notation: 1110131310
valid from: 2020-10-03

Writing Instruments
type: BicsLevel5Segment
type: Classifier
type: NamedIndividual
is level5 segment of: Office Supplies
created with: infer-bics.sql
derived from: Writing Instruments
  type: BicsLevel4SubIndustry
  type: Classifier
  type: AnachronousDerivation
  derived from: http://data.ga-group.nl/ics/bics/2014/11121314
  source accessed on: 2019-12-03T20:05:01Z
  source last accessed on: 2019-12-03T20:05:01Z
  definition: This industry subgroup includes companies that manufacture writing instruments. Such instruments include ballpoint pens, pencils, markers, chalk and rubber stamps.
  notation: 11121314
  valid from: 2014-08-08
  valid till: 2020-10-03
derived from: Writing Instruments
  type: BicsLevel5Segment
  type: Classifier
  type: ContemporaryDerivation
  derived from: http://data.ga-group.nl/ics/bics/2020/1110131311
  derived from: http://data.ga-group.nl/ics/bics/2024/1110131311
  source accessed on: 2023-07-03T18:11:29Z
  source last accessed on: 2024-06-05T14:42:36Z
  definition: This segment includes companies that manufacture writing instruments, such as pens, pencils, markers, chalk, and rubber stamps.
  notation: 1110131311
  valid from: 2020-10-03
source accessed on: 2023-07-03T18:11:29Z
source last accessed on: 2024-06-05T14:42:36Z
definition: This segment includes companies that manufacture writing instruments, such as pens, pencils, markers, chalk, and rubber stamps.
notation: 1110131311
valid from: 2020-10-03

Office Supplies
type: BicsLevel4SubIndustry
type: Classifier
type: NamedIndividual
replaces: Office Supplies
created with: infer-bics.sql
derived from: Office Supplies
  type: BicsLevel3Industry
  type: Classifier
  type: AnachronousDerivation
  derived from: http://data.ga-group.nl/ics/bics/2014/111213
  source accessed on: 2019-12-03T20:05:01Z
  source last accessed on: 2019-12-03T20:05:01Z
  definition: This industry includes companies that manufacture office supplies. Products include envelopes, tablets, notebooks, writing instruments, folders and carbon paper.
  notation: 111213
  valid from: 2014-08-08
  valid till: 2020-10-03
derived from: Office Supplies
  type: BicsLevel4SubIndustry
  type: Classifier
  type: ContemporaryDerivation
  derived from: http://data.ga-group.nl/ics/bics/2020/11101313
  derived from: http://data.ga-group.nl/ics/bics/2024/11101313
  source accessed on: 2023-07-03T18:11:29Z
  source last accessed on: 2024-06-05T14:42:36Z
  definition: This industry subgroup includes companies that manufacture office supplies such as envelopes, notebooks, writing instruments, folders, and carbon paper.
  notation: 11101313
  valid from: 2020-10-03
source accessed on: 2023-07-03T18:11:29Z
source last accessed on: 2024-06-05T14:42:36Z
definition: This industry subgroup includes companies that manufacture office supplies such as envelopes, notebooks, writing instruments, folders, and carbon paper.
notation: 11101313
valid from: 2020-10-03

Home & Office Products
type: BicsLevel3Industry
type: Classifier
type: NamedIndividual
is industry of: Consumer Discretionary Products
replaces: Retail & Whsle - Discretionary
created with: infer-bics.sql
derived from: Home & Office Products
  type: BicsLevel2IndustryGroup
  type: Classifier
  type: AnachronousDerivation
  derived from: http://data.ga-group.nl/ics/bics/2014/1112
  source accessed on: 2019-12-03T20:05:01Z
  source last accessed on: 2019-12-03T20:05:01Z
  definition: This industry group includes companies that build homes and manufacture home-related products as well as office supplies.
  notation: 1112
  valid from: 2014-08-08
  valid till: 2020-10-03
derived from: Home & Office Products
  type: BicsLevel3Industry
  type: Classifier
  type: ContemporaryDerivation
  derived from: http://data.ga-group.nl/ics/bics/2020/111013
  derived from: http://data.ga-group.nl/ics/bics/2024/111013
  source accessed on: 2023-07-03T18:11:29Z
  source last accessed on: 2024-06-05T14:42:36Z
  definition: This industry includes companies that manufacture non-affixed products used within a home or office. Typically, these products are used to furnish the interior of homes for decorative or functional purposes.
  notation: 111013
  valid from: 2020-10-03
source accessed on: 2023-07-03T18:11:29Z
source last accessed on: 2024-06-05T14:42:36Z
definition: This industry includes companies that manufacture non-affixed products used within a home or office. Typically, these products are used to furnish the interior of homes for decorative or functional purposes.
notation: 111013
valid from: 2020-10-03

Toys & Games
type: BicsLevel4SubIndustry
type: Classifier
type: NamedIndividual
replaces: Toys & Games
created with: infer-bics.sql
derived from: Toys & Games
  type: BicsLevel3Industry
  type: Classifier
  type: AnachronousDerivation
  derived from: http://data.ga-group.nl/ics/bics/2014/111310
  source accessed on: 2019-12-03T20:05:01Z
  source last accessed on: 2019-12-03T20:05:01Z
  definition: This industry includes companies that make dolls, toys, board games, electronic games, action figures, playing cards, riding toys, toy instruments, puzzles and stuffed animals. It does not include metal bicycles or video game consoles or software.
  notation: 111310
  valid from: 2014-08-08
  valid till: 2020-10-03
derived from: Toys & Games
  type: BicsLevel4SubIndustry
  type: Classifier
  type: ContemporaryDerivation
  derived from: http://data.ga-group.nl/ics/bics/2020/11101410
  derived from: http://data.ga-group.nl/ics/bics/2024/11101410
  source accessed on: 2023-07-03T18:11:29Z
  source last accessed on: 2024-06-05T14:42:36Z
  definition: This industry subgroup includes companies that manufacture physical products used for leisure such as dolls, toys, board games, playing cards, puzzles, hobby items, and crafts. Excludes video game consoles (see Video Game Equipment), and their games (see Video Game Software).
  notation: 11101410
  valid from: 2020-10-03
source accessed on: 2023-07-03T18:11:29Z
source last accessed on: 2024-06-05T14:42:36Z
definition: This industry subgroup includes companies that manufacture physical products used for leisure such as dolls, toys, board games, playing cards, puzzles, hobby items, and crafts. Excludes video game consoles (see Video Game Equipment), and their games (see Video Game Software).
notation: 11101410
valid from: 2020-10-03

Music Instruments
type: BicsLevel4SubIndustry
type: Classifier
type: NamedIndividual
replaces: Music Instruments
created with: infer-bics.sql
derived from: Music Instruments
  type: BicsLevel3Industry
  type: Classifier
  type: AnachronousDerivation
  derived from: http://data.ga-group.nl/ics/bics/2014/111311
  source accessed on: 2019-12-03T20:05:01Z
  source last accessed on: 2019-12-03T20:05:01Z
  definition: This industry includes companies that manufacture stringed, keyboard, woodwind, brass and percussion instruments used to perform music.
  notation: 111311
  valid from: 2014-08-08
  valid till: 2020-10-03
derived from: Music Instruments
  type: BicsLevel4SubIndustry
  type: Classifier
  type: ContemporaryDerivation
  derived from: http://data.ga-group.nl/ics/bics/2020/11101411
  derived from: http://data.ga-group.nl/ics/bics/2024/11101411
  source accessed on: 2023-07-03T18:11:29Z
  source last accessed on: 2024-06-05T14:42:36Z
  definition: This industry subgroup includes companies that manufacture stringed, keyboard, woodwind, brass, and percussion instruments used to perform music.
  notation: 11101411
  valid from: 2020-10-03
source accessed on: 2023-07-03T18:11:29Z
source last accessed on: 2024-06-05T14:42:36Z
definition: This industry subgroup includes companies that manufacture stringed, keyboard, woodwind, brass, and percussion instruments used to perform music.
notation: 11101411
valid from: 2020-10-03

Leisure Boats & Yachts Building
type: BicsLevel5Segment
type: Classifier
type: NamedIndividual
is level5 segment of: Recreational Vehicles
created with: infer-bics.sql
derived from: Leisure Boats & Yachts Building
  type: BicsLevel4SubIndustry
  type: Classifier
  type: AnachronousDerivation
  derived from: http://data.ga-group.nl/ics/bics/2014/11131210
  source accessed on: 2019-12-03T20:05:01Z
  source last accessed on: 2019-12-03T20:05:01Z
  definition: This industry subgroup manufactures recreational watercraft, such as yachts, motorboats, sailboats, canoes, kayaks, rowboats and inflatable rafts.
  notation: 11131210
  valid from: 2014-08-08
  valid till: 2020-10-03
derived from: Leisure Boats & Yachts Building
  type: BicsLevel5Segment
  type: Classifier
  type: ContemporaryDerivation
  derived from: http://data.ga-group.nl/ics/bics/2020/1110141210
  derived from: http://data.ga-group.nl/ics/bics/2024/1110141210
  source accessed on: 2023-07-03T18:11:29Z
  source last accessed on: 2024-06-05T14:42:36Z
  definition: This segment includes companies that manufacture recreational watercraft, such as yachts, motorboats, sailboats, canoes, kayaks, rowboats, and inflatable rafts.
  notation: 1110141210
  valid from: 2020-10-03
source accessed on: 2023-07-03T18:11:29Z
source last accessed on: 2024-06-05T14:42:36Z
definition: This segment includes companies that manufacture recreational watercraft, such as yachts, motorboats, sailboats, canoes, kayaks, rowboats, and inflatable rafts.
notation: 1110141210
valid from: 2020-10-03

Motorhomes
type: BicsLevel6Segment
type: Classifier
type: NamedIndividual
is level6 segment of: Motorhomes, Trailers & Campers
replaces: Motorhomes
created with: infer-bics.sql
derived from: Motorhomes
  type: BicsLevel5Segment
  type: Classifier
  type: AnachronousDerivation
  derived from: http://data.ga-group.nl/ics/bics/2014/1113121110
  source accessed on: 2019-12-03T20:05:01Z
  source last accessed on: 2019-12-03T20:05:01Z
  definition: This segment includes companies that manufacture motor homes.
  notation: 1113121110
  valid from: 2014-08-08
  valid till: 2020-10-03
derived from: Motorhomes
  type: BicsLevel6Segment
  type: Classifier
  type: ContemporaryDerivation
  derived from: http://data.ga-group.nl/ics/bics/2020/111014121110
  derived from: http://data.ga-group.nl/ics/bics/2024/111014121110
  source accessed on: 2023-07-03T18:11:29Z
  source last accessed on: 2024-06-05T14:42:36Z
  definition: This segment includes companies that manufacture motorhomes, which are vehicles equipped with living quarters.
  notation: 111014121110
  valid from: 2020-10-03
source accessed on: 2023-07-03T18:11:29Z
source last accessed on: 2024-06-05T14:42:36Z
definition: This segment includes companies that manufacture motorhomes, which are vehicles equipped with living quarters.
notation: 111014121110
valid from: 2020-10-03

Travel Trailers & Campers
type: BicsLevel6Segment
type: Classifier
type: NamedIndividual
is level6 segment of: Motorhomes, Trailers & Campers
replaces: Travel Trailers & Campers
created with: infer-bics.sql
derived from: Travel Trailers & Campers
  type: BicsLevel5Segment
  type: Classifier
  type: AnachronousDerivation
  derived from: http://data.ga-group.nl/ics/bics/2014/1113121111
  source accessed on: 2019-12-03T20:05:01Z
  source last accessed on: 2019-12-03T20:05:01Z
  definition: This segment includes companies that manufacture travel trailers and campers.
  notation: 1113121111
  valid from: 2014-08-08
  valid till: 2020-10-03
derived from: Travel Trailers & Campers
  type: BicsLevel6Segment
  type: Classifier
  type: ContemporaryDerivation
  derived from: http://data.ga-group.nl/ics/bics/2020/111014121111
  derived from: http://data.ga-group.nl/ics/bics/2024/111014121111
  source accessed on: 2023-07-03T18:11:29Z
  source last accessed on: 2024-06-05T14:42:36Z
  definition: This segment includes companies that manufacture travel and camper trailers, which are towed behind a vehicle.
  notation: 111014121111
  valid from: 2020-10-03
source accessed on: 2023-07-03T18:11:29Z
source last accessed on: 2024-06-05T14:42:36Z
definition: This segment includes companies that manufacture travel and camper trailers, which are towed behind a vehicle.
notation: 111014121111
valid from: 2020-10-03

Motorhomes, Trailers & Campers
type: BicsLevel5Segment
type: Classifier
type: NamedIndividual
is level5 segment of: Recreational Vehicles
created with: infer-bics.sql
derived from: Motorhomes, Trailers & Campers
  type: BicsLevel4SubIndustry
  type: Classifier
  type: AnachronousDerivation
  derived from: http://data.ga-group.nl/ics/bics/2014/11131211
  source accessed on: 2019-12-03T20:05:01Z
  source last accessed on: 2019-12-03T20:05:01Z
  definition: This industry subgroup includes companies that manufacture motor homes, travel trailers and campers.
  notation: 11131211
  valid from: 2014-08-08
  valid till: 2020-10-03
derived from: Motorhomes, Trailers & Campers
  type: BicsLevel5Segment
  type: Classifier
  type: ContemporaryDerivation
  derived from: http://data.ga-group.nl/ics/bics/2020/1110141211
  derived from: http://data.ga-group.nl/ics/bics/2024/1110141211
  source accessed on: 2023-07-03T18:11:29Z
  source last accessed on: 2024-06-05T14:42:36Z
  definition: This segment includes companies that manufacture motor homes, travel trailers, and campers.
  notation: 1110141211
  valid from: 2020-10-03
source accessed on: 2023-07-03T18:11:29Z
source last accessed on: 2024-06-05T14:42:36Z
definition: This segment includes companies that manufacture motor homes, travel trailers, and campers.
notation: 1110141211
valid from: 2020-10-03

Recreational Vehicles
type: BicsLevel4SubIndustry
type: Classifier
type: NamedIndividual
replaces: Recreational Vehicles
created with: infer-bics.sql
derived from: Recreational Vehicles
  type: BicsLevel3Industry
  type: Classifier
  type: AnachronousDerivation
  derived from: http://data.ga-group.nl/ics/bics/2014/111312
  source accessed on: 2019-12-03T20:05:01Z
  source last accessed on: 2019-12-03T20:05:01Z
  definition: This industry includes companies that manufacture motor homes, travel trailers and campers, and recreational vehicle equipment.
  notation: 111312
  valid from: 2014-08-08
  valid till: 2020-10-03
derived from: Recreational Vehicles
  type: BicsLevel4SubIndustry
  type: Classifier
  type: ContemporaryDerivation
  derived from: http://data.ga-group.nl/ics/bics/2020/11101412
  derived from: http://data.ga-group.nl/ics/bics/2024/11101412
  source accessed on: 2023-07-03T18:11:29Z
  source last accessed on: 2024-06-05T14:42:36Z
  definition: This industry subgroup includes companies that manufacture motor homes, travel trailers, campers, and recreational vehicle equipment.
  notation: 11101412
  valid from: 2020-10-03
source accessed on: 2023-07-03T18:11:29Z
source last accessed on: 2024-06-05T14:42:36Z
definition: This industry subgroup includes companies that manufacture motor homes, travel trailers, campers, and recreational vehicle equipment.
notation: 11101412
valid from: 2020-10-03

Bicycles
type: BicsLevel6Segment
type: Classifier
type: NamedIndividual
is level6 segment of: Bicycles & Parts
replaces: Bicycles
created with: infer-bics.sql
derived from: Bicycles
  type: BicsLevel5Segment
  type: Classifier
  type: AnachronousDerivation
  derived from: http://data.ga-group.nl/ics/bics/2014/1113131010
  source accessed on: 2019-12-03T20:05:01Z
  source last accessed on: 2019-12-03T20:05:01Z
  definition: This segment includes companies that manufacture bicycles.
  notation: 1113131010
  valid from: 2014-08-08
  valid till: 2020-10-03
derived from: Bicycles
  type: BicsLevel6Segment
  type: Classifier
  type: ContemporaryDerivation
  derived from: http://data.ga-group.nl/ics/bics/2020/111014131010
  derived from: http://data.ga-group.nl/ics/bics/2024/111014131010
  source accessed on: 2023-07-03T18:11:29Z
  source last accessed on: 2024-06-05T14:42:36Z
  definition: This segment includes companies that manufacture bicycles.
  notation: 111014131010
  valid from: 2020-10-03
source accessed on: 2023-07-03T18:11:29Z
source last accessed on: 2024-06-05T14:42:36Z
definition: This segment includes companies that manufacture bicycles.
notation: 111014131010
valid from: 2020-10-03

Bicycle Parts
type: BicsLevel6Segment
type: Classifier
type: NamedIndividual
is level6 segment of: Bicycles & Parts
replaces: Bicycle Parts
created with: infer-bics.sql
derived from: Bicycle Parts
  type: BicsLevel5Segment
  type: Classifier
  type: AnachronousDerivation
  derived from: http://data.ga-group.nl/ics/bics/2014/1113131011
  source accessed on: 2019-12-03T20:05:01Z
  source last accessed on: 2019-12-03T20:05:01Z
  definition: This segment includes companies that manufacture bicycle parts.
  notation: 1113131011
  valid from: 2014-08-08
  valid till: 2020-10-03
derived from: Bicycle Parts
  type: BicsLevel6Segment
  type: Classifier
  type: ContemporaryDerivation
  derived from: http://data.ga-group.nl/ics/bics/2020/111014131011
  derived from: http://data.ga-group.nl/ics/bics/2024/111014131011
  source accessed on: 2023-07-03T18:11:29Z
  source last accessed on: 2024-06-05T14:42:36Z
  definition: This segment includes companies that manufacture bicycle parts.
  notation: 111014131011
  valid from: 2020-10-03
source accessed on: 2023-07-03T18:11:29Z
source last accessed on: 2024-06-05T14:42:36Z
definition: This segment includes companies that manufacture bicycle parts.
notation: 111014131011
valid from: 2020-10-03

Bicycles & Parts
type: BicsLevel5Segment
type: Classifier
type: NamedIndividual
is level5 segment of: Sporting Goods
created with: infer-bics.sql
derived from: Bicycles & Parts
  type: BicsLevel4SubIndustry
  type: Classifier
  type: AnachronousDerivation
  derived from: http://data.ga-group.nl/ics/bics/2014/11131310
  source accessed on: 2019-12-03T20:05:01Z
  source last accessed on: 2019-12-03T20:05:01Z
  definition: This industry subgroup includes companies that manufacture bicycles and bicycle parts.
  notation: 11131310
  valid from: 2014-08-08
  valid till: 2020-10-03
derived from: Bicycles & Parts
  type: BicsLevel5Segment
  type: Classifier
  type: ContemporaryDerivation
  derived from: http://data.ga-group.nl/ics/bics/2020/1110141310
  derived from: http://data.ga-group.nl/ics/bics/2024/1110141310
  source accessed on: 2023-07-03T18:11:29Z
  source last accessed on: 2024-06-05T14:42:36Z
  definition: This segment includes companies that manufacture bicycles and bicycle parts.
  notation: 1110141310
  valid from: 2020-10-03
source accessed on: 2023-07-03T18:11:29Z
source last accessed on: 2024-06-05T14:42:36Z
definition: This segment includes companies that manufacture bicycles and bicycle parts.
notation: 1110141310
valid from: 2020-10-03

Golf Equipment
type: BicsLevel5Segment
type: Classifier
type: NamedIndividual
is level5 segment of: Sporting Goods
created with: infer-bics.sql
derived from: Golf Equipment
  type: BicsLevel4SubIndustry
  type: Classifier
  type: AnachronousDerivation
  derived from: http://data.ga-group.nl/ics/bics/2014/11131311
  source accessed on: 2019-12-03T20:05:01Z
  source last accessed on: 2019-12-03T20:05:01Z
  definition: This industry subgroup includes companies that manufacture golfing equipment, such as bags, balls, caddy carts, clubs and tees.
  notation: 11131311
  valid from: 2014-08-08
  valid till: 2020-10-03
derived from: Golf Equipment
  type: BicsLevel5Segment
  type: Classifier
  type: ContemporaryDerivation
  derived from: http://data.ga-group.nl/ics/bics/2020/1110141311
  derived from: http://data.ga-group.nl/ics/bics/2024/1110141311
  source accessed on: 2023-07-03T18:11:29Z
  source last accessed on: 2024-06-05T14:42:36Z
  definition: This segment includes companies that manufacture golfing equipment, such as bags, balls, caddy carts, clubs, and tees.
  notation: 1110141311
  valid from: 2020-10-03
source accessed on: 2023-07-03T18:11:29Z
source last accessed on: 2024-06-05T14:42:36Z
definition: This segment includes companies that manufacture golfing equipment, such as bags, balls, caddy carts, clubs, and tees.
notation: 1110141311
valid from: 2020-10-03

Small Arms
type: BicsLevel5Segment
type: Classifier
type: NamedIndividual
is level5 segment of: Sporting Goods
replaces: http://data.ga-group.nl/ics/bics/1610111312
created with: infer-bics.sql
derived from: Small Arms
  type: BicsLevel5Segment
  type: Classifier
  type: AnachronousDerivation
  derived from: http://data.ga-group.nl/ics/bics/2014/1610111312
  source accessed on: 2019-12-03T20:05:01Z
  source last accessed on: 2019-12-03T20:05:01Z
  definition: This segment includes companies that manufacture small firearms that individuals can carry. Such firearms include pistols, rifles and shotguns.
  notation: 1610111312
  valid from: 2014-08-08
  valid till: 2020-10-03
derived from: Small Arms
  type: BicsLevel5Segment
  type: Classifier
  type: ContemporaryDerivation
  derived from: http://data.ga-group.nl/ics/bics/2020/1110141312
  derived from: http://data.ga-group.nl/ics/bics/2024/1110141312
  source accessed on: 2023-07-03T18:11:29Z
  source last accessed on: 2024-06-05T14:42:36Z
  definition: This segment includes companies that manufacture small firearms, including pistols, rifles, and shotguns.
  notation: 1110141312
  valid from: 2020-10-03
source accessed on: 2023-07-03T18:11:29Z
source last accessed on: 2024-06-05T14:42:36Z
definition: This segment includes companies that manufacture small firearms, including pistols, rifles, and shotguns.
notation: 1110141312
valid from: 2020-10-03

Sporting Goods
type: BicsLevel4SubIndustry
type: Classifier
type: NamedIndividual
replaces: Sporting Goods
created with: infer-bics.sql
derived from: Sporting Goods
  type: BicsLevel3Industry
  type: Classifier
  type: AnachronousDerivation
  derived from: http://data.ga-group.nl/ics/bics/2014/111313
  source accessed on: 2019-12-03T20:05:01Z
  source last accessed on: 2019-12-03T20:05:01Z
  definition: This industry includes companies that manufacture sporting equipment. Includes metal bicycles; hard, soft and inflatable balls; rackets; bats; golf clubs; skates; protective sporting equipment; baseball gloves; bows; and camping and fishing equipment. Excludes recreational firearms (see Munitions & Small Arms).
  notation: 111313
  valid from: 2014-08-08
  valid till: 2020-10-03
derived from: Sporting Goods
  type: BicsLevel4SubIndustry
  type: Classifier
  type: ContemporaryDerivation
  derived from: http://data.ga-group.nl/ics/bics/2020/11101413
  derived from: http://data.ga-group.nl/ics/bics/2024/11101413
  source accessed on: 2023-07-03T18:11:29Z
  source last accessed on: 2024-06-05T14:42:36Z
  definition: This industry subgroup includes companies that manufacture sporting equipment.
  notation: 11101413
  valid from: 2020-10-03
source accessed on: 2023-07-03T18:11:29Z
source last accessed on: 2024-06-05T14:42:36Z
definition: This industry subgroup includes companies that manufacture sporting equipment.
notation: 11101413
valid from: 2020-10-03

Leisure Products
type: BicsLevel3Industry
type: Classifier
type: NamedIndividual
is industry of: Consumer Discretionary Products
replaces: Leisure Products
created with: infer-bics.sql
derived from: Leisure Products
  type: BicsLevel2IndustryGroup
  type: Classifier
  type: AnachronousDerivation
  derived from: http://data.ga-group.nl/ics/bics/2014/1113
  source accessed on: 2019-12-03T20:05:01Z
  source last accessed on: 2019-12-03T20:05:01Z
  definition: This industry group includes companies that manufacture consumer electronics, recreational products, sporting goods, and toys and games.
  notation: 1113
  valid from: 2014-08-08
  valid till: 2020-10-03
derived from: Leisure Products
  type: BicsLevel3Industry
  type: Classifier
  type: ContemporaryDerivation
  derived from: http://data.ga-group.nl/ics/bics/2020/111014
  derived from: http://data.ga-group.nl/ics/bics/2024/111014
  source accessed on: 2023-07-03T18:11:29Z
  source last accessed on: 2024-06-05T14:42:36Z
  definition: This industry includes companies that manufacture consumer products used for leisure, recreation, or hobbies.
  notation: 111014
  valid from: 2020-10-03
source accessed on: 2023-07-03T18:11:29Z
source last accessed on: 2024-06-05T14:42:36Z
definition: This industry includes companies that manufacture consumer products used for leisure, recreation, or hobbies.
notation: 111014
valid from: 2020-10-03

Consumer Discretionary Products
type: BicsLevel2IndustryGroup
type: Classifier
type: NamedIndividual
is industry group of: Consumer Discretionary
is replaced by: Apparel & Textile Products
created with: infer-bics.sql
derived from: Apparel & Textile Products
  type: BicsLevel2IndustryGroup
  type: Classifier
  type: ContemporaryDerivation
  derived from: http://data.ga-group.nl/ics/bics/2014/1110
  source accessed on: 2019-12-03T20:05:01Z
  source last accessed on: 2019-12-03T20:05:01Z
  definition: This industry group includes companies that design, manufacture and market apparel and textile products.
  notation: 1110
  valid from: 2014-08-08
  valid till: 2020-10-03
derived from: Consumer Discretionary Products
  type: BicsLevel2IndustryGroup
  type: Classifier
  type: ContemporaryDerivation
  derived from: http://data.ga-group.nl/ics/bics/2020/1110
  derived from: http://data.ga-group.nl/ics/bics/2024/1110
  source accessed on: 2023-07-03T18:11:29Z
  source last accessed on: 2024-06-05T14:42:36Z
  definition: This industry group includes companies that manufacture cyclical products for household consumption.
  notation: 1110
  valid from: 2020-10-03
source accessed on: 2019-12-03T20:05:01Z
source last accessed on: 2024-06-05T14:42:36Z
definition: This industry group includes companies that manufacture cyclical products for household consumption.
notation: 1110
valid from: 2014-08-08

Hybrid Electric Vehicles
type: BicsLevel6Segment
type: Classifier
type: NamedIndividual
is level6 segment of: Consumer Elec & Applc Rental
created with: infer-bics.sql
derived from: Hybrid Electric Vehicles
  type: BicsLevel6Segment
  type: Classifier
  type: ContemporaryDerivation
  derived from: http://data.ga-group.nl/ics/bics/2014/111110101010
  source accessed on: 2019-12-03T20:05:01Z
  source last accessed on: 2019-12-03T20:05:01Z
  definition: This segment includes companies that manufacture hybrid electric light trucks and utility vehicles.
  notation: 111110101010
  valid from: 2014-08-08
  valid till: 2020-10-03
source accessed on: 2019-12-03T20:05:01Z
source last accessed on: 2019-12-03T20:05:01Z
definition: This segment includes companies that manufacture hybrid electric light trucks and utility vehicles.
notation: 111110101010
valid from: 2014-08-08
valid till: 2020-10-03

Plug-in Electric Vehicles
type: BicsLevel6Segment
type: Classifier
type: NamedIndividual
is level6 segment of: Consumer Elec & Applc Rental
created with: infer-bics.sql
derived from: Plug-in Electric Vehicles
  type: BicsLevel6Segment
  type: Classifier
  type: ContemporaryDerivation
  derived from: http://data.ga-group.nl/ics/bics/2014/111110101011
  source accessed on: 2019-12-03T20:05:01Z
  source last accessed on: 2019-12-03T20:05:01Z
  definition: This segment includes companies that manufacture plug-in electric light trucks and utility vehicles.
  notation: 111110101011
  valid from: 2014-08-08
  valid till: 2020-10-03
source accessed on: 2019-12-03T20:05:01Z
source last accessed on: 2019-12-03T20:05:01Z
definition: This segment includes companies that manufacture plug-in electric light trucks and utility vehicles.
notation: 111110101011
valid from: 2014-08-08
valid till: 2020-10-03

Plug-in Hybrid Electric Vehicles
type: BicsLevel6Segment
type: Classifier
type: NamedIndividual
is level6 segment of: Consumer Elec & Applc Rental
created with: infer-bics.sql
derived from: Plug-in Hybrid Electric Vehicles
  type: BicsLevel6Segment
  type: Classifier
  type: ContemporaryDerivation
  derived from: http://data.ga-group.nl/ics/bics/2014/111110101012
  source accessed on: 2019-12-03T20:05:01Z
  source last accessed on: 2019-12-03T20:05:01Z
  definition: This segment includes companies that manufacture plug-in hybrid electric light trucks and utility vehicles.
  notation: 111110101012
  valid from: 2014-08-08
  valid till: 2020-10-03
source accessed on: 2019-12-03T20:05:01Z
source last accessed on: 2019-12-03T20:05:01Z
definition: This segment includes companies that manufacture plug-in hybrid electric light trucks and utility vehicles.
notation: 111110101012
valid from: 2014-08-08
valid till: 2020-10-03

Other Alternative Energy Veh
type: BicsLevel6Segment
type: Classifier
type: NamedIndividual
is level6 segment of: Consumer Elec & Applc Rental
created with: infer-bics.sql
derived from: Other Alternative Energy Veh
  type: BicsLevel6Segment
  type: Classifier
  type: ContemporaryDerivation
  derived from: http://data.ga-group.nl/ics/bics/2014/111110101013
  source accessed on: 2019-12-03T20:05:01Z
  source last accessed on: 2019-12-03T20:05:01Z
  definition: This segment includes companies that manufacture alternative passenger vehicles not elsewhere classified.
  notation: 111110101013
  valid from: 2014-08-08
  valid till: 2020-10-03
source accessed on: 2019-12-03T20:05:01Z
source last accessed on: 2019-12-03T20:05:01Z
definition: This segment includes companies that manufacture alternative passenger vehicles not elsewhere classified.
notation: 111110101013
valid from: 2014-08-08
valid till: 2020-10-03

Consumer Elec & Applc Rental
type: BicsLevel5Segment
type: Classifier
type: NamedIndividual
is level5 segment of: Consumer Goods Rental
created with: infer-bics.sql
derived from: Alternative Passenger Vehicles
  type: BicsLevel5Segment
  type: Classifier
  type: ContemporaryDerivation
  derived from: http://data.ga-group.nl/ics/bics/2014/1111101010
  source accessed on: 2019-12-03T20:05:01Z
  source last accessed on: 2019-12-03T20:05:01Z
  definition: This segment includes companies that manufacture alternative energy drivetrain light trucks and utility vehicles.
  notation: 1111101010
  valid from: 2014-08-08
  valid till: 2020-10-03
derived from: Consumer Elec & Applc Rental
  type: BicsLevel4SubIndustry
  type: Classifier
  type: AnachronousDerivation
  derived from: http://data.ga-group.nl/ics/bics/2014/11151010
  source accessed on: 2019-12-03T20:05:01Z
  source last accessed on: 2019-12-03T20:05:01Z
  definition: This industry subgroup includes companies that rent televisions, stereos, refrigerators, and other consumer electronics equipment and appliances.
  notation: 11151010
  valid from: 2014-08-08
  valid till: 2020-10-03
derived from: Consumer Elec & Applc Rental
  type: BicsLevel5Segment
  type: Classifier
  type: ContemporaryDerivation
  derived from: http://data.ga-group.nl/ics/bics/2020/1111101010
  derived from: http://data.ga-group.nl/ics/bics/2024/1111101010
  source accessed on: 2023-07-03T18:11:29Z
  source last accessed on: 2024-06-05T14:42:36Z
  definition: This segment includes companies that rent televisions, stereos, refrigerators, and other consumer electronics equipment and appliances.
  notation: 1111101010
  valid from: 2020-10-03
source accessed on: 2019-12-03T20:05:01Z
source last accessed on: 2024-06-05T14:42:36Z
definition: This segment includes companies that rent televisions, stereos, refrigerators, and other consumer electronics equipment and appliances.
notation: 1111101010
valid from: 2014-08-08

Home Health Equipment Rental
type: BicsLevel5Segment
type: Classifier
type: NamedIndividual
is level5 segment of: Consumer Goods Rental
created with: infer-bics.sql
derived from: Internal Comb Eng Vehicles
  type: BicsLevel5Segment
  type: Classifier
  type: ContemporaryDerivation
  derived from: http://data.ga-group.nl/ics/bics/2014/1111101011
  source accessed on: 2019-12-03T20:05:01Z
  source last accessed on: 2019-12-03T20:05:01Z
  definition: This segment includes companies that manufacture internal combustion engine (ICE) light trucks and utility vehicles.
  notation: 1111101011
  valid from: 2014-08-08
  valid till: 2020-10-03
derived from: Home Health Equipment Rental
  type: BicsLevel4SubIndustry
  type: Classifier
  type: AnachronousDerivation
  derived from: http://data.ga-group.nl/ics/bics/2014/11151012
  source accessed on: 2019-12-03T20:05:01Z
  source last accessed on: 2019-12-03T20:05:01Z
  definition: This industry subgroup includes companies that rent wheelchairs, hospital beds, oxygen tanks, walkers, crutches and other home health care equipment.
  notation: 11151012
  valid from: 2014-08-08
  valid till: 2020-10-03
derived from: Home Health Equipment Rental
  type: BicsLevel5Segment
  type: Classifier
  type: ContemporaryDerivation
  derived from: http://data.ga-group.nl/ics/bics/2020/1111101011
  derived from: http://data.ga-group.nl/ics/bics/2024/1111101011
  source accessed on: 2023-07-03T18:11:29Z
  source last accessed on: 2024-06-05T14:42:36Z
  definition: This segment includes companies that rent wheelchairs, hospital beds, oxygen tanks, walkers, crutches, and other home health care equipment.
  notation: 1111101011
  valid from: 2020-10-03
source accessed on: 2019-12-03T20:05:01Z
source last accessed on: 2024-06-05T14:42:36Z
definition: This segment includes companies that rent wheelchairs, hospital beds, oxygen tanks, walkers, crutches, and other home health care equipment.
notation: 1111101011
valid from: 2014-08-08

Consumer Goods Rental
type: BicsLevel4SubIndustry
type: Classifier
type: NamedIndividual
replaces: Consumer Goods Rental
created with: infer-bics.sql
derived from: Passenger Vehicles
  type: BicsLevel4SubIndustry
  type: Classifier
  type: ContemporaryDerivation
  derived from: http://data.ga-group.nl/ics/bics/2014/11111010
  source accessed on: 2019-12-03T20:05:01Z
  source last accessed on: 2019-12-03T20:05:01Z
  definition: This industry subgroup includes companies that manufacture passenger cars. Such vehicles include sports cars, sedans, station wagons, hatchbacks, and microcars.
  notation: 11111010
  valid from: 2014-08-08
  valid till: 2020-10-03
derived from: Consumer Goods Rental
  type: BicsLevel3Industry
  type: Classifier
  type: AnachronousDerivation
  derived from: http://data.ga-group.nl/ics/bics/2014/111510
  source accessed on: 2019-12-03T20:05:01Z
  source last accessed on: 2019-12-03T20:05:01Z
  definition: This industry includes companies that rent various types of consumer goods, such as appliances, formal wear, costumes, fitness equipment and power tools.
  notation: 111510
  valid from: 2014-08-08
  valid till: 2020-10-03
derived from: Consumer Goods Rental
  type: BicsLevel4SubIndustry
  type: Classifier
  type: ContemporaryDerivation
  derived from: http://data.ga-group.nl/ics/bics/2020/11111010
  derived from: http://data.ga-group.nl/ics/bics/2024/11111010
  source accessed on: 2023-07-03T18:11:29Z
  source last accessed on: 2024-06-05T14:42:36Z
  definition: This industry subgroup includes companies that rent consumer goods, such as appliances, formal wear, costumes, fitness equipment, and power tools.
  notation: 11111010
  valid from: 2020-10-03
source accessed on: 2019-12-03T20:05:01Z
source last accessed on: 2024-06-05T14:42:36Z
definition: This industry subgroup includes companies that rent consumer goods, such as appliances, formal wear, costumes, fitness equipment, and power tools.
notation: 11111010
valid from: 2014-08-08

Hybrid Electric Light Trucks
type: BicsLevel6Segment
type: Classifier
type: NamedIndividual
is level6 segment of: Primary & Secondary Schools
created with: infer-bics.sql
derived from: Hybrid Electric Light Trucks
  type: BicsLevel6Segment
  type: Classifier
  type: ContemporaryDerivation
  derived from: http://data.ga-group.nl/ics/bics/2014/111110111010
  source accessed on: 2019-12-03T20:05:01Z
  source last accessed on: 2019-12-03T20:05:01Z
  definition: This segment includes companies that manufacture hybrid electric passenger cars.
  notation: 111110111010
  valid from: 2014-08-08
  valid till: 2020-10-03
source accessed on: 2019-12-03T20:05:01Z
source last accessed on: 2019-12-03T20:05:01Z
definition: This segment includes companies that manufacture hybrid electric passenger cars.
notation: 111110111010
valid from: 2014-08-08
valid till: 2020-10-03

Plug-in Electric Light Trucks
type: BicsLevel6Segment
type: Classifier
type: NamedIndividual
is level6 segment of: Primary & Secondary Schools
created with: infer-bics.sql
derived from: Plug-in Electric Light Trucks
  type: BicsLevel6Segment
  type: Classifier
  type: ContemporaryDerivation
  derived from: http://data.ga-group.nl/ics/bics/2014/111110111011
  source accessed on: 2019-12-03T20:05:01Z
  source last accessed on: 2019-12-03T20:05:01Z
  definition: This segment includes companies that manufacture plug-in electric passenger cars.
  notation: 111110111011
  valid from: 2014-08-08
  valid till: 2020-10-03
source accessed on: 2019-12-03T20:05:01Z
source last accessed on: 2019-12-03T20:05:01Z
definition: This segment includes companies that manufacture plug-in electric passenger cars.
notation: 111110111011
valid from: 2014-08-08
valid till: 2020-10-03

Plug-in Hybrid Light Trucks
type: BicsLevel6Segment
type: Classifier
type: NamedIndividual
is level6 segment of: Primary & Secondary Schools
created with: infer-bics.sql
derived from: Plug-in Hybrid Light Trucks
  type: BicsLevel6Segment
  type: Classifier
  type: ContemporaryDerivation
  derived from: http://data.ga-group.nl/ics/bics/2014/111110111012
  source accessed on: 2019-12-03T20:05:01Z
  source last accessed on: 2019-12-03T20:05:01Z
  definition: This segment includes companies that manufacture plug-in hybrid electric passenger cars.
  notation: 111110111012
  valid from: 2014-08-08
  valid till: 2020-10-03
source accessed on: 2019-12-03T20:05:01Z
source last accessed on: 2019-12-03T20:05:01Z
definition: This segment includes companies that manufacture plug-in hybrid electric passenger cars.
notation: 111110111012
valid from: 2014-08-08
valid till: 2020-10-03

Other Alt Energy Light Trucks
type: BicsLevel6Segment
type: Classifier
type: NamedIndividual
is level6 segment of: Primary & Secondary Schools
created with: infer-bics.sql
derived from: Other Alt Energy Light Trucks
  type: BicsLevel6Segment
  type: Classifier
  type: ContemporaryDerivation
  derived from: http://data.ga-group.nl/ics/bics/2014/111110111013
  source accessed on: 2019-12-03T20:05:01Z
  source last accessed on: 2019-12-03T20:05:01Z
  definition: This segment includes companies that manufacture all other alternative energy drivetrain passenger cars that are not elsewhere classified.
  notation: 111110111013
  valid from: 2014-08-08
  valid till: 2020-10-03
source accessed on: 2019-12-03T20:05:01Z
source last accessed on: 2019-12-03T20:05:01Z
definition: This segment includes companies that manufacture all other alternative energy drivetrain passenger cars that are not elsewhere classified.
notation: 111110111013
valid from: 2014-08-08
valid till: 2020-10-03

Primary & Secondary Schools
type: BicsLevel5Segment
type: Classifier
type: NamedIndividual
is level5 segment of: Educational Services
created with: infer-bics.sql
derived from: Alternative Light Trucks
  type: BicsLevel5Segment
  type: Classifier
  type: ContemporaryDerivation
  derived from: http://data.ga-group.nl/ics/bics/2014/1111101110
  source accessed on: 2019-12-03T20:05:01Z
  source last accessed on: 2019-12-03T20:05:01Z
  definition: This segment includes companies that manufacture alternative energy drivetrain passenger cars.
  notation: 1111101110
  valid from: 2014-08-08
  valid till: 2020-10-03
derived from: Elementary Schools
  type: BicsLevel4SubIndustry
  type: Classifier
  type: AnachronousDerivation
  derived from: http://data.ga-group.nl/ics/bics/2014/11151112
  source accessed on: 2019-12-03T20:05:01Z
  source last accessed on: 2019-12-03T20:05:01Z
  definition: This industry subgroup includes companies that offer basic preparatory education.
  notation: 11151112
  valid from: 2014-08-08
  valid till: 2020-10-03
derived from: Primary & Secondary Schools
  type: BicsLevel5Segment
  type: Classifier
  type: ContemporaryDerivation
  derived from: http://data.ga-group.nl/ics/bics/2020/1111101110
  derived from: http://data.ga-group.nl/ics/bics/2024/1111101110
  source accessed on: 2023-07-03T18:11:29Z
  source last accessed on: 2024-06-05T14:42:36Z
  definition: This segment includes companies that offer primary and secondary education.
  notation: 1111101110
  valid from: 2020-10-03
source accessed on: 2019-12-03T20:05:01Z
source last accessed on: 2024-06-05T14:42:36Z
definition: This segment includes companies that offer primary and secondary education.
notation: 1111101110
valid from: 2014-08-08

Junior Colleges
type: BicsLevel5Segment
type: Classifier
type: NamedIndividual
is level5 segment of: Educational Services
created with: infer-bics.sql
derived from: Internal Comb Eng Light Trucks
  type: BicsLevel5Segment
  type: Classifier
  type: ContemporaryDerivation
  derived from: http://data.ga-group.nl/ics/bics/2014/1111101111
  source accessed on: 2019-12-03T20:05:01Z
  source last accessed on: 2019-12-03T20:05:01Z
  definition: This segment includes companies that manufacture internal combustion engine (ICE) passenger cars.
  notation: 1111101111
  valid from: 2014-08-08
  valid till: 2020-10-03
derived from: Junior Colleges
  type: BicsLevel4SubIndustry
  type: Classifier
  type: AnachronousDerivation
  derived from: http://data.ga-group.nl/ics/bics/2014/11151113
  source accessed on: 2019-12-03T20:05:01Z
  source last accessed on: 2019-12-03T20:05:01Z
  definition: This industry subgroup includes companies that offer academic courses that lead to associate degrees, certificates, or diplomas below the baccalaureate level.
  notation: 11151113
  valid from: 2014-08-08
  valid till: 2020-10-03
derived from: Junior Colleges
  type: BicsLevel5Segment
  type: Classifier
  type: ContemporaryDerivation
  derived from: http://data.ga-group.nl/ics/bics/2020/1111101111
  derived from: http://data.ga-group.nl/ics/bics/2024/1111101111
  source accessed on: 2023-07-03T18:11:29Z
  source last accessed on: 2024-06-05T14:42:36Z
  definition: This segment includes companies that offer academic courses that lead to associate degrees, certificates, or diplomas below the baccalaureate level.
  notation: 1111101111
  valid from: 2020-10-03
source accessed on: 2019-12-03T20:05:01Z
source last accessed on: 2024-06-05T14:42:36Z
definition: This segment includes companies that offer academic courses that lead to associate degrees, certificates, or diplomas below the baccalaureate level.
notation: 1111101111
valid from: 2014-08-08

College, University & Pro Schools
type: BicsLevel5Segment
type: Classifier
type: NamedIndividual
is level5 segment of: Educational Services
created with: infer-bics.sql
derived from: College, University & Pro Schools
  type: BicsLevel4SubIndustry
  type: Classifier
  type: AnachronousDerivation
  derived from: http://data.ga-group.nl/ics/bics/2014/11151111
  source accessed on: 2019-12-03T20:05:01Z
  source last accessed on: 2019-12-03T20:05:01Z
  definition: This industry subgroup includes companies that offer academic courses that lead to degrees at the baccalaureate or graduate level.
  notation: 11151111
  valid from: 2014-08-08
  valid till: 2020-10-03
derived from: College, University & Pro Schools
  type: BicsLevel5Segment
  type: Classifier
  type: ContemporaryDerivation
  derived from: http://data.ga-group.nl/ics/bics/2020/1111101112
  derived from: http://data.ga-group.nl/ics/bics/2024/1111101112
  source accessed on: 2023-07-03T18:11:29Z
  source last accessed on: 2024-06-05T14:42:36Z
  definition: This segment includes companies that offer academic courses leading to degrees at the baccalaureate, graduate, or doctoral level.
  notation: 1111101112
  valid from: 2020-10-03
source accessed on: 2023-07-03T18:11:29Z
source last accessed on: 2024-06-05T14:42:36Z
definition: This segment includes companies that offer academic courses leading to degrees at the baccalaureate, graduate, or doctoral level.
notation: 1111101112
valid from: 2020-10-03

Vocational Schools
type: BicsLevel5Segment
type: Classifier
type: NamedIndividual
is level5 segment of: Educational Services
created with: infer-bics.sql
derived from: Business & Secretarial Schools
  type: BicsLevel4SubIndustry
  type: Classifier
  type: AnachronousDerivation
  derived from: http://data.ga-group.nl/ics/bics/2014/11151110
  source accessed on: 2019-12-03T20:05:01Z
  source last accessed on: 2019-12-03T20:05:01Z
  definition: This industry subgroup includes companies that offer courses in basic business skills, such as word processing, communication and presentation skills.
  notation: 11151110
  valid from: 2014-08-08
  valid till: 2020-10-03
derived from: Vocational Schools
  type: BicsLevel5Segment
  type: Classifier
  type: ContemporaryDerivation
  derived from: http://data.ga-group.nl/ics/bics/2020/1111101113
  derived from: http://data.ga-group.nl/ics/bics/2024/1111101113
  source accessed on: 2023-07-03T18:11:29Z
  source last accessed on: 2024-06-05T14:42:36Z
  definition: This segment includes companies that offer courses specific to a profession, trade, or career, leading to a certification or license. Includes trade schools, mechanics schools, beauty schools and real estate licensing schools.
  notation: 1111101113
  valid from: 2020-10-03
source accessed on: 2023-07-03T18:11:29Z
source last accessed on: 2024-06-05T14:42:36Z
definition: This segment includes companies that offer courses specific to a profession, trade, or career, leading to a certification or license. Includes trade schools, mechanics schools, beauty schools and real estate licensing schools.
notation: 1111101113
valid from: 2020-10-03

Language Schools
type: BicsLevel5Segment
type: Classifier
type: NamedIndividual
is level5 segment of: Educational Services
created with: infer-bics.sql
derived from: Language Schools
  type: BicsLevel4SubIndustry
  type: Classifier
  type: AnachronousDerivation
  derived from: http://data.ga-group.nl/ics/bics/2014/11151114
  source accessed on: 2019-12-03T20:05:01Z
  source last accessed on: 2019-12-03T20:05:01Z
  definition: This industry subgroup includes companies that offer foreign language courses.
  notation: 11151114
  valid from: 2014-08-08
  valid till: 2020-10-03
derived from: Language Schools
  type: BicsLevel5Segment
  type: Classifier
  type: ContemporaryDerivation
  derived from: http://data.ga-group.nl/ics/bics/2020/1111101114
  derived from: http://data.ga-group.nl/ics/bics/2024/1111101114
  source accessed on: 2023-07-03T18:11:29Z
  source last accessed on: 2024-06-05T14:42:36Z
  definition: This segment includes companies that offer foreign language educational programs.
  notation: 1111101114
  valid from: 2020-10-03
source accessed on: 2023-07-03T18:11:29Z
source last accessed on: 2024-06-05T14:42:36Z
definition: This segment includes companies that offer foreign language educational programs.
notation: 1111101114
valid from: 2020-10-03

Educational Services
type: BicsLevel4SubIndustry
type: Classifier
type: NamedIndividual
replaces: Educational Services
created with: infer-bics.sql
derived from: Light Trucks
  type: BicsLevel4SubIndustry
  type: Classifier
  type: ContemporaryDerivation
  derived from: http://data.ga-group.nl/ics/bics/2014/11111011
  source accessed on: 2019-12-03T20:05:01Z
  source last accessed on: 2019-12-03T20:05:01Z
  definition: This industry subgroup includes companies that manufacture light duty trucks and utility vehicles. Such vehicles include light trucks, pickup trucks, cabs, light duty vans, minivans and sport utility vehicles.
  notation: 11111011
  valid from: 2014-08-08
  valid till: 2020-10-03
derived from: Educational Services
  type: BicsLevel3Industry
  type: Classifier
  type: AnachronousDerivation
  derived from: http://data.ga-group.nl/ics/bics/2014/111511
  source accessed on: 2019-12-03T20:05:01Z
  source last accessed on: 2019-12-03T20:05:01Z
  definition: This industry includes companies that provide instruction and training in a variety of social, business and language sciences and subjects. The instruction and training could be delivered on a full-time, part-time, distance learning and occasional basis through establishments, such as schools, colleges, universities and professional institutes.
  notation: 111511
  valid from: 2014-08-08
  valid till: 2020-10-03
derived from: Educational Services
  type: BicsLevel4SubIndustry
  type: Classifier
  type: ContemporaryDerivation
  derived from: http://data.ga-group.nl/ics/bics/2020/11111011
  derived from: http://data.ga-group.nl/ics/bics/2024/11111011
  source accessed on: 2023-07-03T18:11:29Z
  source last accessed on: 2024-06-05T14:42:36Z
  definition: This industry subgroup includes companies that provide instruction and training for a variety of social, business, and language sciences and subjects. Instruction and training may be facilitated on a full-time, part-time, distance learning, or occasional basis through institutions such as schools, colleges, universities, and professional institutes.
  notation: 11111011
  valid from: 2020-10-03
source accessed on: 2019-12-03T20:05:01Z
source last accessed on: 2024-06-05T14:42:36Z
definition: This industry subgroup includes companies that provide instruction and training for a variety of social, business, and language sciences and subjects. Instruction and training may be facilitated on a full-time, part-time, distance learning, or occasional basis through institutions such as schools, colleges, universities, and professional institutes.
notation: 11111011
valid from: 2014-08-08

Funeral Homes & Services
type: BicsLevel5Segment
type: Classifier
type: NamedIndividual
is level5 segment of: Funeral Services
created with: infer-bics.sql
derived from: Funeral Homes & Services
  type: BicsLevel4SubIndustry
  type: Classifier
  type: AnachronousDerivation
  derived from: http://data.ga-group.nl/ics/bics/2014/11151211
  source accessed on: 2019-12-03T20:05:01Z
  source last accessed on: 2019-12-03T20:05:01Z
  definition: This industry subgroup includes companies that provide funeral services.
  notation: 11151211
  valid from: 2014-08-08
  valid till: 2020-10-03
derived from: Funeral Homes & Services
  type: BicsLevel5Segment
  type: Classifier
  type: ContemporaryDerivation
  derived from: http://data.ga-group.nl/ics/bics/2020/1111101210
  derived from: http://data.ga-group.nl/ics/bics/2024/1111101210
  source accessed on: 2023-07-03T18:11:29Z
  source last accessed on: 2024-06-05T14:42:36Z
  definition: This segment includes companies that operate funeral homes or provide funeral services.
  notation: 1111101210
  valid from: 2020-10-03
source accessed on: 2023-07-03T18:11:29Z
source last accessed on: 2024-06-05T14:42:36Z
definition: This segment includes companies that operate funeral homes or provide funeral services.
notation: 1111101210
valid from: 2020-10-03

Cemeteries & Crematories
type: BicsLevel5Segment
type: Classifier
type: NamedIndividual
is level5 segment of: Funeral Services
created with: infer-bics.sql
derived from: Cemeteries & Crematories
  type: BicsLevel4SubIndustry
  type: Classifier
  type: AnachronousDerivation
  derived from: http://data.ga-group.nl/ics/bics/2014/11151210
  source accessed on: 2019-12-03T20:05:01Z
  source last accessed on: 2019-12-03T20:05:01Z
  definition: This industry subgroup includes companies that operate cemeteries and crematories.
  notation: 11151210
  valid from: 2014-08-08
  valid till: 2020-10-03
derived from: Cemeteries & Crematories
  type: BicsLevel5Segment
  type: Classifier
  type: ContemporaryDerivation
  derived from: http://data.ga-group.nl/ics/bics/2020/1111101211
  derived from: http://data.ga-group.nl/ics/bics/2024/1111101211
  source accessed on: 2023-07-03T18:11:29Z
  source last accessed on: 2024-06-05T14:42:36Z
  definition: This segment includes companies that operate cemeteries and crematories.
  notation: 1111101211
  valid from: 2020-10-03
source accessed on: 2023-07-03T18:11:29Z
source last accessed on: 2024-06-05T14:42:36Z
definition: This segment includes companies that operate cemeteries and crematories.
notation: 1111101211
valid from: 2020-10-03

Funeral Services
type: BicsLevel4SubIndustry
type: Classifier
type: NamedIndividual
replaces: Funeral Services
created with: infer-bics.sql
derived from: Motorbikes & Parts
  type: BicsLevel4SubIndustry
  type: Classifier
  type: ContemporaryDerivation
  derived from: http://data.ga-group.nl/ics/bics/2014/11111012
  source accessed on: 2019-12-03T20:05:01Z
  source last accessed on: 2019-12-03T20:05:01Z
  definition: This industry subgroup includes companies that manufacture motorcycles and scooters as well as parts specifically designed for motorcycles and scooters.
  notation: 11111012
  valid from: 2014-08-08
  valid till: 2020-10-03
derived from: Funeral Services
  type: BicsLevel3Industry
  type: Classifier
  type: AnachronousDerivation
  derived from: http://data.ga-group.nl/ics/bics/2014/111512
  source accessed on: 2019-12-03T20:05:01Z
  source last accessed on: 2019-12-03T20:05:01Z
  definition: This industry includes companies that provide services for burial or incineration of human or animal corpses. Includes mortician services, burial plots, tombs and grave stones.
  notation: 111512
  valid from: 2014-08-08
  valid till: 2020-10-03
derived from: Funeral Services
  type: BicsLevel4SubIndustry
  type: Classifier
  type: ContemporaryDerivation
  derived from: http://data.ga-group.nl/ics/bics/2020/11111012
  derived from: http://data.ga-group.nl/ics/bics/2024/11111012
  source accessed on: 2023-07-03T18:11:29Z
  source last accessed on: 2024-06-05T14:42:36Z
  definition: This industry subgroup includes companies that provide services for burial or cremation of human or animal remains. Includes mortician services, burial plots, tombs, gravestones, and casket manufacturers.
  notation: 11111012
  valid from: 2020-10-03
source accessed on: 2019-12-03T20:05:01Z
source last accessed on: 2024-06-05T14:42:36Z
definition: This industry subgroup includes companies that provide services for burial or cremation of human or animal remains. Includes mortician services, burial plots, tombs, gravestones, and casket manufacturers.
notation: 11111012
valid from: 2014-08-08

Labor Unions
type: BicsLevel5Segment
type: Classifier
type: NamedIndividual
is level5 segment of: Non-Profit Organization
created with: infer-bics.sql
derived from: Labor Unions
  type: BicsLevel5Segment
  type: Classifier
  type: ContemporaryDerivation
  derived from: http://data.ga-group.nl/ics/bics/2020/1111101310
  derived from: http://data.ga-group.nl/ics/bics/2024/1111101310
  source accessed on: 2023-07-03T18:11:29Z
  source last accessed on: 2024-06-05T14:42:36Z
  definition: This segment includes companies that represent employees of a specific trade or profession for contract negotiations and collective bargaining benefits.
  notation: 1111101310
  valid from: 2020-10-03
source accessed on: 2023-07-03T18:11:29Z
source last accessed on: 2024-06-05T14:42:36Z
definition: This segment includes companies that represent employees of a specific trade or profession for contract negotiations and collective bargaining benefits.
notation: 1111101310
valid from: 2020-10-03

Trade Associations
type: BicsLevel5Segment
type: Classifier
type: NamedIndividual
is level5 segment of: Non-Profit Organization
created with: infer-bics.sql
derived from: Trade Associations
  type: BicsLevel5Segment
  type: Classifier
  type: ContemporaryDerivation
  derived from: http://data.ga-group.nl/ics/bics/2020/1111101311
  derived from: http://data.ga-group.nl/ics/bics/2024/1111101311
  source accessed on: 2023-07-03T18:11:29Z
  source last accessed on: 2024-06-05T14:42:36Z
  definition: This segment includes companies that represent firms and individuals that operate within a specific economic sector. These organizations provide best practices within the field, advocate on behalf of their members before governmental organizations, and provide networking opportunities for their members.
  notation: 1111101311
  valid from: 2020-10-03
source accessed on: 2023-07-03T18:11:29Z
source last accessed on: 2024-06-05T14:42:36Z
definition: This segment includes companies that represent firms and individuals that operate within a specific economic sector. These organizations provide best practices within the field, advocate on behalf of their members before governmental organizations, and provide networking opportunities for their members.
notation: 1111101311
valid from: 2020-10-03

Non-Profit Organization
type: BicsLevel4SubIndustry
type: Classifier
type: NamedIndividual
replaces: Non-Profit Organization
created with: infer-bics.sql
derived from: Non-Profit Organization
  type: BicsLevel3Industry
  type: Classifier
  type: AnachronousDerivation
  derived from: http://data.ga-group.nl/ics/bics/2014/111513
  source accessed on: 2019-12-03T20:05:01Z
  source last accessed on: 2019-12-03T20:05:01Z
  definition: This industry includes organizations that do not have owners. Revenues generated by the organization will be used to continue and expand operations.
  notation: 111513
  valid from: 2014-08-08
  valid till: 2020-10-03
derived from: Non-Profit Organization
  type: BicsLevel4SubIndustry
  type: Classifier
  type: ContemporaryDerivation
  derived from: http://data.ga-group.nl/ics/bics/2020/11111013
  derived from: http://data.ga-group.nl/ics/bics/2024/11111013
  source accessed on: 2023-07-03T18:11:29Z
  source last accessed on: 2024-06-05T14:42:36Z
  definition: This industry subgroup includes organizations that provide consumer services on a non-profit basis not elsewhere classifiable, including charitable, humanitarian, or religious services, and advocate organizations.
  notation: 11111013
  valid from: 2020-10-03
source accessed on: 2023-07-03T18:11:29Z
source last accessed on: 2024-06-05T14:42:36Z
definition: This industry subgroup includes organizations that provide consumer services on a non-profit basis not elsewhere classifiable, including charitable, humanitarian, or religious services, and advocate organizations.
notation: 11111013
valid from: 2020-10-03

Beauty Salons
type: BicsLevel5Segment
type: Classifier
type: NamedIndividual
is level5 segment of: Personal Care Services
created with: infer-bics.sql
derived from: Beauty Salons
  type: BicsLevel4SubIndustry
  type: Classifier
  type: AnachronousDerivation
  derived from: http://data.ga-group.nl/ics/bics/2014/11151410
  source accessed on: 2019-12-03T20:05:01Z
  source last accessed on: 2019-12-03T20:05:01Z
  definition: This industry subgroup includes stores that provide haircutting, washing, setting, dyeing, tinting, straightening and styling.
  notation: 11151410
  valid from: 2014-08-08
  valid till: 2020-10-03
derived from: Beauty Salons
  type: BicsLevel5Segment
  type: Classifier
  type: ContemporaryDerivation
  derived from: http://data.ga-group.nl/ics/bics/2020/1111101410
  derived from: http://data.ga-group.nl/ics/bics/2024/1111101410
  source accessed on: 2023-07-03T18:11:29Z
  source last accessed on: 2024-06-05T14:42:36Z
  definition: This segment includes establishments that provide personal care services, including nail, hair, and tanning treatments.
  notation: 1111101410
  valid from: 2020-10-03
source accessed on: 2023-07-03T18:11:29Z
source last accessed on: 2024-06-05T14:42:36Z
definition: This segment includes establishments that provide personal care services, including nail, hair, and tanning treatments.
notation: 1111101410
valid from: 2020-10-03

Weight Management Services
type: BicsLevel5Segment
type: Classifier
type: NamedIndividual
is level5 segment of: Personal Care Services
created with: infer-bics.sql
derived from: Weight Management Services
  type: BicsLevel4SubIndustry
  type: Classifier
  type: AnachronousDerivation
  derived from: http://data.ga-group.nl/ics/bics/2014/11151411
  source accessed on: 2019-12-03T20:05:01Z
  source last accessed on: 2019-12-03T20:05:01Z
  definition: This industry subgroup includes companies that offer a weight loss program that may include prepared meals, exercise programs and calorie control methods, while keeping meals nutritionally balanced.
  notation: 11151411
  valid from: 2014-08-08
  valid till: 2020-10-03
derived from: Weight Management Services
  type: BicsLevel5Segment
  type: Classifier
  type: ContemporaryDerivation
  derived from: http://data.ga-group.nl/ics/bics/2020/1111101411
  derived from: http://data.ga-group.nl/ics/bics/2024/1111101411
  source accessed on: 2023-07-03T18:11:29Z
  source last accessed on: 2024-06-05T14:42:36Z
  definition: This segment includes companies that offer weight loss programs that may include prepared meals, exercise programs, or calorie control methods.
  notation: 1111101411
  valid from: 2020-10-03
source accessed on: 2023-07-03T18:11:29Z
source last accessed on: 2024-06-05T14:42:36Z
definition: This segment includes companies that offer weight loss programs that may include prepared meals, exercise programs, or calorie control methods.
notation: 1111101411
valid from: 2020-10-03

Personal Care Services
type: BicsLevel4SubIndustry
type: Classifier
type: NamedIndividual
replaces: Personal Care Services
created with: infer-bics.sql
derived from: Personal Care Services
  type: BicsLevel3Industry
  type: Classifier
  type: AnachronousDerivation
  derived from: http://data.ga-group.nl/ics/bics/2014/111514
  source accessed on: 2019-12-03T20:05:01Z
  source last accessed on: 2019-12-03T20:05:01Z
  definition: This industry includes companies that provide services for personal wellness, including beauty salons and weight management services. This industry does not include fitness centers (see Fitness & Recreation Centers).
  notation: 111514
  valid from: 2014-08-08
  valid till: 2020-10-03
derived from: Personal Care Services
  type: BicsLevel4SubIndustry
  type: Classifier
  type: ContemporaryDerivation
  derived from: http://data.ga-group.nl/ics/bics/2020/11111014
  derived from: http://data.ga-group.nl/ics/bics/2024/11111014
  source accessed on: 2023-07-03T18:11:29Z
  source last accessed on: 2024-06-05T14:42:36Z
  definition: This industry subgroup includes companies that provide services for personal wellness, including beauty salons and weight management services. This industry does not include fitness centers (see Fitness & Recreation Centers).
  notation: 11111014
  valid from: 2020-10-03
source accessed on: 2023-07-03T18:11:29Z
source last accessed on: 2024-06-05T14:42:36Z
definition: This industry subgroup includes companies that provide services for personal wellness, including beauty salons and weight management services. This industry does not include fitness centers (see Fitness & Recreation Centers).
notation: 11111014
valid from: 2020-10-03

Photography Studios
type: BicsLevel5Segment
type: Classifier
type: NamedIndividual
is level5 segment of: Photography Services
created with: infer-bics.sql
derived from: Photography Studios
  type: BicsLevel4SubIndustry
  type: Classifier
  type: AnachronousDerivation
  derived from: http://data.ga-group.nl/ics/bics/2014/11151511
  source accessed on: 2019-12-03T20:05:01Z
  source last accessed on: 2019-12-03T20:05:01Z
  definition: This industry subgroup includes companies that operate photography studios or provide on-site photography services for memorable events. These companies may also process and print these photos in various merchandise formats.
  notation: 11151511
  valid from: 2014-08-08
  valid till: 2020-10-03
derived from: Photography Studios
  type: BicsLevel5Segment
  type: Classifier
  type: ContemporaryDerivation
  derived from: http://data.ga-group.nl/ics/bics/2020/1111101510
  derived from: http://data.ga-group.nl/ics/bics/2024/1111101510
  source accessed on: 2023-07-03T18:11:29Z
  source last accessed on: 2024-06-05T14:42:36Z
  definition: This segment includes companies that operate photography studios or provide photography services. These companies may also process and print photos in various merchandise formats.
  notation: 1111101510
  valid from: 2020-10-03
source accessed on: 2023-07-03T18:11:29Z
source last accessed on: 2024-06-05T14:42:36Z
definition: This segment includes companies that operate photography studios or provide photography services. These companies may also process and print photos in various merchandise formats.
notation: 1111101510
valid from: 2020-10-03

Photo Printing Services
type: BicsLevel5Segment
type: Classifier
type: NamedIndividual
is level5 segment of: Photography Services
created with: infer-bics.sql
derived from: Photo Printing Services
  type: BicsLevel4SubIndustry
  type: Classifier
  type: AnachronousDerivation
  derived from: http://data.ga-group.nl/ics/bics/2014/11151510
  source accessed on: 2019-12-03T20:05:01Z
  source last accessed on: 2019-12-03T20:05:01Z
  definition: This industry subgroup includes companies that specialize in film development, processing, enlargement and printing. These companies may process photos for commercial or retail clients. Excludes companies that are involved in photography activities (see Photography Studios).
  notation: 11151510
  valid from: 2014-08-08
  valid till: 2020-10-03
derived from: Photo Printing Services
  type: BicsLevel5Segment
  type: Classifier
  type: ContemporaryDerivation
  derived from: http://data.ga-group.nl/ics/bics/2020/1111101511
  derived from: http://data.ga-group.nl/ics/bics/2024/1111101511
  source accessed on: 2023-07-03T18:11:29Z
  source last accessed on: 2024-06-05T14:42:36Z
  definition: This segment includes companies that specialize in film development, processing, enlargement, and printing. Excludes companies that are involved in photography activities (see Photography Studios).
  notation: 1111101511
  valid from: 2020-10-03
source accessed on: 2023-07-03T18:11:29Z
source last accessed on: 2024-06-05T14:42:36Z
definition: This segment includes companies that specialize in film development, processing, enlargement, and printing. Excludes companies that are involved in photography activities (see Photography Studios).
notation: 1111101511
valid from: 2020-10-03

Photography Services
type: BicsLevel4SubIndustry
type: Classifier
type: NamedIndividual
replaces: Photography Services
created with: infer-bics.sql
derived from: Photography Services
  type: BicsLevel3Industry
  type: Classifier
  type: AnachronousDerivation
  derived from: http://data.ga-group.nl/ics/bics/2014/111515
  source accessed on: 2019-12-03T20:05:01Z
  source last accessed on: 2019-12-03T20:05:01Z
  definition: This industry includes companies that offer portrait and video photography of memorable events, such as weddings and school graduations. Includes developing and printing services that utilize the photo in a retail product like picture books, cards and coffee mugs.
  notation: 111515
  valid from: 2014-08-08
  valid till: 2020-10-03
derived from: Photography Services
  type: BicsLevel4SubIndustry
  type: Classifier
  type: ContemporaryDerivation
  derived from: http://data.ga-group.nl/ics/bics/2020/11111015
  derived from: http://data.ga-group.nl/ics/bics/2024/11111015
  source accessed on: 2023-07-03T18:11:29Z
  source last accessed on: 2024-06-05T14:42:36Z
  definition: This industry subgroup includes companies that offer photography and videography services. Includes developing and printing services that utilize the photo in a retail product like picture books, cards, and coffee mugs.
  notation: 11111015
  valid from: 2020-10-03
source accessed on: 2023-07-03T18:11:29Z
source last accessed on: 2024-06-05T14:42:36Z
definition: This industry subgroup includes companies that offer photography and videography services. Includes developing and printing services that utilize the photo in a retail product like picture books, cards, and coffee mugs.
notation: 11111015
valid from: 2020-10-03

Political Committees
type: BicsLevel4SubIndustry
type: Classifier
type: NamedIndividual
created with: infer-bics.sql
derived from: Political Committees
  type: BicsLevel4SubIndustry
  type: Classifier
  type: ContemporaryDerivation
  derived from: http://data.ga-group.nl/ics/bics/2020/11111016
  derived from: http://data.ga-group.nl/ics/bics/2024/11111016
  source accessed on: 2023-07-03T18:11:29Z
  source last accessed on: 2024-06-05T14:42:36Z
  definition: This industry subgroup includes entities that collect and spend money in elections, or on political issues. These committees may be set up for candidates, corporations, trade associations, or by private citizens wishing to make independent expenditures.
  notation: 11111016
  valid from: 2020-10-03
source accessed on: 2023-07-03T18:11:29Z
source last accessed on: 2024-06-05T14:42:36Z
definition: This industry subgroup includes entities that collect and spend money in elections, or on political issues. These committees may be set up for candidates, corporations, trade associations, or by private citizens wishing to make independent expenditures.
notation: 11111016
valid from: 2020-10-03

Residential Contractors
type: BicsLevel4SubIndustry
type: Classifier
type: NamedIndividual
created with: infer-bics.sql
derived from: Residential Remodel
  type: BicsLevel4SubIndustry
  type: Classifier
  type: AnachronousDerivation
  derived from: http://data.ga-group.nl/ics/bics/2014/11121116
  source accessed on: 2019-12-03T20:05:01Z
  source last accessed on: 2019-12-03T20:05:01Z
  definition: This industry subgroup includes companies that build additions or make alterations, renovations or any other home improvements to residential buildings.
  notation: 11121116
  valid from: 2014-08-08
  valid till: 2020-10-03
derived from: Residential Contractors
  type: BicsLevel4SubIndustry
  type: Classifier
  type: ContemporaryDerivation
  derived from: http://data.ga-group.nl/ics/bics/2020/11111017
  derived from: http://data.ga-group.nl/ics/bics/2024/11111017
  source accessed on: 2023-07-03T18:11:29Z
  source last accessed on: 2024-06-05T14:42:36Z
  definition: This industry subgroup includes companies that build additions or make alterations, renovations, or any other home improvements to residential buildings.
  notation: 11111017
  valid from: 2020-10-03
source accessed on: 2023-07-03T18:11:29Z
source last accessed on: 2024-06-05T14:42:36Z
definition: This industry subgroup includes companies that build additions or make alterations, renovations, or any other home improvements to residential buildings.
notation: 11111017
valid from: 2020-10-03

Consumer Goods Repair & Maint
type: BicsLevel5Segment
type: Classifier
type: NamedIndividual
is level5 segment of: Other Consumer Services
created with: infer-bics.sql
derived from: Consumer Goods Repair & Maint
  type: BicsLevel4SubIndustry
  type: Classifier
  type: AnachronousDerivation
  derived from: http://data.ga-group.nl/ics/bics/2014/11151610
  source accessed on: 2019-12-03T20:05:01Z
  source last accessed on: 2019-12-03T20:05:01Z
  definition: This industry subgroup includes companies that provide repair and maintenance services for consumer goods, such as household appliances, watches and consumer electronics. These services may be offered for retail or commercial customers.
  notation: 11151610
  valid from: 2014-08-08
  valid till: 2020-10-03
derived from: Consumer Goods Repair & Maint
  type: BicsLevel5Segment
  type: Classifier
  type: ContemporaryDerivation
  derived from: http://data.ga-group.nl/ics/bics/2020/1111101810
  derived from: http://data.ga-group.nl/ics/bics/2024/1111101810
  source accessed on: 2023-07-03T18:11:29Z
  source last accessed on: 2024-06-05T14:42:36Z
  definition: This segment includes companies that provide repair and maintenance services for consumer goods, such as household appliances, watches, and consumer electronics.
  notation: 1111101810
  valid from: 2020-10-03
source accessed on: 2023-07-03T18:11:29Z
source last accessed on: 2024-06-05T14:42:36Z
definition: This segment includes companies that provide repair and maintenance services for consumer goods, such as household appliances, watches, and consumer electronics.
notation: 1111101810
valid from: 2020-10-03

Laundry Services
type: BicsLevel5Segment
type: Classifier
type: NamedIndividual
is level5 segment of: Other Consumer Services
created with: infer-bics.sql
derived from: Laundry Services
  type: BicsLevel4SubIndustry
  type: Classifier
  type: AnachronousDerivation
  derived from: http://data.ga-group.nl/ics/bics/2014/11151611
  source accessed on: 2019-12-03T20:05:01Z
  source last accessed on: 2019-12-03T20:05:01Z
  definition: This industry subgroup includes companies that provide laundering or dry cleaning services. These companies may operate self-service laundromats or provide outsourced linen and garment cleaning services for commercial customers.
  notation: 11151611
  valid from: 2014-08-08
  valid till: 2020-10-03
derived from: Laundry Services
  type: BicsLevel5Segment
  type: Classifier
  type: ContemporaryDerivation
  derived from: http://data.ga-group.nl/ics/bics/2020/1111101811
  derived from: http://data.ga-group.nl/ics/bics/2024/1111101811
  source accessed on: 2023-07-03T18:11:29Z
  source last accessed on: 2024-06-05T14:42:36Z
  definition: This segment includes companies that provide laundering or dry cleaning services. These companies may operate self-service laundromats or provide outsourced linen and garment cleaning services for commercial customers.
  notation: 1111101811
  valid from: 2020-10-03
source accessed on: 2023-07-03T18:11:29Z
source last accessed on: 2024-06-05T14:42:36Z
definition: This segment includes companies that provide laundering or dry cleaning services. These companies may operate self-service laundromats or provide outsourced linen and garment cleaning services for commercial customers.
notation: 1111101811
valid from: 2020-10-03

Other Consumer Services
type: BicsLevel4SubIndustry
type: Classifier
type: NamedIndividual
replaces: Other Consumer Services
created with: infer-bics.sql
derived from: Other Consumer Services
  type: BicsLevel3Industry
  type: Classifier
  type: AnachronousDerivation
  derived from: http://data.ga-group.nl/ics/bics/2014/111516
  source accessed on: 2019-12-03T20:05:01Z
  source last accessed on: 2019-12-03T20:05:01Z
  definition: This industry includes companies that provide laundry services, consumer goods repair services and consumer services not elsewhere classified.
  notation: 111516
  valid from: 2014-08-08
  valid till: 2020-10-03
derived from: Other Consumer Services
  type: BicsLevel4SubIndustry
  type: Classifier
  type: ContemporaryDerivation
  derived from: http://data.ga-group.nl/ics/bics/2020/11111018
  derived from: http://data.ga-group.nl/ics/bics/2024/11111018
  source accessed on: 2023-07-03T18:11:29Z
  source last accessed on: 2024-06-05T14:42:36Z
  definition: This industry subgroup includes companies that provide laundry services, consumer goods repair services, remodeling services, and consumer services not elsewhere classified.
  notation: 11111018
  valid from: 2020-10-03
source accessed on: 2023-07-03T18:11:29Z
source last accessed on: 2024-06-05T14:42:36Z
definition: This industry subgroup includes companies that provide laundry services, consumer goods repair services, remodeling services, and consumer services not elsewhere classified.
notation: 11111018
valid from: 2020-10-03

Consumer Services
type: BicsLevel3Industry
type: Classifier
type: NamedIndividual
is industry of: Consumer Discretionary Services
is replaced by: Automobiles
replaces: Consumer Services
created with: infer-bics.sql
derived from: Automobiles
  type: BicsLevel3Industry
  type: Classifier
  type: ContemporaryDerivation
  derived from: http://data.ga-group.nl/ics/bics/2014/111110
  source accessed on: 2019-12-03T20:05:01Z
  source last accessed on: 2019-12-03T20:05:01Z
  definition: This industry includes companies that manufacture automobiles (passenger cars), light trucks, motorcycles and sport utility vehicles. Excludes passenger vehicles manufactured for commercial use, medium duty trucks and heavy duty trucks.
  notation: 111110
  valid from: 2014-08-08
  valid till: 2020-10-03
derived from: Consumer Services
  type: BicsLevel2IndustryGroup
  type: Classifier
  type: AnachronousDerivation
  derived from: http://data.ga-group.nl/ics/bics/2014/1115
  source accessed on: 2019-12-03T20:05:01Z
  source last accessed on: 2019-12-03T20:05:01Z
  definition: This industry group includes companies that provide services to retail consumers.
  notation: 1115
  valid from: 2014-08-08
  valid till: 2020-10-03
derived from: Consumer Services
  type: BicsLevel3Industry
  type: Classifier
  type: ContemporaryDerivation
  derived from: http://data.ga-group.nl/ics/bics/2020/111110
  derived from: http://data.ga-group.nl/ics/bics/2024/111110
  source accessed on: 2023-07-03T18:11:29Z
  source last accessed on: 2024-06-05T14:42:36Z
  definition: This industry includes companies that provide consumer services for non-transportation, non-leisure, or non-entertainment purposes.
  notation: 111110
  valid from: 2020-10-03
source accessed on: 2019-12-03T20:05:01Z
source last accessed on: 2024-06-05T14:42:36Z
definition: This industry includes companies that provide consumer services for non-transportation, non-leisure, or non-entertainment purposes.
notation: 111110
valid from: 2014-08-08

Casinos
type: BicsLevel5Segment
type: Classifier
type: NamedIndividual
is level5 segment of: Casinos & Gaming
created with: infer-bics.sql
derived from: Alt Vehicle Drivetrains
  type: BicsLevel5Segment
  type: Classifier
  type: ContemporaryDerivation
  derived from: http://data.ga-group.nl/ics/bics/2014/1111111010
  source accessed on: 2019-12-03T20:05:01Z
  source last accessed on: 2019-12-03T20:05:01Z
  definition: This segment includes companies that manufacture drivetrains for alternative energy and hybrid systems.
  notation: 1111111010
  valid from: 2014-08-08
  valid till: 2020-10-03
derived from: Casinos
  type: BicsLevel4SubIndustry
  type: Classifier
  type: AnachronousDerivation
  derived from: http://data.ga-group.nl/ics/bics/2014/11161010
  source accessed on: 2019-12-03T20:05:01Z
  source last accessed on: 2019-12-03T20:05:01Z
  definition: This industry subgroup includes companies that own and operate facilities that host gambling operations, such as coin-operated gambling machines, wagering at table games, off-track betting and certain floating facilities like riverboats. Excludes operations of cruise ships (see Cruise Lines).
  notation: 11161010
  valid from: 2014-08-08
  valid till: 2020-10-03
derived from: Casinos
  type: BicsLevel5Segment
  type: Classifier
  type: ContemporaryDerivation
  derived from: http://data.ga-group.nl/ics/bics/2020/1111111010
  derived from: http://data.ga-group.nl/ics/bics/2024/1111111010
  source accessed on: 2023-07-03T18:11:29Z
  source last accessed on: 2024-06-05T14:42:36Z
  definition: This segment includes companies that own and operate gambling facilities.
  notation: 1111111010
  valid from: 2020-10-03
source accessed on: 2019-12-03T20:05:01Z
source last accessed on: 2024-06-05T14:42:36Z
definition: This segment includes companies that own and operate gambling facilities.
notation: 1111111010
valid from: 2014-08-08

Gaming Equipment
type: BicsLevel5Segment
type: Classifier
type: NamedIndividual
is level5 segment of: Casinos & Gaming
created with: infer-bics.sql
derived from: Alt Vehicle Energy Storage
  type: BicsLevel5Segment
  type: Classifier
  type: ContemporaryDerivation
  derived from: http://data.ga-group.nl/ics/bics/2014/1111111011
  source accessed on: 2019-12-03T20:05:01Z
  source last accessed on: 2019-12-03T20:05:01Z
  definition: This segment includes companies that manufacture alternative energy storage systems. Includes hybrid batteries, electric vehicle batteries and hydrogen fuel cells. Excludes standard lead acid starter batteries (see Vehicle Battery Manufacturing).
  notation: 1111111011
  valid from: 2014-08-08
  valid till: 2020-10-03
derived from: Gaming Equipment
  type: BicsLevel4SubIndustry
  type: Classifier
  type: AnachronousDerivation
  derived from: http://data.ga-group.nl/ics/bics/2014/11161011
  source accessed on: 2019-12-03T20:05:01Z
  source last accessed on: 2019-12-03T20:05:01Z
  definition: This industry subgroup includes companies that manufacture or lease gaming equipment.
  notation: 11161011
  valid from: 2014-08-08
  valid till: 2020-10-03
derived from: Gaming Equipment
  type: BicsLevel5Segment
  type: Classifier
  type: ContemporaryDerivation
  derived from: http://data.ga-group.nl/ics/bics/2020/1111111011
  derived from: http://data.ga-group.nl/ics/bics/2024/1111111011
  source accessed on: 2023-07-03T18:11:29Z
  source last accessed on: 2024-06-05T14:42:36Z
  definition: This segment includes companies that manufacture or lease gaming equipment.
  notation: 1111111011
  valid from: 2020-10-03
source accessed on: 2019-12-03T20:05:01Z
source last accessed on: 2024-06-05T14:42:36Z
definition: This segment includes companies that manufacture or lease gaming equipment.
notation: 1111111011
valid from: 2014-08-08

Mobile & Online Gambling
type: BicsLevel5Segment
type: Classifier
type: NamedIndividual
is level5 segment of: Casinos & Gaming
created with: infer-bics.sql
derived from: Other Alt Vehicles Parts
  type: BicsLevel5Segment
  type: Classifier
  type: ContemporaryDerivation
  derived from: http://data.ga-group.nl/ics/bics/2014/1111111012
  source accessed on: 2019-12-03T20:05:01Z
  source last accessed on: 2019-12-03T20:05:01Z
  definition: This segment includes companies that manufacture other alternative drivetrain and hybrid system parts not elsewhere classified.
  notation: 1111111012
  valid from: 2014-08-08
  valid till: 2020-10-03
derived from: Mobile & Online Gambling
  type: BicsLevel4SubIndustry
  type: Classifier
  type: AnachronousDerivation
  derived from: http://data.ga-group.nl/ics/bics/2014/11161012
  source accessed on: 2019-12-03T20:05:01Z
  source last accessed on: 2019-12-03T20:05:01Z
  definition: This industry subgroup includes companies that provide gambling services through Internet or mobile devices.
  notation: 11161012
  valid from: 2014-08-08
  valid till: 2020-10-03
derived from: Mobile & Online Gambling
  type: BicsLevel5Segment
  type: Classifier
  type: ContemporaryDerivation
  derived from: http://data.ga-group.nl/ics/bics/2020/1111111012
  derived from: http://data.ga-group.nl/ics/bics/2024/1111111012
  source accessed on: 2023-07-03T18:11:29Z
  source last accessed on: 2024-06-05T14:42:36Z
  definition: This segment includes companies that provide gambling services through Internet or mobile devices.
  notation: 1111111012
  valid from: 2020-10-03
source accessed on: 2019-12-03T20:05:01Z
source last accessed on: 2024-06-05T14:42:36Z
definition: This segment includes companies that provide gambling services through Internet or mobile devices.
notation: 1111111012
valid from: 2014-08-08

Lottery Services
type: BicsLevel5Segment
type: Classifier
type: NamedIndividual
is level5 segment of: Casinos & Gaming
created with: infer-bics.sql
derived from: Lottery Services
  type: BicsLevel4SubIndustry
  type: Classifier
  type: AnachronousDerivation
  derived from: http://data.ga-group.nl/ics/bics/2014/11161013
  source accessed on: 2019-12-03T20:05:01Z
  source last accessed on: 2019-12-03T20:05:01Z
  definition: This industry subgroup includes companies that operate establishments, other than retail stores, that sell lottery tickets.
  notation: 11161013
  valid from: 2014-08-08
  valid till: 2020-10-03
derived from: Lottery Services
  type: BicsLevel5Segment
  type: Classifier
  type: ContemporaryDerivation
  derived from: http://data.ga-group.nl/ics/bics/2020/1111111013
  derived from: http://data.ga-group.nl/ics/bics/2024/1111111013
  source accessed on: 2023-07-03T18:11:29Z
  source last accessed on: 2024-06-05T14:42:36Z
  definition: This segment includes companies that operate a lottery system.
  notation: 1111111013
  valid from: 2020-10-03
source accessed on: 2023-07-03T18:11:29Z
source last accessed on: 2024-06-05T14:42:36Z
definition: This segment includes companies that operate a lottery system.
notation: 1111111013
valid from: 2020-10-03

Racetracks
type: BicsLevel5Segment
type: Classifier
type: NamedIndividual
is level5 segment of: Casinos & Gaming
created with: infer-bics.sql
derived from: Racetracks
  type: BicsLevel4SubIndustry
  type: Classifier
  type: AnachronousDerivation
  derived from: http://data.ga-group.nl/ics/bics/2014/11161014
  source accessed on: 2019-12-03T20:05:01Z
  source last accessed on: 2019-12-03T20:05:01Z
  definition: This industry subgroup includes companies that operate racetrack facilities.
  notation: 11161014
  valid from: 2014-08-08
  valid till: 2020-10-03
derived from: Racetracks
  type: BicsLevel5Segment
  type: Classifier
  type: ContemporaryDerivation
  derived from: http://data.ga-group.nl/ics/bics/2020/1111111014
  derived from: http://data.ga-group.nl/ics/bics/2024/1111111014
  source accessed on: 2023-07-03T18:11:29Z
  source last accessed on: 2024-06-05T14:42:36Z
  definition: This segment includes companies that operate racetrack facilities.
  notation: 1111111014
  valid from: 2020-10-03
source accessed on: 2023-07-03T18:11:29Z
source last accessed on: 2024-06-05T14:42:36Z
definition: This segment includes companies that operate racetrack facilities.
notation: 1111111014
valid from: 2020-10-03

Betting
type: BicsLevel5Segment
type: Classifier
type: NamedIndividual
is level5 segment of: Casinos & Gaming
created with: infer-bics.sql
derived from: Betting
  type: BicsLevel4SubIndustry
  type: Classifier
  type: AnachronousDerivation
  derived from: http://data.ga-group.nl/ics/bics/2014/11161015
  source accessed on: 2019-12-03T20:05:01Z
  source last accessed on: 2019-12-03T20:05:01Z
  definition: This industry subgroup includes companies that provide betting services. These betting services can be done at a retail storefront (betting shop) or over the phone via call centers. Includes sports betting and off-racetrack betting. Excludes betting services provided through the Internet (see Mobile & Online Gambling).
  notation: 11161015
  valid from: 2014-08-08
  valid till: 2020-10-03
derived from: Betting
  type: BicsLevel5Segment
  type: Classifier
  type: ContemporaryDerivation
  derived from: http://data.ga-group.nl/ics/bics/2020/1111111015
  derived from: http://data.ga-group.nl/ics/bics/2024/1111111015
  source accessed on: 2023-07-03T18:11:29Z
  source last accessed on: 2024-06-05T14:42:36Z
  definition: This segment includes companies that provide betting services, at betting shops, or over the phone via call centers. Includes sports betting and off-racetrack betting. Excludes betting services provided through the Internet (see Mobile & Online Gambling).
  notation: 1111111015
  valid from: 2020-10-03
source accessed on: 2023-07-03T18:11:29Z
source last accessed on: 2024-06-05T14:42:36Z
definition: This segment includes companies that provide betting services, at betting shops, or over the phone via call centers. Includes sports betting and off-racetrack betting. Excludes betting services provided through the Internet (see Mobile & Online Gambling).
notation: 1111111015
valid from: 2020-10-03

Casinos & Gaming
type: BicsLevel4SubIndustry
type: Classifier
type: NamedIndividual
replaces: Casinos & Gaming
created with: infer-bics.sql
derived from: Alternative Vehicle Parts
  type: BicsLevel4SubIndustry
  type: Classifier
  type: ContemporaryDerivation
  derived from: http://data.ga-group.nl/ics/bics/2014/11111110
  source accessed on: 2019-12-03T20:05:01Z
  source last accessed on: 2019-12-03T20:05:01Z
  definition: This industry subgroup includes companies that manufacture alternative drivetrain and hybrid systems and parts for automobiles.
  notation: 11111110
  valid from: 2014-08-08
  valid till: 2020-10-03
derived from: Casinos & Gaming
  type: BicsLevel3Industry
  type: Classifier
  type: AnachronousDerivation
  derived from: http://data.ga-group.nl/ics/bics/2014/111610
  source accessed on: 2019-12-03T20:05:01Z
  source last accessed on: 2019-12-03T20:05:01Z
  definition: This industry includes companies that provide casino gaming without lodging. Also includes online gaming, racetracks, gaming equipment manufacturers and lottery services.
  notation: 111610
  valid from: 2014-08-08
  valid till: 2020-10-03
derived from: Casinos & Gaming
  type: BicsLevel4SubIndustry
  type: Classifier
  type: ContemporaryDerivation
  derived from: http://data.ga-group.nl/ics/bics/2020/11111110
  derived from: http://data.ga-group.nl/ics/bics/2024/11111110
  source accessed on: 2023-07-03T18:11:29Z
  source last accessed on: 2024-06-05T14:42:36Z
  definition: This industry subgroup includes companies that provide casino gaming without lodging. Also includes online gaming, racetracks, gaming equipment manufacturers and lottery services.
  notation: 11111110
  valid from: 2020-10-03
source accessed on: 2019-12-03T20:05:01Z
source last accessed on: 2024-06-05T14:42:36Z
definition: This industry subgroup includes companies that provide casino gaming without lodging. Also includes online gaming, racetracks, gaming equipment manufacturers and lottery services.
notation: 11111110
valid from: 2014-08-08

Auto Audio & Video Equipment
type: BicsLevel5Segment
type: Classifier
type: NamedIndividual
is level5 segment of: Cruise Lines
created with: infer-bics.sql
derived from: Auto Audio & Video Equipment
  type: BicsLevel5Segment
  type: Classifier
  type: ContemporaryDerivation
  derived from: http://data.ga-group.nl/ics/bics/2014/1111111110
  source accessed on: 2019-12-03T20:05:01Z
  source last accessed on: 2019-12-03T20:05:01Z
  definition: This segment includes companies that manufacture onboard electrical audio/video equipment. Such equipment includes GPS systems, car component monitoring and telematics.
  notation: 1111111110
  valid from: 2014-08-08
  valid till: 2020-10-03
source accessed on: 2019-12-03T20:05:01Z
source last accessed on: 2019-12-03T20:05:01Z
definition: This segment includes companies that manufacture onboard electrical audio/video equipment. Such equipment includes GPS systems, car component monitoring and telematics.
notation: 1111111110
valid from: 2014-08-08
valid till: 2020-10-03

Auto Light Equipment
type: BicsLevel5Segment
type: Classifier
type: NamedIndividual
is level5 segment of: Cruise Lines
is replaced by: Auto Light Equipment
created with: infer-bics.sql
derived from: Auto Light Equipment
  type: BicsLevel5Segment
  type: Classifier
  type: ContemporaryDerivation
  derived from: http://data.ga-group.nl/ics/bics/2014/1111111111
  source accessed on: 2019-12-03T20:05:01Z
  source last accessed on: 2019-12-03T20:05:01Z
  definition: This segment includes companies that manufacture onboard electrical lighting products.
  notation: 1111111111
  valid from: 2014-08-08
  valid till: 2020-10-03
source accessed on: 2019-12-03T20:05:01Z
source last accessed on: 2019-12-03T20:05:01Z
definition: This segment includes companies that manufacture onboard electrical lighting products.
notation: 1111111111
valid from: 2014-08-08
valid till: 2020-10-03

Other Electrical Equipment
type: BicsLevel5Segment
type: Classifier
type: NamedIndividual
is level5 segment of: Cruise Lines
is replaced by: Auto Electronics
created with: infer-bics.sql
derived from: Other Electrical Equipment
  type: BicsLevel5Segment
  type: Classifier
  type: ContemporaryDerivation
  derived from: http://data.ga-group.nl/ics/bics/2014/1111111112
  source accessed on: 2019-12-03T20:05:01Z
  source last accessed on: 2019-12-03T20:05:01Z
  definition: This segment includes companies that manufacture electrical and electronic equipment, except lighting systems and audio/video equipment. Includes automotive systems, cruise control systems, power window systems, alternators, starters, engine control units, sensors, and wiper systems.
  notation: 1111111112
  valid from: 2014-08-08
  valid till: 2020-10-03
source accessed on: 2019-12-03T20:05:01Z
source last accessed on: 2019-12-03T20:05:01Z
definition: This segment includes companies that manufacture electrical and electronic equipment, except lighting systems and audio/video equipment. Includes automotive systems, cruise control systems, power window systems, alternators, starters, engine control units, sensors, and wiper systems.
notation: 1111111112
valid from: 2014-08-08
valid till: 2020-10-03

Cruise Lines
type: BicsLevel4SubIndustry
type: Classifier
type: NamedIndividual
replaces: Cruise Lines
created with: infer-bics.sql
derived from: Auto Electrical
  type: BicsLevel4SubIndustry
  type: Classifier
  type: ContemporaryDerivation
  derived from: http://data.ga-group.nl/ics/bics/2014/11111111
  source accessed on: 2019-12-03T20:05:01Z
  source last accessed on: 2019-12-03T20:05:01Z
  definition: This industry subgroup includes companies that manufacture onboard electrical and electronic equipment for the automobile industry.
  notation: 11111111
  valid from: 2014-08-08
  valid till: 2020-10-03
derived from: Cruise Lines
  type: BicsLevel3Industry
  type: Classifier
  type: AnachronousDerivation
  derived from: http://data.ga-group.nl/ics/bics/2014/111611
  source accessed on: 2019-12-03T20:05:01Z
  source last accessed on: 2019-12-03T20:05:01Z
  definition: This industry includes companies that provide transportation and leisure entertainment, such as deep sea cruises and river cruises.
  notation: 111611
  valid from: 2014-08-08
  valid till: 2020-10-03
derived from: Cruise Lines
  type: BicsLevel4SubIndustry
  type: Classifier
  type: ContemporaryDerivation
  derived from: http://data.ga-group.nl/ics/bics/2020/11111111
  derived from: http://data.ga-group.nl/ics/bics/2024/11111111
  source accessed on: 2023-07-03T18:11:29Z
  source last accessed on: 2024-06-05T14:42:36Z
  definition: This industry subgroup includes companies that provide transportation and leisure entertainment, such as deep sea cruises and river cruises.
  notation: 11111111
  valid from: 2020-10-03
source accessed on: 2019-12-03T20:05:01Z
source last accessed on: 2024-06-05T14:42:36Z
definition: This industry subgroup includes companies that provide transportation and leisure entertainment, such as deep sea cruises and river cruises.
notation: 11111111
valid from: 2014-08-08

Food & Beverage Rev - Hotels
type: BicsLevel6Segment
type: Classifier
type: NamedIndividual
is level6 segment of: Hotel & Motel (excl Casino Hotel)
replaces: Food & Beverage Rev - Hotels
created with: infer-bics.sql
derived from: Food & Beverage Rev - Hotels
  type: BicsLevel5Segment
  type: Classifier
  type: AnachronousDerivation
  derived from: http://data.ga-group.nl/ics/bics/2014/1116121010
  source accessed on: 2019-12-03T20:05:01Z
  source last accessed on: 2019-12-03T20:05:01Z
  definition: This segment includes the hotel revenue attributed to the food and beverage component.
  notation: 1116121010
  valid from: 2014-08-08
  valid till: 2020-10-03
derived from: Food & Beverage Rev - Hotels
  type: BicsLevel6Segment
  type: Classifier
  type: ContemporaryDerivation
  derived from: http://data.ga-group.nl/ics/bics/2020/111111121010
  derived from: http://data.ga-group.nl/ics/bics/2024/111111121010
  source accessed on: 2023-07-03T18:11:29Z
  source last accessed on: 2024-06-05T14:42:36Z
  definition: This segment includes hotel revenue generated from food and beverage.
  notation: 111111121010
  valid from: 2020-10-03
source accessed on: 2023-07-03T18:11:29Z
source last accessed on: 2024-06-05T14:42:36Z
definition: This segment includes hotel revenue generated from food and beverage.
notation: 111111121010
valid from: 2020-10-03

Room Revenue - Hotels
type: BicsLevel6Segment
type: Classifier
type: NamedIndividual
is level6 segment of: Hotel & Motel (excl Casino Hotel)
replaces: Room Revenue - Hotels
created with: infer-bics.sql
derived from: Room Revenue - Hotels
  type: BicsLevel5Segment
  type: Classifier
  type: AnachronousDerivation
  derived from: http://data.ga-group.nl/ics/bics/2014/1116121011
  source accessed on: 2019-12-03T20:05:01Z
  source last accessed on: 2019-12-03T20:05:01Z
  definition: This segment includes the hotel revenue attributed to the room component.
  notation: 1116121011
  valid from: 2014-08-08
  valid till: 2020-10-03
derived from: Room Revenue - Hotels
  type: BicsLevel6Segment
  type: Classifier
  type: ContemporaryDerivation
  derived from: http://data.ga-group.nl/ics/bics/2020/111111121011
  derived from: http://data.ga-group.nl/ics/bics/2024/111111121011
  source accessed on: 2023-07-03T18:11:29Z
  source last accessed on: 2024-06-05T14:42:36Z
  definition: This segment includes hotel revenue generated from lodging.
  notation: 111111121011
  valid from: 2020-10-03
source accessed on: 2023-07-03T18:11:29Z
source last accessed on: 2024-06-05T14:42:36Z
definition: This segment includes hotel revenue generated from lodging.
notation: 111111121011
valid from: 2020-10-03

Time-Share Revenue - Hotels
type: BicsLevel6Segment
type: Classifier
type: NamedIndividual
is level6 segment of: Hotel & Motel (excl Casino Hotel)
replaces: Time-Share Revenue - Hotels
created with: infer-bics.sql
derived from: Time-Share Revenue - Hotels
  type: BicsLevel5Segment
  type: Classifier
  type: AnachronousDerivation
  derived from: http://data.ga-group.nl/ics/bics/2014/1116121012
  source accessed on: 2019-12-03T20:05:01Z
  source last accessed on: 2019-12-03T20:05:01Z
  definition: This segment includes companies that sell vacation ownership or time-share units.
  notation: 1116121012
  valid from: 2014-08-08
  valid till: 2020-10-03
derived from: Time-Share Revenue - Hotels
  type: BicsLevel6Segment
  type: Classifier
  type: ContemporaryDerivation
  derived from: http://data.ga-group.nl/ics/bics/2020/111111121012
  derived from: http://data.ga-group.nl/ics/bics/2024/111111121012
  source accessed on: 2023-07-03T18:11:29Z
  source last accessed on: 2024-06-05T14:42:36Z
  definition: This segment includes revenue from sales of vacation ownership or time-share units.
  notation: 111111121012
  valid from: 2020-10-03
source accessed on: 2023-07-03T18:11:29Z
source last accessed on: 2024-06-05T14:42:36Z
definition: This segment includes revenue from sales of vacation ownership or time-share units.
notation: 111111121012
valid from: 2020-10-03

Other Revenue - Hotels
type: BicsLevel6Segment
type: Classifier
type: NamedIndividual
is level6 segment of: Hotel & Motel (excl Casino Hotel)
replaces: Other Revenue - Hotels
created with: infer-bics.sql
derived from: Other Revenue - Hotels
  type: BicsLevel5Segment
  type: Classifier
  type: AnachronousDerivation
  derived from: http://data.ga-group.nl/ics/bics/2014/1116121013
  source accessed on: 2019-12-03T20:05:01Z
  source last accessed on: 2019-12-03T20:05:01Z
  definition: This segment includes the hotel revenue attributed to components other than room or food and beverage.
  notation: 1116121013
  valid from: 2014-08-08
  valid till: 2020-10-03
derived from: Other Revenue - Hotels
  type: BicsLevel6Segment
  type: Classifier
  type: ContemporaryDerivation
  derived from: http://data.ga-group.nl/ics/bics/2020/111111121013
  derived from: http://data.ga-group.nl/ics/bics/2024/111111121013
  source accessed on: 2023-07-03T18:11:29Z
  source last accessed on: 2024-06-05T14:42:36Z
  definition: This segment includes hotel revenue generated from components other than room, food, or beverage.
  notation: 111111121013
  valid from: 2020-10-03
source accessed on: 2023-07-03T18:11:29Z
source last accessed on: 2024-06-05T14:42:36Z
definition: This segment includes hotel revenue generated from components other than room, food, or beverage.
notation: 111111121013
valid from: 2020-10-03

Hotel & Motel (excl Casino Hotel)
type: BicsLevel5Segment
type: Classifier
type: NamedIndividual
is level5 segment of: Lodging
created with: infer-bics.sql
derived from: Hotel & Motel (excl Casino Hotel)
  type: BicsLevel4SubIndustry
  type: Classifier
  type: AnachronousDerivation
  derived from: http://data.ga-group.nl/ics/bics/2014/11161210
  source accessed on: 2019-12-03T20:05:01Z
  source last accessed on: 2019-12-03T20:05:01Z
  definition: This industry subgroup includes companies (other than casino hotels) that provide short-term lodgings.
  notation: 11161210
  valid from: 2014-08-08
  valid till: 2020-10-03
derived from: Hotel & Motel (excl Casino Hotel)
  type: BicsLevel5Segment
  type: Classifier
  type: ContemporaryDerivation
  derived from: http://data.ga-group.nl/ics/bics/2020/1111111210
  derived from: http://data.ga-group.nl/ics/bics/2024/1111111210
  source accessed on: 2023-07-03T18:11:29Z
  source last accessed on: 2024-06-05T14:42:36Z
  definition: This segment includes companies, excluding casino hotels, that provide short-term lodgings.
  notation: 1111111210
  valid from: 2020-10-03
source accessed on: 2023-07-03T18:11:29Z
source last accessed on: 2024-06-05T14:42:36Z
definition: This segment includes companies, excluding casino hotels, that provide short-term lodgings.
notation: 1111111210
valid from: 2020-10-03

Food & Bev Rev - Casino Hotels
type: BicsLevel6Segment
type: Classifier
type: NamedIndividual
is level6 segment of: Casino Hotels
replaces: Food & Bev Rev - Casino Hotels
created with: infer-bics.sql
derived from: Food & Bev Rev - Casino Hotels
  type: BicsLevel5Segment
  type: Classifier
  type: AnachronousDerivation
  derived from: http://data.ga-group.nl/ics/bics/2014/1116121110
  source accessed on: 2019-12-03T20:05:01Z
  source last accessed on: 2019-12-03T20:05:01Z
  definition: This segment includes the casino hotel revenue attributed to the food and beverage component.
  notation: 1116121110
  valid from: 2014-08-08
  valid till: 2020-10-03
derived from: Food & Bev Rev - Casino Hotels
  type: BicsLevel6Segment
  type: Classifier
  type: ContemporaryDerivation
  derived from: http://data.ga-group.nl/ics/bics/2020/111111121110
  derived from: http://data.ga-group.nl/ics/bics/2024/111111121110
  source accessed on: 2023-07-03T18:11:29Z
  source last accessed on: 2024-06-05T14:42:36Z
  definition: This segment includes casino hotel revenue generated from food and beverage.
  notation: 111111121110
  valid from: 2020-10-03
source accessed on: 2023-07-03T18:11:29Z
source last accessed on: 2024-06-05T14:42:36Z
definition: This segment includes casino hotel revenue generated from food and beverage.
notation: 111111121110
valid from: 2020-10-03

Room Revenue - Casino Hotels
type: BicsLevel6Segment
type: Classifier
type: NamedIndividual
is level6 segment of: Casino Hotels
replaces: Room Revenue - Casino Hotels
created with: infer-bics.sql
derived from: Room Revenue - Casino Hotels
  type: BicsLevel5Segment
  type: Classifier
  type: AnachronousDerivation
  derived from: http://data.ga-group.nl/ics/bics/2014/1116121111
  source accessed on: 2019-12-03T20:05:01Z
  source last accessed on: 2019-12-03T20:05:01Z
  definition: This segment includes the casino hotel revenue attributed to the room component.
  notation: 1116121111
  valid from: 2014-08-08
  valid till: 2020-10-03
derived from: Room Revenue - Casino Hotels
  type: BicsLevel6Segment
  type: Classifier
  type: ContemporaryDerivation
  derived from: http://data.ga-group.nl/ics/bics/2020/111111121111
  derived from: http://data.ga-group.nl/ics/bics/2024/111111121111
  source accessed on: 2023-07-03T18:11:29Z
  source last accessed on: 2024-06-05T14:42:36Z
  definition: This segment includes casino hotel revenue generated from lodging.
  notation: 111111121111
  valid from: 2020-10-03
source accessed on: 2023-07-03T18:11:29Z
source last accessed on: 2024-06-05T14:42:36Z
definition: This segment includes casino hotel revenue generated from lodging.
notation: 111111121111
valid from: 2020-10-03

Other Rev - Casino Hotels
type: BicsLevel6Segment
type: Classifier
type: NamedIndividual
is level6 segment of: Casino Hotels
replaces: Other Rev - Casino Hotels
created with: infer-bics.sql
derived from: Other Rev - Casino Hotels
  type: BicsLevel5Segment
  type: Classifier
  type: AnachronousDerivation
  derived from: http://data.ga-group.nl/ics/bics/2014/1116121112
  source accessed on: 2019-12-03T20:05:01Z
  source last accessed on: 2019-12-03T20:05:01Z
  definition: This segment includes the casino hotel revenue attributed to the components other than room or food and beverage.
  notation: 1116121112
  valid from: 2014-08-08
  valid till: 2020-10-03
derived from: Other Rev - Casino Hotels
  type: BicsLevel6Segment
  type: Classifier
  type: ContemporaryDerivation
  derived from: http://data.ga-group.nl/ics/bics/2020/111111121112
  derived from: http://data.ga-group.nl/ics/bics/2024/111111121112
  source accessed on: 2023-07-03T18:11:29Z
  source last accessed on: 2024-06-05T14:42:36Z
  definition: This segment includes casino hotel revenue attributed to the components other than room, food or beverage. Excludes gambling related revenues (see Casinos & Gaming).
  notation: 111111121112
  valid from: 2020-10-03
source accessed on: 2023-07-03T18:11:29Z
source last accessed on: 2024-06-05T14:42:36Z
definition: This segment includes casino hotel revenue attributed to the components other than room, food or beverage. Excludes gambling related revenues (see Casinos & Gaming).
notation: 111111121112
valid from: 2020-10-03

Casino Hotels
type: BicsLevel5Segment
type: Classifier
type: NamedIndividual
is level5 segment of: Lodging
created with: infer-bics.sql
derived from: Casino Hotels
  type: BicsLevel4SubIndustry
  type: Classifier
  type: AnachronousDerivation
  derived from: http://data.ga-group.nl/ics/bics/2014/11161211
  source accessed on: 2019-12-03T20:05:01Z
  source last accessed on: 2019-12-03T20:05:01Z
  definition: This industry subgroup includes companies that provide short-term lodging in facilities with a casino on the premises.
  notation: 11161211
  valid from: 2014-08-08
  valid till: 2020-10-03
derived from: Casino Hotels
  type: BicsLevel5Segment
  type: Classifier
  type: ContemporaryDerivation
  derived from: http://data.ga-group.nl/ics/bics/2020/1111111211
  derived from: http://data.ga-group.nl/ics/bics/2024/1111111211
  source accessed on: 2023-07-03T18:11:29Z
  source last accessed on: 2024-06-05T14:42:36Z
  definition: This segment includes companies that provide short-term lodging in facilities with a casino on the premises.
  notation: 1111111211
  valid from: 2020-10-03
source accessed on: 2023-07-03T18:11:29Z
source last accessed on: 2024-06-05T14:42:36Z
definition: This segment includes companies that provide short-term lodging in facilities with a casino on the premises.
notation: 1111111211
valid from: 2020-10-03

Bed & Breakfast Inns
type: BicsLevel5Segment
type: Classifier
type: NamedIndividual
is level5 segment of: Lodging
created with: infer-bics.sql
derived from: Bed & Breakfast Inns
  type: BicsLevel4SubIndustry
  type: Classifier
  type: AnachronousDerivation
  derived from: http://data.ga-group.nl/ics/bics/2014/11161212
  source accessed on: 2019-12-03T20:05:01Z
  source last accessed on: 2019-12-03T20:05:01Z
  definition: This industry subgroup includes companies that provide short-term lodging in facilities known as bed-and-breakfast inns.
  notation: 11161212
  valid from: 2014-08-08
  valid till: 2020-10-03
derived from: Bed & Breakfast Inns
  type: BicsLevel5Segment
  type: Classifier
  type: ContemporaryDerivation
  derived from: http://data.ga-group.nl/ics/bics/2020/1111111212
  derived from: http://data.ga-group.nl/ics/bics/2024/1111111212
  source accessed on: 2023-07-03T18:11:29Z
  source last accessed on: 2024-06-05T14:42:36Z
  definition: This segment includes companies that provide short-term lodging in a home-like setting where breakfast is provided.
  notation: 1111111212
  valid from: 2020-10-03
source accessed on: 2023-07-03T18:11:29Z
source last accessed on: 2024-06-05T14:42:36Z
definition: This segment includes companies that provide short-term lodging in a home-like setting where breakfast is provided.
notation: 1111111212
valid from: 2020-10-03

Lodging
type: BicsLevel4SubIndustry
type: Classifier
type: NamedIndividual
replaces: Lodging
created with: infer-bics.sql
derived from: Auto Glass
  type: BicsLevel4SubIndustry
  type: Classifier
  type: ContemporaryDerivation
  derived from: http://data.ga-group.nl/ics/bics/2014/11111112
  source accessed on: 2019-12-03T20:05:01Z
  source last accessed on: 2019-12-03T20:05:01Z
  definition: This industry subgroup includes companies that manufacture automobile glass. Products include tinted and tintless windshields, windows and sun and moon roofs.
  notation: 11111112
  valid from: 2014-08-08
  valid till: 2020-10-03
derived from: Lodging
  type: BicsLevel3Industry
  type: Classifier
  type: AnachronousDerivation
  derived from: http://data.ga-group.nl/ics/bics/2014/111612
  source accessed on: 2019-12-03T20:05:01Z
  source last accessed on: 2019-12-03T20:05:01Z
  definition: This industry includes companies that provide temporary quarters in a room or rooms and usually charge a daily rate for their use.
  notation: 111612
  valid from: 2014-08-08
  valid till: 2020-10-03
derived from: Lodging
  type: BicsLevel4SubIndustry
  type: Classifier
  type: ContemporaryDerivation
  derived from: http://data.ga-group.nl/ics/bics/2020/11111112
  derived from: http://data.ga-group.nl/ics/bics/2024/11111112
  source accessed on: 2023-07-03T18:11:29Z
  source last accessed on: 2024-06-05T14:42:36Z
  definition: This industry subgroup includes companies that provide temporary accommodation and usually charge a daily rate for their use.
  notation: 11111112
  valid from: 2020-10-03
source accessed on: 2019-12-03T20:05:01Z
source last accessed on: 2024-06-05T14:42:36Z
definition: This industry subgroup includes companies that provide temporary accommodation and usually charge a daily rate for their use.
notation: 11111112
valid from: 2014-08-08

Fast Casual Rest - Franchise
type: BicsLevel7Segment
type: Classifier
type: NamedIndividual
is level7 segment of: Fast Casual Restaurants
replaces: Fast Casual Rest - Franchise
created with: infer-bics.sql
derived from: Fast Casual Rest - Franchise
  type: BicsLevel6Segment
  type: Classifier
  type: AnachronousDerivation
  derived from: http://data.ga-group.nl/ics/bics/2014/111613101210
  source accessed on: 2019-12-03T20:05:01Z
  source last accessed on: 2019-12-03T20:05:01Z
  definition: This segment includes companies that have franchise revenue for fast casual restaurants.
  notation: 111613101210
  valid from: 2014-08-08
  valid till: 2020-10-03
derived from: Fast Casual Rest - Franchise
  type: BicsLevel7Segment
  type: Classifier
  type: ContemporaryDerivation
  derived from: http://data.ga-group.nl/ics/bics/2020/11111113101010
  derived from: http://data.ga-group.nl/ics/bics/2024/11111113101010
  source accessed on: 2023-07-03T18:11:29Z
  source last accessed on: 2024-06-05T14:42:36Z
  definition: This segment includes revenue that fast casual restaurants generate from their franchising operations such as revenue from licensing, royalties, or providing supplies and equipment to franchisees.
  notation: 11111113101010
  valid from: 2020-10-03
source accessed on: 2023-07-03T18:11:29Z
source last accessed on: 2024-06-05T14:42:36Z
definition: This segment includes revenue that fast casual restaurants generate from their franchising operations such as revenue from licensing, royalties, or providing supplies and equipment to franchisees.
notation: 11111113101010
valid from: 2020-10-03

Fast Casual Rest - Owned
type: BicsLevel7Segment
type: Classifier
type: NamedIndividual
is level7 segment of: Fast Casual Restaurants
replaces: Fast Casual Rest - Owned
created with: infer-bics.sql
derived from: Fast Casual Rest - Owned
  type: BicsLevel6Segment
  type: Classifier
  type: AnachronousDerivation
  derived from: http://data.ga-group.nl/ics/bics/2014/111613101211
  source accessed on: 2019-12-03T20:05:01Z
  source last accessed on: 2019-12-03T20:05:01Z
  definition: This segment includes restaurants that provide food services where food is made to order, often in front of the customer with customizable options. Patrons pay before self-seating in an upscale environment. Food and drink may be consumed on premises, taken out or delivered to the customer's location. Alcohol may or may not be available. This segment includes only company-owned restaurant revenue.
  notation: 111613101211
  valid from: 2014-08-08
  valid till: 2020-10-03
derived from: Fast Casual Rest - Owned
  type: BicsLevel7Segment
  type: Classifier
  type: ContemporaryDerivation
  derived from: http://data.ga-group.nl/ics/bics/2020/11111113101011
  derived from: http://data.ga-group.nl/ics/bics/2024/11111113101011
  source accessed on: 2023-07-03T18:11:29Z
  source last accessed on: 2024-06-05T14:42:36Z
  definition: This segment includes revenue that fast casual restaurants generate from the operations of their company-owned restaurants.
  notation: 11111113101011
  valid from: 2020-10-03
source accessed on: 2023-07-03T18:11:29Z
source last accessed on: 2024-06-05T14:42:36Z
definition: This segment includes revenue that fast casual restaurants generate from the operations of their company-owned restaurants.
notation: 11111113101011
valid from: 2020-10-03

Fast Casual Restaurants
type: BicsLevel6Segment
type: Classifier
type: NamedIndividual
is level6 segment of: Limited Service Restaurants
replaces: Fast Casual Restaurants
created with: infer-bics.sql
derived from: Fast Casual Restaurants
  type: BicsLevel5Segment
  type: Classifier
  type: AnachronousDerivation
  derived from: http://data.ga-group.nl/ics/bics/2014/1116131012
  source accessed on: 2019-12-03T20:05:01Z
  source last accessed on: 2019-12-03T20:05:01Z
  definition: This segment includes restaurants that provide food services where food is made to order, often in front of the customer with customizable options. Patrons pay before self-seating in an upscale environment. Food and drink may be consumed on premises, taken out, or delivered to the customer's location. Alcohol may or may not be available. This segment includes company-owned and franchise revenue.
  notation: 1116131012
  valid from: 2014-08-08
  valid till: 2020-10-03
derived from: Fast Casual Restaurants
  type: BicsLevel6Segment
  type: Classifier
  type: ContemporaryDerivation
  derived from: http://data.ga-group.nl/ics/bics/2020/111111131010
  source accessed on: 2023-07-03T18:11:29Z
  source last accessed on: 2023-07-03T18:11:29Z
  definition: This segment includes restaurants that provide food services where food is made to order, often in front of the customer with customizable options. Patrons pay before self-seating in an upscale environment. Food and drink may be consumed on premises, taken out, or delivered.
  notation: 111111131010
  valid from: 2020-10-03
  valid till: 2024-06-07
derived from: Fast Casual Restaurants
  type: BicsLevel6Segment
  type: Classifier
  type: ContemporaryDerivation
  derived from: http://data.ga-group.nl/ics/bics/2024/111111131010
  source accessed on: 2024-06-05T14:42:36Z
  source last accessed on: 2024-06-05T14:42:36Z
  definition: This segment includes restaurants that provide food services where food is made to order, often in front of the customer with customizable options. Patrons pay before self-seating in an upscale environment. Food and drink may be consumed on premises, taken out, or delivered.
  notation: 111111131010
  valid from: 2024-06-07
source accessed on: 2023-07-03T18:11:29Z
source last accessed on: 2024-06-05T14:42:36Z
definition: This segment includes restaurants that provide food services where food is made to order, often in front of the customer with customizable options. Patrons pay before self-seating in an upscale environment. Food and drink may be consumed on premises, taken out, or delivered.
notation: 111111131010
valid from: 2020-10-03

Fast Food Rest - Franchise
type: BicsLevel7Segment
type: Classifier
type: NamedIndividual
is level7 segment of: Fast Food Restaurants
replaces: Fast Food Rest - Franchise
created with: infer-bics.sql
derived from: Fast Food Rest - Franchise
  type: BicsLevel6Segment
  type: Classifier
  type: AnachronousDerivation
  derived from: http://data.ga-group.nl/ics/bics/2014/111613101310
  source accessed on: 2019-12-03T20:05:01Z
  source last accessed on: 2019-12-03T20:05:01Z
  definition: This segment includes companies that have franchise revenue for limited-service restaurants.
  notation: 111613101310
  valid from: 2014-08-08
  valid till: 2020-10-03
derived from: Fast Food Rest - Franchise
  type: BicsLevel7Segment
  type: Classifier
  type: ContemporaryDerivation
  derived from: http://data.ga-group.nl/ics/bics/2020/11111113101110
  derived from: http://data.ga-group.nl/ics/bics/2024/11111113101110
  source accessed on: 2023-07-03T18:11:29Z
  source last accessed on: 2024-06-05T14:42:36Z
  definition: This segment includes revenue that fast food restaurants generate from their franchising operations such as revenue from licensing, royalty, or providing supplies and equipment to franchisee owners.
  notation: 11111113101110
  valid from: 2020-10-03
source accessed on: 2023-07-03T18:11:29Z
source last accessed on: 2024-06-05T14:42:36Z
definition: This segment includes revenue that fast food restaurants generate from their franchising operations such as revenue from licensing, royalty, or providing supplies and equipment to franchisee owners.
notation: 11111113101110
valid from: 2020-10-03

Fast Food Rest - Owned
type: BicsLevel7Segment
type: Classifier
type: NamedIndividual
is level7 segment of: Fast Food Restaurants
replaces: Fast Food Rest - Owned
created with: infer-bics.sql
derived from: Fast Food Rest - Owned
  type: BicsLevel6Segment
  type: Classifier
  type: AnachronousDerivation
  derived from: http://data.ga-group.nl/ics/bics/2014/111613101311
  source accessed on: 2019-12-03T20:05:01Z
  source last accessed on: 2019-12-03T20:05:01Z
  definition: This segment includes restaurants that provide food services where patrons generally order their food and pay before eating. Food and drink may be consumed on premises, taken out or delivered to the customer's location. This segment only includes company-owned restaurant revenue.
  notation: 111613101311
  valid from: 2014-08-08
  valid till: 2020-10-03
derived from: Fast Food Rest - Owned
  type: BicsLevel7Segment
  type: Classifier
  type: ContemporaryDerivation
  derived from: http://data.ga-group.nl/ics/bics/2020/11111113101111
  derived from: http://data.ga-group.nl/ics/bics/2024/11111113101111
  source accessed on: 2023-07-03T18:11:29Z
  source last accessed on: 2024-06-05T14:42:36Z
  definition: This segment includes revenue that fast food restaurants generate from the operations of their company-owned restaurants.
  notation: 11111113101111
  valid from: 2020-10-03
source accessed on: 2023-07-03T18:11:29Z
source last accessed on: 2024-06-05T14:42:36Z
definition: This segment includes revenue that fast food restaurants generate from the operations of their company-owned restaurants.
notation: 11111113101111
valid from: 2020-10-03

Fast Food Restaurants
type: BicsLevel6Segment
type: Classifier
type: NamedIndividual
is level6 segment of: Limited Service Restaurants
replaces: Fast Food Restaurants
created with: infer-bics.sql
derived from: Fast Food Restaurants
  type: BicsLevel5Segment
  type: Classifier
  type: AnachronousDerivation
  derived from: http://data.ga-group.nl/ics/bics/2014/1116131013
  source accessed on: 2019-12-03T20:05:01Z
  source last accessed on: 2019-12-03T20:05:01Z
  definition: This segment includes restaurants that provide food services where patrons order their food and pay before eating. Food and drink may be consumed on premises, taken out or delivered to the customer's location. This segment includes both company-owned restaurant and franchise revenue.
  notation: 1116131013
  valid from: 2014-08-08
  valid till: 2020-10-03
derived from: Fast Food Restaurants
  type: BicsLevel6Segment
  type: Classifier
  type: ContemporaryDerivation
  derived from: http://data.ga-group.nl/ics/bics/2020/111111131011
  derived from: http://data.ga-group.nl/ics/bics/2024/111111131011
  source accessed on: 2023-07-03T18:11:29Z
  source last accessed on: 2024-06-05T14:42:36Z
  definition: This segment includes restaurants that provide food services where patrons order their food and pay before eating. Food and drink may be consumed on premises, taken out, or delivered.
  notation: 111111131011
  valid from: 2020-10-03
source accessed on: 2023-07-03T18:11:29Z
source last accessed on: 2024-06-05T14:42:36Z
definition: This segment includes restaurants that provide food services where patrons order their food and pay before eating. Food and drink may be consumed on premises, taken out, or delivered.
notation: 111111131011
valid from: 2020-10-03

Coffee & Snack - Franchise
type: BicsLevel7Segment
type: Classifier
type: NamedIndividual
is level7 segment of: Coffee & Snack
replaces: Snack & Juice Bars-Franchise
created with: infer-bics.sql
derived from: Snack & Juice Bars-Franchise
  type: BicsLevel6Segment
  type: Classifier
  type: AnachronousDerivation
  derived from: http://data.ga-group.nl/ics/bics/2014/111613101410
  source accessed on: 2019-12-03T20:05:01Z
  source last accessed on: 2019-12-03T20:05:01Z
  definition: This segment includes companies that have franchise revenue for snack and nonalcoholic beverage bars.
  notation: 111613101410
  valid from: 2014-08-08
  valid till: 2020-10-03
derived from: Coffee & Snack - Franchise
  type: BicsLevel7Segment
  type: Classifier
  type: ContemporaryDerivation
  derived from: http://data.ga-group.nl/ics/bics/2020/11111113101210
  source accessed on: 2023-07-03T18:11:29Z
  source last accessed on: 2023-07-03T18:11:29Z
  definition: This segment includes revenue that coffee and snack restaurants generate from their franchising operations, such as revenue from licensing, royalties, or providing supplies and equipment to franchisees.
  notation: 11111113101210
  valid from: 2020-10-03
  valid till: 2024-06-07
derived from: Coffee & Snack - Franchise
  type: BicsLevel7Segment
  type: Classifier
  type: ContemporaryDerivation
  derived from: http://data.ga-group.nl/ics/bics/2024/11111113101210
  source accessed on: 2024-06-05T14:42:36Z
  source last accessed on: 2024-06-05T14:42:36Z
  definition: This segment includes revenue that coffee and snack restaurants generate from their franchising operations, such as revenue from licensing, royalties, or providing supplies and equipment to franchisees.
  notation: 11111113101210
  valid from: 2024-06-07
source accessed on: 2023-07-03T18:11:29Z
source last accessed on: 2024-06-05T14:42:36Z
definition: This segment includes revenue that coffee and snack restaurants generate from their franchising operations, such as revenue from licensing, royalties, or providing supplies and equipment to franchisees.
notation: 11111113101210
valid from: 2020-10-03

Coffee & Snack - Owned
type: BicsLevel7Segment
type: Classifier
type: NamedIndividual
is level7 segment of: Coffee & Snack
replaces: Snack & Juice Bars - Owned
created with: infer-bics.sql
derived from: Snack & Juice Bars - Owned
  type: BicsLevel6Segment
  type: Classifier
  type: AnachronousDerivation
  derived from: http://data.ga-group.nl/ics/bics/2014/111613101411
  source accessed on: 2019-12-03T20:05:01Z
  source last accessed on: 2019-12-03T20:05:01Z
  definition: This segment includes companies that prepare and/or serve a specialty snack, such as ice cream, frozen yogurt, cookies or popcorn, or nonalcoholic beverages, such as coffee, juices, sodas or smoothies. The food is prepared for immediate consumption. This segment includes only company-owned restaurant revenue.
  notation: 111613101411
  valid from: 2014-08-08
  valid till: 2020-10-03
derived from: Coffee & Snack - Owned
  type: BicsLevel7Segment
  type: Classifier
  type: ContemporaryDerivation
  derived from: http://data.ga-group.nl/ics/bics/2020/11111113101211
  derived from: http://data.ga-group.nl/ics/bics/2024/11111113101211
  source accessed on: 2023-07-03T18:11:29Z
  source last accessed on: 2024-06-05T14:42:36Z
  definition: This segment includes revenue that coffee and snack restaurants generate from the operations of their company-owned restaurants.
  notation: 11111113101211
  valid from: 2020-10-03
source accessed on: 2023-07-03T18:11:29Z
source last accessed on: 2024-06-05T14:42:36Z
definition: This segment includes revenue that coffee and snack restaurants generate from the operations of their company-owned restaurants.
notation: 11111113101211
valid from: 2020-10-03

Coffee & Snack
type: BicsLevel6Segment
type: Classifier
type: NamedIndividual
is level6 segment of: Limited Service Restaurants
replaces: Snack & Juice Bars
created with: infer-bics.sql
derived from: Snack & Juice Bars
  type: BicsLevel5Segment
  type: Classifier
  type: AnachronousDerivation
  derived from: http://data.ga-group.nl/ics/bics/2014/1116131014
  source accessed on: 2019-12-03T20:05:01Z
  source last accessed on: 2019-12-03T20:05:01Z
  definition: This segment includes companies that prepare and/or serve a specialty snack, such as ice cream, frozen yogurt, cookies or popcorn, or serve nonalcoholic beverages, such as coffee, juices, sodas or smoothies. This segment includes company-owned and franchise revenue.
  notation: 1116131014
  valid from: 2014-08-08
  valid till: 2020-10-03
derived from: Coffee & Snack
  type: BicsLevel6Segment
  type: Classifier
  type: ContemporaryDerivation
  derived from: http://data.ga-group.nl/ics/bics/2020/111111131012
  derived from: http://data.ga-group.nl/ics/bics/2024/111111131012
  source accessed on: 2023-07-03T18:11:29Z
  source last accessed on: 2024-06-05T14:42:36Z
  definition: This segment includes companies that prepare and/or serve specialty snacks such as ice cream, frozen yogurt, cookies or popcorn, or serve nonalcoholic beverages, such as coffee, juices, sodas, or smoothies.
  notation: 111111131012
  valid from: 2020-10-03
source accessed on: 2023-07-03T18:11:29Z
source last accessed on: 2024-06-05T14:42:36Z
definition: This segment includes companies that prepare and/or serve specialty snacks such as ice cream, frozen yogurt, cookies or popcorn, or serve nonalcoholic beverages, such as coffee, juices, sodas, or smoothies.
notation: 111111131012
valid from: 2020-10-03

Bars & Taverns
type: BicsLevel6Segment
type: Classifier
type: NamedIndividual
is level6 segment of: Limited Service Restaurants
replaces: Bars & Taverns
created with: infer-bics.sql
derived from: Bars & Taverns
  type: BicsLevel5Segment
  type: Classifier
  type: AnachronousDerivation
  derived from: http://data.ga-group.nl/ics/bics/2014/1116131010
  source accessed on: 2019-12-03T20:05:01Z
  source last accessed on: 2019-12-03T20:05:01Z
  definition: This segment includes companies known as bars, taverns, nightclubs or drinking places that prepare and serve alcoholic beverages for immediate consumption. Such companies may also provide limited food services.
  notation: 1116131010
  valid from: 2014-08-08
  valid till: 2020-10-03
derived from: Bars & Taverns
  type: BicsLevel6Segment
  type: Classifier
  type: ContemporaryDerivation
  derived from: http://data.ga-group.nl/ics/bics/2020/111111131013
  derived from: http://data.ga-group.nl/ics/bics/2024/111111131013
  source accessed on: 2023-07-03T18:11:29Z
  source last accessed on: 2024-06-05T14:42:36Z
  definition: This segment includes companies that operate bars, taverns, nightclubs, or other drinking establishments. Such companies may also provide limited food services.
  notation: 111111131013
  valid from: 2020-10-03
source accessed on: 2023-07-03T18:11:29Z
source last accessed on: 2024-06-05T14:42:36Z
definition: This segment includes companies that operate bars, taverns, nightclubs, or other drinking establishments. Such companies may also provide limited food services.
notation: 111111131013
valid from: 2020-10-03

Limited Service Restaurants
type: BicsLevel5Segment
type: Classifier
type: NamedIndividual
is level5 segment of: Restaurants
created with: infer-bics.sql
derived from: Limited Service Restaurants
  type: BicsLevel4SubIndustry
  type: Classifier
  type: AnachronousDerivation
  derived from: http://data.ga-group.nl/ics/bics/2014/11161310
  source accessed on: 2019-12-03T20:05:01Z
  source last accessed on: 2019-12-03T20:05:01Z
  definition: This industry subgroup includes establishments that provide food services where patrons generally order or select items and pay before eating. Food and drink may be consumed on premises, taken out or delivered to the customer's location. This industry subgroup includes company-owned and franchise revenue.
  notation: 11161310
  valid from: 2014-08-08
  valid till: 2020-10-03
derived from: Limited Service Restaurants
  type: BicsLevel5Segment
  type: Classifier
  type: ContemporaryDerivation
  derived from: http://data.ga-group.nl/ics/bics/2020/1111111310
  derived from: http://data.ga-group.nl/ics/bics/2024/1111111310
  source accessed on: 2023-07-03T18:11:29Z
  source last accessed on: 2024-06-05T14:42:36Z
  definition: This segment includes establishments that provide food services where patrons generally order or select items and pay before eating. Food and drink may be consumed on premises, taken out, or delivered.
  notation: 1111111310
  valid from: 2020-10-03
source accessed on: 2023-07-03T18:11:29Z
source last accessed on: 2024-06-05T14:42:36Z
definition: This segment includes establishments that provide food services where patrons generally order or select items and pay before eating. Food and drink may be consumed on premises, taken out, or delivered.
notation: 1111111310
valid from: 2020-10-03

Casual Rest - Franchise
type: BicsLevel7Segment
type: Classifier
type: NamedIndividual
is level7 segment of: Casual Restaurants
replaces: Casual Rest - Franchise
created with: infer-bics.sql
derived from: Casual Rest - Franchise
  type: BicsLevel6Segment
  type: Classifier
  type: AnachronousDerivation
  derived from: http://data.ga-group.nl/ics/bics/2014/111613111010
  source accessed on: 2019-12-03T20:05:01Z
  source last accessed on: 2019-12-03T20:05:01Z
  definition: This segment includes companies that have franchise revenue for casual family restaurants.
  notation: 111613111010
  valid from: 2014-08-08
  valid till: 2020-10-03
derived from: Casual Rest - Franchise
  type: BicsLevel7Segment
  type: Classifier
  type: ContemporaryDerivation
  derived from: http://data.ga-group.nl/ics/bics/2020/11111113111010
  derived from: http://data.ga-group.nl/ics/bics/2024/11111113111010
  source accessed on: 2023-07-03T18:11:29Z
  source last accessed on: 2024-06-05T14:42:36Z
  definition: This segment includes revenue that casual restaurants generate from their franchising operations, such as revenue from licensing, royalties, or providing supplies and equipment to franchisees.
  notation: 11111113111010
  valid from: 2020-10-03
source accessed on: 2023-07-03T18:11:29Z
source last accessed on: 2024-06-05T14:42:36Z
definition: This segment includes revenue that casual restaurants generate from their franchising operations, such as revenue from licensing, royalties, or providing supplies and equipment to franchisees.
notation: 11111113111010
valid from: 2020-10-03

Casual Rest - Owned
type: BicsLevel7Segment
type: Classifier
type: NamedIndividual
is level7 segment of: Casual Restaurants
replaces: Casual Rest - Owned
created with: infer-bics.sql
derived from: Casual Rest - Owned
  type: BicsLevel6Segment
  type: Classifier
  type: AnachronousDerivation
  derived from: http://data.ga-group.nl/ics/bics/2014/111613111011
  source accessed on: 2019-12-03T20:05:01Z
  source last accessed on: 2019-12-03T20:05:01Z
  definition: This segment includes lower- to mid-priced restaurants that provide food services to patrons who order their food, are served by wait staff while seated and pay after eating. This segment only includes company-owned restaurant revenue.
  notation: 111613111011
  valid from: 2014-08-08
  valid till: 2020-10-03
derived from: Casual Rest - Owned
  type: BicsLevel7Segment
  type: Classifier
  type: ContemporaryDerivation
  derived from: http://data.ga-group.nl/ics/bics/2020/11111113111011
  derived from: http://data.ga-group.nl/ics/bics/2024/11111113111011
  source accessed on: 2023-07-03T18:11:29Z
  source last accessed on: 2024-06-05T14:42:36Z
  definition: This segment includes revenue that casual restaurants generate from the operations of their company-owned restaurants.
  notation: 11111113111011
  valid from: 2020-10-03
source accessed on: 2023-07-03T18:11:29Z
source last accessed on: 2024-06-05T14:42:36Z
definition: This segment includes revenue that casual restaurants generate from the operations of their company-owned restaurants.
notation: 11111113111011
valid from: 2020-10-03

Casual Restaurants
type: BicsLevel6Segment
type: Classifier
type: NamedIndividual
is level6 segment of: Full Service Restaurants
replaces: Casual Full Svc Restaurants
created with: infer-bics.sql
derived from: Casual Full Svc Restaurants
  type: BicsLevel5Segment
  type: Classifier
  type: AnachronousDerivation
  derived from: http://data.ga-group.nl/ics/bics/2014/1116131110
  source accessed on: 2019-12-03T20:05:01Z
  source last accessed on: 2019-12-03T20:05:01Z
  definition: This segment includes lower- to mid-priced restaurants that provide food services to patrons who order their food, are served by wait staff while seated and pay after eating. This segment includes both company-owned restaurant and franchise revenue.
  notation: 1116131110
  valid from: 2014-08-08
  valid till: 2020-10-03
derived from: Casual Restaurants
  type: BicsLevel6Segment
  type: Classifier
  type: ContemporaryDerivation
  derived from: http://data.ga-group.nl/ics/bics/2020/111111131110
  derived from: http://data.ga-group.nl/ics/bics/2024/111111131110
  source accessed on: 2023-07-03T18:11:29Z
  source last accessed on: 2024-06-05T14:42:36Z
  definition: This segment includes low to mid-priced restaurants that provide food services to patrons who order their food, are served by wait staff while seated, and pay after eating.
  notation: 111111131110
  valid from: 2020-10-03
source accessed on: 2023-07-03T18:11:29Z
source last accessed on: 2024-06-05T14:42:36Z
definition: This segment includes low to mid-priced restaurants that provide food services to patrons who order their food, are served by wait staff while seated, and pay after eating.
notation: 111111131110
valid from: 2020-10-03

Upscale Rest - Franchise
type: BicsLevel7Segment
type: Classifier
type: NamedIndividual
is level7 segment of: Upscale Restaurants
replaces: Upscale Rest - Franchise
created with: infer-bics.sql
derived from: Upscale Rest - Franchise
  type: BicsLevel6Segment
  type: Classifier
  type: AnachronousDerivation
  derived from: http://data.ga-group.nl/ics/bics/2014/111613111110
  source accessed on: 2019-12-03T20:05:01Z
  source last accessed on: 2019-12-03T20:05:01Z
  definition: This segment includes companies that have franchise revenue for upscale family restaurants.
  notation: 111613111110
  valid from: 2014-08-08
  valid till: 2020-10-03
derived from: Upscale Rest - Franchise
  type: BicsLevel7Segment
  type: Classifier
  type: ContemporaryDerivation
  derived from: http://data.ga-group.nl/ics/bics/2020/11111113111110
  derived from: http://data.ga-group.nl/ics/bics/2024/11111113111110
  source accessed on: 2023-07-03T18:11:29Z
  source last accessed on: 2024-06-05T14:42:36Z
  definition: This segment includes revenue that upscale restaurants generate from their franchising operations, such as revenue from licensing, royalties, or providing supplies and equipment to franchisees.
  notation: 11111113111110
  valid from: 2020-10-03
source accessed on: 2023-07-03T18:11:29Z
source last accessed on: 2024-06-05T14:42:36Z
definition: This segment includes revenue that upscale restaurants generate from their franchising operations, such as revenue from licensing, royalties, or providing supplies and equipment to franchisees.
notation: 11111113111110
valid from: 2020-10-03

Upscale Rest - Owned
type: BicsLevel7Segment
type: Classifier
type: NamedIndividual
is level7 segment of: Upscale Restaurants
replaces: Upscale Rest - Owned
created with: infer-bics.sql
derived from: Upscale Rest - Owned
  type: BicsLevel6Segment
  type: Classifier
  type: AnachronousDerivation
  derived from: http://data.ga-group.nl/ics/bics/2014/111613111111
  source accessed on: 2019-12-03T20:05:01Z
  source last accessed on: 2019-12-03T20:05:01Z
  definition: This segment includes high-priced restaurants that provide food services to patrons who order their food, are served by wait staff while seated and pay after eating. This segment only includes company-owned restaurant revenue.
  notation: 111613111111
  valid from: 2014-08-08
  valid till: 2020-10-03
derived from: Upscale Rest - Owned
  type: BicsLevel7Segment
  type: Classifier
  type: ContemporaryDerivation
  derived from: http://data.ga-group.nl/ics/bics/2020/11111113111111
  derived from: http://data.ga-group.nl/ics/bics/2024/11111113111111
  source accessed on: 2023-07-03T18:11:29Z
  source last accessed on: 2024-06-05T14:42:36Z
  definition: This segment includes revenue that upscale restaurants generate from the operations of their company-owned restaurants.
  notation: 11111113111111
  valid from: 2020-10-03
source accessed on: 2023-07-03T18:11:29Z
source last accessed on: 2024-06-05T14:42:36Z
definition: This segment includes revenue that upscale restaurants generate from the operations of their company-owned restaurants.
notation: 11111113111111
valid from: 2020-10-03

Upscale Restaurants
type: BicsLevel6Segment
type: Classifier
type: NamedIndividual
is level6 segment of: Full Service Restaurants
replaces: Upscale Full Svc Restaurants
created with: infer-bics.sql
derived from: Upscale Full Svc Restaurants
  type: BicsLevel5Segment
  type: Classifier
  type: AnachronousDerivation
  derived from: http://data.ga-group.nl/ics/bics/2014/1116131111
  source accessed on: 2019-12-03T20:05:01Z
  source last accessed on: 2019-12-03T20:05:01Z
  definition: This segment includes companies that provide food services to patrons who order their food, are served by wait staff while seated and pay after eating. This segment includes company-owned and franchise revenue.
  notation: 1116131111
  valid from: 2014-08-08
  valid till: 2020-10-03
derived from: Upscale Restaurants
  type: BicsLevel6Segment
  type: Classifier
  type: ContemporaryDerivation
  derived from: http://data.ga-group.nl/ics/bics/2020/111111131111
  derived from: http://data.ga-group.nl/ics/bics/2024/111111131111
  source accessed on: 2023-07-03T18:11:29Z
  source last accessed on: 2024-06-05T14:42:36Z
  definition: This segment includes high-priced restaurants that provide food services to patrons who order their food, are served by wait staff while seated and pay after eating.
  notation: 111111131111
  valid from: 2020-10-03
source accessed on: 2023-07-03T18:11:29Z
source last accessed on: 2024-06-05T14:42:36Z
definition: This segment includes high-priced restaurants that provide food services to patrons who order their food, are served by wait staff while seated and pay after eating.
notation: 111111131111
valid from: 2020-10-03

Full Service Restaurants
type: BicsLevel5Segment
type: Classifier
type: NamedIndividual
is level5 segment of: Restaurants
created with: infer-bics.sql
derived from: Full Service Restaurants
  type: BicsLevel4SubIndustry
  type: Classifier
  type: AnachronousDerivation
  derived from: http://data.ga-group.nl/ics/bics/2014/11161311
  source accessed on: 2019-12-03T20:05:01Z
  source last accessed on: 2019-12-03T20:05:01Z
  definition: This industry subgroup includes restaurants that provide food services to patrons who order their food, are served by wait staff while seated and pay after eating.
  notation: 11161311
  valid from: 2014-08-08
  valid till: 2020-10-03
derived from: Full Service Restaurants
  type: BicsLevel5Segment
  type: Classifier
  type: ContemporaryDerivation
  derived from: http://data.ga-group.nl/ics/bics/2020/1111111311
  derived from: http://data.ga-group.nl/ics/bics/2024/1111111311
  source accessed on: 2023-07-03T18:11:29Z
  source last accessed on: 2024-06-05T14:42:36Z
  definition: This segment includes restaurants that provide food services to patrons who order their food, are served by wait staff while seated, and pay after eating.
  notation: 1111111311
  valid from: 2020-10-03
source accessed on: 2023-07-03T18:11:29Z
source last accessed on: 2024-06-05T14:42:36Z
definition: This segment includes restaurants that provide food services to patrons who order their food, are served by wait staff while seated, and pay after eating.
notation: 1111111311
valid from: 2020-10-03

Restaurants
type: BicsLevel4SubIndustry
type: Classifier
type: NamedIndividual
replaces: Restaurants
created with: infer-bics.sql
derived from: Auto Metal Stamping
  type: BicsLevel4SubIndustry
  type: Classifier
  type: ContemporaryDerivation
  derived from: http://data.ga-group.nl/ics/bics/2014/11111113
  source accessed on: 2019-12-03T20:05:01Z
  source last accessed on: 2019-12-03T20:05:01Z
  definition: This industry subgroup includes companies that manufacture automobile metal stampings. Products include body parts, fenders, hubcaps and tops.
  notation: 11111113
  valid from: 2014-08-08
  valid till: 2020-10-03
derived from: Restaurants
  type: BicsLevel3Industry
  type: Classifier
  type: AnachronousDerivation
  derived from: http://data.ga-group.nl/ics/bics/2014/111613
  source accessed on: 2019-12-03T20:05:01Z
  source last accessed on: 2019-12-03T20:05:01Z
  definition: This industry includes companies that prepares, serves or provides self-serve food for immediate consumption. The facilities can be seated, takeout, or mobile vehicles or carts.
  notation: 111613
  valid from: 2014-08-08
  valid till: 2020-10-03
derived from: Restaurants
  type: BicsLevel4SubIndustry
  type: Classifier
  type: ContemporaryDerivation
  derived from: http://data.ga-group.nl/ics/bics/2020/11111113
  derived from: http://data.ga-group.nl/ics/bics/2024/11111113
  source accessed on: 2023-07-03T18:11:29Z
  source last accessed on: 2024-06-05T14:42:36Z
  definition: This industry subgroup includes companies that prepare, serve, or provide food for immediate consumption. The facilities can be seated, takeout, mobile vehicles, or carts.
  notation: 11111113
  valid from: 2020-10-03
source accessed on: 2019-12-03T20:05:01Z
source last accessed on: 2024-06-05T14:42:36Z
definition: This industry subgroup includes companies that prepare, serve, or provide food for immediate consumption. The facilities can be seated, takeout, mobile vehicles, or carts.
notation: 11111113
valid from: 2014-08-08

Adult Nightclubs
type: BicsLevel5Segment
type: Classifier
type: NamedIndividual
is level5 segment of: Entertainment Facilities
created with: infer-bics.sql
derived from: Adult Nightclubs
  type: BicsLevel4SubIndustry
  type: Classifier
  type: AnachronousDerivation
  derived from: http://data.ga-group.nl/ics/bics/2014/11181010
  source accessed on: 2019-12-03T20:05:01Z
  source last accessed on: 2019-12-03T20:05:01Z
  definition: This industry subgroup includes companies that operate adult nightclub establishments.
  notation: 11181010
  valid from: 2014-08-08
  valid till: 2020-10-03
derived from: Adult Nightclubs
  type: BicsLevel5Segment
  type: Classifier
  type: ContemporaryDerivation
  derived from: http://data.ga-group.nl/ics/bics/2020/1111111410
  derived from: http://data.ga-group.nl/ics/bics/2024/1111111410
  source accessed on: 2023-07-03T18:11:29Z
  source last accessed on: 2024-06-05T14:42:36Z
  definition: This segment includes companies that operate adult nightclubs.
  notation: 1111111410
  valid from: 2020-10-03
source accessed on: 2023-07-03T18:11:29Z
source last accessed on: 2024-06-05T14:42:36Z
definition: This segment includes companies that operate adult nightclubs.
notation: 1111111410
valid from: 2020-10-03

Amusement Arcades
type: BicsLevel6Segment
type: Classifier
type: NamedIndividual
is level6 segment of: Amusement & Theme Parks
replaces: Amusement Arcades
created with: infer-bics.sql
derived from: Amusement Arcades
  type: BicsLevel5Segment
  type: Classifier
  type: AnachronousDerivation
  derived from: http://data.ga-group.nl/ics/bics/2014/1118101110
  source accessed on: 2019-12-03T20:05:01Z
  source last accessed on: 2019-12-03T20:05:01Z
  definition: This segment includes companies that operate amusement arcades.
  notation: 1118101110
  valid from: 2014-08-08
  valid till: 2020-10-03
derived from: Amusement Arcades
  type: BicsLevel6Segment
  type: Classifier
  type: ContemporaryDerivation
  derived from: http://data.ga-group.nl/ics/bics/2020/111111141110
  derived from: http://data.ga-group.nl/ics/bics/2024/111111141110
  source accessed on: 2023-07-03T18:11:29Z
  source last accessed on: 2024-06-05T14:42:36Z
  definition: This segment includes companies that operate amusement arcades.
  notation: 111111141110
  valid from: 2020-10-03
source accessed on: 2023-07-03T18:11:29Z
source last accessed on: 2024-06-05T14:42:36Z
definition: This segment includes companies that operate amusement arcades.
notation: 111111141110
valid from: 2020-10-03

Amuse Theme Parks
type: BicsLevel6Segment
type: Classifier
type: NamedIndividual
is level6 segment of: Amusement & Theme Parks
replaces: Amuse Theme Parks
created with: infer-bics.sql
derived from: Amuse Theme Parks
  type: BicsLevel5Segment
  type: Classifier
  type: AnachronousDerivation
  derived from: http://data.ga-group.nl/ics/bics/2014/1118101111
  source accessed on: 2019-12-03T20:05:01Z
  source last accessed on: 2019-12-03T20:05:01Z
  definition: This segment includes companies that operate theme park facilities.
  notation: 1118101111
  valid from: 2014-08-08
  valid till: 2020-10-03
derived from: Amuse Theme Parks
  type: BicsLevel6Segment
  type: Classifier
  type: ContemporaryDerivation
  derived from: http://data.ga-group.nl/ics/bics/2020/111111141111
  derived from: http://data.ga-group.nl/ics/bics/2024/111111141111
  source accessed on: 2023-07-03T18:11:29Z
  source last accessed on: 2024-06-05T14:42:36Z
  definition: This segment includes companies that operate theme park facilities.
  notation: 111111141111
  valid from: 2020-10-03
source accessed on: 2023-07-03T18:11:29Z
source last accessed on: 2024-06-05T14:42:36Z
definition: This segment includes companies that operate theme park facilities.
notation: 111111141111
valid from: 2020-10-03

Amusement & Theme Parks
type: BicsLevel5Segment
type: Classifier
type: NamedIndividual
is level5 segment of: Entertainment Facilities
created with: infer-bics.sql
derived from: Amusement & Theme Parks
  type: BicsLevel4SubIndustry
  type: Classifier
  type: AnachronousDerivation
  derived from: http://data.ga-group.nl/ics/bics/2014/11181011
  source accessed on: 2019-12-03T20:05:01Z
  source last accessed on: 2019-12-03T20:05:01Z
  definition: This industry subgroup includes companies that operate theme park facilities and amusement arcades.
  notation: 11181011
  valid from: 2014-08-08
  valid till: 2020-10-03
derived from: Amusement & Theme Parks
  type: BicsLevel5Segment
  type: Classifier
  type: ContemporaryDerivation
  derived from: http://data.ga-group.nl/ics/bics/2020/1111111411
  derived from: http://data.ga-group.nl/ics/bics/2024/1111111411
  source accessed on: 2023-07-03T18:11:29Z
  source last accessed on: 2024-06-05T14:42:36Z
  definition: This segment includes companies that operate theme park facilities and amusement arcades.
  notation: 1111111411
  valid from: 2020-10-03
source accessed on: 2023-07-03T18:11:29Z
source last accessed on: 2024-06-05T14:42:36Z
definition: This segment includes companies that operate theme park facilities and amusement arcades.
notation: 1111111411
valid from: 2020-10-03

Entertainment Ticket Agencies
type: BicsLevel5Segment
type: Classifier
type: NamedIndividual
is level5 segment of: Entertainment Facilities
created with: infer-bics.sql
derived from: Entertainment Ticket Agencies
  type: BicsLevel4SubIndustry
  type: Classifier
  type: AnachronousDerivation
  derived from: http://data.ga-group.nl/ics/bics/2014/11181012
  source accessed on: 2019-12-03T20:05:01Z
  source last accessed on: 2019-12-03T20:05:01Z
  definition: This industry subgroup includes companies that act as agents in the sale of tickets.
  notation: 11181012
  valid from: 2014-08-08
  valid till: 2020-10-03
derived from: Entertainment Ticket Agencies
  type: BicsLevel5Segment
  type: Classifier
  type: ContemporaryDerivation
  derived from: http://data.ga-group.nl/ics/bics/2020/1111111412
  derived from: http://data.ga-group.nl/ics/bics/2024/1111111412
  source accessed on: 2023-07-03T18:11:29Z
  source last accessed on: 2024-06-05T14:42:36Z
  definition: This segment includes companies that act as agents in the sale of tickets.
  notation: 1111111412
  valid from: 2020-10-03
source accessed on: 2023-07-03T18:11:29Z
source last accessed on: 2024-06-05T14:42:36Z
definition: This segment includes companies that act as agents in the sale of tickets.
notation: 1111111412
valid from: 2020-10-03

Movie Theaters
type: BicsLevel5Segment
type: Classifier
type: NamedIndividual
is level5 segment of: Entertainment Facilities
created with: infer-bics.sql
derived from: Movie Theaters
  type: BicsLevel4SubIndustry
  type: Classifier
  type: AnachronousDerivation
  derived from: http://data.ga-group.nl/ics/bics/2014/11181013
  source accessed on: 2019-12-03T20:05:01Z
  source last accessed on: 2019-12-03T20:05:01Z
  definition: This industry subgroup includes cinema viewing facilities that project motion pictures onto a large screen.
  notation: 11181013
  valid from: 2014-08-08
  valid till: 2020-10-03
derived from: Movie Theaters
  type: BicsLevel5Segment
  type: Classifier
  type: ContemporaryDerivation
  derived from: http://data.ga-group.nl/ics/bics/2020/1111111413
  derived from: http://data.ga-group.nl/ics/bics/2024/1111111413
  source accessed on: 2023-07-03T18:11:29Z
  source last accessed on: 2024-06-05T14:42:36Z
  definition: This segment includes cinema viewing facilities that project motion pictures.
  notation: 1111111413
  valid from: 2020-10-03
source accessed on: 2023-07-03T18:11:29Z
source last accessed on: 2024-06-05T14:42:36Z
definition: This segment includes cinema viewing facilities that project motion pictures.
notation: 1111111413
valid from: 2020-10-03

Museums & Galleries
type: BicsLevel6Segment
type: Classifier
type: NamedIndividual
is level6 segment of: Perform Arts & Museums
replaces: Museums & Galleries
created with: infer-bics.sql
derived from: Museums & Galleries
  type: BicsLevel5Segment
  type: Classifier
  type: AnachronousDerivation
  derived from: http://data.ga-group.nl/ics/bics/2014/1118101410
  source accessed on: 2019-12-03T20:05:01Z
  source last accessed on: 2019-12-03T20:05:01Z
  definition: This segment includes companies that provide the facilities for displays of various artifacts primarily for educational or cultural reasons.
  notation: 1118101410
  valid from: 2014-08-08
  valid till: 2020-10-03
derived from: Museums & Galleries
  type: BicsLevel6Segment
  type: Classifier
  type: ContemporaryDerivation
  derived from: http://data.ga-group.nl/ics/bics/2020/111111141410
  derived from: http://data.ga-group.nl/ics/bics/2024/111111141410
  source accessed on: 2023-07-03T18:11:29Z
  source last accessed on: 2024-06-05T14:42:36Z
  definition: This segment includes companies that provide facilities to display educational, artistic, scientific, or cultural artifacts.
  notation: 111111141410
  valid from: 2020-10-03
source accessed on: 2023-07-03T18:11:29Z
source last accessed on: 2024-06-05T14:42:36Z
definition: This segment includes companies that provide facilities to display educational, artistic, scientific, or cultural artifacts.
notation: 111111141410
valid from: 2020-10-03

Independent Artists
type: BicsLevel7Segment
type: Classifier
type: NamedIndividual
is level7 segment of: Performing Arts
replaces: Independent Artists
created with: infer-bics.sql
derived from: Independent Artists
  type: BicsLevel6Segment
  type: Classifier
  type: AnachronousDerivation
  derived from: http://data.ga-group.nl/ics/bics/2014/111810141110
  source accessed on: 2019-12-03T20:05:01Z
  source last accessed on: 2019-12-03T20:05:01Z
  definition: This segment includes companies that provide performing arts production, such as choreography, cinematography, acting and directing.
  notation: 111810141110
  valid from: 2014-08-08
  valid till: 2020-10-03
derived from: Independent Artists
  type: BicsLevel7Segment
  type: Classifier
  type: ContemporaryDerivation
  derived from: http://data.ga-group.nl/ics/bics/2020/11111114141110
  derived from: http://data.ga-group.nl/ics/bics/2024/11111114141110
  source accessed on: 2023-07-03T18:11:29Z
  source last accessed on: 2024-06-05T14:42:36Z
  definition: This segment includes companies that provide performing arts production, such as choreography, cinematography, acting, and directing.
  notation: 11111114141110
  valid from: 2020-10-03
source accessed on: 2023-07-03T18:11:29Z
source last accessed on: 2024-06-05T14:42:36Z
definition: This segment includes companies that provide performing arts production, such as choreography, cinematography, acting, and directing.
notation: 11111114141110
valid from: 2020-10-03

Event Promoters w/ Facilities
type: BicsLevel7Segment
type: Classifier
type: NamedIndividual
is level7 segment of: Performing Arts
replaces: Event Promoters w/ Facilities
created with: infer-bics.sql
derived from: Event Promoters w/ Facilities
  type: BicsLevel6Segment
  type: Classifier
  type: AnachronousDerivation
  derived from: http://data.ga-group.nl/ics/bics/2014/111810141111
  source accessed on: 2019-12-03T20:05:01Z
  source last accessed on: 2019-12-03T20:05:01Z
  definition: This segment includes companies that produce and organize live theatrical performances and provide facilities for such performances.
  notation: 111810141111
  valid from: 2014-08-08
  valid till: 2020-10-03
derived from: Event Promoters w/ Facilities
  type: BicsLevel7Segment
  type: Classifier
  type: ContemporaryDerivation
  derived from: http://data.ga-group.nl/ics/bics/2020/11111114141111
  derived from: http://data.ga-group.nl/ics/bics/2024/11111114141111
  source accessed on: 2023-07-03T18:11:29Z
  source last accessed on: 2024-06-05T14:42:36Z
  definition: This segment includes companies that produce and promote performing arts events for their own venues.
  notation: 11111114141111
  valid from: 2020-10-03
source accessed on: 2023-07-03T18:11:29Z
source last accessed on: 2024-06-05T14:42:36Z
definition: This segment includes companies that produce and promote performing arts events for their own venues.
notation: 11111114141111
valid from: 2020-10-03

Event Promoters w/o Facilities
type: BicsLevel7Segment
type: Classifier
type: NamedIndividual
is level7 segment of: Performing Arts
replaces: Event Promoters w/o Facilities
created with: infer-bics.sql
derived from: Event Promoters w/o Facilities
  type: BicsLevel6Segment
  type: Classifier
  type: AnachronousDerivation
  derived from: http://data.ga-group.nl/ics/bics/2014/111810141112
  source accessed on: 2019-12-03T20:05:01Z
  source last accessed on: 2019-12-03T20:05:01Z
  definition: This segment includes companies that produce events, such as concerts and sports events, but do not actually provide the facilities.
  notation: 111810141112
  valid from: 2014-08-08
  valid till: 2020-10-03
derived from: Event Promoters w/o Facilities
  type: BicsLevel7Segment
  type: Classifier
  type: ContemporaryDerivation
  derived from: http://data.ga-group.nl/ics/bics/2020/11111114141112
  derived from: http://data.ga-group.nl/ics/bics/2024/11111114141112
  source accessed on: 2023-07-03T18:11:29Z
  source last accessed on: 2024-06-05T14:42:36Z
  definition: This segment includes companies that produce and promote performing arts events, but do not own venues.
  notation: 11111114141112
  valid from: 2020-10-03
source accessed on: 2023-07-03T18:11:29Z
source last accessed on: 2024-06-05T14:42:36Z
definition: This segment includes companies that produce and promote performing arts events, but do not own venues.
notation: 11111114141112
valid from: 2020-10-03

Theaters & Dinner Theaters
type: BicsLevel7Segment
type: Classifier
type: NamedIndividual
is level7 segment of: Performing Arts
replaces: Theaters & Dinner Theaters
created with: infer-bics.sql
derived from: Theaters & Dinner Theaters
  type: BicsLevel6Segment
  type: Classifier
  type: AnachronousDerivation
  derived from: http://data.ga-group.nl/ics/bics/2014/111810141113
  source accessed on: 2019-12-03T20:05:01Z
  source last accessed on: 2019-12-03T20:05:01Z
  definition: This segment includes companies that provide facilities for live theatrical performances.
  notation: 111810141113
  valid from: 2014-08-08
  valid till: 2020-10-03
derived from: Theaters & Dinner Theaters
  type: BicsLevel7Segment
  type: Classifier
  type: ContemporaryDerivation
  derived from: http://data.ga-group.nl/ics/bics/2020/11111114141113
  derived from: http://data.ga-group.nl/ics/bics/2024/11111114141113
  source accessed on: 2023-07-03T18:11:29Z
  source last accessed on: 2024-06-05T14:42:36Z
  definition: This segment includes companies that provide venues for live theatrical performances.
  notation: 11111114141113
  valid from: 2020-10-03
source accessed on: 2023-07-03T18:11:29Z
source last accessed on: 2024-06-05T14:42:36Z
definition: This segment includes companies that provide venues for live theatrical performances.
notation: 11111114141113
valid from: 2020-10-03

Performing Arts
type: BicsLevel6Segment
type: Classifier
type: NamedIndividual
is level6 segment of: Perform Arts & Museums
replaces: Performing Arts
created with: infer-bics.sql
derived from: Performing Arts
  type: BicsLevel5Segment
  type: Classifier
  type: AnachronousDerivation
  derived from: http://data.ga-group.nl/ics/bics/2014/1118101411
  source accessed on: 2019-12-03T20:05:01Z
  source last accessed on: 2019-12-03T20:05:01Z
  definition: This segment includes companies that produce live theatrical events.
  notation: 1118101411
  valid from: 2014-08-08
  valid till: 2020-10-03
derived from: Performing Arts
  type: BicsLevel6Segment
  type: Classifier
  type: ContemporaryDerivation
  derived from: http://data.ga-group.nl/ics/bics/2020/111111141411
  derived from: http://data.ga-group.nl/ics/bics/2024/111111141411
  source accessed on: 2023-07-03T18:11:29Z
  source last accessed on: 2024-06-05T14:42:36Z
  definition: This segment includes companies that produce theater, dance, or music events.
  notation: 111111141411
  valid from: 2020-10-03
source accessed on: 2023-07-03T18:11:29Z
source last accessed on: 2024-06-05T14:42:36Z
definition: This segment includes companies that produce theater, dance, or music events.
notation: 111111141411
valid from: 2020-10-03

Perform Arts & Museums
type: BicsLevel5Segment
type: Classifier
type: NamedIndividual
is level5 segment of: Entertainment Facilities
created with: infer-bics.sql
derived from: Perform Arts & Museums
  type: BicsLevel4SubIndustry
  type: Classifier
  type: AnachronousDerivation
  derived from: http://data.ga-group.nl/ics/bics/2014/11181014
  source accessed on: 2019-12-03T20:05:01Z
  source last accessed on: 2019-12-03T20:05:01Z
  definition: This industry subgroup includes companies that provide theatrical performances, such as plays, concerts, dance and opera. Also includes museums, zoos and botanical gardens.
  notation: 11181014
  valid from: 2014-08-08
  valid till: 2020-10-03
derived from: Perform Arts & Museums
  type: BicsLevel5Segment
  type: Classifier
  type: ContemporaryDerivation
  derived from: http://data.ga-group.nl/ics/bics/2020/1111111414
  derived from: http://data.ga-group.nl/ics/bics/2024/1111111414
  source accessed on: 2023-07-03T18:11:29Z
  source last accessed on: 2024-06-05T14:42:36Z
  definition: This segment includes companies that provide theatrical performances, such as plays, concerts, dance, and opera. Also includes museums, zoos, and botanical gardens.
  notation: 1111111414
  valid from: 2020-10-03
source accessed on: 2023-07-03T18:11:29Z
source last accessed on: 2024-06-05T14:42:36Z
definition: This segment includes companies that provide theatrical performances, such as plays, concerts, dance, and opera. Also includes museums, zoos, and botanical gardens.
notation: 1111111414
valid from: 2020-10-03

Broadcast Rights - Sports Teams
type: BicsLevel6Segment
type: Classifier
type: NamedIndividual
is level6 segment of: Pro Sports & Related Activities
replaces: Broadcast Rights - Sports Teams
created with: infer-bics.sql
derived from: Broadcast Rights - Sports Teams
  type: BicsLevel5Segment
  type: Classifier
  type: AnachronousDerivation
  derived from: http://data.ga-group.nl/ics/bics/2014/1118101510
  source accessed on: 2019-12-03T20:05:01Z
  source last accessed on: 2019-12-03T20:05:01Z
  definition: This segment includes companies that manage the media and broadcasting rights of sports teams.
  notation: 1118101510
  valid from: 2014-08-08
  valid till: 2020-10-03
derived from: Broadcast Rights - Sports Teams
  type: BicsLevel6Segment
  type: Classifier
  type: ContemporaryDerivation
  derived from: http://data.ga-group.nl/ics/bics/2020/111111141510
  derived from: http://data.ga-group.nl/ics/bics/2024/111111141510
  source accessed on: 2023-07-03T18:11:29Z
  source last accessed on: 2024-06-05T14:42:36Z
  definition: This segment includes companies that manage the media and broadcasting rights of sports teams.
  notation: 111111141510
  valid from: 2020-10-03
source accessed on: 2023-07-03T18:11:29Z
source last accessed on: 2024-06-05T14:42:36Z
definition: This segment includes companies that manage the media and broadcasting rights of sports teams.
notation: 111111141510
valid from: 2020-10-03

Gate Receipts
type: BicsLevel6Segment
type: Classifier
type: NamedIndividual
is level6 segment of: Pro Sports & Related Activities
replaces: Gate Receipts
created with: infer-bics.sql
derived from: Gate Receipts
  type: BicsLevel5Segment
  type: Classifier
  type: AnachronousDerivation
  derived from: http://data.ga-group.nl/ics/bics/2014/1118101511
  source accessed on: 2019-12-03T20:05:01Z
  source last accessed on: 2019-12-03T20:05:01Z
  definition: This segment includes companies that provide ticket sales for live sporting events.
  notation: 1118101511
  valid from: 2014-08-08
  valid till: 2020-10-03
derived from: Gate Receipts
  type: BicsLevel6Segment
  type: Classifier
  type: ContemporaryDerivation
  derived from: http://data.ga-group.nl/ics/bics/2020/111111141511
  derived from: http://data.ga-group.nl/ics/bics/2024/111111141511
  source accessed on: 2023-07-03T18:11:29Z
  source last accessed on: 2024-06-05T14:42:36Z
  definition: This segment includes companies that provide ticket sales for live sporting events.
  notation: 111111141511
  valid from: 2020-10-03
source accessed on: 2023-07-03T18:11:29Z
source last accessed on: 2024-06-05T14:42:36Z
definition: This segment includes companies that provide ticket sales for live sporting events.
notation: 111111141511
valid from: 2020-10-03

Sports Merchandising
type: BicsLevel6Segment
type: Classifier
type: NamedIndividual
is level6 segment of: Pro Sports & Related Activities
replaces: Sports Merchandising
created with: infer-bics.sql
derived from: Sports Merchandising
  type: BicsLevel5Segment
  type: Classifier
  type: AnachronousDerivation
  derived from: http://data.ga-group.nl/ics/bics/2014/1118101512
  source accessed on: 2019-12-03T20:05:01Z
  source last accessed on: 2019-12-03T20:05:01Z
  definition: This segment includes companies that utilize sports trademarks to sell branded merchandise.
  notation: 1118101512
  valid from: 2014-08-08
  valid till: 2020-10-03
derived from: Sports Merchandising
  type: BicsLevel6Segment
  type: Classifier
  type: ContemporaryDerivation
  derived from: http://data.ga-group.nl/ics/bics/2020/111111141512
  derived from: http://data.ga-group.nl/ics/bics/2024/111111141512
  source accessed on: 2023-07-03T18:11:29Z
  source last accessed on: 2024-06-05T14:42:36Z
  definition: This segment includes companies that utilize sports trademarks to sell branded merchandise.
  notation: 111111141512
  valid from: 2020-10-03
source accessed on: 2023-07-03T18:11:29Z
source last accessed on: 2024-06-05T14:42:36Z
definition: This segment includes companies that utilize sports trademarks to sell branded merchandise.
notation: 111111141512
valid from: 2020-10-03

Sports Teams
type: BicsLevel6Segment
type: Classifier
type: NamedIndividual
is level6 segment of: Pro Sports & Related Activities
replaces: Sports Teams
created with: infer-bics.sql
derived from: Sports Teams
  type: BicsLevel5Segment
  type: Classifier
  type: AnachronousDerivation
  derived from: http://data.ga-group.nl/ics/bics/2014/1118101513
  source accessed on: 2019-12-03T20:05:01Z
  source last accessed on: 2019-12-03T20:05:01Z
  definition: This segment includes sports clubs that participate in live sporting events, such as baseball and football.
  notation: 1118101513
  valid from: 2014-08-08
  valid till: 2020-10-03
derived from: Sports Teams
  type: BicsLevel6Segment
  type: Classifier
  type: ContemporaryDerivation
  derived from: http://data.ga-group.nl/ics/bics/2020/111111141513
  derived from: http://data.ga-group.nl/ics/bics/2024/111111141513
  source accessed on: 2023-07-03T18:11:29Z
  source last accessed on: 2024-06-05T14:42:36Z
  definition: This segment includes sports clubs that participate in live sporting events, such as baseball and football.
  notation: 111111141513
  valid from: 2020-10-03
source accessed on: 2023-07-03T18:11:29Z
source last accessed on: 2024-06-05T14:42:36Z
definition: This segment includes sports clubs that participate in live sporting events, such as baseball and football.
notation: 111111141513
valid from: 2020-10-03

Pro Sports & Related Activities
type: BicsLevel5Segment
type: Classifier
type: NamedIndividual
is level5 segment of: Entertainment Facilities
created with: infer-bics.sql
derived from: Pro Sports & Related Activities
  type: BicsLevel4SubIndustry
  type: Classifier
  type: AnachronousDerivation
  derived from: http://data.ga-group.nl/ics/bics/2014/11181015
  source accessed on: 2019-12-03T20:05:01Z
  source last accessed on: 2019-12-03T20:05:01Z
  definition: This industry subgroup includes companies that provide professional sports activities.
  notation: 11181015
  valid from: 2014-08-08
  valid till: 2020-10-03
derived from: Pro Sports & Related Activities
  type: BicsLevel5Segment
  type: Classifier
  type: ContemporaryDerivation
  derived from: http://data.ga-group.nl/ics/bics/2020/1111111415
  derived from: http://data.ga-group.nl/ics/bics/2024/1111111415
  source accessed on: 2023-07-03T18:11:29Z
  source last accessed on: 2024-06-05T14:42:36Z
  definition: This segment includes companies that are involved in the production and promotion of sporting events.
  notation: 1111111415
  valid from: 2020-10-03
source accessed on: 2023-07-03T18:11:29Z
source last accessed on: 2024-06-05T14:42:36Z
definition: This segment includes companies that are involved in the production and promotion of sporting events.
notation: 1111111415
valid from: 2020-10-03

Bowling Centers
type: BicsLevel5Segment
type: Classifier
type: NamedIndividual
is level5 segment of: Entertainment Facilities
created with: infer-bics.sql
derived from: Bowling Centers
  type: BicsLevel4SubIndustry
  type: Classifier
  type: AnachronousDerivation
  derived from: http://data.ga-group.nl/ics/bics/2014/11181210
  source accessed on: 2019-12-03T20:05:01Z
  source last accessed on: 2019-12-03T20:05:01Z
  definition: This industry subgroup includes companies that operate bowling alleys.
  notation: 11181210
  valid from: 2014-08-08
  valid till: 2020-10-03
derived from: Bowling Centers
  type: BicsLevel5Segment
  type: Classifier
  type: ContemporaryDerivation
  derived from: http://data.ga-group.nl/ics/bics/2020/1111111416
  derived from: http://data.ga-group.nl/ics/bics/2024/1111111416
  source accessed on: 2023-07-03T18:11:29Z
  source last accessed on: 2024-06-05T14:42:36Z
  definition: This segment includes companies that operate bowling alleys.
  notation: 1111111416
  valid from: 2020-10-03
source accessed on: 2023-07-03T18:11:29Z
source last accessed on: 2024-06-05T14:42:36Z
definition: This segment includes companies that operate bowling alleys.
notation: 1111111416
valid from: 2020-10-03

Fitness & Recreation Centers
type: BicsLevel5Segment
type: Classifier
type: NamedIndividual
is level5 segment of: Entertainment Facilities
created with: infer-bics.sql
derived from: Fitness & Recreation Centers
  type: BicsLevel4SubIndustry
  type: Classifier
  type: AnachronousDerivation
  derived from: http://data.ga-group.nl/ics/bics/2014/11181211
  source accessed on: 2019-12-03T20:05:01Z
  source last accessed on: 2019-12-03T20:05:01Z
  definition: This industry subgroup includes companies that operate fitness and recreation sports centers, such as athletic club facilities, health spas without accommodations, ice- or roller-skating rinks and swimming pools.
  notation: 11181211
  valid from: 2014-08-08
  valid till: 2020-10-03
derived from: Fitness & Recreation Centers
  type: BicsLevel5Segment
  type: Classifier
  type: ContemporaryDerivation
  derived from: http://data.ga-group.nl/ics/bics/2020/1111111417
  derived from: http://data.ga-group.nl/ics/bics/2024/1111111417
  source accessed on: 2023-07-03T18:11:29Z
  source last accessed on: 2024-06-05T14:42:36Z
  definition: This segment includes companies that operate fitness and recreation sports centers, such as athletic club facilities, health spas without accommodations, ice or roller skating rinks, and swimming pools.
  notation: 1111111417
  valid from: 2020-10-03
source accessed on: 2023-07-03T18:11:29Z
source last accessed on: 2024-06-05T14:42:36Z
definition: This segment includes companies that operate fitness and recreation sports centers, such as athletic club facilities, health spas without accommodations, ice or roller skating rinks, and swimming pools.
notation: 1111111417
valid from: 2020-10-03

Golf Courses & Country Clubs
type: BicsLevel5Segment
type: Classifier
type: NamedIndividual
is level5 segment of: Entertainment Facilities
created with: infer-bics.sql
derived from: Golf Courses & Country Clubs
  type: BicsLevel4SubIndustry
  type: Classifier
  type: AnachronousDerivation
  derived from: http://data.ga-group.nl/ics/bics/2014/11181212
  source accessed on: 2019-12-03T20:05:01Z
  source last accessed on: 2019-12-03T20:05:01Z
  definition: This industry subgroup includes companies that operate golf courses and country clubs.
  notation: 11181212
  valid from: 2014-08-08
  valid till: 2020-10-03
derived from: Golf Courses & Country Clubs
  type: BicsLevel5Segment
  type: Classifier
  type: ContemporaryDerivation
  derived from: http://data.ga-group.nl/ics/bics/2020/1111111418
  derived from: http://data.ga-group.nl/ics/bics/2024/1111111418
  source accessed on: 2023-07-03T18:11:29Z
  source last accessed on: 2024-06-05T14:42:36Z
  definition: This segment includes companies that operate golf courses and country clubs.
  notation: 1111111418
  valid from: 2020-10-03
source accessed on: 2023-07-03T18:11:29Z
source last accessed on: 2024-06-05T14:42:36Z
definition: This segment includes companies that operate golf courses and country clubs.
notation: 1111111418
valid from: 2020-10-03

Marinas
type: BicsLevel5Segment
type: Classifier
type: NamedIndividual
is level5 segment of: Entertainment Facilities
created with: infer-bics.sql
derived from: Marinas
  type: BicsLevel4SubIndustry
  type: Classifier
  type: AnachronousDerivation
  derived from: http://data.ga-group.nl/ics/bics/2014/11181213
  source accessed on: 2019-12-03T20:05:01Z
  source last accessed on: 2019-12-03T20:05:01Z
  definition: This industry subgroup includes facilities that support the operation of recreational water transports like boats, yachts and wave-runners.
  notation: 11181213
  valid from: 2014-08-08
  valid till: 2020-10-03
derived from: Marinas
  type: BicsLevel5Segment
  type: Classifier
  type: ContemporaryDerivation
  derived from: http://data.ga-group.nl/ics/bics/2020/1111111419
  derived from: http://data.ga-group.nl/ics/bics/2024/1111111419
  source accessed on: 2023-07-03T18:11:29Z
  source last accessed on: 2024-06-05T14:42:36Z
  definition: This segment includes docks, basins or other facilities that provide secure moorings for recreational boats and often offer supply, repair, and other boating related services.
  notation: 1111111419
  valid from: 2020-10-03
source accessed on: 2023-07-03T18:11:29Z
source last accessed on: 2024-06-05T14:42:36Z
definition: This segment includes docks, basins or other facilities that provide secure moorings for recreational boats and often offer supply, repair, and other boating related services.
notation: 1111111419
valid from: 2020-10-03

Skiing Facilities
type: BicsLevel5Segment
type: Classifier
type: NamedIndividual
is level5 segment of: Entertainment Facilities
created with: infer-bics.sql
derived from: Skiing Facilities
  type: BicsLevel4SubIndustry
  type: Classifier
  type: AnachronousDerivation
  derived from: http://data.ga-group.nl/ics/bics/2014/11181214
  source accessed on: 2019-12-03T20:05:01Z
  source last accessed on: 2019-12-03T20:05:01Z
  definition: This industry subgroup includes companies that operate ski mountain trails, lifts and ski resorts. These companies may provide lodging and dining in addition to the operation of ski trails.
  notation: 11181214
  valid from: 2014-08-08
  valid till: 2020-10-03
derived from: Skiing Facilities
  type: BicsLevel5Segment
  type: Classifier
  type: ContemporaryDerivation
  derived from: http://data.ga-group.nl/ics/bics/2020/1111111420
  derived from: http://data.ga-group.nl/ics/bics/2024/1111111420
  source accessed on: 2023-07-03T18:11:29Z
  source last accessed on: 2024-06-05T14:42:36Z
  definition: This segment includes companies that operate ski mountain trails, lifts, and ski resorts. These companies may provide lodging and dining in addition to the operation of ski trails.
  notation: 1111111420
  valid from: 2020-10-03
source accessed on: 2023-07-03T18:11:29Z
source last accessed on: 2024-06-05T14:42:36Z
definition: This segment includes companies that operate ski mountain trails, lifts, and ski resorts. These companies may provide lodging and dining in addition to the operation of ski trails.
notation: 1111111420
valid from: 2020-10-03

Entertainment Facilities
type: BicsLevel4SubIndustry
type: Classifier
type: NamedIndividual
replaces: Entertainment Facilities
created with: infer-bics.sql
derived from: Auto Safety Equipment
  type: BicsLevel4SubIndustry
  type: Classifier
  type: ContemporaryDerivation
  derived from: http://data.ga-group.nl/ics/bics/2014/11111114
  source accessed on: 2019-12-03T20:05:01Z
  source last accessed on: 2019-12-03T20:05:01Z
  definition: This industry subgroup includes companies that manufacture automotive safety equipment. Products include airbags and seatbelts.
  notation: 11111114
  valid from: 2014-08-08
  valid till: 2020-10-03
derived from: Entertainment Facilities
  type: BicsLevel3Industry
  type: Classifier
  type: AnachronousDerivation
  derived from: http://data.ga-group.nl/ics/bics/2014/111810
  source accessed on: 2019-12-03T20:05:01Z
  source last accessed on: 2019-12-03T20:05:01Z
  definition: This industry includes companies that operate various types of entertainment facilities, such as movie theaters, amusement parks, sports stadiums and arenas, and adult nightclubs.
  notation: 111810
  valid from: 2014-08-08
  valid till: 2020-10-03
derived from: Entertainment Facilities
  type: BicsLevel4SubIndustry
  type: Classifier
  type: ContemporaryDerivation
  derived from: http://data.ga-group.nl/ics/bics/2020/11111114
  derived from: http://data.ga-group.nl/ics/bics/2024/11111114
  source accessed on: 2023-07-03T18:11:29Z
  source last accessed on: 2024-06-05T14:42:36Z
  definition: This industry subgroup includes companies that operate various types of entertainment and recreational facilities.
  notation: 11111114
  valid from: 2020-10-03
source accessed on: 2019-12-03T20:05:01Z
source last accessed on: 2024-06-05T14:42:36Z
definition: This industry subgroup includes companies that operate various types of entertainment and recreational facilities.
notation: 11111114
valid from: 2014-08-08

Tour Operators
type: BicsLevel5Segment
type: Classifier
type: NamedIndividual
is level5 segment of: Travel Services
replaces: Tour Operators
created with: infer-bics.sql
derived from: Tour Operators
  type: BicsLevel5Segment
  type: Classifier
  type: AnachronousDerivation
  derived from: http://data.ga-group.nl/ics/bics/2014/1118111210
  source accessed on: 2019-12-03T20:05:01Z
  source last accessed on: 2019-12-03T20:05:01Z
  definition: This segment includes companies that arrange and operate tours.
  notation: 1118111210
  valid from: 2014-08-08
  valid till: 2020-10-03
derived from: Tour Operators
  type: BicsLevel5Segment
  type: Classifier
  type: ContemporaryDerivation
  derived from: http://data.ga-group.nl/ics/bics/2020/1111111510
  derived from: http://data.ga-group.nl/ics/bics/2024/1111111510
  source accessed on: 2023-07-03T18:11:29Z
  source last accessed on: 2024-06-05T14:42:36Z
  definition: This segment includes companies that arrange and operate tours.
  notation: 1111111510
  valid from: 2020-10-03
source accessed on: 2023-07-03T18:11:29Z
source last accessed on: 2024-06-05T14:42:36Z
definition: This segment includes companies that arrange and operate tours.
notation: 1111111510
valid from: 2020-10-03

Travel Agencies
type: BicsLevel5Segment
type: Classifier
type: NamedIndividual
is level5 segment of: Travel Services
replaces: Travel Agencies
created with: infer-bics.sql
derived from: Travel Agencies
  type: BicsLevel5Segment
  type: Classifier
  type: AnachronousDerivation
  derived from: http://data.ga-group.nl/ics/bics/2014/1118111211
  source accessed on: 2019-12-03T20:05:01Z
  source last accessed on: 2019-12-03T20:05:01Z
  definition: This segment includes companies that act as agents in the sale of travel and tour packages.
  notation: 1118111211
  valid from: 2014-08-08
  valid till: 2020-10-03
derived from: Travel Agencies
  type: BicsLevel5Segment
  type: Classifier
  type: ContemporaryDerivation
  derived from: http://data.ga-group.nl/ics/bics/2020/1111111511
  derived from: http://data.ga-group.nl/ics/bics/2024/1111111511
  source accessed on: 2023-07-03T18:11:29Z
  source last accessed on: 2024-06-05T14:42:36Z
  definition: This segment includes companies that act as agents in the sale of travel and tour packages.
  notation: 1111111511
  valid from: 2020-10-03
source accessed on: 2023-07-03T18:11:29Z
source last accessed on: 2024-06-05T14:42:36Z
definition: This segment includes companies that act as agents in the sale of travel and tour packages.
notation: 1111111511
valid from: 2020-10-03

Travel Reservation Services
type: BicsLevel5Segment
type: Classifier
type: NamedIndividual
is level5 segment of: Travel Services
replaces: Travel Reservation Services
created with: infer-bics.sql
derived from: Travel Reservation Services
  type: BicsLevel5Segment
  type: Classifier
  type: AnachronousDerivation
  derived from: http://data.ga-group.nl/ics/bics/2014/1118111212
  source accessed on: 2019-12-03T20:05:01Z
  source last accessed on: 2019-12-03T20:05:01Z
  definition: This segment includes companies that arrange travel reservation services. It also includes companies that provide time-share exchange services.
  notation: 1118111212
  valid from: 2014-08-08
  valid till: 2020-10-03
derived from: Travel Reservation Services
  type: BicsLevel5Segment
  type: Classifier
  type: ContemporaryDerivation
  derived from: http://data.ga-group.nl/ics/bics/2020/1111111512
  derived from: http://data.ga-group.nl/ics/bics/2024/1111111512
  source accessed on: 2023-07-03T18:11:29Z
  source last accessed on: 2024-06-05T14:42:36Z
  definition: This segment includes companies that arrange travel reservation services and companies that provide time-share exchange services.
  notation: 1111111512
  valid from: 2020-10-03
source accessed on: 2023-07-03T18:11:29Z
source last accessed on: 2024-06-05T14:42:36Z
definition: This segment includes companies that arrange travel reservation services and companies that provide time-share exchange services.
notation: 1111111512
valid from: 2020-10-03

Travel Services
type: BicsLevel4SubIndustry
type: Classifier
type: NamedIndividual
created with: infer-bics.sql
derived from: Automotive Engineering & Tech
  type: BicsLevel4SubIndustry
  type: Classifier
  type: ContemporaryDerivation
  derived from: http://data.ga-group.nl/ics/bics/2014/11111115
  source accessed on: 2019-12-03T20:05:01Z
  source last accessed on: 2019-12-03T20:05:01Z
  definition: This industry subgroup includes companies that develop, license or sell technology applied in the automobile industry but are not involved in the manufacturing process.
  notation: 11111115
  valid from: 2014-08-08
  valid till: 2020-10-03
derived from: Travel Services
  type: BicsLevel4SubIndustry
  type: Classifier
  type: AnachronousDerivation
  derived from: http://data.ga-group.nl/ics/bics/2014/11181112
  source accessed on: 2019-12-03T20:05:01Z
  source last accessed on: 2019-12-03T20:05:01Z
  definition: This industry subgroup includes companies that provide travel arrangement and/or tour operating services.
  notation: 11181112
  valid from: 2014-08-08
  valid till: 2020-10-03
derived from: Travel Services
  type: BicsLevel4SubIndustry
  type: Classifier
  type: ContemporaryDerivation
  derived from: http://data.ga-group.nl/ics/bics/2020/11111115
  derived from: http://data.ga-group.nl/ics/bics/2024/11111115
  source accessed on: 2023-07-03T18:11:29Z
  source last accessed on: 2024-06-05T14:42:36Z
  definition: This industry subgroup includes companies that provide travel arrangement and/or tour operating services.
  notation: 11111115
  valid from: 2020-10-03
source accessed on: 2019-12-03T20:05:01Z
source last accessed on: 2024-06-05T14:42:36Z
definition: This industry subgroup includes companies that provide travel arrangement and/or tour operating services.
notation: 11111115
valid from: 2014-08-08

Body & Chassis
type: BicsLevel4SubIndustry
type: Classifier
type: NamedIndividual
created with: infer-bics.sql
derived from: Body & Chassis
  type: BicsLevel4SubIndustry
  type: Classifier
  type: ContemporaryDerivation
  derived from: http://data.ga-group.nl/ics/bics/2014/11111116
  source accessed on: 2019-12-03T20:05:01Z
  source last accessed on: 2019-12-03T20:05:01Z
  definition: This industry subgroup includes companies that manufacture body and chassis structures, such as frames, roll cages, and joints.
  notation: 11111116
  valid from: 2014-08-08
  valid till: 2020-10-03
source accessed on: 2019-12-03T20:05:01Z
source last accessed on: 2019-12-03T20:05:01Z
definition: This industry subgroup includes companies that manufacture body and chassis structures, such as frames, roll cages, and joints.
notation: 11111116
valid from: 2014-08-08
valid till: 2020-10-03

Brake Systems
type: BicsLevel4SubIndustry
type: Classifier
type: NamedIndividual
created with: infer-bics.sql
derived from: Brake Systems
  type: BicsLevel4SubIndustry
  type: Classifier
  type: ContemporaryDerivation
  derived from: http://data.ga-group.nl/ics/bics/2014/11111117
  source accessed on: 2019-12-03T20:05:01Z
  source last accessed on: 2019-12-03T20:05:01Z
  definition: This industry subgroup includes companies that manufacture automobile braking systems and related components.
  notation: 11111117
  valid from: 2014-08-08
  valid till: 2020-10-03
source accessed on: 2019-12-03T20:05:01Z
source last accessed on: 2019-12-03T20:05:01Z
definition: This industry subgroup includes companies that manufacture automobile braking systems and related components.
notation: 11111117
valid from: 2014-08-08
valid till: 2020-10-03

Drivetrain Components
type: BicsLevel4SubIndustry
type: Classifier
type: NamedIndividual
created with: infer-bics.sql
derived from: Drivetrain Components
  type: BicsLevel4SubIndustry
  type: Classifier
  type: ContemporaryDerivation
  derived from: http://data.ga-group.nl/ics/bics/2014/11111118
  source accessed on: 2019-12-03T20:05:01Z
  source last accessed on: 2019-12-03T20:05:01Z
  definition: This industry subgroup includes companies that manufacture automobile transmission and powertrain parts.
  notation: 11111118
  valid from: 2014-08-08
  valid till: 2020-10-03
source accessed on: 2019-12-03T20:05:01Z
source last accessed on: 2019-12-03T20:05:01Z
definition: This industry subgroup includes companies that manufacture automobile transmission and powertrain parts.
notation: 11111118
valid from: 2014-08-08
valid till: 2020-10-03

Diesel Engines & Engine Parts
type: BicsLevel5Segment
type: Classifier
type: NamedIndividual
is level5 segment of: Engines & Parts
is replaced by: Diesel Engines & Engine Parts
created with: infer-bics.sql
derived from: Diesel Engines & Engine Parts
  type: BicsLevel5Segment
  type: Classifier
  type: ContemporaryDerivation
  derived from: http://data.ga-group.nl/ics/bics/2014/1111111910
  source accessed on: 2019-12-03T20:05:01Z
  source last accessed on: 2019-12-03T20:05:01Z
  definition: This segment includes companies that manufacture diesel engines and engine parts for automobiles.
  notation: 1111111910
  valid from: 2014-08-08
  valid till: 2020-10-03
source accessed on: 2019-12-03T20:05:01Z
source last accessed on: 2019-12-03T20:05:01Z
definition: This segment includes companies that manufacture diesel engines and engine parts for automobiles.
notation: 1111111910
valid from: 2014-08-08
valid till: 2020-10-03

Gasoline Engines & Eng Parts
type: BicsLevel5Segment
type: Classifier
type: NamedIndividual
is level5 segment of: Engines & Parts
is replaced by: Gasoline Engines & Eng Parts
created with: infer-bics.sql
derived from: Gasoline Engines & Eng Parts
  type: BicsLevel5Segment
  type: Classifier
  type: ContemporaryDerivation
  derived from: http://data.ga-group.nl/ics/bics/2014/1111111911
  source accessed on: 2019-12-03T20:05:01Z
  source last accessed on: 2019-12-03T20:05:01Z
  definition: This segment includes companies that manufacture gasoline engines and engine parts for automobiles.
  notation: 1111111911
  valid from: 2014-08-08
  valid till: 2020-10-03
source accessed on: 2019-12-03T20:05:01Z
source last accessed on: 2019-12-03T20:05:01Z
definition: This segment includes companies that manufacture gasoline engines and engine parts for automobiles.
notation: 1111111911
valid from: 2014-08-08
valid till: 2020-10-03

Engines & Parts
type: BicsLevel4SubIndustry
type: Classifier
type: NamedIndividual
created with: infer-bics.sql
derived from: Engines & Parts
  type: BicsLevel4SubIndustry
  type: Classifier
  type: ContemporaryDerivation
  derived from: http://data.ga-group.nl/ics/bics/2014/11111119
  source accessed on: 2019-12-03T20:05:01Z
  source last accessed on: 2019-12-03T20:05:01Z
  definition: This industry subgroup includes companies that manufacture automobile engines and engine parts. Products include gasoline and diesel engines and engine parts.
  notation: 11111119
  valid from: 2014-08-08
  valid till: 2020-10-03
source accessed on: 2019-12-03T20:05:01Z
source last accessed on: 2019-12-03T20:05:01Z
definition: This industry subgroup includes companies that manufacture automobile engines and engine parts. Products include gasoline and diesel engines and engine parts.
notation: 11111119
valid from: 2014-08-08
valid till: 2020-10-03

Exhausts & Emissions
type: BicsLevel4SubIndustry
type: Classifier
type: NamedIndividual
created with: infer-bics.sql
derived from: Exhausts & Emissions
  type: BicsLevel4SubIndustry
  type: Classifier
  type: ContemporaryDerivation
  derived from: http://data.ga-group.nl/ics/bics/2014/11111120
  source accessed on: 2019-12-03T20:05:01Z
  source last accessed on: 2019-12-03T20:05:01Z
  definition: This industry subgroup includes companies that manufacture exhaust and emissions systems. Products include exhaust manifolds, exhaust pipes and catalytic converters.
  notation: 11111120
  valid from: 2014-08-08
  valid till: 2020-10-03
source accessed on: 2019-12-03T20:05:01Z
source last accessed on: 2019-12-03T20:05:01Z
definition: This industry subgroup includes companies that manufacture exhaust and emissions systems. Products include exhaust manifolds, exhaust pipes and catalytic converters.
notation: 11111120
valid from: 2014-08-08
valid till: 2020-10-03

Auto HVAC Systems
type: BicsLevel4SubIndustry
type: Classifier
type: NamedIndividual
created with: infer-bics.sql
derived from: Auto HVAC Systems
  type: BicsLevel4SubIndustry
  type: Classifier
  type: ContemporaryDerivation
  derived from: http://data.ga-group.nl/ics/bics/2014/11111121
  source accessed on: 2019-12-03T20:05:01Z
  source last accessed on: 2019-12-03T20:05:01Z
  definition: This industry subgroup includes companies that manufacture heating, ventilation and air conditioning (HVAC) systems and their components.
  notation: 11111121
  valid from: 2014-08-08
  valid till: 2020-10-03
source accessed on: 2019-12-03T20:05:01Z
source last accessed on: 2019-12-03T20:05:01Z
definition: This industry subgroup includes companies that manufacture heating, ventilation and air conditioning (HVAC) systems and their components.
notation: 11111121
valid from: 2014-08-08
valid till: 2020-10-03

Seating & Trim
type: BicsLevel4SubIndustry
type: Classifier
type: NamedIndividual
created with: infer-bics.sql
derived from: Seating & Trim
  type: BicsLevel4SubIndustry
  type: Classifier
  type: ContemporaryDerivation
  derived from: http://data.ga-group.nl/ics/bics/2014/11111122
  source accessed on: 2019-12-03T20:05:01Z
  source last accessed on: 2019-12-03T20:05:01Z
  definition: This industry subgroup includes companies that manufacture automobile seating equipment and interiors trims. Products include seats, panels, headliners and textiles.
  notation: 11111122
  valid from: 2014-08-08
  valid till: 2020-10-03
source accessed on: 2019-12-03T20:05:01Z
source last accessed on: 2019-12-03T20:05:01Z
definition: This industry subgroup includes companies that manufacture automobile seating equipment and interiors trims. Products include seats, panels, headliners and textiles.
notation: 11111122
valid from: 2014-08-08
valid till: 2020-10-03

Steering & Suspension
type: BicsLevel4SubIndustry
type: Classifier
type: NamedIndividual
created with: infer-bics.sql
derived from: Steering & Suspension
  type: BicsLevel4SubIndustry
  type: Classifier
  type: ContemporaryDerivation
  derived from: http://data.ga-group.nl/ics/bics/2014/11111123
  source accessed on: 2019-12-03T20:05:01Z
  source last accessed on: 2019-12-03T20:05:01Z
  definition: This industry subgroup includes companies that manufacture steering, suspension parts, and shock absorbers, excluding springs.
  notation: 11111123
  valid from: 2014-08-08
  valid till: 2020-10-03
source accessed on: 2019-12-03T20:05:01Z
source last accessed on: 2019-12-03T20:05:01Z
definition: This industry subgroup includes companies that manufacture steering, suspension parts, and shock absorbers, excluding springs.
notation: 11111123
valid from: 2014-08-08
valid till: 2020-10-03

Tire
type: BicsLevel4SubIndustry
type: Classifier
type: NamedIndividual
created with: infer-bics.sql
derived from: Tire
  type: BicsLevel4SubIndustry
  type: Classifier
  type: ContemporaryDerivation
  derived from: http://data.ga-group.nl/ics/bics/2014/11111124
  source accessed on: 2019-12-03T20:05:01Z
  source last accessed on: 2019-12-03T20:05:01Z
  definition: This industry subgroup includes companies that manufacture tires and inner tubes from natural and synthetic rubber.
  notation: 11111124
  valid from: 2014-08-08
  valid till: 2020-10-03
source accessed on: 2019-12-03T20:05:01Z
source last accessed on: 2019-12-03T20:05:01Z
definition: This industry subgroup includes companies that manufacture tires and inner tubes from natural and synthetic rubber.
notation: 11111124
valid from: 2014-08-08
valid till: 2020-10-03

Vehicle Batteries
type: BicsLevel4SubIndustry
type: Classifier
type: NamedIndividual
created with: infer-bics.sql
derived from: Vehicle Batteries
  type: BicsLevel4SubIndustry
  type: Classifier
  type: ContemporaryDerivation
  derived from: http://data.ga-group.nl/ics/bics/2014/11111125
  source accessed on: 2019-12-03T20:05:01Z
  source last accessed on: 2019-12-03T20:05:01Z
  definition: This industry subgroup includes companies that manufacture batteries to power automobiles.
  notation: 11111125
  valid from: 2014-08-08
  valid till: 2020-10-03
source accessed on: 2019-12-03T20:05:01Z
source last accessed on: 2019-12-03T20:05:01Z
definition: This industry subgroup includes companies that manufacture batteries to power automobiles.
notation: 11111125
valid from: 2014-08-08
valid till: 2020-10-03

Vehicle Wheels
type: BicsLevel4SubIndustry
type: Classifier
type: NamedIndividual
created with: infer-bics.sql
derived from: Vehicle Wheels
  type: BicsLevel4SubIndustry
  type: Classifier
  type: ContemporaryDerivation
  derived from: http://data.ga-group.nl/ics/bics/2014/11111126
  source accessed on: 2019-12-03T20:05:01Z
  source last accessed on: 2019-12-03T20:05:01Z
  definition: This industry subgroup includes companies that manufacture automobile wheels and rims. Products include steel, aluminum and alloy wheels.
  notation: 11111126
  valid from: 2014-08-08
  valid till: 2020-10-03
source accessed on: 2019-12-03T20:05:01Z
source last accessed on: 2019-12-03T20:05:01Z
definition: This industry subgroup includes companies that manufacture automobile wheels and rims. Products include steel, aluminum and alloy wheels.
notation: 11111126
valid from: 2014-08-08
valid till: 2020-10-03

Other Motor Vehicle Parts
type: BicsLevel4SubIndustry
type: Classifier
type: NamedIndividual
created with: infer-bics.sql
derived from: Other Motor Vehicle Parts
  type: BicsLevel4SubIndustry
  type: Classifier
  type: ContemporaryDerivation
  derived from: http://data.ga-group.nl/ics/bics/2014/11111127
  source accessed on: 2019-12-03T20:05:01Z
  source last accessed on: 2019-12-03T20:05:01Z
  definition: This industry subgroup includes companies that manufacture other motor vehicle parts not elsewhere classified.
  notation: 11111127
  valid from: 2014-08-08
  valid till: 2020-10-03
source accessed on: 2019-12-03T20:05:01Z
source last accessed on: 2019-12-03T20:05:01Z
definition: This industry subgroup includes companies that manufacture other motor vehicle parts not elsewhere classified.
notation: 11111127
valid from: 2014-08-08
valid till: 2020-10-03

Leisure Facilities & Services
type: BicsLevel3Industry
type: Classifier
type: NamedIndividual
is industry of: Consumer Discretionary Services
is replaced by: Auto Parts
replaces: Gaming, Lodging & Restaurants
created with: infer-bics.sql
derived from: Auto Parts
  type: BicsLevel3Industry
  type: Classifier
  type: ContemporaryDerivation
  derived from: http://data.ga-group.nl/ics/bics/2014/111111
  source accessed on: 2019-12-03T20:05:01Z
  source last accessed on: 2019-12-03T20:05:01Z
  definition: This industry includes companies that manufacture various types of automotive parts. Excludes companies that manufactures parts for commercial vehicles (see Commercial Vehicles) and motorcycles (see Motorbikes & Parts).
  notation: 111111
  valid from: 2014-08-08
  valid till: 2020-10-03
derived from: Gaming, Lodging & Restaurants
  type: BicsLevel2IndustryGroup
  type: Classifier
  type: AnachronousDerivation
  derived from: http://data.ga-group.nl/ics/bics/2014/1116
  source accessed on: 2019-12-03T20:05:01Z
  source last accessed on: 2019-12-03T20:05:01Z
  definition: This industry group includes companies that operate establishments in casinos and gambling, cruises lines, lodging, passenger transportation and restaurants.
  notation: 1116
  valid from: 2014-08-08
  valid till: 2020-10-03
derived from: Leisure Facilities & Services
  type: BicsLevel3Industry
  type: Classifier
  type: ContemporaryDerivation
  derived from: http://data.ga-group.nl/ics/bics/2020/111111
  derived from: http://data.ga-group.nl/ics/bics/2024/111111
  source accessed on: 2023-07-03T18:11:29Z
  source last accessed on: 2024-06-05T14:42:36Z
  definition: This industry includes companies that operate casinos and gambling establishments, cruise lines, lodging, passenger transportation, and restaurants.
  notation: 111111
  valid from: 2020-10-03
source accessed on: 2019-12-03T20:05:01Z
source last accessed on: 2024-06-05T14:42:36Z
definition: This industry includes companies that operate casinos and gambling establishments, cruise lines, lodging, passenger transportation, and restaurants.
notation: 111111
valid from: 2014-08-08

Consumer Discretionary Services
type: BicsLevel2IndustryGroup
type: Classifier
type: NamedIndividual
is industry group of: Consumer Discretionary
is replaced by: Automotive
created with: infer-bics.sql
derived from: Automotive
  type: BicsLevel2IndustryGroup
  type: Classifier
  type: ContemporaryDerivation
  derived from: http://data.ga-group.nl/ics/bics/2014/1111
  source accessed on: 2019-12-03T20:05:01Z
  source last accessed on: 2019-12-03T20:05:01Z
  definition: This industry group includes companies that manufacture automobiles or automobile parts.
  notation: 1111
  valid from: 2014-08-08
  valid till: 2020-10-03
derived from: Consumer Discretionary Services
  type: BicsLevel2IndustryGroup
  type: Classifier
  type: ContemporaryDerivation
  derived from: http://data.ga-group.nl/ics/bics/2020/1111
  derived from: http://data.ga-group.nl/ics/bics/2024/1111
  source accessed on: 2023-07-03T18:11:29Z
  source last accessed on: 2024-06-05T14:42:36Z
  definition: This industry group includes companies that provide services to household consumers.
  notation: 1111
  valid from: 2020-10-03
source accessed on: 2019-12-03T20:05:01Z
source last accessed on: 2024-06-05T14:42:36Z
definition: This industry group includes companies that provide services to household consumers.
notation: 1111
valid from: 2014-08-08

Clothing & Accessories Whslrs
type: BicsLevel5Segment
type: Classifier
type: NamedIndividual
is level5 segment of: Apparel & Footwear Whslrs
created with: infer-bics.sql
derived from: Clothing & Accessories Whslrs
  type: BicsLevel4SubIndustry
  type: Classifier
  type: AnachronousDerivation
  derived from: http://data.ga-group.nl/ics/bics/2014/11191010
  source accessed on: 2019-12-03T20:05:01Z
  source last accessed on: 2019-12-03T20:05:01Z
  definition: This industry subgroup includes companies that wholesale and distribute men's, women's, children's and infants' clothing.
  notation: 11191010
  valid from: 2014-08-08
  valid till: 2020-10-03
derived from: Clothing & Accessories Whslrs
  type: BicsLevel5Segment
  type: Classifier
  type: ContemporaryDerivation
  derived from: http://data.ga-group.nl/ics/bics/2020/1112101010
  derived from: http://data.ga-group.nl/ics/bics/2024/1112101010
  source accessed on: 2023-07-03T18:11:29Z
  source last accessed on: 2024-06-05T14:42:36Z
  definition: This segment includes companies that wholesale and distribute men's, women's, children's, and infants' clothing and accessories.
  notation: 1112101010
  valid from: 2020-10-03
source accessed on: 2023-07-03T18:11:29Z
source last accessed on: 2024-06-05T14:42:36Z
definition: This segment includes companies that wholesale and distribute men's, women's, children's, and infants' clothing and accessories.
notation: 1112101010
valid from: 2020-10-03

Footwear Wholesalers
type: BicsLevel5Segment
type: Classifier
type: NamedIndividual
is level5 segment of: Apparel & Footwear Whslrs
created with: infer-bics.sql
derived from: Footwear Wholesalers
  type: BicsLevel4SubIndustry
  type: Classifier
  type: AnachronousDerivation
  derived from: http://data.ga-group.nl/ics/bics/2014/11191011
  source accessed on: 2019-12-03T20:05:01Z
  source last accessed on: 2019-12-03T20:05:01Z
  definition: This industry subgroup includes companies that wholesale and distribute leather, rubber and composite material footwear.
  notation: 11191011
  valid from: 2014-08-08
  valid till: 2020-10-03
derived from: Footwear Wholesalers
  type: BicsLevel5Segment
  type: Classifier
  type: ContemporaryDerivation
  derived from: http://data.ga-group.nl/ics/bics/2020/1112101011
  derived from: http://data.ga-group.nl/ics/bics/2024/1112101011
  source accessed on: 2023-07-03T18:11:29Z
  source last accessed on: 2024-06-05T14:42:36Z
  definition: This segment includes companies that wholesale and distribute athletic and non-athletic footwear.
  notation: 1112101011
  valid from: 2020-10-03
source accessed on: 2023-07-03T18:11:29Z
source last accessed on: 2024-06-05T14:42:36Z
definition: This segment includes companies that wholesale and distribute athletic and non-athletic footwear.
notation: 1112101011
valid from: 2020-10-03

Jewelry & Watch Wholesalers
type: BicsLevel5Segment
type: Classifier
type: NamedIndividual
is level5 segment of: Apparel & Footwear Whslrs
created with: infer-bics.sql
derived from: Jewelry Wholesalers
  type: BicsLevel4SubIndustry
  type: Classifier
  type: AnachronousDerivation
  derived from: http://data.ga-group.nl/ics/bics/2014/11191414
  source accessed on: 2019-12-03T20:05:01Z
  source last accessed on: 2019-12-03T20:05:01Z
  definition: This industry subgroup includes companies that wholesale and distribute jewelry, watches, precious stones and precious metal goods. Products include clocks, diamonds, pearls and silverware.
  notation: 11191414
  valid from: 2014-08-08
  valid till: 2020-10-03
derived from: Jewelry & Watch Wholesalers
  type: BicsLevel5Segment
  type: Classifier
  type: ContemporaryDerivation
  derived from: http://data.ga-group.nl/ics/bics/2020/1112101012
  derived from: http://data.ga-group.nl/ics/bics/2024/1112101012
  source accessed on: 2023-07-03T18:11:29Z
  source last accessed on: 2024-06-05T14:42:36Z
  definition: This segment includes companies that wholesale and distribute jewelry, watches, precious stones, and precious metal goods.
  notation: 1112101012
  valid from: 2020-10-03
source accessed on: 2023-07-03T18:11:29Z
source last accessed on: 2024-06-05T14:42:36Z
definition: This segment includes companies that wholesale and distribute jewelry, watches, precious stones, and precious metal goods.
notation: 1112101012
valid from: 2020-10-03

Apparel & Footwear Whslrs
type: BicsLevel4SubIndustry
type: Classifier
type: NamedIndividual
replaces: Apparel & Footwear Whslrs
created with: infer-bics.sql
derived from: Single Family Home Const
  type: BicsLevel4SubIndustry
  type: Classifier
  type: ContemporaryDerivation
  derived from: http://data.ga-group.nl/ics/bics/2014/11121010
  source accessed on: 2019-12-03T20:05:01Z
  source last accessed on: 2019-12-03T20:05:01Z
  definition: This industry subgroup includes companies that build and sell single family homes.
  notation: 11121010
  valid from: 2014-08-08
  valid till: 2020-10-03
derived from: Apparel & Footwear Whslrs
  type: BicsLevel3Industry
  type: Classifier
  type: AnachronousDerivation
  derived from: http://data.ga-group.nl/ics/bics/2014/111910
  source accessed on: 2019-12-03T20:05:01Z
  source last accessed on: 2019-12-03T20:05:01Z
  definition: This industry includes companies that wholesale fashion apparel, sports clothing, outerwear, gloves, ties, belts and footwear, including fashion footwear and athletic footwear.
  notation: 111910
  valid from: 2014-08-08
  valid till: 2020-10-03
derived from: Apparel & Footwear Whslrs
  type: BicsLevel4SubIndustry
  type: Classifier
  type: ContemporaryDerivation
  derived from: http://data.ga-group.nl/ics/bics/2020/11121010
  derived from: http://data.ga-group.nl/ics/bics/2024/11121010
  source accessed on: 2023-07-03T18:11:29Z
  source last accessed on: 2024-06-05T14:42:36Z
  definition: This industry subgroup includes companies that wholesale and distribute fashion apparel, sports clothing, outerwear, and footwear.
  notation: 11121010
  valid from: 2020-10-03
source accessed on: 2019-12-03T20:05:01Z
source last accessed on: 2024-06-05T14:42:36Z
definition: This industry subgroup includes companies that wholesale and distribute fashion apparel, sports clothing, outerwear, and footwear.
notation: 11121010
valid from: 2014-08-08

Automobiles Wholesalers
type: BicsLevel5Segment
type: Classifier
type: NamedIndividual
is level5 segment of: Automotive Wholesalers
created with: infer-bics.sql
derived from: Auto & Motor Vehicles Whslrs
  type: BicsLevel4SubIndustry
  type: Classifier
  type: AnachronousDerivation
  derived from: http://data.ga-group.nl/ics/bics/2014/11191110
  source accessed on: 2019-12-03T20:05:01Z
  source last accessed on: 2019-12-03T20:05:01Z
  definition: This industry subgroup includes companies that wholesale and distribute new and used passenger automobiles, trucks, trailers and other motor vehicles, such as motorcycles, motor homes and snowmobiles.
  notation: 11191110
  valid from: 2014-08-08
  valid till: 2020-10-03
derived from: Automobiles Wholesalers
  type: BicsLevel5Segment
  type: Classifier
  type: ContemporaryDerivation
  derived from: http://data.ga-group.nl/ics/bics/2020/1112101110
  derived from: http://data.ga-group.nl/ics/bics/2024/1112101110
  source accessed on: 2023-07-03T18:11:29Z
  source last accessed on: 2024-06-05T14:42:36Z
  definition: This segment includes companies that wholesale and distribute new and used passenger automobiles, trucks, trailers, and other motor vehicles, such as motorcycles, motorhomes, and snowmobiles. Also includes car auctions primarily for automotive retailers.
  notation: 1112101110
  valid from: 2020-10-03
source accessed on: 2023-07-03T18:11:29Z
source last accessed on: 2024-06-05T14:42:36Z
definition: This segment includes companies that wholesale and distribute new and used passenger automobiles, trucks, trailers, and other motor vehicles, such as motorcycles, motorhomes, and snowmobiles. Also includes car auctions primarily for automotive retailers.
notation: 1112101110
valid from: 2020-10-03

Automotive Supplies Whslrs
type: BicsLevel5Segment
type: Classifier
type: NamedIndividual
is level5 segment of: Automotive Wholesalers
created with: infer-bics.sql
derived from: Motor Vehicle Supplies Whslrs
  type: BicsLevel4SubIndustry
  type: Classifier
  type: AnachronousDerivation
  derived from: http://data.ga-group.nl/ics/bics/2014/11191112
  source accessed on: 2019-12-03T20:05:01Z
  source last accessed on: 2019-12-03T20:05:01Z
  definition: This industry subgroup includes companies that wholesale and distribute new motor vehicle parts, accessories, tools and equipment.
  notation: 11191112
  valid from: 2014-08-08
  valid till: 2020-10-03
derived from: Automotive Supplies Whslrs
  type: BicsLevel5Segment
  type: Classifier
  type: ContemporaryDerivation
  derived from: http://data.ga-group.nl/ics/bics/2020/1112101111
  derived from: http://data.ga-group.nl/ics/bics/2024/1112101111
  source accessed on: 2023-07-03T18:11:29Z
  source last accessed on: 2024-06-05T14:42:36Z
  definition: This segment includes companies that wholesale and distribute motor vehicle parts, accessories, tools, and equipment.
  notation: 1112101111
  valid from: 2020-10-03
source accessed on: 2023-07-03T18:11:29Z
source last accessed on: 2024-06-05T14:42:36Z
definition: This segment includes companies that wholesale and distribute motor vehicle parts, accessories, tools, and equipment.
notation: 1112101111
valid from: 2020-10-03

Tire Wholesalers
type: BicsLevel5Segment
type: Classifier
type: NamedIndividual
is level5 segment of: Automotive Wholesalers
created with: infer-bics.sql
derived from: Tire Wholesalers
  type: BicsLevel4SubIndustry
  type: Classifier
  type: AnachronousDerivation
  derived from: http://data.ga-group.nl/ics/bics/2014/11191113
  source accessed on: 2019-12-03T20:05:01Z
  source last accessed on: 2019-12-03T20:05:01Z
  definition: This industry subgroup includes companies that wholesale and distribute automotive tire products.
  notation: 11191113
  valid from: 2014-08-08
  valid till: 2020-10-03
derived from: Tire Wholesalers
  type: BicsLevel5Segment
  type: Classifier
  type: ContemporaryDerivation
  derived from: http://data.ga-group.nl/ics/bics/2020/1112101112
  derived from: http://data.ga-group.nl/ics/bics/2024/1112101112
  source accessed on: 2023-07-03T18:11:29Z
  source last accessed on: 2024-06-05T14:42:36Z
  definition: This segment includes companies that wholesale and distribute automotive tire products.
  notation: 1112101112
  valid from: 2020-10-03
source accessed on: 2023-07-03T18:11:29Z
source last accessed on: 2024-06-05T14:42:36Z
definition: This segment includes companies that wholesale and distribute automotive tire products.
notation: 1112101112
valid from: 2020-10-03

Automotive Wholesalers
type: BicsLevel4SubIndustry
type: Classifier
type: NamedIndividual
replaces: Automotive Wholesalers
created with: infer-bics.sql
derived from: Multifamily Home Construction
  type: BicsLevel4SubIndustry
  type: Classifier
  type: ContemporaryDerivation
  derived from: http://data.ga-group.nl/ics/bics/2014/11121011
  source accessed on: 2019-12-03T20:05:01Z
  source last accessed on: 2019-12-03T20:05:01Z
  definition: This industry subgroup includes companies that build and sell multifamily homes. Includes townhouses, condominiums and duplexes.
  notation: 11121011
  valid from: 2014-08-08
  valid till: 2020-10-03
derived from: Automotive Wholesalers
  type: BicsLevel3Industry
  type: Classifier
  type: AnachronousDerivation
  derived from: http://data.ga-group.nl/ics/bics/2014/111911
  source accessed on: 2019-12-03T20:05:01Z
  source last accessed on: 2019-12-03T20:05:01Z
  definition: This industry includes companies that wholesale and distribute motor vehicles and parts. Excludes companies that manufacture motor vehicles or their parts.
  notation: 111911
  valid from: 2014-08-08
  valid till: 2020-10-03
derived from: Automotive Wholesalers
  type: BicsLevel4SubIndustry
  type: Classifier
  type: ContemporaryDerivation
  derived from: http://data.ga-group.nl/ics/bics/2020/11121011
  derived from: http://data.ga-group.nl/ics/bics/2024/11121011
  source accessed on: 2023-07-03T18:11:29Z
  source last accessed on: 2024-06-05T14:42:36Z
  definition: This industry subgroup includes companies that wholesale and distribute motor vehicles and parts. Excludes companies that manufacture motor vehicles or their parts.
  notation: 11121011
  valid from: 2020-10-03
source accessed on: 2019-12-03T20:05:01Z
source last accessed on: 2024-06-05T14:42:36Z
definition: This industry subgroup includes companies that wholesale and distribute motor vehicles and parts. Excludes companies that manufacture motor vehicles or their parts.
notation: 11121011
valid from: 2014-08-08

Computer & Software Whslrs
type: BicsLevel5Segment
type: Classifier
type: NamedIndividual
is level5 segment of: Consumer Elec & Applc Whslrs
created with: infer-bics.sql
derived from: Computer & Software Whslrs
  type: BicsLevel4SubIndustry
  type: Classifier
  type: AnachronousDerivation
  derived from: http://data.ga-group.nl/ics/bics/2014/11191210
  source accessed on: 2019-12-03T20:05:01Z
  source last accessed on: 2019-12-03T20:05:01Z
  definition: This industry subgroup includes companies that wholesale and distribute computer and computer peripheral equipment. Products include computer boards, computer software, motherboards and printers.
  notation: 11191210
  valid from: 2014-08-08
  valid till: 2020-10-03
derived from: Computer & Software Whslrs
  type: BicsLevel5Segment
  type: Classifier
  type: ContemporaryDerivation
  derived from: http://data.ga-group.nl/ics/bics/2020/1112101210
  derived from: http://data.ga-group.nl/ics/bics/2024/1112101210
  source accessed on: 2023-07-03T18:11:29Z
  source last accessed on: 2024-06-05T14:42:36Z
  definition: This segment includes companies that wholesale and distribute computer and computer peripheral equipment. Includes computer boards, computer software, motherboards, and printers.
  notation: 1112101210
  valid from: 2020-10-03
source accessed on: 2023-07-03T18:11:29Z
source last accessed on: 2024-06-05T14:42:36Z
definition: This segment includes companies that wholesale and distribute computer and computer peripheral equipment. Includes computer boards, computer software, motherboards, and printers.
notation: 1112101210
valid from: 2020-10-03

Photo Equip & Supplies Whslrs
type: BicsLevel5Segment
type: Classifier
type: NamedIndividual
is level5 segment of: Consumer Elec & Applc Whslrs
created with: infer-bics.sql
derived from: Photo Equip & Supplies Whslrs
  type: BicsLevel4SubIndustry
  type: Classifier
  type: AnachronousDerivation
  derived from: http://data.ga-group.nl/ics/bics/2014/11191211
  source accessed on: 2019-12-03T20:05:01Z
  source last accessed on: 2019-12-03T20:05:01Z
  definition: This industry subgroup includes companies that wholesale and distribute photographic equipment and supplies. Products include camera equipment, motion picture cameras, projection equipment and theater equipment.
  notation: 11191211
  valid from: 2014-08-08
  valid till: 2020-10-03
derived from: Photo Equip & Supplies Whslrs
  type: BicsLevel5Segment
  type: Classifier
  type: ContemporaryDerivation
  derived from: http://data.ga-group.nl/ics/bics/2020/1112101211
  derived from: http://data.ga-group.nl/ics/bics/2024/1112101211
  source accessed on: 2023-07-03T18:11:29Z
  source last accessed on: 2024-06-05T14:42:36Z
  definition: This segment includes companies that wholesale and distribute photographic equipment and supplies. Include camera equipment, motion picture cameras, projection equipment, and theater equipment.
  notation: 1112101211
  valid from: 2020-10-03
source accessed on: 2023-07-03T18:11:29Z
source last accessed on: 2024-06-05T14:42:36Z
definition: This segment includes companies that wholesale and distribute photographic equipment and supplies. Include camera equipment, motion picture cameras, projection equipment, and theater equipment.
notation: 1112101211
valid from: 2020-10-03

Consumer Elec & Applc Whslrs
type: BicsLevel4SubIndustry
type: Classifier
type: NamedIndividual
replaces: Consumer Elec & Applc Whslrs
created with: infer-bics.sql
derived from: Manufactured (Mobile) Home
  type: BicsLevel4SubIndustry
  type: Classifier
  type: ContemporaryDerivation
  derived from: http://data.ga-group.nl/ics/bics/2014/11121012
  source accessed on: 2019-12-03T20:05:01Z
  source last accessed on: 2019-12-03T20:05:01Z
  definition: This industry subgroup includes companies that build and sell manufactured or mobile homes and other buildings.
  notation: 11121012
  valid from: 2014-08-08
  valid till: 2020-10-03
derived from: Consumer Elec & Applc Whslrs
  type: BicsLevel3Industry
  type: Classifier
  type: AnachronousDerivation
  derived from: http://data.ga-group.nl/ics/bics/2014/111912
  source accessed on: 2019-12-03T20:05:01Z
  source last accessed on: 2019-12-03T20:05:01Z
  definition: This industry includes companies that wholesale and distribute household consumer electronics and appliances. Includes consumer electronics, household appliances, photography equipment, computers and software.
  notation: 111912
  valid from: 2014-08-08
  valid till: 2020-10-03
derived from: Consumer Elec & Applc Whslrs
  type: BicsLevel4SubIndustry
  type: Classifier
  type: ContemporaryDerivation
  derived from: http://data.ga-group.nl/ics/bics/2020/11121012
  derived from: http://data.ga-group.nl/ics/bics/2024/11121012
  source accessed on: 2023-07-03T18:11:29Z
  source last accessed on: 2024-06-05T14:42:36Z
  definition: This industry subgroup includes companies that wholesale and distribute household consumer electronics and appliances. Includes consumer electronics, household appliances, photography equipment, computers and software.
  notation: 11121012
  valid from: 2020-10-03
source accessed on: 2019-12-03T20:05:01Z
source last accessed on: 2024-06-05T14:42:36Z
definition: This industry subgroup includes companies that wholesale and distribute household consumer electronics and appliances. Includes consumer electronics, household appliances, photography equipment, computers and software.
notation: 11121012
valid from: 2014-08-08

Hardware Wholesalers
type: BicsLevel5Segment
type: Classifier
type: NamedIndividual
is level5 segment of: Home & Office Product Whslrs
created with: infer-bics.sql
derived from: Hardware Wholesalers
  type: BicsLevel4SubIndustry
  type: Classifier
  type: AnachronousDerivation
  derived from: http://data.ga-group.nl/ics/bics/2014/11191311
  source accessed on: 2019-12-03T20:05:01Z
  source last accessed on: 2019-12-03T20:05:01Z
  definition: This industry subgroup includes companies that wholesale and distribute hand tools, fasteners and hardware. Products include blades, staples, nuts, bolts, screws and hand tools.
  notation: 11191311
  valid from: 2014-08-08
  valid till: 2020-10-03
derived from: Hardware Wholesalers
  type: BicsLevel5Segment
  type: Classifier
  type: ContemporaryDerivation
  derived from: http://data.ga-group.nl/ics/bics/2020/1112101310
  derived from: http://data.ga-group.nl/ics/bics/2024/1112101310
  source accessed on: 2023-07-03T18:11:29Z
  source last accessed on: 2024-06-05T14:42:36Z
  definition: This segment includes companies that wholesale and distribute hand tools, fasteners, and hardware. Includes blades, staples, nuts, bolts, screws, and hand tools.
  notation: 1112101310
  valid from: 2020-10-03
source accessed on: 2023-07-03T18:11:29Z
source last accessed on: 2024-06-05T14:42:36Z
definition: This segment includes companies that wholesale and distribute hand tools, fasteners, and hardware. Includes blades, staples, nuts, bolts, screws, and hand tools.
notation: 1112101310
valid from: 2020-10-03

Home Furnishing Wholesalers
type: BicsLevel5Segment
type: Classifier
type: NamedIndividual
is level5 segment of: Home & Office Product Whslrs
created with: infer-bics.sql
derived from: Home Furnishing Wholesalers
  type: BicsLevel4SubIndustry
  type: Classifier
  type: AnachronousDerivation
  derived from: http://data.ga-group.nl/ics/bics/2014/11191312
  source accessed on: 2019-12-03T20:05:01Z
  source last accessed on: 2019-12-03T20:05:01Z
  definition: This industry subgroup includes companies that wholesale home furnishings used to beautify or add comfort to a home. They do not manufacture anything themselves. Home furnishings may include items like crystal, kitchen utensils, porcelain vases, artwork and floriculture products.
  notation: 11191312
  valid from: 2014-08-08
  valid till: 2020-10-03
derived from: Home Furnishing Wholesalers
  type: BicsLevel5Segment
  type: Classifier
  type: ContemporaryDerivation
  derived from: http://data.ga-group.nl/ics/bics/2020/1112101311
  derived from: http://data.ga-group.nl/ics/bics/2024/1112101311
  source accessed on: 2023-07-03T18:11:29Z
  source last accessed on: 2024-06-05T14:42:36Z
  definition: This segment includes companies that wholesale and distribute home furnishings used to decorate a home.
  notation: 1112101311
  valid from: 2020-10-03
source accessed on: 2023-07-03T18:11:29Z
source last accessed on: 2024-06-05T14:42:36Z
definition: This segment includes companies that wholesale and distribute home furnishings used to decorate a home.
notation: 1112101311
valid from: 2020-10-03

Office Equip Wholesalers
type: BicsLevel5Segment
type: Classifier
type: NamedIndividual
is level5 segment of: Home & Office Product Whslrs
created with: infer-bics.sql
derived from: Office Equip Wholesalers
  type: BicsLevel4SubIndustry
  type: Classifier
  type: AnachronousDerivation
  derived from: http://data.ga-group.nl/ics/bics/2014/11191313
  source accessed on: 2019-12-03T20:05:01Z
  source last accessed on: 2019-12-03T20:05:01Z
  definition: This industry subgroup includes companies that wholesale and distribute office machines and related equipment. Includes accounting machines, cash registers, postage meters, safes and copying machines.
  notation: 11191313
  valid from: 2014-08-08
  valid till: 2020-10-03
derived from: Office Equip Wholesalers
  type: BicsLevel5Segment
  type: Classifier
  type: ContemporaryDerivation
  derived from: http://data.ga-group.nl/ics/bics/2020/1112101312
  derived from: http://data.ga-group.nl/ics/bics/2024/1112101312
  source accessed on: 2023-07-03T18:11:29Z
  source last accessed on: 2024-06-05T14:42:36Z
  definition: This segment includes companies that wholesale and distribute office machines and related equipment. Includes accounting machines, cash registers, postage meters, safes, and copying machines.
  notation: 1112101312
  valid from: 2020-10-03
source accessed on: 2023-07-03T18:11:29Z
source last accessed on: 2024-06-05T14:42:36Z
definition: This segment includes companies that wholesale and distribute office machines and related equipment. Includes accounting machines, cash registers, postage meters, safes, and copying machines.
notation: 1112101312
valid from: 2020-10-03

Paint Wholesalers
type: BicsLevel5Segment
type: Classifier
type: NamedIndividual
is level5 segment of: Home & Office Product Whslrs
created with: infer-bics.sql
derived from: Paint Wholesalers
  type: BicsLevel4SubIndustry
  type: Classifier
  type: AnachronousDerivation
  derived from: http://data.ga-group.nl/ics/bics/2014/11191314
  source accessed on: 2019-12-03T20:05:01Z
  source last accessed on: 2019-12-03T20:05:01Z
  definition: This industry subgroup includes companies that wholesale and distribute paints, coatings, wallpaper, paintbrushes, rollers and related supplies.
  notation: 11191314
  valid from: 2014-08-08
  valid till: 2020-10-03
derived from: Paint Wholesalers
  type: BicsLevel5Segment
  type: Classifier
  type: ContemporaryDerivation
  derived from: http://data.ga-group.nl/ics/bics/2020/1112101313
  derived from: http://data.ga-group.nl/ics/bics/2024/1112101313
  source accessed on: 2023-07-03T18:11:29Z
  source last accessed on: 2024-06-05T14:42:36Z
  definition: This segment includes companies that wholesale and distribute paints, coatings, wallpaper, paintbrushes, rollers, and related supplies.
  notation: 1112101313
  valid from: 2020-10-03
source accessed on: 2023-07-03T18:11:29Z
source last accessed on: 2024-06-05T14:42:36Z
definition: This segment includes companies that wholesale and distribute paints, coatings, wallpaper, paintbrushes, rollers, and related supplies.
notation: 1112101313
valid from: 2020-10-03

Print & Writing Paper Whslrs
type: BicsLevel5Segment
type: Classifier
type: NamedIndividual
is level5 segment of: Home & Office Product Whslrs
created with: infer-bics.sql
derived from: Print & Writing Paper Whslrs
  type: BicsLevel4SubIndustry
  type: Classifier
  type: AnachronousDerivation
  derived from: http://data.ga-group.nl/ics/bics/2014/11191315
  source accessed on: 2019-12-03T20:05:01Z
  source last accessed on: 2019-12-03T20:05:01Z
  definition: This industry subgroup includes companies that wholesale and distribute bulk printing and writing paper.
  notation: 11191315
  valid from: 2014-08-08
  valid till: 2020-10-03
derived from: Print & Writing Paper Whslrs
  type: BicsLevel5Segment
  type: Classifier
  type: ContemporaryDerivation
  derived from: http://data.ga-group.nl/ics/bics/2020/1112101314
  derived from: http://data.ga-group.nl/ics/bics/2024/1112101314
  source accessed on: 2023-07-03T18:11:29Z
  source last accessed on: 2024-06-05T14:42:36Z
  definition: This segment includes companies that wholesale and distribute bulk printing and writing paper.
  notation: 1112101314
  valid from: 2020-10-03
source accessed on: 2023-07-03T18:11:29Z
source last accessed on: 2024-06-05T14:42:36Z
definition: This segment includes companies that wholesale and distribute bulk printing and writing paper.
notation: 1112101314
valid from: 2020-10-03

Stationery & Office Sply Whslrs
type: BicsLevel5Segment
type: Classifier
type: NamedIndividual
is level5 segment of: Home & Office Product Whslrs
created with: infer-bics.sql
derived from: Stationery & Office Supp Whslrs
  type: BicsLevel4SubIndustry
  type: Classifier
  type: AnachronousDerivation
  derived from: http://data.ga-group.nl/ics/bics/2014/11191316
  source accessed on: 2019-12-03T20:05:01Z
  source last accessed on: 2019-12-03T20:05:01Z
  definition: This industry subgroup includes companies that wholesale and distribute stationery, office supplies and gift wrap.
  notation: 11191316
  valid from: 2014-08-08
  valid till: 2020-10-03
derived from: Stationery & Office Sply Whslrs
  type: BicsLevel5Segment
  type: Classifier
  type: ContemporaryDerivation
  derived from: http://data.ga-group.nl/ics/bics/2020/1112101315
  derived from: http://data.ga-group.nl/ics/bics/2024/1112101315
  source accessed on: 2023-07-03T18:11:29Z
  source last accessed on: 2024-06-05T14:42:36Z
  definition: This segment includes companies that wholesale and distribute stationery, office supplies, and gift wrap.
  notation: 1112101315
  valid from: 2020-10-03
source accessed on: 2023-07-03T18:11:29Z
source last accessed on: 2024-06-05T14:42:36Z
definition: This segment includes companies that wholesale and distribute stationery, office supplies, and gift wrap.
notation: 1112101315
valid from: 2020-10-03

Home & Office Product Whslrs
type: BicsLevel4SubIndustry
type: Classifier
type: NamedIndividual
replaces: Home & Office Product Whslrs
created with: infer-bics.sql
derived from: Land Sales
  type: BicsLevel4SubIndustry
  type: Classifier
  type: ContemporaryDerivation
  derived from: http://data.ga-group.nl/ics/bics/2014/11121013
  source accessed on: 2019-12-03T20:05:01Z
  source last accessed on: 2019-12-03T20:05:01Z
  definition: This industry subgroup includes revenue derived from land sales by homebuilders.
  notation: 11121013
  valid from: 2014-08-08
  valid till: 2020-10-03
derived from: Home & Office Product Whslrs
  type: BicsLevel3Industry
  type: Classifier
  type: AnachronousDerivation
  derived from: http://data.ga-group.nl/ics/bics/2014/111913
  source accessed on: 2019-12-03T20:05:01Z
  source last accessed on: 2019-12-03T20:05:01Z
  definition: This industry includes companies that wholesale home or office furniture, home furnishings, office equipment, paint, wallpaper and personal or office stationery.
  notation: 111913
  valid from: 2014-08-08
  valid till: 2020-10-03
derived from: Home & Office Product Whslrs
  type: BicsLevel4SubIndustry
  type: Classifier
  type: ContemporaryDerivation
  derived from: http://data.ga-group.nl/ics/bics/2020/11121013
  derived from: http://data.ga-group.nl/ics/bics/2024/11121013
  source accessed on: 2023-07-03T18:11:29Z
  source last accessed on: 2024-06-05T14:42:36Z
  definition: This industry subgroup includes companies that wholesale and distribute home or office furniture, home furnishings, office equipment, hardware, paint, wallpaper, and personal or office stationery.
  notation: 11121013
  valid from: 2020-10-03
source accessed on: 2019-12-03T20:05:01Z
source last accessed on: 2024-06-05T14:42:36Z
definition: This industry subgroup includes companies that wholesale and distribute home or office furniture, home furnishings, office equipment, hardware, paint, wallpaper, and personal or office stationery.
notation: 11121013
valid from: 2014-08-08

Book, Periodical & News Whslrs
type: BicsLevel5Segment
type: Classifier
type: NamedIndividual
is level5 segment of: Other Wholesalers
created with: infer-bics.sql
derived from: Book, Periodical & News Whslrs
  type: BicsLevel4SubIndustry
  type: Classifier
  type: AnachronousDerivation
  derived from: http://data.ga-group.nl/ics/bics/2014/11191410
  source accessed on: 2019-12-03T20:05:01Z
  source last accessed on: 2019-12-03T20:05:01Z
  definition: This industry subgroup includes companies that wholesale books, audiobooks and periodicals to retail stores.
  notation: 11191410
  valid from: 2014-08-08
  valid till: 2020-10-03
derived from: Book, Periodical & News Whslrs
  type: BicsLevel5Segment
  type: Classifier
  type: ContemporaryDerivation
  derived from: http://data.ga-group.nl/ics/bics/2020/1112101410
  derived from: http://data.ga-group.nl/ics/bics/2024/1112101410
  source accessed on: 2023-07-03T18:11:29Z
  source last accessed on: 2024-06-05T14:42:36Z
  definition: This segment includes companies that wholesale and distribute books, audiobooks, and periodicals.
  notation: 1112101410
  valid from: 2020-10-03
source accessed on: 2023-07-03T18:11:29Z
source last accessed on: 2024-06-05T14:42:36Z
definition: This segment includes companies that wholesale and distribute books, audiobooks, and periodicals.
notation: 1112101410
valid from: 2020-10-03

Fabric & Textile Wholesalers
type: BicsLevel5Segment
type: Classifier
type: NamedIndividual
is level5 segment of: Other Wholesalers
created with: infer-bics.sql
derived from: Fabric & Textile Wholesalers
  type: BicsLevel4SubIndustry
  type: Classifier
  type: AnachronousDerivation
  derived from: http://data.ga-group.nl/ics/bics/2014/11191411
  source accessed on: 2019-12-03T20:05:01Z
  source last accessed on: 2019-12-03T20:05:01Z
  definition: This industry subgroup includes companies that wholesale fabrics and textiles, such as yarn, linen and other fabrics to retailers. Excludes companies that manufacture textiles.
  notation: 11191411
  valid from: 2014-08-08
  valid till: 2020-10-03
derived from: Fabric & Textile Wholesalers
  type: BicsLevel5Segment
  type: Classifier
  type: ContemporaryDerivation
  derived from: http://data.ga-group.nl/ics/bics/2020/1112101411
  derived from: http://data.ga-group.nl/ics/bics/2024/1112101411
  source accessed on: 2023-07-03T18:11:29Z
  source last accessed on: 2024-06-05T14:42:36Z
  definition: This segment includes companies that wholesale and distribute fabrics and textiles, such as yarn, linen, and other fabrics.
  notation: 1112101411
  valid from: 2020-10-03
source accessed on: 2023-07-03T18:11:29Z
source last accessed on: 2024-06-05T14:42:36Z
definition: This segment includes companies that wholesale and distribute fabrics and textiles, such as yarn, linen, and other fabrics.
notation: 1112101411
valid from: 2020-10-03

Florist Supplies Wholesalers
type: BicsLevel5Segment
type: Classifier
type: NamedIndividual
is level5 segment of: Other Wholesalers
created with: infer-bics.sql
derived from: Florist Supply Wholesalers
  type: BicsLevel4SubIndustry
  type: Classifier
  type: AnachronousDerivation
  derived from: http://data.ga-group.nl/ics/bics/2014/11191412
  source accessed on: 2019-12-03T20:05:01Z
  source last accessed on: 2019-12-03T20:05:01Z
  definition: This industry subgroup includes companies that wholesale and distribute flowers, florists supplies and nursery materials.
  notation: 11191412
  valid from: 2014-08-08
  valid till: 2020-10-03
derived from: Florist Supplies Wholesalers
  type: BicsLevel5Segment
  type: Classifier
  type: ContemporaryDerivation
  derived from: http://data.ga-group.nl/ics/bics/2020/1112101412
  derived from: http://data.ga-group.nl/ics/bics/2024/1112101412
  source accessed on: 2023-07-03T18:11:29Z
  source last accessed on: 2024-06-05T14:42:36Z
  definition: This segment includes companies that wholesale and distribute flowers, florists supplies and nursery materials.
  notation: 1112101412
  valid from: 2020-10-03
source accessed on: 2023-07-03T18:11:29Z
source last accessed on: 2024-06-05T14:42:36Z
definition: This segment includes companies that wholesale and distribute flowers, florists supplies and nursery materials.
notation: 1112101412
valid from: 2020-10-03

Industrial Paper Wholesalers
type: BicsLevel5Segment
type: Classifier
type: NamedIndividual
is level5 segment of: Other Wholesalers
created with: infer-bics.sql
derived from: Industrial Paper Wholesalers
  type: BicsLevel4SubIndustry
  type: Classifier
  type: AnachronousDerivation
  derived from: http://data.ga-group.nl/ics/bics/2014/11191413
  source accessed on: 2019-12-03T20:05:01Z
  source last accessed on: 2019-12-03T20:05:01Z
  definition: This industry subgroup includes companies that wholesale and distribute craft wrapping, paperboard, converted paper and disposable paper products.
  notation: 11191413
  valid from: 2014-08-08
  valid till: 2020-10-03
derived from: Industrial Paper Wholesalers
  type: BicsLevel5Segment
  type: Classifier
  type: ContemporaryDerivation
  derived from: http://data.ga-group.nl/ics/bics/2020/1112101413
  derived from: http://data.ga-group.nl/ics/bics/2024/1112101413
  source accessed on: 2023-07-03T18:11:29Z
  source last accessed on: 2024-06-05T14:42:36Z
  definition: This segment includes companies that wholesale and distribute craft wrapping, paperboard, converted paper and disposable paper products.
  notation: 1112101413
  valid from: 2020-10-03
source accessed on: 2023-07-03T18:11:29Z
source last accessed on: 2024-06-05T14:42:36Z
definition: This segment includes companies that wholesale and distribute craft wrapping, paperboard, converted paper and disposable paper products.
notation: 1112101413
valid from: 2020-10-03

Ophthalmic Goods Wholesalers
type: BicsLevel5Segment
type: Classifier
type: NamedIndividual
is level5 segment of: Other Wholesalers
created with: infer-bics.sql
derived from: Ophthalmic Goods Wholesalers
  type: BicsLevel4SubIndustry
  type: Classifier
  type: AnachronousDerivation
  derived from: http://data.ga-group.nl/ics/bics/2014/11191415
  source accessed on: 2019-12-03T20:05:01Z
  source last accessed on: 2019-12-03T20:05:01Z
  definition: This industry subgroup includes companies that wholesale and distribute professional equipment, instruments, and/or goods sold, prescribed or used by ophthalmologists, optometrists and opticians.
  notation: 11191415
  valid from: 2014-08-08
  valid till: 2020-10-03
derived from: Ophthalmic Goods Wholesalers
  type: BicsLevel5Segment
  type: Classifier
  type: ContemporaryDerivation
  derived from: http://data.ga-group.nl/ics/bics/2020/1112101414
  derived from: http://data.ga-group.nl/ics/bics/2024/1112101414
  source accessed on: 2023-07-03T18:11:29Z
  source last accessed on: 2024-06-05T14:42:36Z
  definition: This segment includes companies that wholesale and distribute professional equipment, instruments, and/or goods sold, prescribed, or used by ophthalmologists, optometrists, and opticians.
  notation: 1112101414
  valid from: 2020-10-03
source accessed on: 2023-07-03T18:11:29Z
source last accessed on: 2024-06-05T14:42:36Z
definition: This segment includes companies that wholesale and distribute professional equipment, instruments, and/or goods sold, prescribed, or used by ophthalmologists, optometrists, and opticians.
notation: 1112101414
valid from: 2020-10-03

Sporting Goods Wholesalers
type: BicsLevel5Segment
type: Classifier
type: NamedIndividual
is level5 segment of: Other Wholesalers
created with: infer-bics.sql
derived from: Sporting Goods Wholesalers
  type: BicsLevel4SubIndustry
  type: Classifier
  type: AnachronousDerivation
  derived from: http://data.ga-group.nl/ics/bics/2014/11191416
  source accessed on: 2019-12-03T20:05:01Z
  source last accessed on: 2019-12-03T20:05:01Z
  definition: This industry subgroup includes companies that wholesale and distribute sporting goods and related products. Products include athletic uniforms and apparel, athletic equipment and athletic supplies.
  notation: 11191416
  valid from: 2014-08-08
  valid till: 2020-10-03
derived from: Sporting Goods Wholesalers
  type: BicsLevel5Segment
  type: Classifier
  type: ContemporaryDerivation
  derived from: http://data.ga-group.nl/ics/bics/2020/1112101415
  derived from: http://data.ga-group.nl/ics/bics/2024/1112101415
  source accessed on: 2023-07-03T18:11:29Z
  source last accessed on: 2024-06-05T14:42:36Z
  definition: This segment includes companies that wholesale and distribute sporting goods and related products. Products include athletic uniforms and apparel, athletic equipment, and athletic supplies.
  notation: 1112101415
  valid from: 2020-10-03
source accessed on: 2023-07-03T18:11:29Z
source last accessed on: 2024-06-05T14:42:36Z
definition: This segment includes companies that wholesale and distribute sporting goods and related products. Products include athletic uniforms and apparel, athletic equipment, and athletic supplies.
notation: 1112101415
valid from: 2020-10-03

Toys & Games Whslrs
type: BicsLevel5Segment
type: Classifier
type: NamedIndividual
is level5 segment of: Other Wholesalers
created with: infer-bics.sql
derived from: Toys & Games Whslrs
  type: BicsLevel4SubIndustry
  type: Classifier
  type: AnachronousDerivation
  derived from: http://data.ga-group.nl/ics/bics/2014/11191417
  source accessed on: 2019-12-03T20:05:01Z
  source last accessed on: 2019-12-03T20:05:01Z
  definition: This industry subgroup includes companies that wholesale and distribute games, toys and hobby-related products. Products include children's vehicles, electronic games, playing cards and toys.
  notation: 11191417
  valid from: 2014-08-08
  valid till: 2020-10-03
derived from: Toys & Games Whslrs
  type: BicsLevel5Segment
  type: Classifier
  type: ContemporaryDerivation
  derived from: http://data.ga-group.nl/ics/bics/2020/1112101416
  derived from: http://data.ga-group.nl/ics/bics/2024/1112101416
  source accessed on: 2023-07-03T18:11:29Z
  source last accessed on: 2024-06-05T14:42:36Z
  definition: This segment includes companies that wholesale and distribute games, toys, and hobby-related products. Products include children's vehicles, electronic games, playing cards, and toys.
  notation: 1112101416
  valid from: 2020-10-03
source accessed on: 2023-07-03T18:11:29Z
source last accessed on: 2024-06-05T14:42:36Z
definition: This segment includes companies that wholesale and distribute games, toys, and hobby-related products. Products include children's vehicles, electronic games, playing cards, and toys.
notation: 1112101416
valid from: 2020-10-03

Other Wholesalers
type: BicsLevel4SubIndustry
type: Classifier
type: NamedIndividual
replaces: Other Wholesalers
created with: infer-bics.sql
derived from: Other Wholesalers
  type: BicsLevel3Industry
  type: Classifier
  type: AnachronousDerivation
  derived from: http://data.ga-group.nl/ics/bics/2014/111914
  source accessed on: 2019-12-03T20:05:01Z
  source last accessed on: 2019-12-03T20:05:01Z
  definition: This industry includes companies that wholesale and distribute products not elsewhere classified. Excludes manufacturers that wholesale their own products.
  notation: 111914
  valid from: 2014-08-08
  valid till: 2020-10-03
derived from: Other Wholesalers
  type: BicsLevel4SubIndustry
  type: Classifier
  type: ContemporaryDerivation
  derived from: http://data.ga-group.nl/ics/bics/2020/11121014
  derived from: http://data.ga-group.nl/ics/bics/2024/11121014
  source accessed on: 2023-07-03T18:11:29Z
  source last accessed on: 2024-06-05T14:42:36Z
  definition: This industry subgroup includes companies that wholesale and distribute products not elsewhere classified.
  notation: 11121014
  valid from: 2020-10-03
source accessed on: 2023-07-03T18:11:29Z
source last accessed on: 2024-06-05T14:42:36Z
definition: This industry subgroup includes companies that wholesale and distribute products not elsewhere classified.
notation: 11121014
valid from: 2020-10-03

Import & Export
type: BicsLevel4SubIndustry
type: Classifier
type: NamedIndividual
replaces: Import & Export
created with: infer-bics.sql
derived from: Import & Export
  type: BicsLevel3Industry
  type: Classifier
  type: AnachronousDerivation
  derived from: http://data.ga-group.nl/ics/bics/2014/111915
  source accessed on: 2019-12-03T20:05:01Z
  source last accessed on: 2019-12-03T20:05:01Z
  definition: This industry includes companies that wholesale trade merchandise overseas using their own money or on behalf of someone else for a fee.
  notation: 111915
  valid from: 2014-08-08
  valid till: 2020-10-03
derived from: Import & Export
  type: BicsLevel4SubIndustry
  type: Classifier
  type: ContemporaryDerivation
  derived from: http://data.ga-group.nl/ics/bics/2020/11121015
  derived from: http://data.ga-group.nl/ics/bics/2024/11121015
  source accessed on: 2023-07-03T18:11:29Z
  source last accessed on: 2024-06-05T14:42:36Z
  definition: This industry subgroup includes companies that wholesale international trade merchandise using their own money or on behalf of someone else for a fee.
  notation: 11121015
  valid from: 2020-10-03
source accessed on: 2023-07-03T18:11:29Z
source last accessed on: 2024-06-05T14:42:36Z
definition: This industry subgroup includes companies that wholesale international trade merchandise using their own money or on behalf of someone else for a fee.
notation: 11121015
valid from: 2020-10-03

Wholesale - Discretionary
type: BicsLevel3Industry
type: Classifier
type: NamedIndividual
is industry of: Retail & Whsle - Discretionary
is replaced by: Homebuilding
replaces: Distributors - Discretionary
created with: infer-bics.sql
derived from: Homebuilders
  type: BicsLevel3Industry
  type: Classifier
  type: ContemporaryDerivation
  derived from: http://data.ga-group.nl/ics/bics/2014/111210
  source accessed on: 2019-12-03T20:05:01Z
  source last accessed on: 2019-12-03T20:05:01Z
  definition: This industry includes companies that build and sell residential buildings, including single and multifamily homes, apartments and condominiums. Excludes companies that rent properties.
  notation: 111210
  valid from: 2014-08-08
  valid till: 2020-10-03
derived from: Distributors - Discretionary
  type: BicsLevel2IndustryGroup
  type: Classifier
  type: AnachronousDerivation
  derived from: http://data.ga-group.nl/ics/bics/2014/1119
  source accessed on: 2019-12-03T20:05:01Z
  source last accessed on: 2019-12-03T20:05:01Z
  definition: This industry group includes companies that wholesale and distribute auto and general merchandise products.
  notation: 1119
  valid from: 2014-08-08
  valid till: 2020-10-03
derived from: Wholesale - Discretionary
  type: BicsLevel3Industry
  type: Classifier
  type: ContemporaryDerivation
  derived from: http://data.ga-group.nl/ics/bics/2020/111210
  derived from: http://data.ga-group.nl/ics/bics/2024/111210
  source accessed on: 2023-07-03T18:11:29Z
  source last accessed on: 2024-06-05T14:42:36Z
  definition: This industry includes companies that wholesale and distribute consumer discretionary products. Such companies do not manufacture their own products, but instead distribute other companies' products in bulk to intermediaries in the supply chain or commercial and industrial clients.
  notation: 111210
  valid from: 2020-10-03
source accessed on: 2019-12-03T20:05:01Z
source last accessed on: 2024-06-05T14:42:36Z
definition: This industry includes companies that wholesale and distribute consumer discretionary products. Such companies do not manufacture their own products, but instead distribute other companies' products in bulk to intermediaries in the supply chain or commercial and industrial clients.
notation: 111210
valid from: 2014-08-08

Auto Parts & Accessories Stores
type: BicsLevel5Segment
type: Classifier
type: NamedIndividual
is level5 segment of: Automotive Retailers
created with: infer-bics.sql
derived from: Auto Parts & Accessories Stores
  type: BicsLevel4SubIndustry
  type: Classifier
  type: AnachronousDerivation
  derived from: http://data.ga-group.nl/ics/bics/2014/11201010
  source accessed on: 2019-12-03T20:05:01Z
  source last accessed on: 2019-12-03T20:05:01Z
  definition: This industry subgroup includes companies that retail automotive parts and accessories.
  notation: 11201010
  valid from: 2014-08-08
  valid till: 2020-10-03
derived from: Auto Parts & Accessories Stores
  type: BicsLevel5Segment
  type: Classifier
  type: ContemporaryDerivation
  derived from: http://data.ga-group.nl/ics/bics/2020/1112111010
  derived from: http://data.ga-group.nl/ics/bics/2024/1112111010
  source accessed on: 2023-07-03T18:11:29Z
  source last accessed on: 2024-06-05T14:42:36Z
  definition: This segment includes stores that specialize in retailing automotive parts, accessories, and related tools.
  notation: 1112111010
  valid from: 2020-10-03
source accessed on: 2023-07-03T18:11:29Z
source last accessed on: 2024-06-05T14:42:36Z
definition: This segment includes stores that specialize in retailing automotive parts, accessories, and related tools.
notation: 1112111010
valid from: 2020-10-03

Auto Repair Centers
type: BicsLevel5Segment
type: Classifier
type: NamedIndividual
is level5 segment of: Automotive Retailers
created with: infer-bics.sql
derived from: Auto Repair Centers
  type: BicsLevel4SubIndustry
  type: Classifier
  type: AnachronousDerivation
  derived from: http://data.ga-group.nl/ics/bics/2014/11201011
  source accessed on: 2019-12-03T20:05:01Z
  source last accessed on: 2019-12-03T20:05:01Z
  definition: This industry subgroup includes companies that provide automotive repair and maintenance services.
  notation: 11201011
  valid from: 2014-08-08
  valid till: 2020-10-03
derived from: Auto Repair Centers
  type: BicsLevel5Segment
  type: Classifier
  type: ContemporaryDerivation
  derived from: http://data.ga-group.nl/ics/bics/2020/1112111011
  derived from: http://data.ga-group.nl/ics/bics/2024/1112111011
  source accessed on: 2023-07-03T18:11:29Z
  source last accessed on: 2024-06-05T14:42:36Z
  definition: This segment includes companies that provide automotive repair and maintenance services.
  notation: 1112111011
  valid from: 2020-10-03
source accessed on: 2023-07-03T18:11:29Z
source last accessed on: 2024-06-05T14:42:36Z
definition: This segment includes companies that provide automotive repair and maintenance services.
notation: 1112111011
valid from: 2020-10-03

Car Dealers
type: BicsLevel5Segment
type: Classifier
type: NamedIndividual
is level5 segment of: Automotive Retailers
created with: infer-bics.sql
derived from: Car Dealers
  type: BicsLevel4SubIndustry
  type: Classifier
  type: AnachronousDerivation
  derived from: http://data.ga-group.nl/ics/bics/2014/11201012
  source accessed on: 2019-12-03T20:05:01Z
  source last accessed on: 2019-12-03T20:05:01Z
  definition: This industry subgroup includes companies that sell both new and used vehicles including passenger cars, light trucks and utility vehicles.
  notation: 11201012
  valid from: 2014-08-08
  valid till: 2020-10-03
derived from: Car Dealers
  type: BicsLevel5Segment
  type: Classifier
  type: ContemporaryDerivation
  derived from: http://data.ga-group.nl/ics/bics/2020/1112111012
  derived from: http://data.ga-group.nl/ics/bics/2024/1112111012
  source accessed on: 2023-07-03T18:11:29Z
  source last accessed on: 2024-06-05T14:42:36Z
  definition: This segment includes companies that sell both new and used vehicles including passenger cars, light trucks, and utility vehicles.
  notation: 1112111012
  valid from: 2020-10-03
source accessed on: 2023-07-03T18:11:29Z
source last accessed on: 2024-06-05T14:42:36Z
definition: This segment includes companies that sell both new and used vehicles including passenger cars, light trucks, and utility vehicles.
notation: 1112111012
valid from: 2020-10-03

Passenger Veh Leasing - Electric
type: BicsLevel7Segment
type: Classifier
type: NamedIndividual
is level7 segment of: Passenger Vehicle Leasing
created with: infer-bics.sql
derived from: Passenger Veh Leasing - Electric
  type: BicsLevel7Segment
  type: Classifier
  type: ContemporaryDerivation
  derived from: http://data.ga-group.nl/ics/bics/2020/11121110131010
  derived from: http://data.ga-group.nl/ics/bics/2024/11121110131010
  source accessed on: 2023-07-03T18:11:29Z
  source last accessed on: 2024-06-05T14:42:36Z
  definition: This segment includes companies that lease electric passenger vehicles.
  notation: 11121110131010
  valid from: 2020-10-03
source accessed on: 2023-07-03T18:11:29Z
source last accessed on: 2024-06-05T14:42:36Z
definition: This segment includes companies that lease electric passenger vehicles.
notation: 11121110131010
valid from: 2020-10-03

Passenger Veh Leasing - Fossil Fuels
type: BicsLevel7Segment
type: Classifier
type: NamedIndividual
is level7 segment of: Passenger Vehicle Leasing
created with: infer-bics.sql
derived from: Passenger Veh Leasing - Fossil Fuels
  type: BicsLevel7Segment
  type: Classifier
  type: ContemporaryDerivation
  derived from: http://data.ga-group.nl/ics/bics/2020/11121110131011
  derived from: http://data.ga-group.nl/ics/bics/2024/11121110131011
  source accessed on: 2023-07-03T18:11:29Z
  source last accessed on: 2024-06-05T14:42:36Z
  definition: This segment includes companies that lease fossil fuel passenger vehicles.
  notation: 11121110131011
  valid from: 2020-10-03
source accessed on: 2023-07-03T18:11:29Z
source last accessed on: 2024-06-05T14:42:36Z
definition: This segment includes companies that lease fossil fuel passenger vehicles.
notation: 11121110131011
valid from: 2020-10-03

Passenger Vehicle Leasing
type: BicsLevel6Segment
type: Classifier
type: NamedIndividual
is level6 segment of: Passenger Car Rental & Leasing
replaces: Passenger Vehicle Leasing
created with: infer-bics.sql
derived from: Passenger Vehicle Leasing
  type: BicsLevel5Segment
  type: Classifier
  type: AnachronousDerivation
  derived from: http://data.ga-group.nl/ics/bics/2014/1120101310
  source accessed on: 2019-12-03T20:05:01Z
  source last accessed on: 2019-12-03T20:05:01Z
  definition: This segment includes companies that lease passenger cars without drivers.
  notation: 1120101310
  valid from: 2014-08-08
  valid till: 2020-10-03
derived from: Passenger Vehicle Leasing
  type: BicsLevel6Segment
  type: Classifier
  type: ContemporaryDerivation
  derived from: http://data.ga-group.nl/ics/bics/2020/111211101310
  derived from: http://data.ga-group.nl/ics/bics/2024/111211101310
  source accessed on: 2023-07-03T18:11:29Z
  source last accessed on: 2024-06-05T14:42:36Z
  definition: This segment includes companies that lease passenger cars. Excludes companies that provide a driver for the vehicle (see Taxi Services).
  notation: 111211101310
  valid from: 2020-10-03
source accessed on: 2023-07-03T18:11:29Z
source last accessed on: 2024-06-05T14:42:36Z
definition: This segment includes companies that lease passenger cars. Excludes companies that provide a driver for the vehicle (see Taxi Services).
notation: 111211101310
valid from: 2020-10-03

Passenger Veh Rental - Electric
type: BicsLevel7Segment
type: Classifier
type: NamedIndividual
is level7 segment of: Passenger Vehicle Rental
created with: infer-bics.sql
derived from: Passenger Veh Rental - Electric
  type: BicsLevel7Segment
  type: Classifier
  type: ContemporaryDerivation
  derived from: http://data.ga-group.nl/ics/bics/2020/11121110131110
  derived from: http://data.ga-group.nl/ics/bics/2024/11121110131110
  source accessed on: 2023-07-03T18:11:29Z
  source last accessed on: 2024-06-05T14:42:36Z
  definition: This segment includes companies that rent electric passenger vehicles.
  notation: 11121110131110
  valid from: 2020-10-03
source accessed on: 2023-07-03T18:11:29Z
source last accessed on: 2024-06-05T14:42:36Z
definition: This segment includes companies that rent electric passenger vehicles.
notation: 11121110131110
valid from: 2020-10-03

Passenger Veh Rental - Fossil Fuels
type: BicsLevel7Segment
type: Classifier
type: NamedIndividual
is level7 segment of: Passenger Vehicle Rental
created with: infer-bics.sql
derived from: Passenger Veh Rental - Fossil Fuels
  type: BicsLevel7Segment
  type: Classifier
  type: ContemporaryDerivation
  derived from: http://data.ga-group.nl/ics/bics/2020/11121110131111
  derived from: http://data.ga-group.nl/ics/bics/2024/11121110131111
  source accessed on: 2023-07-03T18:11:29Z
  source last accessed on: 2024-06-05T14:42:36Z
  definition: This segment includes companies that rent fossil fuel passenger vehicles.
  notation: 11121110131111
  valid from: 2020-10-03
source accessed on: 2023-07-03T18:11:29Z
source last accessed on: 2024-06-05T14:42:36Z
definition: This segment includes companies that rent fossil fuel passenger vehicles.
notation: 11121110131111
valid from: 2020-10-03

Passenger Vehicle Rental
type: BicsLevel6Segment
type: Classifier
type: NamedIndividual
is level6 segment of: Passenger Car Rental & Leasing
replaces: Passenger Vehicle Rental
created with: infer-bics.sql
derived from: Passenger Vehicle Rental
  type: BicsLevel5Segment
  type: Classifier
  type: AnachronousDerivation
  derived from: http://data.ga-group.nl/ics/bics/2014/1120101311
  source accessed on: 2019-12-03T20:05:01Z
  source last accessed on: 2019-12-03T20:05:01Z
  definition: This segment includes companies that rent passenger cars without drivers.
  notation: 1120101311
  valid from: 2014-08-08
  valid till: 2020-10-03
derived from: Passenger Vehicle Rental
  type: BicsLevel6Segment
  type: Classifier
  type: ContemporaryDerivation
  derived from: http://data.ga-group.nl/ics/bics/2020/111211101311
  derived from: http://data.ga-group.nl/ics/bics/2024/111211101311
  source accessed on: 2023-07-03T18:11:29Z
  source last accessed on: 2024-06-05T14:42:36Z
  definition: This segment includes companies that rent passenger cars. Excludes companies that provide a driver for the vehicle (see Taxi Services).
  notation: 111211101311
  valid from: 2020-10-03
source accessed on: 2023-07-03T18:11:29Z
source last accessed on: 2024-06-05T14:42:36Z
definition: This segment includes companies that rent passenger cars. Excludes companies that provide a driver for the vehicle (see Taxi Services).
notation: 111211101311
valid from: 2020-10-03

Passenger Car Rental & Leasing
type: BicsLevel5Segment
type: Classifier
type: NamedIndividual
is level5 segment of: Automotive Retailers
created with: infer-bics.sql
derived from: Passenger Car Rental & Leasing
  type: BicsLevel4SubIndustry
  type: Classifier
  type: AnachronousDerivation
  derived from: http://data.ga-group.nl/ics/bics/2014/11201013
  source accessed on: 2019-12-03T20:05:01Z
  source last accessed on: 2019-12-03T20:05:01Z
  definition: This industry subgroup includes companies that rent and lease passenger cars.
  notation: 11201013
  valid from: 2014-08-08
  valid till: 2020-10-03
derived from: Passenger Car Rental & Leasing
  type: BicsLevel5Segment
  type: Classifier
  type: ContemporaryDerivation
  derived from: http://data.ga-group.nl/ics/bics/2020/1112111013
  derived from: http://data.ga-group.nl/ics/bics/2024/1112111013
  source accessed on: 2023-07-03T18:11:29Z
  source last accessed on: 2024-06-05T14:42:36Z
  definition: This segment includes companies that rent and lease passenger cars.
  notation: 1112111013
  valid from: 2020-10-03
source accessed on: 2023-07-03T18:11:29Z
source last accessed on: 2024-06-05T14:42:36Z
definition: This segment includes companies that rent and lease passenger cars.
notation: 1112111013
valid from: 2020-10-03

Automotive Retailers
type: BicsLevel4SubIndustry
type: Classifier
type: NamedIndividual
replaces: Automotive Retailers
created with: infer-bics.sql
derived from: Arch & Decorative Coatings
  type: BicsLevel4SubIndustry
  type: Classifier
  type: ContemporaryDerivation
  derived from: http://data.ga-group.nl/ics/bics/2014/11121110
  source accessed on: 2019-12-03T20:05:01Z
  source last accessed on: 2019-12-03T20:05:01Z
  definition: This industry subgroup includes companies that manufacture wallpaper.
  notation: 11121110
  valid from: 2014-08-08
  valid till: 2020-10-03
derived from: Automotive Retailers
  type: BicsLevel3Industry
  type: Classifier
  type: AnachronousDerivation
  derived from: http://data.ga-group.nl/ics/bics/2014/112010
  source accessed on: 2019-12-03T20:05:01Z
  source last accessed on: 2019-12-03T20:05:01Z
  definition: This industry includes companies that retail automotive parts and products. Such companies may also provide repair and maintenance services.
  notation: 112010
  valid from: 2014-08-08
  valid till: 2020-10-03
derived from: Automotive Retailers
  type: BicsLevel4SubIndustry
  type: Classifier
  type: ContemporaryDerivation
  derived from: http://data.ga-group.nl/ics/bics/2020/11121110
  derived from: http://data.ga-group.nl/ics/bics/2024/11121110
  source accessed on: 2023-07-03T18:11:29Z
  source last accessed on: 2024-06-05T14:42:36Z
  definition: This industry subgroup includes stores that specialize in retailing automotive parts and products. Such companies may also provide related repair or rental services.
  notation: 11121110
  valid from: 2020-10-03
source accessed on: 2019-12-03T20:05:01Z
source last accessed on: 2024-06-05T14:42:36Z
definition: This industry subgroup includes stores that specialize in retailing automotive parts and products. Such companies may also provide related repair or rental services.
notation: 11121110
valid from: 2014-08-08

Mail Catalog Retailers
type: BicsLevel5Segment
type: Classifier
type: NamedIndividual
is level5 segment of: Catalog & TV Based Retailers
is replaced by: Carpet Flooring
created with: infer-bics.sql
derived from: Carpets & Rugs
  type: BicsLevel5Segment
  type: Classifier
  type: ContemporaryDerivation
  derived from: http://data.ga-group.nl/ics/bics/2014/1112111110
  source accessed on: 2019-12-03T20:05:01Z
  source last accessed on: 2019-12-03T20:05:01Z
  definition: This segment includes companies that mill carpets and rugs.
  notation: 1112111110
  valid from: 2014-08-08
  valid till: 2020-10-03
derived from: Mail Catalog Retailers
  type: BicsLevel4SubIndustry
  type: Classifier
  type: AnachronousDerivation
  derived from: http://data.ga-group.nl/ics/bics/2014/11201110
  source accessed on: 2019-12-03T20:05:01Z
  source last accessed on: 2019-12-03T20:05:01Z
  definition: This industry subgroup includes companies that retail all types of merchandise using mail catalogs to generate clients and display merchandise as well as companies that retail from catalog showrooms of mail-order houses.
  notation: 11201110
  valid from: 2014-08-08
  valid till: 2020-10-03
derived from: Mail Catalog Retailers
  type: BicsLevel5Segment
  type: Classifier
  type: ContemporaryDerivation
  derived from: http://data.ga-group.nl/ics/bics/2020/1112111110
  derived from: http://data.ga-group.nl/ics/bics/2024/1112111110
  source accessed on: 2023-07-03T18:11:29Z
  source last accessed on: 2024-06-05T14:42:36Z
  definition: This segment includes companies that retail merchandise through mail catalog as well as companies that retail from catalog showrooms.
  notation: 1112111110
  valid from: 2020-10-03
source accessed on: 2019-12-03T20:05:01Z
source last accessed on: 2024-06-05T14:42:36Z
definition: This segment includes companies that retail merchandise through mail catalog as well as companies that retail from catalog showrooms.
notation: 1112111110
valid from: 2014-08-08

Multi-Level Marketing
type: BicsLevel5Segment
type: Classifier
type: NamedIndividual
is level5 segment of: Catalog & TV Based Retailers
is replaced by: Tile Flooring
created with: infer-bics.sql
derived from: Ceramic Wall & Floor Tiles
  type: BicsLevel5Segment
  type: Classifier
  type: ContemporaryDerivation
  derived from: http://data.ga-group.nl/ics/bics/2014/1112111111
  source accessed on: 2019-12-03T20:05:01Z
  source last accessed on: 2019-12-03T20:05:01Z
  definition: This segment includes companies that manufacture ceramic wall and floor tiles.
  notation: 1112111111
  valid from: 2014-08-08
  valid till: 2020-10-03
derived from: Multi-Level Marketing
  type: BicsLevel4SubIndustry
  type: Classifier
  type: AnachronousDerivation
  derived from: http://data.ga-group.nl/ics/bics/2014/11201111
  source accessed on: 2019-12-03T20:05:01Z
  source last accessed on: 2019-12-03T20:05:01Z
  definition: This industry subgroup includes companies that sell consumer products through a direct sales force.
  notation: 11201111
  valid from: 2014-08-08
  valid till: 2020-10-03
derived from: Multi-Level Marketing
  type: BicsLevel5Segment
  type: Classifier
  type: ContemporaryDerivation
  derived from: http://data.ga-group.nl/ics/bics/2020/1112111111
  derived from: http://data.ga-group.nl/ics/bics/2024/1112111111
  source accessed on: 2023-07-03T18:11:29Z
  source last accessed on: 2024-06-05T14:42:36Z
  definition: This segment includes companies that sell consumer products through a direct sales force.
  notation: 1112111111
  valid from: 2020-10-03
source accessed on: 2019-12-03T20:05:01Z
source last accessed on: 2024-06-05T14:42:36Z
definition: This segment includes companies that sell consumer products through a direct sales force.
notation: 1112111111
valid from: 2014-08-08

TV Based Retailers
type: BicsLevel5Segment
type: Classifier
type: NamedIndividual
is level5 segment of: Catalog & TV Based Retailers
is replaced by: Laminate & Wood Flooring
created with: infer-bics.sql
derived from: Hardwood Flooring
  type: BicsLevel5Segment
  type: Classifier
  type: ContemporaryDerivation
  derived from: http://data.ga-group.nl/ics/bics/2014/1112111112
  source accessed on: 2019-12-03T20:05:01Z
  source last accessed on: 2019-12-03T20:05:01Z
  definition: This segment includes companies that plane and finish wood strips for unassembled wood flooring.
  notation: 1112111112
  valid from: 2014-08-08
  valid till: 2020-10-03
derived from: TV Based Retailers
  type: BicsLevel4SubIndustry
  type: Classifier
  type: AnachronousDerivation
  derived from: http://data.ga-group.nl/ics/bics/2014/11201112
  source accessed on: 2019-12-03T20:05:01Z
  source last accessed on: 2019-12-03T20:05:01Z
  definition: This industry subgroup includes companies that retail all types of merchandise using television to generate clients and display merchandise.
  notation: 11201112
  valid from: 2014-08-08
  valid till: 2020-10-03
derived from: TV Based Retailers
  type: BicsLevel5Segment
  type: Classifier
  type: ContemporaryDerivation
  derived from: http://data.ga-group.nl/ics/bics/2020/1112111112
  derived from: http://data.ga-group.nl/ics/bics/2024/1112111112
  source accessed on: 2023-07-03T18:11:29Z
  source last accessed on: 2024-06-05T14:42:36Z
  definition: This segment includes companies that retail merchandise through television.
  notation: 1112111112
  valid from: 2020-10-03
source accessed on: 2019-12-03T20:05:01Z
source last accessed on: 2024-06-05T14:42:36Z
definition: This segment includes companies that retail merchandise through television.
notation: 1112111112
valid from: 2014-08-08

Resilient Floor Covering
type: BicsLevel5Segment
type: Classifier
type: NamedIndividual
is level5 segment of: Catalog & TV Based Retailers
is replaced by: Vinyl Flooring
created with: infer-bics.sql
derived from: Resilient Floor Covering
  type: BicsLevel5Segment
  type: Classifier
  type: ContemporaryDerivation
  derived from: http://data.ga-group.nl/ics/bics/2014/1112111113
  source accessed on: 2019-12-03T20:05:01Z
  source last accessed on: 2019-12-03T20:05:01Z
  definition: This segment includes companies that manufacture vinyl and linoleum floor covering.
  notation: 1112111113
  valid from: 2014-08-08
  valid till: 2020-10-03
source accessed on: 2019-12-03T20:05:01Z
source last accessed on: 2019-12-03T20:05:01Z
definition: This segment includes companies that manufacture vinyl and linoleum floor covering.
notation: 1112111113
valid from: 2014-08-08
valid till: 2020-10-03

Catalog & TV Based Retailers
type: BicsLevel4SubIndustry
type: Classifier
type: NamedIndividual
replaces: Catalog & TV Based Retailers
created with: infer-bics.sql
derived from: Flooring Products
  type: BicsLevel4SubIndustry
  type: Classifier
  type: ContemporaryDerivation
  derived from: http://data.ga-group.nl/ics/bics/2014/11121111
  source accessed on: 2019-12-03T20:05:01Z
  source last accessed on: 2019-12-03T20:05:01Z
  definition: This industry subgroup includes companies that manufacture flooring products. Products include carpet, hardwood, tile, resilient, vinyl and laminate flooring.
  notation: 11121111
  valid from: 2014-08-08
  valid till: 2020-10-03
derived from: Catalog & TV Based Retailers
  type: BicsLevel3Industry
  type: Classifier
  type: AnachronousDerivation
  derived from: http://data.ga-group.nl/ics/bics/2014/112011
  source accessed on: 2019-12-03T20:05:01Z
  source last accessed on: 2019-12-03T20:05:01Z
  definition: This industry includes companies that retail all types of merchandise using mail catalogs or television to generate clients and display merchandise. Included in this industry are companies that retail from catalog showrooms of mail-order houses as well as companies providing a combination of Internet and mail-order sales.
  notation: 112011
  valid from: 2014-08-08
  valid till: 2020-10-03
derived from: Catalog & TV Based Retailers
  type: BicsLevel4SubIndustry
  type: Classifier
  type: ContemporaryDerivation
  derived from: http://data.ga-group.nl/ics/bics/2020/11121111
  derived from: http://data.ga-group.nl/ics/bics/2024/11121111
  source accessed on: 2023-07-03T18:11:29Z
  source last accessed on: 2024-06-05T14:42:36Z
  definition: This industry subgroup includes companies that retail merchandise through mail catalogs or television.
  notation: 11121111
  valid from: 2020-10-03
source accessed on: 2019-12-03T20:05:01Z
source last accessed on: 2024-06-05T14:42:36Z
definition: This industry subgroup includes companies that retail merchandise through mail catalogs or television.
notation: 11121111
valid from: 2014-08-08

Consumer Electronics Stores
type: BicsLevel5Segment
type: Classifier
type: NamedIndividual
is level5 segment of: Electronics & Appliances Stores
is replaced by: Heating & Cooling Appliances
created with: infer-bics.sql
derived from: Electric Housewares & Fans
  type: BicsLevel5Segment
  type: Classifier
  type: ContemporaryDerivation
  derived from: http://data.ga-group.nl/ics/bics/2014/1112111210
  source accessed on: 2019-12-03T20:05:01Z
  source last accessed on: 2019-12-03T20:05:01Z
  definition: This segment includes companies that manufacture small household electrical appliances and housewares.
  notation: 1112111210
  valid from: 2014-08-08
  valid till: 2020-10-03
derived from: Consumer Electronics Stores
  type: BicsLevel4SubIndustry
  type: Classifier
  type: AnachronousDerivation
  derived from: http://data.ga-group.nl/ics/bics/2014/11201211
  source accessed on: 2019-12-03T20:05:01Z
  source last accessed on: 2019-12-03T20:05:01Z
  definition: This industry subgroup includes companies that retail consumer electronic products. This can include Internet sales of brick-and-mortar stores.
  notation: 11201211
  valid from: 2014-08-08
  valid till: 2020-10-03
derived from: Consumer Electronics Stores
  type: BicsLevel5Segment
  type: Classifier
  type: ContemporaryDerivation
  derived from: http://data.ga-group.nl/ics/bics/2020/1112111210
  derived from: http://data.ga-group.nl/ics/bics/2024/1112111210
  source accessed on: 2023-07-03T18:11:29Z
  source last accessed on: 2024-06-05T14:42:36Z
  definition: This segment includes stores that specialize in retailing consumer electronics.
  notation: 1112111210
  valid from: 2020-10-03
source accessed on: 2019-12-03T20:05:01Z
source last accessed on: 2024-06-05T14:42:36Z
definition: This segment includes stores that specialize in retailing consumer electronics.
notation: 1112111210
valid from: 2014-08-08

Household Appliance Stores
type: BicsLevel5Segment
type: Classifier
type: NamedIndividual
is level5 segment of: Electronics & Appliances Stores
is replaced by: Cooking Appliances
created with: infer-bics.sql
derived from: Household Cooking Appliances
  type: BicsLevel5Segment
  type: Classifier
  type: ContemporaryDerivation
  derived from: http://data.ga-group.nl/ics/bics/2014/1112111211
  source accessed on: 2019-12-03T20:05:01Z
  source last accessed on: 2019-12-03T20:05:01Z
  definition: This segment includes companies that manufacture household cooking equipment.
  notation: 1112111211
  valid from: 2014-08-08
  valid till: 2020-10-03
derived from: Household Appliance Stores
  type: BicsLevel4SubIndustry
  type: Classifier
  type: AnachronousDerivation
  derived from: http://data.ga-group.nl/ics/bics/2014/11201212
  source accessed on: 2019-12-03T20:05:01Z
  source last accessed on: 2019-12-03T20:05:01Z
  definition: This industry subgroup includes companies that retail household appliances. This can include Internet sales of brick-and-mortar stores.
  notation: 11201212
  valid from: 2014-08-08
  valid till: 2020-10-03
derived from: Household Appliance Stores
  type: BicsLevel5Segment
  type: Classifier
  type: ContemporaryDerivation
  derived from: http://data.ga-group.nl/ics/bics/2020/1112111211
  derived from: http://data.ga-group.nl/ics/bics/2024/1112111211
  source accessed on: 2023-07-03T18:11:29Z
  source last accessed on: 2024-06-05T14:42:36Z
  definition: This segment includes stores that specialize in retailing household appliances.
  notation: 1112111211
  valid from: 2020-10-03
source accessed on: 2019-12-03T20:05:01Z
source last accessed on: 2024-06-05T14:42:36Z
definition: This segment includes stores that specialize in retailing household appliances.
notation: 1112111211
valid from: 2014-08-08

Household Laundry Equipment
type: BicsLevel5Segment
type: Classifier
type: NamedIndividual
is level5 segment of: Electronics & Appliances Stores
is replaced by: Washers & Dryers
created with: infer-bics.sql
derived from: Household Laundry Equipment
  type: BicsLevel5Segment
  type: Classifier
  type: ContemporaryDerivation
  derived from: http://data.ga-group.nl/ics/bics/2014/1112111212
  source accessed on: 2019-12-03T20:05:01Z
  source last accessed on: 2019-12-03T20:05:01Z
  definition: This segment includes companies that manufacture household laundry equipment.
  notation: 1112111212
  valid from: 2014-08-08
  valid till: 2020-10-03
source accessed on: 2019-12-03T20:05:01Z
source last accessed on: 2019-12-03T20:05:01Z
definition: This segment includes companies that manufacture household laundry equipment.
notation: 1112111212
valid from: 2014-08-08
valid till: 2020-10-03

Household Fridges & Freezers
type: BicsLevel5Segment
type: Classifier
type: NamedIndividual
is level5 segment of: Electronics & Appliances Stores
is replaced by: Refrigerators & Freezers
created with: infer-bics.sql
derived from: Household Fridges & Freezers
  type: BicsLevel5Segment
  type: Classifier
  type: ContemporaryDerivation
  derived from: http://data.ga-group.nl/ics/bics/2014/1112111213
  source accessed on: 2019-12-03T20:05:01Z
  source last accessed on: 2019-12-03T20:05:01Z
  definition: This segment includes companies that manufacture household refrigerators and freezers.
  notation: 1112111213
  valid from: 2014-08-08
  valid till: 2020-10-03
source accessed on: 2019-12-03T20:05:01Z
source last accessed on: 2019-12-03T20:05:01Z
definition: This segment includes companies that manufacture household refrigerators and freezers.
notation: 1112111213
valid from: 2014-08-08
valid till: 2020-10-03

Household Vacuum Cleaners
type: BicsLevel5Segment
type: Classifier
type: NamedIndividual
is level5 segment of: Electronics & Appliances Stores
is replaced by: Vacuum Cleaners
created with: infer-bics.sql
derived from: Household Vacuum Cleaners
  type: BicsLevel5Segment
  type: Classifier
  type: ContemporaryDerivation
  derived from: http://data.ga-group.nl/ics/bics/2014/1112111214
  source accessed on: 2019-12-03T20:05:01Z
  source last accessed on: 2019-12-03T20:05:01Z
  definition: This segment includes companies that manufacture household vacuum cleaners and floor waxing and carpet cleaning machines.
  notation: 1112111214
  valid from: 2014-08-08
  valid till: 2020-10-03
source accessed on: 2019-12-03T20:05:01Z
source last accessed on: 2019-12-03T20:05:01Z
definition: This segment includes companies that manufacture household vacuum cleaners and floor waxing and carpet cleaning machines.
notation: 1112111214
valid from: 2014-08-08
valid till: 2020-10-03

Other Household Appliances
type: BicsLevel5Segment
type: Classifier
type: NamedIndividual
is level5 segment of: Electronics & Appliances Stores
created with: infer-bics.sql
derived from: Other Household Appliances
  type: BicsLevel5Segment
  type: Classifier
  type: ContemporaryDerivation
  derived from: http://data.ga-group.nl/ics/bics/2014/1112111215
  source accessed on: 2019-12-03T20:05:01Z
  source last accessed on: 2019-12-03T20:05:01Z
  definition: This segment includes companies that manufacture major electrical and non-electrical appliances that are not elsewhere classified.
  notation: 1112111215
  valid from: 2014-08-08
  valid till: 2020-10-03
source accessed on: 2019-12-03T20:05:01Z
source last accessed on: 2019-12-03T20:05:01Z
definition: This segment includes companies that manufacture major electrical and non-electrical appliances that are not elsewhere classified.
notation: 1112111215
valid from: 2014-08-08
valid till: 2020-10-03

Electronics & Appliances Stores
type: BicsLevel4SubIndustry
type: Classifier
type: NamedIndividual
replaces: Consumer Elec & Applc Stores
created with: infer-bics.sql
derived from: Household Appliances
  type: BicsLevel4SubIndustry
  type: Classifier
  type: ContemporaryDerivation
  derived from: http://data.ga-group.nl/ics/bics/2014/11121112
  source accessed on: 2019-12-03T20:05:01Z
  source last accessed on: 2019-12-03T20:05:01Z
  definition: This industry subgroup includes companies that manufacture electric housewares, fans, vacuum cleaners, cooking appliances, and major household appliances including refrigerators, freezers, and laundry equipment.
  notation: 11121112
  valid from: 2014-08-08
  valid till: 2020-10-03
derived from: Consumer Elec & Applc Stores
  type: BicsLevel3Industry
  type: Classifier
  type: AnachronousDerivation
  derived from: http://data.ga-group.nl/ics/bics/2014/112012
  source accessed on: 2019-12-03T20:05:01Z
  source last accessed on: 2019-12-03T20:05:01Z
  definition: This industry includes stores that retail computers and peripherals, video game consoles, off-the-shelf software, video games, household appliances, mobile devices and tablets.
  notation: 112012
  valid from: 2014-08-08
  valid till: 2020-10-03
derived from: Electronics & Appliances Stores
  type: BicsLevel4SubIndustry
  type: Classifier
  type: ContemporaryDerivation
  derived from: http://data.ga-group.nl/ics/bics/2020/11121112
  derived from: http://data.ga-group.nl/ics/bics/2024/11121112
  source accessed on: 2023-07-03T18:11:29Z
  source last accessed on: 2024-06-05T14:42:36Z
  definition: This industry subgroup includes stores that specialize in retailing consumer electronics, appliances, and other technology focused products.
  notation: 11121112
  valid from: 2020-10-03
source accessed on: 2019-12-03T20:05:01Z
source last accessed on: 2024-06-05T14:42:36Z
definition: This industry subgroup includes stores that specialize in retailing consumer electronics, appliances, and other technology focused products.
notation: 11121112
valid from: 2014-08-08

High-End Department Stores
type: BicsLevel5Segment
type: Classifier
type: NamedIndividual
is level5 segment of: Department Stores
created with: infer-bics.sql
derived from: High-End Department Stores
  type: BicsLevel4SubIndustry
  type: Classifier
  type: AnachronousDerivation
  derived from: http://data.ga-group.nl/ics/bics/2014/11201310
  source accessed on: 2019-12-03T20:05:01Z
  source last accessed on: 2019-12-03T20:05:01Z
  definition: This industry subgroup includes department stores that have separate departments for various merchandise lines, such as apparel, jewelry, home furnishings and linens, each with separate cash registers and sales associates. These are generally companies that target high-income families. This can include Internet sales of brick-and-mortar stores.
  notation: 11201310
  valid from: 2014-08-08
  valid till: 2020-10-03
derived from: High-End Department Stores
  type: BicsLevel5Segment
  type: Classifier
  type: ContemporaryDerivation
  derived from: http://data.ga-group.nl/ics/bics/2020/1112111310
  derived from: http://data.ga-group.nl/ics/bics/2024/1112111310
  source accessed on: 2023-07-03T18:11:29Z
  source last accessed on: 2024-06-05T14:42:36Z
  definition: This segment includes department stores that retail high-end and luxury products.
  notation: 1112111310
  valid from: 2020-10-03
source accessed on: 2023-07-03T18:11:29Z
source last accessed on: 2024-06-05T14:42:36Z
definition: This segment includes department stores that retail high-end and luxury products.
notation: 1112111310
valid from: 2020-10-03

Mid-Tier Department Stores
type: BicsLevel5Segment
type: Classifier
type: NamedIndividual
is level5 segment of: Department Stores
created with: infer-bics.sql
derived from: Mid-Tier Department Stores
  type: BicsLevel4SubIndustry
  type: Classifier
  type: AnachronousDerivation
  derived from: http://data.ga-group.nl/ics/bics/2014/11201311
  source accessed on: 2019-12-03T20:05:01Z
  source last accessed on: 2019-12-03T20:05:01Z
  definition: This industry subgroup includes department stores that have separate departments for various merchandise lines, such as apparel, jewelry, home furnishings and linens, each with separate cash registers and sales associates. These are generally on-mall companies that target mid-income and low-income families. This can include Internet sales of brick-and-mortar stores.
  notation: 11201311
  valid from: 2014-08-08
  valid till: 2020-10-03
derived from: Mid-Tier Department Stores
  type: BicsLevel5Segment
  type: Classifier
  type: ContemporaryDerivation
  derived from: http://data.ga-group.nl/ics/bics/2020/1112111311
  derived from: http://data.ga-group.nl/ics/bics/2024/1112111311
  source accessed on: 2023-07-03T18:11:29Z
  source last accessed on: 2024-06-05T14:42:36Z
  definition: This segment includes department stores that retail low and mid-price products.
  notation: 1112111311
  valid from: 2020-10-03
source accessed on: 2023-07-03T18:11:29Z
source last accessed on: 2024-06-05T14:42:36Z
definition: This segment includes department stores that retail low and mid-price products.
notation: 1112111311
valid from: 2020-10-03

Department Stores
type: BicsLevel4SubIndustry
type: Classifier
type: NamedIndividual
replaces: Department Stores
created with: infer-bics.sql
derived from: Kitchen Cabinets & Countertops
  type: BicsLevel4SubIndustry
  type: Classifier
  type: ContemporaryDerivation
  derived from: http://data.ga-group.nl/ics/bics/2014/11121113
  source accessed on: 2019-12-03T20:05:01Z
  source last accessed on: 2019-12-03T20:05:01Z
  definition: This industry subgroup includes companies that manufacture wood cabinets and countertops for kitchens and bathrooms.
  notation: 11121113
  valid from: 2014-08-08
  valid till: 2020-10-03
derived from: Department Stores
  type: BicsLevel3Industry
  type: Classifier
  type: AnachronousDerivation
  derived from: http://data.ga-group.nl/ics/bics/2014/112013
  source accessed on: 2019-12-03T20:05:01Z
  source last accessed on: 2019-12-03T20:05:01Z
  definition: This industry includes establishments known as department stores that have separate departments for various merchandise lines, such as apparel, jewelry, home furnishings and linens, each with separate cash registers and sales associates.
  notation: 112013
  valid from: 2014-08-08
  valid till: 2020-10-03
derived from: Department Stores
  type: BicsLevel4SubIndustry
  type: Classifier
  type: ContemporaryDerivation
  derived from: http://data.ga-group.nl/ics/bics/2020/11121113
  derived from: http://data.ga-group.nl/ics/bics/2024/11121113
  source accessed on: 2023-07-03T18:11:29Z
  source last accessed on: 2024-06-05T14:42:36Z
  definition: This industry subgroup includes retail stores with separate departments for various merchandise lines, such as apparel, jewelry, home furnishings, and linens, each with separate cash registers and sales associates.
  notation: 11121113
  valid from: 2020-10-03
source accessed on: 2019-12-03T20:05:01Z
source last accessed on: 2024-06-05T14:42:36Z
definition: This industry subgroup includes retail stores with separate departments for various merchandise lines, such as apparel, jewelry, home furnishings, and linens, each with separate cash registers and sales associates.
notation: 11121113
valid from: 2014-08-08

Brick & Stone Bldg Matl Dealers
type: BicsLevel6Segment
type: Classifier
type: NamedIndividual
is level6 segment of: Building Materials Dealers
replaces: Brick & Stone Bldg Matl Dealers
created with: infer-bics.sql
derived from: Brick & Stone Bldg Matl Dealers
  type: BicsLevel5Segment
  type: Classifier
  type: AnachronousDerivation
  derived from: http://data.ga-group.nl/ics/bics/2014/1120151010
  source accessed on: 2019-12-03T20:05:01Z
  source last accessed on: 2019-12-03T20:05:01Z
  definition: This segment includes companies that wholesale and distribute building materials and products, such as brick, stone and related construction materials.
  notation: 1120151010
  valid from: 2014-08-08
  valid till: 2020-10-03
derived from: Brick & Stone Bldg Matl Dealers
  type: BicsLevel6Segment
  type: Classifier
  type: ContemporaryDerivation
  derived from: http://data.ga-group.nl/ics/bics/2020/111211141010
  derived from: http://data.ga-group.nl/ics/bics/2024/111211141010
  source accessed on: 2023-07-03T18:11:29Z
  source last accessed on: 2024-06-05T14:42:36Z
  definition: This segment includes companies that wholesale and distribute brick, stone, and related construction materials.
  notation: 111211141010
  valid from: 2020-10-03
source accessed on: 2023-07-03T18:11:29Z
source last accessed on: 2024-06-05T14:42:36Z
definition: This segment includes companies that wholesale and distribute brick, stone, and related construction materials.
notation: 111211141010
valid from: 2020-10-03

Plumbing & HVAC Dealers
type: BicsLevel6Segment
type: Classifier
type: NamedIndividual
is level6 segment of: Building Materials Dealers
replaces: Plumbing & HVAC Dealers
created with: infer-bics.sql
derived from: Plumbing & HVAC Dealers
  type: BicsLevel5Segment
  type: Classifier
  type: AnachronousDerivation
  derived from: http://data.ga-group.nl/ics/bics/2014/1120151011
  source accessed on: 2019-12-03T20:05:01Z
  source last accessed on: 2019-12-03T20:05:01Z
  definition: This segment includes companies that wholesale and distribute consumer-grade plumbing and heating equipment and supplies. Excludes commercial-grade products (see Industrial Equip & Supplies Distr).
  notation: 1120151011
  valid from: 2014-08-08
  valid till: 2020-10-03
derived from: Plumbing & HVAC Dealers
  type: BicsLevel6Segment
  type: Classifier
  type: ContemporaryDerivation
  derived from: http://data.ga-group.nl/ics/bics/2020/111211141011
  derived from: http://data.ga-group.nl/ics/bics/2024/111211141011
  source accessed on: 2023-07-03T18:11:29Z
  source last accessed on: 2024-06-05T14:42:36Z
  definition: This segment includes companies that wholesale and distribute consumer-grade plumbing and heating equipment and supplies. Excludes commercial-grade products (see Industrial Equip & Supplies Distr).
  notation: 111211141011
  valid from: 2020-10-03
source accessed on: 2023-07-03T18:11:29Z
source last accessed on: 2024-06-05T14:42:36Z
definition: This segment includes companies that wholesale and distribute consumer-grade plumbing and heating equipment and supplies. Excludes commercial-grade products (see Industrial Equip & Supplies Distr).
notation: 111211141011
valid from: 2020-10-03

Roof, Siding & Insulation Distr
type: BicsLevel6Segment
type: Classifier
type: NamedIndividual
is level6 segment of: Building Materials Dealers
replaces: Roof, Siding & Insulation Distr
created with: infer-bics.sql
derived from: Roof, Siding & Insulation Distr
  type: BicsLevel5Segment
  type: Classifier
  type: AnachronousDerivation
  derived from: http://data.ga-group.nl/ics/bics/2014/1120151012
  source accessed on: 2019-12-03T20:05:01Z
  source last accessed on: 2019-12-03T20:05:01Z
  definition: This segment includes companies that wholesale and distribute building materials and products, such as roofing, siding and insulation materials.
  notation: 1120151012
  valid from: 2014-08-08
  valid till: 2020-10-03
derived from: Roof, Siding & Insulation Distr
  type: BicsLevel6Segment
  type: Classifier
  type: ContemporaryDerivation
  derived from: http://data.ga-group.nl/ics/bics/2020/111211141012
  derived from: http://data.ga-group.nl/ics/bics/2024/111211141012
  source accessed on: 2023-07-03T18:11:29Z
  source last accessed on: 2024-06-05T14:42:36Z
  definition: This segment includes companies that wholesale and distribute roofing, siding, and insulation materials.
  notation: 111211141012
  valid from: 2020-10-03
source accessed on: 2023-07-03T18:11:29Z
source last accessed on: 2024-06-05T14:42:36Z
definition: This segment includes companies that wholesale and distribute roofing, siding, and insulation materials.
notation: 111211141012
valid from: 2020-10-03

Wood Products Dealers
type: BicsLevel6Segment
type: Classifier
type: NamedIndividual
is level6 segment of: Building Materials Dealers
replaces: Wood Products Dealers
created with: infer-bics.sql
derived from: Wood Products Dealers
  type: BicsLevel5Segment
  type: Classifier
  type: AnachronousDerivation
  derived from: http://data.ga-group.nl/ics/bics/2014/1120151013
  source accessed on: 2019-12-03T20:05:01Z
  source last accessed on: 2019-12-03T20:05:01Z
  definition: This segment includes companies that wholesale and distribute building materials, such as lumber, plywood, millwork and related product materials.
  notation: 1120151013
  valid from: 2014-08-08
  valid till: 2020-10-03
derived from: Wood Products Dealers
  type: BicsLevel6Segment
  type: Classifier
  type: ContemporaryDerivation
  derived from: http://data.ga-group.nl/ics/bics/2020/111211141013
  derived from: http://data.ga-group.nl/ics/bics/2024/111211141013
  source accessed on: 2023-07-03T18:11:29Z
  source last accessed on: 2024-06-05T14:42:36Z
  definition: This segment includes companies that wholesale and distribute lumber, plywood, millwork, and related wood products.
  notation: 111211141013
  valid from: 2020-10-03
source accessed on: 2023-07-03T18:11:29Z
source last accessed on: 2024-06-05T14:42:36Z
definition: This segment includes companies that wholesale and distribute lumber, plywood, millwork, and related wood products.
notation: 111211141013
valid from: 2020-10-03

Building Materials Dealers
type: BicsLevel5Segment
type: Classifier
type: NamedIndividual
is level5 segment of: Home Products Stores
created with: infer-bics.sql
derived from: Building Materials Dealers
  type: BicsLevel4SubIndustry
  type: Classifier
  type: AnachronousDerivation
  derived from: http://data.ga-group.nl/ics/bics/2014/11201510
  source accessed on: 2019-12-03T20:05:01Z
  source last accessed on: 2019-12-03T20:05:01Z
  definition: This industry subgroup includes companies that wholesale and distribute building materials and products. These building materials and products are utilized for use in homebuilding and other retail-orientated applications.
  notation: 11201510
  valid from: 2014-08-08
  valid till: 2020-10-03
derived from: Building Materials Dealers
  type: BicsLevel5Segment
  type: Classifier
  type: ContemporaryDerivation
  derived from: http://data.ga-group.nl/ics/bics/2020/1112111410
  derived from: http://data.ga-group.nl/ics/bics/2024/1112111410
  source accessed on: 2023-07-03T18:11:29Z
  source last accessed on: 2024-06-05T14:42:36Z
  definition: This segment includes companies that wholesale and distribute building materials and products.
  notation: 1112111410
  valid from: 2020-10-03
source accessed on: 2023-07-03T18:11:29Z
source last accessed on: 2024-06-05T14:42:36Z
definition: This segment includes companies that wholesale and distribute building materials and products.
notation: 1112111410
valid from: 2020-10-03

Hardware Stores
type: BicsLevel6Segment
type: Classifier
type: NamedIndividual
is level6 segment of: Home Improvement Stores
replaces: Hardware Stores
created with: infer-bics.sql
derived from: Hardware Stores
  type: BicsLevel5Segment
  type: Classifier
  type: AnachronousDerivation
  derived from: http://data.ga-group.nl/ics/bics/2014/1120151310
  source accessed on: 2019-12-03T20:05:01Z
  source last accessed on: 2019-12-03T20:05:01Z
  definition: This segment includes companies that retail hardware. This can include Internet sales of brick-and-mortar stores.
  notation: 1120151310
  valid from: 2014-08-08
  valid till: 2020-10-03
derived from: Hardware Stores
  type: BicsLevel6Segment
  type: Classifier
  type: ContemporaryDerivation
  derived from: http://data.ga-group.nl/ics/bics/2020/111211141110
  derived from: http://data.ga-group.nl/ics/bics/2024/111211141110
  source accessed on: 2023-07-03T18:11:29Z
  source last accessed on: 2024-06-05T14:42:36Z
  definition: This segment includes small-format home improvement stores.
  notation: 111211141110
  valid from: 2020-10-03
source accessed on: 2023-07-03T18:11:29Z
source last accessed on: 2024-06-05T14:42:36Z
definition: This segment includes small-format home improvement stores.
notation: 111211141110
valid from: 2020-10-03

Home Centers
type: BicsLevel6Segment
type: Classifier
type: NamedIndividual
is level6 segment of: Home Improvement Stores
replaces: Home Centers
created with: infer-bics.sql
derived from: Home Centers
  type: BicsLevel5Segment
  type: Classifier
  type: AnachronousDerivation
  derived from: http://data.ga-group.nl/ics/bics/2014/1120151311
  source accessed on: 2019-12-03T20:05:01Z
  source last accessed on: 2019-12-03T20:05:01Z
  definition: This segment includes companies that retail home improvement materials and related merchandise. This can include Internet sales of brick-and-mortar stores.
  notation: 1120151311
  valid from: 2014-08-08
  valid till: 2020-10-03
derived from: Home Centers
  type: BicsLevel6Segment
  type: Classifier
  type: ContemporaryDerivation
  derived from: http://data.ga-group.nl/ics/bics/2020/111211141111
  derived from: http://data.ga-group.nl/ics/bics/2024/111211141111
  source accessed on: 2023-07-03T18:11:29Z
  source last accessed on: 2024-06-05T14:42:36Z
  definition: This segment includes big-box home improvement stores offering a diversified range of products and specific departments for various merchandise lines.
  notation: 111211141111
  valid from: 2020-10-03
source accessed on: 2023-07-03T18:11:29Z
source last accessed on: 2024-06-05T14:42:36Z
definition: This segment includes big-box home improvement stores offering a diversified range of products and specific departments for various merchandise lines.
notation: 111211141111
valid from: 2020-10-03

Nursery & Garden Centers
type: BicsLevel6Segment
type: Classifier
type: NamedIndividual
is level6 segment of: Home Improvement Stores
replaces: Nursery & Garden Centers
created with: infer-bics.sql
derived from: Nursery & Garden Centers
  type: BicsLevel5Segment
  type: Classifier
  type: AnachronousDerivation
  derived from: http://data.ga-group.nl/ics/bics/2014/1120151312
  source accessed on: 2019-12-03T20:05:01Z
  source last accessed on: 2019-12-03T20:05:01Z
  definition: This segment includes companies that retail nursery and gardening products. This can include Internet sales of brick-and-mortar stores.
  notation: 1120151312
  valid from: 2014-08-08
  valid till: 2020-10-03
derived from: Nursery & Garden Centers
  type: BicsLevel6Segment
  type: Classifier
  type: ContemporaryDerivation
  derived from: http://data.ga-group.nl/ics/bics/2020/111211141112
  derived from: http://data.ga-group.nl/ics/bics/2024/111211141112
  source accessed on: 2023-07-03T18:11:29Z
  source last accessed on: 2024-06-05T14:42:36Z
  definition: This segment includes home improvement stores specialized in seeds, plants, gardening supplies, and related equipment.
  notation: 111211141112
  valid from: 2020-10-03
source accessed on: 2023-07-03T18:11:29Z
source last accessed on: 2024-06-05T14:42:36Z
definition: This segment includes home improvement stores specialized in seeds, plants, gardening supplies, and related equipment.
notation: 111211141112
valid from: 2020-10-03

Home Improvement Stores
type: BicsLevel5Segment
type: Classifier
type: NamedIndividual
is level5 segment of: Home Products Stores
created with: infer-bics.sql
derived from: Home Improvement Stores
  type: BicsLevel4SubIndustry
  type: Classifier
  type: AnachronousDerivation
  derived from: http://data.ga-group.nl/ics/bics/2014/11201513
  source accessed on: 2019-12-03T20:05:01Z
  source last accessed on: 2019-12-03T20:05:01Z
  definition: This industry subgroup includes companies that retail home improvement products and materials. Products can include lumber, paint, plumbing, tools, lighting, hardware and flooring.
  notation: 11201513
  valid from: 2014-08-08
  valid till: 2020-10-03
derived from: Home Improvement Stores
  type: BicsLevel5Segment
  type: Classifier
  type: ContemporaryDerivation
  derived from: http://data.ga-group.nl/ics/bics/2020/1112111411
  derived from: http://data.ga-group.nl/ics/bics/2024/1112111411
  source accessed on: 2023-07-03T18:11:29Z
  source last accessed on: 2024-06-05T14:42:36Z
  definition: This segment includes stores that specialize in retailing products used to build and improve homes such as gardening products, lumber, paint, plumbing, tools, lighting, hardware, and flooring.
  notation: 1112111411
  valid from: 2020-10-03
source accessed on: 2023-07-03T18:11:29Z
source last accessed on: 2024-06-05T14:42:36Z
definition: This segment includes stores that specialize in retailing products used to build and improve homes such as gardening products, lumber, paint, plumbing, tools, lighting, hardware, and flooring.
notation: 1112111411
valid from: 2020-10-03

Home Furniture Stores
type: BicsLevel6Segment
type: Classifier
type: NamedIndividual
is level6 segment of: Home Furnishings Stores
created with: infer-bics.sql
derived from: Furniture Stores
  type: BicsLevel4SubIndustry
  type: Classifier
  type: AnachronousDerivation
  derived from: http://data.ga-group.nl/ics/bics/2014/11201511
  source accessed on: 2019-12-03T20:05:01Z
  source last accessed on: 2019-12-03T20:05:01Z
  definition: This industry subgroup includes companies that retail furniture. This can include Internet sales of brick-and-mortar stores.
  notation: 11201511
  valid from: 2014-08-08
  valid till: 2020-10-03
derived from: Home Furniture Stores
  type: BicsLevel6Segment
  type: Classifier
  type: ContemporaryDerivation
  derived from: http://data.ga-group.nl/ics/bics/2020/111211141210
  derived from: http://data.ga-group.nl/ics/bics/2024/111211141210
  source accessed on: 2023-07-03T18:11:29Z
  source last accessed on: 2024-06-05T14:42:36Z
  definition: This segment includes stores that specialize in retailing home furniture products.
  notation: 111211141210
  valid from: 2020-10-03
source accessed on: 2023-07-03T18:11:29Z
source last accessed on: 2024-06-05T14:42:36Z
definition: This segment includes stores that specialize in retailing home furniture products.
notation: 111211141210
valid from: 2020-10-03

Houseware Stores
type: BicsLevel6Segment
type: Classifier
type: NamedIndividual
is level6 segment of: Home Furnishings Stores
created with: infer-bics.sql
derived from: Home Furnishings Stores
  type: BicsLevel4SubIndustry
  type: Classifier
  type: AnachronousDerivation
  derived from: http://data.ga-group.nl/ics/bics/2014/11201512
  source accessed on: 2019-12-03T20:05:01Z
  source last accessed on: 2019-12-03T20:05:01Z
  definition: This industry subgroup includes companies that retail home furnishing products. This can include Internet sales of brick-and-mortar stores.
  notation: 11201512
  valid from: 2014-08-08
  valid till: 2020-10-03
derived from: Houseware Stores
  type: BicsLevel6Segment
  type: Classifier
  type: ContemporaryDerivation
  derived from: http://data.ga-group.nl/ics/bics/2020/111211141211
  derived from: http://data.ga-group.nl/ics/bics/2024/111211141211
  source accessed on: 2023-07-03T18:11:29Z
  source last accessed on: 2024-06-05T14:42:36Z
  definition: This segment includes stores that specialize in retailing housewares and decorative home products. Includes specialized container, bedding, candle, and kitchenware stores.
  notation: 111211141211
  valid from: 2020-10-03
source accessed on: 2023-07-03T18:11:29Z
source last accessed on: 2024-06-05T14:42:36Z
definition: This segment includes stores that specialize in retailing housewares and decorative home products. Includes specialized container, bedding, candle, and kitchenware stores.
notation: 111211141211
valid from: 2020-10-03

Home Furnishings Stores
type: BicsLevel5Segment
type: Classifier
type: NamedIndividual
is level5 segment of: Home Products Stores
created with: infer-bics.sql
derived from: Home Furnishings Stores
  type: BicsLevel5Segment
  type: Classifier
  type: ContemporaryDerivation
  derived from: http://data.ga-group.nl/ics/bics/2020/1112111412
  derived from: http://data.ga-group.nl/ics/bics/2024/1112111412
  source accessed on: 2023-07-03T18:11:29Z
  source last accessed on: 2024-06-05T14:42:36Z
  definition: This segment includes stores that specialize in retailing products used to decorate and furnish homes.
  notation: 1112111412
  valid from: 2020-10-03
source accessed on: 2023-07-03T18:11:29Z
source last accessed on: 2024-06-05T14:42:36Z
definition: This segment includes stores that specialize in retailing products used to decorate and furnish homes.
notation: 1112111412
valid from: 2020-10-03

Home Products Stores
type: BicsLevel4SubIndustry
type: Classifier
type: NamedIndividual
replaces: Home Products Stores
created with: infer-bics.sql
derived from: Lawn & Garden Supplies
  type: BicsLevel4SubIndustry
  type: Classifier
  type: ContemporaryDerivation
  derived from: http://data.ga-group.nl/ics/bics/2014/11121114
  source accessed on: 2019-12-03T20:05:01Z
  source last accessed on: 2019-12-03T20:05:01Z
  definition: This industry subgroup includes companies that manufacture home lawn and garden supplies and hardware. Includes hoses, sprinklers, bird feeders and outdoor décor. Excludes fertilizers and pesticides manufacturers (see Agricultural Chemicals) and lawn equipment (see Home Lawn & Garden Equipment).
  notation: 11121114
  valid from: 2014-08-08
  valid till: 2020-10-03
derived from: Home Products Stores
  type: BicsLevel3Industry
  type: Classifier
  type: AnachronousDerivation
  derived from: http://data.ga-group.nl/ics/bics/2014/112015
  source accessed on: 2019-12-03T20:05:01Z
  source last accessed on: 2019-12-03T20:05:01Z
  definition: This industry includes companies that retail furniture, hardware, home furnishings, nursery products, gardening and home improvement products. This industry can include Internet sales of brick-and-mortar stores.
  notation: 112015
  valid from: 2014-08-08
  valid till: 2020-10-03
derived from: Home Products Stores
  type: BicsLevel4SubIndustry
  type: Classifier
  type: ContemporaryDerivation
  derived from: http://data.ga-group.nl/ics/bics/2020/11121114
  derived from: http://data.ga-group.nl/ics/bics/2024/11121114
  source accessed on: 2023-07-03T18:11:29Z
  source last accessed on: 2024-06-05T14:42:36Z
  definition: This industry subgroup includes stores that specialize in retailing products involved in building, improving, furnishing, or decorating homes.
  notation: 11121114
  valid from: 2020-10-03
source accessed on: 2019-12-03T20:05:01Z
source last accessed on: 2024-06-05T14:42:36Z
definition: This industry subgroup includes stores that specialize in retailing products involved in building, improving, furnishing, or decorating homes.
notation: 11121114
valid from: 2014-08-08

Jewelry Stores
type: BicsLevel5Segment
type: Classifier
type: NamedIndividual
is level5 segment of: Jewelry & Watch Stores
created with: infer-bics.sql
derived from: Iron Metalware
  type: BicsLevel5Segment
  type: Classifier
  type: ContemporaryDerivation
  derived from: http://data.ga-group.nl/ics/bics/2014/1112111510
  source accessed on: 2019-12-03T20:05:01Z
  source last accessed on: 2019-12-03T20:05:01Z
  definition: This segment includes companies that manufacture enameled iron and metal bathroom fixtures, such as bathtubs, metal plumbing fixtures and metal sinks.
  notation: 1112111510
  valid from: 2014-08-08
  valid till: 2020-10-03
derived from: Jewelry Stores
  type: BicsLevel4SubIndustry
  type: Classifier
  type: AnachronousDerivation
  derived from: http://data.ga-group.nl/ics/bics/2014/11201610
  source accessed on: 2019-12-03T20:05:01Z
  source last accessed on: 2019-12-03T20:05:01Z
  definition: This industry subgroup includes companies that retail jewelry. This can include Internet sales of brick-and-mortar stores.
  notation: 11201610
  valid from: 2014-08-08
  valid till: 2020-10-03
derived from: Jewelry Stores
  type: BicsLevel5Segment
  type: Classifier
  type: ContemporaryDerivation
  derived from: http://data.ga-group.nl/ics/bics/2020/1112111510
  derived from: http://data.ga-group.nl/ics/bics/2024/1112111510
  source accessed on: 2023-07-03T18:11:29Z
  source last accessed on: 2024-06-05T14:42:36Z
  definition: This segment includes stores that specialize in retailing jewelry.
  notation: 1112111510
  valid from: 2020-10-03
source accessed on: 2019-12-03T20:05:01Z
source last accessed on: 2024-06-05T14:42:36Z
definition: This segment includes stores that specialize in retailing jewelry.
notation: 1112111510
valid from: 2014-08-08

Watch Stores
type: BicsLevel5Segment
type: Classifier
type: NamedIndividual
is level5 segment of: Jewelry & Watch Stores
created with: infer-bics.sql
derived from: Plastic Plumbing Fixtures
  type: BicsLevel5Segment
  type: Classifier
  type: ContemporaryDerivation
  derived from: http://data.ga-group.nl/ics/bics/2014/1112111511
  source accessed on: 2019-12-03T20:05:01Z
  source last accessed on: 2019-12-03T20:05:01Z
  definition: This segment includes companies that manufacture plastic plumbing fixtures, such as fiberglass tubs, hot tubs and shower stalls.
  notation: 1112111511
  valid from: 2014-08-08
  valid till: 2020-10-03
derived from: Watch Stores
  type: BicsLevel4SubIndustry
  type: Classifier
  type: AnachronousDerivation
  derived from: http://data.ga-group.nl/ics/bics/2014/11201611
  source accessed on: 2019-12-03T20:05:01Z
  source last accessed on: 2019-12-03T20:05:01Z
  definition: This industry subgroup includes companies that retail watches. This can include Internet sales of brick-and-mortar stores.
  notation: 11201611
  valid from: 2014-08-08
  valid till: 2020-10-03
derived from: Watch Stores
  type: BicsLevel5Segment
  type: Classifier
  type: ContemporaryDerivation
  derived from: http://data.ga-group.nl/ics/bics/2020/1112111511
  derived from: http://data.ga-group.nl/ics/bics/2024/1112111511
  source accessed on: 2023-07-03T18:11:29Z
  source last accessed on: 2024-06-05T14:42:36Z
  definition: This segment includes stores that specialize in retailing watches.
  notation: 1112111511
  valid from: 2020-10-03
source accessed on: 2019-12-03T20:05:01Z
source last accessed on: 2024-06-05T14:42:36Z
definition: This segment includes stores that specialize in retailing watches.
notation: 1112111511
valid from: 2014-08-08

Plumb Fixture Fitting & Trim
type: BicsLevel5Segment
type: Classifier
type: NamedIndividual
is level5 segment of: Jewelry & Watch Stores
created with: infer-bics.sql
derived from: Plumb Fixture Fitting & Trim
  type: BicsLevel5Segment
  type: Classifier
  type: ContemporaryDerivation
  derived from: http://data.ga-group.nl/ics/bics/2014/1112111512
  source accessed on: 2019-12-03T20:05:01Z
  source last accessed on: 2019-12-03T20:05:01Z
  definition: This segment includes companies that manufacture plumbing fixtures, such as faucets, shower heads and flush valves.
  notation: 1112111512
  valid from: 2014-08-08
  valid till: 2020-10-03
source accessed on: 2019-12-03T20:05:01Z
source last accessed on: 2019-12-03T20:05:01Z
definition: This segment includes companies that manufacture plumbing fixtures, such as faucets, shower heads and flush valves.
notation: 1112111512
valid from: 2014-08-08
valid till: 2020-10-03

Porcelain Plumbing Fixtures
type: BicsLevel5Segment
type: Classifier
type: NamedIndividual
is level5 segment of: Jewelry & Watch Stores
created with: infer-bics.sql
derived from: Porcelain Plumbing Fixtures
  type: BicsLevel5Segment
  type: Classifier
  type: ContemporaryDerivation
  derived from: http://data.ga-group.nl/ics/bics/2014/1112111513
  source accessed on: 2019-12-03T20:05:01Z
  source last accessed on: 2019-12-03T20:05:01Z
  definition: This segment includes companies that manufacture vitreous china plumbing fixtures and bathroom accessories.
  notation: 1112111513
  valid from: 2014-08-08
  valid till: 2020-10-03
source accessed on: 2019-12-03T20:05:01Z
source last accessed on: 2019-12-03T20:05:01Z
definition: This segment includes companies that manufacture vitreous china plumbing fixtures and bathroom accessories.
notation: 1112111513
valid from: 2014-08-08
valid till: 2020-10-03

Jewelry & Watch Stores
type: BicsLevel4SubIndustry
type: Classifier
type: NamedIndividual
replaces: Jewelry & Watch Stores
created with: infer-bics.sql
derived from: Plumbing Products
  type: BicsLevel4SubIndustry
  type: Classifier
  type: ContemporaryDerivation
  derived from: http://data.ga-group.nl/ics/bics/2014/11121115
  source accessed on: 2019-12-03T20:05:01Z
  source last accessed on: 2019-12-03T20:05:01Z
  definition: This industry subgroup includes companies that manufacture plumbing fixtures and bathroom accessories, such as sinks, bathtubs, faucets and hot tubs.
  notation: 11121115
  valid from: 2014-08-08
  valid till: 2020-10-03
derived from: Jewelry & Watch Stores
  type: BicsLevel3Industry
  type: Classifier
  type: AnachronousDerivation
  derived from: http://data.ga-group.nl/ics/bics/2014/112016
  source accessed on: 2019-12-03T20:05:01Z
  source last accessed on: 2019-12-03T20:05:01Z
  definition: This industry includes stores that retail pearls, precious gems, and precious metal crafted into various types of adornments.
  notation: 112016
  valid from: 2014-08-08
  valid till: 2020-10-03
derived from: Jewelry & Watch Stores
  type: BicsLevel4SubIndustry
  type: Classifier
  type: ContemporaryDerivation
  derived from: http://data.ga-group.nl/ics/bics/2020/11121115
  derived from: http://data.ga-group.nl/ics/bics/2024/11121115
  source accessed on: 2023-07-03T18:11:29Z
  source last accessed on: 2024-06-05T14:42:36Z
  definition: This industry subgroup includes stores that specialize in retailing jewelry, watches, precious stones, and precious metal goods.
  notation: 11121115
  valid from: 2020-10-03
source accessed on: 2019-12-03T20:05:01Z
source last accessed on: 2024-06-05T14:42:36Z
definition: This industry subgroup includes stores that specialize in retailing jewelry, watches, precious stones, and precious metal goods.
notation: 11121115
valid from: 2014-08-08

Apparel Stores - Franchising
type: BicsLevel5Segment
type: Classifier
type: NamedIndividual
is level5 segment of: Specialty Apparel Stores
created with: infer-bics.sql
derived from: Apparel Stores - Franchising
  type: BicsLevel4SubIndustry
  type: Classifier
  type: AnachronousDerivation
  derived from: http://data.ga-group.nl/ics/bics/2014/11201710
  source accessed on: 2019-12-03T20:05:01Z
  source last accessed on: 2019-12-03T20:05:01Z
  definition: This industry subgroup includes apparel retailers that have a franchise revenue stream.
  notation: 11201710
  valid from: 2014-08-08
  valid till: 2020-10-03
derived from: Apparel Stores - Franchising
  type: BicsLevel5Segment
  type: Classifier
  type: ContemporaryDerivation
  derived from: http://data.ga-group.nl/ics/bics/2020/1112111610
  derived from: http://data.ga-group.nl/ics/bics/2024/1112111610
  source accessed on: 2023-07-03T18:11:29Z
  source last accessed on: 2024-06-05T14:42:36Z
  definition: This segment includes revenue that specialty apparel stores generate from their franchising operations.
  notation: 1112111610
  valid from: 2020-10-03
source accessed on: 2023-07-03T18:11:29Z
source last accessed on: 2024-06-05T14:42:36Z
definition: This segment includes revenue that specialty apparel stores generate from their franchising operations.
notation: 1112111610
valid from: 2020-10-03

Child & Infant Clothing Stores
type: BicsLevel5Segment
type: Classifier
type: NamedIndividual
is level5 segment of: Specialty Apparel Stores
created with: infer-bics.sql
derived from: Child & Infant Clothing Stores
  type: BicsLevel4SubIndustry
  type: Classifier
  type: AnachronousDerivation
  derived from: http://data.ga-group.nl/ics/bics/2014/11201711
  source accessed on: 2019-12-03T20:05:01Z
  source last accessed on: 2019-12-03T20:05:01Z
  definition: This industry subgroup includes companies that retail children's and infants' clothing. This can include Internet sales of brick-and-mortar stores.
  notation: 11201711
  valid from: 2014-08-08
  valid till: 2020-10-03
derived from: Child & Infant Clothing Stores
  type: BicsLevel5Segment
  type: Classifier
  type: ContemporaryDerivation
  derived from: http://data.ga-group.nl/ics/bics/2020/1112111611
  derived from: http://data.ga-group.nl/ics/bics/2024/1112111611
  source accessed on: 2023-07-03T18:11:29Z
  source last accessed on: 2024-06-05T14:42:36Z
  definition: This segment includes stores that specialize in children and infant clothing.
  notation: 1112111611
  valid from: 2020-10-03
source accessed on: 2023-07-03T18:11:29Z
source last accessed on: 2024-06-05T14:42:36Z
definition: This segment includes stores that specialize in children and infant clothing.
notation: 1112111611
valid from: 2020-10-03

Teen & Young Adult Cloth Stores
type: BicsLevel5Segment
type: Classifier
type: NamedIndividual
is level5 segment of: Specialty Apparel Stores
created with: infer-bics.sql
derived from: Teen & Young Adult Cloth Stores
  type: BicsLevel4SubIndustry
  type: Classifier
  type: AnachronousDerivation
  derived from: http://data.ga-group.nl/ics/bics/2014/11201717
  source accessed on: 2019-12-03T20:05:01Z
  source last accessed on: 2019-12-03T20:05:01Z
  definition: This industry subgroup includes companies that retail teen, tween and young adult clothing. This can include Internet sales of brick-and-mortar stores.
  notation: 11201717
  valid from: 2014-08-08
  valid till: 2020-10-03
derived from: Teen & Young Adult Cloth Stores
  type: BicsLevel5Segment
  type: Classifier
  type: ContemporaryDerivation
  derived from: http://data.ga-group.nl/ics/bics/2020/1112111612
  derived from: http://data.ga-group.nl/ics/bics/2024/1112111612
  source accessed on: 2023-07-03T18:11:29Z
  source last accessed on: 2024-06-05T14:42:36Z
  definition: This segment includes stores that specialize in retailing teen and young adult clothing.
  notation: 1112111612
  valid from: 2020-10-03
source accessed on: 2023-07-03T18:11:29Z
source last accessed on: 2024-06-05T14:42:36Z
definition: This segment includes stores that specialize in retailing teen and young adult clothing.
notation: 1112111612
valid from: 2020-10-03

Family Clothing Stores
type: BicsLevel5Segment
type: Classifier
type: NamedIndividual
is level5 segment of: Specialty Apparel Stores
created with: infer-bics.sql
derived from: Family Clothing Stores
  type: BicsLevel4SubIndustry
  type: Classifier
  type: AnachronousDerivation
  derived from: http://data.ga-group.nl/ics/bics/2014/11201713
  source accessed on: 2019-12-03T20:05:01Z
  source last accessed on: 2019-12-03T20:05:01Z
  definition: This industry subgroup includes companies that retail apparel for men, women and children. This can include Internet sales of brick-and-mortar stores.
  notation: 11201713
  valid from: 2014-08-08
  valid till: 2020-10-03
derived from: Family Clothing Stores
  type: BicsLevel5Segment
  type: Classifier
  type: ContemporaryDerivation
  derived from: http://data.ga-group.nl/ics/bics/2020/1112111613
  derived from: http://data.ga-group.nl/ics/bics/2024/1112111613
  source accessed on: 2023-07-03T18:11:29Z
  source last accessed on: 2024-06-05T14:42:36Z
  definition: This segment includes stores that specialize in retailing clothing for all ages, genders, and sizes.
  notation: 1112111613
  valid from: 2020-10-03
source accessed on: 2023-07-03T18:11:29Z
source last accessed on: 2024-06-05T14:42:36Z
definition: This segment includes stores that specialize in retailing clothing for all ages, genders, and sizes.
notation: 1112111613
valid from: 2020-10-03

Men's Clothing Stores
type: BicsLevel5Segment
type: Classifier
type: NamedIndividual
is level5 segment of: Specialty Apparel Stores
created with: infer-bics.sql
derived from: Men's Clothing Stores
  type: BicsLevel4SubIndustry
  type: Classifier
  type: AnachronousDerivation
  derived from: http://data.ga-group.nl/ics/bics/2014/11201715
  source accessed on: 2019-12-03T20:05:01Z
  source last accessed on: 2019-12-03T20:05:01Z
  definition: This industry subgroup includes companies that retail men's clothing. This can include Internet sales of brick-and-mortar stores.
  notation: 11201715
  valid from: 2014-08-08
  valid till: 2020-10-03
derived from: Men's Clothing Stores
  type: BicsLevel5Segment
  type: Classifier
  type: ContemporaryDerivation
  derived from: http://data.ga-group.nl/ics/bics/2020/1112111614
  derived from: http://data.ga-group.nl/ics/bics/2024/1112111614
  source accessed on: 2023-07-03T18:11:29Z
  source last accessed on: 2024-06-05T14:42:36Z
  definition: This segment includes stores that specialize in retailing men's clothing.
  notation: 1112111614
  valid from: 2020-10-03
source accessed on: 2023-07-03T18:11:29Z
source last accessed on: 2024-06-05T14:42:36Z
definition: This segment includes stores that specialize in retailing men's clothing.
notation: 1112111614
valid from: 2020-10-03

Women's Clothing Stores
type: BicsLevel5Segment
type: Classifier
type: NamedIndividual
is level5 segment of: Specialty Apparel Stores
created with: infer-bics.sql
derived from: Women's Clothing Stores
  type: BicsLevel4SubIndustry
  type: Classifier
  type: AnachronousDerivation
  derived from: http://data.ga-group.nl/ics/bics/2014/11201718
  source accessed on: 2019-12-03T20:05:01Z
  source last accessed on: 2019-12-03T20:05:01Z
  definition: This industry subgroup includes companies that retail women's clothing. This can include Internet sales of brick-and-mortar stores.
  notation: 11201718
  valid from: 2014-08-08
  valid till: 2020-10-03
derived from: Women's Clothing Stores
  type: BicsLevel5Segment
  type: Classifier
  type: ContemporaryDerivation
  derived from: http://data.ga-group.nl/ics/bics/2020/1112111615
  derived from: http://data.ga-group.nl/ics/bics/2024/1112111615
  source accessed on: 2023-07-03T18:11:29Z
  source last accessed on: 2024-06-05T14:42:36Z
  definition: This segment includes stores that specialize in retailing women's clothing.
  notation: 1112111615
  valid from: 2020-10-03
source accessed on: 2023-07-03T18:11:29Z
source last accessed on: 2024-06-05T14:42:36Z
definition: This segment includes stores that specialize in retailing women's clothing.
notation: 1112111615
valid from: 2020-10-03

Off-Price Apparel
type: BicsLevel5Segment
type: Classifier
type: NamedIndividual
is level5 segment of: Specialty Apparel Stores
created with: infer-bics.sql
derived from: Off-Price Apparel
  type: BicsLevel4SubIndustry
  type: Classifier
  type: AnachronousDerivation
  derived from: http://data.ga-group.nl/ics/bics/2014/11201716
  source accessed on: 2019-12-03T20:05:01Z
  source last accessed on: 2019-12-03T20:05:01Z
  definition: This industry subgroup includes companies that have separate departments for various merchandise lines, such as apparel, jewelry, home furnishings and linens, each with a single line of cash registers. They generally offer merchandise at discounted prices compared with traditional department stores.
  notation: 11201716
  valid from: 2014-08-08
  valid till: 2020-10-03
derived from: Off-Price Apparel
  type: BicsLevel5Segment
  type: Classifier
  type: ContemporaryDerivation
  derived from: http://data.ga-group.nl/ics/bics/2020/1112111616
  derived from: http://data.ga-group.nl/ics/bics/2024/1112111616
  source accessed on: 2023-07-03T18:11:29Z
  source last accessed on: 2024-06-05T14:42:36Z
  definition: This segment includes stores which offer merchandise at discounted prices by purchasing overstock inventory from manufacturers.
  notation: 1112111616
  valid from: 2020-10-03
source accessed on: 2023-07-03T18:11:29Z
source last accessed on: 2024-06-05T14:42:36Z
definition: This segment includes stores which offer merchandise at discounted prices by purchasing overstock inventory from manufacturers.
notation: 1112111616
valid from: 2020-10-03

Clothing Accessories Stores
type: BicsLevel5Segment
type: Classifier
type: NamedIndividual
is level5 segment of: Specialty Apparel Stores
created with: infer-bics.sql
derived from: Clothing Accessories Stores
  type: BicsLevel4SubIndustry
  type: Classifier
  type: AnachronousDerivation
  derived from: http://data.ga-group.nl/ics/bics/2014/11201712
  source accessed on: 2019-12-03T20:05:01Z
  source last accessed on: 2019-12-03T20:05:01Z
  definition: This industry subgroup includes companies that retail clothing accessories. This can include Internet sales of brick-and-mortar stores.
  notation: 11201712
  valid from: 2014-08-08
  valid till: 2020-10-03
derived from: Clothing Accessories Stores
  type: BicsLevel5Segment
  type: Classifier
  type: ContemporaryDerivation
  derived from: http://data.ga-group.nl/ics/bics/2020/1112111617
  derived from: http://data.ga-group.nl/ics/bics/2024/1112111617
  source accessed on: 2023-07-03T18:11:29Z
  source last accessed on: 2024-06-05T14:42:36Z
  definition: This segment includes stores that specialize in retailing accessories such as handbags, luggage, leather goods, and other accessories.
  notation: 1112111617
  valid from: 2020-10-03
source accessed on: 2023-07-03T18:11:29Z
source last accessed on: 2024-06-05T14:42:36Z
definition: This segment includes stores that specialize in retailing accessories such as handbags, luggage, leather goods, and other accessories.
notation: 1112111617
valid from: 2020-10-03

Footwear Stores
type: BicsLevel5Segment
type: Classifier
type: NamedIndividual
is level5 segment of: Specialty Apparel Stores
created with: infer-bics.sql
derived from: Footwear Stores
  type: BicsLevel4SubIndustry
  type: Classifier
  type: AnachronousDerivation
  derived from: http://data.ga-group.nl/ics/bics/2014/11201714
  source accessed on: 2019-12-03T20:05:01Z
  source last accessed on: 2019-12-03T20:05:01Z
  definition: This industry subgroup includes companies that retail footwear products. This can include Internet sales of brick-and-mortar stores.
  notation: 11201714
  valid from: 2014-08-08
  valid till: 2020-10-03
derived from: Footwear Stores
  type: BicsLevel5Segment
  type: Classifier
  type: ContemporaryDerivation
  derived from: http://data.ga-group.nl/ics/bics/2020/1112111618
  derived from: http://data.ga-group.nl/ics/bics/2024/1112111618
  source accessed on: 2023-07-03T18:11:29Z
  source last accessed on: 2024-06-05T14:42:36Z
  definition: This segment includes stores that specialize in retailing footwear products.
  notation: 1112111618
  valid from: 2020-10-03
source accessed on: 2023-07-03T18:11:29Z
source last accessed on: 2024-06-05T14:42:36Z
definition: This segment includes stores that specialize in retailing footwear products.
notation: 1112111618
valid from: 2020-10-03

Specialty Apparel Stores
type: BicsLevel4SubIndustry
type: Classifier
type: NamedIndividual
replaces: Specialty Apparel Stores
created with: infer-bics.sql
derived from: Residential Remodel
  type: BicsLevel4SubIndustry
  type: Classifier
  type: ContemporaryDerivation
  derived from: http://data.ga-group.nl/ics/bics/2014/11121116
  source accessed on: 2019-12-03T20:05:01Z
  source last accessed on: 2019-12-03T20:05:01Z
  definition: This industry subgroup includes companies that build additions or make alterations, renovations or any other home improvements to residential buildings.
  notation: 11121116
  valid from: 2014-08-08
  valid till: 2020-10-03
derived from: Specialty Apparel Stores
  type: BicsLevel3Industry
  type: Classifier
  type: AnachronousDerivation
  derived from: http://data.ga-group.nl/ics/bics/2014/112017
  source accessed on: 2019-12-03T20:05:01Z
  source last accessed on: 2019-12-03T20:05:01Z
  definition: This industry includes companies that retail family, men's, women's, children's and teen's clothing accessories. This industry can include Internet sales of brick-and-mortar stores.
  notation: 112017
  valid from: 2014-08-08
  valid till: 2020-10-03
derived from: Specialty Apparel Stores
  type: BicsLevel4SubIndustry
  type: Classifier
  type: ContemporaryDerivation
  derived from: http://data.ga-group.nl/ics/bics/2020/11121116
  derived from: http://data.ga-group.nl/ics/bics/2024/11121116
  source accessed on: 2023-07-03T18:11:29Z
  source last accessed on: 2024-06-05T14:42:36Z
  definition: This industry subgroup includes stores that specialize in retailing apparel, footwear and accessories.
  notation: 11121116
  valid from: 2020-10-03
source accessed on: 2019-12-03T20:05:01Z
source last accessed on: 2024-06-05T14:42:36Z
definition: This industry subgroup includes stores that specialize in retailing apparel, footwear and accessories.
notation: 11121116
valid from: 2014-08-08

Hand Tools
type: BicsLevel5Segment
type: Classifier
type: NamedIndividual
is level5 segment of: Sporting Goods Stores
is replaced by: http://data.ga-group.nl/ics/bics/171013151710
created with: infer-bics.sql
derived from: Hand Tools
  type: BicsLevel5Segment
  type: Classifier
  type: ContemporaryDerivation
  derived from: http://data.ga-group.nl/ics/bics/2014/1112111710
  source accessed on: 2019-12-03T20:05:01Z
  source last accessed on: 2019-12-03T20:05:01Z
  definition: This segment includes companies that manufacture nonpowered hand and edge tools. Products include hammers, screwdrivers, axes, garden tools, pliers and ratchets.
  notation: 1112111710
  valid from: 2014-08-08
  valid till: 2020-10-03
source accessed on: 2019-12-03T20:05:01Z
source last accessed on: 2019-12-03T20:05:01Z
definition: This segment includes companies that manufacture nonpowered hand and edge tools. Products include hammers, screwdrivers, axes, garden tools, pliers and ratchets.
notation: 1112111710
valid from: 2014-08-08
valid till: 2020-10-03

Power Tools
type: BicsLevel5Segment
type: Classifier
type: NamedIndividual
is level5 segment of: Sporting Goods Stores
is replaced by: http://data.ga-group.nl/ics/bics/171013151711
created with: infer-bics.sql
derived from: Power Tools
  type: BicsLevel5Segment
  type: Classifier
  type: ContemporaryDerivation
  derived from: http://data.ga-group.nl/ics/bics/2014/1112111711
  source accessed on: 2019-12-03T20:05:01Z
  source last accessed on: 2019-12-03T20:05:01Z
  definition: This segment includes companies that manufacture power-driven hand tools. Such tools include circular saws, chain saws, nail guns, planers, paint spray guns, riveting guns, routers, drills and sanders.
  notation: 1112111711
  valid from: 2014-08-08
  valid till: 2020-10-03
source accessed on: 2019-12-03T20:05:01Z
source last accessed on: 2019-12-03T20:05:01Z
definition: This segment includes companies that manufacture power-driven hand tools. Such tools include circular saws, chain saws, nail guns, planers, paint spray guns, riveting guns, routers, drills and sanders.
notation: 1112111711
valid from: 2014-08-08
valid till: 2020-10-03

Tool Accessories
type: BicsLevel5Segment
type: Classifier
type: NamedIndividual
is level5 segment of: Sporting Goods Stores
is replaced by: http://data.ga-group.nl/ics/bics/171013151712
created with: infer-bics.sql
derived from: Tool Accessories
  type: BicsLevel5Segment
  type: Classifier
  type: ContemporaryDerivation
  derived from: http://data.ga-group.nl/ics/bics/2014/1112111712
  source accessed on: 2019-12-03T20:05:01Z
  source last accessed on: 2019-12-03T20:05:01Z
  definition: This segment includes companies that manufacture nonpowered handsaws and saw blades. Products include saws for stone and wood cutting.
  notation: 1112111712
  valid from: 2014-08-08
  valid till: 2020-10-03
source accessed on: 2019-12-03T20:05:01Z
source last accessed on: 2019-12-03T20:05:01Z
definition: This segment includes companies that manufacture nonpowered handsaws and saw blades. Products include saws for stone and wood cutting.
notation: 1112111712
valid from: 2014-08-08
valid till: 2020-10-03

Sporting Goods Stores
type: BicsLevel4SubIndustry
type: Classifier
type: NamedIndividual
replaces: Sporting Goods Stores
created with: infer-bics.sql
derived from: Tools
  type: BicsLevel4SubIndustry
  type: Classifier
  type: ContemporaryDerivation
  derived from: http://data.ga-group.nl/ics/bics/2014/11121117
  source accessed on: 2019-12-03T20:05:01Z
  source last accessed on: 2019-12-03T20:05:01Z
  definition: This industry subgroup includes companies that manufacture hand tools. Products include powered and nonpowered hand tools and saws, as well as saw blades.
  notation: 11121117
  valid from: 2014-08-08
  valid till: 2020-10-03
derived from: Sporting Goods Stores
  type: BicsLevel3Industry
  type: Classifier
  type: AnachronousDerivation
  derived from: http://data.ga-group.nl/ics/bics/2014/112018
  source accessed on: 2019-12-03T20:05:01Z
  source last accessed on: 2019-12-03T20:05:01Z
  definition: This industry includes stores that retail sporting goods, fishing gear, camping gear, kayaks, rowboats and bicycles.
  notation: 112018
  valid from: 2014-08-08
  valid till: 2020-10-03
derived from: Sporting Goods Stores
  type: BicsLevel4SubIndustry
  type: Classifier
  type: ContemporaryDerivation
  derived from: http://data.ga-group.nl/ics/bics/2020/11121117
  derived from: http://data.ga-group.nl/ics/bics/2024/11121117
  source accessed on: 2023-07-03T18:11:29Z
  source last accessed on: 2024-06-05T14:42:36Z
  definition: This industry subgroup includes stores that specialize in retailing sporting goods, outdoor recreational products, and small arms.
  notation: 11121117
  valid from: 2020-10-03
source accessed on: 2019-12-03T20:05:01Z
source last accessed on: 2024-06-05T14:42:36Z
definition: This industry subgroup includes stores that specialize in retailing sporting goods, outdoor recreational products, and small arms.
notation: 11121117
valid from: 2014-08-08

Arts & Crafts Stores
type: BicsLevel5Segment
type: Classifier
type: NamedIndividual
is level5 segment of: Other Spec Retail - Discr
is replaced by: Windows
created with: infer-bics.sql
derived from: Metal Windows & Doors
  type: BicsLevel5Segment
  type: Classifier
  type: ContemporaryDerivation
  derived from: http://data.ga-group.nl/ics/bics/2014/1112111810
  source accessed on: 2019-12-03T20:05:01Z
  source last accessed on: 2019-12-03T20:05:01Z
  definition: This segment includes companies that manufacture metal windows and doors, sashes, windows and door frames.
  notation: 1112111810
  valid from: 2014-08-08
  valid till: 2020-10-03
derived from: Arts & Crafts Stores
  type: BicsLevel4SubIndustry
  type: Classifier
  type: AnachronousDerivation
  derived from: http://data.ga-group.nl/ics/bics/2014/11201910
  source accessed on: 2019-12-03T20:05:01Z
  source last accessed on: 2019-12-03T20:05:01Z
  definition: This industry subgroup includes companies that retail arts and crafts products. This can include Internet sales of brick-and-mortar stores.
  notation: 11201910
  valid from: 2014-08-08
  valid till: 2020-10-03
derived from: Arts & Crafts Stores
  type: BicsLevel5Segment
  type: Classifier
  type: ContemporaryDerivation
  derived from: http://data.ga-group.nl/ics/bics/2020/1112111810
  derived from: http://data.ga-group.nl/ics/bics/2024/1112111810
  source accessed on: 2023-07-03T18:11:29Z
  source last accessed on: 2024-06-05T14:42:36Z
  definition: This segment includes stores that specialize in retailing materials, supplies, and tools related to arts and craft activities.
  notation: 1112111810
  valid from: 2020-10-03
source accessed on: 2019-12-03T20:05:01Z
source last accessed on: 2024-06-05T14:42:36Z
definition: This segment includes stores that specialize in retailing materials, supplies, and tools related to arts and craft activities.
notation: 1112111810
valid from: 2014-08-08

Book Stores
type: BicsLevel5Segment
type: Classifier
type: NamedIndividual
is level5 segment of: Other Spec Retail - Discr
created with: infer-bics.sql
derived from: Vinyl Wind Doors
  type: BicsLevel5Segment
  type: Classifier
  type: ContemporaryDerivation
  derived from: http://data.ga-group.nl/ics/bics/2014/1112111811
  source accessed on: 2019-12-03T20:05:01Z
  source last accessed on: 2019-12-03T20:05:01Z
  definition: This segment includes companies that manufacture vinyl windows and doors, sashes, windows and door frames.
  notation: 1112111811
  valid from: 2014-08-08
  valid till: 2020-10-03
derived from: Book Stores
  type: BicsLevel4SubIndustry
  type: Classifier
  type: AnachronousDerivation
  derived from: http://data.ga-group.nl/ics/bics/2014/11201911
  source accessed on: 2019-12-03T20:05:01Z
  source last accessed on: 2019-12-03T20:05:01Z
  definition: This industry subgroup includes companies that retail new books in brick-and-mortar stores and on the Internet.
  notation: 11201911
  valid from: 2014-08-08
  valid till: 2020-10-03
derived from: Book Stores
  type: BicsLevel5Segment
  type: Classifier
  type: ContemporaryDerivation
  derived from: http://data.ga-group.nl/ics/bics/2020/1112111811
  derived from: http://data.ga-group.nl/ics/bics/2024/1112111811
  source accessed on: 2023-07-03T18:11:29Z
  source last accessed on: 2024-06-05T14:42:36Z
  definition: This segment includes stores that specialize in retailing books.
  notation: 1112111811
  valid from: 2020-10-03
source accessed on: 2019-12-03T20:05:01Z
source last accessed on: 2024-06-05T14:42:36Z
definition: This segment includes stores that specialize in retailing books.
notation: 1112111811
valid from: 2014-08-08

Cosmetics & Beauty Stores
type: BicsLevel5Segment
type: Classifier
type: NamedIndividual
is level5 segment of: Other Spec Retail - Discr
is replaced by: Doors
created with: infer-bics.sql
derived from: Wood Window Doors
  type: BicsLevel5Segment
  type: Classifier
  type: ContemporaryDerivation
  derived from: http://data.ga-group.nl/ics/bics/2014/1112111812
  source accessed on: 2019-12-03T20:05:01Z
  source last accessed on: 2019-12-03T20:05:01Z
  definition: This segment includes companies that manufacture wood windows and doors, sashes, windows and door frames.
  notation: 1112111812
  valid from: 2014-08-08
  valid till: 2020-10-03
derived from: Cosmetics & Beauty Stores
  type: BicsLevel4SubIndustry
  type: Classifier
  type: AnachronousDerivation
  derived from: http://data.ga-group.nl/ics/bics/2014/11201912
  source accessed on: 2019-12-03T20:05:01Z
  source last accessed on: 2019-12-03T20:05:01Z
  definition: This industry subgroup includes companies that sell cosmetics and hair care products, both consumable and durable. This can include Internet sales of brick-and-mortar stores.
  notation: 11201912
  valid from: 2014-08-08
  valid till: 2020-10-03
derived from: Cosmetics & Beauty Stores
  type: BicsLevel5Segment
  type: Classifier
  type: ContemporaryDerivation
  derived from: http://data.ga-group.nl/ics/bics/2020/1112111812
  derived from: http://data.ga-group.nl/ics/bics/2024/1112111812
  source accessed on: 2023-07-03T18:11:29Z
  source last accessed on: 2024-06-05T14:42:36Z
  definition: This segment includes stores that specialize in retailing cosmetics and hair care products.
  notation: 1112111812
  valid from: 2020-10-03
source accessed on: 2019-12-03T20:05:01Z
source last accessed on: 2024-06-05T14:42:36Z
definition: This segment includes stores that specialize in retailing cosmetics and hair care products.
notation: 1112111812
valid from: 2014-08-08

Florists
type: BicsLevel5Segment
type: Classifier
type: NamedIndividual
is level5 segment of: Other Spec Retail - Discr
created with: infer-bics.sql
derived from: Florists
  type: BicsLevel4SubIndustry
  type: Classifier
  type: AnachronousDerivation
  derived from: http://data.ga-group.nl/ics/bics/2014/11201913
  source accessed on: 2019-12-03T20:05:01Z
  source last accessed on: 2019-12-03T20:05:01Z
  definition: This industry subgroup includes companies that retail flowers. This can include Internet sales of brick-and-mortar stores.
  notation: 11201913
  valid from: 2014-08-08
  valid till: 2020-10-03
derived from: Florists
  type: BicsLevel5Segment
  type: Classifier
  type: ContemporaryDerivation
  derived from: http://data.ga-group.nl/ics/bics/2020/1112111813
  derived from: http://data.ga-group.nl/ics/bics/2024/1112111813
  source accessed on: 2023-07-03T18:11:29Z
  source last accessed on: 2024-06-05T14:42:36Z
  definition: This segment includes stores that specialize in retailing cut flowers, floral arrangements, and potted plants.
  notation: 1112111813
  valid from: 2020-10-03
source accessed on: 2023-07-03T18:11:29Z
source last accessed on: 2024-06-05T14:42:36Z
definition: This segment includes stores that specialize in retailing cut flowers, floral arrangements, and potted plants.
notation: 1112111813
valid from: 2020-10-03

Gift, Novelty & Souvenir Stores
type: BicsLevel5Segment
type: Classifier
type: NamedIndividual
is level5 segment of: Other Spec Retail - Discr
created with: infer-bics.sql
derived from: Gift, Novelty & Souvenir Stores
  type: BicsLevel4SubIndustry
  type: Classifier
  type: AnachronousDerivation
  derived from: http://data.ga-group.nl/ics/bics/2014/11201914
  source accessed on: 2019-12-03T20:05:01Z
  source last accessed on: 2019-12-03T20:05:01Z
  definition: This industry subgroup includes companies that retail gift, novelty products and souvenirs. This can include Internet sales of brick-and-mortar stores.
  notation: 11201914
  valid from: 2014-08-08
  valid till: 2020-10-03
derived from: Gift, Novelty & Souvenir Stores
  type: BicsLevel5Segment
  type: Classifier
  type: ContemporaryDerivation
  derived from: http://data.ga-group.nl/ics/bics/2020/1112111814
  derived from: http://data.ga-group.nl/ics/bics/2024/1112111814
  source accessed on: 2023-07-03T18:11:29Z
  source last accessed on: 2024-06-05T14:42:36Z
  definition: This segment includes stores that specialize in retailing gift products and souvenirs. Includes duty free stores and gift shops.
  notation: 1112111814
  valid from: 2020-10-03
source accessed on: 2023-07-03T18:11:29Z
source last accessed on: 2024-06-05T14:42:36Z
definition: This segment includes stores that specialize in retailing gift products and souvenirs. Includes duty free stores and gift shops.
notation: 1112111814
valid from: 2020-10-03

Health Supplement Stores
type: BicsLevel5Segment
type: Classifier
type: NamedIndividual
is level5 segment of: Other Spec Retail - Discr
created with: infer-bics.sql
derived from: Health Supplement Stores
  type: BicsLevel4SubIndustry
  type: Classifier
  type: AnachronousDerivation
  derived from: http://data.ga-group.nl/ics/bics/2014/11201915
  source accessed on: 2019-12-03T20:05:01Z
  source last accessed on: 2019-12-03T20:05:01Z
  definition: This industry subgroup includes companies that retail food supplements, vitamins and nutritional supplements. This can include Internet sales of brick-and-mortar stores.
  notation: 11201915
  valid from: 2014-08-08
  valid till: 2020-10-03
derived from: Health Supplement Stores
  type: BicsLevel5Segment
  type: Classifier
  type: ContemporaryDerivation
  derived from: http://data.ga-group.nl/ics/bics/2020/1112111815
  source accessed on: 2023-07-03T18:11:29Z
  source last accessed on: 2023-07-03T18:11:29Z
  definition: This segment includes stores that specialize in retailing health and fitness related food supplements.
  notation: 1112111815
  valid from: 2020-10-03
  valid till: 2024-06-07
derived from: Health Supplement Stores
  type: BicsLevel5Segment
  type: Classifier
  type: ContemporaryDerivation
  derived from: http://data.ga-group.nl/ics/bics/2024/1112111815
  source accessed on: 2024-06-05T14:42:36Z
  source last accessed on: 2024-06-05T14:42:36Z
  definition: This segment includes stores that specialize in retailing health and fitness related food, shakes and supplements.
  notation: 1112111815
  valid from: 2024-06-07
source accessed on: 2023-07-03T18:11:29Z
source last accessed on: 2024-06-05T14:42:36Z
definition: This segment includes stores that specialize in retailing health and fitness related food, shakes and supplements.
notation: 1112111815
valid from: 2020-10-03

Toy & Game Stores
type: BicsLevel5Segment
type: Classifier
type: NamedIndividual
is level5 segment of: Other Spec Retail - Discr
created with: infer-bics.sql
derived from: Toy & Game Stores
  type: BicsLevel4SubIndustry
  type: Classifier
  type: AnachronousDerivation
  derived from: http://data.ga-group.nl/ics/bics/2014/11201916
  source accessed on: 2019-12-03T20:05:01Z
  source last accessed on: 2019-12-03T20:05:01Z
  definition: This industry subgroup includes companies that retail hobby products, toys and games. This can include Internet sales of brick-and-mortar stores.
  notation: 11201916
  valid from: 2014-08-08
  valid till: 2020-10-03
derived from: Toy & Game Stores
  type: BicsLevel5Segment
  type: Classifier
  type: ContemporaryDerivation
  derived from: http://data.ga-group.nl/ics/bics/2020/1112111816
  derived from: http://data.ga-group.nl/ics/bics/2024/1112111816
  source accessed on: 2023-07-03T18:11:29Z
  source last accessed on: 2024-06-05T14:42:36Z
  definition: This segment includes stores that specialize in retailing physical products for entertainment and leisure such as toys, dolls, and hobby products.
  notation: 1112111816
  valid from: 2020-10-03
source accessed on: 2023-07-03T18:11:29Z
source last accessed on: 2024-06-05T14:42:36Z
definition: This segment includes stores that specialize in retailing physical products for entertainment and leisure such as toys, dolls, and hobby products.
notation: 1112111816
valid from: 2020-10-03

Movie & Video Game Rent Stores
type: BicsLevel5Segment
type: Classifier
type: NamedIndividual
is level5 segment of: Other Spec Retail - Discr
created with: infer-bics.sql
derived from: Movie & Video Game Rent Stores
  type: BicsLevel4SubIndustry
  type: Classifier
  type: AnachronousDerivation
  derived from: http://data.ga-group.nl/ics/bics/2014/11201917
  source accessed on: 2019-12-03T20:05:01Z
  source last accessed on: 2019-12-03T20:05:01Z
  definition: This industry subgroup includes companies that specialize in renting movies and video games. This can include Internet sales of brick-and-mortar stores.
  notation: 11201917
  valid from: 2014-08-08
  valid till: 2020-10-03
derived from: Movie & Video Game Rent Stores
  type: BicsLevel5Segment
  type: Classifier
  type: ContemporaryDerivation
  derived from: http://data.ga-group.nl/ics/bics/2020/1112111817
  derived from: http://data.ga-group.nl/ics/bics/2024/1112111817
  source accessed on: 2023-07-03T18:11:29Z
  source last accessed on: 2024-06-05T14:42:36Z
  definition: This segment includes stores that specialize in movie and video game rentals.
  notation: 1112111817
  valid from: 2020-10-03
source accessed on: 2023-07-03T18:11:29Z
source last accessed on: 2024-06-05T14:42:36Z
definition: This segment includes stores that specialize in movie and video game rentals.
notation: 1112111817
valid from: 2020-10-03

Music & Movie Stores
type: BicsLevel5Segment
type: Classifier
type: NamedIndividual
is level5 segment of: Other Spec Retail - Discr
created with: infer-bics.sql
derived from: Music & Movie Stores
  type: BicsLevel4SubIndustry
  type: Classifier
  type: AnachronousDerivation
  derived from: http://data.ga-group.nl/ics/bics/2014/11201918
  source accessed on: 2019-12-03T20:05:01Z
  source last accessed on: 2019-12-03T20:05:01Z
  definition: This industry subgroup includes companies that retail prerecorded music and movie products. This can include Internet sales of brick-and-mortar stores.
  notation: 11201918
  valid from: 2014-08-08
  valid till: 2020-10-03
derived from: Music & Movie Stores
  type: BicsLevel5Segment
  type: Classifier
  type: ContemporaryDerivation
  derived from: http://data.ga-group.nl/ics/bics/2020/1112111818
  derived from: http://data.ga-group.nl/ics/bics/2024/1112111818
  source accessed on: 2023-07-03T18:11:29Z
  source last accessed on: 2024-06-05T14:42:36Z
  definition: This segment includes stores that specialize in retailing music and movie products.
  notation: 1112111818
  valid from: 2020-10-03
source accessed on: 2023-07-03T18:11:29Z
source last accessed on: 2024-06-05T14:42:36Z
definition: This segment includes stores that specialize in retailing music and movie products.
notation: 1112111818
valid from: 2020-10-03

Musical Instrument Stores
type: BicsLevel5Segment
type: Classifier
type: NamedIndividual
is level5 segment of: Other Spec Retail - Discr
created with: infer-bics.sql
derived from: Musical Instrument Stores
  type: BicsLevel4SubIndustry
  type: Classifier
  type: AnachronousDerivation
  derived from: http://data.ga-group.nl/ics/bics/2014/11201919
  source accessed on: 2019-12-03T20:05:01Z
  source last accessed on: 2019-12-03T20:05:01Z
  definition: This industry subgroup includes companies that retail musical instruments and supplies. This can include Internet sales of brick-and-mortar stores.
  notation: 11201919
  valid from: 2014-08-08
  valid till: 2020-10-03
derived from: Musical Instrument Stores
  type: BicsLevel5Segment
  type: Classifier
  type: ContemporaryDerivation
  derived from: http://data.ga-group.nl/ics/bics/2020/1112111819
  derived from: http://data.ga-group.nl/ics/bics/2024/1112111819
  source accessed on: 2023-07-03T18:11:29Z
  source last accessed on: 2024-06-05T14:42:36Z
  definition: This segment includes stores that specialize in retailing musical instruments.
  notation: 1112111819
  valid from: 2020-10-03
source accessed on: 2023-07-03T18:11:29Z
source last accessed on: 2024-06-05T14:42:36Z
definition: This segment includes stores that specialize in retailing musical instruments.
notation: 1112111819
valid from: 2020-10-03

Office Sply & Stationery Stores
type: BicsLevel5Segment
type: Classifier
type: NamedIndividual
is level5 segment of: Other Spec Retail - Discr
created with: infer-bics.sql
derived from: Office Supp & Stationery Stores
  type: BicsLevel4SubIndustry
  type: Classifier
  type: AnachronousDerivation
  derived from: http://data.ga-group.nl/ics/bics/2014/11201920
  source accessed on: 2019-12-03T20:05:01Z
  source last accessed on: 2019-12-03T20:05:01Z
  definition: This industry subgroup includes companies that retail stationery and office supplies in brick-and-mortar stores and on the Internet.
  notation: 11201920
  valid from: 2014-08-08
  valid till: 2020-10-03
derived from: Office Sply & Stationery Stores
  type: BicsLevel5Segment
  type: Classifier
  type: ContemporaryDerivation
  derived from: http://data.ga-group.nl/ics/bics/2020/1112111820
  derived from: http://data.ga-group.nl/ics/bics/2024/1112111820
  source accessed on: 2023-07-03T18:11:29Z
  source last accessed on: 2024-06-05T14:42:36Z
  definition: This segment includes stores that specialize in retailing office related stationery, supplies, and equipment.
  notation: 1112111820
  valid from: 2020-10-03
source accessed on: 2023-07-03T18:11:29Z
source last accessed on: 2024-06-05T14:42:36Z
definition: This segment includes stores that specialize in retailing office related stationery, supplies, and equipment.
notation: 1112111820
valid from: 2020-10-03

Optical Goods Stores
type: BicsLevel5Segment
type: Classifier
type: NamedIndividual
is level5 segment of: Other Spec Retail - Discr
created with: infer-bics.sql
derived from: Optical Goods Stores
  type: BicsLevel4SubIndustry
  type: Classifier
  type: AnachronousDerivation
  derived from: http://data.ga-group.nl/ics/bics/2014/11201921
  source accessed on: 2019-12-03T20:05:01Z
  source last accessed on: 2019-12-03T20:05:01Z
  definition: This industry subgroup includes companies that retail eyeglasses, contact lenses and related products. This can include Internet sales of brick-and-mortar stores.
  notation: 11201921
  valid from: 2014-08-08
  valid till: 2020-10-03
derived from: Optical Goods Stores
  type: BicsLevel5Segment
  type: Classifier
  type: ContemporaryDerivation
  derived from: http://data.ga-group.nl/ics/bics/2020/1112111821
  derived from: http://data.ga-group.nl/ics/bics/2024/1112111821
  source accessed on: 2023-07-03T18:11:29Z
  source last accessed on: 2024-06-05T14:42:36Z
  definition: This segment includes stores that specialize in retailing eyeglasses, contact lenses, sunglasses, and related products.
  notation: 1112111821
  valid from: 2020-10-03
source accessed on: 2023-07-03T18:11:29Z
source last accessed on: 2024-06-05T14:42:36Z
definition: This segment includes stores that specialize in retailing eyeglasses, contact lenses, sunglasses, and related products.
notation: 1112111821
valid from: 2020-10-03

Pet & Pet Supplies Stores
type: BicsLevel5Segment
type: Classifier
type: NamedIndividual
is level5 segment of: Other Spec Retail - Discr
created with: infer-bics.sql
derived from: Pet & Pet Supplies Stores
  type: BicsLevel4SubIndustry
  type: Classifier
  type: AnachronousDerivation
  derived from: http://data.ga-group.nl/ics/bics/2014/11201922
  source accessed on: 2019-12-03T20:05:01Z
  source last accessed on: 2019-12-03T20:05:01Z
  definition: This industry subgroup includes companies that retail pets and pet supplies in brick-and-mortar stores. This can include Internet sales of brick-and-mortar stores.
  notation: 11201922
  valid from: 2014-08-08
  valid till: 2020-10-03
derived from: Pet & Pet Supplies Stores
  type: BicsLevel5Segment
  type: Classifier
  type: ContemporaryDerivation
  derived from: http://data.ga-group.nl/ics/bics/2020/1112111822
  derived from: http://data.ga-group.nl/ics/bics/2024/1112111822
  source accessed on: 2023-07-03T18:11:29Z
  source last accessed on: 2024-06-05T14:42:36Z
  definition: This segment includes stores that specialize in retailing pets and pet care products.
  notation: 1112111822
  valid from: 2020-10-03
source accessed on: 2023-07-03T18:11:29Z
source last accessed on: 2024-06-05T14:42:36Z
definition: This segment includes stores that specialize in retailing pets and pet care products.
notation: 1112111822
valid from: 2020-10-03

Used Merchandise Stores
type: BicsLevel5Segment
type: Classifier
type: NamedIndividual
is level5 segment of: Other Spec Retail - Discr
created with: infer-bics.sql
derived from: Used Merchandise Stores
  type: BicsLevel4SubIndustry
  type: Classifier
  type: AnachronousDerivation
  derived from: http://data.ga-group.nl/ics/bics/2014/11201923
  source accessed on: 2019-12-03T20:05:01Z
  source last accessed on: 2019-12-03T20:05:01Z
  definition: This industry subgroup includes companies that retail used merchandise of any sort. This can include Internet sales of brick-and-mortar stores.
  notation: 11201923
  valid from: 2014-08-08
  valid till: 2020-10-03
derived from: Used Merchandise Stores
  type: BicsLevel5Segment
  type: Classifier
  type: ContemporaryDerivation
  derived from: http://data.ga-group.nl/ics/bics/2020/1112111823
  derived from: http://data.ga-group.nl/ics/bics/2024/1112111823
  source accessed on: 2023-07-03T18:11:29Z
  source last accessed on: 2024-06-05T14:42:36Z
  definition: This segment includes stores that specialize in retailing used household merchandise.
  notation: 1112111823
  valid from: 2020-10-03
source accessed on: 2023-07-03T18:11:29Z
source last accessed on: 2024-06-05T14:42:36Z
definition: This segment includes stores that specialize in retailing used household merchandise.
notation: 1112111823
valid from: 2020-10-03

Video Game Stores
type: BicsLevel5Segment
type: Classifier
type: NamedIndividual
is level5 segment of: Other Spec Retail - Discr
created with: infer-bics.sql
derived from: Video Game Stores
  type: BicsLevel4SubIndustry
  type: Classifier
  type: AnachronousDerivation
  derived from: http://data.ga-group.nl/ics/bics/2014/11201924
  source accessed on: 2019-12-03T20:05:01Z
  source last accessed on: 2019-12-03T20:05:01Z
  definition: This industry subgroup includes companies that retail video games. This can include Internet sales of brick-and-mortar stores.
  notation: 11201924
  valid from: 2014-08-08
  valid till: 2020-10-03
derived from: Video Game Stores
  type: BicsLevel5Segment
  type: Classifier
  type: ContemporaryDerivation
  derived from: http://data.ga-group.nl/ics/bics/2020/1112111824
  derived from: http://data.ga-group.nl/ics/bics/2024/1112111824
  source accessed on: 2023-07-03T18:11:29Z
  source last accessed on: 2024-06-05T14:42:36Z
  definition: This segment includes stores that specialize in retailing video game equipment and their software.
  notation: 1112111824
  valid from: 2020-10-03
source accessed on: 2023-07-03T18:11:29Z
source last accessed on: 2024-06-05T14:42:36Z
definition: This segment includes stores that specialize in retailing video game equipment and their software.
notation: 1112111824
valid from: 2020-10-03

Electric Vehicle Charging Stations
type: BicsLevel5Segment
type: Classifier
type: NamedIndividual
is level5 segment of: Other Spec Retail - Discr
created with: infer-bics.sql
derived from: Electric Vehicle Charging Stations
  type: BicsLevel5Segment
  type: Classifier
  type: ContemporaryDerivation
  derived from: http://data.ga-group.nl/ics/bics/2024/1112111825
  source accessed on: 2024-06-05T14:42:36Z
  source last accessed on: 2024-06-05T14:42:36Z
  definition: This segment includes companies that own or operate electric vehicle charging stations. These are also known as charge points.
  notation: 1112111825
  valid from: 2024-06-07
source accessed on: 2024-06-05T14:42:36Z
source last accessed on: 2024-06-05T14:42:36Z
definition: This segment includes companies that own or operate electric vehicle charging stations. These are also known as charge points.
notation: 1112111825
valid from: 2024-06-07

Other Spec Retail - Discr
type: BicsLevel4SubIndustry
type: Classifier
type: NamedIndividual
replaces: Other Spec Retail - Discr
created with: infer-bics.sql
derived from: Windows & Doors - Bldg Prods
  type: BicsLevel4SubIndustry
  type: Classifier
  type: ContemporaryDerivation
  derived from: http://data.ga-group.nl/ics/bics/2014/11121118
  source accessed on: 2019-12-03T20:05:01Z
  source last accessed on: 2019-12-03T20:05:01Z
  definition: This industry subgroup includes companies that manufacture wood, metal and vinyl windows and doors, sashes, windows and door frames.
  notation: 11121118
  valid from: 2014-08-08
  valid till: 2020-10-03
derived from: Other Spec Retail - Discr
  type: BicsLevel3Industry
  type: Classifier
  type: AnachronousDerivation
  derived from: http://data.ga-group.nl/ics/bics/2014/112019
  source accessed on: 2019-12-03T20:05:01Z
  source last accessed on: 2019-12-03T20:05:01Z
  definition: This industry includes companies that retail arts, crafts, gifts, novelties, souvenirs, toys, games, flowers, jewelry, sporting goods and other consumer discretionary products elsewhere classified. This industry can include Internet sales of brick-and-mortar stores.
  notation: 112019
  valid from: 2014-08-08
  valid till: 2020-10-03
derived from: Other Spec Retail - Discr
  type: BicsLevel4SubIndustry
  type: Classifier
  type: ContemporaryDerivation
  derived from: http://data.ga-group.nl/ics/bics/2020/11121118
  derived from: http://data.ga-group.nl/ics/bics/2024/11121118
  source accessed on: 2023-07-03T18:11:29Z
  source last accessed on: 2024-06-05T14:42:36Z
  definition: This industry subgroup includes stores that specialize in retailing consumer discretionary products not elsewhere classified.
  notation: 11121118
  valid from: 2020-10-03
source accessed on: 2019-12-03T20:05:01Z
source last accessed on: 2024-06-05T14:42:36Z
definition: This industry subgroup includes stores that specialize in retailing consumer discretionary products not elsewhere classified.
notation: 11121118
valid from: 2014-08-08

Retail - Discretionary
type: BicsLevel3Industry
type: Classifier
type: NamedIndividual
is industry of: Retail & Whsle - Discretionary
is replaced by: Building Products
replaces: Retail - Discretionary
created with: infer-bics.sql
derived from: Home Improvement
  type: BicsLevel3Industry
  type: Classifier
  type: ContemporaryDerivation
  derived from: http://data.ga-group.nl/ics/bics/2014/111211
  source accessed on: 2019-12-03T20:05:01Z
  source last accessed on: 2019-12-03T20:05:01Z
  definition: This industry includes companies that manufacture building products, appliances, tools, and lawn and garden supplies. Typically, these products are for decorative purposes and are affixed within the home. Excludes products utilized for structural integrity.
  notation: 111211
  valid from: 2014-08-08
  valid till: 2020-10-03
derived from: Retail - Discretionary
  type: BicsLevel2IndustryGroup
  type: Classifier
  type: AnachronousDerivation
  derived from: http://data.ga-group.nl/ics/bics/2014/1120
  source accessed on: 2019-12-03T20:05:01Z
  source last accessed on: 2019-12-03T20:05:01Z
  definition: This industry group includes companies that retail merchandise to the general public through storefront operations.
  notation: 1120
  valid from: 2014-08-08
  valid till: 2020-10-03
derived from: Retail - Discretionary
  type: BicsLevel3Industry
  type: Classifier
  type: ContemporaryDerivation
  derived from: http://data.ga-group.nl/ics/bics/2020/111211
  derived from: http://data.ga-group.nl/ics/bics/2024/111211
  source accessed on: 2023-07-03T18:11:29Z
  source last accessed on: 2024-06-05T14:42:36Z
  definition: This industry includes companies that retail consumer discretionary goods through storefront operations or non-internet based direct marketing.
  notation: 111211
  valid from: 2020-10-03
source accessed on: 2019-12-03T20:05:01Z
source last accessed on: 2024-06-05T14:42:36Z
definition: This industry includes companies that retail consumer discretionary goods through storefront operations or non-internet based direct marketing.
notation: 111211
valid from: 2014-08-08

Blinds & Shades
type: BicsLevel5Segment
type: Classifier
type: NamedIndividual
is level5 segment of: Online Marketplace
created with: infer-bics.sql
derived from: Blinds & Shades
  type: BicsLevel5Segment
  type: Classifier
  type: ContemporaryDerivation
  derived from: http://data.ga-group.nl/ics/bics/2014/1112121010
  source accessed on: 2019-12-03T20:05:01Z
  source last accessed on: 2019-12-03T20:05:01Z
  definition: This segment includes companies that manufacture blinds, curtains, shades and related fixtures.
  notation: 1112121010
  valid from: 2014-08-08
  valid till: 2020-10-03
source accessed on: 2019-12-03T20:05:01Z
source last accessed on: 2019-12-03T20:05:01Z
definition: This segment includes companies that manufacture blinds, curtains, shades and related fixtures.
notation: 1112121010
valid from: 2014-08-08
valid till: 2020-10-03

Hhld Furniture ex Wood & Metal
type: BicsLevel6Segment
type: Classifier
type: NamedIndividual
is level6 segment of: Household Furniture
created with: infer-bics.sql
derived from: Hhld Furniture ex Wood & Metal
  type: BicsLevel6Segment
  type: Classifier
  type: ContemporaryDerivation
  derived from: http://data.ga-group.nl/ics/bics/2014/111212101110
  source accessed on: 2019-12-03T20:05:01Z
  source last accessed on: 2019-12-03T20:05:01Z
  definition: This segment includes companies that manufacture household furniture made from plastic, wicker, fiberglass, rattan, composite materials and reeds.
  notation: 111212101110
  valid from: 2014-08-08
  valid till: 2020-10-03
source accessed on: 2019-12-03T20:05:01Z
source last accessed on: 2019-12-03T20:05:01Z
definition: This segment includes companies that manufacture household furniture made from plastic, wicker, fiberglass, rattan, composite materials and reeds.
notation: 111212101110
valid from: 2014-08-08
valid till: 2020-10-03

Metal Household Furniture
type: BicsLevel6Segment
type: Classifier
type: NamedIndividual
is level6 segment of: Household Furniture
is replaced by: Metal Furniture
created with: infer-bics.sql
derived from: Metal Household Furniture
  type: BicsLevel6Segment
  type: Classifier
  type: ContemporaryDerivation
  derived from: http://data.ga-group.nl/ics/bics/2014/111212101111
  source accessed on: 2019-12-03T20:05:01Z
  source last accessed on: 2019-12-03T20:05:01Z
  definition: This segment includes companies that manufacture metal household furniture and stand-alone cabinets.
  notation: 111212101111
  valid from: 2014-08-08
  valid till: 2020-10-03
source accessed on: 2019-12-03T20:05:01Z
source last accessed on: 2019-12-03T20:05:01Z
definition: This segment includes companies that manufacture metal household furniture and stand-alone cabinets.
notation: 111212101111
valid from: 2014-08-08
valid till: 2020-10-03

Nonupholstered Wood Furniture
type: BicsLevel7Segment
type: Classifier
type: NamedIndividual
is level7 segment of: Wood Household Furniture
is replaced by: Nonupholstered Wood Furniture
created with: infer-bics.sql
derived from: Nonupholstered Wood Furniture
  type: BicsLevel7Segment
  type: Classifier
  type: ContemporaryDerivation
  derived from: http://data.ga-group.nl/ics/bics/2014/11121210111210
  source accessed on: 2019-12-03T20:05:01Z
  source last accessed on: 2019-12-03T20:05:01Z
  definition: This segment includes companies that manufacture non-upholstered wood household furniture. Products include stand-alone cabinets.
  notation: 11121210111210
  valid from: 2014-08-08
  valid till: 2020-10-03
source accessed on: 2019-12-03T20:05:01Z
source last accessed on: 2019-12-03T20:05:01Z
definition: This segment includes companies that manufacture non-upholstered wood household furniture. Products include stand-alone cabinets.
notation: 11121210111210
valid from: 2014-08-08
valid till: 2020-10-03

Upholstered Wood Furniture
type: BicsLevel7Segment
type: Classifier
type: NamedIndividual
is level7 segment of: Wood Household Furniture
is replaced by: Upholstered Wood Furniture
created with: infer-bics.sql
derived from: Upholstered Wood Furniture
  type: BicsLevel7Segment
  type: Classifier
  type: ContemporaryDerivation
  derived from: http://data.ga-group.nl/ics/bics/2014/11121210111211
  source accessed on: 2019-12-03T20:05:01Z
  source last accessed on: 2019-12-03T20:05:01Z
  definition: This segment includes companies that manufacture upholstered household furniture and stand-alone cabinets.
  notation: 11121210111211
  valid from: 2014-08-08
  valid till: 2020-10-03
source accessed on: 2019-12-03T20:05:01Z
source last accessed on: 2019-12-03T20:05:01Z
definition: This segment includes companies that manufacture upholstered household furniture and stand-alone cabinets.
notation: 11121210111211
valid from: 2014-08-08
valid till: 2020-10-03

Wood Household Furniture
type: BicsLevel6Segment
type: Classifier
type: NamedIndividual
is level6 segment of: Household Furniture
is replaced by: Wood Furniture
created with: infer-bics.sql
derived from: Wood Household Furniture
  type: BicsLevel6Segment
  type: Classifier
  type: ContemporaryDerivation
  derived from: http://data.ga-group.nl/ics/bics/2014/111212101112
  source accessed on: 2019-12-03T20:05:01Z
  source last accessed on: 2019-12-03T20:05:01Z
  definition: This segment includes companies that manufacture upholstered, non-upholstered, and stand-alone wood cabinets for the home.
  notation: 111212101112
  valid from: 2014-08-08
  valid till: 2020-10-03
source accessed on: 2019-12-03T20:05:01Z
source last accessed on: 2019-12-03T20:05:01Z
definition: This segment includes companies that manufacture upholstered, non-upholstered, and stand-alone wood cabinets for the home.
notation: 111212101112
valid from: 2014-08-08
valid till: 2020-10-03

Household Furniture
type: BicsLevel5Segment
type: Classifier
type: NamedIndividual
is level5 segment of: Online Marketplace
is replaced by: Home Furniture
created with: infer-bics.sql
derived from: Household Furniture
  type: BicsLevel5Segment
  type: Classifier
  type: ContemporaryDerivation
  derived from: http://data.ga-group.nl/ics/bics/2014/1112121011
  source accessed on: 2019-12-03T20:05:01Z
  source last accessed on: 2019-12-03T20:05:01Z
  definition: This segment includes companies that manufacture wood, metal and composite household furniture.
  notation: 1112121011
  valid from: 2014-08-08
  valid till: 2020-10-03
source accessed on: 2019-12-03T20:05:01Z
source last accessed on: 2019-12-03T20:05:01Z
definition: This segment includes companies that manufacture wood, metal and composite household furniture.
notation: 1112121011
valid from: 2014-08-08
valid till: 2020-10-03

Mattress
type: BicsLevel5Segment
type: Classifier
type: NamedIndividual
is level5 segment of: Online Marketplace
is replaced by: Mattress
created with: infer-bics.sql
derived from: Mattress
  type: BicsLevel5Segment
  type: Classifier
  type: ContemporaryDerivation
  derived from: http://data.ga-group.nl/ics/bics/2014/1112121012
  source accessed on: 2019-12-03T20:05:01Z
  source last accessed on: 2019-12-03T20:05:01Z
  definition: This segment includes companies that manufacture foam rubber, memory material, innerspring, and non-innerspring mattresses, box springs and waterbeds.
  notation: 1112121012
  valid from: 2014-08-08
  valid till: 2020-10-03
source accessed on: 2019-12-03T20:05:01Z
source last accessed on: 2019-12-03T20:05:01Z
definition: This segment includes companies that manufacture foam rubber, memory material, innerspring, and non-innerspring mattresses, box springs and waterbeds.
notation: 1112121012
valid from: 2014-08-08
valid till: 2020-10-03

Online Marketplace
type: BicsLevel4SubIndustry
type: Classifier
type: NamedIndividual
created with: infer-bics.sql
derived from: Home Furniture
  type: BicsLevel4SubIndustry
  type: Classifier
  type: ContemporaryDerivation
  derived from: http://data.ga-group.nl/ics/bics/2014/11121210
  source accessed on: 2019-12-03T20:05:01Z
  source last accessed on: 2019-12-03T20:05:01Z
  definition: This industry subgroup includes companies that manufacture household furniture, office furniture, institutional furniture, mattresses, shades and blinds.
  notation: 11121210
  valid from: 2014-08-08
  valid till: 2020-10-03
derived from: Electronic Shopping
  type: BicsLevel4SubIndustry
  type: Classifier
  type: AnachronousDerivation
  derived from: http://data.ga-group.nl/ics/bics/2014/11201413
  source accessed on: 2019-12-03T20:05:01Z
  source last accessed on: 2019-12-03T20:05:01Z
  definition: This industry subgroup includes companies that retail all types of merchandise primarily online.
  notation: 11201413
  valid from: 2014-08-08
  valid till: 2020-10-03
derived from: Online Marketplace
  type: BicsLevel4SubIndustry
  type: Classifier
  type: ContemporaryDerivation
  derived from: http://data.ga-group.nl/ics/bics/2020/11121210
  derived from: http://data.ga-group.nl/ics/bics/2024/11121210
  source accessed on: 2023-07-03T18:11:29Z
  source last accessed on: 2024-06-05T14:42:36Z
  definition: This industry subgroup includes companies that offer an online marketplace for third party sellers or diversified online retailers to sell merchandise.
  notation: 11121210
  valid from: 2020-10-03
source accessed on: 2019-12-03T20:05:01Z
source last accessed on: 2024-06-05T14:42:36Z
definition: This industry subgroup includes companies that offer an online marketplace for third party sellers or diversified online retailers to sell merchandise.
notation: 11121210
valid from: 2014-08-08

Auto Parts - Online
type: BicsLevel5Segment
type: Classifier
type: NamedIndividual
is level5 segment of: Specialty Online Retailers
created with: infer-bics.sql
derived from: Crystal & Giftware
  type: BicsLevel5Segment
  type: Classifier
  type: ContemporaryDerivation
  derived from: http://data.ga-group.nl/ics/bics/2014/1112121110
  source accessed on: 2019-12-03T20:05:01Z
  source last accessed on: 2019-12-03T20:05:01Z
  definition: This segment includes companies that manufacture crystal and giftware.
  notation: 1112121110
  valid from: 2014-08-08
  valid till: 2020-10-03
derived from: Auto Parts & Supply - Online
  type: BicsLevel4SubIndustry
  type: Classifier
  type: AnachronousDerivation
  derived from: http://data.ga-group.nl/ics/bics/2014/11201410
  source accessed on: 2019-12-03T20:05:01Z
  source last accessed on: 2019-12-03T20:05:01Z
  definition: This industry subgroup includes companies that retail auto parts and accessories on the Internet.
  notation: 11201410
  valid from: 2014-08-08
  valid till: 2020-10-03
derived from: Auto Parts - Online
  type: BicsLevel5Segment
  type: Classifier
  type: ContemporaryDerivation
  derived from: http://data.ga-group.nl/ics/bics/2020/1112121110
  derived from: http://data.ga-group.nl/ics/bics/2024/1112121110
  source accessed on: 2023-07-03T18:11:29Z
  source last accessed on: 2024-06-05T14:42:36Z
  definition: This segment includes companies that retail auto parts and accessories on the Internet.
  notation: 1112121110
  valid from: 2020-10-03
source accessed on: 2019-12-03T20:05:01Z
source last accessed on: 2024-06-05T14:42:36Z
definition: This segment includes companies that retail auto parts and accessories on the Internet.
notation: 1112121110
valid from: 2014-08-08

Consumer Electronics - Online
type: BicsLevel5Segment
type: Classifier
type: NamedIndividual
is level5 segment of: Specialty Online Retailers
is replaced by: Cookware & Tableware
created with: infer-bics.sql
derived from: Cutlery & Flatware
  type: BicsLevel5Segment
  type: Classifier
  type: ContemporaryDerivation
  derived from: http://data.ga-group.nl/ics/bics/2014/1112121111
  source accessed on: 2019-12-03T20:05:01Z
  source last accessed on: 2019-12-03T20:05:01Z
  definition: This segment includes companies that manufacture plated metal cutlery and flatware. Includes forks, knives and spoons.
  notation: 1112121111
  valid from: 2014-08-08
  valid till: 2020-10-03
derived from: Consumer Electronics - Online
  type: BicsLevel4SubIndustry
  type: Classifier
  type: AnachronousDerivation
  derived from: http://data.ga-group.nl/ics/bics/2014/11201411
  source accessed on: 2019-12-03T20:05:01Z
  source last accessed on: 2019-12-03T20:05:01Z
  definition: This industry subgroup includes companies that retail consumer electronics products on the Internet.
  notation: 11201411
  valid from: 2014-08-08
  valid till: 2020-10-03
derived from: Consumer Electronics - Online
  type: BicsLevel5Segment
  type: Classifier
  type: ContemporaryDerivation
  derived from: http://data.ga-group.nl/ics/bics/2020/1112121111
  derived from: http://data.ga-group.nl/ics/bics/2024/1112121111
  source accessed on: 2023-07-03T18:11:29Z
  source last accessed on: 2024-06-05T14:42:36Z
  definition: This segment includes companies that retail consumer electronics products on the Internet.
  notation: 1112121111
  valid from: 2020-10-03
source accessed on: 2019-12-03T20:05:01Z
source last accessed on: 2024-06-05T14:42:36Z
definition: This segment includes companies that retail consumer electronics products on the Internet.
notation: 1112121111
valid from: 2014-08-08

Home & Office Products - Online
type: BicsLevel5Segment
type: Classifier
type: NamedIndividual
is level5 segment of: Specialty Online Retailers
created with: infer-bics.sql
derived from: Floriculture Products
  type: BicsLevel5Segment
  type: Classifier
  type: ContemporaryDerivation
  derived from: http://data.ga-group.nl/ics/bics/2014/1112121112
  source accessed on: 2019-12-03T20:05:01Z
  source last accessed on: 2019-12-03T20:05:01Z
  definition: This segment includes companies that produce cut flowers.
  notation: 1112121112
  valid from: 2014-08-08
  valid till: 2020-10-03
derived from: Home & Office Products - Online
  type: BicsLevel4SubIndustry
  type: Classifier
  type: AnachronousDerivation
  derived from: http://data.ga-group.nl/ics/bics/2014/11201414
  source accessed on: 2019-12-03T20:05:01Z
  source last accessed on: 2019-12-03T20:05:01Z
  definition: This industry subgroup includes pure-play Internet companies that retail products utilized in or for the home.
  notation: 11201414
  valid from: 2014-08-08
  valid till: 2020-10-03
derived from: Home & Office Products - Online
  type: BicsLevel5Segment
  type: Classifier
  type: ContemporaryDerivation
  derived from: http://data.ga-group.nl/ics/bics/2020/1112121112
  derived from: http://data.ga-group.nl/ics/bics/2024/1112121112
  source accessed on: 2023-07-03T18:11:29Z
  source last accessed on: 2024-06-05T14:42:36Z
  definition: This segment includes companies that retail home and office products on the Internet.
  notation: 1112121112
  valid from: 2020-10-03
source accessed on: 2019-12-03T20:05:01Z
source last accessed on: 2024-06-05T14:42:36Z
definition: This segment includes companies that retail home and office products on the Internet.
notation: 1112121112
valid from: 2014-08-08

Apparel & Footwear - Online
type: BicsLevel5Segment
type: Classifier
type: NamedIndividual
is level5 segment of: Specialty Online Retailers
created with: infer-bics.sql
derived from: Garden Products
  type: BicsLevel5Segment
  type: Classifier
  type: ContemporaryDerivation
  derived from: http://data.ga-group.nl/ics/bics/2014/1112121113
  source accessed on: 2019-12-03T20:05:01Z
  source last accessed on: 2019-12-03T20:05:01Z
  definition: This segment includes companies that manufacture garden products, such as pots, planters and hoses.
  notation: 1112121113
  valid from: 2014-08-08
  valid till: 2020-10-03
derived from: Apparel & Footwear - Online
  type: BicsLevel4SubIndustry
  type: Classifier
  type: AnachronousDerivation
  derived from: http://data.ga-group.nl/ics/bics/2014/11201415
  source accessed on: 2019-12-03T20:05:01Z
  source last accessed on: 2019-12-03T20:05:01Z
  definition: This industry subgroup includes companies that retail apparel and footwear on the Internet.
  notation: 11201415
  valid from: 2014-08-08
  valid till: 2020-10-03
derived from: Apparel & Footwear - Online
  type: BicsLevel5Segment
  type: Classifier
  type: ContemporaryDerivation
  derived from: http://data.ga-group.nl/ics/bics/2020/1112121113
  derived from: http://data.ga-group.nl/ics/bics/2024/1112121113
  source accessed on: 2023-07-03T18:11:29Z
  source last accessed on: 2024-06-05T14:42:36Z
  definition: This segment includes companies that retail apparel, clothing accessories, and footwear on the Internet.
  notation: 1112121113
  valid from: 2020-10-03
source accessed on: 2019-12-03T20:05:01Z
source last accessed on: 2024-06-05T14:42:36Z
definition: This segment includes companies that retail apparel, clothing accessories, and footwear on the Internet.
notation: 1112121113
valid from: 2014-08-08

Books - Online
type: BicsLevel5Segment
type: Classifier
type: NamedIndividual
is level5 segment of: Specialty Online Retailers
replaces: Books - Online
created with: infer-bics.sql
derived from: Greet Cards & Gift Wrap
  type: BicsLevel5Segment
  type: Classifier
  type: ContemporaryDerivation
  derived from: http://data.ga-group.nl/ics/bics/2014/1112121114
  source accessed on: 2019-12-03T20:05:01Z
  source last accessed on: 2019-12-03T20:05:01Z
  definition: This segment includes companies that manufacture greeting cards and gift wrap. Products include ribbons and gift bags.
  notation: 1112121114
  valid from: 2014-08-08
  valid till: 2020-10-03
derived from: Books - Online
  type: BicsLevel5Segment
  type: Classifier
  type: AnachronousDerivation
  derived from: http://data.ga-group.nl/ics/bics/2014/1120141610
  source accessed on: 2019-12-03T20:05:01Z
  source last accessed on: 2019-12-03T20:05:01Z
  definition: This segment includes pure-play Internet companies that retail books on the Internet.
  notation: 1120141610
  valid from: 2014-08-08
  valid till: 2020-10-03
derived from: Books - Online
  type: BicsLevel5Segment
  type: Classifier
  type: ContemporaryDerivation
  derived from: http://data.ga-group.nl/ics/bics/2020/1112121114
  derived from: http://data.ga-group.nl/ics/bics/2024/1112121114
  source accessed on: 2023-07-03T18:11:29Z
  source last accessed on: 2024-06-05T14:42:36Z
  definition: This segment includes companies that retail books on the Internet.
  notation: 1112121114
  valid from: 2020-10-03
source accessed on: 2019-12-03T20:05:01Z
source last accessed on: 2024-06-05T14:42:36Z
definition: This segment includes companies that retail books on the Internet.
notation: 1112121114
valid from: 2014-08-08

Cosmetics & Beauty - Online
type: BicsLevel5Segment
type: Classifier
type: NamedIndividual
is level5 segment of: Specialty Online Retailers
is replaced by: Home Decoration Products
replaces: Cosmetics & Beauty - Online
created with: infer-bics.sql
derived from: Home Decoration Products
  type: BicsLevel5Segment
  type: Classifier
  type: ContemporaryDerivation
  derived from: http://data.ga-group.nl/ics/bics/2014/1112121115
  source accessed on: 2019-12-03T20:05:01Z
  source last accessed on: 2019-12-03T20:05:01Z
  definition: This segment includes companies that manufacture home decoration products.
  notation: 1112121115
  valid from: 2014-08-08
  valid till: 2020-10-03
derived from: Cosmetics & Beauty - Online
  type: BicsLevel5Segment
  type: Classifier
  type: AnachronousDerivation
  derived from: http://data.ga-group.nl/ics/bics/2014/1120141611
  source accessed on: 2019-12-03T20:05:01Z
  source last accessed on: 2019-12-03T20:05:01Z
  definition: This segment includes pure-play Internet companies that retail cosmetics and beauty products on the Internet.
  notation: 1120141611
  valid from: 2014-08-08
  valid till: 2020-10-03
derived from: Cosmetics & Beauty - Online
  type: BicsLevel5Segment
  type: Classifier
  type: ContemporaryDerivation
  derived from: http://data.ga-group.nl/ics/bics/2020/1112121115
  derived from: http://data.ga-group.nl/ics/bics/2024/1112121115
  source accessed on: 2023-07-03T18:11:29Z
  source last accessed on: 2024-06-05T14:42:36Z
  definition: This segment includes companies that retail cosmetics and hair care products on the Internet.
  notation: 1112121115
  valid from: 2020-10-03
source accessed on: 2019-12-03T20:05:01Z
source last accessed on: 2024-06-05T14:42:36Z
definition: This segment includes companies that retail cosmetics and hair care products on the Internet.
notation: 1112121115
valid from: 2014-08-08

Flowers - Online
type: BicsLevel5Segment
type: Classifier
type: NamedIndividual
is level5 segment of: Specialty Online Retailers
replaces: Flowers - Online
created with: infer-bics.sql
derived from: Kitchen Utensils
  type: BicsLevel5Segment
  type: Classifier
  type: ContemporaryDerivation
  derived from: http://data.ga-group.nl/ics/bics/2014/1112121116
  source accessed on: 2019-12-03T20:05:01Z
  source last accessed on: 2019-12-03T20:05:01Z
  definition: This segment includes companies that manufacture kitchen utensils, pots, pans and household food storage containers.
  notation: 1112121116
  valid from: 2014-08-08
  valid till: 2020-10-03
derived from: Flowers - Online
  type: BicsLevel5Segment
  type: Classifier
  type: AnachronousDerivation
  derived from: http://data.ga-group.nl/ics/bics/2014/1120141612
  source accessed on: 2019-12-03T20:05:01Z
  source last accessed on: 2019-12-03T20:05:01Z
  definition: This segment includes pure-play Internet companies that retail cut flowers, floral arrangements and potted plants on the Internet.
  notation: 1120141612
  valid from: 2014-08-08
  valid till: 2020-10-03
derived from: Flowers - Online
  type: BicsLevel5Segment
  type: Classifier
  type: ContemporaryDerivation
  derived from: http://data.ga-group.nl/ics/bics/2020/1112121116
  derived from: http://data.ga-group.nl/ics/bics/2024/1112121116
  source accessed on: 2023-07-03T18:11:29Z
  source last accessed on: 2024-06-05T14:42:36Z
  definition: This segment includes companies that retail cut flowers, floral arrangements, and potted plants on the Internet.
  notation: 1112121116
  valid from: 2020-10-03
source accessed on: 2019-12-03T20:05:01Z
source last accessed on: 2024-06-05T14:42:36Z
definition: This segment includes companies that retail cut flowers, floral arrangements, and potted plants on the Internet.
notation: 1112121116
valid from: 2014-08-08

Toys & Games - Online
type: BicsLevel5Segment
type: Classifier
type: NamedIndividual
is level5 segment of: Specialty Online Retailers
replaces: Toys & Games - Online
created with: infer-bics.sql
derived from: Toys & Games - Online
  type: BicsLevel5Segment
  type: Classifier
  type: AnachronousDerivation
  derived from: http://data.ga-group.nl/ics/bics/2014/1120141613
  source accessed on: 2019-12-03T20:05:01Z
  source last accessed on: 2019-12-03T20:05:01Z
  definition: This segment includes pure-play Internet companies that retail toys, games and hobby products on the Internet.
  notation: 1120141613
  valid from: 2014-08-08
  valid till: 2020-10-03
derived from: Toys & Games - Online
  type: BicsLevel5Segment
  type: Classifier
  type: ContemporaryDerivation
  derived from: http://data.ga-group.nl/ics/bics/2020/1112121117
  derived from: http://data.ga-group.nl/ics/bics/2024/1112121117
  source accessed on: 2023-07-03T18:11:29Z
  source last accessed on: 2024-06-05T14:42:36Z
  definition: This segment includes companies that retail toys, games, and hobby-related products on the Internet.
  notation: 1112121117
  valid from: 2020-10-03
source accessed on: 2023-07-03T18:11:29Z
source last accessed on: 2024-06-05T14:42:36Z
definition: This segment includes companies that retail toys, games, and hobby-related products on the Internet.
notation: 1112121117
valid from: 2020-10-03

Jewelry & Watch - Online
type: BicsLevel5Segment
type: Classifier
type: NamedIndividual
is level5 segment of: Specialty Online Retailers
replaces: Jewelry & Watch - Online
created with: infer-bics.sql
derived from: Jewelry & Watch - Online
  type: BicsLevel5Segment
  type: Classifier
  type: AnachronousDerivation
  derived from: http://data.ga-group.nl/ics/bics/2014/1120141614
  source accessed on: 2019-12-03T20:05:01Z
  source last accessed on: 2019-12-03T20:05:01Z
  definition: This segment includes pure-play Internet companies that retail jewelry.
  notation: 1120141614
  valid from: 2014-08-08
  valid till: 2020-10-03
derived from: Jewelry & Watch - Online
  type: BicsLevel5Segment
  type: Classifier
  type: ContemporaryDerivation
  derived from: http://data.ga-group.nl/ics/bics/2020/1112121118
  derived from: http://data.ga-group.nl/ics/bics/2024/1112121118
  source accessed on: 2023-07-03T18:11:29Z
  source last accessed on: 2024-06-05T14:42:36Z
  definition: This segment includes companies that retail jewelry, watches, precious stones, and precious metal goods on the Internet.
  notation: 1112121118
  valid from: 2020-10-03
source accessed on: 2023-07-03T18:11:29Z
source last accessed on: 2024-06-05T14:42:36Z
definition: This segment includes companies that retail jewelry, watches, precious stones, and precious metal goods on the Internet.
notation: 1112121118
valid from: 2020-10-03

Music & Movies - Online
type: BicsLevel5Segment
type: Classifier
type: NamedIndividual
is level5 segment of: Specialty Online Retailers
replaces: Music & Movies - Online
created with: infer-bics.sql
derived from: Music & Movies - Online
  type: BicsLevel5Segment
  type: Classifier
  type: AnachronousDerivation
  derived from: http://data.ga-group.nl/ics/bics/2014/1120141616
  source accessed on: 2019-12-03T20:05:01Z
  source last accessed on: 2019-12-03T20:05:01Z
  definition: This segment includes companies that retail prerecorded music and movie products on the Internet.
  notation: 1120141616
  valid from: 2014-08-08
  valid till: 2020-10-03
derived from: Music & Movies - Online
  type: BicsLevel5Segment
  type: Classifier
  type: ContemporaryDerivation
  derived from: http://data.ga-group.nl/ics/bics/2020/1112121119
  derived from: http://data.ga-group.nl/ics/bics/2024/1112121119
  source accessed on: 2023-07-03T18:11:29Z
  source last accessed on: 2024-06-05T14:42:36Z
  definition: This segment includes companies that specialize in retailing music and movie products on the Internet.
  notation: 1112121119
  valid from: 2020-10-03
source accessed on: 2023-07-03T18:11:29Z
source last accessed on: 2024-06-05T14:42:36Z
definition: This segment includes companies that specialize in retailing music and movie products on the Internet.
notation: 1112121119
valid from: 2020-10-03

Musical Instrument - Online
type: BicsLevel5Segment
type: Classifier
type: NamedIndividual
is level5 segment of: Specialty Online Retailers
replaces: Musical Instrument - Online
created with: infer-bics.sql
derived from: Musical Instrument - Online
  type: BicsLevel5Segment
  type: Classifier
  type: AnachronousDerivation
  derived from: http://data.ga-group.nl/ics/bics/2014/1120141618
  source accessed on: 2019-12-03T20:05:01Z
  source last accessed on: 2019-12-03T20:05:01Z
  definition: This segment includes pure-play Internet companies that retail musical instruments and accessories on the Internet.
  notation: 1120141618
  valid from: 2014-08-08
  valid till: 2020-10-03
derived from: Musical Instrument - Online
  type: BicsLevel5Segment
  type: Classifier
  type: ContemporaryDerivation
  derived from: http://data.ga-group.nl/ics/bics/2020/1112121120
  derived from: http://data.ga-group.nl/ics/bics/2024/1112121120
  source accessed on: 2023-07-03T18:11:29Z
  source last accessed on: 2024-06-05T14:42:36Z
  definition: This segment includes companies that retail musical instruments and accessories on the Internet.
  notation: 1112121120
  valid from: 2020-10-03
source accessed on: 2023-07-03T18:11:29Z
source last accessed on: 2024-06-05T14:42:36Z
definition: This segment includes companies that retail musical instruments and accessories on the Internet.
notation: 1112121120
valid from: 2020-10-03

Pets & Supplies - Online
type: BicsLevel5Segment
type: Classifier
type: NamedIndividual
is level5 segment of: Specialty Online Retailers
replaces: Pets & Supplies - Online
created with: infer-bics.sql
derived from: Pets & Supplies - Online
  type: BicsLevel5Segment
  type: Classifier
  type: AnachronousDerivation
  derived from: http://data.ga-group.nl/ics/bics/2014/1120141619
  source accessed on: 2019-12-03T20:05:01Z
  source last accessed on: 2019-12-03T20:05:01Z
  definition: This segment includes pure-play Internet companies that retail pet products and supplies on the Internet.
  notation: 1120141619
  valid from: 2014-08-08
  valid till: 2020-10-03
derived from: Pets & Supplies - Online
  type: BicsLevel5Segment
  type: Classifier
  type: ContemporaryDerivation
  derived from: http://data.ga-group.nl/ics/bics/2020/1112121121
  derived from: http://data.ga-group.nl/ics/bics/2024/1112121121
  source accessed on: 2023-07-03T18:11:29Z
  source last accessed on: 2024-06-05T14:42:36Z
  definition: This segment includes companies that specialize in retailing pets and pet care products on the Internet.
  notation: 1112121121
  valid from: 2020-10-03
source accessed on: 2023-07-03T18:11:29Z
source last accessed on: 2024-06-05T14:42:36Z
definition: This segment includes companies that specialize in retailing pets and pet care products on the Internet.
notation: 1112121121
valid from: 2020-10-03

Sporting Goods - Online
type: BicsLevel5Segment
type: Classifier
type: NamedIndividual
is level5 segment of: Specialty Online Retailers
replaces: Sporting Goods - Online
created with: infer-bics.sql
derived from: Sporting Goods - Online
  type: BicsLevel5Segment
  type: Classifier
  type: AnachronousDerivation
  derived from: http://data.ga-group.nl/ics/bics/2014/1120141620
  source accessed on: 2019-12-03T20:05:01Z
  source last accessed on: 2019-12-03T20:05:01Z
  definition: This segment includes pure-play Internet companies that retail sporting goods primarily on the Internet.
  notation: 1120141620
  valid from: 2014-08-08
  valid till: 2020-10-03
derived from: Sporting Goods - Online
  type: BicsLevel5Segment
  type: Classifier
  type: ContemporaryDerivation
  derived from: http://data.ga-group.nl/ics/bics/2020/1112121122
  derived from: http://data.ga-group.nl/ics/bics/2024/1112121122
  source accessed on: 2023-07-03T18:11:29Z
  source last accessed on: 2024-06-05T14:42:36Z
  definition: This segment includes companies that specialize in retailing sporting goods, outdoor recreational products, and small arms on the Internet.
  notation: 1112121122
  valid from: 2020-10-03
source accessed on: 2023-07-03T18:11:29Z
source last accessed on: 2024-06-05T14:42:36Z
definition: This segment includes companies that specialize in retailing sporting goods, outdoor recreational products, and small arms on the Internet.
notation: 1112121122
valid from: 2020-10-03

Specialty Online Retailers
type: BicsLevel4SubIndustry
type: Classifier
type: NamedIndividual
replaces: E-Commerce Discretionary
created with: infer-bics.sql
derived from: Housewares
  type: BicsLevel4SubIndustry
  type: Classifier
  type: ContemporaryDerivation
  derived from: http://data.ga-group.nl/ics/bics/2014/11121211
  source accessed on: 2019-12-03T20:05:01Z
  source last accessed on: 2019-12-03T20:05:01Z
  definition: This industry subgroup includes companies that manufacture kitchen utensils, pots, pans, cutlery and flatware.
  notation: 11121211
  valid from: 2014-08-08
  valid till: 2020-10-03
derived from: E-Commerce Discretionary
  type: BicsLevel3Industry
  type: Classifier
  type: AnachronousDerivation
  derived from: http://data.ga-group.nl/ics/bics/2014/112014
  source accessed on: 2019-12-03T20:05:01Z
  source last accessed on: 2019-12-03T20:05:01Z
  definition: This industry includes companies that retail products on the Internet.
  notation: 112014
  valid from: 2014-08-08
  valid till: 2020-10-03
derived from: Other Specialty Retail - Online
  type: BicsLevel4SubIndustry
  type: Classifier
  type: AnachronousDerivation
  derived from: http://data.ga-group.nl/ics/bics/2014/11201416
  source accessed on: 2019-12-03T20:05:01Z
  source last accessed on: 2019-12-03T20:05:01Z
  definition: This industry subgroup includes online retail companies not elsewhere classified.
  notation: 11201416
  valid from: 2014-08-08
  valid till: 2020-10-03
derived from: Specialty Online Retailers
  type: BicsLevel4SubIndustry
  type: Classifier
  type: ContemporaryDerivation
  derived from: http://data.ga-group.nl/ics/bics/2020/11121211
  derived from: http://data.ga-group.nl/ics/bics/2024/11121211
  source accessed on: 2023-07-03T18:11:29Z
  source last accessed on: 2024-06-05T14:42:36Z
  definition: This industry subgroup includes companies that specialize in retailing specific merchandise lines on the Internet.
  notation: 11121211
  valid from: 2020-10-03
source accessed on: 2019-12-03T20:05:01Z
source last accessed on: 2024-06-05T14:42:36Z
definition: This industry subgroup includes companies that specialize in retailing specific merchandise lines on the Internet.
notation: 11121211
valid from: 2014-08-08

Office Furniture
type: BicsLevel4SubIndustry
type: Classifier
type: NamedIndividual
created with: infer-bics.sql
derived from: Office Furniture
  type: BicsLevel4SubIndustry
  type: Classifier
  type: ContemporaryDerivation
  derived from: http://data.ga-group.nl/ics/bics/2014/11121212
  source accessed on: 2019-12-03T20:05:01Z
  source last accessed on: 2019-12-03T20:05:01Z
  definition: This industry subgroup includes companies that manufacture nonresidential furniture. Products include office-type cabinets, chairs, desks, tables, showcases, partitions and shelving units.
  notation: 11121212
  valid from: 2014-08-08
  valid till: 2020-10-03
source accessed on: 2019-12-03T20:05:01Z
source last accessed on: 2019-12-03T20:05:01Z
definition: This industry subgroup includes companies that manufacture nonresidential furniture. Products include office-type cabinets, chairs, desks, tables, showcases, partitions and shelving units.
notation: 11121212
valid from: 2014-08-08
valid till: 2020-10-03

E-Commerce Discretionary
type: BicsLevel3Industry
type: Classifier
type: NamedIndividual
is industry of: Retail & Whsle - Discretionary
created with: infer-bics.sql
derived from: Home & Office Furnishings
  type: BicsLevel3Industry
  type: Classifier
  type: ContemporaryDerivation
  derived from: http://data.ga-group.nl/ics/bics/2014/111212
  source accessed on: 2019-12-03T20:05:01Z
  source last accessed on: 2019-12-03T20:05:01Z
  definition: This industry includes companies that manufacture household furniture, office furniture and housewares.
  notation: 111212
  valid from: 2014-08-08
  valid till: 2020-10-03
derived from: E-Commerce Discretionary
  type: BicsLevel3Industry
  type: Classifier
  type: ContemporaryDerivation
  derived from: http://data.ga-group.nl/ics/bics/2020/111212
  derived from: http://data.ga-group.nl/ics/bics/2024/111212
  source accessed on: 2023-07-03T18:11:29Z
  source last accessed on: 2024-06-05T14:42:36Z
  definition: This industry includes companies that retail consumer discretionary goods directly to the general public through websites.
  notation: 111212
  valid from: 2020-10-03
source accessed on: 2019-12-03T20:05:01Z
source last accessed on: 2024-06-05T14:42:36Z
definition: This industry includes companies that retail consumer discretionary goods directly to the general public through websites.
notation: 111212
valid from: 2014-08-08

Carbon Paper & Inked Ribbons
type: BicsLevel4SubIndustry
type: Classifier
type: NamedIndividual
created with: infer-bics.sql
derived from: Carbon Paper & Inked Ribbons
  type: BicsLevel4SubIndustry
  type: Classifier
  type: ContemporaryDerivation
  derived from: http://data.ga-group.nl/ics/bics/2014/11121310
  source accessed on: 2019-12-03T20:05:01Z
  source last accessed on: 2019-12-03T20:05:01Z
  definition: This industry subgroup includes companies that manufacture carbon paper and inked ribbons. Products include typewriter ribbons and stencil paper.
  notation: 11121310
  valid from: 2014-08-08
  valid till: 2020-10-03
source accessed on: 2019-12-03T20:05:01Z
source last accessed on: 2019-12-03T20:05:01Z
definition: This industry subgroup includes companies that manufacture carbon paper and inked ribbons. Products include typewriter ribbons and stencil paper.
notation: 11121310
valid from: 2014-08-08
valid till: 2020-10-03

Die-Cut Paper & Paperboard
type: BicsLevel4SubIndustry
type: Classifier
type: NamedIndividual
created with: infer-bics.sql
derived from: Die-Cut Paper & Paperboard
  type: BicsLevel4SubIndustry
  type: Classifier
  type: ContemporaryDerivation
  derived from: http://data.ga-group.nl/ics/bics/2014/11121311
  source accessed on: 2019-12-03T20:05:01Z
  source last accessed on: 2019-12-03T20:05:01Z
  definition: This industry subgroup includes companies that manufacture die-cut paper, manila folders, pocket folders and report covers.
  notation: 11121311
  valid from: 2014-08-08
  valid till: 2020-10-03
source accessed on: 2019-12-03T20:05:01Z
source last accessed on: 2019-12-03T20:05:01Z
definition: This industry subgroup includes companies that manufacture die-cut paper, manila folders, pocket folders and report covers.
notation: 11121311
valid from: 2014-08-08
valid till: 2020-10-03

Envelopes
type: BicsLevel4SubIndustry
type: Classifier
type: NamedIndividual
created with: infer-bics.sql
derived from: Envelopes
  type: BicsLevel4SubIndustry
  type: Classifier
  type: ContemporaryDerivation
  derived from: http://data.ga-group.nl/ics/bics/2014/11121312
  source accessed on: 2019-12-03T20:05:01Z
  source last accessed on: 2019-12-03T20:05:01Z
  definition: This industry subgroup includes companies that manufacture envelope products, such as envelopes, padded envelopes and seed packets.
  notation: 11121312
  valid from: 2014-08-08
  valid till: 2020-10-03
source accessed on: 2019-12-03T20:05:01Z
source last accessed on: 2019-12-03T20:05:01Z
definition: This industry subgroup includes companies that manufacture envelope products, such as envelopes, padded envelopes and seed packets.
notation: 11121312
valid from: 2014-08-08
valid till: 2020-10-03

Stationery & Note Books
type: BicsLevel4SubIndustry
type: Classifier
type: NamedIndividual
created with: infer-bics.sql
derived from: Stationery & Note Books
  type: BicsLevel4SubIndustry
  type: Classifier
  type: ContemporaryDerivation
  derived from: http://data.ga-group.nl/ics/bics/2014/11121313
  source accessed on: 2019-12-03T20:05:01Z
  source last accessed on: 2019-12-03T20:05:01Z
  definition: This industry subgroup includes companies that manufacture stationery and related office supplies, such as stationary tablets and notebooks.
  notation: 11121313
  valid from: 2014-08-08
  valid till: 2020-10-03
source accessed on: 2019-12-03T20:05:01Z
source last accessed on: 2019-12-03T20:05:01Z
definition: This industry subgroup includes companies that manufacture stationery and related office supplies, such as stationary tablets and notebooks.
notation: 11121313
valid from: 2014-08-08
valid till: 2020-10-03

Writing Instruments
type: BicsLevel4SubIndustry
type: Classifier
type: NamedIndividual
created with: infer-bics.sql
derived from: Writing Instruments
  type: BicsLevel4SubIndustry
  type: Classifier
  type: ContemporaryDerivation
  derived from: http://data.ga-group.nl/ics/bics/2014/11121314
  source accessed on: 2019-12-03T20:05:01Z
  source last accessed on: 2019-12-03T20:05:01Z
  definition: This industry subgroup includes companies that manufacture writing instruments. Such instruments include ballpoint pens, pencils, markers, chalk and rubber stamps.
  notation: 11121314
  valid from: 2014-08-08
  valid till: 2020-10-03
source accessed on: 2019-12-03T20:05:01Z
source last accessed on: 2019-12-03T20:05:01Z
definition: This industry subgroup includes companies that manufacture writing instruments. Such instruments include ballpoint pens, pencils, markers, chalk and rubber stamps.
notation: 11121314
valid from: 2014-08-08
valid till: 2020-10-03

Office Supplies
type: BicsLevel3Industry
type: Classifier
type: NamedIndividual
is industry of: Retail & Whsle - Discretionary
is replaced by: Office Supplies
created with: infer-bics.sql
derived from: Office Supplies
  type: BicsLevel3Industry
  type: Classifier
  type: ContemporaryDerivation
  derived from: http://data.ga-group.nl/ics/bics/2014/111213
  source accessed on: 2019-12-03T20:05:01Z
  source last accessed on: 2019-12-03T20:05:01Z
  definition: This industry includes companies that manufacture office supplies. Products include envelopes, tablets, notebooks, writing instruments, folders and carbon paper.
  notation: 111213
  valid from: 2014-08-08
  valid till: 2020-10-03
source accessed on: 2019-12-03T20:05:01Z
source last accessed on: 2019-12-03T20:05:01Z
definition: This industry includes companies that manufacture office supplies. Products include envelopes, tablets, notebooks, writing instruments, folders and carbon paper.
notation: 111213
valid from: 2014-08-08
valid till: 2020-10-03

Retail & Whsle - Discretionary
type: BicsLevel2IndustryGroup
type: Classifier
type: NamedIndividual
is industry group of: Consumer Discretionary
is replaced by: Home & Office Products
created with: infer-bics.sql
derived from: Home & Office Products
  type: BicsLevel2IndustryGroup
  type: Classifier
  type: ContemporaryDerivation
  derived from: http://data.ga-group.nl/ics/bics/2014/1112
  source accessed on: 2019-12-03T20:05:01Z
  source last accessed on: 2019-12-03T20:05:01Z
  definition: This industry group includes companies that build homes and manufacture home-related products as well as office supplies.
  notation: 1112
  valid from: 2014-08-08
  valid till: 2020-10-03
derived from: Retail & Whsle - Discretionary
  type: BicsLevel2IndustryGroup
  type: Classifier
  type: ContemporaryDerivation
  derived from: http://data.ga-group.nl/ics/bics/2020/1112
  derived from: http://data.ga-group.nl/ics/bics/2024/1112
  source accessed on: 2023-07-03T18:11:29Z
  source last accessed on: 2024-06-05T14:42:36Z
  definition: This industry group includes companies that provide distribution channels for consumer discretionary products.
  notation: 1112
  valid from: 2020-10-03
source accessed on: 2019-12-03T20:05:01Z
source last accessed on: 2024-06-05T14:42:36Z
definition: This industry group includes companies that provide distribution channels for consumer discretionary products.
notation: 1112
valid from: 2014-08-08

Dolls & Stuff Toys
type: BicsLevel5Segment
type: Classifier
type: NamedIndividual
is level5 segment of: Dolls, Toys & Games
created with: infer-bics.sql
derived from: Dolls & Stuff Toys
  type: BicsLevel5Segment
  type: Classifier
  type: ContemporaryDerivation
  derived from: http://data.ga-group.nl/ics/bics/2014/1113101010
  source accessed on: 2019-12-03T20:05:01Z
  source last accessed on: 2019-12-03T20:05:01Z
  definition: This segment includes companies that manufacture dolls, doll parts, doll clothes, stuffed toys and action figures.
  notation: 1113101010
  valid from: 2014-08-08
  valid till: 2020-10-03
source accessed on: 2019-12-03T20:05:01Z
source last accessed on: 2019-12-03T20:05:01Z
definition: This segment includes companies that manufacture dolls, doll parts, doll clothes, stuffed toys and action figures.
notation: 1113101010
valid from: 2014-08-08
valid till: 2020-10-03

Games, Toys & Child Vehicles
type: BicsLevel5Segment
type: Classifier
type: NamedIndividual
is level5 segment of: Dolls, Toys & Games
created with: infer-bics.sql
derived from: Games, Toys & Child Vehicles
  type: BicsLevel5Segment
  type: Classifier
  type: ContemporaryDerivation
  derived from: http://data.ga-group.nl/ics/bics/2014/1113101011
  source accessed on: 2019-12-03T20:05:01Z
  source last accessed on: 2019-12-03T20:05:01Z
  definition: This segment includes companies that manufacture games, toys and children's vehicles.
  notation: 1113101011
  valid from: 2014-08-08
  valid till: 2020-10-03
source accessed on: 2019-12-03T20:05:01Z
source last accessed on: 2019-12-03T20:05:01Z
definition: This segment includes companies that manufacture games, toys and children's vehicles.
notation: 1113101011
valid from: 2014-08-08
valid till: 2020-10-03

Dolls, Toys & Games
type: BicsLevel4SubIndustry
type: Classifier
type: NamedIndividual
created with: infer-bics.sql
derived from: Dolls, Toys & Games
  type: BicsLevel4SubIndustry
  type: Classifier
  type: ContemporaryDerivation
  derived from: http://data.ga-group.nl/ics/bics/2014/11131010
  source accessed on: 2019-12-03T20:05:01Z
  source last accessed on: 2019-12-03T20:05:01Z
  definition: This industry subgroup includes companies that manufacture toys and games, such as dolls, board games, stuffed animals, model kit sets, electronic games and go-carts.
  notation: 11131010
  valid from: 2014-08-08
  valid till: 2020-10-03
source accessed on: 2019-12-03T20:05:01Z
source last accessed on: 2019-12-03T20:05:01Z
definition: This industry subgroup includes companies that manufacture toys and games, such as dolls, board games, stuffed animals, model kit sets, electronic games and go-carts.
notation: 11131010
valid from: 2014-08-08
valid till: 2020-10-03

Royalty Income - Toys & Games
type: BicsLevel4SubIndustry
type: Classifier
type: NamedIndividual
created with: infer-bics.sql
derived from: Royalty Income - Toys & Games
  type: BicsLevel4SubIndustry
  type: Classifier
  type: ContemporaryDerivation
  derived from: http://data.ga-group.nl/ics/bics/2014/11131011
  source accessed on: 2019-12-03T20:05:01Z
  source last accessed on: 2019-12-03T20:05:01Z
  definition: This industry subgroup includes companies that generate money from licensing rights to toys and games.
  notation: 11131011
  valid from: 2014-08-08
  valid till: 2020-10-03
source accessed on: 2019-12-03T20:05:01Z
source last accessed on: 2019-12-03T20:05:01Z
definition: This industry subgroup includes companies that generate money from licensing rights to toys and games.
notation: 11131011
valid from: 2014-08-08
valid till: 2020-10-03

Toys & Games
type: BicsLevel3Industry
type: Classifier
type: NamedIndividual
is industry of: Leisure Products
is replaced by: Toys & Games
created with: infer-bics.sql
derived from: Toys & Games
  type: BicsLevel3Industry
  type: Classifier
  type: ContemporaryDerivation
  derived from: http://data.ga-group.nl/ics/bics/2014/111310
  source accessed on: 2019-12-03T20:05:01Z
  source last accessed on: 2019-12-03T20:05:01Z
  definition: This industry includes companies that make dolls, toys, board games, electronic games, action figures, playing cards, riding toys, toy instruments, puzzles and stuffed animals. It does not include metal bicycles or video game consoles or software.
  notation: 111310
  valid from: 2014-08-08
  valid till: 2020-10-03
source accessed on: 2019-12-03T20:05:01Z
source last accessed on: 2019-12-03T20:05:01Z
definition: This industry includes companies that make dolls, toys, board games, electronic games, action figures, playing cards, riding toys, toy instruments, puzzles and stuffed animals. It does not include metal bicycles or video game consoles or software.
notation: 111310
valid from: 2014-08-08
valid till: 2020-10-03

Music Instruments
type: BicsLevel3Industry
type: Classifier
type: NamedIndividual
is industry of: Leisure Products
is replaced by: Music Instruments
created with: infer-bics.sql
derived from: Music Instruments
  type: BicsLevel3Industry
  type: Classifier
  type: ContemporaryDerivation
  derived from: http://data.ga-group.nl/ics/bics/2014/111311
  source accessed on: 2019-12-03T20:05:01Z
  source last accessed on: 2019-12-03T20:05:01Z
  definition: This industry includes companies that manufacture stringed, keyboard, woodwind, brass and percussion instruments used to perform music.
  notation: 111311
  valid from: 2014-08-08
  valid till: 2020-10-03
source accessed on: 2019-12-03T20:05:01Z
source last accessed on: 2019-12-03T20:05:01Z
definition: This industry includes companies that manufacture stringed, keyboard, woodwind, brass and percussion instruments used to perform music.
notation: 111311
valid from: 2014-08-08
valid till: 2020-10-03

Leisure Boats & Yachts Building
type: BicsLevel4SubIndustry
type: Classifier
type: NamedIndividual
created with: infer-bics.sql
derived from: Leisure Boats & Yachts Building
  type: BicsLevel4SubIndustry
  type: Classifier
  type: ContemporaryDerivation
  derived from: http://data.ga-group.nl/ics/bics/2014/11131210
  source accessed on: 2019-12-03T20:05:01Z
  source last accessed on: 2019-12-03T20:05:01Z
  definition: This industry subgroup manufactures recreational watercraft, such as yachts, motorboats, sailboats, canoes, kayaks, rowboats and inflatable rafts.
  notation: 11131210
  valid from: 2014-08-08
  valid till: 2020-10-03
source accessed on: 2019-12-03T20:05:01Z
source last accessed on: 2019-12-03T20:05:01Z
definition: This industry subgroup manufactures recreational watercraft, such as yachts, motorboats, sailboats, canoes, kayaks, rowboats and inflatable rafts.
notation: 11131210
valid from: 2014-08-08
valid till: 2020-10-03

Motorhomes
type: BicsLevel5Segment
type: Classifier
type: NamedIndividual
is level5 segment of: Motorhomes, Trailers & Campers
is replaced by: Motorhomes
created with: infer-bics.sql
derived from: Motorhomes
  type: BicsLevel5Segment
  type: Classifier
  type: ContemporaryDerivation
  derived from: http://data.ga-group.nl/ics/bics/2014/1113121110
  source accessed on: 2019-12-03T20:05:01Z
  source last accessed on: 2019-12-03T20:05:01Z
  definition: This segment includes companies that manufacture motor homes.
  notation: 1113121110
  valid from: 2014-08-08
  valid till: 2020-10-03
source accessed on: 2019-12-03T20:05:01Z
source last accessed on: 2019-12-03T20:05:01Z
definition: This segment includes companies that manufacture motor homes.
notation: 1113121110
valid from: 2014-08-08
valid till: 2020-10-03

Travel Trailers & Campers
type: BicsLevel5Segment
type: Classifier
type: NamedIndividual
is level5 segment of: Motorhomes, Trailers & Campers
is replaced by: Travel Trailers & Campers
created with: infer-bics.sql
derived from: Travel Trailers & Campers
  type: BicsLevel5Segment
  type: Classifier
  type: ContemporaryDerivation
  derived from: http://data.ga-group.nl/ics/bics/2014/1113121111
  source accessed on: 2019-12-03T20:05:01Z
  source last accessed on: 2019-12-03T20:05:01Z
  definition: This segment includes companies that manufacture travel trailers and campers.
  notation: 1113121111
  valid from: 2014-08-08
  valid till: 2020-10-03
source accessed on: 2019-12-03T20:05:01Z
source last accessed on: 2019-12-03T20:05:01Z
definition: This segment includes companies that manufacture travel trailers and campers.
notation: 1113121111
valid from: 2014-08-08
valid till: 2020-10-03

Motorhomes, Trailers & Campers
type: BicsLevel4SubIndustry
type: Classifier
type: NamedIndividual
created with: infer-bics.sql
derived from: Motorhomes, Trailers & Campers
  type: BicsLevel4SubIndustry
  type: Classifier
  type: ContemporaryDerivation
  derived from: http://data.ga-group.nl/ics/bics/2014/11131211
  source accessed on: 2019-12-03T20:05:01Z
  source last accessed on: 2019-12-03T20:05:01Z
  definition: This industry subgroup includes companies that manufacture motor homes, travel trailers and campers.
  notation: 11131211
  valid from: 2014-08-08
  valid till: 2020-10-03
source accessed on: 2019-12-03T20:05:01Z
source last accessed on: 2019-12-03T20:05:01Z
definition: This industry subgroup includes companies that manufacture motor homes, travel trailers and campers.
notation: 11131211
valid from: 2014-08-08
valid till: 2020-10-03

Other Recreational Vehicles
type: BicsLevel4SubIndustry
type: Classifier
type: NamedIndividual
created with: infer-bics.sql
derived from: Other Recreational Vehicles
  type: BicsLevel4SubIndustry
  type: Classifier
  type: ContemporaryDerivation
  derived from: http://data.ga-group.nl/ics/bics/2014/11131212
  source accessed on: 2019-12-03T20:05:01Z
  source last accessed on: 2019-12-03T20:05:01Z
  definition: This industry subgroup includes companies that other manufacture recreational transportation equipment, including all-terrain vehicles (ATVs), snowmobiles, personal watercraft and golf carts.
  notation: 11131212
  valid from: 2014-08-08
  valid till: 2020-10-03
source accessed on: 2019-12-03T20:05:01Z
source last accessed on: 2019-12-03T20:05:01Z
definition: This industry subgroup includes companies that other manufacture recreational transportation equipment, including all-terrain vehicles (ATVs), snowmobiles, personal watercraft and golf carts.
notation: 11131212
valid from: 2014-08-08
valid till: 2020-10-03

Recreational Vehicles
type: BicsLevel3Industry
type: Classifier
type: NamedIndividual
is industry of: Leisure Products
is replaced by: Recreational Vehicles
created with: infer-bics.sql
derived from: Recreational Vehicles
  type: BicsLevel3Industry
  type: Classifier
  type: ContemporaryDerivation
  derived from: http://data.ga-group.nl/ics/bics/2014/111312
  source accessed on: 2019-12-03T20:05:01Z
  source last accessed on: 2019-12-03T20:05:01Z
  definition: This industry includes companies that manufacture motor homes, travel trailers and campers, and recreational vehicle equipment.
  notation: 111312
  valid from: 2014-08-08
  valid till: 2020-10-03
source accessed on: 2019-12-03T20:05:01Z
source last accessed on: 2019-12-03T20:05:01Z
definition: This industry includes companies that manufacture motor homes, travel trailers and campers, and recreational vehicle equipment.
notation: 111312
valid from: 2014-08-08
valid till: 2020-10-03

Bicycles
type: BicsLevel5Segment
type: Classifier
type: NamedIndividual
is level5 segment of: Bicycles & Parts
is replaced by: Bicycles
created with: infer-bics.sql
derived from: Bicycles
  type: BicsLevel5Segment
  type: Classifier
  type: ContemporaryDerivation
  derived from: http://data.ga-group.nl/ics/bics/2014/1113131010
  source accessed on: 2019-12-03T20:05:01Z
  source last accessed on: 2019-12-03T20:05:01Z
  definition: This segment includes companies that manufacture bicycles.
  notation: 1113131010
  valid from: 2014-08-08
  valid till: 2020-10-03
source accessed on: 2019-12-03T20:05:01Z
source last accessed on: 2019-12-03T20:05:01Z
definition: This segment includes companies that manufacture bicycles.
notation: 1113131010
valid from: 2014-08-08
valid till: 2020-10-03

Bicycle Parts
type: BicsLevel5Segment
type: Classifier
type: NamedIndividual
is level5 segment of: Bicycles & Parts
is replaced by: Bicycle Parts
created with: infer-bics.sql
derived from: Bicycle Parts
  type: BicsLevel5Segment
  type: Classifier
  type: ContemporaryDerivation
  derived from: http://data.ga-group.nl/ics/bics/2014/1113131011
  source accessed on: 2019-12-03T20:05:01Z
  source last accessed on: 2019-12-03T20:05:01Z
  definition: This segment includes companies that manufacture bicycle parts.
  notation: 1113131011
  valid from: 2014-08-08
  valid till: 2020-10-03
source accessed on: 2019-12-03T20:05:01Z
source last accessed on: 2019-12-03T20:05:01Z
definition: This segment includes companies that manufacture bicycle parts.
notation: 1113131011
valid from: 2014-08-08
valid till: 2020-10-03

Bicycles & Parts
type: BicsLevel4SubIndustry
type: Classifier
type: NamedIndividual
created with: infer-bics.sql
derived from: Bicycles & Parts
  type: BicsLevel4SubIndustry
  type: Classifier
  type: ContemporaryDerivation
  derived from: http://data.ga-group.nl/ics/bics/2014/11131310
  source accessed on: 2019-12-03T20:05:01Z
  source last accessed on: 2019-12-03T20:05:01Z
  definition: This industry subgroup includes companies that manufacture bicycles and bicycle parts.
  notation: 11131310
  valid from: 2014-08-08
  valid till: 2020-10-03
source accessed on: 2019-12-03T20:05:01Z
source last accessed on: 2019-12-03T20:05:01Z
definition: This industry subgroup includes companies that manufacture bicycles and bicycle parts.
notation: 11131310
valid from: 2014-08-08
valid till: 2020-10-03

Golf Equipment
type: BicsLevel4SubIndustry
type: Classifier
type: NamedIndividual
created with: infer-bics.sql
derived from: Golf Equipment
  type: BicsLevel4SubIndustry
  type: Classifier
  type: ContemporaryDerivation
  derived from: http://data.ga-group.nl/ics/bics/2014/11131311
  source accessed on: 2019-12-03T20:05:01Z
  source last accessed on: 2019-12-03T20:05:01Z
  definition: This industry subgroup includes companies that manufacture golfing equipment, such as bags, balls, caddy carts, clubs and tees.
  notation: 11131311
  valid from: 2014-08-08
  valid till: 2020-10-03
source accessed on: 2019-12-03T20:05:01Z
source last accessed on: 2019-12-03T20:05:01Z
definition: This industry subgroup includes companies that manufacture golfing equipment, such as bags, balls, caddy carts, clubs and tees.
notation: 11131311
valid from: 2014-08-08
valid till: 2020-10-03

Other Sporting Equipment
type: BicsLevel4SubIndustry
type: Classifier
type: NamedIndividual
created with: infer-bics.sql
derived from: Other Sporting Equipment
  type: BicsLevel4SubIndustry
  type: Classifier
  type: ContemporaryDerivation
  derived from: http://data.ga-group.nl/ics/bics/2014/11131312
  source accessed on: 2019-12-03T20:05:01Z
  source last accessed on: 2019-12-03T20:05:01Z
  definition: This industry subgroup includes companies that manufacture sporting goods not elsewhere classified.
  notation: 11131312
  valid from: 2014-08-08
  valid till: 2020-10-03
source accessed on: 2019-12-03T20:05:01Z
source last accessed on: 2019-12-03T20:05:01Z
definition: This industry subgroup includes companies that manufacture sporting goods not elsewhere classified.
notation: 11131312
valid from: 2014-08-08
valid till: 2020-10-03

Sporting Goods
type: BicsLevel3Industry
type: Classifier
type: NamedIndividual
is industry of: Leisure Products
is replaced by: Sporting Goods
created with: infer-bics.sql
derived from: Sporting Goods
  type: BicsLevel3Industry
  type: Classifier
  type: ContemporaryDerivation
  derived from: http://data.ga-group.nl/ics/bics/2014/111313
  source accessed on: 2019-12-03T20:05:01Z
  source last accessed on: 2019-12-03T20:05:01Z
  definition: This industry includes companies that manufacture sporting equipment. Includes metal bicycles; hard, soft and inflatable balls; rackets; bats; golf clubs; skates; protective sporting equipment; baseball gloves; bows; and camping and fishing equipment. Excludes recreational firearms (see Munitions & Small Arms).
  notation: 111313
  valid from: 2014-08-08
  valid till: 2020-10-03
source accessed on: 2019-12-03T20:05:01Z
source last accessed on: 2019-12-03T20:05:01Z
definition: This industry includes companies that manufacture sporting equipment. Includes metal bicycles; hard, soft and inflatable balls; rackets; bats; golf clubs; skates; protective sporting equipment; baseball gloves; bows; and camping and fishing equipment. Excludes recreational firearms (see Munitions & Small Arms).
notation: 111313
valid from: 2014-08-08
valid till: 2020-10-03

Leisure Products
type: BicsLevel2IndustryGroup
type: Classifier
type: NamedIndividual
is industry group of: Consumer Discretionary
is replaced by: Leisure Products
created with: infer-bics.sql
derived from: Leisure Products
  type: BicsLevel2IndustryGroup
  type: Classifier
  type: ContemporaryDerivation
  derived from: http://data.ga-group.nl/ics/bics/2014/1113
  source accessed on: 2019-12-03T20:05:01Z
  source last accessed on: 2019-12-03T20:05:01Z
  definition: This industry group includes companies that manufacture consumer electronics, recreational products, sporting goods, and toys and games.
  notation: 1113
  valid from: 2014-08-08
  valid till: 2020-10-03
source accessed on: 2019-12-03T20:05:01Z
source last accessed on: 2019-12-03T20:05:01Z
definition: This industry group includes companies that manufacture consumer electronics, recreational products, sporting goods, and toys and games.
notation: 1113
valid from: 2014-08-08
valid till: 2020-10-03

Facility Repair & Maintenance
type: BicsLevel4SubIndustry
type: Classifier
type: NamedIndividual
created with: infer-bics.sql
derived from: Facility Repair & Maintenance
  type: BicsLevel4SubIndustry
  type: Classifier
  type: ContemporaryDerivation
  derived from: http://data.ga-group.nl/ics/bics/2014/11141010
  source accessed on: 2019-12-03T20:05:01Z
  source last accessed on: 2019-12-03T20:05:01Z
  definition: This industry subgroup includes companies that provide building repair and maintenance services. Typically, these services are offered in an outsourcing model for property owners. These services include minor building repairs, painting, light fixture replacements and general handyman services. These companies may also hire and manage subcontractors, such as plumbers, electricians and HVAC specialists for more specialized services.
  notation: 11141010
  valid from: 2014-08-08
  valid till: 2020-10-03
source accessed on: 2019-12-03T20:05:01Z
source last accessed on: 2019-12-03T20:05:01Z
definition: This industry subgroup includes companies that provide building repair and maintenance services. Typically, these services are offered in an outsourcing model for property owners. These services include minor building repairs, painting, light fixture replacements and general handyman services. These companies may also hire and manage subcontractors, such as plumbers, electricians and HVAC specialists for more specialized services.
notation: 11141010
valid from: 2014-08-08
valid till: 2020-10-03

Janitorial Services
type: BicsLevel4SubIndustry
type: Classifier
type: NamedIndividual
created with: infer-bics.sql
derived from: Janitorial Services
  type: BicsLevel4SubIndustry
  type: Classifier
  type: ContemporaryDerivation
  derived from: http://data.ga-group.nl/ics/bics/2014/11141011
  source accessed on: 2019-12-03T20:05:01Z
  source last accessed on: 2019-12-03T20:05:01Z
  definition: This industry subgroup includes companies that clean windows, buildings, interiors and transportation equipment.
  notation: 11141011
  valid from: 2014-08-08
  valid till: 2020-10-03
source accessed on: 2019-12-03T20:05:01Z
source last accessed on: 2019-12-03T20:05:01Z
definition: This industry subgroup includes companies that clean windows, buildings, interiors and transportation equipment.
notation: 11141011
valid from: 2014-08-08
valid till: 2020-10-03

Landscaping Services
type: BicsLevel4SubIndustry
type: Classifier
type: NamedIndividual
created with: infer-bics.sql
derived from: Landscaping Services
  type: BicsLevel4SubIndustry
  type: Classifier
  type: ContemporaryDerivation
  derived from: http://data.ga-group.nl/ics/bics/2014/11141012
  source accessed on: 2019-12-03T20:05:01Z
  source last accessed on: 2019-12-03T20:05:01Z
  definition: This industry subgroup includes companies that perform planting, care and maintenance for lawns and flower beds for both commercial and residential properties. Excludes companies that specialize in engineering or designing landscape (see Landscape Architecture Svcs).
  notation: 11141012
  valid from: 2014-08-08
  valid till: 2020-10-03
source accessed on: 2019-12-03T20:05:01Z
source last accessed on: 2019-12-03T20:05:01Z
definition: This industry subgroup includes companies that perform planting, care and maintenance for lawns and flower beds for both commercial and residential properties. Excludes companies that specialize in engineering or designing landscape (see Landscape Architecture Svcs).
notation: 11141012
valid from: 2014-08-08
valid till: 2020-10-03

Pest Control Services
type: BicsLevel4SubIndustry
type: Classifier
type: NamedIndividual
created with: infer-bics.sql
derived from: Pest Control Services
  type: BicsLevel4SubIndustry
  type: Classifier
  type: ContemporaryDerivation
  derived from: http://data.ga-group.nl/ics/bics/2014/11141013
  source accessed on: 2019-12-03T20:05:01Z
  source last accessed on: 2019-12-03T20:05:01Z
  definition: This industry subgroup includes companies that provide pest elimination, prevention or deterrence. Excludes pest control services for agricultural purposes (see Support Activities-Crop Prod). Also known as exterminators.
  notation: 11141013
  valid from: 2014-08-08
  valid till: 2020-10-03
source accessed on: 2019-12-03T20:05:01Z
source last accessed on: 2019-12-03T20:05:01Z
definition: This industry subgroup includes companies that provide pest elimination, prevention or deterrence. Excludes pest control services for agricultural purposes (see Support Activities-Crop Prod). Also known as exterminators.
notation: 11141013
valid from: 2014-08-08
valid till: 2020-10-03

Building Maintenance Services
type: BicsLevel3Industry
type: Classifier
type: NamedIndividual
is industry of: Commercial Services
is replaced by: http://data.ga-group.nl/ics/bics/17111110
created with: infer-bics.sql
derived from: Building Maintenance Services
  type: BicsLevel3Industry
  type: Classifier
  type: ContemporaryDerivation
  derived from: http://data.ga-group.nl/ics/bics/2014/111410
  source accessed on: 2019-12-03T20:05:01Z
  source last accessed on: 2019-12-03T20:05:01Z
  definition: This industry includes companies that provide services to assist in the facility's day-to-day functions. Includes basic building repairs, painting, janitorial cleaning services, landscape maintenance and pest control. Excludes contract construction projects (see Building Subcontractors).
  notation: 111410
  valid from: 2014-08-08
  valid till: 2020-10-03
source accessed on: 2019-12-03T20:05:01Z
source last accessed on: 2019-12-03T20:05:01Z
definition: This industry includes companies that provide services to assist in the facility's day-to-day functions. Includes basic building repairs, painting, janitorial cleaning services, landscape maintenance and pest control. Excludes contract construction projects (see Building Subcontractors).
notation: 111410
valid from: 2014-08-08
valid till: 2020-10-03

Architectural Services
type: BicsLevel4SubIndustry
type: Classifier
type: NamedIndividual
created with: infer-bics.sql
derived from: Architectural Services
  type: BicsLevel4SubIndustry
  type: Classifier
  type: ContemporaryDerivation
  derived from: http://data.ga-group.nl/ics/bics/2014/11141110
  source accessed on: 2019-12-03T20:05:01Z
  source last accessed on: 2019-12-03T20:05:01Z
  definition: This industry subgroup includes companies that provide architectural design services for residential, commercial and industrial buildings.
  notation: 11141110
  valid from: 2014-08-08
  valid till: 2020-10-03
source accessed on: 2019-12-03T20:05:01Z
source last accessed on: 2019-12-03T20:05:01Z
definition: This industry subgroup includes companies that provide architectural design services for residential, commercial and industrial buildings.
notation: 11141110
valid from: 2014-08-08
valid till: 2020-10-03

Building Inspection Services
type: BicsLevel4SubIndustry
type: Classifier
type: NamedIndividual
created with: infer-bics.sql
derived from: Building Inspection Services
  type: BicsLevel4SubIndustry
  type: Classifier
  type: ContemporaryDerivation
  derived from: http://data.ga-group.nl/ics/bics/2014/11141111
  source accessed on: 2019-12-03T20:05:01Z
  source last accessed on: 2019-12-03T20:05:01Z
  definition: This industry subgroup includes companies that provide building and home inspection services.
  notation: 11141111
  valid from: 2014-08-08
  valid till: 2020-10-03
source accessed on: 2019-12-03T20:05:01Z
source last accessed on: 2019-12-03T20:05:01Z
definition: This industry subgroup includes companies that provide building and home inspection services.
notation: 11141111
valid from: 2014-08-08
valid till: 2020-10-03

Landscape Architecture Svcs
type: BicsLevel4SubIndustry
type: Classifier
type: NamedIndividual
created with: infer-bics.sql
derived from: Landscape Architecture Svcs
  type: BicsLevel4SubIndustry
  type: Classifier
  type: ContemporaryDerivation
  derived from: http://data.ga-group.nl/ics/bics/2014/11141112
  source accessed on: 2019-12-03T20:05:01Z
  source last accessed on: 2019-12-03T20:05:01Z
  definition: This industry subgroup includes companies that provide landscape design and land use management services.
  notation: 11141112
  valid from: 2014-08-08
  valid till: 2020-10-03
source accessed on: 2019-12-03T20:05:01Z
source last accessed on: 2019-12-03T20:05:01Z
definition: This industry subgroup includes companies that provide landscape design and land use management services.
notation: 11141112
valid from: 2014-08-08
valid till: 2020-10-03

Construction Related Pro Svcs
type: BicsLevel3Industry
type: Classifier
type: NamedIndividual
is industry of: Commercial Services
created with: infer-bics.sql
derived from: Construction Related Pro Svcs
  type: BicsLevel3Industry
  type: Classifier
  type: ContemporaryDerivation
  derived from: http://data.ga-group.nl/ics/bics/2014/111411
  source accessed on: 2019-12-03T20:05:01Z
  source last accessed on: 2019-12-03T20:05:01Z
  definition: This industry includes companies that provide construction-related professional services, such as architectural design, landscaping and building inspection.
  notation: 111411
  valid from: 2014-08-08
  valid till: 2020-10-03
source accessed on: 2019-12-03T20:05:01Z
source last accessed on: 2019-12-03T20:05:01Z
definition: This industry includes companies that provide construction-related professional services, such as architectural design, landscaping and building inspection.
notation: 111411
valid from: 2014-08-08
valid till: 2020-10-03

Caterers
type: BicsLevel4SubIndustry
type: Classifier
type: NamedIndividual
created with: infer-bics.sql
derived from: Caterers
  type: BicsLevel4SubIndustry
  type: Classifier
  type: ContemporaryDerivation
  derived from: http://data.ga-group.nl/ics/bics/2014/11141210
  source accessed on: 2019-12-03T20:05:01Z
  source last accessed on: 2019-12-03T20:05:01Z
  definition: This industry subgroup includes companies that offer single-event food services.
  notation: 11141210
  valid from: 2014-08-08
  valid till: 2020-10-03
source accessed on: 2019-12-03T20:05:01Z
source last accessed on: 2019-12-03T20:05:01Z
definition: This industry subgroup includes companies that offer single-event food services.
notation: 11141210
valid from: 2014-08-08
valid till: 2020-10-03

Food Service Contractors
type: BicsLevel4SubIndustry
type: Classifier
type: NamedIndividual
created with: infer-bics.sql
derived from: Food Service Contractors
  type: BicsLevel4SubIndustry
  type: Classifier
  type: ContemporaryDerivation
  derived from: http://data.ga-group.nl/ics/bics/2014/11141211
  source accessed on: 2019-12-03T20:05:01Z
  source last accessed on: 2019-12-03T20:05:01Z
  definition: This industry subgroup includes companies that provide food services to institutional, governmental, commercial, or industrial clients, usually on a contractual basis.
  notation: 11141211
  valid from: 2014-08-08
  valid till: 2020-10-03
source accessed on: 2019-12-03T20:05:01Z
source last accessed on: 2019-12-03T20:05:01Z
definition: This industry subgroup includes companies that provide food services to institutional, governmental, commercial, or industrial clients, usually on a contractual basis.
notation: 11141211
valid from: 2014-08-08
valid till: 2020-10-03

Food Services
type: BicsLevel3Industry
type: Classifier
type: NamedIndividual
is industry of: Commercial Services
is replaced by: http://data.ga-group.nl/ics/bics/17111111
created with: infer-bics.sql
derived from: Food Services
  type: BicsLevel3Industry
  type: Classifier
  type: ContemporaryDerivation
  derived from: http://data.ga-group.nl/ics/bics/2014/111412
  source accessed on: 2019-12-03T20:05:01Z
  source last accessed on: 2019-12-03T20:05:01Z
  definition: This industry includes companies that provide catering for a single event or long-term food services for a specified period of time via contract. They may cater single events at different locations or continually operate concessions at sports or similar facilities. The food may be served or offered cafeteria style.
  notation: 111412
  valid from: 2014-08-08
  valid till: 2020-10-03
source accessed on: 2019-12-03T20:05:01Z
source last accessed on: 2019-12-03T20:05:01Z
definition: This industry includes companies that provide catering for a single event or long-term food services for a specified period of time via contract. They may cater single events at different locations or continually operate concessions at sports or similar facilities. The food may be served or offered cafeteria style.
notation: 111412
valid from: 2014-08-08
valid till: 2020-10-03

Newspaper, Book & Mag Printing
type: BicsLevel4SubIndustry
type: Classifier
type: NamedIndividual
created with: infer-bics.sql
derived from: Newspaper, Book & Mag Printing
  type: BicsLevel4SubIndustry
  type: Classifier
  type: ContemporaryDerivation
  derived from: http://data.ga-group.nl/ics/bics/2014/11141310
  source accessed on: 2019-12-03T20:05:01Z
  source last accessed on: 2019-12-03T20:05:01Z
  definition: This industry subgroup includes companies that provide newspaper, book and magazine printing and binding services.
  notation: 11141310
  valid from: 2014-08-08
  valid till: 2020-10-03
source accessed on: 2019-12-03T20:05:01Z
source last accessed on: 2019-12-03T20:05:01Z
definition: This industry subgroup includes companies that provide newspaper, book and magazine printing and binding services.
notation: 11141310
valid from: 2014-08-08
valid till: 2020-10-03

Printing Support
type: BicsLevel4SubIndustry
type: Classifier
type: NamedIndividual
created with: infer-bics.sql
derived from: Printing Support
  type: BicsLevel4SubIndustry
  type: Classifier
  type: ContemporaryDerivation
  derived from: http://data.ga-group.nl/ics/bics/2014/11141311
  source accessed on: 2019-12-03T20:05:01Z
  source last accessed on: 2019-12-03T20:05:01Z
  definition: This industry subgroup includes companies that provide printing support services.
  notation: 11141311
  valid from: 2014-08-08
  valid till: 2020-10-03
source accessed on: 2019-12-03T20:05:01Z
source last accessed on: 2019-12-03T20:05:01Z
definition: This industry subgroup includes companies that provide printing support services.
notation: 11141311
valid from: 2014-08-08
valid till: 2020-10-03

Other Commercial Printing
type: BicsLevel4SubIndustry
type: Classifier
type: NamedIndividual
created with: infer-bics.sql
derived from: Other Commercial Printing
  type: BicsLevel4SubIndustry
  type: Classifier
  type: ContemporaryDerivation
  derived from: http://data.ga-group.nl/ics/bics/2014/11141312
  source accessed on: 2019-12-03T20:05:01Z
  source last accessed on: 2019-12-03T20:05:01Z
  definition: This industry subgroup includes companies that provide commercial printing services not elsewhere classified. Includes letterpress and engraving printing services.
  notation: 11141312
  valid from: 2014-08-08
  valid till: 2020-10-03
source accessed on: 2019-12-03T20:05:01Z
source last accessed on: 2019-12-03T20:05:01Z
definition: This industry subgroup includes companies that provide commercial printing services not elsewhere classified. Includes letterpress and engraving printing services.
notation: 11141312
valid from: 2014-08-08
valid till: 2020-10-03

Printing Services
type: BicsLevel3Industry
type: Classifier
type: NamedIndividual
is industry of: Commercial Services
is replaced by: http://data.ga-group.nl/ics/bics/17111112
created with: infer-bics.sql
derived from: Printing Services
  type: BicsLevel3Industry
  type: Classifier
  type: ContemporaryDerivation
  derived from: http://data.ga-group.nl/ics/bics/2014/111413
  source accessed on: 2019-12-03T20:05:01Z
  source last accessed on: 2019-12-03T20:05:01Z
  definition: This industry includes companies that provide a variety of copying, document preparation and support services for printing activities.
  notation: 111413
  valid from: 2014-08-08
  valid till: 2020-10-03
source accessed on: 2019-12-03T20:05:01Z
source last accessed on: 2019-12-03T20:05:01Z
definition: This industry includes companies that provide a variety of copying, document preparation and support services for printing activities.
notation: 111413
valid from: 2014-08-08
valid till: 2020-10-03

Lawyer Offices
type: BicsLevel5Segment
type: Classifier
type: NamedIndividual
is level5 segment of: Legal Services
is replaced by: http://data.ga-group.nl/ics/bics/171111161010
created with: infer-bics.sql
derived from: Lawyer Offices
  type: BicsLevel5Segment
  type: Classifier
  type: ContemporaryDerivation
  derived from: http://data.ga-group.nl/ics/bics/2014/1114141010
  source accessed on: 2019-12-03T20:05:01Z
  source last accessed on: 2019-12-03T20:05:01Z
  definition: This segment includes offices of legal practitioners. Such offices include attorneys' offices, barristers' offices, criminal law offices, law firms and solicitors' offices.
  notation: 1114141010
  valid from: 2014-08-08
  valid till: 2020-10-03
source accessed on: 2019-12-03T20:05:01Z
source last accessed on: 2019-12-03T20:05:01Z
definition: This segment includes offices of legal practitioners. Such offices include attorneys' offices, barristers' offices, criminal law offices, law firms and solicitors' offices.
notation: 1114141010
valid from: 2014-08-08
valid till: 2020-10-03

Patent, Notary & Paralegal Svcs
type: BicsLevel5Segment
type: Classifier
type: NamedIndividual
is level5 segment of: Legal Services
is replaced by: http://data.ga-group.nl/ics/bics/171111161011
created with: infer-bics.sql
derived from: Patent, Notary & Paralegal Svcs
  type: BicsLevel5Segment
  type: Classifier
  type: ContemporaryDerivation
  derived from: http://data.ga-group.nl/ics/bics/2014/1114141011
  source accessed on: 2019-12-03T20:05:01Z
  source last accessed on: 2019-12-03T20:05:01Z
  definition: This segment includes companies that provide notary services, public services, paralegal services, patent agent services and process-serving services.
  notation: 1114141011
  valid from: 2014-08-08
  valid till: 2020-10-03
source accessed on: 2019-12-03T20:05:01Z
source last accessed on: 2019-12-03T20:05:01Z
definition: This segment includes companies that provide notary services, public services, paralegal services, patent agent services and process-serving services.
notation: 1114141011
valid from: 2014-08-08
valid till: 2020-10-03

Legal Services
type: BicsLevel4SubIndustry
type: Classifier
type: NamedIndividual
created with: infer-bics.sql
derived from: Legal Services
  type: BicsLevel4SubIndustry
  type: Classifier
  type: ContemporaryDerivation
  derived from: http://data.ga-group.nl/ics/bics/2014/11141410
  source accessed on: 2019-12-03T20:05:01Z
  source last accessed on: 2019-12-03T20:05:01Z
  definition: This industry subgroup includes groups or organizations of lawyers who provide expertise in a range of specific areas of law, such as criminal, family, estate, patent, real estate, or tax law.
  notation: 11141410
  valid from: 2014-08-08
  valid till: 2020-10-03
source accessed on: 2019-12-03T20:05:01Z
source last accessed on: 2019-12-03T20:05:01Z
definition: This industry subgroup includes groups or organizations of lawyers who provide expertise in a range of specific areas of law, such as criminal, family, estate, patent, real estate, or tax law.
notation: 11141410
valid from: 2014-08-08
valid till: 2020-10-03

Employment Agencies
type: BicsLevel5Segment
type: Classifier
type: NamedIndividual
is level5 segment of: Mgmt & Admin Consulting Svcs
is replaced by: http://data.ga-group.nl/ics/bics/171111161110
created with: infer-bics.sql
derived from: Employment Agencies
  type: BicsLevel5Segment
  type: Classifier
  type: ContemporaryDerivation
  derived from: http://data.ga-group.nl/ics/bics/2014/1114141110
  source accessed on: 2019-12-03T20:05:01Z
  source last accessed on: 2019-12-03T20:05:01Z
  definition: This segment includes companies that serve as an intermediary between hiring companies and potential job candidates.
  notation: 1114141110
  valid from: 2014-08-08
  valid till: 2020-10-03
source accessed on: 2019-12-03T20:05:01Z
source last accessed on: 2019-12-03T20:05:01Z
definition: This segment includes companies that serve as an intermediary between hiring companies and potential job candidates.
notation: 1114141110
valid from: 2014-08-08
valid till: 2020-10-03

Executive Search
type: BicsLevel5Segment
type: Classifier
type: NamedIndividual
is level5 segment of: Mgmt & Admin Consulting Svcs
is replaced by: http://data.ga-group.nl/ics/bics/171111161111
created with: infer-bics.sql
derived from: Executive Search
  type: BicsLevel5Segment
  type: Classifier
  type: ContemporaryDerivation
  derived from: http://data.ga-group.nl/ics/bics/2014/1114141111
  source accessed on: 2019-12-03T20:05:01Z
  source last accessed on: 2019-12-03T20:05:01Z
  definition: This segment includes companies that provide executive search, recruitment and placement services for clients with specific executive and senior management position requirements.
  notation: 1114141111
  valid from: 2014-08-08
  valid till: 2020-10-03
source accessed on: 2019-12-03T20:05:01Z
source last accessed on: 2019-12-03T20:05:01Z
definition: This segment includes companies that provide executive search, recruitment and placement services for clients with specific executive and senior management position requirements.
notation: 1114141111
valid from: 2014-08-08
valid till: 2020-10-03

General Management Consulting
type: BicsLevel5Segment
type: Classifier
type: NamedIndividual
is level5 segment of: Mgmt & Admin Consulting Svcs
is replaced by: http://data.ga-group.nl/ics/bics/171111161112
created with: infer-bics.sql
derived from: General Management Consulting
  type: BicsLevel5Segment
  type: Classifier
  type: ContemporaryDerivation
  derived from: http://data.ga-group.nl/ics/bics/2014/1114141112
  source accessed on: 2019-12-03T20:05:01Z
  source last accessed on: 2019-12-03T20:05:01Z
  definition: This segment includes companies that provide operating advice and assistance to businesses and other organizations on administrative management issues, such as financial planning and budgeting, records management, office planning, strategic and organizational planning, site selection, new business startup and business process improvement.
  notation: 1114141112
  valid from: 2014-08-08
  valid till: 2020-10-03
source accessed on: 2019-12-03T20:05:01Z
source last accessed on: 2019-12-03T20:05:01Z
definition: This segment includes companies that provide operating advice and assistance to businesses and other organizations on administrative management issues, such as financial planning and budgeting, records management, office planning, strategic and organizational planning, site selection, new business startup and business process improvement.
notation: 1114141112
valid from: 2014-08-08
valid till: 2020-10-03

Talent Management Services
type: BicsLevel5Segment
type: Classifier
type: NamedIndividual
is level5 segment of: Mgmt & Admin Consulting Svcs
is replaced by: http://data.ga-group.nl/ics/bics/171111161113
created with: infer-bics.sql
derived from: Talent Management Services
  type: BicsLevel5Segment
  type: Classifier
  type: ContemporaryDerivation
  derived from: http://data.ga-group.nl/ics/bics/2014/1114141113
  source accessed on: 2019-12-03T20:05:01Z
  source last accessed on: 2019-12-03T20:05:01Z
  definition: This segment includes companies that provide promotional agency services. These companies enter into contractual agreements with their clients and aid in job placements and career development. Typically, these companies operate agencies and are specialized in job-related fields (modelling, music, sports, etc.). Also known as talent agencies.
  notation: 1114141113
  valid from: 2014-08-08
  valid till: 2020-10-03
source accessed on: 2019-12-03T20:05:01Z
source last accessed on: 2019-12-03T20:05:01Z
definition: This segment includes companies that provide promotional agency services. These companies enter into contractual agreements with their clients and aid in job placements and career development. Typically, these companies operate agencies and are specialized in job-related fields (modelling, music, sports, etc.). Also known as talent agencies.
notation: 1114141113
valid from: 2014-08-08
valid till: 2020-10-03

Temporary Help
type: BicsLevel5Segment
type: Classifier
type: NamedIndividual
is level5 segment of: Mgmt & Admin Consulting Svcs
is replaced by: http://data.ga-group.nl/ics/bics/171111161114
created with: infer-bics.sql
derived from: Temporary Help
  type: BicsLevel5Segment
  type: Classifier
  type: ContemporaryDerivation
  derived from: http://data.ga-group.nl/ics/bics/2014/1114141114
  source accessed on: 2019-12-03T20:05:01Z
  source last accessed on: 2019-12-03T20:05:01Z
  definition: This segment includes companies that provide workers to clients' businesses for limited periods of time to supplement the client's existing work force. Also known as temp agencies.
  notation: 1114141114
  valid from: 2014-08-08
  valid till: 2020-10-03
source accessed on: 2019-12-03T20:05:01Z
source last accessed on: 2019-12-03T20:05:01Z
definition: This segment includes companies that provide workers to clients' businesses for limited periods of time to supplement the client's existing work force. Also known as temp agencies.
notation: 1114141114
valid from: 2014-08-08
valid till: 2020-10-03

Mgmt & Admin Consulting Svcs
type: BicsLevel4SubIndustry
type: Classifier
type: NamedIndividual
created with: infer-bics.sql
derived from: Mgmt & Admin Consulting Svcs
  type: BicsLevel4SubIndustry
  type: Classifier
  type: ContemporaryDerivation
  derived from: http://data.ga-group.nl/ics/bics/2014/11141411
  source accessed on: 2019-12-03T20:05:01Z
  source last accessed on: 2019-12-03T20:05:01Z
  definition: This industry subgroup includes organizations that provide advice and assistance to businesses and other organizations on management issues, such as organizational planning, financial planning and budgeting, marketing, human resources, business process outsourcing and other third-party services.
  notation: 11141411
  valid from: 2014-08-08
  valid till: 2020-10-03
source accessed on: 2019-12-03T20:05:01Z
source last accessed on: 2019-12-03T20:05:01Z
definition: This industry subgroup includes organizations that provide advice and assistance to businesses and other organizations on management issues, such as organizational planning, financial planning and budgeting, marketing, human resources, business process outsourcing and other third-party services.
notation: 11141411
valid from: 2014-08-08
valid till: 2020-10-03

Accounting Services
type: BicsLevel5Segment
type: Classifier
type: NamedIndividual
is level5 segment of: Other Professional Services
is replaced by: http://data.ga-group.nl/ics/bics/171111161210
created with: infer-bics.sql
derived from: Accounting Services
  type: BicsLevel5Segment
  type: Classifier
  type: ContemporaryDerivation
  derived from: http://data.ga-group.nl/ics/bics/2014/1114141210
  source accessed on: 2019-12-03T20:05:01Z
  source last accessed on: 2019-12-03T20:05:01Z
  definition: This segment includes companies that audit the accounting records of public and private organizations.
  notation: 1114141210
  valid from: 2014-08-08
  valid till: 2020-10-03
source accessed on: 2019-12-03T20:05:01Z
source last accessed on: 2019-12-03T20:05:01Z
definition: This segment includes companies that audit the accounting records of public and private organizations.
notation: 1114141210
valid from: 2014-08-08
valid till: 2020-10-03

Tax Preparation Services
type: BicsLevel5Segment
type: Classifier
type: NamedIndividual
is level5 segment of: Other Professional Services
is replaced by: http://data.ga-group.nl/ics/bics/171111161211
created with: infer-bics.sql
derived from: Tax Preparation Services
  type: BicsLevel5Segment
  type: Classifier
  type: ContemporaryDerivation
  derived from: http://data.ga-group.nl/ics/bics/2014/1114141211
  source accessed on: 2019-12-03T20:05:01Z
  source last accessed on: 2019-12-03T20:05:01Z
  definition: This segment includes companies that provide tax return, payroll and bookkeeping services.
  notation: 1114141211
  valid from: 2014-08-08
  valid till: 2020-10-03
source accessed on: 2019-12-03T20:05:01Z
source last accessed on: 2019-12-03T20:05:01Z
definition: This segment includes companies that provide tax return, payroll and bookkeeping services.
notation: 1114141211
valid from: 2014-08-08
valid till: 2020-10-03

Other Professional Services
type: BicsLevel4SubIndustry
type: Classifier
type: NamedIndividual
created with: infer-bics.sql
derived from: Other Professional Services
  type: BicsLevel4SubIndustry
  type: Classifier
  type: ContemporaryDerivation
  derived from: http://data.ga-group.nl/ics/bics/2014/11141412
  source accessed on: 2019-12-03T20:05:01Z
  source last accessed on: 2019-12-03T20:05:01Z
  definition: This industry subgroup includes organizations that provide professional services not elsewhere classified.
  notation: 11141412
  valid from: 2014-08-08
  valid till: 2020-10-03
source accessed on: 2019-12-03T20:05:01Z
source last accessed on: 2019-12-03T20:05:01Z
definition: This industry subgroup includes organizations that provide professional services not elsewhere classified.
notation: 11141412
valid from: 2014-08-08
valid till: 2020-10-03

Professional Services
type: BicsLevel3Industry
type: Classifier
type: NamedIndividual
is industry of: Commercial Services
is replaced by: http://data.ga-group.nl/ics/bics/17111116
created with: infer-bics.sql
derived from: Professional Services
  type: BicsLevel3Industry
  type: Classifier
  type: ContemporaryDerivation
  derived from: http://data.ga-group.nl/ics/bics/2014/111414
  source accessed on: 2019-12-03T20:05:01Z
  source last accessed on: 2019-12-03T20:05:01Z
  definition: This industry includes companies that provide services based on the unique skills and knowledge of their employees, often on an assignment basis, where an individual or a team is responsible for the delivery of services to clients.
  notation: 111414
  valid from: 2014-08-08
  valid till: 2020-10-03
source accessed on: 2019-12-03T20:05:01Z
source last accessed on: 2019-12-03T20:05:01Z
definition: This industry includes companies that provide services based on the unique skills and knowledge of their employees, often on an assignment basis, where an individual or a team is responsible for the delivery of services to clients.
notation: 111414
valid from: 2014-08-08
valid till: 2020-10-03

Investigation Services
type: BicsLevel4SubIndustry
type: Classifier
type: NamedIndividual
created with: infer-bics.sql
derived from: Investigation Services
  type: BicsLevel4SubIndustry
  type: Classifier
  type: ContemporaryDerivation
  derived from: http://data.ga-group.nl/ics/bics/2014/11141510
  source accessed on: 2019-12-03T20:05:01Z
  source last accessed on: 2019-12-03T20:05:01Z
  definition: This industry subgroup includes companies that provide investigation and detective services.
  notation: 11141510
  valid from: 2014-08-08
  valid till: 2020-10-03
source accessed on: 2019-12-03T20:05:01Z
source last accessed on: 2019-12-03T20:05:01Z
definition: This industry subgroup includes companies that provide investigation and detective services.
notation: 11141510
valid from: 2014-08-08
valid till: 2020-10-03

Security Guards Services
type: BicsLevel4SubIndustry
type: Classifier
type: NamedIndividual
created with: infer-bics.sql
derived from: Security Guards Services
  type: BicsLevel4SubIndustry
  type: Classifier
  type: ContemporaryDerivation
  derived from: http://data.ga-group.nl/ics/bics/2014/11141511
  source accessed on: 2019-12-03T20:05:01Z
  source last accessed on: 2019-12-03T20:05:01Z
  definition: This industry subgroup includes companies that provide guard and patrol services.
  notation: 11141511
  valid from: 2014-08-08
  valid till: 2020-10-03
source accessed on: 2019-12-03T20:05:01Z
source last accessed on: 2019-12-03T20:05:01Z
definition: This industry subgroup includes companies that provide guard and patrol services.
notation: 11141511
valid from: 2014-08-08
valid till: 2020-10-03

Security System Services
type: BicsLevel4SubIndustry
type: Classifier
type: NamedIndividual
created with: infer-bics.sql
derived from: Security System Services
  type: BicsLevel4SubIndustry
  type: Classifier
  type: ContemporaryDerivation
  derived from: http://data.ga-group.nl/ics/bics/2014/11141512
  source accessed on: 2019-12-03T20:05:01Z
  source last accessed on: 2019-12-03T20:05:01Z
  definition: This industry subgroup includes companies that install, maintain and operate security systems. Typically, these companies provide comprehensive security monitoring and alerting services for commercial and household clients.
  notation: 11141512
  valid from: 2014-08-08
  valid till: 2020-10-03
source accessed on: 2019-12-03T20:05:01Z
source last accessed on: 2019-12-03T20:05:01Z
definition: This industry subgroup includes companies that install, maintain and operate security systems. Typically, these companies provide comprehensive security monitoring and alerting services for commercial and household clients.
notation: 11141512
valid from: 2014-08-08
valid till: 2020-10-03

Security Services
type: BicsLevel3Industry
type: Classifier
type: NamedIndividual
is industry of: Commercial Services
is replaced by: http://data.ga-group.nl/ics/bics/17111113
created with: infer-bics.sql
derived from: Security Services
  type: BicsLevel3Industry
  type: Classifier
  type: ContemporaryDerivation
  derived from: http://data.ga-group.nl/ics/bics/2014/111415
  source accessed on: 2019-12-03T20:05:01Z
  source last accessed on: 2019-12-03T20:05:01Z
  definition: This industry includes companies that provide security services including guard/patrol services, armored car transportation, bodyguards, polygraph testing, security system operation and fingerprinting services.
  notation: 111415
  valid from: 2014-08-08
  valid till: 2020-10-03
source accessed on: 2019-12-03T20:05:01Z
source last accessed on: 2019-12-03T20:05:01Z
definition: This industry includes companies that provide security services including guard/patrol services, armored car transportation, bodyguards, polygraph testing, security system operation and fingerprinting services.
notation: 111415
valid from: 2014-08-08
valid till: 2020-10-03

Auction Houses & Art Dealers
type: BicsLevel4SubIndustry
type: Classifier
type: NamedIndividual
created with: infer-bics.sql
derived from: Auction Houses & Art Dealers
  type: BicsLevel4SubIndustry
  type: Classifier
  type: ContemporaryDerivation
  derived from: http://data.ga-group.nl/ics/bics/2014/11141610
  source accessed on: 2019-12-03T20:05:01Z
  source last accessed on: 2019-12-03T20:05:01Z
  definition: This industry subgroup includes companies that operate auction houses, as well as art dealers. Excludes online auction marketplaces (see Electronic Auctions).
  notation: 11141610
  valid from: 2014-08-08
  valid till: 2020-10-03
source accessed on: 2019-12-03T20:05:01Z
source last accessed on: 2019-12-03T20:05:01Z
definition: This industry subgroup includes companies that operate auction houses, as well as art dealers. Excludes online auction marketplaces (see Electronic Auctions).
notation: 11141610
valid from: 2014-08-08
valid till: 2020-10-03

Convention & Trade Show Org
type: BicsLevel4SubIndustry
type: Classifier
type: NamedIndividual
created with: infer-bics.sql
derived from: Convention & Trade Show Org
  type: BicsLevel4SubIndustry
  type: Classifier
  type: ContemporaryDerivation
  derived from: http://data.ga-group.nl/ics/bics/2014/11141611
  source accessed on: 2019-12-03T20:05:01Z
  source last accessed on: 2019-12-03T20:05:01Z
  definition: This industry subgroup includes companies that organize, promote and manage events for business trade shows, conventions and conferences.
  notation: 11141611
  valid from: 2014-08-08
  valid till: 2020-10-03
source accessed on: 2019-12-03T20:05:01Z
source last accessed on: 2019-12-03T20:05:01Z
definition: This industry subgroup includes companies that organize, promote and manage events for business trade shows, conventions and conferences.
notation: 11141611
valid from: 2014-08-08
valid till: 2020-10-03

Geophysical Survey & Map Svcs
type: BicsLevel4SubIndustry
type: Classifier
type: NamedIndividual
created with: infer-bics.sql
derived from: Geophysical Survey & Map Svcs
  type: BicsLevel4SubIndustry
  type: Classifier
  type: ContemporaryDerivation
  derived from: http://data.ga-group.nl/ics/bics/2014/11141612
  source accessed on: 2019-12-03T20:05:01Z
  source last accessed on: 2019-12-03T20:05:01Z
  definition: This industry subgroup includes companies that gather, interpret and map geophysical data.
  notation: 11141612
  valid from: 2014-08-08
  valid till: 2020-10-03
source accessed on: 2019-12-03T20:05:01Z
source last accessed on: 2019-12-03T20:05:01Z
definition: This industry subgroup includes companies that gather, interpret and map geophysical data.
notation: 11141612
valid from: 2014-08-08
valid till: 2020-10-03

Interior Design
type: BicsLevel4SubIndustry
type: Classifier
type: NamedIndividual
created with: infer-bics.sql
derived from: Interior Design
  type: BicsLevel4SubIndustry
  type: Classifier
  type: ContemporaryDerivation
  derived from: http://data.ga-group.nl/ics/bics/2014/11141613
  source accessed on: 2019-12-03T20:05:01Z
  source last accessed on: 2019-12-03T20:05:01Z
  definition: This industry subgroup includes companies that create and develop design based on specifications that optimize the appearance, branding, efficiency of interior space through the use of textiles, furniture, color selections and surface finishes.
  notation: 11141613
  valid from: 2014-08-08
  valid till: 2020-10-03
source accessed on: 2019-12-03T20:05:01Z
source last accessed on: 2019-12-03T20:05:01Z
definition: This industry subgroup includes companies that create and develop design based on specifications that optimize the appearance, branding, efficiency of interior space through the use of textiles, furniture, color selections and surface finishes.
notation: 11141613
valid from: 2014-08-08
valid till: 2020-10-03

Parking Lots & Garages
type: BicsLevel4SubIndustry
type: Classifier
type: NamedIndividual
created with: infer-bics.sql
derived from: Parking Lots & Garages
  type: BicsLevel4SubIndustry
  type: Classifier
  type: ContemporaryDerivation
  derived from: http://data.ga-group.nl/ics/bics/2014/11141614
  source accessed on: 2019-12-03T20:05:01Z
  source last accessed on: 2019-12-03T20:05:01Z
  definition: This industry subgroup includes companies that provide parking lot facility management services. These companies provide outsourced parking lot operations for property owners.
  notation: 11141614
  valid from: 2014-08-08
  valid till: 2020-10-03
source accessed on: 2019-12-03T20:05:01Z
source last accessed on: 2019-12-03T20:05:01Z
definition: This industry subgroup includes companies that provide parking lot facility management services. These companies provide outsourced parking lot operations for property owners.
notation: 11141614
valid from: 2014-08-08
valid till: 2020-10-03

Testing Laboratories
type: BicsLevel4SubIndustry
type: Classifier
type: NamedIndividual
created with: infer-bics.sql
derived from: Testing Laboratories
  type: BicsLevel4SubIndustry
  type: Classifier
  type: ContemporaryDerivation
  derived from: http://data.ga-group.nl/ics/bics/2014/11141615
  source accessed on: 2019-12-03T20:05:01Z
  source last accessed on: 2019-12-03T20:05:01Z
  definition: This industry subgroup includes companies that perform physical, chemical and other analytical testing services, such as acoustics or vibration testing, biological testing, calibration testing, electrical and electronic testing, mechanical testing, nondestructive testing or thermal testing. The testing may occur in a laboratory or on-site.
  notation: 11141615
  valid from: 2014-08-08
  valid till: 2020-10-03
source accessed on: 2019-12-03T20:05:01Z
source last accessed on: 2019-12-03T20:05:01Z
definition: This industry subgroup includes companies that perform physical, chemical and other analytical testing services, such as acoustics or vibration testing, biological testing, calibration testing, electrical and electronic testing, mechanical testing, nondestructive testing or thermal testing. The testing may occur in a laboratory or on-site.
notation: 11141615
valid from: 2014-08-08
valid till: 2020-10-03

Uniforms Rental
type: BicsLevel4SubIndustry
type: Classifier
type: NamedIndividual
created with: infer-bics.sql
derived from: Uniforms Rental
  type: BicsLevel4SubIndustry
  type: Classifier
  type: ContemporaryDerivation
  derived from: http://data.ga-group.nl/ics/bics/2014/11141616
  source accessed on: 2019-12-03T20:05:01Z
  source last accessed on: 2019-12-03T20:05:01Z
  definition: This industry subgroup includes companies that rent uniforms products.
  notation: 11141616
  valid from: 2014-08-08
  valid till: 2020-10-03
source accessed on: 2019-12-03T20:05:01Z
source last accessed on: 2019-12-03T20:05:01Z
definition: This industry subgroup includes companies that rent uniforms products.
notation: 11141616
valid from: 2014-08-08
valid till: 2020-10-03

Misc. Commercial Services
type: BicsLevel4SubIndustry
type: Classifier
type: NamedIndividual
created with: infer-bics.sql
derived from: Misc. Commercial Services
  type: BicsLevel4SubIndustry
  type: Classifier
  type: ContemporaryDerivation
  derived from: http://data.ga-group.nl/ics/bics/2014/11141617
  source accessed on: 2019-12-03T20:05:01Z
  source last accessed on: 2019-12-03T20:05:01Z
  definition: This industry subgroup includes companies that provide commercial services not elsewhere classified. Includes bartering services, electric/gas meter reading services, diving services and other organizational support services.
  notation: 11141617
  valid from: 2014-08-08
  valid till: 2020-10-03
source accessed on: 2019-12-03T20:05:01Z
source last accessed on: 2019-12-03T20:05:01Z
definition: This industry subgroup includes companies that provide commercial services not elsewhere classified. Includes bartering services, electric/gas meter reading services, diving services and other organizational support services.
notation: 11141617
valid from: 2014-08-08
valid till: 2020-10-03

Other Commercial Services
type: BicsLevel3Industry
type: Classifier
type: NamedIndividual
is industry of: Commercial Services
is replaced by: http://data.ga-group.nl/ics/bics/17111114
created with: infer-bics.sql
derived from: Other Commercial Services
  type: BicsLevel3Industry
  type: Classifier
  type: ContemporaryDerivation
  derived from: http://data.ga-group.nl/ics/bics/2014/111416
  source accessed on: 2019-12-03T20:05:01Z
  source last accessed on: 2019-12-03T20:05:01Z
  definition: This industry includes companies that provide commercial services not elsewhere classified.
  notation: 111416
  valid from: 2014-08-08
  valid till: 2020-10-03
source accessed on: 2019-12-03T20:05:01Z
source last accessed on: 2019-12-03T20:05:01Z
definition: This industry includes companies that provide commercial services not elsewhere classified.
notation: 111416
valid from: 2014-08-08
valid till: 2020-10-03

Commercial Services
type: BicsLevel2IndustryGroup
type: Classifier
type: NamedIndividual
is industry group of: Consumer Discretionary
is replaced by: http://data.ga-group.nl/ics/bics/171111
created with: infer-bics.sql
derived from: Commercial Services
  type: BicsLevel2IndustryGroup
  type: Classifier
  type: ContemporaryDerivation
  derived from: http://data.ga-group.nl/ics/bics/2014/1114
  source accessed on: 2019-12-03T20:05:01Z
  source last accessed on: 2019-12-03T20:05:01Z
  definition: This industry group includes companies that provide services to primarily commercial customers.
  notation: 1114
  valid from: 2014-08-08
  valid till: 2020-10-03
source accessed on: 2019-12-03T20:05:01Z
source last accessed on: 2019-12-03T20:05:01Z
definition: This industry group includes companies that provide services to primarily commercial customers.
notation: 1114
valid from: 2014-08-08
valid till: 2020-10-03

Consumer Elec & Applc Rental
type: BicsLevel4SubIndustry
type: Classifier
type: NamedIndividual
created with: infer-bics.sql
derived from: Consumer Elec & Applc Rental
  type: BicsLevel4SubIndustry
  type: Classifier
  type: ContemporaryDerivation
  derived from: http://data.ga-group.nl/ics/bics/2014/11151010
  source accessed on: 2019-12-03T20:05:01Z
  source last accessed on: 2019-12-03T20:05:01Z
  definition: This industry subgroup includes companies that rent televisions, stereos, refrigerators, and other consumer electronics equipment and appliances.
  notation: 11151010
  valid from: 2014-08-08
  valid till: 2020-10-03
source accessed on: 2019-12-03T20:05:01Z
source last accessed on: 2019-12-03T20:05:01Z
definition: This industry subgroup includes companies that rent televisions, stereos, refrigerators, and other consumer electronics equipment and appliances.
notation: 11151010
valid from: 2014-08-08
valid till: 2020-10-03

Formal Wear & Costume Rental
type: BicsLevel4SubIndustry
type: Classifier
type: NamedIndividual
created with: infer-bics.sql
derived from: Formal Wear & Costume Rental
  type: BicsLevel4SubIndustry
  type: Classifier
  type: ContemporaryDerivation
  derived from: http://data.ga-group.nl/ics/bics/2014/11151011
  source accessed on: 2019-12-03T20:05:01Z
  source last accessed on: 2019-12-03T20:05:01Z
  definition: This industry subgroup includes companies that rent formal wear, costumes or other clothing, excluding work uniforms.
  notation: 11151011
  valid from: 2014-08-08
  valid till: 2020-10-03
source accessed on: 2019-12-03T20:05:01Z
source last accessed on: 2019-12-03T20:05:01Z
definition: This industry subgroup includes companies that rent formal wear, costumes or other clothing, excluding work uniforms.
notation: 11151011
valid from: 2014-08-08
valid till: 2020-10-03

Home Health Equipment Rental
type: BicsLevel4SubIndustry
type: Classifier
type: NamedIndividual
created with: infer-bics.sql
derived from: Home Health Equipment Rental
  type: BicsLevel4SubIndustry
  type: Classifier
  type: ContemporaryDerivation
  derived from: http://data.ga-group.nl/ics/bics/2014/11151012
  source accessed on: 2019-12-03T20:05:01Z
  source last accessed on: 2019-12-03T20:05:01Z
  definition: This industry subgroup includes companies that rent wheelchairs, hospital beds, oxygen tanks, walkers, crutches and other home health care equipment.
  notation: 11151012
  valid from: 2014-08-08
  valid till: 2020-10-03
source accessed on: 2019-12-03T20:05:01Z
source last accessed on: 2019-12-03T20:05:01Z
definition: This industry subgroup includes companies that rent wheelchairs, hospital beds, oxygen tanks, walkers, crutches and other home health care equipment.
notation: 11151012
valid from: 2014-08-08
valid till: 2020-10-03

Other Consumer Goods Rental
type: BicsLevel4SubIndustry
type: Classifier
type: NamedIndividual
created with: infer-bics.sql
derived from: Other Consumer Goods Rental
  type: BicsLevel4SubIndustry
  type: Classifier
  type: ContemporaryDerivation
  derived from: http://data.ga-group.nl/ics/bics/2014/11151013
  source accessed on: 2019-12-03T20:05:01Z
  source last accessed on: 2019-12-03T20:05:01Z
  definition: This industry subgroup includes companies that rent power tools, furniture, tents, helium tanks, portable storage containers, and pallets.
  notation: 11151013
  valid from: 2014-08-08
  valid till: 2020-10-03
source accessed on: 2019-12-03T20:05:01Z
source last accessed on: 2019-12-03T20:05:01Z
definition: This industry subgroup includes companies that rent power tools, furniture, tents, helium tanks, portable storage containers, and pallets.
notation: 11151013
valid from: 2014-08-08
valid till: 2020-10-03

Consumer Goods Rental
type: BicsLevel3Industry
type: Classifier
type: NamedIndividual
is industry of: Consumer Services
is replaced by: Consumer Goods Rental
created with: infer-bics.sql
derived from: Consumer Goods Rental
  type: BicsLevel3Industry
  type: Classifier
  type: ContemporaryDerivation
  derived from: http://data.ga-group.nl/ics/bics/2014/111510
  source accessed on: 2019-12-03T20:05:01Z
  source last accessed on: 2019-12-03T20:05:01Z
  definition: This industry includes companies that rent various types of consumer goods, such as appliances, formal wear, costumes, fitness equipment and power tools.
  notation: 111510
  valid from: 2014-08-08
  valid till: 2020-10-03
source accessed on: 2019-12-03T20:05:01Z
source last accessed on: 2019-12-03T20:05:01Z
definition: This industry includes companies that rent various types of consumer goods, such as appliances, formal wear, costumes, fitness equipment and power tools.
notation: 111510
valid from: 2014-08-08
valid till: 2020-10-03

Business & Secretarial Schools
type: BicsLevel4SubIndustry
type: Classifier
type: NamedIndividual
created with: infer-bics.sql
derived from: Business & Secretarial Schools
  type: BicsLevel4SubIndustry
  type: Classifier
  type: ContemporaryDerivation
  derived from: http://data.ga-group.nl/ics/bics/2014/11151110
  source accessed on: 2019-12-03T20:05:01Z
  source last accessed on: 2019-12-03T20:05:01Z
  definition: This industry subgroup includes companies that offer courses in basic business skills, such as word processing, communication and presentation skills.
  notation: 11151110
  valid from: 2014-08-08
  valid till: 2020-10-03
source accessed on: 2019-12-03T20:05:01Z
source last accessed on: 2019-12-03T20:05:01Z
definition: This industry subgroup includes companies that offer courses in basic business skills, such as word processing, communication and presentation skills.
notation: 11151110
valid from: 2014-08-08
valid till: 2020-10-03

College, University & Pro Schools
type: BicsLevel4SubIndustry
type: Classifier
type: NamedIndividual
created with: infer-bics.sql
derived from: College, University & Pro Schools
  type: BicsLevel4SubIndustry
  type: Classifier
  type: ContemporaryDerivation
  derived from: http://data.ga-group.nl/ics/bics/2014/11151111
  source accessed on: 2019-12-03T20:05:01Z
  source last accessed on: 2019-12-03T20:05:01Z
  definition: This industry subgroup includes companies that offer academic courses that lead to degrees at the baccalaureate or graduate level.
  notation: 11151111
  valid from: 2014-08-08
  valid till: 2020-10-03
source accessed on: 2019-12-03T20:05:01Z
source last accessed on: 2019-12-03T20:05:01Z
definition: This industry subgroup includes companies that offer academic courses that lead to degrees at the baccalaureate or graduate level.
notation: 11151111
valid from: 2014-08-08
valid till: 2020-10-03

Elementary Schools
type: BicsLevel4SubIndustry
type: Classifier
type: NamedIndividual
created with: infer-bics.sql
derived from: Elementary Schools
  type: BicsLevel4SubIndustry
  type: Classifier
  type: ContemporaryDerivation
  derived from: http://data.ga-group.nl/ics/bics/2014/11151112
  source accessed on: 2019-12-03T20:05:01Z
  source last accessed on: 2019-12-03T20:05:01Z
  definition: This industry subgroup includes companies that offer basic preparatory education.
  notation: 11151112
  valid from: 2014-08-08
  valid till: 2020-10-03
source accessed on: 2019-12-03T20:05:01Z
source last accessed on: 2019-12-03T20:05:01Z
definition: This industry subgroup includes companies that offer basic preparatory education.
notation: 11151112
valid from: 2014-08-08
valid till: 2020-10-03

Junior Colleges
type: BicsLevel4SubIndustry
type: Classifier
type: NamedIndividual
created with: infer-bics.sql
derived from: Junior Colleges
  type: BicsLevel4SubIndustry
  type: Classifier
  type: ContemporaryDerivation
  derived from: http://data.ga-group.nl/ics/bics/2014/11151113
  source accessed on: 2019-12-03T20:05:01Z
  source last accessed on: 2019-12-03T20:05:01Z
  definition: This industry subgroup includes companies that offer academic courses that lead to associate degrees, certificates, or diplomas below the baccalaureate level.
  notation: 11151113
  valid from: 2014-08-08
  valid till: 2020-10-03
source accessed on: 2019-12-03T20:05:01Z
source last accessed on: 2019-12-03T20:05:01Z
definition: This industry subgroup includes companies that offer academic courses that lead to associate degrees, certificates, or diplomas below the baccalaureate level.
notation: 11151113
valid from: 2014-08-08
valid till: 2020-10-03

Language Schools
type: BicsLevel4SubIndustry
type: Classifier
type: NamedIndividual
created with: infer-bics.sql
derived from: Language Schools
  type: BicsLevel4SubIndustry
  type: Classifier
  type: ContemporaryDerivation
  derived from: http://data.ga-group.nl/ics/bics/2014/11151114
  source accessed on: 2019-12-03T20:05:01Z
  source last accessed on: 2019-12-03T20:05:01Z
  definition: This industry subgroup includes companies that offer foreign language courses.
  notation: 11151114
  valid from: 2014-08-08
  valid till: 2020-10-03
source accessed on: 2019-12-03T20:05:01Z
source last accessed on: 2019-12-03T20:05:01Z
definition: This industry subgroup includes companies that offer foreign language courses.
notation: 11151114
valid from: 2014-08-08
valid till: 2020-10-03

Other Schools
type: BicsLevel4SubIndustry
type: Classifier
type: NamedIndividual
created with: infer-bics.sql
derived from: Other Schools
  type: BicsLevel4SubIndustry
  type: Classifier
  type: ContemporaryDerivation
  derived from: http://data.ga-group.nl/ics/bics/2014/11151115
  source accessed on: 2019-12-03T20:05:01Z
  source last accessed on: 2019-12-03T20:05:01Z
  definition: This industry subgroup includes companies that offer educational services not elsewhere classified.
  notation: 11151115
  valid from: 2014-08-08
  valid till: 2020-10-03
source accessed on: 2019-12-03T20:05:01Z
source last accessed on: 2019-12-03T20:05:01Z
definition: This industry subgroup includes companies that offer educational services not elsewhere classified.
notation: 11151115
valid from: 2014-08-08
valid till: 2020-10-03

Educational Services
type: BicsLevel3Industry
type: Classifier
type: NamedIndividual
is industry of: Consumer Services
is replaced by: Educational Services
created with: infer-bics.sql
derived from: Educational Services
  type: BicsLevel3Industry
  type: Classifier
  type: ContemporaryDerivation
  derived from: http://data.ga-group.nl/ics/bics/2014/111511
  source accessed on: 2019-12-03T20:05:01Z
  source last accessed on: 2019-12-03T20:05:01Z
  definition: This industry includes companies that provide instruction and training in a variety of social, business and language sciences and subjects. The instruction and training could be delivered on a full-time, part-time, distance learning and occasional basis through establishments, such as schools, colleges, universities and professional institutes.
  notation: 111511
  valid from: 2014-08-08
  valid till: 2020-10-03
source accessed on: 2019-12-03T20:05:01Z
source last accessed on: 2019-12-03T20:05:01Z
definition: This industry includes companies that provide instruction and training in a variety of social, business and language sciences and subjects. The instruction and training could be delivered on a full-time, part-time, distance learning and occasional basis through establishments, such as schools, colleges, universities and professional institutes.
notation: 111511
valid from: 2014-08-08
valid till: 2020-10-03

Cemeteries & Crematories
type: BicsLevel4SubIndustry
type: Classifier
type: NamedIndividual
created with: infer-bics.sql
derived from: Cemeteries & Crematories
  type: BicsLevel4SubIndustry
  type: Classifier
  type: ContemporaryDerivation
  derived from: http://data.ga-group.nl/ics/bics/2014/11151210
  source accessed on: 2019-12-03T20:05:01Z
  source last accessed on: 2019-12-03T20:05:01Z
  definition: This industry subgroup includes companies that operate cemeteries and crematories.
  notation: 11151210
  valid from: 2014-08-08
  valid till: 2020-10-03
source accessed on: 2019-12-03T20:05:01Z
source last accessed on: 2019-12-03T20:05:01Z
definition: This industry subgroup includes companies that operate cemeteries and crematories.
notation: 11151210
valid from: 2014-08-08
valid till: 2020-10-03

Funeral Homes & Services
type: BicsLevel4SubIndustry
type: Classifier
type: NamedIndividual
created with: infer-bics.sql
derived from: Funeral Homes & Services
  type: BicsLevel4SubIndustry
  type: Classifier
  type: ContemporaryDerivation
  derived from: http://data.ga-group.nl/ics/bics/2014/11151211
  source accessed on: 2019-12-03T20:05:01Z
  source last accessed on: 2019-12-03T20:05:01Z
  definition: This industry subgroup includes companies that provide funeral services.
  notation: 11151211
  valid from: 2014-08-08
  valid till: 2020-10-03
source accessed on: 2019-12-03T20:05:01Z
source last accessed on: 2019-12-03T20:05:01Z
definition: This industry subgroup includes companies that provide funeral services.
notation: 11151211
valid from: 2014-08-08
valid till: 2020-10-03

Funeral Services
type: BicsLevel3Industry
type: Classifier
type: NamedIndividual
is industry of: Consumer Services
is replaced by: Funeral Services
created with: infer-bics.sql
derived from: Funeral Services
  type: BicsLevel3Industry
  type: Classifier
  type: ContemporaryDerivation
  derived from: http://data.ga-group.nl/ics/bics/2014/111512
  source accessed on: 2019-12-03T20:05:01Z
  source last accessed on: 2019-12-03T20:05:01Z
  definition: This industry includes companies that provide services for burial or incineration of human or animal corpses. Includes mortician services, burial plots, tombs and grave stones.
  notation: 111512
  valid from: 2014-08-08
  valid till: 2020-10-03
source accessed on: 2019-12-03T20:05:01Z
source last accessed on: 2019-12-03T20:05:01Z
definition: This industry includes companies that provide services for burial or incineration of human or animal corpses. Includes mortician services, burial plots, tombs and grave stones.
notation: 111512
valid from: 2014-08-08
valid till: 2020-10-03

Non-Profit Organization
type: BicsLevel3Industry
type: Classifier
type: NamedIndividual
is industry of: Consumer Services
is replaced by: Non-Profit Organization
created with: infer-bics.sql
derived from: Non-Profit Organization
  type: BicsLevel3Industry
  type: Classifier
  type: ContemporaryDerivation
  derived from: http://data.ga-group.nl/ics/bics/2014/111513
  source accessed on: 2019-12-03T20:05:01Z
  source last accessed on: 2019-12-03T20:05:01Z
  definition: This industry includes organizations that do not have owners. Revenues generated by the organization will be used to continue and expand operations.
  notation: 111513
  valid from: 2014-08-08
  valid till: 2020-10-03
source accessed on: 2019-12-03T20:05:01Z
source last accessed on: 2019-12-03T20:05:01Z
definition: This industry includes organizations that do not have owners. Revenues generated by the organization will be used to continue and expand operations.
notation: 111513
valid from: 2014-08-08
valid till: 2020-10-03

Beauty Salons
type: BicsLevel4SubIndustry
type: Classifier
type: NamedIndividual
created with: infer-bics.sql
derived from: Beauty Salons
  type: BicsLevel4SubIndustry
  type: Classifier
  type: ContemporaryDerivation
  derived from: http://data.ga-group.nl/ics/bics/2014/11151410
  source accessed on: 2019-12-03T20:05:01Z
  source last accessed on: 2019-12-03T20:05:01Z
  definition: This industry subgroup includes stores that provide haircutting, washing, setting, dyeing, tinting, straightening and styling.
  notation: 11151410
  valid from: 2014-08-08
  valid till: 2020-10-03
source accessed on: 2019-12-03T20:05:01Z
source last accessed on: 2019-12-03T20:05:01Z
definition: This industry subgroup includes stores that provide haircutting, washing, setting, dyeing, tinting, straightening and styling.
notation: 11151410
valid from: 2014-08-08
valid till: 2020-10-03

Weight Management Services
type: BicsLevel4SubIndustry
type: Classifier
type: NamedIndividual
created with: infer-bics.sql
derived from: Weight Management Services
  type: BicsLevel4SubIndustry
  type: Classifier
  type: ContemporaryDerivation
  derived from: http://data.ga-group.nl/ics/bics/2014/11151411
  source accessed on: 2019-12-03T20:05:01Z
  source last accessed on: 2019-12-03T20:05:01Z
  definition: This industry subgroup includes companies that offer a weight loss program that may include prepared meals, exercise programs and calorie control methods, while keeping meals nutritionally balanced.
  notation: 11151411
  valid from: 2014-08-08
  valid till: 2020-10-03
source accessed on: 2019-12-03T20:05:01Z
source last accessed on: 2019-12-03T20:05:01Z
definition: This industry subgroup includes companies that offer a weight loss program that may include prepared meals, exercise programs and calorie control methods, while keeping meals nutritionally balanced.
notation: 11151411
valid from: 2014-08-08
valid till: 2020-10-03

Personal Care Services
type: BicsLevel3Industry
type: Classifier
type: NamedIndividual
is industry of: Consumer Services
is replaced by: Personal Care Services
created with: infer-bics.sql
derived from: Personal Care Services
  type: BicsLevel3Industry
  type: Classifier
  type: ContemporaryDerivation
  derived from: http://data.ga-group.nl/ics/bics/2014/111514
  source accessed on: 2019-12-03T20:05:01Z
  source last accessed on: 2019-12-03T20:05:01Z
  definition: This industry includes companies that provide services for personal wellness, including beauty salons and weight management services. This industry does not include fitness centers (see Fitness & Recreation Centers).
  notation: 111514
  valid from: 2014-08-08
  valid till: 2020-10-03
source accessed on: 2019-12-03T20:05:01Z
source last accessed on: 2019-12-03T20:05:01Z
definition: This industry includes companies that provide services for personal wellness, including beauty salons and weight management services. This industry does not include fitness centers (see Fitness & Recreation Centers).
notation: 111514
valid from: 2014-08-08
valid till: 2020-10-03

Photo Printing Services
type: BicsLevel4SubIndustry
type: Classifier
type: NamedIndividual
created with: infer-bics.sql
derived from: Photo Printing Services
  type: BicsLevel4SubIndustry
  type: Classifier
  type: ContemporaryDerivation
  derived from: http://data.ga-group.nl/ics/bics/2014/11151510
  source accessed on: 2019-12-03T20:05:01Z
  source last accessed on: 2019-12-03T20:05:01Z
  definition: This industry subgroup includes companies that specialize in film development, processing, enlargement and printing. These companies may process photos for commercial or retail clients. Excludes companies that are involved in photography activities (see Photography Studios).
  notation: 11151510
  valid from: 2014-08-08
  valid till: 2020-10-03
source accessed on: 2019-12-03T20:05:01Z
source last accessed on: 2019-12-03T20:05:01Z
definition: This industry subgroup includes companies that specialize in film development, processing, enlargement and printing. These companies may process photos for commercial or retail clients. Excludes companies that are involved in photography activities (see Photography Studios).
notation: 11151510
valid from: 2014-08-08
valid till: 2020-10-03

Photography Studios
type: BicsLevel4SubIndustry
type: Classifier
type: NamedIndividual
created with: infer-bics.sql
derived from: Photography Studios
  type: BicsLevel4SubIndustry
  type: Classifier
  type: ContemporaryDerivation
  derived from: http://data.ga-group.nl/ics/bics/2014/11151511
  source accessed on: 2019-12-03T20:05:01Z
  source last accessed on: 2019-12-03T20:05:01Z
  definition: This industry subgroup includes companies that operate photography studios or provide on-site photography services for memorable events. These companies may also process and print these photos in various merchandise formats.
  notation: 11151511
  valid from: 2014-08-08
  valid till: 2020-10-03
source accessed on: 2019-12-03T20:05:01Z
source last accessed on: 2019-12-03T20:05:01Z
definition: This industry subgroup includes companies that operate photography studios or provide on-site photography services for memorable events. These companies may also process and print these photos in various merchandise formats.
notation: 11151511
valid from: 2014-08-08
valid till: 2020-10-03

Photography Services
type: BicsLevel3Industry
type: Classifier
type: NamedIndividual
is industry of: Consumer Services
is replaced by: Photography Services
created with: infer-bics.sql
derived from: Photography Services
  type: BicsLevel3Industry
  type: Classifier
  type: ContemporaryDerivation
  derived from: http://data.ga-group.nl/ics/bics/2014/111515
  source accessed on: 2019-12-03T20:05:01Z
  source last accessed on: 2019-12-03T20:05:01Z
  definition: This industry includes companies that offer portrait and video photography of memorable events, such as weddings and school graduations. Includes developing and printing services that utilize the photo in a retail product like picture books, cards and coffee mugs.
  notation: 111515
  valid from: 2014-08-08
  valid till: 2020-10-03
source accessed on: 2019-12-03T20:05:01Z
source last accessed on: 2019-12-03T20:05:01Z
definition: This industry includes companies that offer portrait and video photography of memorable events, such as weddings and school graduations. Includes developing and printing services that utilize the photo in a retail product like picture books, cards and coffee mugs.
notation: 111515
valid from: 2014-08-08
valid till: 2020-10-03

Consumer Goods Repair & Maint
type: BicsLevel4SubIndustry
type: Classifier
type: NamedIndividual
created with: infer-bics.sql
derived from: Consumer Goods Repair & Maint
  type: BicsLevel4SubIndustry
  type: Classifier
  type: ContemporaryDerivation
  derived from: http://data.ga-group.nl/ics/bics/2014/11151610
  source accessed on: 2019-12-03T20:05:01Z
  source last accessed on: 2019-12-03T20:05:01Z
  definition: This industry subgroup includes companies that provide repair and maintenance services for consumer goods, such as household appliances, watches and consumer electronics. These services may be offered for retail or commercial customers.
  notation: 11151610
  valid from: 2014-08-08
  valid till: 2020-10-03
source accessed on: 2019-12-03T20:05:01Z
source last accessed on: 2019-12-03T20:05:01Z
definition: This industry subgroup includes companies that provide repair and maintenance services for consumer goods, such as household appliances, watches and consumer electronics. These services may be offered for retail or commercial customers.
notation: 11151610
valid from: 2014-08-08
valid till: 2020-10-03

Laundry Services
type: BicsLevel4SubIndustry
type: Classifier
type: NamedIndividual
created with: infer-bics.sql
derived from: Laundry Services
  type: BicsLevel4SubIndustry
  type: Classifier
  type: ContemporaryDerivation
  derived from: http://data.ga-group.nl/ics/bics/2014/11151611
  source accessed on: 2019-12-03T20:05:01Z
  source last accessed on: 2019-12-03T20:05:01Z
  definition: This industry subgroup includes companies that provide laundering or dry cleaning services. These companies may operate self-service laundromats or provide outsourced linen and garment cleaning services for commercial customers.
  notation: 11151611
  valid from: 2014-08-08
  valid till: 2020-10-03
source accessed on: 2019-12-03T20:05:01Z
source last accessed on: 2019-12-03T20:05:01Z
definition: This industry subgroup includes companies that provide laundering or dry cleaning services. These companies may operate self-service laundromats or provide outsourced linen and garment cleaning services for commercial customers.
notation: 11151611
valid from: 2014-08-08
valid till: 2020-10-03

Other Consumer Services
type: BicsLevel3Industry
type: Classifier
type: NamedIndividual
is industry of: Consumer Services
is replaced by: Other Consumer Services
created with: infer-bics.sql
derived from: Other Consumer Services
  type: BicsLevel3Industry
  type: Classifier
  type: ContemporaryDerivation
  derived from: http://data.ga-group.nl/ics/bics/2014/111516
  source accessed on: 2019-12-03T20:05:01Z
  source last accessed on: 2019-12-03T20:05:01Z
  definition: This industry includes companies that provide laundry services, consumer goods repair services and consumer services not elsewhere classified.
  notation: 111516
  valid from: 2014-08-08
  valid till: 2020-10-03
source accessed on: 2019-12-03T20:05:01Z
source last accessed on: 2019-12-03T20:05:01Z
definition: This industry includes companies that provide laundry services, consumer goods repair services and consumer services not elsewhere classified.
notation: 111516
valid from: 2014-08-08
valid till: 2020-10-03

Consumer Services
type: BicsLevel2IndustryGroup
type: Classifier
type: NamedIndividual
is industry group of: Consumer Discretionary
is replaced by: Consumer Services
created with: infer-bics.sql
derived from: Consumer Services
  type: BicsLevel2IndustryGroup
  type: Classifier
  type: ContemporaryDerivation
  derived from: http://data.ga-group.nl/ics/bics/2014/1115
  source accessed on: 2019-12-03T20:05:01Z
  source last accessed on: 2019-12-03T20:05:01Z
  definition: This industry group includes companies that provide services to retail consumers.
  notation: 1115
  valid from: 2014-08-08
  valid till: 2020-10-03
source accessed on: 2019-12-03T20:05:01Z
source last accessed on: 2019-12-03T20:05:01Z
definition: This industry group includes companies that provide services to retail consumers.
notation: 1115
valid from: 2014-08-08
valid till: 2020-10-03

Casinos
type: BicsLevel4SubIndustry
type: Classifier
type: NamedIndividual
created with: infer-bics.sql
derived from: Casinos
  type: BicsLevel4SubIndustry
  type: Classifier
  type: ContemporaryDerivation
  derived from: http://data.ga-group.nl/ics/bics/2014/11161010
  source accessed on: 2019-12-03T20:05:01Z
  source last accessed on: 2019-12-03T20:05:01Z
  definition: This industry subgroup includes companies that own and operate facilities that host gambling operations, such as coin-operated gambling machines, wagering at table games, off-track betting and certain floating facilities like riverboats. Excludes operations of cruise ships (see Cruise Lines).
  notation: 11161010
  valid from: 2014-08-08
  valid till: 2020-10-03
source accessed on: 2019-12-03T20:05:01Z
source last accessed on: 2019-12-03T20:05:01Z
definition: This industry subgroup includes companies that own and operate facilities that host gambling operations, such as coin-operated gambling machines, wagering at table games, off-track betting and certain floating facilities like riverboats. Excludes operations of cruise ships (see Cruise Lines).
notation: 11161010
valid from: 2014-08-08
valid till: 2020-10-03

Gaming Equipment Mfg
type: BicsLevel5Segment
type: Classifier
type: NamedIndividual
is level5 segment of: Gaming Equipment
created with: infer-bics.sql
derived from: Gaming Equipment Mfg
  type: BicsLevel5Segment
  type: Classifier
  type: ContemporaryDerivation
  derived from: http://data.ga-group.nl/ics/bics/2014/1116101110
  source accessed on: 2019-12-03T20:05:01Z
  source last accessed on: 2019-12-03T20:05:01Z
  definition: This segment includes companies that manufacture mechanical or electronic equipment utilized for gambling purposes. Also includes manufactures of these components as well as computerized gaming systems. Typically, this equipment is regulated by government regulations. Includes slot machines, pachinko machines, lottery machines, race booking equipment and gambling revenue monitoring equipment.
  notation: 1116101110
  valid from: 2014-08-08
  valid till: 2020-10-03
source accessed on: 2019-12-03T20:05:01Z
source last accessed on: 2019-12-03T20:05:01Z
definition: This segment includes companies that manufacture mechanical or electronic equipment utilized for gambling purposes. Also includes manufactures of these components as well as computerized gaming systems. Typically, this equipment is regulated by government regulations. Includes slot machines, pachinko machines, lottery machines, race booking equipment and gambling revenue monitoring equipment.
notation: 1116101110
valid from: 2014-08-08
valid till: 2020-10-03

Gaming Equipment Leasing
type: BicsLevel5Segment
type: Classifier
type: NamedIndividual
is level5 segment of: Gaming Equipment
created with: infer-bics.sql
derived from: Gaming Equipment Leasing
  type: BicsLevel5Segment
  type: Classifier
  type: ContemporaryDerivation
  derived from: http://data.ga-group.nl/ics/bics/2014/1116101111
  source accessed on: 2019-12-03T20:05:01Z
  source last accessed on: 2019-12-03T20:05:01Z
  definition: This segment includes companies that lease gaming equipment to customers. Excludes capital leasing of gambling machines (see Commercial Finance).
  notation: 1116101111
  valid from: 2014-08-08
  valid till: 2020-10-03
source accessed on: 2019-12-03T20:05:01Z
source last accessed on: 2019-12-03T20:05:01Z
definition: This segment includes companies that lease gaming equipment to customers. Excludes capital leasing of gambling machines (see Commercial Finance).
notation: 1116101111
valid from: 2014-08-08
valid till: 2020-10-03

Gaming Equipment
type: BicsLevel4SubIndustry
type: Classifier
type: NamedIndividual
created with: infer-bics.sql
derived from: Gaming Equipment
  type: BicsLevel4SubIndustry
  type: Classifier
  type: ContemporaryDerivation
  derived from: http://data.ga-group.nl/ics/bics/2014/11161011
  source accessed on: 2019-12-03T20:05:01Z
  source last accessed on: 2019-12-03T20:05:01Z
  definition: This industry subgroup includes companies that manufacture or lease gaming equipment.
  notation: 11161011
  valid from: 2014-08-08
  valid till: 2020-10-03
source accessed on: 2019-12-03T20:05:01Z
source last accessed on: 2019-12-03T20:05:01Z
definition: This industry subgroup includes companies that manufacture or lease gaming equipment.
notation: 11161011
valid from: 2014-08-08
valid till: 2020-10-03

Mobile & Online Gambling
type: BicsLevel4SubIndustry
type: Classifier
type: NamedIndividual
created with: infer-bics.sql
derived from: Mobile & Online Gambling
  type: BicsLevel4SubIndustry
  type: Classifier
  type: ContemporaryDerivation
  derived from: http://data.ga-group.nl/ics/bics/2014/11161012
  source accessed on: 2019-12-03T20:05:01Z
  source last accessed on: 2019-12-03T20:05:01Z
  definition: This industry subgroup includes companies that provide gambling services through Internet or mobile devices.
  notation: 11161012
  valid from: 2014-08-08
  valid till: 2020-10-03
source accessed on: 2019-12-03T20:05:01Z
source last accessed on: 2019-12-03T20:05:01Z
definition: This industry subgroup includes companies that provide gambling services through Internet or mobile devices.
notation: 11161012
valid from: 2014-08-08
valid till: 2020-10-03

Lottery Services
type: BicsLevel4SubIndustry
type: Classifier
type: NamedIndividual
created with: infer-bics.sql
derived from: Lottery Services
  type: BicsLevel4SubIndustry
  type: Classifier
  type: ContemporaryDerivation
  derived from: http://data.ga-group.nl/ics/bics/2014/11161013
  source accessed on: 2019-12-03T20:05:01Z
  source last accessed on: 2019-12-03T20:05:01Z
  definition: This industry subgroup includes companies that operate establishments, other than retail stores, that sell lottery tickets.
  notation: 11161013
  valid from: 2014-08-08
  valid till: 2020-10-03
source accessed on: 2019-12-03T20:05:01Z
source last accessed on: 2019-12-03T20:05:01Z
definition: This industry subgroup includes companies that operate establishments, other than retail stores, that sell lottery tickets.
notation: 11161013
valid from: 2014-08-08
valid till: 2020-10-03

Racetracks
type: BicsLevel4SubIndustry
type: Classifier
type: NamedIndividual
created with: infer-bics.sql
derived from: Racetracks
  type: BicsLevel4SubIndustry
  type: Classifier
  type: ContemporaryDerivation
  derived from: http://data.ga-group.nl/ics/bics/2014/11161014
  source accessed on: 2019-12-03T20:05:01Z
  source last accessed on: 2019-12-03T20:05:01Z
  definition: This industry subgroup includes companies that operate racetrack facilities.
  notation: 11161014
  valid from: 2014-08-08
  valid till: 2020-10-03
source accessed on: 2019-12-03T20:05:01Z
source last accessed on: 2019-12-03T20:05:01Z
definition: This industry subgroup includes companies that operate racetrack facilities.
notation: 11161014
valid from: 2014-08-08
valid till: 2020-10-03

Betting
type: BicsLevel4SubIndustry
type: Classifier
type: NamedIndividual
created with: infer-bics.sql
derived from: Betting
  type: BicsLevel4SubIndustry
  type: Classifier
  type: ContemporaryDerivation
  derived from: http://data.ga-group.nl/ics/bics/2014/11161015
  source accessed on: 2019-12-03T20:05:01Z
  source last accessed on: 2019-12-03T20:05:01Z
  definition: This industry subgroup includes companies that provide betting services. These betting services can be done at a retail storefront (betting shop) or over the phone via call centers. Includes sports betting and off-racetrack betting. Excludes betting services provided through the Internet (see Mobile & Online Gambling).
  notation: 11161015
  valid from: 2014-08-08
  valid till: 2020-10-03
source accessed on: 2019-12-03T20:05:01Z
source last accessed on: 2019-12-03T20:05:01Z
definition: This industry subgroup includes companies that provide betting services. These betting services can be done at a retail storefront (betting shop) or over the phone via call centers. Includes sports betting and off-racetrack betting. Excludes betting services provided through the Internet (see Mobile & Online Gambling).
notation: 11161015
valid from: 2014-08-08
valid till: 2020-10-03

Casinos & Gaming
type: BicsLevel3Industry
type: Classifier
type: NamedIndividual
is industry of: Gaming, Lodging & Restaurants
is replaced by: Casinos & Gaming
created with: infer-bics.sql
derived from: Casinos & Gaming
  type: BicsLevel3Industry
  type: Classifier
  type: ContemporaryDerivation
  derived from: http://data.ga-group.nl/ics/bics/2014/111610
  source accessed on: 2019-12-03T20:05:01Z
  source last accessed on: 2019-12-03T20:05:01Z
  definition: This industry includes companies that provide casino gaming without lodging. Also includes online gaming, racetracks, gaming equipment manufacturers and lottery services.
  notation: 111610
  valid from: 2014-08-08
  valid till: 2020-10-03
source accessed on: 2019-12-03T20:05:01Z
source last accessed on: 2019-12-03T20:05:01Z
definition: This industry includes companies that provide casino gaming without lodging. Also includes online gaming, racetracks, gaming equipment manufacturers and lottery services.
notation: 111610
valid from: 2014-08-08
valid till: 2020-10-03

Cruise Lines
type: BicsLevel3Industry
type: Classifier
type: NamedIndividual
is industry of: Gaming, Lodging & Restaurants
is replaced by: Cruise Lines
created with: infer-bics.sql
derived from: Cruise Lines
  type: BicsLevel3Industry
  type: Classifier
  type: ContemporaryDerivation
  derived from: http://data.ga-group.nl/ics/bics/2014/111611
  source accessed on: 2019-12-03T20:05:01Z
  source last accessed on: 2019-12-03T20:05:01Z
  definition: This industry includes companies that provide transportation and leisure entertainment, such as deep sea cruises and river cruises.
  notation: 111611
  valid from: 2014-08-08
  valid till: 2020-10-03
source accessed on: 2019-12-03T20:05:01Z
source last accessed on: 2019-12-03T20:05:01Z
definition: This industry includes companies that provide transportation and leisure entertainment, such as deep sea cruises and river cruises.
notation: 111611
valid from: 2014-08-08
valid till: 2020-10-03

Food & Beverage Rev - Hotels
type: BicsLevel5Segment
type: Classifier
type: NamedIndividual
is level5 segment of: Hotel & Motel (excl Casino Hotel)
is replaced by: Food & Beverage Rev - Hotels
created with: infer-bics.sql
derived from: Food & Beverage Rev - Hotels
  type: BicsLevel5Segment
  type: Classifier
  type: ContemporaryDerivation
  derived from: http://data.ga-group.nl/ics/bics/2014/1116121010
  source accessed on: 2019-12-03T20:05:01Z
  source last accessed on: 2019-12-03T20:05:01Z
  definition: This segment includes the hotel revenue attributed to the food and beverage component.
  notation: 1116121010
  valid from: 2014-08-08
  valid till: 2020-10-03
source accessed on: 2019-12-03T20:05:01Z
source last accessed on: 2019-12-03T20:05:01Z
definition: This segment includes the hotel revenue attributed to the food and beverage component.
notation: 1116121010
valid from: 2014-08-08
valid till: 2020-10-03

Room Revenue - Hotels
type: BicsLevel5Segment
type: Classifier
type: NamedIndividual
is level5 segment of: Hotel & Motel (excl Casino Hotel)
is replaced by: Room Revenue - Hotels
created with: infer-bics.sql
derived from: Room Revenue - Hotels
  type: BicsLevel5Segment
  type: Classifier
  type: ContemporaryDerivation
  derived from: http://data.ga-group.nl/ics/bics/2014/1116121011
  source accessed on: 2019-12-03T20:05:01Z
  source last accessed on: 2019-12-03T20:05:01Z
  definition: This segment includes the hotel revenue attributed to the room component.
  notation: 1116121011
  valid from: 2014-08-08
  valid till: 2020-10-03
source accessed on: 2019-12-03T20:05:01Z
source last accessed on: 2019-12-03T20:05:01Z
definition: This segment includes the hotel revenue attributed to the room component.
notation: 1116121011
valid from: 2014-08-08
valid till: 2020-10-03

Time-Share Revenue - Hotels
type: BicsLevel5Segment
type: Classifier
type: NamedIndividual
is level5 segment of: Hotel & Motel (excl Casino Hotel)
is replaced by: Time-Share Revenue - Hotels
created with: infer-bics.sql
derived from: Time-Share Revenue - Hotels
  type: BicsLevel5Segment
  type: Classifier
  type: ContemporaryDerivation
  derived from: http://data.ga-group.nl/ics/bics/2014/1116121012
  source accessed on: 2019-12-03T20:05:01Z
  source last accessed on: 2019-12-03T20:05:01Z
  definition: This segment includes companies that sell vacation ownership or time-share units.
  notation: 1116121012
  valid from: 2014-08-08
  valid till: 2020-10-03
source accessed on: 2019-12-03T20:05:01Z
source last accessed on: 2019-12-03T20:05:01Z
definition: This segment includes companies that sell vacation ownership or time-share units.
notation: 1116121012
valid from: 2014-08-08
valid till: 2020-10-03

Other Revenue - Hotels
type: BicsLevel5Segment
type: Classifier
type: NamedIndividual
is level5 segment of: Hotel & Motel (excl Casino Hotel)
is replaced by: Other Revenue - Hotels
created with: infer-bics.sql
derived from: Other Revenue - Hotels
  type: BicsLevel5Segment
  type: Classifier
  type: ContemporaryDerivation
  derived from: http://data.ga-group.nl/ics/bics/2014/1116121013
  source accessed on: 2019-12-03T20:05:01Z
  source last accessed on: 2019-12-03T20:05:01Z
  definition: This segment includes the hotel revenue attributed to components other than room or food and beverage.
  notation: 1116121013
  valid from: 2014-08-08
  valid till: 2020-10-03
source accessed on: 2019-12-03T20:05:01Z
source last accessed on: 2019-12-03T20:05:01Z
definition: This segment includes the hotel revenue attributed to components other than room or food and beverage.
notation: 1116121013
valid from: 2014-08-08
valid till: 2020-10-03

Hotel & Motel (excl Casino Hotel)
type: BicsLevel4SubIndustry
type: Classifier
type: NamedIndividual
created with: infer-bics.sql
derived from: Hotel & Motel (excl Casino Hotel)
  type: BicsLevel4SubIndustry
  type: Classifier
  type: ContemporaryDerivation
  derived from: http://data.ga-group.nl/ics/bics/2014/11161210
  source accessed on: 2019-12-03T20:05:01Z
  source last accessed on: 2019-12-03T20:05:01Z
  definition: This industry subgroup includes companies (other than casino hotels) that provide short-term lodgings.
  notation: 11161210
  valid from: 2014-08-08
  valid till: 2020-10-03
source accessed on: 2019-12-03T20:05:01Z
source last accessed on: 2019-12-03T20:05:01Z
definition: This industry subgroup includes companies (other than casino hotels) that provide short-term lodgings.
notation: 11161210
valid from: 2014-08-08
valid till: 2020-10-03

Food & Bev Rev - Casino Hotels
type: BicsLevel5Segment
type: Classifier
type: NamedIndividual
is level5 segment of: Casino Hotels
is replaced by: Food & Bev Rev - Casino Hotels
created with: infer-bics.sql
derived from: Food & Bev Rev - Casino Hotels
  type: BicsLevel5Segment
  type: Classifier
  type: ContemporaryDerivation
  derived from: http://data.ga-group.nl/ics/bics/2014/1116121110
  source accessed on: 2019-12-03T20:05:01Z
  source last accessed on: 2019-12-03T20:05:01Z
  definition: This segment includes the casino hotel revenue attributed to the food and beverage component.
  notation: 1116121110
  valid from: 2014-08-08
  valid till: 2020-10-03
source accessed on: 2019-12-03T20:05:01Z
source last accessed on: 2019-12-03T20:05:01Z
definition: This segment includes the casino hotel revenue attributed to the food and beverage component.
notation: 1116121110
valid from: 2014-08-08
valid till: 2020-10-03

Room Revenue - Casino Hotels
type: BicsLevel5Segment
type: Classifier
type: NamedIndividual
is level5 segment of: Casino Hotels
is replaced by: Room Revenue - Casino Hotels
created with: infer-bics.sql
derived from: Room Revenue - Casino Hotels
  type: BicsLevel5Segment
  type: Classifier
  type: ContemporaryDerivation
  derived from: http://data.ga-group.nl/ics/bics/2014/1116121111
  source accessed on: 2019-12-03T20:05:01Z
  source last accessed on: 2019-12-03T20:05:01Z
  definition: This segment includes the casino hotel revenue attributed to the room component.
  notation: 1116121111
  valid from: 2014-08-08
  valid till: 2020-10-03
source accessed on: 2019-12-03T20:05:01Z
source last accessed on: 2019-12-03T20:05:01Z
definition: This segment includes the casino hotel revenue attributed to the room component.
notation: 1116121111
valid from: 2014-08-08
valid till: 2020-10-03

Other Rev - Casino Hotels
type: BicsLevel5Segment
type: Classifier
type: NamedIndividual
is level5 segment of: Casino Hotels
is replaced by: Other Rev - Casino Hotels
created with: infer-bics.sql
derived from: Other Rev - Casino Hotels
  type: BicsLevel5Segment
  type: Classifier
  type: ContemporaryDerivation
  derived from: http://data.ga-group.nl/ics/bics/2014/1116121112
  source accessed on: 2019-12-03T20:05:01Z
  source last accessed on: 2019-12-03T20:05:01Z
  definition: This segment includes the casino hotel revenue attributed to the components other than room or food and beverage.
  notation: 1116121112
  valid from: 2014-08-08
  valid till: 2020-10-03
source accessed on: 2019-12-03T20:05:01Z
source last accessed on: 2019-12-03T20:05:01Z
definition: This segment includes the casino hotel revenue attributed to the components other than room or food and beverage.
notation: 1116121112
valid from: 2014-08-08
valid till: 2020-10-03

Casino Hotels
type: BicsLevel4SubIndustry
type: Classifier
type: NamedIndividual
created with: infer-bics.sql
derived from: Casino Hotels
  type: BicsLevel4SubIndustry
  type: Classifier
  type: ContemporaryDerivation
  derived from: http://data.ga-group.nl/ics/bics/2014/11161211
  source accessed on: 2019-12-03T20:05:01Z
  source last accessed on: 2019-12-03T20:05:01Z
  definition: This industry subgroup includes companies that provide short-term lodging in facilities with a casino on the premises.
  notation: 11161211
  valid from: 2014-08-08
  valid till: 2020-10-03
source accessed on: 2019-12-03T20:05:01Z
source last accessed on: 2019-12-03T20:05:01Z
definition: This industry subgroup includes companies that provide short-term lodging in facilities with a casino on the premises.
notation: 11161211
valid from: 2014-08-08
valid till: 2020-10-03

Bed & Breakfast Inns
type: BicsLevel4SubIndustry
type: Classifier
type: NamedIndividual
created with: infer-bics.sql
derived from: Bed & Breakfast Inns
  type: BicsLevel4SubIndustry
  type: Classifier
  type: ContemporaryDerivation
  derived from: http://data.ga-group.nl/ics/bics/2014/11161212
  source accessed on: 2019-12-03T20:05:01Z
  source last accessed on: 2019-12-03T20:05:01Z
  definition: This industry subgroup includes companies that provide short-term lodging in facilities known as bed-and-breakfast inns.
  notation: 11161212
  valid from: 2014-08-08
  valid till: 2020-10-03
source accessed on: 2019-12-03T20:05:01Z
source last accessed on: 2019-12-03T20:05:01Z
definition: This industry subgroup includes companies that provide short-term lodging in facilities known as bed-and-breakfast inns.
notation: 11161212
valid from: 2014-08-08
valid till: 2020-10-03

Other Travel Accommodations
type: BicsLevel4SubIndustry
type: Classifier
type: NamedIndividual
created with: infer-bics.sql
derived from: Other Travel Accommodations
  type: BicsLevel4SubIndustry
  type: Classifier
  type: ContemporaryDerivation
  derived from: http://data.ga-group.nl/ics/bics/2014/11161213
  source accessed on: 2019-12-03T20:05:01Z
  source last accessed on: 2019-12-03T20:05:01Z
  definition: This industry subgroup includes companies that provide lodging services not elsewhere classified.
  notation: 11161213
  valid from: 2014-08-08
  valid till: 2020-10-03
source accessed on: 2019-12-03T20:05:01Z
source last accessed on: 2019-12-03T20:05:01Z
definition: This industry subgroup includes companies that provide lodging services not elsewhere classified.
notation: 11161213
valid from: 2014-08-08
valid till: 2020-10-03

Lodging
type: BicsLevel3Industry
type: Classifier
type: NamedIndividual
is industry of: Gaming, Lodging & Restaurants
is replaced by: Lodging
created with: infer-bics.sql
derived from: Lodging
  type: BicsLevel3Industry
  type: Classifier
  type: ContemporaryDerivation
  derived from: http://data.ga-group.nl/ics/bics/2014/111612
  source accessed on: 2019-12-03T20:05:01Z
  source last accessed on: 2019-12-03T20:05:01Z
  definition: This industry includes companies that provide temporary quarters in a room or rooms and usually charge a daily rate for their use.
  notation: 111612
  valid from: 2014-08-08
  valid till: 2020-10-03
source accessed on: 2019-12-03T20:05:01Z
source last accessed on: 2019-12-03T20:05:01Z
definition: This industry includes companies that provide temporary quarters in a room or rooms and usually charge a daily rate for their use.
notation: 111612
valid from: 2014-08-08
valid till: 2020-10-03

Bars & Taverns
type: BicsLevel5Segment
type: Classifier
type: NamedIndividual
is level5 segment of: Limited Service Restaurants
is replaced by: Bars & Taverns
created with: infer-bics.sql
derived from: Bars & Taverns
  type: BicsLevel5Segment
  type: Classifier
  type: ContemporaryDerivation
  derived from: http://data.ga-group.nl/ics/bics/2014/1116131010
  source accessed on: 2019-12-03T20:05:01Z
  source last accessed on: 2019-12-03T20:05:01Z
  definition: This segment includes companies known as bars, taverns, nightclubs or drinking places that prepare and serve alcoholic beverages for immediate consumption. Such companies may also provide limited food services.
  notation: 1116131010
  valid from: 2014-08-08
  valid till: 2020-10-03
source accessed on: 2019-12-03T20:05:01Z
source last accessed on: 2019-12-03T20:05:01Z
definition: This segment includes companies known as bars, taverns, nightclubs or drinking places that prepare and serve alcoholic beverages for immediate consumption. Such companies may also provide limited food services.
notation: 1116131010
valid from: 2014-08-08
valid till: 2020-10-03

Cafe & Buffets - Franchise
type: BicsLevel6Segment
type: Classifier
type: NamedIndividual
is level6 segment of: Cafeterias & Buffets
created with: infer-bics.sql
derived from: Cafe & Buffets - Franchise
  type: BicsLevel6Segment
  type: Classifier
  type: ContemporaryDerivation
  derived from: http://data.ga-group.nl/ics/bics/2014/111613101110
  source accessed on: 2019-12-03T20:05:01Z
  source last accessed on: 2019-12-03T20:05:01Z
  definition: This segment includes companies that have franchise revenue for cafeterias, buffets and grill buffet style restaurants.
  notation: 111613101110
  valid from: 2014-08-08
  valid till: 2020-10-03
source accessed on: 2019-12-03T20:05:01Z
source last accessed on: 2019-12-03T20:05:01Z
definition: This segment includes companies that have franchise revenue for cafeterias, buffets and grill buffet style restaurants.
notation: 111613101110
valid from: 2014-08-08
valid till: 2020-10-03

Cafe & Buffets - Owned
type: BicsLevel6Segment
type: Classifier
type: NamedIndividual
is level6 segment of: Cafeterias & Buffets
created with: infer-bics.sql
derived from: Cafe & Buffets - Owned
  type: BicsLevel6Segment
  type: Classifier
  type: ContemporaryDerivation
  derived from: http://data.ga-group.nl/ics/bics/2014/111613101111
  source accessed on: 2019-12-03T20:05:01Z
  source last accessed on: 2019-12-03T20:05:01Z
  definition: This segment includes cafeterias, buffets or grills buffets that prepare and serve meals for immediate consumption using cafeteria-style or buffet serving equipment, such as steam tables, refrigerated areas, display grills, and self-service nonalcoholic beverage dispensing equipment. Patrons select from food and drink items on display in a continuous cafeteria line or from buffet stations. This segment includes only company-owned restaurant revenue.
  notation: 111613101111
  valid from: 2014-08-08
  valid till: 2020-10-03
source accessed on: 2019-12-03T20:05:01Z
source last accessed on: 2019-12-03T20:05:01Z
definition: This segment includes cafeterias, buffets or grills buffets that prepare and serve meals for immediate consumption using cafeteria-style or buffet serving equipment, such as steam tables, refrigerated areas, display grills, and self-service nonalcoholic beverage dispensing equipment. Patrons select from food and drink items on display in a continuous cafeteria line or from buffet stations. This segment includes only company-owned restaurant revenue.
notation: 111613101111
valid from: 2014-08-08
valid till: 2020-10-03

Cafeterias & Buffets
type: BicsLevel5Segment
type: Classifier
type: NamedIndividual
is level5 segment of: Limited Service Restaurants
created with: infer-bics.sql
derived from: Cafeterias & Buffets
  type: BicsLevel5Segment
  type: Classifier
  type: ContemporaryDerivation
  derived from: http://data.ga-group.nl/ics/bics/2014/1116131011
  source accessed on: 2019-12-03T20:05:01Z
  source last accessed on: 2019-12-03T20:05:01Z
  definition: This segment includes cafeterias, buffets or grills buffets that prepare and serve meals for immediate consumption using cafeteria-style or buffet serving equipment, such as steam tables, refrigerated areas, display grills, and self-service nonalcoholic beverage dispensing equipment. Patrons select from food and drink items on display in a continuous cafeteria line or from buffet stations. This segment includes company-owned and franchise revenue.
  notation: 1116131011
  valid from: 2014-08-08
  valid till: 2020-10-03
source accessed on: 2019-12-03T20:05:01Z
source last accessed on: 2019-12-03T20:05:01Z
definition: This segment includes cafeterias, buffets or grills buffets that prepare and serve meals for immediate consumption using cafeteria-style or buffet serving equipment, such as steam tables, refrigerated areas, display grills, and self-service nonalcoholic beverage dispensing equipment. Patrons select from food and drink items on display in a continuous cafeteria line or from buffet stations. This segment includes company-owned and franchise revenue.
notation: 1116131011
valid from: 2014-08-08
valid till: 2020-10-03

Fast Casual Rest - Franchise
type: BicsLevel6Segment
type: Classifier
type: NamedIndividual
is level6 segment of: Fast Casual Restaurants
is replaced by: Fast Casual Rest - Franchise
created with: infer-bics.sql
derived from: Fast Casual Rest - Franchise
  type: BicsLevel6Segment
  type: Classifier
  type: ContemporaryDerivation
  derived from: http://data.ga-group.nl/ics/bics/2014/111613101210
  source accessed on: 2019-12-03T20:05:01Z
  source last accessed on: 2019-12-03T20:05:01Z
  definition: This segment includes companies that have franchise revenue for fast casual restaurants.
  notation: 111613101210
  valid from: 2014-08-08
  valid till: 2020-10-03
source accessed on: 2019-12-03T20:05:01Z
source last accessed on: 2019-12-03T20:05:01Z
definition: This segment includes companies that have franchise revenue for fast casual restaurants.
notation: 111613101210
valid from: 2014-08-08
valid till: 2020-10-03

Fast Casual Rest - Owned
type: BicsLevel6Segment
type: Classifier
type: NamedIndividual
is level6 segment of: Fast Casual Restaurants
is replaced by: Fast Casual Rest - Owned
created with: infer-bics.sql
derived from: Fast Casual Rest - Owned
  type: BicsLevel6Segment
  type: Classifier
  type: ContemporaryDerivation
  derived from: http://data.ga-group.nl/ics/bics/2014/111613101211
  source accessed on: 2019-12-03T20:05:01Z
  source last accessed on: 2019-12-03T20:05:01Z
  definition: This segment includes restaurants that provide food services where food is made to order, often in front of the customer with customizable options. Patrons pay before self-seating in an upscale environment. Food and drink may be consumed on premises, taken out or delivered to the customer's location. Alcohol may or may not be available. This segment includes only company-owned restaurant revenue.
  notation: 111613101211
  valid from: 2014-08-08
  valid till: 2020-10-03
source accessed on: 2019-12-03T20:05:01Z
source last accessed on: 2019-12-03T20:05:01Z
definition: This segment includes restaurants that provide food services where food is made to order, often in front of the customer with customizable options. Patrons pay before self-seating in an upscale environment. Food and drink may be consumed on premises, taken out or delivered to the customer's location. Alcohol may or may not be available. This segment includes only company-owned restaurant revenue.
notation: 111613101211
valid from: 2014-08-08
valid till: 2020-10-03

Fast Casual Restaurants
type: BicsLevel5Segment
type: Classifier
type: NamedIndividual
is level5 segment of: Limited Service Restaurants
is replaced by: Fast Casual Restaurants
created with: infer-bics.sql
derived from: Fast Casual Restaurants
  type: BicsLevel5Segment
  type: Classifier
  type: ContemporaryDerivation
  derived from: http://data.ga-group.nl/ics/bics/2014/1116131012
  source accessed on: 2019-12-03T20:05:01Z
  source last accessed on: 2019-12-03T20:05:01Z
  definition: This segment includes restaurants that provide food services where food is made to order, often in front of the customer with customizable options. Patrons pay before self-seating in an upscale environment. Food and drink may be consumed on premises, taken out, or delivered to the customer's location. Alcohol may or may not be available. This segment includes company-owned and franchise revenue.
  notation: 1116131012
  valid from: 2014-08-08
  valid till: 2020-10-03
source accessed on: 2019-12-03T20:05:01Z
source last accessed on: 2019-12-03T20:05:01Z
definition: This segment includes restaurants that provide food services where food is made to order, often in front of the customer with customizable options. Patrons pay before self-seating in an upscale environment. Food and drink may be consumed on premises, taken out, or delivered to the customer's location. Alcohol may or may not be available. This segment includes company-owned and franchise revenue.
notation: 1116131012
valid from: 2014-08-08
valid till: 2020-10-03

Fast Food Rest - Franchise
type: BicsLevel6Segment
type: Classifier
type: NamedIndividual
is level6 segment of: Fast Food Restaurants
is replaced by: Fast Food Rest - Franchise
created with: infer-bics.sql
derived from: Fast Food Rest - Franchise
  type: BicsLevel6Segment
  type: Classifier
  type: ContemporaryDerivation
  derived from: http://data.ga-group.nl/ics/bics/2014/111613101310
  source accessed on: 2019-12-03T20:05:01Z
  source last accessed on: 2019-12-03T20:05:01Z
  definition: This segment includes companies that have franchise revenue for limited-service restaurants.
  notation: 111613101310
  valid from: 2014-08-08
  valid till: 2020-10-03
source accessed on: 2019-12-03T20:05:01Z
source last accessed on: 2019-12-03T20:05:01Z
definition: This segment includes companies that have franchise revenue for limited-service restaurants.
notation: 111613101310
valid from: 2014-08-08
valid till: 2020-10-03

Fast Food Rest - Owned
type: BicsLevel6Segment
type: Classifier
type: NamedIndividual
is level6 segment of: Fast Food Restaurants
is replaced by: Fast Food Rest - Owned
created with: infer-bics.sql
derived from: Fast Food Rest - Owned
  type: BicsLevel6Segment
  type: Classifier
  type: ContemporaryDerivation
  derived from: http://data.ga-group.nl/ics/bics/2014/111613101311
  source accessed on: 2019-12-03T20:05:01Z
  source last accessed on: 2019-12-03T20:05:01Z
  definition: This segment includes restaurants that provide food services where patrons generally order their food and pay before eating. Food and drink may be consumed on premises, taken out or delivered to the customer's location. This segment only includes company-owned restaurant revenue.
  notation: 111613101311
  valid from: 2014-08-08
  valid till: 2020-10-03
source accessed on: 2019-12-03T20:05:01Z
source last accessed on: 2019-12-03T20:05:01Z
definition: This segment includes restaurants that provide food services where patrons generally order their food and pay before eating. Food and drink may be consumed on premises, taken out or delivered to the customer's location. This segment only includes company-owned restaurant revenue.
notation: 111613101311
valid from: 2014-08-08
valid till: 2020-10-03

Fast Food Restaurants
type: BicsLevel5Segment
type: Classifier
type: NamedIndividual
is level5 segment of: Limited Service Restaurants
is replaced by: Fast Food Restaurants
created with: infer-bics.sql
derived from: Fast Food Restaurants
  type: BicsLevel5Segment
  type: Classifier
  type: ContemporaryDerivation
  derived from: http://data.ga-group.nl/ics/bics/2014/1116131013
  source accessed on: 2019-12-03T20:05:01Z
  source last accessed on: 2019-12-03T20:05:01Z
  definition: This segment includes restaurants that provide food services where patrons order their food and pay before eating. Food and drink may be consumed on premises, taken out or delivered to the customer's location. This segment includes both company-owned restaurant and franchise revenue.
  notation: 1116131013
  valid from: 2014-08-08
  valid till: 2020-10-03
source accessed on: 2019-12-03T20:05:01Z
source last accessed on: 2019-12-03T20:05:01Z
definition: This segment includes restaurants that provide food services where patrons order their food and pay before eating. Food and drink may be consumed on premises, taken out or delivered to the customer's location. This segment includes both company-owned restaurant and franchise revenue.
notation: 1116131013
valid from: 2014-08-08
valid till: 2020-10-03

Snack & Juice Bars-Franchise
type: BicsLevel6Segment
type: Classifier
type: NamedIndividual
is level6 segment of: Snack & Juice Bars
is replaced by: Coffee & Snack - Franchise
created with: infer-bics.sql
derived from: Snack & Juice Bars-Franchise
  type: BicsLevel6Segment
  type: Classifier
  type: ContemporaryDerivation
  derived from: http://data.ga-group.nl/ics/bics/2014/111613101410
  source accessed on: 2019-12-03T20:05:01Z
  source last accessed on: 2019-12-03T20:05:01Z
  definition: This segment includes companies that have franchise revenue for snack and nonalcoholic beverage bars.
  notation: 111613101410
  valid from: 2014-08-08
  valid till: 2020-10-03
source accessed on: 2019-12-03T20:05:01Z
source last accessed on: 2019-12-03T20:05:01Z
definition: This segment includes companies that have franchise revenue for snack and nonalcoholic beverage bars.
notation: 111613101410
valid from: 2014-08-08
valid till: 2020-10-03

Snack & Juice Bars - Owned
type: BicsLevel6Segment
type: Classifier
type: NamedIndividual
is level6 segment of: Snack & Juice Bars
is replaced by: Coffee & Snack - Owned
created with: infer-bics.sql
derived from: Snack & Juice Bars - Owned
  type: BicsLevel6Segment
  type: Classifier
  type: ContemporaryDerivation
  derived from: http://data.ga-group.nl/ics/bics/2014/111613101411
  source accessed on: 2019-12-03T20:05:01Z
  source last accessed on: 2019-12-03T20:05:01Z
  definition: This segment includes companies that prepare and/or serve a specialty snack, such as ice cream, frozen yogurt, cookies or popcorn, or nonalcoholic beverages, such as coffee, juices, sodas or smoothies. The food is prepared for immediate consumption. This segment includes only company-owned restaurant revenue.
  notation: 111613101411
  valid from: 2014-08-08
  valid till: 2020-10-03
source accessed on: 2019-12-03T20:05:01Z
source last accessed on: 2019-12-03T20:05:01Z
definition: This segment includes companies that prepare and/or serve a specialty snack, such as ice cream, frozen yogurt, cookies or popcorn, or nonalcoholic beverages, such as coffee, juices, sodas or smoothies. The food is prepared for immediate consumption. This segment includes only company-owned restaurant revenue.
notation: 111613101411
valid from: 2014-08-08
valid till: 2020-10-03

Snack & Juice Bars
type: BicsLevel5Segment
type: Classifier
type: NamedIndividual
is level5 segment of: Limited Service Restaurants
is replaced by: Coffee & Snack
created with: infer-bics.sql
derived from: Snack & Juice Bars
  type: BicsLevel5Segment
  type: Classifier
  type: ContemporaryDerivation
  derived from: http://data.ga-group.nl/ics/bics/2014/1116131014
  source accessed on: 2019-12-03T20:05:01Z
  source last accessed on: 2019-12-03T20:05:01Z
  definition: This segment includes companies that prepare and/or serve a specialty snack, such as ice cream, frozen yogurt, cookies or popcorn, or serve nonalcoholic beverages, such as coffee, juices, sodas or smoothies. This segment includes company-owned and franchise revenue.
  notation: 1116131014
  valid from: 2014-08-08
  valid till: 2020-10-03
source accessed on: 2019-12-03T20:05:01Z
source last accessed on: 2019-12-03T20:05:01Z
definition: This segment includes companies that prepare and/or serve a specialty snack, such as ice cream, frozen yogurt, cookies or popcorn, or serve nonalcoholic beverages, such as coffee, juices, sodas or smoothies. This segment includes company-owned and franchise revenue.
notation: 1116131014
valid from: 2014-08-08
valid till: 2020-10-03

Limited Service Restaurants
type: BicsLevel4SubIndustry
type: Classifier
type: NamedIndividual
created with: infer-bics.sql
derived from: Limited Service Restaurants
  type: BicsLevel4SubIndustry
  type: Classifier
  type: ContemporaryDerivation
  derived from: http://data.ga-group.nl/ics/bics/2014/11161310
  source accessed on: 2019-12-03T20:05:01Z
  source last accessed on: 2019-12-03T20:05:01Z
  definition: This industry subgroup includes establishments that provide food services where patrons generally order or select items and pay before eating. Food and drink may be consumed on premises, taken out or delivered to the customer's location. This industry subgroup includes company-owned and franchise revenue.
  notation: 11161310
  valid from: 2014-08-08
  valid till: 2020-10-03
source accessed on: 2019-12-03T20:05:01Z
source last accessed on: 2019-12-03T20:05:01Z
definition: This industry subgroup includes establishments that provide food services where patrons generally order or select items and pay before eating. Food and drink may be consumed on premises, taken out or delivered to the customer's location. This industry subgroup includes company-owned and franchise revenue.
notation: 11161310
valid from: 2014-08-08
valid till: 2020-10-03

Casual Rest - Franchise
type: BicsLevel6Segment
type: Classifier
type: NamedIndividual
is level6 segment of: Casual Full Svc Restaurants
is replaced by: Casual Rest - Franchise
created with: infer-bics.sql
derived from: Casual Rest - Franchise
  type: BicsLevel6Segment
  type: Classifier
  type: ContemporaryDerivation
  derived from: http://data.ga-group.nl/ics/bics/2014/111613111010
  source accessed on: 2019-12-03T20:05:01Z
  source last accessed on: 2019-12-03T20:05:01Z
  definition: This segment includes companies that have franchise revenue for casual family restaurants.
  notation: 111613111010
  valid from: 2014-08-08
  valid till: 2020-10-03
source accessed on: 2019-12-03T20:05:01Z
source last accessed on: 2019-12-03T20:05:01Z
definition: This segment includes companies that have franchise revenue for casual family restaurants.
notation: 111613111010
valid from: 2014-08-08
valid till: 2020-10-03

Casual Rest - Owned
type: BicsLevel6Segment
type: Classifier
type: NamedIndividual
is level6 segment of: Casual Full Svc Restaurants
is replaced by: Casual Rest - Owned
created with: infer-bics.sql
derived from: Casual Rest - Owned
  type: BicsLevel6Segment
  type: Classifier
  type: ContemporaryDerivation
  derived from: http://data.ga-group.nl/ics/bics/2014/111613111011
  source accessed on: 2019-12-03T20:05:01Z
  source last accessed on: 2019-12-03T20:05:01Z
  definition: This segment includes lower- to mid-priced restaurants that provide food services to patrons who order their food, are served by wait staff while seated and pay after eating. This segment only includes company-owned restaurant revenue.
  notation: 111613111011
  valid from: 2014-08-08
  valid till: 2020-10-03
source accessed on: 2019-12-03T20:05:01Z
source last accessed on: 2019-12-03T20:05:01Z
definition: This segment includes lower- to mid-priced restaurants that provide food services to patrons who order their food, are served by wait staff while seated and pay after eating. This segment only includes company-owned restaurant revenue.
notation: 111613111011
valid from: 2014-08-08
valid till: 2020-10-03

Casual Full Svc Restaurants
type: BicsLevel5Segment
type: Classifier
type: NamedIndividual
is level5 segment of: Full Service Restaurants
is replaced by: Casual Restaurants
created with: infer-bics.sql
derived from: Casual Full Svc Restaurants
  type: BicsLevel5Segment
  type: Classifier
  type: ContemporaryDerivation
  derived from: http://data.ga-group.nl/ics/bics/2014/1116131110
  source accessed on: 2019-12-03T20:05:01Z
  source last accessed on: 2019-12-03T20:05:01Z
  definition: This segment includes lower- to mid-priced restaurants that provide food services to patrons who order their food, are served by wait staff while seated and pay after eating. This segment includes both company-owned restaurant and franchise revenue.
  notation: 1116131110
  valid from: 2014-08-08
  valid till: 2020-10-03
source accessed on: 2019-12-03T20:05:01Z
source last accessed on: 2019-12-03T20:05:01Z
definition: This segment includes lower- to mid-priced restaurants that provide food services to patrons who order their food, are served by wait staff while seated and pay after eating. This segment includes both company-owned restaurant and franchise revenue.
notation: 1116131110
valid from: 2014-08-08
valid till: 2020-10-03

Upscale Rest - Franchise
type: BicsLevel6Segment
type: Classifier
type: NamedIndividual
is level6 segment of: Upscale Full Svc Restaurants
is replaced by: Upscale Rest - Franchise
created with: infer-bics.sql
derived from: Upscale Rest - Franchise
  type: BicsLevel6Segment
  type: Classifier
  type: ContemporaryDerivation
  derived from: http://data.ga-group.nl/ics/bics/2014/111613111110
  source accessed on: 2019-12-03T20:05:01Z
  source last accessed on: 2019-12-03T20:05:01Z
  definition: This segment includes companies that have franchise revenue for upscale family restaurants.
  notation: 111613111110
  valid from: 2014-08-08
  valid till: 2020-10-03
source accessed on: 2019-12-03T20:05:01Z
source last accessed on: 2019-12-03T20:05:01Z
definition: This segment includes companies that have franchise revenue for upscale family restaurants.
notation: 111613111110
valid from: 2014-08-08
valid till: 2020-10-03

Upscale Rest - Owned
type: BicsLevel6Segment
type: Classifier
type: NamedIndividual
is level6 segment of: Upscale Full Svc Restaurants
is replaced by: Upscale Rest - Owned
created with: infer-bics.sql
derived from: Upscale Rest - Owned
  type: BicsLevel6Segment
  type: Classifier
  type: ContemporaryDerivation
  derived from: http://data.ga-group.nl/ics/bics/2014/111613111111
  source accessed on: 2019-12-03T20:05:01Z
  source last accessed on: 2019-12-03T20:05:01Z
  definition: This segment includes high-priced restaurants that provide food services to patrons who order their food, are served by wait staff while seated and pay after eating. This segment only includes company-owned restaurant revenue.
  notation: 111613111111
  valid from: 2014-08-08
  valid till: 2020-10-03
source accessed on: 2019-12-03T20:05:01Z
source last accessed on: 2019-12-03T20:05:01Z
definition: This segment includes high-priced restaurants that provide food services to patrons who order their food, are served by wait staff while seated and pay after eating. This segment only includes company-owned restaurant revenue.
notation: 111613111111
valid from: 2014-08-08
valid till: 2020-10-03

Upscale Full Svc Restaurants
type: BicsLevel5Segment
type: Classifier
type: NamedIndividual
is level5 segment of: Full Service Restaurants
is replaced by: Upscale Restaurants
created with: infer-bics.sql
derived from: Upscale Full Svc Restaurants
  type: BicsLevel5Segment
  type: Classifier
  type: ContemporaryDerivation
  derived from: http://data.ga-group.nl/ics/bics/2014/1116131111
  source accessed on: 2019-12-03T20:05:01Z
  source last accessed on: 2019-12-03T20:05:01Z
  definition: This segment includes companies that provide food services to patrons who order their food, are served by wait staff while seated and pay after eating. This segment includes company-owned and franchise revenue.
  notation: 1116131111
  valid from: 2014-08-08
  valid till: 2020-10-03
source accessed on: 2019-12-03T20:05:01Z
source last accessed on: 2019-12-03T20:05:01Z
definition: This segment includes companies that provide food services to patrons who order their food, are served by wait staff while seated and pay after eating. This segment includes company-owned and franchise revenue.
notation: 1116131111
valid from: 2014-08-08
valid till: 2020-10-03

Full Service Restaurants
type: BicsLevel4SubIndustry
type: Classifier
type: NamedIndividual
created with: infer-bics.sql
derived from: Full Service Restaurants
  type: BicsLevel4SubIndustry
  type: Classifier
  type: ContemporaryDerivation
  derived from: http://data.ga-group.nl/ics/bics/2014/11161311
  source accessed on: 2019-12-03T20:05:01Z
  source last accessed on: 2019-12-03T20:05:01Z
  definition: This industry subgroup includes restaurants that provide food services to patrons who order their food, are served by wait staff while seated and pay after eating.
  notation: 11161311
  valid from: 2014-08-08
  valid till: 2020-10-03
source accessed on: 2019-12-03T20:05:01Z
source last accessed on: 2019-12-03T20:05:01Z
definition: This industry subgroup includes restaurants that provide food services to patrons who order their food, are served by wait staff while seated and pay after eating.
notation: 11161311
valid from: 2014-08-08
valid till: 2020-10-03

Restaurants
type: BicsLevel3Industry
type: Classifier
type: NamedIndividual
is industry of: Gaming, Lodging & Restaurants
is replaced by: Restaurants
created with: infer-bics.sql
derived from: Restaurants
  type: BicsLevel3Industry
  type: Classifier
  type: ContemporaryDerivation
  derived from: http://data.ga-group.nl/ics/bics/2014/111613
  source accessed on: 2019-12-03T20:05:01Z
  source last accessed on: 2019-12-03T20:05:01Z
  definition: This industry includes companies that prepares, serves or provides self-serve food for immediate consumption. The facilities can be seated, takeout, or mobile vehicles or carts.
  notation: 111613
  valid from: 2014-08-08
  valid till: 2020-10-03
source accessed on: 2019-12-03T20:05:01Z
source last accessed on: 2019-12-03T20:05:01Z
definition: This industry includes companies that prepares, serves or provides self-serve food for immediate consumption. The facilities can be seated, takeout, or mobile vehicles or carts.
notation: 111613
valid from: 2014-08-08
valid till: 2020-10-03

Gaming, Lodging & Restaurants
type: BicsLevel2IndustryGroup
type: Classifier
type: NamedIndividual
is industry group of: Consumer Discretionary
is replaced by: Leisure Facilities & Services
created with: infer-bics.sql
derived from: Gaming, Lodging & Restaurants
  type: BicsLevel2IndustryGroup
  type: Classifier
  type: ContemporaryDerivation
  derived from: http://data.ga-group.nl/ics/bics/2014/1116
  source accessed on: 2019-12-03T20:05:01Z
  source last accessed on: 2019-12-03T20:05:01Z
  definition: This industry group includes companies that operate establishments in casinos and gambling, cruises lines, lodging, passenger transportation and restaurants.
  notation: 1116
  valid from: 2014-08-08
  valid till: 2020-10-03
source accessed on: 2019-12-03T20:05:01Z
source last accessed on: 2019-12-03T20:05:01Z
definition: This industry group includes companies that operate establishments in casinos and gambling, cruises lines, lodging, passenger transportation and restaurants.
notation: 1116
valid from: 2014-08-08
valid till: 2020-10-03

Charter Airline - Full Svc
type: BicsLevel5Segment
type: Classifier
type: NamedIndividual
is level5 segment of: Full Service Airline
is replaced by: http://data.ga-group.nl/ics/bics/171112101010
created with: infer-bics.sql
derived from: Charter Airline - Full Svc
  type: BicsLevel5Segment
  type: Classifier
  type: ContemporaryDerivation
  derived from: http://data.ga-group.nl/ics/bics/2014/1117101010
  source accessed on: 2019-12-03T20:05:01Z
  source last accessed on: 2019-12-03T20:05:01Z
  definition: This segment includes full-service carrier revenue generated from chartered airline operations. Charter flights are usually nonscheduled and carry mainly tourists as passengers. Airlines can also offer charter flights to carry military personnel.
  notation: 1117101010
  valid from: 2014-08-08
  valid till: 2020-10-03
source accessed on: 2019-12-03T20:05:01Z
source last accessed on: 2019-12-03T20:05:01Z
definition: This segment includes full-service carrier revenue generated from chartered airline operations. Charter flights are usually nonscheduled and carry mainly tourists as passengers. Airlines can also offer charter flights to carry military personnel.
notation: 1117101010
valid from: 2014-08-08
valid till: 2020-10-03

Mainline Airline - Full Svc
type: BicsLevel5Segment
type: Classifier
type: NamedIndividual
is level5 segment of: Full Service Airline
is replaced by: http://data.ga-group.nl/ics/bics/171112101011
created with: infer-bics.sql
derived from: Mainline Airline - Full Svc
  type: BicsLevel5Segment
  type: Classifier
  type: ContemporaryDerivation
  derived from: http://data.ga-group.nl/ics/bics/2014/1117101011
  source accessed on: 2019-12-03T20:05:01Z
  source last accessed on: 2019-12-03T20:05:01Z
  definition: This segment includes full-service carrier revenue generated from mainline passenger air operations. Services are conducted with long-haul aircraft to domestic and international destinations.
  notation: 1117101011
  valid from: 2014-08-08
  valid till: 2020-10-03
source accessed on: 2019-12-03T20:05:01Z
source last accessed on: 2019-12-03T20:05:01Z
definition: This segment includes full-service carrier revenue generated from mainline passenger air operations. Services are conducted with long-haul aircraft to domestic and international destinations.
notation: 1117101011
valid from: 2014-08-08
valid till: 2020-10-03

Onboard Airline - Full Svc
type: BicsLevel5Segment
type: Classifier
type: NamedIndividual
is level5 segment of: Full Service Airline
created with: infer-bics.sql
derived from: Onboard Airline - Full Svc
  type: BicsLevel5Segment
  type: Classifier
  type: ContemporaryDerivation
  derived from: http://data.ga-group.nl/ics/bics/2014/1117101012
  source accessed on: 2019-12-03T20:05:01Z
  source last accessed on: 2019-12-03T20:05:01Z
  definition: This segment includes full-service carrier revenue generated from the sale of onboard food, goods, telecommunications services and gaming proceeds.
  notation: 1117101012
  valid from: 2014-08-08
  valid till: 2020-10-03
source accessed on: 2019-12-03T20:05:01Z
source last accessed on: 2019-12-03T20:05:01Z
definition: This segment includes full-service carrier revenue generated from the sale of onboard food, goods, telecommunications services and gaming proceeds.
notation: 1117101012
valid from: 2014-08-08
valid till: 2020-10-03

Regional Airline - Full Svc
type: BicsLevel5Segment
type: Classifier
type: NamedIndividual
is level5 segment of: Full Service Airline
is replaced by: http://data.ga-group.nl/ics/bics/171112101012
created with: infer-bics.sql
derived from: Regional Airline - Full Svc
  type: BicsLevel5Segment
  type: Classifier
  type: ContemporaryDerivation
  derived from: http://data.ga-group.nl/ics/bics/2014/1117101013
  source accessed on: 2019-12-03T20:05:01Z
  source last accessed on: 2019-12-03T20:05:01Z
  definition: This segment includes full-service carrier revenue generated from regional operations, such as contract carriers and/or regional subsidiaries.
  notation: 1117101013
  valid from: 2014-08-08
  valid till: 2020-10-03
source accessed on: 2019-12-03T20:05:01Z
source last accessed on: 2019-12-03T20:05:01Z
definition: This segment includes full-service carrier revenue generated from regional operations, such as contract carriers and/or regional subsidiaries.
notation: 1117101013
valid from: 2014-08-08
valid till: 2020-10-03

Other Passenger Rev - Full Svc
type: BicsLevel5Segment
type: Classifier
type: NamedIndividual
is level5 segment of: Full Service Airline
is replaced by: http://data.ga-group.nl/ics/bics/171112101013
created with: infer-bics.sql
derived from: Other Passenger Rev - Full Svc
  type: BicsLevel5Segment
  type: Classifier
  type: ContemporaryDerivation
  derived from: http://data.ga-group.nl/ics/bics/2014/1117101014
  source accessed on: 2019-12-03T20:05:01Z
  source last accessed on: 2019-12-03T20:05:01Z
  definition: This segment includes full-service carrier revenue generated from ancillary passenger activities, such as booking fees, baggage fees, frequent flyer programs and leasing income.
  notation: 1117101014
  valid from: 2014-08-08
  valid till: 2020-10-03
source accessed on: 2019-12-03T20:05:01Z
source last accessed on: 2019-12-03T20:05:01Z
definition: This segment includes full-service carrier revenue generated from ancillary passenger activities, such as booking fees, baggage fees, frequent flyer programs and leasing income.
notation: 1117101014
valid from: 2014-08-08
valid till: 2020-10-03

Full Service Airline
type: BicsLevel4SubIndustry
type: Classifier
type: NamedIndividual
created with: infer-bics.sql
derived from: Full Service Airline
  type: BicsLevel4SubIndustry
  type: Classifier
  type: ContemporaryDerivation
  derived from: http://data.ga-group.nl/ics/bics/2014/11171010
  source accessed on: 2019-12-03T20:05:01Z
  source last accessed on: 2019-12-03T20:05:01Z
  definition: This industry subgroup includes companies that provide traditional full-service hub-and-spoke scheduled passenger flights.
  notation: 11171010
  valid from: 2014-08-08
  valid till: 2020-10-03
source accessed on: 2019-12-03T20:05:01Z
source last accessed on: 2019-12-03T20:05:01Z
definition: This industry subgroup includes companies that provide traditional full-service hub-and-spoke scheduled passenger flights.
notation: 11171010
valid from: 2014-08-08
valid till: 2020-10-03

Chartered Airline - LCC
type: BicsLevel5Segment
type: Classifier
type: NamedIndividual
is level5 segment of: Low Cost Airline
is replaced by: http://data.ga-group.nl/ics/bics/171112101110
created with: infer-bics.sql
derived from: Chartered Airline - LCC
  type: BicsLevel5Segment
  type: Classifier
  type: ContemporaryDerivation
  derived from: http://data.ga-group.nl/ics/bics/2014/1117101110
  source accessed on: 2019-12-03T20:05:01Z
  source last accessed on: 2019-12-03T20:05:01Z
  definition: This segment includes low-cost carrier revenue generated from charted airline operations.
  notation: 1117101110
  valid from: 2014-08-08
  valid till: 2020-10-03
source accessed on: 2019-12-03T20:05:01Z
source last accessed on: 2019-12-03T20:05:01Z
definition: This segment includes low-cost carrier revenue generated from charted airline operations.
notation: 1117101110
valid from: 2014-08-08
valid till: 2020-10-03

Mainline Airline - LCC
type: BicsLevel5Segment
type: Classifier
type: NamedIndividual
is level5 segment of: Low Cost Airline
is replaced by: http://data.ga-group.nl/ics/bics/171112101111
created with: infer-bics.sql
derived from: Mainline Airline - LCC
  type: BicsLevel5Segment
  type: Classifier
  type: ContemporaryDerivation
  derived from: http://data.ga-group.nl/ics/bics/2014/1117101111
  source accessed on: 2019-12-03T20:05:01Z
  source last accessed on: 2019-12-03T20:05:01Z
  definition: This segment includes low-cost carrier revenue generated from airline mainline operations.
  notation: 1117101111
  valid from: 2014-08-08
  valid till: 2020-10-03
source accessed on: 2019-12-03T20:05:01Z
source last accessed on: 2019-12-03T20:05:01Z
definition: This segment includes low-cost carrier revenue generated from airline mainline operations.
notation: 1117101111
valid from: 2014-08-08
valid till: 2020-10-03

Onboard Airline - LCC
type: BicsLevel5Segment
type: Classifier
type: NamedIndividual
is level5 segment of: Low Cost Airline
created with: infer-bics.sql
derived from: Onboard Airline - LCC
  type: BicsLevel5Segment
  type: Classifier
  type: ContemporaryDerivation
  derived from: http://data.ga-group.nl/ics/bics/2014/1117101112
  source accessed on: 2019-12-03T20:05:01Z
  source last accessed on: 2019-12-03T20:05:01Z
  definition: This segment includes low-cost carrier revenue from the sale of onboard items and services.
  notation: 1117101112
  valid from: 2014-08-08
  valid till: 2020-10-03
source accessed on: 2019-12-03T20:05:01Z
source last accessed on: 2019-12-03T20:05:01Z
definition: This segment includes low-cost carrier revenue from the sale of onboard items and services.
notation: 1117101112
valid from: 2014-08-08
valid till: 2020-10-03

Regional Airline - LCC
type: BicsLevel5Segment
type: Classifier
type: NamedIndividual
is level5 segment of: Low Cost Airline
is replaced by: http://data.ga-group.nl/ics/bics/171112101112
created with: infer-bics.sql
derived from: Regional Airline - LCC
  type: BicsLevel5Segment
  type: Classifier
  type: ContemporaryDerivation
  derived from: http://data.ga-group.nl/ics/bics/2014/1117101113
  source accessed on: 2019-12-03T20:05:01Z
  source last accessed on: 2019-12-03T20:05:01Z
  definition: This segment includes low-cost carrier revenue generated from regional operations, such as contract carriers and/or regional subsidiaries.
  notation: 1117101113
  valid from: 2014-08-08
  valid till: 2020-10-03
source accessed on: 2019-12-03T20:05:01Z
source last accessed on: 2019-12-03T20:05:01Z
definition: This segment includes low-cost carrier revenue generated from regional operations, such as contract carriers and/or regional subsidiaries.
notation: 1117101113
valid from: 2014-08-08
valid till: 2020-10-03

Other Passenger Rev - LCC
type: BicsLevel5Segment
type: Classifier
type: NamedIndividual
is level5 segment of: Low Cost Airline
is replaced by: http://data.ga-group.nl/ics/bics/171112101113
created with: infer-bics.sql
derived from: Other Passenger Rev - LCC
  type: BicsLevel5Segment
  type: Classifier
  type: ContemporaryDerivation
  derived from: http://data.ga-group.nl/ics/bics/2014/1117101114
  source accessed on: 2019-12-03T20:05:01Z
  source last accessed on: 2019-12-03T20:05:01Z
  definition: This segment includes low-cost carrier revenue from ancillary revenue, luggage handling, airport services and other items and services not elsewhere classified.
  notation: 1117101114
  valid from: 2014-08-08
  valid till: 2020-10-03
source accessed on: 2019-12-03T20:05:01Z
source last accessed on: 2019-12-03T20:05:01Z
definition: This segment includes low-cost carrier revenue from ancillary revenue, luggage handling, airport services and other items and services not elsewhere classified.
notation: 1117101114
valid from: 2014-08-08
valid till: 2020-10-03

Low Cost Airline
type: BicsLevel4SubIndustry
type: Classifier
type: NamedIndividual
created with: infer-bics.sql
derived from: Low Cost Airline
  type: BicsLevel4SubIndustry
  type: Classifier
  type: ContemporaryDerivation
  derived from: http://data.ga-group.nl/ics/bics/2014/11171011
  source accessed on: 2019-12-03T20:05:01Z
  source last accessed on: 2019-12-03T20:05:01Z
  definition: This industry subgroup includes airlines that operate under a low-cost business model. Such a model may include providing low ticket prices, a single passenger class and limited services.
  notation: 11171011
  valid from: 2014-08-08
  valid till: 2020-10-03
source accessed on: 2019-12-03T20:05:01Z
source last accessed on: 2019-12-03T20:05:01Z
definition: This industry subgroup includes airlines that operate under a low-cost business model. Such a model may include providing low ticket prices, a single passenger class and limited services.
notation: 11171011
valid from: 2014-08-08
valid till: 2020-10-03

Branded Airline - Regional
type: BicsLevel5Segment
type: Classifier
type: NamedIndividual
is level5 segment of: Regional Airline
created with: infer-bics.sql
derived from: Branded Airline - Regional
  type: BicsLevel5Segment
  type: Classifier
  type: ContemporaryDerivation
  derived from: http://data.ga-group.nl/ics/bics/2014/1117101210
  source accessed on: 2019-12-03T20:05:01Z
  source last accessed on: 2019-12-03T20:05:01Z
  definition: This segment includes revenue that regional carriers generate from branded flying operations.
  notation: 1117101210
  valid from: 2014-08-08
  valid till: 2020-10-03
source accessed on: 2019-12-03T20:05:01Z
source last accessed on: 2019-12-03T20:05:01Z
definition: This segment includes revenue that regional carriers generate from branded flying operations.
notation: 1117101210
valid from: 2014-08-08
valid till: 2020-10-03

Chartered Airline - Regional
type: BicsLevel5Segment
type: Classifier
type: NamedIndividual
is level5 segment of: Regional Airline
is replaced by: http://data.ga-group.nl/ics/bics/171112101210
created with: infer-bics.sql
derived from: Chartered Airline - Regional
  type: BicsLevel5Segment
  type: Classifier
  type: ContemporaryDerivation
  derived from: http://data.ga-group.nl/ics/bics/2014/1117101211
  source accessed on: 2019-12-03T20:05:01Z
  source last accessed on: 2019-12-03T20:05:01Z
  definition: This segment includes regional carrier revenue generated from airline charter operations.
  notation: 1117101211
  valid from: 2014-08-08
  valid till: 2020-10-03
source accessed on: 2019-12-03T20:05:01Z
source last accessed on: 2019-12-03T20:05:01Z
definition: This segment includes regional carrier revenue generated from airline charter operations.
notation: 1117101211
valid from: 2014-08-08
valid till: 2020-10-03

Mainline Airline - Regional
type: BicsLevel5Segment
type: Classifier
type: NamedIndividual
is level5 segment of: Regional Airline
is replaced by: http://data.ga-group.nl/ics/bics/171112101211
created with: infer-bics.sql
derived from: Mainline Airline - Regional
  type: BicsLevel5Segment
  type: Classifier
  type: ContemporaryDerivation
  derived from: http://data.ga-group.nl/ics/bics/2014/1117101212
  source accessed on: 2019-12-03T20:05:01Z
  source last accessed on: 2019-12-03T20:05:01Z
  definition: This segment includes regional carrier revenue generated from airline mainline operations.
  notation: 1117101212
  valid from: 2014-08-08
  valid till: 2020-10-03
source accessed on: 2019-12-03T20:05:01Z
source last accessed on: 2019-12-03T20:05:01Z
definition: This segment includes regional carrier revenue generated from airline mainline operations.
notation: 1117101212
valid from: 2014-08-08
valid till: 2020-10-03

Onboard Airline - Regional
type: BicsLevel5Segment
type: Classifier
type: NamedIndividual
is level5 segment of: Regional Airline
created with: infer-bics.sql
derived from: Onboard Airline - Regional
  type: BicsLevel5Segment
  type: Classifier
  type: ContemporaryDerivation
  derived from: http://data.ga-group.nl/ics/bics/2014/1117101213
  source accessed on: 2019-12-03T20:05:01Z
  source last accessed on: 2019-12-03T20:05:01Z
  definition: This segment includes regional carrier revenue generated from the sale of onboard items/services.
  notation: 1117101213
  valid from: 2014-08-08
  valid till: 2020-10-03
source accessed on: 2019-12-03T20:05:01Z
source last accessed on: 2019-12-03T20:05:01Z
definition: This segment includes regional carrier revenue generated from the sale of onboard items/services.
notation: 1117101213
valid from: 2014-08-08
valid till: 2020-10-03

Regional Airline - Regional
type: BicsLevel5Segment
type: Classifier
type: NamedIndividual
is level5 segment of: Regional Airline
is replaced by: http://data.ga-group.nl/ics/bics/171112101212
created with: infer-bics.sql
derived from: Regional Airline - Regional
  type: BicsLevel5Segment
  type: Classifier
  type: ContemporaryDerivation
  derived from: http://data.ga-group.nl/ics/bics/2014/1117101214
  source accessed on: 2019-12-03T20:05:01Z
  source last accessed on: 2019-12-03T20:05:01Z
  definition: This segment includes regional carrier revenue generated from regional operations, such as contract carriers and/or regional subsidiaries.
  notation: 1117101214
  valid from: 2014-08-08
  valid till: 2020-10-03
source accessed on: 2019-12-03T20:05:01Z
source last accessed on: 2019-12-03T20:05:01Z
definition: This segment includes regional carrier revenue generated from regional operations, such as contract carriers and/or regional subsidiaries.
notation: 1117101214
valid from: 2014-08-08
valid till: 2020-10-03

Other Passenger Rev - Regional
type: BicsLevel5Segment
type: Classifier
type: NamedIndividual
is level5 segment of: Regional Airline
is replaced by: http://data.ga-group.nl/ics/bics/171112101213
created with: infer-bics.sql
derived from: Other Passenger Rev - Regional
  type: BicsLevel5Segment
  type: Classifier
  type: ContemporaryDerivation
  derived from: http://data.ga-group.nl/ics/bics/2014/1117101215
  source accessed on: 2019-12-03T20:05:01Z
  source last accessed on: 2019-12-03T20:05:01Z
  definition: This segment includes regional carrier revenue generated from ancillary revenue, luggage handling, airport services and other items and services not elsewhere classified.
  notation: 1117101215
  valid from: 2014-08-08
  valid till: 2020-10-03
source accessed on: 2019-12-03T20:05:01Z
source last accessed on: 2019-12-03T20:05:01Z
definition: This segment includes regional carrier revenue generated from ancillary revenue, luggage handling, airport services and other items and services not elsewhere classified.
notation: 1117101215
valid from: 2014-08-08
valid till: 2020-10-03

Regional Airline
type: BicsLevel4SubIndustry
type: Classifier
type: NamedIndividual
created with: infer-bics.sql
derived from: Regional Airline
  type: BicsLevel4SubIndustry
  type: Classifier
  type: ContemporaryDerivation
  derived from: http://data.ga-group.nl/ics/bics/2014/11171012
  source accessed on: 2019-12-03T20:05:01Z
  source last accessed on: 2019-12-03T20:05:01Z
  definition: This industry subgroup includes companies that provide airline service from small cities. Regional carriers are also used to support larger full-service carriers.
  notation: 11171012
  valid from: 2014-08-08
  valid till: 2020-10-03
source accessed on: 2019-12-03T20:05:01Z
source last accessed on: 2019-12-03T20:05:01Z
definition: This industry subgroup includes companies that provide airline service from small cities. Regional carriers are also used to support larger full-service carriers.
notation: 11171012
valid from: 2014-08-08
valid till: 2020-10-03

Airlines
type: BicsLevel3Industry
type: Classifier
type: NamedIndividual
is industry of: Passenger Transportation
is replaced by: http://data.ga-group.nl/ics/bics/17111210
created with: infer-bics.sql
derived from: Airlines
  type: BicsLevel3Industry
  type: Classifier
  type: ContemporaryDerivation
  derived from: http://data.ga-group.nl/ics/bics/2014/111710
  source accessed on: 2019-12-03T20:05:01Z
  source last accessed on: 2019-12-03T20:05:01Z
  definition: This industry includes companies that provide passenger air transportation services by air carriers and air commuter carriers.
  notation: 111710
  valid from: 2014-08-08
  valid till: 2020-10-03
source accessed on: 2019-12-03T20:05:01Z
source last accessed on: 2019-12-03T20:05:01Z
definition: This industry includes companies that provide passenger air transportation services by air carriers and air commuter carriers.
notation: 111710
valid from: 2014-08-08
valid till: 2020-10-03

Passenger Rail Transport
type: BicsLevel5Segment
type: Classifier
type: NamedIndividual
is level5 segment of: Railway Services
is replaced by: http://data.ga-group.nl/ics/bics/171112161010
created with: infer-bics.sql
derived from: Passenger Rail Transport
  type: BicsLevel5Segment
  type: Classifier
  type: ContemporaryDerivation
  derived from: http://data.ga-group.nl/ics/bics/2014/1117111010
  source accessed on: 2019-12-03T20:05:01Z
  source last accessed on: 2019-12-03T20:05:01Z
  definition: This segment includes companies that provide railway passenger services. Such services are provided between cities or over a long distance.
  notation: 1117111010
  valid from: 2014-08-08
  valid till: 2020-10-03
source accessed on: 2019-12-03T20:05:01Z
source last accessed on: 2019-12-03T20:05:01Z
definition: This segment includes companies that provide railway passenger services. Such services are provided between cities or over a long distance.
notation: 1117111010
valid from: 2014-08-08
valid till: 2020-10-03

Commuter Rail Transport
type: BicsLevel5Segment
type: Classifier
type: NamedIndividual
is level5 segment of: Railway Services
is replaced by: http://data.ga-group.nl/ics/bics/171112161011
created with: infer-bics.sql
derived from: Commuter Rail Transport
  type: BicsLevel5Segment
  type: Classifier
  type: ContemporaryDerivation
  derived from: http://data.ga-group.nl/ics/bics/2014/1117111011
  source accessed on: 2019-12-03T20:05:01Z
  source last accessed on: 2019-12-03T20:05:01Z
  definition: This segment includes companies that operate local and suburban commuter rail systems. Such services are provided within a metropolitan area and its adjacent suburban areas. Subways are included in this segment.
  notation: 1117111011
  valid from: 2014-08-08
  valid till: 2020-10-03
source accessed on: 2019-12-03T20:05:01Z
source last accessed on: 2019-12-03T20:05:01Z
definition: This segment includes companies that operate local and suburban commuter rail systems. Such services are provided within a metropolitan area and its adjacent suburban areas. Subways are included in this segment.
notation: 1117111011
valid from: 2014-08-08
valid till: 2020-10-03

Railway Services
type: BicsLevel4SubIndustry
type: Classifier
type: NamedIndividual
created with: infer-bics.sql
derived from: Railway Services
  type: BicsLevel4SubIndustry
  type: Classifier
  type: ContemporaryDerivation
  derived from: http://data.ga-group.nl/ics/bics/2014/11171110
  source accessed on: 2019-12-03T20:05:01Z
  source last accessed on: 2019-12-03T20:05:01Z
  definition: This industry subgroup includes companies that provide railway-based passenger transportation services.
  notation: 11171110
  valid from: 2014-08-08
  valid till: 2020-10-03
source accessed on: 2019-12-03T20:05:01Z
source last accessed on: 2019-12-03T20:05:01Z
definition: This industry subgroup includes companies that provide railway-based passenger transportation services.
notation: 11171110
valid from: 2014-08-08
valid till: 2020-10-03

Interurban & Rural Bus Transp
type: BicsLevel5Segment
type: Classifier
type: NamedIndividual
is level5 segment of: Bus Transit Services
is replaced by: http://data.ga-group.nl/ics/bics/171112161110
created with: infer-bics.sql
derived from: Interurban & Rural Bus Transp
  type: BicsLevel5Segment
  type: Classifier
  type: ContemporaryDerivation
  derived from: http://data.ga-group.nl/ics/bics/2014/1117111110
  source accessed on: 2019-12-03T20:05:01Z
  source last accessed on: 2019-12-03T20:05:01Z
  definition: This segment includes companies that provide bus passenger services outside a single metropolitan area. Such services are provided between cities or in rural areas.
  notation: 1117111110
  valid from: 2014-08-08
  valid till: 2020-10-03
source accessed on: 2019-12-03T20:05:01Z
source last accessed on: 2019-12-03T20:05:01Z
definition: This segment includes companies that provide bus passenger services outside a single metropolitan area. Such services are provided between cities or in rural areas.
notation: 1117111110
valid from: 2014-08-08
valid till: 2020-10-03

Local Bus Services
type: BicsLevel5Segment
type: Classifier
type: NamedIndividual
is level5 segment of: Bus Transit Services
is replaced by: http://data.ga-group.nl/ics/bics/171112161111
created with: infer-bics.sql
derived from: Local Bus Services
  type: BicsLevel5Segment
  type: Classifier
  type: ContemporaryDerivation
  derived from: http://data.ga-group.nl/ics/bics/2014/1117111111
  source accessed on: 2019-12-03T20:05:01Z
  source last accessed on: 2019-12-03T20:05:01Z
  definition: This segment includes companies that provide local and suburban bus passenger services within metropolitan areas and their adjacent suburban areas.
  notation: 1117111111
  valid from: 2014-08-08
  valid till: 2020-10-03
source accessed on: 2019-12-03T20:05:01Z
source last accessed on: 2019-12-03T20:05:01Z
definition: This segment includes companies that provide local and suburban bus passenger services within metropolitan areas and their adjacent suburban areas.
notation: 1117111111
valid from: 2014-08-08
valid till: 2020-10-03

Bus Transit Services
type: BicsLevel4SubIndustry
type: Classifier
type: NamedIndividual
created with: infer-bics.sql
derived from: Bus Transit Services
  type: BicsLevel4SubIndustry
  type: Classifier
  type: ContemporaryDerivation
  derived from: http://data.ga-group.nl/ics/bics/2014/11171111
  source accessed on: 2019-12-03T20:05:01Z
  source last accessed on: 2019-12-03T20:05:01Z
  definition: This industry subgroup includes companies that provide bus passenger transit services. Such services can operate within metropolitan and suburban areas or between cities and urban areas.
  notation: 11171111
  valid from: 2014-08-08
  valid till: 2020-10-03
source accessed on: 2019-12-03T20:05:01Z
source last accessed on: 2019-12-03T20:05:01Z
definition: This industry subgroup includes companies that provide bus passenger transit services. Such services can operate within metropolitan and suburban areas or between cities and urban areas.
notation: 11171111
valid from: 2014-08-08
valid till: 2020-10-03

Taxi Services
type: BicsLevel4SubIndustry
type: Classifier
type: NamedIndividual
created with: infer-bics.sql
derived from: Taxi Services
  type: BicsLevel4SubIndustry
  type: Classifier
  type: ContemporaryDerivation
  derived from: http://data.ga-group.nl/ics/bics/2014/11171112
  source accessed on: 2019-12-03T20:05:01Z
  source last accessed on: 2019-12-03T20:05:01Z
  definition: This industry subgroup includes companies that provide taxi services. Such services are provided by automobile or van.
  notation: 11171112
  valid from: 2014-08-08
  valid till: 2020-10-03
source accessed on: 2019-12-03T20:05:01Z
source last accessed on: 2019-12-03T20:05:01Z
definition: This industry subgroup includes companies that provide taxi services. Such services are provided by automobile or van.
notation: 11171112
valid from: 2014-08-08
valid till: 2020-10-03

Ferry Services
type: BicsLevel4SubIndustry
type: Classifier
type: NamedIndividual
created with: infer-bics.sql
derived from: Ferry Services
  type: BicsLevel4SubIndustry
  type: Classifier
  type: ContemporaryDerivation
  derived from: http://data.ga-group.nl/ics/bics/2014/11171113
  source accessed on: 2019-12-03T20:05:01Z
  source last accessed on: 2019-12-03T20:05:01Z
  definition: This industry subgroup includes companies that transport passengers on ferries and other inland waters vessels that are not suited for ocean transport.
  notation: 11171113
  valid from: 2014-08-08
  valid till: 2020-10-03
source accessed on: 2019-12-03T20:05:01Z
source last accessed on: 2019-12-03T20:05:01Z
definition: This industry subgroup includes companies that transport passengers on ferries and other inland waters vessels that are not suited for ocean transport.
notation: 11171113
valid from: 2014-08-08
valid till: 2020-10-03

Helicopter Services
type: BicsLevel4SubIndustry
type: Classifier
type: NamedIndividual
created with: infer-bics.sql
derived from: Helicopter Services
  type: BicsLevel4SubIndustry
  type: Classifier
  type: ContemporaryDerivation
  derived from: http://data.ga-group.nl/ics/bics/2014/11171114
  source accessed on: 2019-12-03T20:05:01Z
  source last accessed on: 2019-12-03T20:05:01Z
  definition: This industry subgroup includes companies that provide helicopter passenger services, such as commuter helicopter service. Excludes transportation of oil workers to oil platforms (see Oil & Gas Services).
  notation: 11171114
  valid from: 2014-08-08
  valid till: 2020-10-03
source accessed on: 2019-12-03T20:05:01Z
source last accessed on: 2019-12-03T20:05:01Z
definition: This industry subgroup includes companies that provide helicopter passenger services, such as commuter helicopter service. Excludes transportation of oil workers to oil platforms (see Oil & Gas Services).
notation: 11171114
valid from: 2014-08-08
valid till: 2020-10-03

Transit Services
type: BicsLevel3Industry
type: Classifier
type: NamedIndividual
is industry of: Passenger Transportation
is replaced by: http://data.ga-group.nl/ics/bics/17111216
created with: infer-bics.sql
derived from: Transit Services
  type: BicsLevel3Industry
  type: Classifier
  type: ContemporaryDerivation
  derived from: http://data.ga-group.nl/ics/bics/2014/111711
  source accessed on: 2019-12-03T20:05:01Z
  source last accessed on: 2019-12-03T20:05:01Z
  definition: This industry includes companies that operate passenger transit systems. Includes services such as bus and commuter rail passenger transportation, as well as taxi services and ferries. Excludes airlines and cruise ships.
  notation: 111711
  valid from: 2014-08-08
  valid till: 2020-10-03
source accessed on: 2019-12-03T20:05:01Z
source last accessed on: 2019-12-03T20:05:01Z
definition: This industry includes companies that operate passenger transit systems. Includes services such as bus and commuter rail passenger transportation, as well as taxi services and ferries. Excludes airlines and cruise ships.
notation: 111711
valid from: 2014-08-08
valid till: 2020-10-03

Passenger Transportation
type: BicsLevel2IndustryGroup
type: Classifier
type: NamedIndividual
is industry group of: Consumer Discretionary
created with: infer-bics.sql
derived from: Passenger Transportation
  type: BicsLevel2IndustryGroup
  type: Classifier
  type: ContemporaryDerivation
  derived from: http://data.ga-group.nl/ics/bics/2014/1117
  source accessed on: 2019-12-03T20:05:01Z
  source last accessed on: 2019-12-03T20:05:01Z
  definition: This industry group includes companies that provide regularly scheduled and charter operations to transport passengers by air or surface for a fee.
  notation: 1117
  valid from: 2014-08-08
  valid till: 2020-10-03
source accessed on: 2019-12-03T20:05:01Z
source last accessed on: 2019-12-03T20:05:01Z
definition: This industry group includes companies that provide regularly scheduled and charter operations to transport passengers by air or surface for a fee.
notation: 1117
valid from: 2014-08-08
valid till: 2020-10-03

Adult Nightclubs
type: BicsLevel4SubIndustry
type: Classifier
type: NamedIndividual
created with: infer-bics.sql
derived from: Adult Nightclubs
  type: BicsLevel4SubIndustry
  type: Classifier
  type: ContemporaryDerivation
  derived from: http://data.ga-group.nl/ics/bics/2014/11181010
  source accessed on: 2019-12-03T20:05:01Z
  source last accessed on: 2019-12-03T20:05:01Z
  definition: This industry subgroup includes companies that operate adult nightclub establishments.
  notation: 11181010
  valid from: 2014-08-08
  valid till: 2020-10-03
source accessed on: 2019-12-03T20:05:01Z
source last accessed on: 2019-12-03T20:05:01Z
definition: This industry subgroup includes companies that operate adult nightclub establishments.
notation: 11181010
valid from: 2014-08-08
valid till: 2020-10-03

Amusement Arcades
type: BicsLevel5Segment
type: Classifier
type: NamedIndividual
is level5 segment of: Amusement & Theme Parks
is replaced by: Amusement Arcades
created with: infer-bics.sql
derived from: Amusement Arcades
  type: BicsLevel5Segment
  type: Classifier
  type: ContemporaryDerivation
  derived from: http://data.ga-group.nl/ics/bics/2014/1118101110
  source accessed on: 2019-12-03T20:05:01Z
  source last accessed on: 2019-12-03T20:05:01Z
  definition: This segment includes companies that operate amusement arcades.
  notation: 1118101110
  valid from: 2014-08-08
  valid till: 2020-10-03
source accessed on: 2019-12-03T20:05:01Z
source last accessed on: 2019-12-03T20:05:01Z
definition: This segment includes companies that operate amusement arcades.
notation: 1118101110
valid from: 2014-08-08
valid till: 2020-10-03

Amuse Theme Parks
type: BicsLevel5Segment
type: Classifier
type: NamedIndividual
is level5 segment of: Amusement & Theme Parks
is replaced by: Amuse Theme Parks
created with: infer-bics.sql
derived from: Amuse Theme Parks
  type: BicsLevel5Segment
  type: Classifier
  type: ContemporaryDerivation
  derived from: http://data.ga-group.nl/ics/bics/2014/1118101111
  source accessed on: 2019-12-03T20:05:01Z
  source last accessed on: 2019-12-03T20:05:01Z
  definition: This segment includes companies that operate theme park facilities.
  notation: 1118101111
  valid from: 2014-08-08
  valid till: 2020-10-03
source accessed on: 2019-12-03T20:05:01Z
source last accessed on: 2019-12-03T20:05:01Z
definition: This segment includes companies that operate theme park facilities.
notation: 1118101111
valid from: 2014-08-08
valid till: 2020-10-03

Amusement & Theme Parks
type: BicsLevel4SubIndustry
type: Classifier
type: NamedIndividual
created with: infer-bics.sql
derived from: Amusement & Theme Parks
  type: BicsLevel4SubIndustry
  type: Classifier
  type: ContemporaryDerivation
  derived from: http://data.ga-group.nl/ics/bics/2014/11181011
  source accessed on: 2019-12-03T20:05:01Z
  source last accessed on: 2019-12-03T20:05:01Z
  definition: This industry subgroup includes companies that operate theme park facilities and amusement arcades.
  notation: 11181011
  valid from: 2014-08-08
  valid till: 2020-10-03
source accessed on: 2019-12-03T20:05:01Z
source last accessed on: 2019-12-03T20:05:01Z
definition: This industry subgroup includes companies that operate theme park facilities and amusement arcades.
notation: 11181011
valid from: 2014-08-08
valid till: 2020-10-03

Entertainment Ticket Agencies
type: BicsLevel4SubIndustry
type: Classifier
type: NamedIndividual
created with: infer-bics.sql
derived from: Entertainment Ticket Agencies
  type: BicsLevel4SubIndustry
  type: Classifier
  type: ContemporaryDerivation
  derived from: http://data.ga-group.nl/ics/bics/2014/11181012
  source accessed on: 2019-12-03T20:05:01Z
  source last accessed on: 2019-12-03T20:05:01Z
  definition: This industry subgroup includes companies that act as agents in the sale of tickets.
  notation: 11181012
  valid from: 2014-08-08
  valid till: 2020-10-03
source accessed on: 2019-12-03T20:05:01Z
source last accessed on: 2019-12-03T20:05:01Z
definition: This industry subgroup includes companies that act as agents in the sale of tickets.
notation: 11181012
valid from: 2014-08-08
valid till: 2020-10-03

Movie Theaters
type: BicsLevel4SubIndustry
type: Classifier
type: NamedIndividual
created with: infer-bics.sql
derived from: Movie Theaters
  type: BicsLevel4SubIndustry
  type: Classifier
  type: ContemporaryDerivation
  derived from: http://data.ga-group.nl/ics/bics/2014/11181013
  source accessed on: 2019-12-03T20:05:01Z
  source last accessed on: 2019-12-03T20:05:01Z
  definition: This industry subgroup includes cinema viewing facilities that project motion pictures onto a large screen.
  notation: 11181013
  valid from: 2014-08-08
  valid till: 2020-10-03
source accessed on: 2019-12-03T20:05:01Z
source last accessed on: 2019-12-03T20:05:01Z
definition: This industry subgroup includes cinema viewing facilities that project motion pictures onto a large screen.
notation: 11181013
valid from: 2014-08-08
valid till: 2020-10-03

Museums & Galleries
type: BicsLevel5Segment
type: Classifier
type: NamedIndividual
is level5 segment of: Perform Arts & Museums
is replaced by: Museums & Galleries
created with: infer-bics.sql
derived from: Museums & Galleries
  type: BicsLevel5Segment
  type: Classifier
  type: ContemporaryDerivation
  derived from: http://data.ga-group.nl/ics/bics/2014/1118101410
  source accessed on: 2019-12-03T20:05:01Z
  source last accessed on: 2019-12-03T20:05:01Z
  definition: This segment includes companies that provide the facilities for displays of various artifacts primarily for educational or cultural reasons.
  notation: 1118101410
  valid from: 2014-08-08
  valid till: 2020-10-03
source accessed on: 2019-12-03T20:05:01Z
source last accessed on: 2019-12-03T20:05:01Z
definition: This segment includes companies that provide the facilities for displays of various artifacts primarily for educational or cultural reasons.
notation: 1118101410
valid from: 2014-08-08
valid till: 2020-10-03

Independent Artists
type: BicsLevel6Segment
type: Classifier
type: NamedIndividual
is level6 segment of: Performing Arts
is replaced by: Independent Artists
created with: infer-bics.sql
derived from: Independent Artists
  type: BicsLevel6Segment
  type: Classifier
  type: ContemporaryDerivation
  derived from: http://data.ga-group.nl/ics/bics/2014/111810141110
  source accessed on: 2019-12-03T20:05:01Z
  source last accessed on: 2019-12-03T20:05:01Z
  definition: This segment includes companies that provide performing arts production, such as choreography, cinematography, acting and directing.
  notation: 111810141110
  valid from: 2014-08-08
  valid till: 2020-10-03
source accessed on: 2019-12-03T20:05:01Z
source last accessed on: 2019-12-03T20:05:01Z
definition: This segment includes companies that provide performing arts production, such as choreography, cinematography, acting and directing.
notation: 111810141110
valid from: 2014-08-08
valid till: 2020-10-03

Event Promoters w/ Facilities
type: BicsLevel6Segment
type: Classifier
type: NamedIndividual
is level6 segment of: Performing Arts
is replaced by: Event Promoters w/ Facilities
created with: infer-bics.sql
derived from: Event Promoters w/ Facilities
  type: BicsLevel6Segment
  type: Classifier
  type: ContemporaryDerivation
  derived from: http://data.ga-group.nl/ics/bics/2014/111810141111
  source accessed on: 2019-12-03T20:05:01Z
  source last accessed on: 2019-12-03T20:05:01Z
  definition: This segment includes companies that produce and organize live theatrical performances and provide facilities for such performances.
  notation: 111810141111
  valid from: 2014-08-08
  valid till: 2020-10-03
source accessed on: 2019-12-03T20:05:01Z
source last accessed on: 2019-12-03T20:05:01Z
definition: This segment includes companies that produce and organize live theatrical performances and provide facilities for such performances.
notation: 111810141111
valid from: 2014-08-08
valid till: 2020-10-03

Event Promoters w/o Facilities
type: BicsLevel6Segment
type: Classifier
type: NamedIndividual
is level6 segment of: Performing Arts
is replaced by: Event Promoters w/o Facilities
created with: infer-bics.sql
derived from: Event Promoters w/o Facilities
  type: BicsLevel6Segment
  type: Classifier
  type: ContemporaryDerivation
  derived from: http://data.ga-group.nl/ics/bics/2014/111810141112
  source accessed on: 2019-12-03T20:05:01Z
  source last accessed on: 2019-12-03T20:05:01Z
  definition: This segment includes companies that produce events, such as concerts and sports events, but do not actually provide the facilities.
  notation: 111810141112
  valid from: 2014-08-08
  valid till: 2020-10-03
source accessed on: 2019-12-03T20:05:01Z
source last accessed on: 2019-12-03T20:05:01Z
definition: This segment includes companies that produce events, such as concerts and sports events, but do not actually provide the facilities.
notation: 111810141112
valid from: 2014-08-08
valid till: 2020-10-03

Theaters & Dinner Theaters
type: BicsLevel6Segment
type: Classifier
type: NamedIndividual
is level6 segment of: Performing Arts
is replaced by: Theaters & Dinner Theaters
created with: infer-bics.sql
derived from: Theaters & Dinner Theaters
  type: BicsLevel6Segment
  type: Classifier
  type: ContemporaryDerivation
  derived from: http://data.ga-group.nl/ics/bics/2014/111810141113
  source accessed on: 2019-12-03T20:05:01Z
  source last accessed on: 2019-12-03T20:05:01Z
  definition: This segment includes companies that provide facilities for live theatrical performances.
  notation: 111810141113
  valid from: 2014-08-08
  valid till: 2020-10-03
source accessed on: 2019-12-03T20:05:01Z
source last accessed on: 2019-12-03T20:05:01Z
definition: This segment includes companies that provide facilities for live theatrical performances.
notation: 111810141113
valid from: 2014-08-08
valid till: 2020-10-03

Performing Arts
type: BicsLevel5Segment
type: Classifier
type: NamedIndividual
is level5 segment of: Perform Arts & Museums
is replaced by: Performing Arts
created with: infer-bics.sql
derived from: Performing Arts
  type: BicsLevel5Segment
  type: Classifier
  type: ContemporaryDerivation
  derived from: http://data.ga-group.nl/ics/bics/2014/1118101411
  source accessed on: 2019-12-03T20:05:01Z
  source last accessed on: 2019-12-03T20:05:01Z
  definition: This segment includes companies that produce live theatrical events.
  notation: 1118101411
  valid from: 2014-08-08
  valid till: 2020-10-03
source accessed on: 2019-12-03T20:05:01Z
source last accessed on: 2019-12-03T20:05:01Z
definition: This segment includes companies that produce live theatrical events.
notation: 1118101411
valid from: 2014-08-08
valid till: 2020-10-03

Perform Arts & Museums
type: BicsLevel4SubIndustry
type: Classifier
type: NamedIndividual
created with: infer-bics.sql
derived from: Perform Arts & Museums
  type: BicsLevel4SubIndustry
  type: Classifier
  type: ContemporaryDerivation
  derived from: http://data.ga-group.nl/ics/bics/2014/11181014
  source accessed on: 2019-12-03T20:05:01Z
  source last accessed on: 2019-12-03T20:05:01Z
  definition: This industry subgroup includes companies that provide theatrical performances, such as plays, concerts, dance and opera. Also includes museums, zoos and botanical gardens.
  notation: 11181014
  valid from: 2014-08-08
  valid till: 2020-10-03
source accessed on: 2019-12-03T20:05:01Z
source last accessed on: 2019-12-03T20:05:01Z
definition: This industry subgroup includes companies that provide theatrical performances, such as plays, concerts, dance and opera. Also includes museums, zoos and botanical gardens.
notation: 11181014
valid from: 2014-08-08
valid till: 2020-10-03

Broadcast Rights - Sports Teams
type: BicsLevel5Segment
type: Classifier
type: NamedIndividual
is level5 segment of: Pro Sports & Related Activities
is replaced by: Broadcast Rights - Sports Teams
created with: infer-bics.sql
derived from: Broadcast Rights - Sports Teams
  type: BicsLevel5Segment
  type: Classifier
  type: ContemporaryDerivation
  derived from: http://data.ga-group.nl/ics/bics/2014/1118101510
  source accessed on: 2019-12-03T20:05:01Z
  source last accessed on: 2019-12-03T20:05:01Z
  definition: This segment includes companies that manage the media and broadcasting rights of sports teams.
  notation: 1118101510
  valid from: 2014-08-08
  valid till: 2020-10-03
source accessed on: 2019-12-03T20:05:01Z
source last accessed on: 2019-12-03T20:05:01Z
definition: This segment includes companies that manage the media and broadcasting rights of sports teams.
notation: 1118101510
valid from: 2014-08-08
valid till: 2020-10-03

Gate Receipts
type: BicsLevel5Segment
type: Classifier
type: NamedIndividual
is level5 segment of: Pro Sports & Related Activities
is replaced by: Gate Receipts
created with: infer-bics.sql
derived from: Gate Receipts
  type: BicsLevel5Segment
  type: Classifier
  type: ContemporaryDerivation
  derived from: http://data.ga-group.nl/ics/bics/2014/1118101511
  source accessed on: 2019-12-03T20:05:01Z
  source last accessed on: 2019-12-03T20:05:01Z
  definition: This segment includes companies that provide ticket sales for live sporting events.
  notation: 1118101511
  valid from: 2014-08-08
  valid till: 2020-10-03
source accessed on: 2019-12-03T20:05:01Z
source last accessed on: 2019-12-03T20:05:01Z
definition: This segment includes companies that provide ticket sales for live sporting events.
notation: 1118101511
valid from: 2014-08-08
valid till: 2020-10-03

Sports Merchandising
type: BicsLevel5Segment
type: Classifier
type: NamedIndividual
is level5 segment of: Pro Sports & Related Activities
is replaced by: Sports Merchandising
created with: infer-bics.sql
derived from: Sports Merchandising
  type: BicsLevel5Segment
  type: Classifier
  type: ContemporaryDerivation
  derived from: http://data.ga-group.nl/ics/bics/2014/1118101512
  source accessed on: 2019-12-03T20:05:01Z
  source last accessed on: 2019-12-03T20:05:01Z
  definition: This segment includes companies that utilize sports trademarks to sell branded merchandise.
  notation: 1118101512
  valid from: 2014-08-08
  valid till: 2020-10-03
source accessed on: 2019-12-03T20:05:01Z
source last accessed on: 2019-12-03T20:05:01Z
definition: This segment includes companies that utilize sports trademarks to sell branded merchandise.
notation: 1118101512
valid from: 2014-08-08
valid till: 2020-10-03

Sports Teams
type: BicsLevel5Segment
type: Classifier
type: NamedIndividual
is level5 segment of: Pro Sports & Related Activities
is replaced by: Sports Teams
created with: infer-bics.sql
derived from: Sports Teams
  type: BicsLevel5Segment
  type: Classifier
  type: ContemporaryDerivation
  derived from: http://data.ga-group.nl/ics/bics/2014/1118101513
  source accessed on: 2019-12-03T20:05:01Z
  source last accessed on: 2019-12-03T20:05:01Z
  definition: This segment includes sports clubs that participate in live sporting events, such as baseball and football.
  notation: 1118101513
  valid from: 2014-08-08
  valid till: 2020-10-03
source accessed on: 2019-12-03T20:05:01Z
source last accessed on: 2019-12-03T20:05:01Z
definition: This segment includes sports clubs that participate in live sporting events, such as baseball and football.
notation: 1118101513
valid from: 2014-08-08
valid till: 2020-10-03

Pro Sports & Related Activities
type: BicsLevel4SubIndustry
type: Classifier
type: NamedIndividual
created with: infer-bics.sql
derived from: Pro Sports & Related Activities
  type: BicsLevel4SubIndustry
  type: Classifier
  type: ContemporaryDerivation
  derived from: http://data.ga-group.nl/ics/bics/2014/11181015
  source accessed on: 2019-12-03T20:05:01Z
  source last accessed on: 2019-12-03T20:05:01Z
  definition: This industry subgroup includes companies that provide professional sports activities.
  notation: 11181015
  valid from: 2014-08-08
  valid till: 2020-10-03
source accessed on: 2019-12-03T20:05:01Z
source last accessed on: 2019-12-03T20:05:01Z
definition: This industry subgroup includes companies that provide professional sports activities.
notation: 11181015
valid from: 2014-08-08
valid till: 2020-10-03

Entertainment Facilities
type: BicsLevel3Industry
type: Classifier
type: NamedIndividual
is industry of: Recreation Facilities & Svcs
is replaced by: Entertainment Facilities
created with: infer-bics.sql
derived from: Entertainment Facilities
  type: BicsLevel3Industry
  type: Classifier
  type: ContemporaryDerivation
  derived from: http://data.ga-group.nl/ics/bics/2014/111810
  source accessed on: 2019-12-03T20:05:01Z
  source last accessed on: 2019-12-03T20:05:01Z
  definition: This industry includes companies that operate various types of entertainment facilities, such as movie theaters, amusement parks, sports stadiums and arenas, and adult nightclubs.
  notation: 111810
  valid from: 2014-08-08
  valid till: 2020-10-03
source accessed on: 2019-12-03T20:05:01Z
source last accessed on: 2019-12-03T20:05:01Z
definition: This industry includes companies that operate various types of entertainment facilities, such as movie theaters, amusement parks, sports stadiums and arenas, and adult nightclubs.
notation: 111810
valid from: 2014-08-08
valid till: 2020-10-03

Recreational Goods Rental
type: BicsLevel4SubIndustry
type: Classifier
type: NamedIndividual
created with: infer-bics.sql
derived from: Recreational Goods Rental
  type: BicsLevel4SubIndustry
  type: Classifier
  type: ContemporaryDerivation
  derived from: http://data.ga-group.nl/ics/bics/2014/11181110
  source accessed on: 2019-12-03T20:05:01Z
  source last accessed on: 2019-12-03T20:05:01Z
  definition: This industry subgroup includes companies that rent recreational goods, such as ski equipment, personal watercraft and golf carts.
  notation: 11181110
  valid from: 2014-08-08
  valid till: 2020-10-03
source accessed on: 2019-12-03T20:05:01Z
source last accessed on: 2019-12-03T20:05:01Z
definition: This industry subgroup includes companies that rent recreational goods, such as ski equipment, personal watercraft and golf carts.
notation: 11181110
valid from: 2014-08-08
valid till: 2020-10-03

Sports & Recreation Instruction
type: BicsLevel4SubIndustry
type: Classifier
type: NamedIndividual
created with: infer-bics.sql
derived from: Sports & Recreation Instruction
  type: BicsLevel4SubIndustry
  type: Classifier
  type: ContemporaryDerivation
  derived from: http://data.ga-group.nl/ics/bics/2014/11181111
  source accessed on: 2019-12-03T20:05:01Z
  source last accessed on: 2019-12-03T20:05:01Z
  definition: This industry subgroup includes companies that provide instruction for sporting and recreational activities.
  notation: 11181111
  valid from: 2014-08-08
  valid till: 2020-10-03
source accessed on: 2019-12-03T20:05:01Z
source last accessed on: 2019-12-03T20:05:01Z
definition: This industry subgroup includes companies that provide instruction for sporting and recreational activities.
notation: 11181111
valid from: 2014-08-08
valid till: 2020-10-03

Tour Operators
type: BicsLevel5Segment
type: Classifier
type: NamedIndividual
is level5 segment of: Travel Services
is replaced by: Tour Operators
created with: infer-bics.sql
derived from: Tour Operators
  type: BicsLevel5Segment
  type: Classifier
  type: ContemporaryDerivation
  derived from: http://data.ga-group.nl/ics/bics/2014/1118111210
  source accessed on: 2019-12-03T20:05:01Z
  source last accessed on: 2019-12-03T20:05:01Z
  definition: This segment includes companies that arrange and operate tours.
  notation: 1118111210
  valid from: 2014-08-08
  valid till: 2020-10-03
source accessed on: 2019-12-03T20:05:01Z
source last accessed on: 2019-12-03T20:05:01Z
definition: This segment includes companies that arrange and operate tours.
notation: 1118111210
valid from: 2014-08-08
valid till: 2020-10-03

Retail Travel Agencies
type: BicsLevel6Segment
type: Classifier
type: NamedIndividual
is level6 segment of: Travel Agencies
created with: infer-bics.sql
derived from: Retail Travel Agencies
  type: BicsLevel6Segment
  type: Classifier
  type: ContemporaryDerivation
  derived from: http://data.ga-group.nl/ics/bics/2014/111811121110
  source accessed on: 2019-12-03T20:05:01Z
  source last accessed on: 2019-12-03T20:05:01Z
  definition: This segment includes companies that act as agents in the sale of travel and tour packages and who provide their services through retail locations.
  notation: 111811121110
  valid from: 2014-08-08
  valid till: 2020-10-03
source accessed on: 2019-12-03T20:05:01Z
source last accessed on: 2019-12-03T20:05:01Z
definition: This segment includes companies that act as agents in the sale of travel and tour packages and who provide their services through retail locations.
notation: 111811121110
valid from: 2014-08-08
valid till: 2020-10-03

Travel Agencies
type: BicsLevel5Segment
type: Classifier
type: NamedIndividual
is level5 segment of: Travel Services
is replaced by: Travel Agencies
created with: infer-bics.sql
derived from: Travel Agencies
  type: BicsLevel5Segment
  type: Classifier
  type: ContemporaryDerivation
  derived from: http://data.ga-group.nl/ics/bics/2014/1118111211
  source accessed on: 2019-12-03T20:05:01Z
  source last accessed on: 2019-12-03T20:05:01Z
  definition: This segment includes companies that act as agents in the sale of travel and tour packages.
  notation: 1118111211
  valid from: 2014-08-08
  valid till: 2020-10-03
source accessed on: 2019-12-03T20:05:01Z
source last accessed on: 2019-12-03T20:05:01Z
definition: This segment includes companies that act as agents in the sale of travel and tour packages.
notation: 1118111211
valid from: 2014-08-08
valid till: 2020-10-03

Travel Reservation Services
type: BicsLevel5Segment
type: Classifier
type: NamedIndividual
is level5 segment of: Travel Services
is replaced by: Travel Reservation Services
created with: infer-bics.sql
derived from: Travel Reservation Services
  type: BicsLevel5Segment
  type: Classifier
  type: ContemporaryDerivation
  derived from: http://data.ga-group.nl/ics/bics/2014/1118111212
  source accessed on: 2019-12-03T20:05:01Z
  source last accessed on: 2019-12-03T20:05:01Z
  definition: This segment includes companies that arrange travel reservation services. It also includes companies that provide time-share exchange services.
  notation: 1118111212
  valid from: 2014-08-08
  valid till: 2020-10-03
source accessed on: 2019-12-03T20:05:01Z
source last accessed on: 2019-12-03T20:05:01Z
definition: This segment includes companies that arrange travel reservation services. It also includes companies that provide time-share exchange services.
notation: 1118111212
valid from: 2014-08-08
valid till: 2020-10-03

Travel Services
type: BicsLevel4SubIndustry
type: Classifier
type: NamedIndividual
created with: infer-bics.sql
derived from: Travel Services
  type: BicsLevel4SubIndustry
  type: Classifier
  type: ContemporaryDerivation
  derived from: http://data.ga-group.nl/ics/bics/2014/11181112
  source accessed on: 2019-12-03T20:05:01Z
  source last accessed on: 2019-12-03T20:05:01Z
  definition: This industry subgroup includes companies that provide travel arrangement and/or tour operating services.
  notation: 11181112
  valid from: 2014-08-08
  valid till: 2020-10-03
source accessed on: 2019-12-03T20:05:01Z
source last accessed on: 2019-12-03T20:05:01Z
definition: This industry subgroup includes companies that provide travel arrangement and/or tour operating services.
notation: 11181112
valid from: 2014-08-08
valid till: 2020-10-03

Leisure & Travel Services
type: BicsLevel3Industry
type: Classifier
type: NamedIndividual
is industry of: Recreation Facilities & Svcs
created with: infer-bics.sql
derived from: Leisure & Travel Services
  type: BicsLevel3Industry
  type: Classifier
  type: ContemporaryDerivation
  derived from: http://data.ga-group.nl/ics/bics/2014/111811
  source accessed on: 2019-12-03T20:05:01Z
  source last accessed on: 2019-12-03T20:05:01Z
  definition: This industry includes travel agencies, tour operators, sports instruction services and recreational goods rental. Excludes Internet-based booking services (see Travel Info & Booking Web).
  notation: 111811
  valid from: 2014-08-08
  valid till: 2020-10-03
source accessed on: 2019-12-03T20:05:01Z
source last accessed on: 2019-12-03T20:05:01Z
definition: This industry includes travel agencies, tour operators, sports instruction services and recreational goods rental. Excludes Internet-based booking services (see Travel Info & Booking Web).
notation: 111811
valid from: 2014-08-08
valid till: 2020-10-03

Bowling Centers
type: BicsLevel4SubIndustry
type: Classifier
type: NamedIndividual
created with: infer-bics.sql
derived from: Bowling Centers
  type: BicsLevel4SubIndustry
  type: Classifier
  type: ContemporaryDerivation
  derived from: http://data.ga-group.nl/ics/bics/2014/11181210
  source accessed on: 2019-12-03T20:05:01Z
  source last accessed on: 2019-12-03T20:05:01Z
  definition: This industry subgroup includes companies that operate bowling alleys.
  notation: 11181210
  valid from: 2014-08-08
  valid till: 2020-10-03
source accessed on: 2019-12-03T20:05:01Z
source last accessed on: 2019-12-03T20:05:01Z
definition: This industry subgroup includes companies that operate bowling alleys.
notation: 11181210
valid from: 2014-08-08
valid till: 2020-10-03

Fitness & Recreation Centers
type: BicsLevel4SubIndustry
type: Classifier
type: NamedIndividual
created with: infer-bics.sql
derived from: Fitness & Recreation Centers
  type: BicsLevel4SubIndustry
  type: Classifier
  type: ContemporaryDerivation
  derived from: http://data.ga-group.nl/ics/bics/2014/11181211
  source accessed on: 2019-12-03T20:05:01Z
  source last accessed on: 2019-12-03T20:05:01Z
  definition: This industry subgroup includes companies that operate fitness and recreation sports centers, such as athletic club facilities, health spas without accommodations, ice- or roller-skating rinks and swimming pools.
  notation: 11181211
  valid from: 2014-08-08
  valid till: 2020-10-03
source accessed on: 2019-12-03T20:05:01Z
source last accessed on: 2019-12-03T20:05:01Z
definition: This industry subgroup includes companies that operate fitness and recreation sports centers, such as athletic club facilities, health spas without accommodations, ice- or roller-skating rinks and swimming pools.
notation: 11181211
valid from: 2014-08-08
valid till: 2020-10-03

Golf Courses & Country Clubs
type: BicsLevel4SubIndustry
type: Classifier
type: NamedIndividual
created with: infer-bics.sql
derived from: Golf Courses & Country Clubs
  type: BicsLevel4SubIndustry
  type: Classifier
  type: ContemporaryDerivation
  derived from: http://data.ga-group.nl/ics/bics/2014/11181212
  source accessed on: 2019-12-03T20:05:01Z
  source last accessed on: 2019-12-03T20:05:01Z
  definition: This industry subgroup includes companies that operate golf courses and country clubs.
  notation: 11181212
  valid from: 2014-08-08
  valid till: 2020-10-03
source accessed on: 2019-12-03T20:05:01Z
source last accessed on: 2019-12-03T20:05:01Z
definition: This industry subgroup includes companies that operate golf courses and country clubs.
notation: 11181212
valid from: 2014-08-08
valid till: 2020-10-03

Marinas
type: BicsLevel4SubIndustry
type: Classifier
type: NamedIndividual
created with: infer-bics.sql
derived from: Marinas
  type: BicsLevel4SubIndustry
  type: Classifier
  type: ContemporaryDerivation
  derived from: http://data.ga-group.nl/ics/bics/2014/11181213
  source accessed on: 2019-12-03T20:05:01Z
  source last accessed on: 2019-12-03T20:05:01Z
  definition: This industry subgroup includes facilities that support the operation of recreational water transports like boats, yachts and wave-runners.
  notation: 11181213
  valid from: 2014-08-08
  valid till: 2020-10-03
source accessed on: 2019-12-03T20:05:01Z
source last accessed on: 2019-12-03T20:05:01Z
definition: This industry subgroup includes facilities that support the operation of recreational water transports like boats, yachts and wave-runners.
notation: 11181213
valid from: 2014-08-08
valid till: 2020-10-03

Skiing Facilities
type: BicsLevel4SubIndustry
type: Classifier
type: NamedIndividual
created with: infer-bics.sql
derived from: Skiing Facilities
  type: BicsLevel4SubIndustry
  type: Classifier
  type: ContemporaryDerivation
  derived from: http://data.ga-group.nl/ics/bics/2014/11181214
  source accessed on: 2019-12-03T20:05:01Z
  source last accessed on: 2019-12-03T20:05:01Z
  definition: This industry subgroup includes companies that operate ski mountain trails, lifts and ski resorts. These companies may provide lodging and dining in addition to the operation of ski trails.
  notation: 11181214
  valid from: 2014-08-08
  valid till: 2020-10-03
source accessed on: 2019-12-03T20:05:01Z
source last accessed on: 2019-12-03T20:05:01Z
definition: This industry subgroup includes companies that operate ski mountain trails, lifts and ski resorts. These companies may provide lodging and dining in addition to the operation of ski trails.
notation: 11181214
valid from: 2014-08-08
valid till: 2020-10-03

Karaoke Operations
type: BicsLevel5Segment
type: Classifier
type: NamedIndividual
is level5 segment of: Other Amusement & Recreation
created with: infer-bics.sql
derived from: Karaoke Operations
  type: BicsLevel5Segment
  type: Classifier
  type: ContemporaryDerivation
  derived from: http://data.ga-group.nl/ics/bics/2014/1118121510
  source accessed on: 2019-12-03T20:05:01Z
  source last accessed on: 2019-12-03T20:05:01Z
  definition: This segment includes companies that operate karaoke facilities.
  notation: 1118121510
  valid from: 2014-08-08
  valid till: 2020-10-03
source accessed on: 2019-12-03T20:05:01Z
source last accessed on: 2019-12-03T20:05:01Z
definition: This segment includes companies that operate karaoke facilities.
notation: 1118121510
valid from: 2014-08-08
valid till: 2020-10-03

Other Amusement & Recreation
type: BicsLevel4SubIndustry
type: Classifier
type: NamedIndividual
created with: infer-bics.sql
derived from: Other Amusement & Recreation
  type: BicsLevel4SubIndustry
  type: Classifier
  type: ContemporaryDerivation
  derived from: http://data.ga-group.nl/ics/bics/2014/11181215
  source accessed on: 2019-12-03T20:05:01Z
  source last accessed on: 2019-12-03T20:05:01Z
  definition: This industry subgroup includes entertainment facilities not elsewhere classified, such as recreation parks (not theme parks), ski hills (not ski resorts), fairs, shows, beach chair or locker rentals, dance floors, fishing charters, campgrounds and circus events.
  notation: 11181215
  valid from: 2014-08-08
  valid till: 2020-10-03
source accessed on: 2019-12-03T20:05:01Z
source last accessed on: 2019-12-03T20:05:01Z
definition: This industry subgroup includes entertainment facilities not elsewhere classified, such as recreation parks (not theme parks), ski hills (not ski resorts), fairs, shows, beach chair or locker rentals, dance floors, fishing charters, campgrounds and circus events.
notation: 11181215
valid from: 2014-08-08
valid till: 2020-10-03

Leisure Clubs & Facilities
type: BicsLevel3Industry
type: Classifier
type: NamedIndividual
is industry of: Recreation Facilities & Svcs
created with: infer-bics.sql
derived from: Leisure Clubs & Facilities
  type: BicsLevel3Industry
  type: Classifier
  type: ContemporaryDerivation
  derived from: http://data.ga-group.nl/ics/bics/2014/111812
  source accessed on: 2019-12-03T20:05:01Z
  source last accessed on: 2019-12-03T20:05:01Z
  definition: This industry includes golf courses and country clubs, bowling centers, fitness centers, small-craft marinas, and skiing facilities without lodging.
  notation: 111812
  valid from: 2014-08-08
  valid till: 2020-10-03
source accessed on: 2019-12-03T20:05:01Z
source last accessed on: 2019-12-03T20:05:01Z
definition: This industry includes golf courses and country clubs, bowling centers, fitness centers, small-craft marinas, and skiing facilities without lodging.
notation: 111812
valid from: 2014-08-08
valid till: 2020-10-03

Recreation Facilities & Svcs
type: BicsLevel2IndustryGroup
type: Classifier
type: NamedIndividual
is industry group of: Consumer Discretionary
created with: infer-bics.sql
derived from: Recreation Facilities & Svcs
  type: BicsLevel2IndustryGroup
  type: Classifier
  type: ContemporaryDerivation
  derived from: http://data.ga-group.nl/ics/bics/2014/1118
  source accessed on: 2019-12-03T20:05:01Z
  source last accessed on: 2019-12-03T20:05:01Z
  definition: This industry group includes companies that operate establishments in the entertainment facilities and services, leisure and travel services, and leisure clubs and facilities businesses.
  notation: 1118
  valid from: 2014-08-08
  valid till: 2020-10-03
source accessed on: 2019-12-03T20:05:01Z
source last accessed on: 2019-12-03T20:05:01Z
definition: This industry group includes companies that operate establishments in the entertainment facilities and services, leisure and travel services, and leisure clubs and facilities businesses.
notation: 1118
valid from: 2014-08-08
valid till: 2020-10-03

Clothing & Accessories Whslrs
type: BicsLevel4SubIndustry
type: Classifier
type: NamedIndividual
created with: infer-bics.sql
derived from: Clothing & Accessories Whslrs
  type: BicsLevel4SubIndustry
  type: Classifier
  type: ContemporaryDerivation
  derived from: http://data.ga-group.nl/ics/bics/2014/11191010
  source accessed on: 2019-12-03T20:05:01Z
  source last accessed on: 2019-12-03T20:05:01Z
  definition: This industry subgroup includes companies that wholesale and distribute men's, women's, children's and infants' clothing.
  notation: 11191010
  valid from: 2014-08-08
  valid till: 2020-10-03
source accessed on: 2019-12-03T20:05:01Z
source last accessed on: 2019-12-03T20:05:01Z
definition: This industry subgroup includes companies that wholesale and distribute men's, women's, children's and infants' clothing.
notation: 11191010
valid from: 2014-08-08
valid till: 2020-10-03

Footwear Wholesalers
type: BicsLevel4SubIndustry
type: Classifier
type: NamedIndividual
created with: infer-bics.sql
derived from: Footwear Wholesalers
  type: BicsLevel4SubIndustry
  type: Classifier
  type: ContemporaryDerivation
  derived from: http://data.ga-group.nl/ics/bics/2014/11191011
  source accessed on: 2019-12-03T20:05:01Z
  source last accessed on: 2019-12-03T20:05:01Z
  definition: This industry subgroup includes companies that wholesale and distribute leather, rubber and composite material footwear.
  notation: 11191011
  valid from: 2014-08-08
  valid till: 2020-10-03
source accessed on: 2019-12-03T20:05:01Z
source last accessed on: 2019-12-03T20:05:01Z
definition: This industry subgroup includes companies that wholesale and distribute leather, rubber and composite material footwear.
notation: 11191011
valid from: 2014-08-08
valid till: 2020-10-03

Apparel & Footwear Whslrs
type: BicsLevel3Industry
type: Classifier
type: NamedIndividual
is industry of: Distributors - Discretionary
is replaced by: Apparel & Footwear Whslrs
created with: infer-bics.sql
derived from: Apparel & Footwear Whslrs
  type: BicsLevel3Industry
  type: Classifier
  type: ContemporaryDerivation
  derived from: http://data.ga-group.nl/ics/bics/2014/111910
  source accessed on: 2019-12-03T20:05:01Z
  source last accessed on: 2019-12-03T20:05:01Z
  definition: This industry includes companies that wholesale fashion apparel, sports clothing, outerwear, gloves, ties, belts and footwear, including fashion footwear and athletic footwear.
  notation: 111910
  valid from: 2014-08-08
  valid till: 2020-10-03
source accessed on: 2019-12-03T20:05:01Z
source last accessed on: 2019-12-03T20:05:01Z
definition: This industry includes companies that wholesale fashion apparel, sports clothing, outerwear, gloves, ties, belts and footwear, including fashion footwear and athletic footwear.
notation: 111910
valid from: 2014-08-08
valid till: 2020-10-03

Auto & Motor Vehicles Whslrs
type: BicsLevel4SubIndustry
type: Classifier
type: NamedIndividual
created with: infer-bics.sql
derived from: Auto & Motor Vehicles Whslrs
  type: BicsLevel4SubIndustry
  type: Classifier
  type: ContemporaryDerivation
  derived from: http://data.ga-group.nl/ics/bics/2014/11191110
  source accessed on: 2019-12-03T20:05:01Z
  source last accessed on: 2019-12-03T20:05:01Z
  definition: This industry subgroup includes companies that wholesale and distribute new and used passenger automobiles, trucks, trailers and other motor vehicles, such as motorcycles, motor homes and snowmobiles.
  notation: 11191110
  valid from: 2014-08-08
  valid till: 2020-10-03
source accessed on: 2019-12-03T20:05:01Z
source last accessed on: 2019-12-03T20:05:01Z
definition: This industry subgroup includes companies that wholesale and distribute new and used passenger automobiles, trucks, trailers and other motor vehicles, such as motorcycles, motor homes and snowmobiles.
notation: 11191110
valid from: 2014-08-08
valid till: 2020-10-03

Mot Veh Parts (Used) Whslrs
type: BicsLevel4SubIndustry
type: Classifier
type: NamedIndividual
created with: infer-bics.sql
derived from: Mot Veh Parts (Used) Whslrs
  type: BicsLevel4SubIndustry
  type: Classifier
  type: ContemporaryDerivation
  derived from: http://data.ga-group.nl/ics/bics/2014/11191111
  source accessed on: 2019-12-03T20:05:01Z
  source last accessed on: 2019-12-03T20:05:01Z
  definition: This industry subgroup includes companies that wholesale and distribute used motor vehicle parts.
  notation: 11191111
  valid from: 2014-08-08
  valid till: 2020-10-03
source accessed on: 2019-12-03T20:05:01Z
source last accessed on: 2019-12-03T20:05:01Z
definition: This industry subgroup includes companies that wholesale and distribute used motor vehicle parts.
notation: 11191111
valid from: 2014-08-08
valid till: 2020-10-03

Motor Vehicle Supplies Whslrs
type: BicsLevel4SubIndustry
type: Classifier
type: NamedIndividual
created with: infer-bics.sql
derived from: Motor Vehicle Supplies Whslrs
  type: BicsLevel4SubIndustry
  type: Classifier
  type: ContemporaryDerivation
  derived from: http://data.ga-group.nl/ics/bics/2014/11191112
  source accessed on: 2019-12-03T20:05:01Z
  source last accessed on: 2019-12-03T20:05:01Z
  definition: This industry subgroup includes companies that wholesale and distribute new motor vehicle parts, accessories, tools and equipment.
  notation: 11191112
  valid from: 2014-08-08
  valid till: 2020-10-03
source accessed on: 2019-12-03T20:05:01Z
source last accessed on: 2019-12-03T20:05:01Z
definition: This industry subgroup includes companies that wholesale and distribute new motor vehicle parts, accessories, tools and equipment.
notation: 11191112
valid from: 2014-08-08
valid till: 2020-10-03

Tire Wholesalers
type: BicsLevel4SubIndustry
type: Classifier
type: NamedIndividual
created with: infer-bics.sql
derived from: Tire Wholesalers
  type: BicsLevel4SubIndustry
  type: Classifier
  type: ContemporaryDerivation
  derived from: http://data.ga-group.nl/ics/bics/2014/11191113
  source accessed on: 2019-12-03T20:05:01Z
  source last accessed on: 2019-12-03T20:05:01Z
  definition: This industry subgroup includes companies that wholesale and distribute automotive tire products.
  notation: 11191113
  valid from: 2014-08-08
  valid till: 2020-10-03
source accessed on: 2019-12-03T20:05:01Z
source last accessed on: 2019-12-03T20:05:01Z
definition: This industry subgroup includes companies that wholesale and distribute automotive tire products.
notation: 11191113
valid from: 2014-08-08
valid till: 2020-10-03

Automotive Wholesalers
type: BicsLevel3Industry
type: Classifier
type: NamedIndividual
is industry of: Distributors - Discretionary
is replaced by: Automotive Wholesalers
created with: infer-bics.sql
derived from: Automotive Wholesalers
  type: BicsLevel3Industry
  type: Classifier
  type: ContemporaryDerivation
  derived from: http://data.ga-group.nl/ics/bics/2014/111911
  source accessed on: 2019-12-03T20:05:01Z
  source last accessed on: 2019-12-03T20:05:01Z
  definition: This industry includes companies that wholesale and distribute motor vehicles and parts. Excludes companies that manufacture motor vehicles or their parts.
  notation: 111911
  valid from: 2014-08-08
  valid till: 2020-10-03
source accessed on: 2019-12-03T20:05:01Z
source last accessed on: 2019-12-03T20:05:01Z
definition: This industry includes companies that wholesale and distribute motor vehicles and parts. Excludes companies that manufacture motor vehicles or their parts.
notation: 111911
valid from: 2014-08-08
valid till: 2020-10-03

Computer & Software Whslrs
type: BicsLevel4SubIndustry
type: Classifier
type: NamedIndividual
created with: infer-bics.sql
derived from: Computer & Software Whslrs
  type: BicsLevel4SubIndustry
  type: Classifier
  type: ContemporaryDerivation
  derived from: http://data.ga-group.nl/ics/bics/2014/11191210
  source accessed on: 2019-12-03T20:05:01Z
  source last accessed on: 2019-12-03T20:05:01Z
  definition: This industry subgroup includes companies that wholesale and distribute computer and computer peripheral equipment. Products include computer boards, computer software, motherboards and printers.
  notation: 11191210
  valid from: 2014-08-08
  valid till: 2020-10-03
source accessed on: 2019-12-03T20:05:01Z
source last accessed on: 2019-12-03T20:05:01Z
definition: This industry subgroup includes companies that wholesale and distribute computer and computer peripheral equipment. Products include computer boards, computer software, motherboards and printers.
notation: 11191210
valid from: 2014-08-08
valid till: 2020-10-03

Photo Equip & Supplies Whslrs
type: BicsLevel4SubIndustry
type: Classifier
type: NamedIndividual
created with: infer-bics.sql
derived from: Photo Equip & Supplies Whslrs
  type: BicsLevel4SubIndustry
  type: Classifier
  type: ContemporaryDerivation
  derived from: http://data.ga-group.nl/ics/bics/2014/11191211
  source accessed on: 2019-12-03T20:05:01Z
  source last accessed on: 2019-12-03T20:05:01Z
  definition: This industry subgroup includes companies that wholesale and distribute photographic equipment and supplies. Products include camera equipment, motion picture cameras, projection equipment and theater equipment.
  notation: 11191211
  valid from: 2014-08-08
  valid till: 2020-10-03
source accessed on: 2019-12-03T20:05:01Z
source last accessed on: 2019-12-03T20:05:01Z
definition: This industry subgroup includes companies that wholesale and distribute photographic equipment and supplies. Products include camera equipment, motion picture cameras, projection equipment and theater equipment.
notation: 11191211
valid from: 2014-08-08
valid till: 2020-10-03

Consumer Elec & Applc Whslrs
type: BicsLevel3Industry
type: Classifier
type: NamedIndividual
is industry of: Distributors - Discretionary
is replaced by: Consumer Elec & Applc Whslrs
created with: infer-bics.sql
derived from: Consumer Elec & Applc Whslrs
  type: BicsLevel3Industry
  type: Classifier
  type: ContemporaryDerivation
  derived from: http://data.ga-group.nl/ics/bics/2014/111912
  source accessed on: 2019-12-03T20:05:01Z
  source last accessed on: 2019-12-03T20:05:01Z
  definition: This industry includes companies that wholesale and distribute household consumer electronics and appliances. Includes consumer electronics, household appliances, photography equipment, computers and software.
  notation: 111912
  valid from: 2014-08-08
  valid till: 2020-10-03
source accessed on: 2019-12-03T20:05:01Z
source last accessed on: 2019-12-03T20:05:01Z
definition: This industry includes companies that wholesale and distribute household consumer electronics and appliances. Includes consumer electronics, household appliances, photography equipment, computers and software.
notation: 111912
valid from: 2014-08-08
valid till: 2020-10-03

Furniture Wholesalers
type: BicsLevel4SubIndustry
type: Classifier
type: NamedIndividual
created with: infer-bics.sql
derived from: Furniture Wholesalers
  type: BicsLevel4SubIndustry
  type: Classifier
  type: ContemporaryDerivation
  derived from: http://data.ga-group.nl/ics/bics/2014/11191310
  source accessed on: 2019-12-03T20:05:01Z
  source last accessed on: 2019-12-03T20:05:01Z
  definition: This industry subgroup includes companies that wholesale home or office furniture manufactured by various furniture manufacturing companies. They do not manufacture the furniture themselves.
  notation: 11191310
  valid from: 2014-08-08
  valid till: 2020-10-03
source accessed on: 2019-12-03T20:05:01Z
source last accessed on: 2019-12-03T20:05:01Z
definition: This industry subgroup includes companies that wholesale home or office furniture manufactured by various furniture manufacturing companies. They do not manufacture the furniture themselves.
notation: 11191310
valid from: 2014-08-08
valid till: 2020-10-03

Hardware Wholesalers
type: BicsLevel4SubIndustry
type: Classifier
type: NamedIndividual
created with: infer-bics.sql
derived from: Hardware Wholesalers
  type: BicsLevel4SubIndustry
  type: Classifier
  type: ContemporaryDerivation
  derived from: http://data.ga-group.nl/ics/bics/2014/11191311
  source accessed on: 2019-12-03T20:05:01Z
  source last accessed on: 2019-12-03T20:05:01Z
  definition: This industry subgroup includes companies that wholesale and distribute hand tools, fasteners and hardware. Products include blades, staples, nuts, bolts, screws and hand tools.
  notation: 11191311
  valid from: 2014-08-08
  valid till: 2020-10-03
source accessed on: 2019-12-03T20:05:01Z
source last accessed on: 2019-12-03T20:05:01Z
definition: This industry subgroup includes companies that wholesale and distribute hand tools, fasteners and hardware. Products include blades, staples, nuts, bolts, screws and hand tools.
notation: 11191311
valid from: 2014-08-08
valid till: 2020-10-03

Home Furnishing Wholesalers
type: BicsLevel4SubIndustry
type: Classifier
type: NamedIndividual
created with: infer-bics.sql
derived from: Home Furnishing Wholesalers
  type: BicsLevel4SubIndustry
  type: Classifier
  type: ContemporaryDerivation
  derived from: http://data.ga-group.nl/ics/bics/2014/11191312
  source accessed on: 2019-12-03T20:05:01Z
  source last accessed on: 2019-12-03T20:05:01Z
  definition: This industry subgroup includes companies that wholesale home furnishings used to beautify or add comfort to a home. They do not manufacture anything themselves. Home furnishings may include items like crystal, kitchen utensils, porcelain vases, artwork and floriculture products.
  notation: 11191312
  valid from: 2014-08-08
  valid till: 2020-10-03
source accessed on: 2019-12-03T20:05:01Z
source last accessed on: 2019-12-03T20:05:01Z
definition: This industry subgroup includes companies that wholesale home furnishings used to beautify or add comfort to a home. They do not manufacture anything themselves. Home furnishings may include items like crystal, kitchen utensils, porcelain vases, artwork and floriculture products.
notation: 11191312
valid from: 2014-08-08
valid till: 2020-10-03

Office Equip Wholesalers
type: BicsLevel4SubIndustry
type: Classifier
type: NamedIndividual
created with: infer-bics.sql
derived from: Office Equip Wholesalers
  type: BicsLevel4SubIndustry
  type: Classifier
  type: ContemporaryDerivation
  derived from: http://data.ga-group.nl/ics/bics/2014/11191313
  source accessed on: 2019-12-03T20:05:01Z
  source last accessed on: 2019-12-03T20:05:01Z
  definition: This industry subgroup includes companies that wholesale and distribute office machines and related equipment. Includes accounting machines, cash registers, postage meters, safes and copying machines.
  notation: 11191313
  valid from: 2014-08-08
  valid till: 2020-10-03
source accessed on: 2019-12-03T20:05:01Z
source last accessed on: 2019-12-03T20:05:01Z
definition: This industry subgroup includes companies that wholesale and distribute office machines and related equipment. Includes accounting machines, cash registers, postage meters, safes and copying machines.
notation: 11191313
valid from: 2014-08-08
valid till: 2020-10-03

Paint Wholesalers
type: BicsLevel4SubIndustry
type: Classifier
type: NamedIndividual
created with: infer-bics.sql
derived from: Paint Wholesalers
  type: BicsLevel4SubIndustry
  type: Classifier
  type: ContemporaryDerivation
  derived from: http://data.ga-group.nl/ics/bics/2014/11191314
  source accessed on: 2019-12-03T20:05:01Z
  source last accessed on: 2019-12-03T20:05:01Z
  definition: This industry subgroup includes companies that wholesale and distribute paints, coatings, wallpaper, paintbrushes, rollers and related supplies.
  notation: 11191314
  valid from: 2014-08-08
  valid till: 2020-10-03
source accessed on: 2019-12-03T20:05:01Z
source last accessed on: 2019-12-03T20:05:01Z
definition: This industry subgroup includes companies that wholesale and distribute paints, coatings, wallpaper, paintbrushes, rollers and related supplies.
notation: 11191314
valid from: 2014-08-08
valid till: 2020-10-03

Print & Writing Paper Whslrs
type: BicsLevel4SubIndustry
type: Classifier
type: NamedIndividual
created with: infer-bics.sql
derived from: Print & Writing Paper Whslrs
  type: BicsLevel4SubIndustry
  type: Classifier
  type: ContemporaryDerivation
  derived from: http://data.ga-group.nl/ics/bics/2014/11191315
  source accessed on: 2019-12-03T20:05:01Z
  source last accessed on: 2019-12-03T20:05:01Z
  definition: This industry subgroup includes companies that wholesale and distribute bulk printing and writing paper.
  notation: 11191315
  valid from: 2014-08-08
  valid till: 2020-10-03
source accessed on: 2019-12-03T20:05:01Z
source last accessed on: 2019-12-03T20:05:01Z
definition: This industry subgroup includes companies that wholesale and distribute bulk printing and writing paper.
notation: 11191315
valid from: 2014-08-08
valid till: 2020-10-03

Stationery & Office Supp Whslrs
type: BicsLevel4SubIndustry
type: Classifier
type: NamedIndividual
created with: infer-bics.sql
derived from: Stationery & Office Supp Whslrs
  type: BicsLevel4SubIndustry
  type: Classifier
  type: ContemporaryDerivation
  derived from: http://data.ga-group.nl/ics/bics/2014/11191316
  source accessed on: 2019-12-03T20:05:01Z
  source last accessed on: 2019-12-03T20:05:01Z
  definition: This industry subgroup includes companies that wholesale and distribute stationery, office supplies and gift wrap.
  notation: 11191316
  valid from: 2014-08-08
  valid till: 2020-10-03
source accessed on: 2019-12-03T20:05:01Z
source last accessed on: 2019-12-03T20:05:01Z
definition: This industry subgroup includes companies that wholesale and distribute stationery, office supplies and gift wrap.
notation: 11191316
valid from: 2014-08-08
valid till: 2020-10-03

Home & Office Product Whslrs
type: BicsLevel3Industry
type: Classifier
type: NamedIndividual
is industry of: Distributors - Discretionary
is replaced by: Home & Office Product Whslrs
created with: infer-bics.sql
derived from: Home & Office Product Whslrs
  type: BicsLevel3Industry
  type: Classifier
  type: ContemporaryDerivation
  derived from: http://data.ga-group.nl/ics/bics/2014/111913
  source accessed on: 2019-12-03T20:05:01Z
  source last accessed on: 2019-12-03T20:05:01Z
  definition: This industry includes companies that wholesale home or office furniture, home furnishings, office equipment, paint, wallpaper and personal or office stationery.
  notation: 111913
  valid from: 2014-08-08
  valid till: 2020-10-03
source accessed on: 2019-12-03T20:05:01Z
source last accessed on: 2019-12-03T20:05:01Z
definition: This industry includes companies that wholesale home or office furniture, home furnishings, office equipment, paint, wallpaper and personal or office stationery.
notation: 111913
valid from: 2014-08-08
valid till: 2020-10-03

Book, Periodical & News Whslrs
type: BicsLevel4SubIndustry
type: Classifier
type: NamedIndividual
created with: infer-bics.sql
derived from: Book, Periodical & News Whslrs
  type: BicsLevel4SubIndustry
  type: Classifier
  type: ContemporaryDerivation
  derived from: http://data.ga-group.nl/ics/bics/2014/11191410
  source accessed on: 2019-12-03T20:05:01Z
  source last accessed on: 2019-12-03T20:05:01Z
  definition: This industry subgroup includes companies that wholesale books, audiobooks and periodicals to retail stores.
  notation: 11191410
  valid from: 2014-08-08
  valid till: 2020-10-03
source accessed on: 2019-12-03T20:05:01Z
source last accessed on: 2019-12-03T20:05:01Z
definition: This industry subgroup includes companies that wholesale books, audiobooks and periodicals to retail stores.
notation: 11191410
valid from: 2014-08-08
valid till: 2020-10-03

Fabric & Textile Wholesalers
type: BicsLevel4SubIndustry
type: Classifier
type: NamedIndividual
created with: infer-bics.sql
derived from: Fabric & Textile Wholesalers
  type: BicsLevel4SubIndustry
  type: Classifier
  type: ContemporaryDerivation
  derived from: http://data.ga-group.nl/ics/bics/2014/11191411
  source accessed on: 2019-12-03T20:05:01Z
  source last accessed on: 2019-12-03T20:05:01Z
  definition: This industry subgroup includes companies that wholesale fabrics and textiles, such as yarn, linen and other fabrics to retailers. Excludes companies that manufacture textiles.
  notation: 11191411
  valid from: 2014-08-08
  valid till: 2020-10-03
source accessed on: 2019-12-03T20:05:01Z
source last accessed on: 2019-12-03T20:05:01Z
definition: This industry subgroup includes companies that wholesale fabrics and textiles, such as yarn, linen and other fabrics to retailers. Excludes companies that manufacture textiles.
notation: 11191411
valid from: 2014-08-08
valid till: 2020-10-03

Florist Supply Wholesalers
type: BicsLevel4SubIndustry
type: Classifier
type: NamedIndividual
created with: infer-bics.sql
derived from: Florist Supply Wholesalers
  type: BicsLevel4SubIndustry
  type: Classifier
  type: ContemporaryDerivation
  derived from: http://data.ga-group.nl/ics/bics/2014/11191412
  source accessed on: 2019-12-03T20:05:01Z
  source last accessed on: 2019-12-03T20:05:01Z
  definition: This industry subgroup includes companies that wholesale and distribute flowers, florists supplies and nursery materials.
  notation: 11191412
  valid from: 2014-08-08
  valid till: 2020-10-03
source accessed on: 2019-12-03T20:05:01Z
source last accessed on: 2019-12-03T20:05:01Z
definition: This industry subgroup includes companies that wholesale and distribute flowers, florists supplies and nursery materials.
notation: 11191412
valid from: 2014-08-08
valid till: 2020-10-03

Industrial Paper Wholesalers
type: BicsLevel4SubIndustry
type: Classifier
type: NamedIndividual
created with: infer-bics.sql
derived from: Industrial Paper Wholesalers
  type: BicsLevel4SubIndustry
  type: Classifier
  type: ContemporaryDerivation
  derived from: http://data.ga-group.nl/ics/bics/2014/11191413
  source accessed on: 2019-12-03T20:05:01Z
  source last accessed on: 2019-12-03T20:05:01Z
  definition: This industry subgroup includes companies that wholesale and distribute craft wrapping, paperboard, converted paper and disposable paper products.
  notation: 11191413
  valid from: 2014-08-08
  valid till: 2020-10-03
source accessed on: 2019-12-03T20:05:01Z
source last accessed on: 2019-12-03T20:05:01Z
definition: This industry subgroup includes companies that wholesale and distribute craft wrapping, paperboard, converted paper and disposable paper products.
notation: 11191413
valid from: 2014-08-08
valid till: 2020-10-03

Jewelry Wholesalers
type: BicsLevel4SubIndustry
type: Classifier
type: NamedIndividual
created with: infer-bics.sql
derived from: Jewelry Wholesalers
  type: BicsLevel4SubIndustry
  type: Classifier
  type: ContemporaryDerivation
  derived from: http://data.ga-group.nl/ics/bics/2014/11191414
  source accessed on: 2019-12-03T20:05:01Z
  source last accessed on: 2019-12-03T20:05:01Z
  definition: This industry subgroup includes companies that wholesale and distribute jewelry, watches, precious stones and precious metal goods. Products include clocks, diamonds, pearls and silverware.
  notation: 11191414
  valid from: 2014-08-08
  valid till: 2020-10-03
source accessed on: 2019-12-03T20:05:01Z
source last accessed on: 2019-12-03T20:05:01Z
definition: This industry subgroup includes companies that wholesale and distribute jewelry, watches, precious stones and precious metal goods. Products include clocks, diamonds, pearls and silverware.
notation: 11191414
valid from: 2014-08-08
valid till: 2020-10-03

Ophthalmic Goods Wholesalers
type: BicsLevel4SubIndustry
type: Classifier
type: NamedIndividual
created with: infer-bics.sql
derived from: Ophthalmic Goods Wholesalers
  type: BicsLevel4SubIndustry
  type: Classifier
  type: ContemporaryDerivation
  derived from: http://data.ga-group.nl/ics/bics/2014/11191415
  source accessed on: 2019-12-03T20:05:01Z
  source last accessed on: 2019-12-03T20:05:01Z
  definition: This industry subgroup includes companies that wholesale and distribute professional equipment, instruments, and/or goods sold, prescribed or used by ophthalmologists, optometrists and opticians.
  notation: 11191415
  valid from: 2014-08-08
  valid till: 2020-10-03
source accessed on: 2019-12-03T20:05:01Z
source last accessed on: 2019-12-03T20:05:01Z
definition: This industry subgroup includes companies that wholesale and distribute professional equipment, instruments, and/or goods sold, prescribed or used by ophthalmologists, optometrists and opticians.
notation: 11191415
valid from: 2014-08-08
valid till: 2020-10-03

Sporting Goods Wholesalers
type: BicsLevel4SubIndustry
type: Classifier
type: NamedIndividual
created with: infer-bics.sql
derived from: Sporting Goods Wholesalers
  type: BicsLevel4SubIndustry
  type: Classifier
  type: ContemporaryDerivation
  derived from: http://data.ga-group.nl/ics/bics/2014/11191416
  source accessed on: 2019-12-03T20:05:01Z
  source last accessed on: 2019-12-03T20:05:01Z
  definition: This industry subgroup includes companies that wholesale and distribute sporting goods and related products. Products include athletic uniforms and apparel, athletic equipment and athletic supplies.
  notation: 11191416
  valid from: 2014-08-08
  valid till: 2020-10-03
source accessed on: 2019-12-03T20:05:01Z
source last accessed on: 2019-12-03T20:05:01Z
definition: This industry subgroup includes companies that wholesale and distribute sporting goods and related products. Products include athletic uniforms and apparel, athletic equipment and athletic supplies.
notation: 11191416
valid from: 2014-08-08
valid till: 2020-10-03

Toys & Games Whslrs
type: BicsLevel4SubIndustry
type: Classifier
type: NamedIndividual
created with: infer-bics.sql
derived from: Toys & Games Whslrs
  type: BicsLevel4SubIndustry
  type: Classifier
  type: ContemporaryDerivation
  derived from: http://data.ga-group.nl/ics/bics/2014/11191417
  source accessed on: 2019-12-03T20:05:01Z
  source last accessed on: 2019-12-03T20:05:01Z
  definition: This industry subgroup includes companies that wholesale and distribute games, toys and hobby-related products. Products include children's vehicles, electronic games, playing cards and toys.
  notation: 11191417
  valid from: 2014-08-08
  valid till: 2020-10-03
source accessed on: 2019-12-03T20:05:01Z
source last accessed on: 2019-12-03T20:05:01Z
definition: This industry subgroup includes companies that wholesale and distribute games, toys and hobby-related products. Products include children's vehicles, electronic games, playing cards and toys.
notation: 11191417
valid from: 2014-08-08
valid till: 2020-10-03

Other Durable Goods Whslrs
type: BicsLevel4SubIndustry
type: Classifier
type: NamedIndividual
created with: infer-bics.sql
derived from: Other Durable Goods Whslrs
  type: BicsLevel4SubIndustry
  type: Classifier
  type: ContemporaryDerivation
  derived from: http://data.ga-group.nl/ics/bics/2014/11191418
  source accessed on: 2019-12-03T20:05:01Z
  source last accessed on: 2019-12-03T20:05:01Z
  definition: This industry subgroup includes companies that wholesale and distribute miscellaneous durable goods. Products include CDs, DVDs, guns, musical instruments and timber products.
  notation: 11191418
  valid from: 2014-08-08
  valid till: 2020-10-03
source accessed on: 2019-12-03T20:05:01Z
source last accessed on: 2019-12-03T20:05:01Z
definition: This industry subgroup includes companies that wholesale and distribute miscellaneous durable goods. Products include CDs, DVDs, guns, musical instruments and timber products.
notation: 11191418
valid from: 2014-08-08
valid till: 2020-10-03

Other Non-Durable Goods Whslrs
type: BicsLevel4SubIndustry
type: Classifier
type: NamedIndividual
created with: infer-bics.sql
derived from: Other Non-Durable Goods Whslrs
  type: BicsLevel4SubIndustry
  type: Classifier
  type: ContemporaryDerivation
  derived from: http://data.ga-group.nl/ics/bics/2014/11191419
  source accessed on: 2019-12-03T20:05:01Z
  source last accessed on: 2019-12-03T20:05:01Z
  definition: This industry subgroup includes companies that wholesale and distribute nondurable goods.
  notation: 11191419
  valid from: 2014-08-08
  valid till: 2020-10-03
source accessed on: 2019-12-03T20:05:01Z
source last accessed on: 2019-12-03T20:05:01Z
definition: This industry subgroup includes companies that wholesale and distribute nondurable goods.
notation: 11191419
valid from: 2014-08-08
valid till: 2020-10-03

Other Wholesalers
type: BicsLevel3Industry
type: Classifier
type: NamedIndividual
is industry of: Distributors - Discretionary
is replaced by: Other Wholesalers
created with: infer-bics.sql
derived from: Other Wholesalers
  type: BicsLevel3Industry
  type: Classifier
  type: ContemporaryDerivation
  derived from: http://data.ga-group.nl/ics/bics/2014/111914
  source accessed on: 2019-12-03T20:05:01Z
  source last accessed on: 2019-12-03T20:05:01Z
  definition: This industry includes companies that wholesale and distribute products not elsewhere classified. Excludes manufacturers that wholesale their own products.
  notation: 111914
  valid from: 2014-08-08
  valid till: 2020-10-03
source accessed on: 2019-12-03T20:05:01Z
source last accessed on: 2019-12-03T20:05:01Z
definition: This industry includes companies that wholesale and distribute products not elsewhere classified. Excludes manufacturers that wholesale their own products.
notation: 111914
valid from: 2014-08-08
valid till: 2020-10-03

Import & Export
type: BicsLevel3Industry
type: Classifier
type: NamedIndividual
is industry of: Distributors - Discretionary
is replaced by: Import & Export
created with: infer-bics.sql
derived from: Import & Export
  type: BicsLevel3Industry
  type: Classifier
  type: ContemporaryDerivation
  derived from: http://data.ga-group.nl/ics/bics/2014/111915
  source accessed on: 2019-12-03T20:05:01Z
  source last accessed on: 2019-12-03T20:05:01Z
  definition: This industry includes companies that wholesale trade merchandise overseas using their own money or on behalf of someone else for a fee.
  notation: 111915
  valid from: 2014-08-08
  valid till: 2020-10-03
source accessed on: 2019-12-03T20:05:01Z
source last accessed on: 2019-12-03T20:05:01Z
definition: This industry includes companies that wholesale trade merchandise overseas using their own money or on behalf of someone else for a fee.
notation: 111915
valid from: 2014-08-08
valid till: 2020-10-03

Distributors - Discretionary
type: BicsLevel2IndustryGroup
type: Classifier
type: NamedIndividual
is industry group of: Consumer Discretionary
is replaced by: Wholesale - Discretionary
created with: infer-bics.sql
derived from: Distributors - Discretionary
  type: BicsLevel2IndustryGroup
  type: Classifier
  type: ContemporaryDerivation
  derived from: http://data.ga-group.nl/ics/bics/2014/1119
  source accessed on: 2019-12-03T20:05:01Z
  source last accessed on: 2019-12-03T20:05:01Z
  definition: This industry group includes companies that wholesale and distribute auto and general merchandise products.
  notation: 1119
  valid from: 2014-08-08
  valid till: 2020-10-03
source accessed on: 2019-12-03T20:05:01Z
source last accessed on: 2019-12-03T20:05:01Z
definition: This industry group includes companies that wholesale and distribute auto and general merchandise products.
notation: 1119
valid from: 2014-08-08
valid till: 2020-10-03

Auto Parts & Accessories Stores
type: BicsLevel4SubIndustry
type: Classifier
type: NamedIndividual
created with: infer-bics.sql
derived from: Auto Parts & Accessories Stores
  type: BicsLevel4SubIndustry
  type: Classifier
  type: ContemporaryDerivation
  derived from: http://data.ga-group.nl/ics/bics/2014/11201010
  source accessed on: 2019-12-03T20:05:01Z
  source last accessed on: 2019-12-03T20:05:01Z
  definition: This industry subgroup includes companies that retail automotive parts and accessories.
  notation: 11201010
  valid from: 2014-08-08
  valid till: 2020-10-03
source accessed on: 2019-12-03T20:05:01Z
source last accessed on: 2019-12-03T20:05:01Z
definition: This industry subgroup includes companies that retail automotive parts and accessories.
notation: 11201010
valid from: 2014-08-08
valid till: 2020-10-03

Auto Repair Centers
type: BicsLevel4SubIndustry
type: Classifier
type: NamedIndividual
created with: infer-bics.sql
derived from: Auto Repair Centers
  type: BicsLevel4SubIndustry
  type: Classifier
  type: ContemporaryDerivation
  derived from: http://data.ga-group.nl/ics/bics/2014/11201011
  source accessed on: 2019-12-03T20:05:01Z
  source last accessed on: 2019-12-03T20:05:01Z
  definition: This industry subgroup includes companies that provide automotive repair and maintenance services.
  notation: 11201011
  valid from: 2014-08-08
  valid till: 2020-10-03
source accessed on: 2019-12-03T20:05:01Z
source last accessed on: 2019-12-03T20:05:01Z
definition: This industry subgroup includes companies that provide automotive repair and maintenance services.
notation: 11201011
valid from: 2014-08-08
valid till: 2020-10-03

Car Dealers
type: BicsLevel4SubIndustry
type: Classifier
type: NamedIndividual
created with: infer-bics.sql
derived from: Car Dealers
  type: BicsLevel4SubIndustry
  type: Classifier
  type: ContemporaryDerivation
  derived from: http://data.ga-group.nl/ics/bics/2014/11201012
  source accessed on: 2019-12-03T20:05:01Z
  source last accessed on: 2019-12-03T20:05:01Z
  definition: This industry subgroup includes companies that sell both new and used vehicles including passenger cars, light trucks and utility vehicles.
  notation: 11201012
  valid from: 2014-08-08
  valid till: 2020-10-03
source accessed on: 2019-12-03T20:05:01Z
source last accessed on: 2019-12-03T20:05:01Z
definition: This industry subgroup includes companies that sell both new and used vehicles including passenger cars, light trucks and utility vehicles.
notation: 11201012
valid from: 2014-08-08
valid till: 2020-10-03

Passenger Vehicle Leasing
type: BicsLevel5Segment
type: Classifier
type: NamedIndividual
is level5 segment of: Passenger Car Rental & Leasing
is replaced by: Passenger Vehicle Leasing
created with: infer-bics.sql
derived from: Passenger Vehicle Leasing
  type: BicsLevel5Segment
  type: Classifier
  type: ContemporaryDerivation
  derived from: http://data.ga-group.nl/ics/bics/2014/1120101310
  source accessed on: 2019-12-03T20:05:01Z
  source last accessed on: 2019-12-03T20:05:01Z
  definition: This segment includes companies that lease passenger cars without drivers.
  notation: 1120101310
  valid from: 2014-08-08
  valid till: 2020-10-03
source accessed on: 2019-12-03T20:05:01Z
source last accessed on: 2019-12-03T20:05:01Z
definition: This segment includes companies that lease passenger cars without drivers.
notation: 1120101310
valid from: 2014-08-08
valid till: 2020-10-03

Passenger Vehicle Rental
type: BicsLevel5Segment
type: Classifier
type: NamedIndividual
is level5 segment of: Passenger Car Rental & Leasing
is replaced by: Passenger Vehicle Rental
created with: infer-bics.sql
derived from: Passenger Vehicle Rental
  type: BicsLevel5Segment
  type: Classifier
  type: ContemporaryDerivation
  derived from: http://data.ga-group.nl/ics/bics/2014/1120101311
  source accessed on: 2019-12-03T20:05:01Z
  source last accessed on: 2019-12-03T20:05:01Z
  definition: This segment includes companies that rent passenger cars without drivers.
  notation: 1120101311
  valid from: 2014-08-08
  valid till: 2020-10-03
source accessed on: 2019-12-03T20:05:01Z
source last accessed on: 2019-12-03T20:05:01Z
definition: This segment includes companies that rent passenger cars without drivers.
notation: 1120101311
valid from: 2014-08-08
valid till: 2020-10-03

Passenger Car Rental & Leasing
type: BicsLevel4SubIndustry
type: Classifier
type: NamedIndividual
created with: infer-bics.sql
derived from: Passenger Car Rental & Leasing
  type: BicsLevel4SubIndustry
  type: Classifier
  type: ContemporaryDerivation
  derived from: http://data.ga-group.nl/ics/bics/2014/11201013
  source accessed on: 2019-12-03T20:05:01Z
  source last accessed on: 2019-12-03T20:05:01Z
  definition: This industry subgroup includes companies that rent and lease passenger cars.
  notation: 11201013
  valid from: 2014-08-08
  valid till: 2020-10-03
source accessed on: 2019-12-03T20:05:01Z
source last accessed on: 2019-12-03T20:05:01Z
definition: This industry subgroup includes companies that rent and lease passenger cars.
notation: 11201013
valid from: 2014-08-08
valid till: 2020-10-03

Other Motor Vehicle Dealers
type: BicsLevel4SubIndustry
type: Classifier
type: NamedIndividual
created with: infer-bics.sql
derived from: Other Motor Vehicle Dealers
  type: BicsLevel4SubIndustry
  type: Classifier
  type: ContemporaryDerivation
  derived from: http://data.ga-group.nl/ics/bics/2014/11201014
  source accessed on: 2019-12-03T20:05:01Z
  source last accessed on: 2019-12-03T20:05:01Z
  definition: This industry subgroup includes companies that sell other new and used vehicles not elsewhere classified. Products may include motorcycles, ATVs and other power equipment.
  notation: 11201014
  valid from: 2014-08-08
  valid till: 2020-10-03
source accessed on: 2019-12-03T20:05:01Z
source last accessed on: 2019-12-03T20:05:01Z
definition: This industry subgroup includes companies that sell other new and used vehicles not elsewhere classified. Products may include motorcycles, ATVs and other power equipment.
notation: 11201014
valid from: 2014-08-08
valid till: 2020-10-03

Automotive Retailers
type: BicsLevel3Industry
type: Classifier
type: NamedIndividual
is industry of: Retail - Discretionary
is replaced by: Automotive Retailers
created with: infer-bics.sql
derived from: Automotive Retailers
  type: BicsLevel3Industry
  type: Classifier
  type: ContemporaryDerivation
  derived from: http://data.ga-group.nl/ics/bics/2014/112010
  source accessed on: 2019-12-03T20:05:01Z
  source last accessed on: 2019-12-03T20:05:01Z
  definition: This industry includes companies that retail automotive parts and products. Such companies may also provide repair and maintenance services.
  notation: 112010
  valid from: 2014-08-08
  valid till: 2020-10-03
source accessed on: 2019-12-03T20:05:01Z
source last accessed on: 2019-12-03T20:05:01Z
definition: This industry includes companies that retail automotive parts and products. Such companies may also provide repair and maintenance services.
notation: 112010
valid from: 2014-08-08
valid till: 2020-10-03

Mail Catalog Retailers
type: BicsLevel4SubIndustry
type: Classifier
type: NamedIndividual
created with: infer-bics.sql
derived from: Mail Catalog Retailers
  type: BicsLevel4SubIndustry
  type: Classifier
  type: ContemporaryDerivation
  derived from: http://data.ga-group.nl/ics/bics/2014/11201110
  source accessed on: 2019-12-03T20:05:01Z
  source last accessed on: 2019-12-03T20:05:01Z
  definition: This industry subgroup includes companies that retail all types of merchandise using mail catalogs to generate clients and display merchandise as well as companies that retail from catalog showrooms of mail-order houses.
  notation: 11201110
  valid from: 2014-08-08
  valid till: 2020-10-03
source accessed on: 2019-12-03T20:05:01Z
source last accessed on: 2019-12-03T20:05:01Z
definition: This industry subgroup includes companies that retail all types of merchandise using mail catalogs to generate clients and display merchandise as well as companies that retail from catalog showrooms of mail-order houses.
notation: 11201110
valid from: 2014-08-08
valid till: 2020-10-03

Multi-Level Marketing
type: BicsLevel4SubIndustry
type: Classifier
type: NamedIndividual
created with: infer-bics.sql
derived from: Multi-Level Marketing
  type: BicsLevel4SubIndustry
  type: Classifier
  type: ContemporaryDerivation
  derived from: http://data.ga-group.nl/ics/bics/2014/11201111
  source accessed on: 2019-12-03T20:05:01Z
  source last accessed on: 2019-12-03T20:05:01Z
  definition: This industry subgroup includes companies that sell consumer products through a direct sales force.
  notation: 11201111
  valid from: 2014-08-08
  valid till: 2020-10-03
source accessed on: 2019-12-03T20:05:01Z
source last accessed on: 2019-12-03T20:05:01Z
definition: This industry subgroup includes companies that sell consumer products through a direct sales force.
notation: 11201111
valid from: 2014-08-08
valid till: 2020-10-03

TV Based Retailers
type: BicsLevel4SubIndustry
type: Classifier
type: NamedIndividual
created with: infer-bics.sql
derived from: TV Based Retailers
  type: BicsLevel4SubIndustry
  type: Classifier
  type: ContemporaryDerivation
  derived from: http://data.ga-group.nl/ics/bics/2014/11201112
  source accessed on: 2019-12-03T20:05:01Z
  source last accessed on: 2019-12-03T20:05:01Z
  definition: This industry subgroup includes companies that retail all types of merchandise using television to generate clients and display merchandise.
  notation: 11201112
  valid from: 2014-08-08
  valid till: 2020-10-03
source accessed on: 2019-12-03T20:05:01Z
source last accessed on: 2019-12-03T20:05:01Z
definition: This industry subgroup includes companies that retail all types of merchandise using television to generate clients and display merchandise.
notation: 11201112
valid from: 2014-08-08
valid till: 2020-10-03

Catalog & TV Based Retailers
type: BicsLevel3Industry
type: Classifier
type: NamedIndividual
is industry of: Retail - Discretionary
is replaced by: Catalog & TV Based Retailers
created with: infer-bics.sql
derived from: Catalog & TV Based Retailers
  type: BicsLevel3Industry
  type: Classifier
  type: ContemporaryDerivation
  derived from: http://data.ga-group.nl/ics/bics/2014/112011
  source accessed on: 2019-12-03T20:05:01Z
  source last accessed on: 2019-12-03T20:05:01Z
  definition: This industry includes companies that retail all types of merchandise using mail catalogs or television to generate clients and display merchandise. Included in this industry are companies that retail from catalog showrooms of mail-order houses as well as companies providing a combination of Internet and mail-order sales.
  notation: 112011
  valid from: 2014-08-08
  valid till: 2020-10-03
source accessed on: 2019-12-03T20:05:01Z
source last accessed on: 2019-12-03T20:05:01Z
definition: This industry includes companies that retail all types of merchandise using mail catalogs or television to generate clients and display merchandise. Included in this industry are companies that retail from catalog showrooms of mail-order houses as well as companies providing a combination of Internet and mail-order sales.
notation: 112011
valid from: 2014-08-08
valid till: 2020-10-03

Computer & Software Stores
type: BicsLevel4SubIndustry
type: Classifier
type: NamedIndividual
created with: infer-bics.sql
derived from: Computer & Software Stores
  type: BicsLevel4SubIndustry
  type: Classifier
  type: ContemporaryDerivation
  derived from: http://data.ga-group.nl/ics/bics/2014/11201210
  source accessed on: 2019-12-03T20:05:01Z
  source last accessed on: 2019-12-03T20:05:01Z
  definition: This industry subgroup includes companies that retail computers and computer software. This can include Internet sales of brick-and-mortar stores.
  notation: 11201210
  valid from: 2014-08-08
  valid till: 2020-10-03
source accessed on: 2019-12-03T20:05:01Z
source last accessed on: 2019-12-03T20:05:01Z
definition: This industry subgroup includes companies that retail computers and computer software. This can include Internet sales of brick-and-mortar stores.
notation: 11201210
valid from: 2014-08-08
valid till: 2020-10-03

Consumer Electronics Stores
type: BicsLevel4SubIndustry
type: Classifier
type: NamedIndividual
created with: infer-bics.sql
derived from: Consumer Electronics Stores
  type: BicsLevel4SubIndustry
  type: Classifier
  type: ContemporaryDerivation
  derived from: http://data.ga-group.nl/ics/bics/2014/11201211
  source accessed on: 2019-12-03T20:05:01Z
  source last accessed on: 2019-12-03T20:05:01Z
  definition: This industry subgroup includes companies that retail consumer electronic products. This can include Internet sales of brick-and-mortar stores.
  notation: 11201211
  valid from: 2014-08-08
  valid till: 2020-10-03
source accessed on: 2019-12-03T20:05:01Z
source last accessed on: 2019-12-03T20:05:01Z
definition: This industry subgroup includes companies that retail consumer electronic products. This can include Internet sales of brick-and-mortar stores.
notation: 11201211
valid from: 2014-08-08
valid till: 2020-10-03

Household Appliance Stores
type: BicsLevel4SubIndustry
type: Classifier
type: NamedIndividual
created with: infer-bics.sql
derived from: Household Appliance Stores
  type: BicsLevel4SubIndustry
  type: Classifier
  type: ContemporaryDerivation
  derived from: http://data.ga-group.nl/ics/bics/2014/11201212
  source accessed on: 2019-12-03T20:05:01Z
  source last accessed on: 2019-12-03T20:05:01Z
  definition: This industry subgroup includes companies that retail household appliances. This can include Internet sales of brick-and-mortar stores.
  notation: 11201212
  valid from: 2014-08-08
  valid till: 2020-10-03
source accessed on: 2019-12-03T20:05:01Z
source last accessed on: 2019-12-03T20:05:01Z
definition: This industry subgroup includes companies that retail household appliances. This can include Internet sales of brick-and-mortar stores.
notation: 11201212
valid from: 2014-08-08
valid till: 2020-10-03

Consumer Elec & Applc Stores
type: BicsLevel3Industry
type: Classifier
type: NamedIndividual
is industry of: Retail - Discretionary
is replaced by: Electronics & Appliances Stores
created with: infer-bics.sql
derived from: Consumer Elec & Applc Stores
  type: BicsLevel3Industry
  type: Classifier
  type: ContemporaryDerivation
  derived from: http://data.ga-group.nl/ics/bics/2014/112012
  source accessed on: 2019-12-03T20:05:01Z
  source last accessed on: 2019-12-03T20:05:01Z
  definition: This industry includes stores that retail computers and peripherals, video game consoles, off-the-shelf software, video games, household appliances, mobile devices and tablets.
  notation: 112012
  valid from: 2014-08-08
  valid till: 2020-10-03
source accessed on: 2019-12-03T20:05:01Z
source last accessed on: 2019-12-03T20:05:01Z
definition: This industry includes stores that retail computers and peripherals, video game consoles, off-the-shelf software, video games, household appliances, mobile devices and tablets.
notation: 112012
valid from: 2014-08-08
valid till: 2020-10-03

High-End Department Stores
type: BicsLevel4SubIndustry
type: Classifier
type: NamedIndividual
created with: infer-bics.sql
derived from: High-End Department Stores
  type: BicsLevel4SubIndustry
  type: Classifier
  type: ContemporaryDerivation
  derived from: http://data.ga-group.nl/ics/bics/2014/11201310
  source accessed on: 2019-12-03T20:05:01Z
  source last accessed on: 2019-12-03T20:05:01Z
  definition: This industry subgroup includes department stores that have separate departments for various merchandise lines, such as apparel, jewelry, home furnishings and linens, each with separate cash registers and sales associates. These are generally companies that target high-income families. This can include Internet sales of brick-and-mortar stores.
  notation: 11201310
  valid from: 2014-08-08
  valid till: 2020-10-03
source accessed on: 2019-12-03T20:05:01Z
source last accessed on: 2019-12-03T20:05:01Z
definition: This industry subgroup includes department stores that have separate departments for various merchandise lines, such as apparel, jewelry, home furnishings and linens, each with separate cash registers and sales associates. These are generally companies that target high-income families. This can include Internet sales of brick-and-mortar stores.
notation: 11201310
valid from: 2014-08-08
valid till: 2020-10-03

Mid-Tier Department Stores
type: BicsLevel4SubIndustry
type: Classifier
type: NamedIndividual
created with: infer-bics.sql
derived from: Mid-Tier Department Stores
  type: BicsLevel4SubIndustry
  type: Classifier
  type: ContemporaryDerivation
  derived from: http://data.ga-group.nl/ics/bics/2014/11201311
  source accessed on: 2019-12-03T20:05:01Z
  source last accessed on: 2019-12-03T20:05:01Z
  definition: This industry subgroup includes department stores that have separate departments for various merchandise lines, such as apparel, jewelry, home furnishings and linens, each with separate cash registers and sales associates. These are generally on-mall companies that target mid-income and low-income families. This can include Internet sales of brick-and-mortar stores.
  notation: 11201311
  valid from: 2014-08-08
  valid till: 2020-10-03
source accessed on: 2019-12-03T20:05:01Z
source last accessed on: 2019-12-03T20:05:01Z
definition: This industry subgroup includes department stores that have separate departments for various merchandise lines, such as apparel, jewelry, home furnishings and linens, each with separate cash registers and sales associates. These are generally on-mall companies that target mid-income and low-income families. This can include Internet sales of brick-and-mortar stores.
notation: 11201311
valid from: 2014-08-08
valid till: 2020-10-03

Department Stores
type: BicsLevel3Industry
type: Classifier
type: NamedIndividual
is industry of: Retail - Discretionary
is replaced by: Department Stores
created with: infer-bics.sql
derived from: Department Stores
  type: BicsLevel3Industry
  type: Classifier
  type: ContemporaryDerivation
  derived from: http://data.ga-group.nl/ics/bics/2014/112013
  source accessed on: 2019-12-03T20:05:01Z
  source last accessed on: 2019-12-03T20:05:01Z
  definition: This industry includes establishments known as department stores that have separate departments for various merchandise lines, such as apparel, jewelry, home furnishings and linens, each with separate cash registers and sales associates.
  notation: 112013
  valid from: 2014-08-08
  valid till: 2020-10-03
source accessed on: 2019-12-03T20:05:01Z
source last accessed on: 2019-12-03T20:05:01Z
definition: This industry includes establishments known as department stores that have separate departments for various merchandise lines, such as apparel, jewelry, home furnishings and linens, each with separate cash registers and sales associates.
notation: 112013
valid from: 2014-08-08
valid till: 2020-10-03

Auto Parts & Supply - Online
type: BicsLevel4SubIndustry
type: Classifier
type: NamedIndividual
created with: infer-bics.sql
derived from: Auto Parts & Supply - Online
  type: BicsLevel4SubIndustry
  type: Classifier
  type: ContemporaryDerivation
  derived from: http://data.ga-group.nl/ics/bics/2014/11201410
  source accessed on: 2019-12-03T20:05:01Z
  source last accessed on: 2019-12-03T20:05:01Z
  definition: This industry subgroup includes companies that retail auto parts and accessories on the Internet.
  notation: 11201410
  valid from: 2014-08-08
  valid till: 2020-10-03
source accessed on: 2019-12-03T20:05:01Z
source last accessed on: 2019-12-03T20:05:01Z
definition: This industry subgroup includes companies that retail auto parts and accessories on the Internet.
notation: 11201410
valid from: 2014-08-08
valid till: 2020-10-03

Computer & Software - Online
type: BicsLevel5Segment
type: Classifier
type: NamedIndividual
is level5 segment of: Consumer Electronics - Online
created with: infer-bics.sql
derived from: Computer & Software - Online
  type: BicsLevel5Segment
  type: Classifier
  type: ContemporaryDerivation
  derived from: http://data.ga-group.nl/ics/bics/2014/1120141110
  source accessed on: 2019-12-03T20:05:01Z
  source last accessed on: 2019-12-03T20:05:01Z
  definition: This segment includes companies that retail consumer electronic products in brick-and-mortar stores.
  notation: 1120141110
  valid from: 2014-08-08
  valid till: 2020-10-03
source accessed on: 2019-12-03T20:05:01Z
source last accessed on: 2019-12-03T20:05:01Z
definition: This segment includes companies that retail consumer electronic products in brick-and-mortar stores.
notation: 1120141110
valid from: 2014-08-08
valid till: 2020-10-03

Consumer Electronics - Online
type: BicsLevel4SubIndustry
type: Classifier
type: NamedIndividual
created with: infer-bics.sql
derived from: Consumer Electronics - Online
  type: BicsLevel4SubIndustry
  type: Classifier
  type: ContemporaryDerivation
  derived from: http://data.ga-group.nl/ics/bics/2014/11201411
  source accessed on: 2019-12-03T20:05:01Z
  source last accessed on: 2019-12-03T20:05:01Z
  definition: This industry subgroup includes companies that retail consumer electronics products on the Internet.
  notation: 11201411
  valid from: 2014-08-08
  valid till: 2020-10-03
source accessed on: 2019-12-03T20:05:01Z
source last accessed on: 2019-12-03T20:05:01Z
definition: This industry subgroup includes companies that retail consumer electronics products on the Internet.
notation: 11201411
valid from: 2014-08-08
valid till: 2020-10-03

Electronic Auctions
type: BicsLevel4SubIndustry
type: Classifier
type: NamedIndividual
created with: infer-bics.sql
derived from: Electronic Auctions
  type: BicsLevel4SubIndustry
  type: Classifier
  type: ContemporaryDerivation
  derived from: http://data.ga-group.nl/ics/bics/2014/11201412
  source accessed on: 2019-12-03T20:05:01Z
  source last accessed on: 2019-12-03T20:05:01Z
  definition: This industry subgroup includes pure-play Internet companies that provide sites for, and facilitate, consumer-to-consumer or business-to-consumer trade in new and used goods, on an auction basis, using the Internet. Companies in this industry provide the electronic location for retail auctions but do not take title to the goods being sold.
  notation: 11201412
  valid from: 2014-08-08
  valid till: 2020-10-03
source accessed on: 2019-12-03T20:05:01Z
source last accessed on: 2019-12-03T20:05:01Z
definition: This industry subgroup includes pure-play Internet companies that provide sites for, and facilitate, consumer-to-consumer or business-to-consumer trade in new and used goods, on an auction basis, using the Internet. Companies in this industry provide the electronic location for retail auctions but do not take title to the goods being sold.
notation: 11201412
valid from: 2014-08-08
valid till: 2020-10-03

Electronic Shopping
type: BicsLevel4SubIndustry
type: Classifier
type: NamedIndividual
created with: infer-bics.sql
derived from: Electronic Shopping
  type: BicsLevel4SubIndustry
  type: Classifier
  type: ContemporaryDerivation
  derived from: http://data.ga-group.nl/ics/bics/2014/11201413
  source accessed on: 2019-12-03T20:05:01Z
  source last accessed on: 2019-12-03T20:05:01Z
  definition: This industry subgroup includes companies that retail all types of merchandise primarily online.
  notation: 11201413
  valid from: 2014-08-08
  valid till: 2020-10-03
source accessed on: 2019-12-03T20:05:01Z
source last accessed on: 2019-12-03T20:05:01Z
definition: This industry subgroup includes companies that retail all types of merchandise primarily online.
notation: 11201413
valid from: 2014-08-08
valid till: 2020-10-03

Furniture - Online
type: BicsLevel5Segment
type: Classifier
type: NamedIndividual
is level5 segment of: Home & Office Products - Online
created with: infer-bics.sql
derived from: Furniture - Online
  type: BicsLevel5Segment
  type: Classifier
  type: ContemporaryDerivation
  derived from: http://data.ga-group.nl/ics/bics/2014/1120141410
  source accessed on: 2019-12-03T20:05:01Z
  source last accessed on: 2019-12-03T20:05:01Z
  definition: This segment includes pure-play Internet companies that retail on the Internet new furniture, such as household furniture (e.g., baby furniture, box springs and mattresses) and outdoor furniture; office furniture (except those sold in combination with office supplies and equipment); and/or furniture sold in combination with major appliances, home electronics, home furnishings or floor coverings.
  notation: 1120141410
  valid from: 2014-08-08
  valid till: 2020-10-03
source accessed on: 2019-12-03T20:05:01Z
source last accessed on: 2019-12-03T20:05:01Z
definition: This segment includes pure-play Internet companies that retail on the Internet new furniture, such as household furniture (e.g., baby furniture, box springs and mattresses) and outdoor furniture; office furniture (except those sold in combination with office supplies and equipment); and/or furniture sold in combination with major appliances, home electronics, home furnishings or floor coverings.
notation: 1120141410
valid from: 2014-08-08
valid till: 2020-10-03

Home Furnishings - Online
type: BicsLevel5Segment
type: Classifier
type: NamedIndividual
is level5 segment of: Home & Office Products - Online
created with: infer-bics.sql
derived from: Home Furnishings - Online
  type: BicsLevel5Segment
  type: Classifier
  type: ContemporaryDerivation
  derived from: http://data.ga-group.nl/ics/bics/2014/1120141411
  source accessed on: 2019-12-03T20:05:01Z
  source last accessed on: 2019-12-03T20:05:01Z
  definition: This segment includes pure-play Internet companies that retail home furnishings on the Internet.
  notation: 1120141411
  valid from: 2014-08-08
  valid till: 2020-10-03
source accessed on: 2019-12-03T20:05:01Z
source last accessed on: 2019-12-03T20:05:01Z
definition: This segment includes pure-play Internet companies that retail home furnishings on the Internet.
notation: 1120141411
valid from: 2014-08-08
valid till: 2020-10-03

Home Improvement - Online
type: BicsLevel5Segment
type: Classifier
type: NamedIndividual
is level5 segment of: Home & Office Products - Online
created with: infer-bics.sql
derived from: Home Improvement - Online
  type: BicsLevel5Segment
  type: Classifier
  type: ContemporaryDerivation
  derived from: http://data.ga-group.nl/ics/bics/2014/1120141412
  source accessed on: 2019-12-03T20:05:01Z
  source last accessed on: 2019-12-03T20:05:01Z
  definition: This segment includes pure-play Internet companies that retail new hardware items, such as tools and builders' hardware, on the Internet.
  notation: 1120141412
  valid from: 2014-08-08
  valid till: 2020-10-03
source accessed on: 2019-12-03T20:05:01Z
source last accessed on: 2019-12-03T20:05:01Z
definition: This segment includes pure-play Internet companies that retail new hardware items, such as tools and builders' hardware, on the Internet.
notation: 1120141412
valid from: 2014-08-08
valid till: 2020-10-03

Office Supp & Stationery - Online
type: BicsLevel5Segment
type: Classifier
type: NamedIndividual
is level5 segment of: Home & Office Products - Online
created with: infer-bics.sql
derived from: Office Supp & Stationery - Online
  type: BicsLevel5Segment
  type: Classifier
  type: ContemporaryDerivation
  derived from: http://data.ga-group.nl/ics/bics/2014/1120141413
  source accessed on: 2019-12-03T20:05:01Z
  source last accessed on: 2019-12-03T20:05:01Z
  definition: This segment includes companies that retail stationery and office supplies on the Internet.
  notation: 1120141413
  valid from: 2014-08-08
  valid till: 2020-10-03
source accessed on: 2019-12-03T20:05:01Z
source last accessed on: 2019-12-03T20:05:01Z
definition: This segment includes companies that retail stationery and office supplies on the Internet.
notation: 1120141413
valid from: 2014-08-08
valid till: 2020-10-03

Home & Office Products - Online
type: BicsLevel4SubIndustry
type: Classifier
type: NamedIndividual
created with: infer-bics.sql
derived from: Home & Office Products - Online
  type: BicsLevel4SubIndustry
  type: Classifier
  type: ContemporaryDerivation
  derived from: http://data.ga-group.nl/ics/bics/2014/11201414
  source accessed on: 2019-12-03T20:05:01Z
  source last accessed on: 2019-12-03T20:05:01Z
  definition: This industry subgroup includes pure-play Internet companies that retail products utilized in or for the home.
  notation: 11201414
  valid from: 2014-08-08
  valid till: 2020-10-03
source accessed on: 2019-12-03T20:05:01Z
source last accessed on: 2019-12-03T20:05:01Z
definition: This industry subgroup includes pure-play Internet companies that retail products utilized in or for the home.
notation: 11201414
valid from: 2014-08-08
valid till: 2020-10-03

Clothing & Accessories - Online
type: BicsLevel5Segment
type: Classifier
type: NamedIndividual
is level5 segment of: Apparel & Footwear - Online
created with: infer-bics.sql
derived from: Clothing & Accessories - Online
  type: BicsLevel5Segment
  type: Classifier
  type: ContemporaryDerivation
  derived from: http://data.ga-group.nl/ics/bics/2014/1120141510
  source accessed on: 2019-12-03T20:05:01Z
  source last accessed on: 2019-12-03T20:05:01Z
  definition: This segment includes companies that retail clothing apparel and accessories online.
  notation: 1120141510
  valid from: 2014-08-08
  valid till: 2020-10-03
source accessed on: 2019-12-03T20:05:01Z
source last accessed on: 2019-12-03T20:05:01Z
definition: This segment includes companies that retail clothing apparel and accessories online.
notation: 1120141510
valid from: 2014-08-08
valid till: 2020-10-03

Footwear - Online
type: BicsLevel5Segment
type: Classifier
type: NamedIndividual
is level5 segment of: Apparel & Footwear - Online
created with: infer-bics.sql
derived from: Footwear - Online
  type: BicsLevel5Segment
  type: Classifier
  type: ContemporaryDerivation
  derived from: http://data.ga-group.nl/ics/bics/2014/1120141511
  source accessed on: 2019-12-03T20:05:01Z
  source last accessed on: 2019-12-03T20:05:01Z
  definition: This segment includes pure-play Internet companies that retail shoes.
  notation: 1120141511
  valid from: 2014-08-08
  valid till: 2020-10-03
source accessed on: 2019-12-03T20:05:01Z
source last accessed on: 2019-12-03T20:05:01Z
definition: This segment includes pure-play Internet companies that retail shoes.
notation: 1120141511
valid from: 2014-08-08
valid till: 2020-10-03

Apparel & Footwear - Online
type: BicsLevel4SubIndustry
type: Classifier
type: NamedIndividual
created with: infer-bics.sql
derived from: Apparel & Footwear - Online
  type: BicsLevel4SubIndustry
  type: Classifier
  type: ContemporaryDerivation
  derived from: http://data.ga-group.nl/ics/bics/2014/11201415
  source accessed on: 2019-12-03T20:05:01Z
  source last accessed on: 2019-12-03T20:05:01Z
  definition: This industry subgroup includes companies that retail apparel and footwear on the Internet.
  notation: 11201415
  valid from: 2014-08-08
  valid till: 2020-10-03
source accessed on: 2019-12-03T20:05:01Z
source last accessed on: 2019-12-03T20:05:01Z
definition: This industry subgroup includes companies that retail apparel and footwear on the Internet.
notation: 11201415
valid from: 2014-08-08
valid till: 2020-10-03

Books - Online
type: BicsLevel5Segment
type: Classifier
type: NamedIndividual
is level5 segment of: Other Specialty Retail - Online
is replaced by: Books - Online
created with: infer-bics.sql
derived from: Books - Online
  type: BicsLevel5Segment
  type: Classifier
  type: ContemporaryDerivation
  derived from: http://data.ga-group.nl/ics/bics/2014/1120141610
  source accessed on: 2019-12-03T20:05:01Z
  source last accessed on: 2019-12-03T20:05:01Z
  definition: This segment includes pure-play Internet companies that retail books on the Internet.
  notation: 1120141610
  valid from: 2014-08-08
  valid till: 2020-10-03
source accessed on: 2019-12-03T20:05:01Z
source last accessed on: 2019-12-03T20:05:01Z
definition: This segment includes pure-play Internet companies that retail books on the Internet.
notation: 1120141610
valid from: 2014-08-08
valid till: 2020-10-03

Cosmetics & Beauty - Online
type: BicsLevel5Segment
type: Classifier
type: NamedIndividual
is level5 segment of: Other Specialty Retail - Online
is replaced by: Cosmetics & Beauty - Online
created with: infer-bics.sql
derived from: Cosmetics & Beauty - Online
  type: BicsLevel5Segment
  type: Classifier
  type: ContemporaryDerivation
  derived from: http://data.ga-group.nl/ics/bics/2014/1120141611
  source accessed on: 2019-12-03T20:05:01Z
  source last accessed on: 2019-12-03T20:05:01Z
  definition: This segment includes pure-play Internet companies that retail cosmetics and beauty products on the Internet.
  notation: 1120141611
  valid from: 2014-08-08
  valid till: 2020-10-03
source accessed on: 2019-12-03T20:05:01Z
source last accessed on: 2019-12-03T20:05:01Z
definition: This segment includes pure-play Internet companies that retail cosmetics and beauty products on the Internet.
notation: 1120141611
valid from: 2014-08-08
valid till: 2020-10-03

Flowers - Online
type: BicsLevel5Segment
type: Classifier
type: NamedIndividual
is level5 segment of: Other Specialty Retail - Online
is replaced by: Flowers - Online
created with: infer-bics.sql
derived from: Flowers - Online
  type: BicsLevel5Segment
  type: Classifier
  type: ContemporaryDerivation
  derived from: http://data.ga-group.nl/ics/bics/2014/1120141612
  source accessed on: 2019-12-03T20:05:01Z
  source last accessed on: 2019-12-03T20:05:01Z
  definition: This segment includes pure-play Internet companies that retail cut flowers, floral arrangements and potted plants on the Internet.
  notation: 1120141612
  valid from: 2014-08-08
  valid till: 2020-10-03
source accessed on: 2019-12-03T20:05:01Z
source last accessed on: 2019-12-03T20:05:01Z
definition: This segment includes pure-play Internet companies that retail cut flowers, floral arrangements and potted plants on the Internet.
notation: 1120141612
valid from: 2014-08-08
valid till: 2020-10-03

Toys & Games - Online
type: BicsLevel5Segment
type: Classifier
type: NamedIndividual
is level5 segment of: Other Specialty Retail - Online
is replaced by: Toys & Games - Online
created with: infer-bics.sql
derived from: Toys & Games - Online
  type: BicsLevel5Segment
  type: Classifier
  type: ContemporaryDerivation
  derived from: http://data.ga-group.nl/ics/bics/2014/1120141613
  source accessed on: 2019-12-03T20:05:01Z
  source last accessed on: 2019-12-03T20:05:01Z
  definition: This segment includes pure-play Internet companies that retail toys, games and hobby products on the Internet.
  notation: 1120141613
  valid from: 2014-08-08
  valid till: 2020-10-03
source accessed on: 2019-12-03T20:05:01Z
source last accessed on: 2019-12-03T20:05:01Z
definition: This segment includes pure-play Internet companies that retail toys, games and hobby products on the Internet.
notation: 1120141613
valid from: 2014-08-08
valid till: 2020-10-03

Jewelry & Watch - Online
type: BicsLevel5Segment
type: Classifier
type: NamedIndividual
is level5 segment of: Other Specialty Retail - Online
is replaced by: Jewelry & Watch - Online
created with: infer-bics.sql
derived from: Jewelry & Watch - Online
  type: BicsLevel5Segment
  type: Classifier
  type: ContemporaryDerivation
  derived from: http://data.ga-group.nl/ics/bics/2014/1120141614
  source accessed on: 2019-12-03T20:05:01Z
  source last accessed on: 2019-12-03T20:05:01Z
  definition: This segment includes pure-play Internet companies that retail jewelry.
  notation: 1120141614
  valid from: 2014-08-08
  valid till: 2020-10-03
source accessed on: 2019-12-03T20:05:01Z
source last accessed on: 2019-12-03T20:05:01Z
definition: This segment includes pure-play Internet companies that retail jewelry.
notation: 1120141614
valid from: 2014-08-08
valid till: 2020-10-03

Movie Rental - Online
type: BicsLevel5Segment
type: Classifier
type: NamedIndividual
is level5 segment of: Other Specialty Retail - Online
created with: infer-bics.sql
derived from: Movie Rental - Online
  type: BicsLevel5Segment
  type: Classifier
  type: ContemporaryDerivation
  derived from: http://data.ga-group.nl/ics/bics/2014/1120141615
  source accessed on: 2019-12-03T20:05:01Z
  source last accessed on: 2019-12-03T20:05:01Z
  definition: This segment includes companies that rent movies online to the general public.
  notation: 1120141615
  valid from: 2014-08-08
  valid till: 2020-10-03
source accessed on: 2019-12-03T20:05:01Z
source last accessed on: 2019-12-03T20:05:01Z
definition: This segment includes companies that rent movies online to the general public.
notation: 1120141615
valid from: 2014-08-08
valid till: 2020-10-03

Music & Movies - Online
type: BicsLevel5Segment
type: Classifier
type: NamedIndividual
is level5 segment of: Other Specialty Retail - Online
is replaced by: Music & Movies - Online
created with: infer-bics.sql
derived from: Music & Movies - Online
  type: BicsLevel5Segment
  type: Classifier
  type: ContemporaryDerivation
  derived from: http://data.ga-group.nl/ics/bics/2014/1120141616
  source accessed on: 2019-12-03T20:05:01Z
  source last accessed on: 2019-12-03T20:05:01Z
  definition: This segment includes companies that retail prerecorded music and movie products on the Internet.
  notation: 1120141616
  valid from: 2014-08-08
  valid till: 2020-10-03
source accessed on: 2019-12-03T20:05:01Z
source last accessed on: 2019-12-03T20:05:01Z
definition: This segment includes companies that retail prerecorded music and movie products on the Internet.
notation: 1120141616
valid from: 2014-08-08
valid till: 2020-10-03

Music Download Sites
type: BicsLevel5Segment
type: Classifier
type: NamedIndividual
is level5 segment of: Other Specialty Retail - Online
created with: infer-bics.sql
derived from: Music Download Sites
  type: BicsLevel5Segment
  type: Classifier
  type: ContemporaryDerivation
  derived from: http://data.ga-group.nl/ics/bics/2014/1120141617
  source accessed on: 2019-12-03T20:05:01Z
  source last accessed on: 2019-12-03T20:05:01Z
  definition: This segment includes pure-play Internet companies that are involved in music downloads on the Internet.
  notation: 1120141617
  valid from: 2014-08-08
  valid till: 2020-10-03
source accessed on: 2019-12-03T20:05:01Z
source last accessed on: 2019-12-03T20:05:01Z
definition: This segment includes pure-play Internet companies that are involved in music downloads on the Internet.
notation: 1120141617
valid from: 2014-08-08
valid till: 2020-10-03

Musical Instrument - Online
type: BicsLevel5Segment
type: Classifier
type: NamedIndividual
is level5 segment of: Other Specialty Retail - Online
is replaced by: Musical Instrument - Online
created with: infer-bics.sql
derived from: Musical Instrument - Online
  type: BicsLevel5Segment
  type: Classifier
  type: ContemporaryDerivation
  derived from: http://data.ga-group.nl/ics/bics/2014/1120141618
  source accessed on: 2019-12-03T20:05:01Z
  source last accessed on: 2019-12-03T20:05:01Z
  definition: This segment includes pure-play Internet companies that retail musical instruments and accessories on the Internet.
  notation: 1120141618
  valid from: 2014-08-08
  valid till: 2020-10-03
source accessed on: 2019-12-03T20:05:01Z
source last accessed on: 2019-12-03T20:05:01Z
definition: This segment includes pure-play Internet companies that retail musical instruments and accessories on the Internet.
notation: 1120141618
valid from: 2014-08-08
valid till: 2020-10-03

Pets & Supplies - Online
type: BicsLevel5Segment
type: Classifier
type: NamedIndividual
is level5 segment of: Other Specialty Retail - Online
is replaced by: Pets & Supplies - Online
created with: infer-bics.sql
derived from: Pets & Supplies - Online
  type: BicsLevel5Segment
  type: Classifier
  type: ContemporaryDerivation
  derived from: http://data.ga-group.nl/ics/bics/2014/1120141619
  source accessed on: 2019-12-03T20:05:01Z
  source last accessed on: 2019-12-03T20:05:01Z
  definition: This segment includes pure-play Internet companies that retail pet products and supplies on the Internet.
  notation: 1120141619
  valid from: 2014-08-08
  valid till: 2020-10-03
source accessed on: 2019-12-03T20:05:01Z
source last accessed on: 2019-12-03T20:05:01Z
definition: This segment includes pure-play Internet companies that retail pet products and supplies on the Internet.
notation: 1120141619
valid from: 2014-08-08
valid till: 2020-10-03

Sporting Goods - Online
type: BicsLevel5Segment
type: Classifier
type: NamedIndividual
is level5 segment of: Other Specialty Retail - Online
is replaced by: Sporting Goods - Online
created with: infer-bics.sql
derived from: Sporting Goods - Online
  type: BicsLevel5Segment
  type: Classifier
  type: ContemporaryDerivation
  derived from: http://data.ga-group.nl/ics/bics/2014/1120141620
  source accessed on: 2019-12-03T20:05:01Z
  source last accessed on: 2019-12-03T20:05:01Z
  definition: This segment includes pure-play Internet companies that retail sporting goods primarily on the Internet.
  notation: 1120141620
  valid from: 2014-08-08
  valid till: 2020-10-03
source accessed on: 2019-12-03T20:05:01Z
source last accessed on: 2019-12-03T20:05:01Z
definition: This segment includes pure-play Internet companies that retail sporting goods primarily on the Internet.
notation: 1120141620
valid from: 2014-08-08
valid till: 2020-10-03

Video Game Rental - Online
type: BicsLevel5Segment
type: Classifier
type: NamedIndividual
is level5 segment of: Other Specialty Retail - Online
created with: infer-bics.sql
derived from: Video Game Rental - Online
  type: BicsLevel5Segment
  type: Classifier
  type: ContemporaryDerivation
  derived from: http://data.ga-group.nl/ics/bics/2014/1120141621
  source accessed on: 2019-12-03T20:05:01Z
  source last accessed on: 2019-12-03T20:05:01Z
  definition: This segment includes companies that rent video games online to the general public.
  notation: 1120141621
  valid from: 2014-08-08
  valid till: 2020-10-03
source accessed on: 2019-12-03T20:05:01Z
source last accessed on: 2019-12-03T20:05:01Z
definition: This segment includes companies that rent video games online to the general public.
notation: 1120141621
valid from: 2014-08-08
valid till: 2020-10-03

Misc. Retail - Online
type: BicsLevel5Segment
type: Classifier
type: NamedIndividual
is level5 segment of: Other Specialty Retail - Online
created with: infer-bics.sql
derived from: Misc. Retail - Online
  type: BicsLevel5Segment
  type: Classifier
  type: ContemporaryDerivation
  derived from: http://data.ga-group.nl/ics/bics/2014/1120141622
  source accessed on: 2019-12-03T20:05:01Z
  source last accessed on: 2019-12-03T20:05:01Z
  definition: This segment includes companies that retail miscellaneous items on the Internet.
  notation: 1120141622
  valid from: 2014-08-08
  valid till: 2020-10-03
source accessed on: 2019-12-03T20:05:01Z
source last accessed on: 2019-12-03T20:05:01Z
definition: This segment includes companies that retail miscellaneous items on the Internet.
notation: 1120141622
valid from: 2014-08-08
valid till: 2020-10-03

Other Specialty Retail - Online
type: BicsLevel4SubIndustry
type: Classifier
type: NamedIndividual
created with: infer-bics.sql
derived from: Other Specialty Retail - Online
  type: BicsLevel4SubIndustry
  type: Classifier
  type: ContemporaryDerivation
  derived from: http://data.ga-group.nl/ics/bics/2014/11201416
  source accessed on: 2019-12-03T20:05:01Z
  source last accessed on: 2019-12-03T20:05:01Z
  definition: This industry subgroup includes online retail companies not elsewhere classified.
  notation: 11201416
  valid from: 2014-08-08
  valid till: 2020-10-03
source accessed on: 2019-12-03T20:05:01Z
source last accessed on: 2019-12-03T20:05:01Z
definition: This industry subgroup includes online retail companies not elsewhere classified.
notation: 11201416
valid from: 2014-08-08
valid till: 2020-10-03

E-Commerce Discretionary
type: BicsLevel3Industry
type: Classifier
type: NamedIndividual
is industry of: Retail - Discretionary
is replaced by: Specialty Online Retailers
created with: infer-bics.sql
derived from: E-Commerce Discretionary
  type: BicsLevel3Industry
  type: Classifier
  type: ContemporaryDerivation
  derived from: http://data.ga-group.nl/ics/bics/2014/112014
  source accessed on: 2019-12-03T20:05:01Z
  source last accessed on: 2019-12-03T20:05:01Z
  definition: This industry includes companies that retail products on the Internet.
  notation: 112014
  valid from: 2014-08-08
  valid till: 2020-10-03
source accessed on: 2019-12-03T20:05:01Z
source last accessed on: 2019-12-03T20:05:01Z
definition: This industry includes companies that retail products on the Internet.
notation: 112014
valid from: 2014-08-08
valid till: 2020-10-03

Brick & Stone Bldg Matl Dealers
type: BicsLevel5Segment
type: Classifier
type: NamedIndividual
is level5 segment of: Building Materials Dealers
is replaced by: Brick & Stone Bldg Matl Dealers
created with: infer-bics.sql
derived from: Brick & Stone Bldg Matl Dealers
  type: BicsLevel5Segment
  type: Classifier
  type: ContemporaryDerivation
  derived from: http://data.ga-group.nl/ics/bics/2014/1120151010
  source accessed on: 2019-12-03T20:05:01Z
  source last accessed on: 2019-12-03T20:05:01Z
  definition: This segment includes companies that wholesale and distribute building materials and products, such as brick, stone and related construction materials.
  notation: 1120151010
  valid from: 2014-08-08
  valid till: 2020-10-03
source accessed on: 2019-12-03T20:05:01Z
source last accessed on: 2019-12-03T20:05:01Z
definition: This segment includes companies that wholesale and distribute building materials and products, such as brick, stone and related construction materials.
notation: 1120151010
valid from: 2014-08-08
valid till: 2020-10-03

Plumbing & HVAC Dealers
type: BicsLevel5Segment
type: Classifier
type: NamedIndividual
is level5 segment of: Building Materials Dealers
is replaced by: Plumbing & HVAC Dealers
created with: infer-bics.sql
derived from: Plumbing & HVAC Dealers
  type: BicsLevel5Segment
  type: Classifier
  type: ContemporaryDerivation
  derived from: http://data.ga-group.nl/ics/bics/2014/1120151011
  source accessed on: 2019-12-03T20:05:01Z
  source last accessed on: 2019-12-03T20:05:01Z
  definition: This segment includes companies that wholesale and distribute consumer-grade plumbing and heating equipment and supplies. Excludes commercial-grade products (see Industrial Equip & Supplies Distr).
  notation: 1120151011
  valid from: 2014-08-08
  valid till: 2020-10-03
source accessed on: 2019-12-03T20:05:01Z
source last accessed on: 2019-12-03T20:05:01Z
definition: This segment includes companies that wholesale and distribute consumer-grade plumbing and heating equipment and supplies. Excludes commercial-grade products (see Industrial Equip & Supplies Distr).
notation: 1120151011
valid from: 2014-08-08
valid till: 2020-10-03

Roof, Siding & Insulation Distr
type: BicsLevel5Segment
type: Classifier
type: NamedIndividual
is level5 segment of: Building Materials Dealers
is replaced by: Roof, Siding & Insulation Distr
created with: infer-bics.sql
derived from: Roof, Siding & Insulation Distr
  type: BicsLevel5Segment
  type: Classifier
  type: ContemporaryDerivation
  derived from: http://data.ga-group.nl/ics/bics/2014/1120151012
  source accessed on: 2019-12-03T20:05:01Z
  source last accessed on: 2019-12-03T20:05:01Z
  definition: This segment includes companies that wholesale and distribute building materials and products, such as roofing, siding and insulation materials.
  notation: 1120151012
  valid from: 2014-08-08
  valid till: 2020-10-03
source accessed on: 2019-12-03T20:05:01Z
source last accessed on: 2019-12-03T20:05:01Z
definition: This segment includes companies that wholesale and distribute building materials and products, such as roofing, siding and insulation materials.
notation: 1120151012
valid from: 2014-08-08
valid till: 2020-10-03

Wood Products Dealers
type: BicsLevel5Segment
type: Classifier
type: NamedIndividual
is level5 segment of: Building Materials Dealers
is replaced by: Wood Products Dealers
created with: infer-bics.sql
derived from: Wood Products Dealers
  type: BicsLevel5Segment
  type: Classifier
  type: ContemporaryDerivation
  derived from: http://data.ga-group.nl/ics/bics/2014/1120151013
  source accessed on: 2019-12-03T20:05:01Z
  source last accessed on: 2019-12-03T20:05:01Z
  definition: This segment includes companies that wholesale and distribute building materials, such as lumber, plywood, millwork and related product materials.
  notation: 1120151013
  valid from: 2014-08-08
  valid till: 2020-10-03
source accessed on: 2019-12-03T20:05:01Z
source last accessed on: 2019-12-03T20:05:01Z
definition: This segment includes companies that wholesale and distribute building materials, such as lumber, plywood, millwork and related product materials.
notation: 1120151013
valid from: 2014-08-08
valid till: 2020-10-03

Other Const Material Dealers
type: BicsLevel5Segment
type: Classifier
type: NamedIndividual
is level5 segment of: Building Materials Dealers
created with: infer-bics.sql
derived from: Other Const Material Dealers
  type: BicsLevel5Segment
  type: Classifier
  type: ContemporaryDerivation
  derived from: http://data.ga-group.nl/ics/bics/2014/1120151014
  source accessed on: 2019-12-03T20:05:01Z
  source last accessed on: 2019-12-03T20:05:01Z
  definition: This segment includes companies that wholesale and distribute all other building materials and products not elsewhere classified.
  notation: 1120151014
  valid from: 2014-08-08
  valid till: 2020-10-03
source accessed on: 2019-12-03T20:05:01Z
source last accessed on: 2019-12-03T20:05:01Z
definition: This segment includes companies that wholesale and distribute all other building materials and products not elsewhere classified.
notation: 1120151014
valid from: 2014-08-08
valid till: 2020-10-03

Building Materials Dealers
type: BicsLevel4SubIndustry
type: Classifier
type: NamedIndividual
created with: infer-bics.sql
derived from: Building Materials Dealers
  type: BicsLevel4SubIndustry
  type: Classifier
  type: ContemporaryDerivation
  derived from: http://data.ga-group.nl/ics/bics/2014/11201510
  source accessed on: 2019-12-03T20:05:01Z
  source last accessed on: 2019-12-03T20:05:01Z
  definition: This industry subgroup includes companies that wholesale and distribute building materials and products. These building materials and products are utilized for use in homebuilding and other retail-orientated applications.
  notation: 11201510
  valid from: 2014-08-08
  valid till: 2020-10-03
source accessed on: 2019-12-03T20:05:01Z
source last accessed on: 2019-12-03T20:05:01Z
definition: This industry subgroup includes companies that wholesale and distribute building materials and products. These building materials and products are utilized for use in homebuilding and other retail-orientated applications.
notation: 11201510
valid from: 2014-08-08
valid till: 2020-10-03

Furniture Stores
type: BicsLevel4SubIndustry
type: Classifier
type: NamedIndividual
created with: infer-bics.sql
derived from: Furniture Stores
  type: BicsLevel4SubIndustry
  type: Classifier
  type: ContemporaryDerivation
  derived from: http://data.ga-group.nl/ics/bics/2014/11201511
  source accessed on: 2019-12-03T20:05:01Z
  source last accessed on: 2019-12-03T20:05:01Z
  definition: This industry subgroup includes companies that retail furniture. This can include Internet sales of brick-and-mortar stores.
  notation: 11201511
  valid from: 2014-08-08
  valid till: 2020-10-03
source accessed on: 2019-12-03T20:05:01Z
source last accessed on: 2019-12-03T20:05:01Z
definition: This industry subgroup includes companies that retail furniture. This can include Internet sales of brick-and-mortar stores.
notation: 11201511
valid from: 2014-08-08
valid till: 2020-10-03

Home Furnishings Stores
type: BicsLevel4SubIndustry
type: Classifier
type: NamedIndividual
created with: infer-bics.sql
derived from: Home Furnishings Stores
  type: BicsLevel4SubIndustry
  type: Classifier
  type: ContemporaryDerivation
  derived from: http://data.ga-group.nl/ics/bics/2014/11201512
  source accessed on: 2019-12-03T20:05:01Z
  source last accessed on: 2019-12-03T20:05:01Z
  definition: This industry subgroup includes companies that retail home furnishing products. This can include Internet sales of brick-and-mortar stores.
  notation: 11201512
  valid from: 2014-08-08
  valid till: 2020-10-03
source accessed on: 2019-12-03T20:05:01Z
source last accessed on: 2019-12-03T20:05:01Z
definition: This industry subgroup includes companies that retail home furnishing products. This can include Internet sales of brick-and-mortar stores.
notation: 11201512
valid from: 2014-08-08
valid till: 2020-10-03

Hardware Stores
type: BicsLevel5Segment
type: Classifier
type: NamedIndividual
is level5 segment of: Home Improvement Stores
is replaced by: Hardware Stores
created with: infer-bics.sql
derived from: Hardware Stores
  type: BicsLevel5Segment
  type: Classifier
  type: ContemporaryDerivation
  derived from: http://data.ga-group.nl/ics/bics/2014/1120151310
  source accessed on: 2019-12-03T20:05:01Z
  source last accessed on: 2019-12-03T20:05:01Z
  definition: This segment includes companies that retail hardware. This can include Internet sales of brick-and-mortar stores.
  notation: 1120151310
  valid from: 2014-08-08
  valid till: 2020-10-03
source accessed on: 2019-12-03T20:05:01Z
source last accessed on: 2019-12-03T20:05:01Z
definition: This segment includes companies that retail hardware. This can include Internet sales of brick-and-mortar stores.
notation: 1120151310
valid from: 2014-08-08
valid till: 2020-10-03

Home Centers
type: BicsLevel5Segment
type: Classifier
type: NamedIndividual
is level5 segment of: Home Improvement Stores
is replaced by: Home Centers
created with: infer-bics.sql
derived from: Home Centers
  type: BicsLevel5Segment
  type: Classifier
  type: ContemporaryDerivation
  derived from: http://data.ga-group.nl/ics/bics/2014/1120151311
  source accessed on: 2019-12-03T20:05:01Z
  source last accessed on: 2019-12-03T20:05:01Z
  definition: This segment includes companies that retail home improvement materials and related merchandise. This can include Internet sales of brick-and-mortar stores.
  notation: 1120151311
  valid from: 2014-08-08
  valid till: 2020-10-03
source accessed on: 2019-12-03T20:05:01Z
source last accessed on: 2019-12-03T20:05:01Z
definition: This segment includes companies that retail home improvement materials and related merchandise. This can include Internet sales of brick-and-mortar stores.
notation: 1120151311
valid from: 2014-08-08
valid till: 2020-10-03

Nursery & Garden Centers
type: BicsLevel5Segment
type: Classifier
type: NamedIndividual
is level5 segment of: Home Improvement Stores
is replaced by: Nursery & Garden Centers
created with: infer-bics.sql
derived from: Nursery & Garden Centers
  type: BicsLevel5Segment
  type: Classifier
  type: ContemporaryDerivation
  derived from: http://data.ga-group.nl/ics/bics/2014/1120151312
  source accessed on: 2019-12-03T20:05:01Z
  source last accessed on: 2019-12-03T20:05:01Z
  definition: This segment includes companies that retail nursery and gardening products. This can include Internet sales of brick-and-mortar stores.
  notation: 1120151312
  valid from: 2014-08-08
  valid till: 2020-10-03
source accessed on: 2019-12-03T20:05:01Z
source last accessed on: 2019-12-03T20:05:01Z
definition: This segment includes companies that retail nursery and gardening products. This can include Internet sales of brick-and-mortar stores.
notation: 1120151312
valid from: 2014-08-08
valid till: 2020-10-03

Other Home Improvement Stores
type: BicsLevel5Segment
type: Classifier
type: NamedIndividual
is level5 segment of: Home Improvement Stores
created with: infer-bics.sql
derived from: Other Home Improvement Stores
  type: BicsLevel5Segment
  type: Classifier
  type: ContemporaryDerivation
  derived from: http://data.ga-group.nl/ics/bics/2014/1120151313
  source accessed on: 2019-12-03T20:05:01Z
  source last accessed on: 2019-12-03T20:05:01Z
  definition: This segment includes companies that retail other home improvement products. This can include Internet sales of brick-and-mortar stores.
  notation: 1120151313
  valid from: 2014-08-08
  valid till: 2020-10-03
source accessed on: 2019-12-03T20:05:01Z
source last accessed on: 2019-12-03T20:05:01Z
definition: This segment includes companies that retail other home improvement products. This can include Internet sales of brick-and-mortar stores.
notation: 1120151313
valid from: 2014-08-08
valid till: 2020-10-03

Home Improvement Stores
type: BicsLevel4SubIndustry
type: Classifier
type: NamedIndividual
created with: infer-bics.sql
derived from: Home Improvement Stores
  type: BicsLevel4SubIndustry
  type: Classifier
  type: ContemporaryDerivation
  derived from: http://data.ga-group.nl/ics/bics/2014/11201513
  source accessed on: 2019-12-03T20:05:01Z
  source last accessed on: 2019-12-03T20:05:01Z
  definition: This industry subgroup includes companies that retail home improvement products and materials. Products can include lumber, paint, plumbing, tools, lighting, hardware and flooring.
  notation: 11201513
  valid from: 2014-08-08
  valid till: 2020-10-03
source accessed on: 2019-12-03T20:05:01Z
source last accessed on: 2019-12-03T20:05:01Z
definition: This industry subgroup includes companies that retail home improvement products and materials. Products can include lumber, paint, plumbing, tools, lighting, hardware and flooring.
notation: 11201513
valid from: 2014-08-08
valid till: 2020-10-03

Home Products Stores
type: BicsLevel3Industry
type: Classifier
type: NamedIndividual
is industry of: Retail - Discretionary
is replaced by: Home Products Stores
created with: infer-bics.sql
derived from: Home Products Stores
  type: BicsLevel3Industry
  type: Classifier
  type: ContemporaryDerivation
  derived from: http://data.ga-group.nl/ics/bics/2014/112015
  source accessed on: 2019-12-03T20:05:01Z
  source last accessed on: 2019-12-03T20:05:01Z
  definition: This industry includes companies that retail furniture, hardware, home furnishings, nursery products, gardening and home improvement products. This industry can include Internet sales of brick-and-mortar stores.
  notation: 112015
  valid from: 2014-08-08
  valid till: 2020-10-03
source accessed on: 2019-12-03T20:05:01Z
source last accessed on: 2019-12-03T20:05:01Z
definition: This industry includes companies that retail furniture, hardware, home furnishings, nursery products, gardening and home improvement products. This industry can include Internet sales of brick-and-mortar stores.
notation: 112015
valid from: 2014-08-08
valid till: 2020-10-03

Jewelry Stores
type: BicsLevel4SubIndustry
type: Classifier
type: NamedIndividual
created with: infer-bics.sql
derived from: Jewelry Stores
  type: BicsLevel4SubIndustry
  type: Classifier
  type: ContemporaryDerivation
  derived from: http://data.ga-group.nl/ics/bics/2014/11201610
  source accessed on: 2019-12-03T20:05:01Z
  source last accessed on: 2019-12-03T20:05:01Z
  definition: This industry subgroup includes companies that retail jewelry. This can include Internet sales of brick-and-mortar stores.
  notation: 11201610
  valid from: 2014-08-08
  valid till: 2020-10-03
source accessed on: 2019-12-03T20:05:01Z
source last accessed on: 2019-12-03T20:05:01Z
definition: This industry subgroup includes companies that retail jewelry. This can include Internet sales of brick-and-mortar stores.
notation: 11201610
valid from: 2014-08-08
valid till: 2020-10-03

Watch Stores
type: BicsLevel4SubIndustry
type: Classifier
type: NamedIndividual
created with: infer-bics.sql
derived from: Watch Stores
  type: BicsLevel4SubIndustry
  type: Classifier
  type: ContemporaryDerivation
  derived from: http://data.ga-group.nl/ics/bics/2014/11201611
  source accessed on: 2019-12-03T20:05:01Z
  source last accessed on: 2019-12-03T20:05:01Z
  definition: This industry subgroup includes companies that retail watches. This can include Internet sales of brick-and-mortar stores.
  notation: 11201611
  valid from: 2014-08-08
  valid till: 2020-10-03
source accessed on: 2019-12-03T20:05:01Z
source last accessed on: 2019-12-03T20:05:01Z
definition: This industry subgroup includes companies that retail watches. This can include Internet sales of brick-and-mortar stores.
notation: 11201611
valid from: 2014-08-08
valid till: 2020-10-03

Jewelry & Watch Stores
type: BicsLevel3Industry
type: Classifier
type: NamedIndividual
is industry of: Retail - Discretionary
is replaced by: Jewelry & Watch Stores
created with: infer-bics.sql
derived from: Jewelry & Watch Stores
  type: BicsLevel3Industry
  type: Classifier
  type: ContemporaryDerivation
  derived from: http://data.ga-group.nl/ics/bics/2014/112016
  source accessed on: 2019-12-03T20:05:01Z
  source last accessed on: 2019-12-03T20:05:01Z
  definition: This industry includes stores that retail pearls, precious gems, and precious metal crafted into various types of adornments.
  notation: 112016
  valid from: 2014-08-08
  valid till: 2020-10-03
source accessed on: 2019-12-03T20:05:01Z
source last accessed on: 2019-12-03T20:05:01Z
definition: This industry includes stores that retail pearls, precious gems, and precious metal crafted into various types of adornments.
notation: 112016
valid from: 2014-08-08
valid till: 2020-10-03

Apparel Stores - Franchising
type: BicsLevel4SubIndustry
type: Classifier
type: NamedIndividual
created with: infer-bics.sql
derived from: Apparel Stores - Franchising
  type: BicsLevel4SubIndustry
  type: Classifier
  type: ContemporaryDerivation
  derived from: http://data.ga-group.nl/ics/bics/2014/11201710
  source accessed on: 2019-12-03T20:05:01Z
  source last accessed on: 2019-12-03T20:05:01Z
  definition: This industry subgroup includes apparel retailers that have a franchise revenue stream.
  notation: 11201710
  valid from: 2014-08-08
  valid till: 2020-10-03
source accessed on: 2019-12-03T20:05:01Z
source last accessed on: 2019-12-03T20:05:01Z
definition: This industry subgroup includes apparel retailers that have a franchise revenue stream.
notation: 11201710
valid from: 2014-08-08
valid till: 2020-10-03

Child & Infant Clothing Stores
type: BicsLevel4SubIndustry
type: Classifier
type: NamedIndividual
created with: infer-bics.sql
derived from: Child & Infant Clothing Stores
  type: BicsLevel4SubIndustry
  type: Classifier
  type: ContemporaryDerivation
  derived from: http://data.ga-group.nl/ics/bics/2014/11201711
  source accessed on: 2019-12-03T20:05:01Z
  source last accessed on: 2019-12-03T20:05:01Z
  definition: This industry subgroup includes companies that retail children's and infants' clothing. This can include Internet sales of brick-and-mortar stores.
  notation: 11201711
  valid from: 2014-08-08
  valid till: 2020-10-03
source accessed on: 2019-12-03T20:05:01Z
source last accessed on: 2019-12-03T20:05:01Z
definition: This industry subgroup includes companies that retail children's and infants' clothing. This can include Internet sales of brick-and-mortar stores.
notation: 11201711
valid from: 2014-08-08
valid till: 2020-10-03

Clothing Accessories Stores
type: BicsLevel4SubIndustry
type: Classifier
type: NamedIndividual
created with: infer-bics.sql
derived from: Clothing Accessories Stores
  type: BicsLevel4SubIndustry
  type: Classifier
  type: ContemporaryDerivation
  derived from: http://data.ga-group.nl/ics/bics/2014/11201712
  source accessed on: 2019-12-03T20:05:01Z
  source last accessed on: 2019-12-03T20:05:01Z
  definition: This industry subgroup includes companies that retail clothing accessories. This can include Internet sales of brick-and-mortar stores.
  notation: 11201712
  valid from: 2014-08-08
  valid till: 2020-10-03
source accessed on: 2019-12-03T20:05:01Z
source last accessed on: 2019-12-03T20:05:01Z
definition: This industry subgroup includes companies that retail clothing accessories. This can include Internet sales of brick-and-mortar stores.
notation: 11201712
valid from: 2014-08-08
valid till: 2020-10-03

Family Clothing Stores
type: BicsLevel4SubIndustry
type: Classifier
type: NamedIndividual
created with: infer-bics.sql
derived from: Family Clothing Stores
  type: BicsLevel4SubIndustry
  type: Classifier
  type: ContemporaryDerivation
  derived from: http://data.ga-group.nl/ics/bics/2014/11201713
  source accessed on: 2019-12-03T20:05:01Z
  source last accessed on: 2019-12-03T20:05:01Z
  definition: This industry subgroup includes companies that retail apparel for men, women and children. This can include Internet sales of brick-and-mortar stores.
  notation: 11201713
  valid from: 2014-08-08
  valid till: 2020-10-03
source accessed on: 2019-12-03T20:05:01Z
source last accessed on: 2019-12-03T20:05:01Z
definition: This industry subgroup includes companies that retail apparel for men, women and children. This can include Internet sales of brick-and-mortar stores.
notation: 11201713
valid from: 2014-08-08
valid till: 2020-10-03

Footwear Stores
type: BicsLevel4SubIndustry
type: Classifier
type: NamedIndividual
created with: infer-bics.sql
derived from: Footwear Stores
  type: BicsLevel4SubIndustry
  type: Classifier
  type: ContemporaryDerivation
  derived from: http://data.ga-group.nl/ics/bics/2014/11201714
  source accessed on: 2019-12-03T20:05:01Z
  source last accessed on: 2019-12-03T20:05:01Z
  definition: This industry subgroup includes companies that retail footwear products. This can include Internet sales of brick-and-mortar stores.
  notation: 11201714
  valid from: 2014-08-08
  valid till: 2020-10-03
source accessed on: 2019-12-03T20:05:01Z
source last accessed on: 2019-12-03T20:05:01Z
definition: This industry subgroup includes companies that retail footwear products. This can include Internet sales of brick-and-mortar stores.
notation: 11201714
valid from: 2014-08-08
valid till: 2020-10-03

Men's Clothing Stores
type: BicsLevel4SubIndustry
type: Classifier
type: NamedIndividual
created with: infer-bics.sql
derived from: Men's Clothing Stores
  type: BicsLevel4SubIndustry
  type: Classifier
  type: ContemporaryDerivation
  derived from: http://data.ga-group.nl/ics/bics/2014/11201715
  source accessed on: 2019-12-03T20:05:01Z
  source last accessed on: 2019-12-03T20:05:01Z
  definition: This industry subgroup includes companies that retail men's clothing. This can include Internet sales of brick-and-mortar stores.
  notation: 11201715
  valid from: 2014-08-08
  valid till: 2020-10-03
source accessed on: 2019-12-03T20:05:01Z
source last accessed on: 2019-12-03T20:05:01Z
definition: This industry subgroup includes companies that retail men's clothing. This can include Internet sales of brick-and-mortar stores.
notation: 11201715
valid from: 2014-08-08
valid till: 2020-10-03

Off-Price Apparel
type: BicsLevel4SubIndustry
type: Classifier
type: NamedIndividual
created with: infer-bics.sql
derived from: Off-Price Apparel
  type: BicsLevel4SubIndustry
  type: Classifier
  type: ContemporaryDerivation
  derived from: http://data.ga-group.nl/ics/bics/2014/11201716
  source accessed on: 2019-12-03T20:05:01Z
  source last accessed on: 2019-12-03T20:05:01Z
  definition: This industry subgroup includes companies that have separate departments for various merchandise lines, such as apparel, jewelry, home furnishings and linens, each with a single line of cash registers. They generally offer merchandise at discounted prices compared with traditional department stores.
  notation: 11201716
  valid from: 2014-08-08
  valid till: 2020-10-03
source accessed on: 2019-12-03T20:05:01Z
source last accessed on: 2019-12-03T20:05:01Z
definition: This industry subgroup includes companies that have separate departments for various merchandise lines, such as apparel, jewelry, home furnishings and linens, each with a single line of cash registers. They generally offer merchandise at discounted prices compared with traditional department stores.
notation: 11201716
valid from: 2014-08-08
valid till: 2020-10-03

Teen & Young Adult Cloth Stores
type: BicsLevel4SubIndustry
type: Classifier
type: NamedIndividual
created with: infer-bics.sql
derived from: Teen & Young Adult Cloth Stores
  type: BicsLevel4SubIndustry
  type: Classifier
  type: ContemporaryDerivation
  derived from: http://data.ga-group.nl/ics/bics/2014/11201717
  source accessed on: 2019-12-03T20:05:01Z
  source last accessed on: 2019-12-03T20:05:01Z
  definition: This industry subgroup includes companies that retail teen, tween and young adult clothing. This can include Internet sales of brick-and-mortar stores.
  notation: 11201717
  valid from: 2014-08-08
  valid till: 2020-10-03
source accessed on: 2019-12-03T20:05:01Z
source last accessed on: 2019-12-03T20:05:01Z
definition: This industry subgroup includes companies that retail teen, tween and young adult clothing. This can include Internet sales of brick-and-mortar stores.
notation: 11201717
valid from: 2014-08-08
valid till: 2020-10-03

Women's Clothing Stores
type: BicsLevel4SubIndustry
type: Classifier
type: NamedIndividual
created with: infer-bics.sql
derived from: Women's Clothing Stores
  type: BicsLevel4SubIndustry
  type: Classifier
  type: ContemporaryDerivation
  derived from: http://data.ga-group.nl/ics/bics/2014/11201718
  source accessed on: 2019-12-03T20:05:01Z
  source last accessed on: 2019-12-03T20:05:01Z
  definition: This industry subgroup includes companies that retail women's clothing. This can include Internet sales of brick-and-mortar stores.
  notation: 11201718
  valid from: 2014-08-08
  valid till: 2020-10-03
source accessed on: 2019-12-03T20:05:01Z
source last accessed on: 2019-12-03T20:05:01Z
definition: This industry subgroup includes companies that retail women's clothing. This can include Internet sales of brick-and-mortar stores.
notation: 11201718
valid from: 2014-08-08
valid till: 2020-10-03

Specialty Apparel Stores
type: BicsLevel3Industry
type: Classifier
type: NamedIndividual
is industry of: Retail - Discretionary
is replaced by: Specialty Apparel Stores
created with: infer-bics.sql
derived from: Specialty Apparel Stores
  type: BicsLevel3Industry
  type: Classifier
  type: ContemporaryDerivation
  derived from: http://data.ga-group.nl/ics/bics/2014/112017
  source accessed on: 2019-12-03T20:05:01Z
  source last accessed on: 2019-12-03T20:05:01Z
  definition: This industry includes companies that retail family, men's, women's, children's and teen's clothing accessories. This industry can include Internet sales of brick-and-mortar stores.
  notation: 112017
  valid from: 2014-08-08
  valid till: 2020-10-03
source accessed on: 2019-12-03T20:05:01Z
source last accessed on: 2019-12-03T20:05:01Z
definition: This industry includes companies that retail family, men's, women's, children's and teen's clothing accessories. This industry can include Internet sales of brick-and-mortar stores.
notation: 112017
valid from: 2014-08-08
valid till: 2020-10-03

Sporting Goods Stores
type: BicsLevel3Industry
type: Classifier
type: NamedIndividual
is industry of: Retail - Discretionary
is replaced by: Sporting Goods Stores
created with: infer-bics.sql
derived from: Sporting Goods Stores
  type: BicsLevel3Industry
  type: Classifier
  type: ContemporaryDerivation
  derived from: http://data.ga-group.nl/ics/bics/2014/112018
  source accessed on: 2019-12-03T20:05:01Z
  source last accessed on: 2019-12-03T20:05:01Z
  definition: This industry includes stores that retail sporting goods, fishing gear, camping gear, kayaks, rowboats and bicycles.
  notation: 112018
  valid from: 2014-08-08
  valid till: 2020-10-03
source accessed on: 2019-12-03T20:05:01Z
source last accessed on: 2019-12-03T20:05:01Z
definition: This industry includes stores that retail sporting goods, fishing gear, camping gear, kayaks, rowboats and bicycles.
notation: 112018
valid from: 2014-08-08
valid till: 2020-10-03

Arts & Crafts Stores
type: BicsLevel4SubIndustry
type: Classifier
type: NamedIndividual
created with: infer-bics.sql
derived from: Arts & Crafts Stores
  type: BicsLevel4SubIndustry
  type: Classifier
  type: ContemporaryDerivation
  derived from: http://data.ga-group.nl/ics/bics/2014/11201910
  source accessed on: 2019-12-03T20:05:01Z
  source last accessed on: 2019-12-03T20:05:01Z
  definition: This industry subgroup includes companies that retail arts and crafts products. This can include Internet sales of brick-and-mortar stores.
  notation: 11201910
  valid from: 2014-08-08
  valid till: 2020-10-03
source accessed on: 2019-12-03T20:05:01Z
source last accessed on: 2019-12-03T20:05:01Z
definition: This industry subgroup includes companies that retail arts and crafts products. This can include Internet sales of brick-and-mortar stores.
notation: 11201910
valid from: 2014-08-08
valid till: 2020-10-03

Book Stores
type: BicsLevel4SubIndustry
type: Classifier
type: NamedIndividual
created with: infer-bics.sql
derived from: Book Stores
  type: BicsLevel4SubIndustry
  type: Classifier
  type: ContemporaryDerivation
  derived from: http://data.ga-group.nl/ics/bics/2014/11201911
  source accessed on: 2019-12-03T20:05:01Z
  source last accessed on: 2019-12-03T20:05:01Z
  definition: This industry subgroup includes companies that retail new books in brick-and-mortar stores and on the Internet.
  notation: 11201911
  valid from: 2014-08-08
  valid till: 2020-10-03
source accessed on: 2019-12-03T20:05:01Z
source last accessed on: 2019-12-03T20:05:01Z
definition: This industry subgroup includes companies that retail new books in brick-and-mortar stores and on the Internet.
notation: 11201911
valid from: 2014-08-08
valid till: 2020-10-03

Cosmetics & Beauty Stores
type: BicsLevel4SubIndustry
type: Classifier
type: NamedIndividual
created with: infer-bics.sql
derived from: Cosmetics & Beauty Stores
  type: BicsLevel4SubIndustry
  type: Classifier
  type: ContemporaryDerivation
  derived from: http://data.ga-group.nl/ics/bics/2014/11201912
  source accessed on: 2019-12-03T20:05:01Z
  source last accessed on: 2019-12-03T20:05:01Z
  definition: This industry subgroup includes companies that sell cosmetics and hair care products, both consumable and durable. This can include Internet sales of brick-and-mortar stores.
  notation: 11201912
  valid from: 2014-08-08
  valid till: 2020-10-03
source accessed on: 2019-12-03T20:05:01Z
source last accessed on: 2019-12-03T20:05:01Z
definition: This industry subgroup includes companies that sell cosmetics and hair care products, both consumable and durable. This can include Internet sales of brick-and-mortar stores.
notation: 11201912
valid from: 2014-08-08
valid till: 2020-10-03

Florists
type: BicsLevel4SubIndustry
type: Classifier
type: NamedIndividual
created with: infer-bics.sql
derived from: Florists
  type: BicsLevel4SubIndustry
  type: Classifier
  type: ContemporaryDerivation
  derived from: http://data.ga-group.nl/ics/bics/2014/11201913
  source accessed on: 2019-12-03T20:05:01Z
  source last accessed on: 2019-12-03T20:05:01Z
  definition: This industry subgroup includes companies that retail flowers. This can include Internet sales of brick-and-mortar stores.
  notation: 11201913
  valid from: 2014-08-08
  valid till: 2020-10-03
source accessed on: 2019-12-03T20:05:01Z
source last accessed on: 2019-12-03T20:05:01Z
definition: This industry subgroup includes companies that retail flowers. This can include Internet sales of brick-and-mortar stores.
notation: 11201913
valid from: 2014-08-08
valid till: 2020-10-03

Gift, Novelty & Souvenir Stores
type: BicsLevel4SubIndustry
type: Classifier
type: NamedIndividual
created with: infer-bics.sql
derived from: Gift, Novelty & Souvenir Stores
  type: BicsLevel4SubIndustry
  type: Classifier
  type: ContemporaryDerivation
  derived from: http://data.ga-group.nl/ics/bics/2014/11201914
  source accessed on: 2019-12-03T20:05:01Z
  source last accessed on: 2019-12-03T20:05:01Z
  definition: This industry subgroup includes companies that retail gift, novelty products and souvenirs. This can include Internet sales of brick-and-mortar stores.
  notation: 11201914
  valid from: 2014-08-08
  valid till: 2020-10-03
source accessed on: 2019-12-03T20:05:01Z
source last accessed on: 2019-12-03T20:05:01Z
definition: This industry subgroup includes companies that retail gift, novelty products and souvenirs. This can include Internet sales of brick-and-mortar stores.
notation: 11201914
valid from: 2014-08-08
valid till: 2020-10-03

Health Supplement Stores
type: BicsLevel4SubIndustry
type: Classifier
type: NamedIndividual
created with: infer-bics.sql
derived from: Health Supplement Stores
  type: BicsLevel4SubIndustry
  type: Classifier
  type: ContemporaryDerivation
  derived from: http://data.ga-group.nl/ics/bics/2014/11201915
  source accessed on: 2019-12-03T20:05:01Z
  source last accessed on: 2019-12-03T20:05:01Z
  definition: This industry subgroup includes companies that retail food supplements, vitamins and nutritional supplements. This can include Internet sales of brick-and-mortar stores.
  notation: 11201915
  valid from: 2014-08-08
  valid till: 2020-10-03
source accessed on: 2019-12-03T20:05:01Z
source last accessed on: 2019-12-03T20:05:01Z
definition: This industry subgroup includes companies that retail food supplements, vitamins and nutritional supplements. This can include Internet sales of brick-and-mortar stores.
notation: 11201915
valid from: 2014-08-08
valid till: 2020-10-03

Toy & Game Stores
type: BicsLevel4SubIndustry
type: Classifier
type: NamedIndividual
created with: infer-bics.sql
derived from: Toy & Game Stores
  type: BicsLevel4SubIndustry
  type: Classifier
  type: ContemporaryDerivation
  derived from: http://data.ga-group.nl/ics/bics/2014/11201916
  source accessed on: 2019-12-03T20:05:01Z
  source last accessed on: 2019-12-03T20:05:01Z
  definition: This industry subgroup includes companies that retail hobby products, toys and games. This can include Internet sales of brick-and-mortar stores.
  notation: 11201916
  valid from: 2014-08-08
  valid till: 2020-10-03
source accessed on: 2019-12-03T20:05:01Z
source last accessed on: 2019-12-03T20:05:01Z
definition: This industry subgroup includes companies that retail hobby products, toys and games. This can include Internet sales of brick-and-mortar stores.
notation: 11201916
valid from: 2014-08-08
valid till: 2020-10-03

Movie & Video Game Rent Stores
type: BicsLevel4SubIndustry
type: Classifier
type: NamedIndividual
created with: infer-bics.sql
derived from: Movie & Video Game Rent Stores
  type: BicsLevel4SubIndustry
  type: Classifier
  type: ContemporaryDerivation
  derived from: http://data.ga-group.nl/ics/bics/2014/11201917
  source accessed on: 2019-12-03T20:05:01Z
  source last accessed on: 2019-12-03T20:05:01Z
  definition: This industry subgroup includes companies that specialize in renting movies and video games. This can include Internet sales of brick-and-mortar stores.
  notation: 11201917
  valid from: 2014-08-08
  valid till: 2020-10-03
source accessed on: 2019-12-03T20:05:01Z
source last accessed on: 2019-12-03T20:05:01Z
definition: This industry subgroup includes companies that specialize in renting movies and video games. This can include Internet sales of brick-and-mortar stores.
notation: 11201917
valid from: 2014-08-08
valid till: 2020-10-03

Music & Movie Stores
type: BicsLevel4SubIndustry
type: Classifier
type: NamedIndividual
created with: infer-bics.sql
derived from: Music & Movie Stores
  type: BicsLevel4SubIndustry
  type: Classifier
  type: ContemporaryDerivation
  derived from: http://data.ga-group.nl/ics/bics/2014/11201918
  source accessed on: 2019-12-03T20:05:01Z
  source last accessed on: 2019-12-03T20:05:01Z
  definition: This industry subgroup includes companies that retail prerecorded music and movie products. This can include Internet sales of brick-and-mortar stores.
  notation: 11201918
  valid from: 2014-08-08
  valid till: 2020-10-03
source accessed on: 2019-12-03T20:05:01Z
source last accessed on: 2019-12-03T20:05:01Z
definition: This industry subgroup includes companies that retail prerecorded music and movie products. This can include Internet sales of brick-and-mortar stores.
notation: 11201918
valid from: 2014-08-08
valid till: 2020-10-03

Musical Instrument Stores
type: BicsLevel4SubIndustry
type: Classifier
type: NamedIndividual
created with: infer-bics.sql
derived from: Musical Instrument Stores
  type: BicsLevel4SubIndustry
  type: Classifier
  type: ContemporaryDerivation
  derived from: http://data.ga-group.nl/ics/bics/2014/11201919
  source accessed on: 2019-12-03T20:05:01Z
  source last accessed on: 2019-12-03T20:05:01Z
  definition: This industry subgroup includes companies that retail musical instruments and supplies. This can include Internet sales of brick-and-mortar stores.
  notation: 11201919
  valid from: 2014-08-08
  valid till: 2020-10-03
source accessed on: 2019-12-03T20:05:01Z
source last accessed on: 2019-12-03T20:05:01Z
definition: This industry subgroup includes companies that retail musical instruments and supplies. This can include Internet sales of brick-and-mortar stores.
notation: 11201919
valid from: 2014-08-08
valid till: 2020-10-03

Office Supp & Stationery Stores
type: BicsLevel4SubIndustry
type: Classifier
type: NamedIndividual
created with: infer-bics.sql
derived from: Office Supp & Stationery Stores
  type: BicsLevel4SubIndustry
  type: Classifier
  type: ContemporaryDerivation
  derived from: http://data.ga-group.nl/ics/bics/2014/11201920
  source accessed on: 2019-12-03T20:05:01Z
  source last accessed on: 2019-12-03T20:05:01Z
  definition: This industry subgroup includes companies that retail stationery and office supplies in brick-and-mortar stores and on the Internet.
  notation: 11201920
  valid from: 2014-08-08
  valid till: 2020-10-03
source accessed on: 2019-12-03T20:05:01Z
source last accessed on: 2019-12-03T20:05:01Z
definition: This industry subgroup includes companies that retail stationery and office supplies in brick-and-mortar stores and on the Internet.
notation: 11201920
valid from: 2014-08-08
valid till: 2020-10-03

Optical Goods Stores
type: BicsLevel4SubIndustry
type: Classifier
type: NamedIndividual
created with: infer-bics.sql
derived from: Optical Goods Stores
  type: BicsLevel4SubIndustry
  type: Classifier
  type: ContemporaryDerivation
  derived from: http://data.ga-group.nl/ics/bics/2014/11201921
  source accessed on: 2019-12-03T20:05:01Z
  source last accessed on: 2019-12-03T20:05:01Z
  definition: This industry subgroup includes companies that retail eyeglasses, contact lenses and related products. This can include Internet sales of brick-and-mortar stores.
  notation: 11201921
  valid from: 2014-08-08
  valid till: 2020-10-03
source accessed on: 2019-12-03T20:05:01Z
source last accessed on: 2019-12-03T20:05:01Z
definition: This industry subgroup includes companies that retail eyeglasses, contact lenses and related products. This can include Internet sales of brick-and-mortar stores.
notation: 11201921
valid from: 2014-08-08
valid till: 2020-10-03

Pet & Pet Supplies Stores
type: BicsLevel4SubIndustry
type: Classifier
type: NamedIndividual
created with: infer-bics.sql
derived from: Pet & Pet Supplies Stores
  type: BicsLevel4SubIndustry
  type: Classifier
  type: ContemporaryDerivation
  derived from: http://data.ga-group.nl/ics/bics/2014/11201922
  source accessed on: 2019-12-03T20:05:01Z
  source last accessed on: 2019-12-03T20:05:01Z
  definition: This industry subgroup includes companies that retail pets and pet supplies in brick-and-mortar stores. This can include Internet sales of brick-and-mortar stores.
  notation: 11201922
  valid from: 2014-08-08
  valid till: 2020-10-03
source accessed on: 2019-12-03T20:05:01Z
source last accessed on: 2019-12-03T20:05:01Z
definition: This industry subgroup includes companies that retail pets and pet supplies in brick-and-mortar stores. This can include Internet sales of brick-and-mortar stores.
notation: 11201922
valid from: 2014-08-08
valid till: 2020-10-03

Used Merchandise Stores
type: BicsLevel4SubIndustry
type: Classifier
type: NamedIndividual
created with: infer-bics.sql
derived from: Used Merchandise Stores
  type: BicsLevel4SubIndustry
  type: Classifier
  type: ContemporaryDerivation
  derived from: http://data.ga-group.nl/ics/bics/2014/11201923
  source accessed on: 2019-12-03T20:05:01Z
  source last accessed on: 2019-12-03T20:05:01Z
  definition: This industry subgroup includes companies that retail used merchandise of any sort. This can include Internet sales of brick-and-mortar stores.
  notation: 11201923
  valid from: 2014-08-08
  valid till: 2020-10-03
source accessed on: 2019-12-03T20:05:01Z
source last accessed on: 2019-12-03T20:05:01Z
definition: This industry subgroup includes companies that retail used merchandise of any sort. This can include Internet sales of brick-and-mortar stores.
notation: 11201923
valid from: 2014-08-08
valid till: 2020-10-03

Video Game Stores
type: BicsLevel4SubIndustry
type: Classifier
type: NamedIndividual
created with: infer-bics.sql
derived from: Video Game Stores
  type: BicsLevel4SubIndustry
  type: Classifier
  type: ContemporaryDerivation
  derived from: http://data.ga-group.nl/ics/bics/2014/11201924
  source accessed on: 2019-12-03T20:05:01Z
  source last accessed on: 2019-12-03T20:05:01Z
  definition: This industry subgroup includes companies that retail video games. This can include Internet sales of brick-and-mortar stores.
  notation: 11201924
  valid from: 2014-08-08
  valid till: 2020-10-03
source accessed on: 2019-12-03T20:05:01Z
source last accessed on: 2019-12-03T20:05:01Z
definition: This industry subgroup includes companies that retail video games. This can include Internet sales of brick-and-mortar stores.
notation: 11201924
valid from: 2014-08-08
valid till: 2020-10-03

Other Spec Retail - Discr
type: BicsLevel3Industry
type: Classifier
type: NamedIndividual
is industry of: Retail - Discretionary
is replaced by: Other Spec Retail - Discr
created with: infer-bics.sql
derived from: Other Spec Retail - Discr
  type: BicsLevel3Industry
  type: Classifier
  type: ContemporaryDerivation
  derived from: http://data.ga-group.nl/ics/bics/2014/112019
  source accessed on: 2019-12-03T20:05:01Z
  source last accessed on: 2019-12-03T20:05:01Z
  definition: This industry includes companies that retail arts, crafts, gifts, novelties, souvenirs, toys, games, flowers, jewelry, sporting goods and other consumer discretionary products elsewhere classified. This industry can include Internet sales of brick-and-mortar stores.
  notation: 112019
  valid from: 2014-08-08
  valid till: 2020-10-03
source accessed on: 2019-12-03T20:05:01Z
source last accessed on: 2019-12-03T20:05:01Z
definition: This industry includes companies that retail arts, crafts, gifts, novelties, souvenirs, toys, games, flowers, jewelry, sporting goods and other consumer discretionary products elsewhere classified. This industry can include Internet sales of brick-and-mortar stores.
notation: 112019
valid from: 2014-08-08
valid till: 2020-10-03

Retail - Discretionary
type: BicsLevel2IndustryGroup
type: Classifier
type: NamedIndividual
is industry group of: Consumer Discretionary
is replaced by: Retail - Discretionary
created with: infer-bics.sql
derived from: Retail - Discretionary
  type: BicsLevel2IndustryGroup
  type: Classifier
  type: ContemporaryDerivation
  derived from: http://data.ga-group.nl/ics/bics/2014/1120
  source accessed on: 2019-12-03T20:05:01Z
  source last accessed on: 2019-12-03T20:05:01Z
  definition: This industry group includes companies that retail merchandise to the general public through storefront operations.
  notation: 1120
  valid from: 2014-08-08
  valid till: 2020-10-03
source accessed on: 2019-12-03T20:05:01Z
source last accessed on: 2019-12-03T20:05:01Z
definition: This industry group includes companies that retail merchandise to the general public through storefront operations.
notation: 1120
valid from: 2014-08-08
valid till: 2020-10-03

Consumer Discretionary
type: BicsLevel1Sector
type: Classifier
type: NamedIndividual
created with: infer-bics.sql
derived from: Consumer Discretionary
  type: BicsLevel1Sector
  type: Classifier
  type: ContemporaryDerivation
  derived from: http://data.ga-group.nl/ics/bics/2014/11
  source accessed on: 2019-12-03T20:05:01Z
  source last accessed on: 2019-12-03T20:05:01Z
  definition: This sector includes companies that design, manufacture, retail and/or market consumer discretionary products and services.
  notation: 11
  valid from: 2014-08-08
  valid till: 2020-10-03
derived from: Consumer Discretionary
  type: BicsLevel1Sector
  type: Classifier
  type: ContemporaryDerivation
  derived from: http://data.ga-group.nl/ics/bics/2020/11
  derived from: http://data.ga-group.nl/ics/bics/2024/11
  source accessed on: 2023-07-03T18:11:29Z
  source last accessed on: 2024-06-05T14:42:36Z
  definition: This sector includes companies that design, manufacture, distribute, or retail consumer discretionary products and services.
  notation: 11
  valid from: 2020-10-03
source accessed on: 2019-12-03T20:05:01Z
source last accessed on: 2024-06-05T14:42:36Z
definition: This sector includes companies that design, manufacture, distribute, or retail consumer discretionary products and services.
notation: 11
valid from: 2014-08-08

Animal Feed
type: BicsLevel5Segment
type: Classifier
type: NamedIndividual
is level5 segment of: Agricultural Producers
created with: infer-bics.sql
derived from: Animal Feed
  type: BicsLevel4SubIndustry
  type: Classifier
  type: AnachronousDerivation
  derived from: http://data.ga-group.nl/ics/bics/2014/12101010
  source accessed on: 2019-12-03T20:05:01Z
  source last accessed on: 2019-12-03T20:05:01Z
  definition: This industry subgroup includes companies that produce food consumed by farm and other animals.
  notation: 12101010
  valid from: 2014-08-08
  valid till: 2020-10-03
derived from: Animal Feed
  type: BicsLevel5Segment
  type: Classifier
  type: ContemporaryDerivation
  derived from: http://data.ga-group.nl/ics/bics/2020/1210101010
  derived from: http://data.ga-group.nl/ics/bics/2024/1210101010
  source accessed on: 2023-07-03T18:11:29Z
  source last accessed on: 2024-06-05T14:42:36Z
  definition: This segment includes companies that produce food consumed by farm and other animals.
  notation: 1210101010
  valid from: 2020-10-03
source accessed on: 2023-07-03T18:11:29Z
source last accessed on: 2024-06-05T14:42:36Z
definition: This segment includes companies that produce food consumed by farm and other animals.
notation: 1210101010
valid from: 2020-10-03

Beef Cattle Ranch & Farming
type: BicsLevel7Segment
type: Classifier
type: NamedIndividual
is level7 segment of: Cattle Ranching & Farming
replaces: Baked Goods
created with: infer-bics.sql
derived from: Beef Cattle Ranch & Farming
  type: BicsLevel6Segment
  type: Classifier
  type: AnachronousDerivation
  derived from: http://data.ga-group.nl/ics/bics/2014/121010111010
  source accessed on: 2019-12-03T20:05:01Z
  source last accessed on: 2019-12-03T20:05:01Z
  definition: This segment includes companies that raise cattle for beef.
  notation: 121010111010
  valid from: 2014-08-08
  valid till: 2020-10-03
derived from: Beef Cattle Ranch & Farming
  type: BicsLevel7Segment
  type: Classifier
  type: ContemporaryDerivation
  derived from: http://data.ga-group.nl/ics/bics/2020/12101010111010
  derived from: http://data.ga-group.nl/ics/bics/2024/12101010111010
  source accessed on: 2023-07-03T18:11:29Z
  source last accessed on: 2024-06-05T14:42:36Z
  definition: This segment includes companies that raise cattle for beef.
  notation: 12101010111010
  valid from: 2020-10-03
source accessed on: 2023-07-03T18:11:29Z
source last accessed on: 2024-06-05T14:42:36Z
definition: This segment includes companies that raise cattle for beef.
notation: 12101010111010
valid from: 2020-10-03

Dairy Cattle & Milk Production
type: BicsLevel7Segment
type: Classifier
type: NamedIndividual
is level7 segment of: Cattle Ranching & Farming
replaces: Frozen Cakes & Pastries
created with: infer-bics.sql
derived from: Dairy Cattle & Milk Production
  type: BicsLevel6Segment
  type: Classifier
  type: AnachronousDerivation
  derived from: http://data.ga-group.nl/ics/bics/2014/121010111011
  source accessed on: 2019-12-03T20:05:01Z
  source last accessed on: 2019-12-03T20:05:01Z
  definition: This segment includes companies that raise and breed dairy cattle as well as companies that produce raw milk.
  notation: 121010111011
  valid from: 2014-08-08
  valid till: 2020-10-03
derived from: Dairy Cattle & Milk Production
  type: BicsLevel7Segment
  type: Classifier
  type: ContemporaryDerivation
  derived from: http://data.ga-group.nl/ics/bics/2020/12101010111011
  derived from: http://data.ga-group.nl/ics/bics/2024/12101010111011
  source accessed on: 2023-07-03T18:11:29Z
  source last accessed on: 2024-06-05T14:42:36Z
  definition: This segment includes companies that raise and breed dairy cattle and companies that produce raw milk.
  notation: 12101010111011
  valid from: 2020-10-03
source accessed on: 2023-07-03T18:11:29Z
source last accessed on: 2024-06-05T14:42:36Z
definition: This segment includes companies that raise and breed dairy cattle and companies that produce raw milk.
notation: 12101010111011
valid from: 2020-10-03

Cattle Ranching & Farming
type: BicsLevel6Segment
type: Classifier
type: NamedIndividual
is level6 segment of: Animal Production & Process
replaces: Bakery Products
created with: infer-bics.sql
derived from: Cattle Ranching & Farming
  type: BicsLevel5Segment
  type: Classifier
  type: AnachronousDerivation
  derived from: http://data.ga-group.nl/ics/bics/2014/1210101110
  source accessed on: 2019-12-03T20:05:01Z
  source last accessed on: 2019-12-03T20:05:01Z
  definition: This segment includes companies that raise cattle.
  notation: 1210101110
  valid from: 2014-08-08
  valid till: 2020-10-03
derived from: Cattle Ranching & Farming
  type: BicsLevel6Segment
  type: Classifier
  type: ContemporaryDerivation
  derived from: http://data.ga-group.nl/ics/bics/2020/121010101110
  derived from: http://data.ga-group.nl/ics/bics/2024/121010101110
  source accessed on: 2023-07-03T18:11:29Z
  source last accessed on: 2024-06-05T14:42:36Z
  definition: This segment includes companies that raise cattle.
  notation: 121010101110
  valid from: 2020-10-03
source accessed on: 2023-07-03T18:11:29Z
source last accessed on: 2024-06-05T14:42:36Z
definition: This segment includes companies that raise cattle.
notation: 121010101110
valid from: 2020-10-03

Hog & Pig Farming
type: BicsLevel6Segment
type: Classifier
type: NamedIndividual
is level6 segment of: Animal Production & Process
replaces: Pasta, Noodles & Rice
created with: infer-bics.sql
derived from: Hog & Pig Farming
  type: BicsLevel5Segment
  type: Classifier
  type: AnachronousDerivation
  derived from: http://data.ga-group.nl/ics/bics/2014/1210101111
  source accessed on: 2019-12-03T20:05:01Z
  source last accessed on: 2019-12-03T20:05:01Z
  definition: This segment includes companies that raise and breed hogs and pigs.
  notation: 1210101111
  valid from: 2014-08-08
  valid till: 2020-10-03
derived from: Hog & Pig Farming
  type: BicsLevel6Segment
  type: Classifier
  type: ContemporaryDerivation
  derived from: http://data.ga-group.nl/ics/bics/2020/121010101111
  derived from: http://data.ga-group.nl/ics/bics/2024/121010101111
  source accessed on: 2023-07-03T18:11:29Z
  source last accessed on: 2024-06-05T14:42:36Z
  definition: This segment includes companies that raise and breed hogs and pigs.
  notation: 121010101111
  valid from: 2020-10-03
source accessed on: 2023-07-03T18:11:29Z
source last accessed on: 2024-06-05T14:42:36Z
definition: This segment includes companies that raise and breed hogs and pigs.
notation: 121010101111
valid from: 2020-10-03

Poultry Farming
type: BicsLevel6Segment
type: Classifier
type: NamedIndividual
is level6 segment of: Animal Production & Process
replaces: Sauces, Dressings & Condiments
created with: infer-bics.sql
derived from: Poultry Farming
  type: BicsLevel5Segment
  type: Classifier
  type: AnachronousDerivation
  derived from: http://data.ga-group.nl/ics/bics/2014/1210101112
  source accessed on: 2019-12-03T20:05:01Z
  source last accessed on: 2019-12-03T20:05:01Z
  definition: This segment includes companies that hatch poultry and eggs of various types.
  notation: 1210101112
  valid from: 2014-08-08
  valid till: 2020-10-03
derived from: Poultry Farming
  type: BicsLevel6Segment
  type: Classifier
  type: ContemporaryDerivation
  derived from: http://data.ga-group.nl/ics/bics/2020/121010101112
  derived from: http://data.ga-group.nl/ics/bics/2024/121010101112
  source accessed on: 2023-07-03T18:11:29Z
  source last accessed on: 2024-06-05T14:42:36Z
  definition: This segment includes companies that hatch and raise poultry.
  notation: 121010101112
  valid from: 2020-10-03
source accessed on: 2023-07-03T18:11:29Z
source last accessed on: 2024-06-05T14:42:36Z
definition: This segment includes companies that hatch and raise poultry.
notation: 121010101112
valid from: 2020-10-03

Meat Processing
type: BicsLevel7Segment
type: Classifier
type: NamedIndividual
is level7 segment of: Animal Processing
replaces: Butter
created with: infer-bics.sql
derived from: Meat Processing
  type: BicsLevel6Segment
  type: Classifier
  type: AnachronousDerivation
  derived from: http://data.ga-group.nl/ics/bics/2014/121010111310
  source accessed on: 2019-12-03T20:05:01Z
  source last accessed on: 2019-12-03T20:05:01Z
  definition: This segment includes companies that slaughter, dress and process animals.
  notation: 121010111310
  valid from: 2014-08-08
  valid till: 2020-10-03
derived from: Meat Processing
  type: BicsLevel7Segment
  type: Classifier
  type: ContemporaryDerivation
  derived from: http://data.ga-group.nl/ics/bics/2020/12101010111310
  derived from: http://data.ga-group.nl/ics/bics/2024/12101010111310
  source accessed on: 2023-07-03T18:11:29Z
  source last accessed on: 2024-06-05T14:42:36Z
  definition: This segment includes companies that slaughter, dress, and process animals.
  notation: 12101010111310
  valid from: 2020-10-03
source accessed on: 2023-07-03T18:11:29Z
source last accessed on: 2024-06-05T14:42:36Z
definition: This segment includes companies that slaughter, dress, and process animals.
notation: 12101010111310
valid from: 2020-10-03

Poultry Processing
type: BicsLevel7Segment
type: Classifier
type: NamedIndividual
is level7 segment of: Animal Processing
replaces: Cheese
created with: infer-bics.sql
derived from: Poultry Processing
  type: BicsLevel6Segment
  type: Classifier
  type: AnachronousDerivation
  derived from: http://data.ga-group.nl/ics/bics/2014/121010111311
  source accessed on: 2019-12-03T20:05:01Z
  source last accessed on: 2019-12-03T20:05:01Z
  definition: This segment includes companies that slaughter, dress and process poultry, such as chickens, turkeys, ducks and geese. This includes processing meat for use in lunch and sandwich meats.
  notation: 121010111311
  valid from: 2014-08-08
  valid till: 2020-10-03
derived from: Poultry Processing
  type: BicsLevel7Segment
  type: Classifier
  type: ContemporaryDerivation
  derived from: http://data.ga-group.nl/ics/bics/2020/12101010111311
  derived from: http://data.ga-group.nl/ics/bics/2024/12101010111311
  source accessed on: 2023-07-03T18:11:29Z
  source last accessed on: 2024-06-05T14:42:36Z
  definition: This segment includes companies that slaughter, dress and process poultry, such as chickens, turkeys, ducks, and geese.
  notation: 12101010111311
  valid from: 2020-10-03
source accessed on: 2023-07-03T18:11:29Z
source last accessed on: 2024-06-05T14:42:36Z
definition: This segment includes companies that slaughter, dress and process poultry, such as chickens, turkeys, ducks, and geese.
notation: 12101010111311
valid from: 2020-10-03

Rendering & Meat Byproducts
type: BicsLevel7Segment
type: Classifier
type: NamedIndividual
is level7 segment of: Animal Processing
replaces: Dry & Condensed Dairy Products
created with: infer-bics.sql
derived from: Rendering & Meat Byproducts
  type: BicsLevel6Segment
  type: Classifier
  type: AnachronousDerivation
  derived from: http://data.ga-group.nl/ics/bics/2014/121010111312
  source accessed on: 2019-12-03T20:05:01Z
  source last accessed on: 2019-12-03T20:05:01Z
  definition: This segment includes companies that render fats and oils from animals and plants. It includes companies that render grease and lard.
  notation: 121010111312
  valid from: 2014-08-08
  valid till: 2020-10-03
derived from: Rendering & Meat Byproducts
  type: BicsLevel7Segment
  type: Classifier
  type: ContemporaryDerivation
  derived from: http://data.ga-group.nl/ics/bics/2020/12101010111312
  derived from: http://data.ga-group.nl/ics/bics/2024/12101010111312
  source accessed on: 2023-07-03T18:11:29Z
  source last accessed on: 2024-06-05T14:42:36Z
  definition: This segment includes companies that render fats and oils from animals and plants. It includes companies that render grease and lard.
  notation: 12101010111312
  valid from: 2020-10-03
source accessed on: 2023-07-03T18:11:29Z
source last accessed on: 2024-06-05T14:42:36Z
definition: This segment includes companies that render fats and oils from animals and plants. It includes companies that render grease and lard.
notation: 12101010111312
valid from: 2020-10-03

Animal Processing
type: BicsLevel6Segment
type: Classifier
type: NamedIndividual
is level6 segment of: Animal Production & Process
replaces: Dairy Products
created with: infer-bics.sql
derived from: Animal Processing
  type: BicsLevel5Segment
  type: Classifier
  type: AnachronousDerivation
  derived from: http://data.ga-group.nl/ics/bics/2014/1210101113
  source accessed on: 2019-12-03T20:05:01Z
  source last accessed on: 2019-12-03T20:05:01Z
  definition: This segment includes companies that are involved in animal processing.
  notation: 1210101113
  valid from: 2014-08-08
  valid till: 2020-10-03
derived from: Animal Processing
  type: BicsLevel6Segment
  type: Classifier
  type: ContemporaryDerivation
  derived from: http://data.ga-group.nl/ics/bics/2020/121010101113
  derived from: http://data.ga-group.nl/ics/bics/2024/121010101113
  source accessed on: 2023-07-03T18:11:29Z
  source last accessed on: 2024-06-05T14:42:36Z
  definition: This segment includes companies that are involved in animal processing.
  notation: 121010101113
  valid from: 2020-10-03
source accessed on: 2023-07-03T18:11:29Z
source last accessed on: 2024-06-05T14:42:36Z
definition: This segment includes companies that are involved in animal processing.
notation: 121010101113
valid from: 2020-10-03

Animal Production & Process
type: BicsLevel5Segment
type: Classifier
type: NamedIndividual
is level5 segment of: Agricultural Producers
created with: infer-bics.sql
derived from: Animal Production & Process
  type: BicsLevel4SubIndustry
  type: Classifier
  type: AnachronousDerivation
  derived from: http://data.ga-group.nl/ics/bics/2014/12101011
  source accessed on: 2019-12-03T20:05:01Z
  source last accessed on: 2019-12-03T20:05:01Z
  definition: This industry subgroup includes companies that process meat and slaughter animals for use in food products.
  notation: 12101011
  valid from: 2014-08-08
  valid till: 2020-10-03
derived from: Animal Production & Process
  type: BicsLevel5Segment
  type: Classifier
  type: ContemporaryDerivation
  derived from: http://data.ga-group.nl/ics/bics/2020/1210101011
  derived from: http://data.ga-group.nl/ics/bics/2024/1210101011
  source accessed on: 2023-07-03T18:11:29Z
  source last accessed on: 2024-06-05T14:42:36Z
  definition: This segment includes companies that raise, process, and/or slaughter animals for use in food products.
  notation: 1210101011
  valid from: 2020-10-03
source accessed on: 2023-07-03T18:11:29Z
source last accessed on: 2024-06-05T14:42:36Z
definition: This segment includes companies that raise, process, and/or slaughter animals for use in food products.
notation: 1210101011
valid from: 2020-10-03

Finfish Farm & Fish Hatcheries
type: BicsLevel7Segment
type: Classifier
type: NamedIndividual
is level7 segment of: Aquaculture
replaces: Finfish Farm & Fish Hatcheries
created with: infer-bics.sql
derived from: Finfish Farm & Fish Hatcheries
  type: BicsLevel6Segment
  type: Classifier
  type: AnachronousDerivation
  derived from: http://data.ga-group.nl/ics/bics/2014/121010121010
  source accessed on: 2019-12-03T20:05:01Z
  source last accessed on: 2019-12-03T20:05:01Z
  definition: This segment includes companies that farm finfish.
  notation: 121010121010
  valid from: 2014-08-08
  valid till: 2020-10-03
derived from: Finfish Farm & Fish Hatcheries
  type: BicsLevel7Segment
  type: Classifier
  type: ContemporaryDerivation
  derived from: http://data.ga-group.nl/ics/bics/2020/12101010121010
  derived from: http://data.ga-group.nl/ics/bics/2024/12101010121010
  source accessed on: 2023-07-03T18:11:29Z
  source last accessed on: 2024-06-05T14:42:36Z
  definition: This segment includes companies that farm finfish.
  notation: 12101010121010
  valid from: 2020-10-03
source accessed on: 2023-07-03T18:11:29Z
source last accessed on: 2024-06-05T14:42:36Z
definition: This segment includes companies that farm finfish.
notation: 12101010121010
valid from: 2020-10-03

Shellfish Farming
type: BicsLevel7Segment
type: Classifier
type: NamedIndividual
is level7 segment of: Aquaculture
replaces: Shellfish Farming
created with: infer-bics.sql
derived from: Shellfish Farming
  type: BicsLevel6Segment
  type: Classifier
  type: AnachronousDerivation
  derived from: http://data.ga-group.nl/ics/bics/2014/121010121011
  source accessed on: 2019-12-03T20:05:01Z
  source last accessed on: 2019-12-03T20:05:01Z
  definition: This segment includes companies that farm shellfish.
  notation: 121010121011
  valid from: 2014-08-08
  valid till: 2020-10-03
derived from: Shellfish Farming
  type: BicsLevel7Segment
  type: Classifier
  type: ContemporaryDerivation
  derived from: http://data.ga-group.nl/ics/bics/2020/12101010121011
  derived from: http://data.ga-group.nl/ics/bics/2024/12101010121011
  source accessed on: 2023-07-03T18:11:29Z
  source last accessed on: 2024-06-05T14:42:36Z
  definition: This segment includes companies that farm shellfish.
  notation: 12101010121011
  valid from: 2020-10-03
source accessed on: 2023-07-03T18:11:29Z
source last accessed on: 2024-06-05T14:42:36Z
definition: This segment includes companies that farm shellfish.
notation: 12101010121011
valid from: 2020-10-03

Aquaculture
type: BicsLevel6Segment
type: Classifier
type: NamedIndividual
is level6 segment of: Aquaculture Fishing
replaces: Aquaculture
created with: infer-bics.sql
derived from: Aquaculture
  type: BicsLevel5Segment
  type: Classifier
  type: AnachronousDerivation
  derived from: http://data.ga-group.nl/ics/bics/2014/1210101210
  source accessed on: 2019-12-03T20:05:01Z
  source last accessed on: 2019-12-03T20:05:01Z
  definition: This segment includes companies that farm aquatic life.
  notation: 1210101210
  valid from: 2014-08-08
  valid till: 2020-10-03
derived from: Aquaculture
  type: BicsLevel6Segment
  type: Classifier
  type: ContemporaryDerivation
  derived from: http://data.ga-group.nl/ics/bics/2020/121010101210
  source accessed on: 2023-07-03T18:11:29Z
  source last accessed on: 2023-07-03T18:11:29Z
  definition: This segment includes companies that farm aquatic products.
  notation: 121010101210
  valid from: 2020-10-03
  valid till: 2024-06-07
derived from: Aquaculture
  type: BicsLevel6Segment
  type: Classifier
  type: ContemporaryDerivation
  derived from: http://data.ga-group.nl/ics/bics/2024/121010101210
  source accessed on: 2024-06-05T14:42:36Z
  source last accessed on: 2024-06-05T14:42:36Z
  definition: This segment includes companies that farm aquatic life.
  notation: 121010101210
  valid from: 2024-06-07
source accessed on: 2023-07-03T18:11:29Z
source last accessed on: 2024-06-05T14:42:36Z
definition: This segment includes companies that farm aquatic life.
notation: 121010101210
valid from: 2020-10-03

Finfish Fishing
type: BicsLevel7Segment
type: Classifier
type: NamedIndividual
is level7 segment of: Fishing
replaces: Finfish Fishing
created with: infer-bics.sql
derived from: Finfish Fishing
  type: BicsLevel6Segment
  type: Classifier
  type: AnachronousDerivation
  derived from: http://data.ga-group.nl/ics/bics/2014/121010121110
  source accessed on: 2019-12-03T20:05:01Z
  source last accessed on: 2019-12-03T20:05:01Z
  definition: This segment includes companies that catch finfish in their natural habitat.
  notation: 121010121110
  valid from: 2014-08-08
  valid till: 2020-10-03
derived from: Finfish Fishing
  type: BicsLevel7Segment
  type: Classifier
  type: ContemporaryDerivation
  derived from: http://data.ga-group.nl/ics/bics/2020/12101010121110
  derived from: http://data.ga-group.nl/ics/bics/2024/12101010121110
  source accessed on: 2023-07-03T18:11:29Z
  source last accessed on: 2024-06-05T14:42:36Z
  definition: This segment includes companies that catch finfish in their natural habitat.
  notation: 12101010121110
  valid from: 2020-10-03
source accessed on: 2023-07-03T18:11:29Z
source last accessed on: 2024-06-05T14:42:36Z
definition: This segment includes companies that catch finfish in their natural habitat.
notation: 12101010121110
valid from: 2020-10-03

Shellfish Fishing
type: BicsLevel7Segment
type: Classifier
type: NamedIndividual
is level7 segment of: Fishing
replaces: Shellfish Fishing
created with: infer-bics.sql
derived from: Shellfish Fishing
  type: BicsLevel6Segment
  type: Classifier
  type: AnachronousDerivation
  derived from: http://data.ga-group.nl/ics/bics/2014/121010121111
  source accessed on: 2019-12-03T20:05:01Z
  source last accessed on: 2019-12-03T20:05:01Z
  definition: This segment includes companies that catch shellfish in their natural habitat.
  notation: 121010121111
  valid from: 2014-08-08
  valid till: 2020-10-03
derived from: Shellfish Fishing
  type: BicsLevel7Segment
  type: Classifier
  type: ContemporaryDerivation
  derived from: http://data.ga-group.nl/ics/bics/2020/12101010121111
  derived from: http://data.ga-group.nl/ics/bics/2024/12101010121111
  source accessed on: 2023-07-03T18:11:29Z
  source last accessed on: 2024-06-05T14:42:36Z
  definition: This segment includes companies that catch shellfish in their natural habitat.
  notation: 12101010121111
  valid from: 2020-10-03
source accessed on: 2023-07-03T18:11:29Z
source last accessed on: 2024-06-05T14:42:36Z
definition: This segment includes companies that catch shellfish in their natural habitat.
notation: 12101010121111
valid from: 2020-10-03

Fishing
type: BicsLevel6Segment
type: Classifier
type: NamedIndividual
is level6 segment of: Aquaculture Fishing
replaces: Fishing
created with: infer-bics.sql
derived from: Fishing
  type: BicsLevel5Segment
  type: Classifier
  type: AnachronousDerivation
  derived from: http://data.ga-group.nl/ics/bics/2014/1210101211
  source accessed on: 2019-12-03T20:05:01Z
  source last accessed on: 2019-12-03T20:05:01Z
  definition: This segment includes companies that fish.
  notation: 1210101211
  valid from: 2014-08-08
  valid till: 2020-10-03
derived from: Fishing
  type: BicsLevel6Segment
  type: Classifier
  type: ContemporaryDerivation
  derived from: http://data.ga-group.nl/ics/bics/2020/121010101211
  source accessed on: 2023-07-03T18:11:29Z
  source last accessed on: 2023-07-03T18:11:29Z
  definition: This segment includes companies that fish aquatic products in their natural habitats.
  notation: 121010101211
  valid from: 2020-10-03
  valid till: 2024-06-07
derived from: Fishing
  type: BicsLevel6Segment
  type: Classifier
  type: ContemporaryDerivation
  derived from: http://data.ga-group.nl/ics/bics/2024/121010101211
  source accessed on: 2024-06-05T14:42:36Z
  source last accessed on: 2024-06-05T14:42:36Z
  definition: This segment includes companies that fish aquatic life in their natural habitats.
  notation: 121010101211
  valid from: 2024-06-07
source accessed on: 2023-07-03T18:11:29Z
source last accessed on: 2024-06-05T14:42:36Z
definition: This segment includes companies that fish aquatic life in their natural habitats.
notation: 121010101211
valid from: 2020-10-03

Aquaculture Fishing
type: BicsLevel5Segment
type: Classifier
type: NamedIndividual
is level5 segment of: Agricultural Producers
created with: infer-bics.sql
derived from: Aquaculture Fishing
  type: BicsLevel4SubIndustry
  type: Classifier
  type: AnachronousDerivation
  derived from: http://data.ga-group.nl/ics/bics/2014/12101012
  source accessed on: 2019-12-03T20:05:01Z
  source last accessed on: 2019-12-03T20:05:01Z
  definition: This industry subgroup includes companies involved in aquaculture and fishing.
  notation: 12101012
  valid from: 2014-08-08
  valid till: 2020-10-03
derived from: Aquaculture Fishing
  type: BicsLevel5Segment
  type: Classifier
  type: ContemporaryDerivation
  derived from: http://data.ga-group.nl/ics/bics/2020/1210101012
  source accessed on: 2023-07-03T18:11:29Z
  source last accessed on: 2023-07-03T18:11:29Z
  definition: This segment includes companies that farm or capture aquatic products.
  notation: 1210101012
  valid from: 2020-10-03
  valid till: 2024-06-07
derived from: Aquaculture Fishing
  type: BicsLevel5Segment
  type: Classifier
  type: ContemporaryDerivation
  derived from: http://data.ga-group.nl/ics/bics/2024/1210101012
  source accessed on: 2024-06-05T14:42:36Z
  source last accessed on: 2024-06-05T14:42:36Z
  definition: This segment includes companies involved in aquaculture and fishing.
  notation: 1210101012
  valid from: 2024-06-07
source accessed on: 2023-07-03T18:11:29Z
source last accessed on: 2024-06-05T14:42:36Z
definition: This segment includes companies involved in aquaculture and fishing.
notation: 1210101012
valid from: 2020-10-03

Cocoa Farming
type: BicsLevel6Segment
type: Classifier
type: NamedIndividual
is level6 segment of: Food Crop Production
replaces: Cocoa Farming
created with: infer-bics.sql
derived from: Cocoa Farming
  type: BicsLevel5Segment
  type: Classifier
  type: AnachronousDerivation
  derived from: http://data.ga-group.nl/ics/bics/2014/1210101310
  source accessed on: 2019-12-03T20:05:01Z
  source last accessed on: 2019-12-03T20:05:01Z
  definition: This segment includes companies that grow cocoa.
  notation: 1210101310
  valid from: 2014-08-08
  valid till: 2020-10-03
derived from: Cocoa Farming
  type: BicsLevel6Segment
  type: Classifier
  type: ContemporaryDerivation
  derived from: http://data.ga-group.nl/ics/bics/2020/121010101310
  derived from: http://data.ga-group.nl/ics/bics/2024/121010101310
  source accessed on: 2023-07-03T18:11:29Z
  source last accessed on: 2024-06-05T14:42:36Z
  definition: This segment includes companies that grow cocoa.
  notation: 121010101310
  valid from: 2020-10-03
source accessed on: 2023-07-03T18:11:29Z
source last accessed on: 2024-06-05T14:42:36Z
definition: This segment includes companies that grow cocoa.
notation: 121010101310
valid from: 2020-10-03

Apple Orchards
type: BicsLevel7Segment
type: Classifier
type: NamedIndividual
is level7 segment of: Fruit Farming
replaces: Apple Orchards
created with: infer-bics.sql
derived from: Apple Orchards
  type: BicsLevel6Segment
  type: Classifier
  type: AnachronousDerivation
  derived from: http://data.ga-group.nl/ics/bics/2014/121010131110
  source accessed on: 2019-12-03T20:05:01Z
  source last accessed on: 2019-12-03T20:05:01Z
  definition: This segment includes companies that grow apples.
  notation: 121010131110
  valid from: 2014-08-08
  valid till: 2020-10-03
derived from: Apple Orchards
  type: BicsLevel7Segment
  type: Classifier
  type: ContemporaryDerivation
  derived from: http://data.ga-group.nl/ics/bics/2020/12101010131110
  derived from: http://data.ga-group.nl/ics/bics/2024/12101010131110
  source accessed on: 2023-07-03T18:11:29Z
  source last accessed on: 2024-06-05T14:42:36Z
  definition: This segment includes companies that grow apples.
  notation: 12101010131110
  valid from: 2020-10-03
source accessed on: 2023-07-03T18:11:29Z
source last accessed on: 2024-06-05T14:42:36Z
definition: This segment includes companies that grow apples.
notation: 12101010131110
valid from: 2020-10-03

Citrus Groves (excl Oranges)
type: BicsLevel7Segment
type: Classifier
type: NamedIndividual
is level7 segment of: Fruit Farming
replaces: Citrus Groves excl Oranges
created with: infer-bics.sql
derived from: Citrus Groves excl Oranges
  type: BicsLevel6Segment
  type: Classifier
  type: AnachronousDerivation
  derived from: http://data.ga-group.nl/ics/bics/2014/121010131111
  source accessed on: 2019-12-03T20:05:01Z
  source last accessed on: 2019-12-03T20:05:01Z
  definition: This segment includes companies that grow citrus fruits other than oranges.
  notation: 121010131111
  valid from: 2014-08-08
  valid till: 2020-10-03
derived from: Citrus Groves (excl Oranges)
  type: BicsLevel7Segment
  type: Classifier
  type: ContemporaryDerivation
  derived from: http://data.ga-group.nl/ics/bics/2020/12101010131111
  derived from: http://data.ga-group.nl/ics/bics/2024/12101010131111
  source accessed on: 2023-07-03T18:11:29Z
  source last accessed on: 2024-06-05T14:42:36Z
  definition: This segment includes companies that grow citrus fruits other than oranges.
  notation: 12101010131111
  valid from: 2020-10-03
source accessed on: 2023-07-03T18:11:29Z
source last accessed on: 2024-06-05T14:42:36Z
definition: This segment includes companies that grow citrus fruits other than oranges.
notation: 12101010131111
valid from: 2020-10-03

Grape Vineyards
type: BicsLevel7Segment
type: Classifier
type: NamedIndividual
is level7 segment of: Fruit Farming
replaces: Grape Vineyards
created with: infer-bics.sql
derived from: Grape Vineyards
  type: BicsLevel6Segment
  type: Classifier
  type: AnachronousDerivation
  derived from: http://data.ga-group.nl/ics/bics/2014/121010131112
  source accessed on: 2019-12-03T20:05:01Z
  source last accessed on: 2019-12-03T20:05:01Z
  definition: This segment includes companies that grow grapes.
  notation: 121010131112
  valid from: 2014-08-08
  valid till: 2020-10-03
derived from: Grape Vineyards
  type: BicsLevel7Segment
  type: Classifier
  type: ContemporaryDerivation
  derived from: http://data.ga-group.nl/ics/bics/2020/12101010131112
  derived from: http://data.ga-group.nl/ics/bics/2024/12101010131112
  source accessed on: 2023-07-03T18:11:29Z
  source last accessed on: 2024-06-05T14:42:36Z
  definition: This segment includes companies that grow grapes.
  notation: 12101010131112
  valid from: 2020-10-03
source accessed on: 2023-07-03T18:11:29Z
source last accessed on: 2024-06-05T14:42:36Z
definition: This segment includes companies that grow grapes.
notation: 12101010131112
valid from: 2020-10-03

Orange Groves
type: BicsLevel7Segment
type: Classifier
type: NamedIndividual
is level7 segment of: Fruit Farming
replaces: Orange Groves
created with: infer-bics.sql
derived from: Orange Groves
  type: BicsLevel6Segment
  type: Classifier
  type: AnachronousDerivation
  derived from: http://data.ga-group.nl/ics/bics/2014/121010131113
  source accessed on: 2019-12-03T20:05:01Z
  source last accessed on: 2019-12-03T20:05:01Z
  definition: This segment includes companies that grow oranges.
  notation: 121010131113
  valid from: 2014-08-08
  valid till: 2020-10-03
derived from: Orange Groves
  type: BicsLevel7Segment
  type: Classifier
  type: ContemporaryDerivation
  derived from: http://data.ga-group.nl/ics/bics/2020/12101010131113
  derived from: http://data.ga-group.nl/ics/bics/2024/12101010131113
  source accessed on: 2023-07-03T18:11:29Z
  source last accessed on: 2024-06-05T14:42:36Z
  definition: This segment includes companies that grow oranges.
  notation: 12101010131113
  valid from: 2020-10-03
source accessed on: 2023-07-03T18:11:29Z
source last accessed on: 2024-06-05T14:42:36Z
definition: This segment includes companies that grow oranges.
notation: 12101010131113
valid from: 2020-10-03

Strawberry Farming
type: BicsLevel7Segment
type: Classifier
type: NamedIndividual
is level7 segment of: Fruit Farming
replaces: Strawberry Farming
created with: infer-bics.sql
derived from: Strawberry Farming
  type: BicsLevel6Segment
  type: Classifier
  type: AnachronousDerivation
  derived from: http://data.ga-group.nl/ics/bics/2014/121010131114
  source accessed on: 2019-12-03T20:05:01Z
  source last accessed on: 2019-12-03T20:05:01Z
  definition: This segment includes companies that grow strawberries.
  notation: 121010131114
  valid from: 2014-08-08
  valid till: 2020-10-03
derived from: Strawberry Farming
  type: BicsLevel7Segment
  type: Classifier
  type: ContemporaryDerivation
  derived from: http://data.ga-group.nl/ics/bics/2020/12101010131114
  derived from: http://data.ga-group.nl/ics/bics/2024/12101010131114
  source accessed on: 2023-07-03T18:11:29Z
  source last accessed on: 2024-06-05T14:42:36Z
  definition: This segment includes companies that grow strawberries.
  notation: 12101010131114
  valid from: 2020-10-03
source accessed on: 2023-07-03T18:11:29Z
source last accessed on: 2024-06-05T14:42:36Z
definition: This segment includes companies that grow strawberries.
notation: 12101010131114
valid from: 2020-10-03

Fruit Farming
type: BicsLevel6Segment
type: Classifier
type: NamedIndividual
is level6 segment of: Food Crop Production
replaces: Fruit Farming
created with: infer-bics.sql
derived from: Fruit Farming
  type: BicsLevel5Segment
  type: Classifier
  type: AnachronousDerivation
  derived from: http://data.ga-group.nl/ics/bics/2014/1210101311
  source accessed on: 2019-12-03T20:05:01Z
  source last accessed on: 2019-12-03T20:05:01Z
  definition: This segment includes companies that grow fruit.
  notation: 1210101311
  valid from: 2014-08-08
  valid till: 2020-10-03
derived from: Fruit Farming
  type: BicsLevel6Segment
  type: Classifier
  type: ContemporaryDerivation
  derived from: http://data.ga-group.nl/ics/bics/2020/121010101311
  derived from: http://data.ga-group.nl/ics/bics/2024/121010101311
  source accessed on: 2023-07-03T18:11:29Z
  source last accessed on: 2024-06-05T14:42:36Z
  definition: This segment includes companies that grow fruit.
  notation: 121010101311
  valid from: 2020-10-03
source accessed on: 2023-07-03T18:11:29Z
source last accessed on: 2024-06-05T14:42:36Z
definition: This segment includes companies that grow fruit.
notation: 121010101311
valid from: 2020-10-03

Corn Farming
type: BicsLevel7Segment
type: Classifier
type: NamedIndividual
is level7 segment of: Grain Farming
replaces: Corn Farming
created with: infer-bics.sql
derived from: Corn Farming
  type: BicsLevel6Segment
  type: Classifier
  type: AnachronousDerivation
  derived from: http://data.ga-group.nl/ics/bics/2014/121010131210
  source accessed on: 2019-12-03T20:05:01Z
  source last accessed on: 2019-12-03T20:05:01Z
  definition: This segment includes companies that grow corn or corn by-products.
  notation: 121010131210
  valid from: 2014-08-08
  valid till: 2020-10-03
derived from: Corn Farming
  type: BicsLevel7Segment
  type: Classifier
  type: ContemporaryDerivation
  derived from: http://data.ga-group.nl/ics/bics/2020/12101010131210
  derived from: http://data.ga-group.nl/ics/bics/2024/12101010131210
  source accessed on: 2023-07-03T18:11:29Z
  source last accessed on: 2024-06-05T14:42:36Z
  definition: This segment includes companies that grow corn.
  notation: 12101010131210
  valid from: 2020-10-03
source accessed on: 2023-07-03T18:11:29Z
source last accessed on: 2024-06-05T14:42:36Z
definition: This segment includes companies that grow corn.
notation: 12101010131210
valid from: 2020-10-03

Rice Farming
type: BicsLevel7Segment
type: Classifier
type: NamedIndividual
is level7 segment of: Grain Farming
replaces: Rice Farming
created with: infer-bics.sql
derived from: Rice Farming
  type: BicsLevel6Segment
  type: Classifier
  type: AnachronousDerivation
  derived from: http://data.ga-group.nl/ics/bics/2014/121010131211
  source accessed on: 2019-12-03T20:05:01Z
  source last accessed on: 2019-12-03T20:05:01Z
  definition: This segment includes companies that grow rice or rice by-products.
  notation: 121010131211
  valid from: 2014-08-08
  valid till: 2020-10-03
derived from: Rice Farming
  type: BicsLevel7Segment
  type: Classifier
  type: ContemporaryDerivation
  derived from: http://data.ga-group.nl/ics/bics/2020/12101010131211
  derived from: http://data.ga-group.nl/ics/bics/2024/12101010131211
  source accessed on: 2023-07-03T18:11:29Z
  source last accessed on: 2024-06-05T14:42:36Z
  definition: This segment includes companies that grow rice.
  notation: 12101010131211
  valid from: 2020-10-03
source accessed on: 2023-07-03T18:11:29Z
source last accessed on: 2024-06-05T14:42:36Z
definition: This segment includes companies that grow rice.
notation: 12101010131211
valid from: 2020-10-03

Wheat Farming
type: BicsLevel7Segment
type: Classifier
type: NamedIndividual
is level7 segment of: Grain Farming
replaces: Wheat Farming
created with: infer-bics.sql
derived from: Wheat Farming
  type: BicsLevel6Segment
  type: Classifier
  type: AnachronousDerivation
  derived from: http://data.ga-group.nl/ics/bics/2014/121010131212
  source accessed on: 2019-12-03T20:05:01Z
  source last accessed on: 2019-12-03T20:05:01Z
  definition: This segment includes companies that grow wheat or wheat by-products.
  notation: 121010131212
  valid from: 2014-08-08
  valid till: 2020-10-03
derived from: Wheat Farming
  type: BicsLevel7Segment
  type: Classifier
  type: ContemporaryDerivation
  derived from: http://data.ga-group.nl/ics/bics/2020/12101010131212
  derived from: http://data.ga-group.nl/ics/bics/2024/12101010131212
  source accessed on: 2023-07-03T18:11:29Z
  source last accessed on: 2024-06-05T14:42:36Z
  definition: This segment includes companies that grow wheat.
  notation: 12101010131212
  valid from: 2020-10-03
source accessed on: 2023-07-03T18:11:29Z
source last accessed on: 2024-06-05T14:42:36Z
definition: This segment includes companies that grow wheat.
notation: 12101010131212
valid from: 2020-10-03

Grain Farming
type: BicsLevel6Segment
type: Classifier
type: NamedIndividual
is level6 segment of: Food Crop Production
replaces: Grain Farming
created with: infer-bics.sql
derived from: Grain Farming
  type: BicsLevel5Segment
  type: Classifier
  type: AnachronousDerivation
  derived from: http://data.ga-group.nl/ics/bics/2014/1210101312
  source accessed on: 2019-12-03T20:05:01Z
  source last accessed on: 2019-12-03T20:05:01Z
  definition: This segment includes companies that grow grains, such as corn, wheat and soybeans.
  notation: 1210101312
  valid from: 2014-08-08
  valid till: 2020-10-03
derived from: Grain Farming
  type: BicsLevel6Segment
  type: Classifier
  type: ContemporaryDerivation
  derived from: http://data.ga-group.nl/ics/bics/2020/121010101312
  derived from: http://data.ga-group.nl/ics/bics/2024/121010101312
  source accessed on: 2023-07-03T18:11:29Z
  source last accessed on: 2024-06-05T14:42:36Z
  definition: This segment includes companies that grow grains, such as corn, wheat, and soybeans.
  notation: 121010101312
  valid from: 2020-10-03
source accessed on: 2023-07-03T18:11:29Z
source last accessed on: 2024-06-05T14:42:36Z
definition: This segment includes companies that grow grains, such as corn, wheat, and soybeans.
notation: 121010101312
valid from: 2020-10-03

Mushroom Production
type: BicsLevel6Segment
type: Classifier
type: NamedIndividual
is level6 segment of: Food Crop Production
replaces: Mushroom Production
created with: infer-bics.sql
derived from: Mushroom Production
  type: BicsLevel5Segment
  type: Classifier
  type: AnachronousDerivation
  derived from: http://data.ga-group.nl/ics/bics/2014/1210101313
  source accessed on: 2019-12-03T20:05:01Z
  source last accessed on: 2019-12-03T20:05:01Z
  definition: This segment includes companies that grow mushrooms in various environments.
  notation: 1210101313
  valid from: 2014-08-08
  valid till: 2020-10-03
derived from: Mushroom Production
  type: BicsLevel6Segment
  type: Classifier
  type: ContemporaryDerivation
  derived from: http://data.ga-group.nl/ics/bics/2020/121010101313
  derived from: http://data.ga-group.nl/ics/bics/2024/121010101313
  source accessed on: 2023-07-03T18:11:29Z
  source last accessed on: 2024-06-05T14:42:36Z
  definition: This segment includes companies that grow mushrooms.
  notation: 121010101313
  valid from: 2020-10-03
source accessed on: 2023-07-03T18:11:29Z
source last accessed on: 2024-06-05T14:42:36Z
definition: This segment includes companies that grow mushrooms.
notation: 121010101313
valid from: 2020-10-03

Palm Oil Farming
type: BicsLevel7Segment
type: Classifier
type: NamedIndividual
is level7 segment of: Oilseed Farming
replaces: Palm Oil Farming
created with: infer-bics.sql
derived from: Palm Oil Farming
  type: BicsLevel6Segment
  type: Classifier
  type: AnachronousDerivation
  derived from: http://data.ga-group.nl/ics/bics/2014/121010131410
  source accessed on: 2019-12-03T20:05:01Z
  source last accessed on: 2019-12-03T20:05:01Z
  definition: This segment includes companies that grow palms for palm oil production.
  notation: 121010131410
  valid from: 2014-08-08
  valid till: 2020-10-03
derived from: Palm Oil Farming
  type: BicsLevel7Segment
  type: Classifier
  type: ContemporaryDerivation
  derived from: http://data.ga-group.nl/ics/bics/2020/12101010131410
  derived from: http://data.ga-group.nl/ics/bics/2024/12101010131410
  source accessed on: 2023-07-03T18:11:29Z
  source last accessed on: 2024-06-05T14:42:36Z
  definition: This segment includes companies that grow palms for palm oil production.
  notation: 12101010131410
  valid from: 2020-10-03
source accessed on: 2023-07-03T18:11:29Z
source last accessed on: 2024-06-05T14:42:36Z
definition: This segment includes companies that grow palms for palm oil production.
notation: 12101010131410
valid from: 2020-10-03

Soybean Farming
type: BicsLevel7Segment
type: Classifier
type: NamedIndividual
is level7 segment of: Oilseed Farming
replaces: Soybean Farming
created with: infer-bics.sql
derived from: Soybean Farming
  type: BicsLevel6Segment
  type: Classifier
  type: AnachronousDerivation
  derived from: http://data.ga-group.nl/ics/bics/2014/121010131411
  source accessed on: 2019-12-03T20:05:01Z
  source last accessed on: 2019-12-03T20:05:01Z
  definition: This segment includes companies that grow soybeans or soybean by-products.
  notation: 121010131411
  valid from: 2014-08-08
  valid till: 2020-10-03
derived from: Soybean Farming
  type: BicsLevel7Segment
  type: Classifier
  type: ContemporaryDerivation
  derived from: http://data.ga-group.nl/ics/bics/2020/12101010131411
  derived from: http://data.ga-group.nl/ics/bics/2024/12101010131411
  source accessed on: 2023-07-03T18:11:29Z
  source last accessed on: 2024-06-05T14:42:36Z
  definition: This segment includes companies that grow soybeans or soybean by-products.
  notation: 12101010131411
  valid from: 2020-10-03
source accessed on: 2023-07-03T18:11:29Z
source last accessed on: 2024-06-05T14:42:36Z
definition: This segment includes companies that grow soybeans or soybean by-products.
notation: 12101010131411
valid from: 2020-10-03

Oilseed Farming
type: BicsLevel6Segment
type: Classifier
type: NamedIndividual
is level6 segment of: Food Crop Production
replaces: Oilseed Farming
created with: infer-bics.sql
derived from: Oilseed Farming
  type: BicsLevel5Segment
  type: Classifier
  type: AnachronousDerivation
  derived from: http://data.ga-group.nl/ics/bics/2014/1210101314
  source accessed on: 2019-12-03T20:05:01Z
  source last accessed on: 2019-12-03T20:05:01Z
  definition: This segment includes companies that grow oilseed-producing plants, such as sunflowers, safflower, flax, cape, canola and sesame.
  notation: 1210101314
  valid from: 2014-08-08
  valid till: 2020-10-03
derived from: Oilseed Farming
  type: BicsLevel6Segment
  type: Classifier
  type: ContemporaryDerivation
  derived from: http://data.ga-group.nl/ics/bics/2020/121010101314
  derived from: http://data.ga-group.nl/ics/bics/2024/121010101314
  source accessed on: 2023-07-03T18:11:29Z
  source last accessed on: 2024-06-05T14:42:36Z
  definition: This segment includes companies that grow oilseed-producing plants, such as sunflowers, safflower, flax, cape, canola, and sesame.
  notation: 121010101314
  valid from: 2020-10-03
source accessed on: 2023-07-03T18:11:29Z
source last accessed on: 2024-06-05T14:42:36Z
definition: This segment includes companies that grow oilseed-producing plants, such as sunflowers, safflower, flax, cape, canola, and sesame.
notation: 121010101314
valid from: 2020-10-03

Sugarcane Farming
type: BicsLevel6Segment
type: Classifier
type: NamedIndividual
is level6 segment of: Food Crop Production
replaces: Sugarcane Farming
created with: infer-bics.sql
derived from: Sugarcane Farming
  type: BicsLevel5Segment
  type: Classifier
  type: AnachronousDerivation
  derived from: http://data.ga-group.nl/ics/bics/2014/1210101315
  source accessed on: 2019-12-03T20:05:01Z
  source last accessed on: 2019-12-03T20:05:01Z
  definition: This segment includes companies that grow sugarcane.
  notation: 1210101315
  valid from: 2014-08-08
  valid till: 2020-10-03
derived from: Sugarcane Farming
  type: BicsLevel6Segment
  type: Classifier
  type: ContemporaryDerivation
  derived from: http://data.ga-group.nl/ics/bics/2020/121010101315
  derived from: http://data.ga-group.nl/ics/bics/2024/121010101315
  source accessed on: 2023-07-03T18:11:29Z
  source last accessed on: 2024-06-05T14:42:36Z
  definition: This segment includes companies that grow sugarcane.
  notation: 121010101315
  valid from: 2020-10-03
source accessed on: 2023-07-03T18:11:29Z
source last accessed on: 2024-06-05T14:42:36Z
definition: This segment includes companies that grow sugarcane.
notation: 121010101315
valid from: 2020-10-03

Tree Nut Farming
type: BicsLevel6Segment
type: Classifier
type: NamedIndividual
is level6 segment of: Food Crop Production
replaces: Tree Nut Farming
created with: infer-bics.sql
derived from: Tree Nut Farming
  type: BicsLevel5Segment
  type: Classifier
  type: AnachronousDerivation
  derived from: http://data.ga-group.nl/ics/bics/2014/1210101316
  source accessed on: 2019-12-03T20:05:01Z
  source last accessed on: 2019-12-03T20:05:01Z
  definition: This segment includes companies that grow tree nuts.
  notation: 1210101316
  valid from: 2014-08-08
  valid till: 2020-10-03
derived from: Tree Nut Farming
  type: BicsLevel6Segment
  type: Classifier
  type: ContemporaryDerivation
  derived from: http://data.ga-group.nl/ics/bics/2020/121010101316
  derived from: http://data.ga-group.nl/ics/bics/2024/121010101316
  source accessed on: 2023-07-03T18:11:29Z
  source last accessed on: 2024-06-05T14:42:36Z
  definition: This segment includes companies that grow tree nuts.
  notation: 121010101316
  valid from: 2020-10-03
source accessed on: 2023-07-03T18:11:29Z
source last accessed on: 2024-06-05T14:42:36Z
definition: This segment includes companies that grow tree nuts.
notation: 121010101316
valid from: 2020-10-03

Vegetable Farming
type: BicsLevel6Segment
type: Classifier
type: NamedIndividual
is level6 segment of: Food Crop Production
replaces: Vegetable Farming
created with: infer-bics.sql
derived from: Vegetable Farming
  type: BicsLevel5Segment
  type: Classifier
  type: AnachronousDerivation
  derived from: http://data.ga-group.nl/ics/bics/2014/1210101317
  source accessed on: 2019-12-03T20:05:01Z
  source last accessed on: 2019-12-03T20:05:01Z
  definition: This segment includes companies that grow vegetables.
  notation: 1210101317
  valid from: 2014-08-08
  valid till: 2020-10-03
derived from: Vegetable Farming
  type: BicsLevel6Segment
  type: Classifier
  type: ContemporaryDerivation
  derived from: http://data.ga-group.nl/ics/bics/2020/121010101317
  derived from: http://data.ga-group.nl/ics/bics/2024/121010101317
  source accessed on: 2023-07-03T18:11:29Z
  source last accessed on: 2024-06-05T14:42:36Z
  definition: This segment includes companies that grow vegetables.
  notation: 121010101317
  valid from: 2020-10-03
source accessed on: 2023-07-03T18:11:29Z
source last accessed on: 2024-06-05T14:42:36Z
definition: This segment includes companies that grow vegetables.
notation: 121010101317
valid from: 2020-10-03

Support Services - Crop Prod
type: BicsLevel6Segment
type: Classifier
type: NamedIndividual
is level6 segment of: Food Crop Production
replaces: Support Services - Crop Prod
created with: infer-bics.sql
derived from: Support Services - Crop Prod
  type: BicsLevel5Segment
  type: Classifier
  type: AnachronousDerivation
  derived from: http://data.ga-group.nl/ics/bics/2014/1210101318
  source accessed on: 2019-12-03T20:05:01Z
  source last accessed on: 2019-12-03T20:05:01Z
  definition: This segment includes companies that support activities (either pre- or post-harvest) for crop production.
  notation: 1210101318
  valid from: 2014-08-08
  valid till: 2020-10-03
derived from: Support Services - Crop Prod
  type: BicsLevel6Segment
  type: Classifier
  type: ContemporaryDerivation
  derived from: http://data.ga-group.nl/ics/bics/2020/121010101318
  derived from: http://data.ga-group.nl/ics/bics/2024/121010101318
  source accessed on: 2023-07-03T18:11:29Z
  source last accessed on: 2024-06-05T14:42:36Z
  definition: This segment includes companies that support activities (either pre or post harvest) for crop production.
  notation: 121010101318
  valid from: 2020-10-03
source accessed on: 2023-07-03T18:11:29Z
source last accessed on: 2024-06-05T14:42:36Z
definition: This segment includes companies that support activities (either pre or post harvest) for crop production.
notation: 121010101318
valid from: 2020-10-03

Coffee Farming
type: BicsLevel6Segment
type: Classifier
type: NamedIndividual
is level6 segment of: Food Crop Production
created with: infer-bics.sql
derived from: Coffee Farming
  type: BicsLevel6Segment
  type: Classifier
  type: ContemporaryDerivation
  derived from: http://data.ga-group.nl/ics/bics/2024/121010101319
  source accessed on: 2024-06-05T14:42:36Z
  source last accessed on: 2024-06-05T14:42:36Z
  definition: This segment includes companies that grow coffee.
  notation: 121010101319
  valid from: 2024-06-07
source accessed on: 2024-06-05T14:42:36Z
source last accessed on: 2024-06-05T14:42:36Z
definition: This segment includes companies that grow coffee.
notation: 121010101319
valid from: 2024-06-07

Food Crop Production
type: BicsLevel5Segment
type: Classifier
type: NamedIndividual
is level5 segment of: Agricultural Producers
created with: infer-bics.sql
derived from: Food Crop Production
  type: BicsLevel4SubIndustry
  type: Classifier
  type: AnachronousDerivation
  derived from: http://data.ga-group.nl/ics/bics/2014/12101013
  source accessed on: 2019-12-03T20:05:01Z
  source last accessed on: 2019-12-03T20:05:01Z
  definition: This industry subgroup includes companies that produce crops for food consumption.
  notation: 12101013
  valid from: 2014-08-08
  valid till: 2020-10-03
derived from: Food Crop Production
  type: BicsLevel5Segment
  type: Classifier
  type: ContemporaryDerivation
  derived from: http://data.ga-group.nl/ics/bics/2020/1210101013
  derived from: http://data.ga-group.nl/ics/bics/2024/1210101013
  source accessed on: 2023-07-03T18:11:29Z
  source last accessed on: 2024-06-05T14:42:36Z
  definition: This segment includes companies that produce crops for food consumption.
  notation: 1210101013
  valid from: 2020-10-03
source accessed on: 2023-07-03T18:11:29Z
source last accessed on: 2024-06-05T14:42:36Z
definition: This segment includes companies that produce crops for food consumption.
notation: 1210101013
valid from: 2020-10-03

Fats & Oil Refining
type: BicsLevel7Segment
type: Classifier
type: NamedIndividual
is level7 segment of: Grain & Oilseed Milling
replaces: Fats & Oil Refining
created with: infer-bics.sql
derived from: Fats & Oil Refining
  type: BicsLevel6Segment
  type: Classifier
  type: AnachronousDerivation
  derived from: http://data.ga-group.nl/ics/bics/2014/121010141010
  source accessed on: 2019-12-03T20:05:01Z
  source last accessed on: 2019-12-03T20:05:01Z
  definition: This segment includes companies that refine cooking oils from purchased fats.
  notation: 121010141010
  valid from: 2014-08-08
  valid till: 2020-10-03
derived from: Fats & Oil Refining
  type: BicsLevel7Segment
  type: Classifier
  type: ContemporaryDerivation
  derived from: http://data.ga-group.nl/ics/bics/2020/12101010141010
  derived from: http://data.ga-group.nl/ics/bics/2024/12101010141010
  source accessed on: 2023-07-03T18:11:29Z
  source last accessed on: 2024-06-05T14:42:36Z
  definition: This segment includes companies that refine cooking oils from purchased fats.
  notation: 12101010141010
  valid from: 2020-10-03
source accessed on: 2023-07-03T18:11:29Z
source last accessed on: 2024-06-05T14:42:36Z
definition: This segment includes companies that refine cooking oils from purchased fats.
notation: 12101010141010
valid from: 2020-10-03

Flour Milling
type: BicsLevel7Segment
type: Classifier
type: NamedIndividual
is level7 segment of: Grain & Oilseed Milling
replaces: Flour Milling
created with: infer-bics.sql
derived from: Flour Milling
  type: BicsLevel6Segment
  type: Classifier
  type: AnachronousDerivation
  derived from: http://data.ga-group.nl/ics/bics/2014/121010141011
  source accessed on: 2019-12-03T20:05:01Z
  source last accessed on: 2019-12-03T20:05:01Z
  definition: This segment includes companies that mill grains into flour used in food products.
  notation: 121010141011
  valid from: 2014-08-08
  valid till: 2020-10-03
derived from: Flour Milling
  type: BicsLevel7Segment
  type: Classifier
  type: ContemporaryDerivation
  derived from: http://data.ga-group.nl/ics/bics/2020/12101010141011
  derived from: http://data.ga-group.nl/ics/bics/2024/12101010141011
  source accessed on: 2023-07-03T18:11:29Z
  source last accessed on: 2024-06-05T14:42:36Z
  definition: This segment includes companies that mill grains into flour used in food products.
  notation: 12101010141011
  valid from: 2020-10-03
source accessed on: 2023-07-03T18:11:29Z
source last accessed on: 2024-06-05T14:42:36Z
definition: This segment includes companies that mill grains into flour used in food products.
notation: 12101010141011
valid from: 2020-10-03

Malt
type: BicsLevel7Segment
type: Classifier
type: NamedIndividual
is level7 segment of: Grain & Oilseed Milling
replaces: Malt
created with: infer-bics.sql
derived from: Malt
  type: BicsLevel6Segment
  type: Classifier
  type: AnachronousDerivation
  derived from: http://data.ga-group.nl/ics/bics/2014/121010141012
  source accessed on: 2019-12-03T20:05:01Z
  source last accessed on: 2019-12-03T20:05:01Z
  definition: This segment includes companies that process grain into malt for wholesale to breweries and distilleries. The companies purchase barley or grow their own barley and use a multi-step process to dry, steep, germinate and kiln the barley into malt.
  notation: 121010141012
  valid from: 2014-08-08
  valid till: 2020-10-03
derived from: Malt
  type: BicsLevel7Segment
  type: Classifier
  type: ContemporaryDerivation
  derived from: http://data.ga-group.nl/ics/bics/2020/12101010141012
  derived from: http://data.ga-group.nl/ics/bics/2024/12101010141012
  source accessed on: 2023-07-03T18:11:29Z
  source last accessed on: 2024-06-05T14:42:36Z
  definition: This segment includes companies that process grains into malt for use in breweries and distilleries. These companies use a multi-step process to dry, steep, germinate, and kiln the grains into malt.
  notation: 12101010141012
  valid from: 2020-10-03
source accessed on: 2023-07-03T18:11:29Z
source last accessed on: 2024-06-05T14:42:36Z
definition: This segment includes companies that process grains into malt for use in breweries and distilleries. These companies use a multi-step process to dry, steep, germinate, and kiln the grains into malt.
notation: 12101010141012
valid from: 2020-10-03

Palm Oil Processing
type: BicsLevel7Segment
type: Classifier
type: NamedIndividual
is level7 segment of: Grain & Oilseed Milling
replaces: Palm Oil Processing
created with: infer-bics.sql
derived from: Palm Oil Processing
  type: BicsLevel6Segment
  type: Classifier
  type: AnachronousDerivation
  derived from: http://data.ga-group.nl/ics/bics/2014/121010141013
  source accessed on: 2019-12-03T20:05:01Z
  source last accessed on: 2019-12-03T20:05:01Z
  definition: This segment includes companies that produce palm oil.
  notation: 121010141013
  valid from: 2014-08-08
  valid till: 2020-10-03
derived from: Palm Oil Processing
  type: BicsLevel7Segment
  type: Classifier
  type: ContemporaryDerivation
  derived from: http://data.ga-group.nl/ics/bics/2020/12101010141013
  derived from: http://data.ga-group.nl/ics/bics/2024/12101010141013
  source accessed on: 2023-07-03T18:11:29Z
  source last accessed on: 2024-06-05T14:42:36Z
  definition: This segment includes companies that produce palm oil.
  notation: 12101010141013
  valid from: 2020-10-03
source accessed on: 2023-07-03T18:11:29Z
source last accessed on: 2024-06-05T14:42:36Z
definition: This segment includes companies that produce palm oil.
notation: 12101010141013
valid from: 2020-10-03

Rice Milling
type: BicsLevel7Segment
type: Classifier
type: NamedIndividual
is level7 segment of: Grain & Oilseed Milling
replaces: Rice Milling
created with: infer-bics.sql
derived from: Rice Milling
  type: BicsLevel6Segment
  type: Classifier
  type: AnachronousDerivation
  derived from: http://data.ga-group.nl/ics/bics/2014/121010141014
  source accessed on: 2019-12-03T20:05:01Z
  source last accessed on: 2019-12-03T20:05:01Z
  definition: This segment includes companies that mill rice, typically using a rice huller that separates the seed from the chaff.
  notation: 121010141014
  valid from: 2014-08-08
  valid till: 2020-10-03
derived from: Rice Milling
  type: BicsLevel7Segment
  type: Classifier
  type: ContemporaryDerivation
  derived from: http://data.ga-group.nl/ics/bics/2020/12101010141014
  derived from: http://data.ga-group.nl/ics/bics/2024/12101010141014
  source accessed on: 2023-07-03T18:11:29Z
  source last accessed on: 2024-06-05T14:42:36Z
  definition: This segment includes companies that process and mill raw rice.
  notation: 12101010141014
  valid from: 2020-10-03
source accessed on: 2023-07-03T18:11:29Z
source last accessed on: 2024-06-05T14:42:36Z
definition: This segment includes companies that process and mill raw rice.
notation: 12101010141014
valid from: 2020-10-03

Soybean Processing
type: BicsLevel7Segment
type: Classifier
type: NamedIndividual
is level7 segment of: Grain & Oilseed Milling
replaces: Soybean Processing
created with: infer-bics.sql
derived from: Soybean Processing
  type: BicsLevel6Segment
  type: Classifier
  type: AnachronousDerivation
  derived from: http://data.ga-group.nl/ics/bics/2014/121010141015
  source accessed on: 2019-12-03T20:05:01Z
  source last accessed on: 2019-12-03T20:05:01Z
  definition: This segment includes companies that process soybeans into tofu, oils, animal feed and other edible forms.
  notation: 121010141015
  valid from: 2014-08-08
  valid till: 2020-10-03
derived from: Soybean Processing
  type: BicsLevel7Segment
  type: Classifier
  type: ContemporaryDerivation
  derived from: http://data.ga-group.nl/ics/bics/2020/12101010141015
  derived from: http://data.ga-group.nl/ics/bics/2024/12101010141015
  source accessed on: 2023-07-03T18:11:29Z
  source last accessed on: 2024-06-05T14:42:36Z
  definition: This segment includes companies that process soybeans into tofu, oils, animal feed, and other edibles.
  notation: 12101010141015
  valid from: 2020-10-03
source accessed on: 2023-07-03T18:11:29Z
source last accessed on: 2024-06-05T14:42:36Z
definition: This segment includes companies that process soybeans into tofu, oils, animal feed, and other edibles.
notation: 12101010141015
valid from: 2020-10-03

Wet Corn Milling
type: BicsLevel7Segment
type: Classifier
type: NamedIndividual
is level7 segment of: Grain & Oilseed Milling
replaces: Wet Corn Milling
created with: infer-bics.sql
derived from: Wet Corn Milling
  type: BicsLevel6Segment
  type: Classifier
  type: AnachronousDerivation
  derived from: http://data.ga-group.nl/ics/bics/2014/121010141016
  source accessed on: 2019-12-03T20:05:01Z
  source last accessed on: 2019-12-03T20:05:01Z
  definition: This segment includes companies that mill wet corn into corn flour.
  notation: 121010141016
  valid from: 2014-08-08
  valid till: 2020-10-03
derived from: Wet Corn Milling
  type: BicsLevel7Segment
  type: Classifier
  type: ContemporaryDerivation
  derived from: http://data.ga-group.nl/ics/bics/2020/12101010141016
  derived from: http://data.ga-group.nl/ics/bics/2024/12101010141016
  source accessed on: 2023-07-03T18:11:29Z
  source last accessed on: 2024-06-05T14:42:36Z
  definition: This segment includes companies that mill wet corn into corn flour.
  notation: 12101010141016
  valid from: 2020-10-03
source accessed on: 2023-07-03T18:11:29Z
source last accessed on: 2024-06-05T14:42:36Z
definition: This segment includes companies that mill wet corn into corn flour.
notation: 12101010141016
valid from: 2020-10-03

Grain & Oilseed Milling
type: BicsLevel6Segment
type: Classifier
type: NamedIndividual
is level6 segment of: Food Crop Processing
replaces: Grain & Oilseed Milling
created with: infer-bics.sql
derived from: Grain & Oilseed Milling
  type: BicsLevel5Segment
  type: Classifier
  type: AnachronousDerivation
  derived from: http://data.ga-group.nl/ics/bics/2014/1210101410
  source accessed on: 2019-12-03T20:05:01Z
  source last accessed on: 2019-12-03T20:05:01Z
  definition: This segment includes companies that grind various grains and produce consumable oils from fruits and vegetables.
  notation: 1210101410
  valid from: 2014-08-08
  valid till: 2020-10-03
derived from: Grain & Oilseed Milling
  type: BicsLevel6Segment
  type: Classifier
  type: ContemporaryDerivation
  derived from: http://data.ga-group.nl/ics/bics/2020/121010101410
  derived from: http://data.ga-group.nl/ics/bics/2024/121010101410
  source accessed on: 2023-07-03T18:11:29Z
  source last accessed on: 2024-06-05T14:42:36Z
  definition: This segment includes companies that grind various grains, and produce consumable oils from fruits and vegetables.
  notation: 121010101410
  valid from: 2020-10-03
source accessed on: 2023-07-03T18:11:29Z
source last accessed on: 2024-06-05T14:42:36Z
definition: This segment includes companies that grind various grains, and produce consumable oils from fruits and vegetables.
notation: 121010101410
valid from: 2020-10-03

Beet Sugar
type: BicsLevel7Segment
type: Classifier
type: NamedIndividual
is level7 segment of: Sugar
replaces: Beet Sugar
created with: infer-bics.sql
derived from: Beet Sugar
  type: BicsLevel6Segment
  type: Classifier
  type: AnachronousDerivation
  derived from: http://data.ga-group.nl/ics/bics/2014/121010141110
  source accessed on: 2019-12-03T20:05:01Z
  source last accessed on: 2019-12-03T20:05:01Z
  definition: This segment includes companies that produce beet sugar.
  notation: 121010141110
  valid from: 2014-08-08
  valid till: 2020-10-03
derived from: Beet Sugar
  type: BicsLevel7Segment
  type: Classifier
  type: ContemporaryDerivation
  derived from: http://data.ga-group.nl/ics/bics/2020/12101010141110
  derived from: http://data.ga-group.nl/ics/bics/2024/12101010141110
  source accessed on: 2023-07-03T18:11:29Z
  source last accessed on: 2024-06-05T14:42:36Z
  definition: This segment includes companies that produce beet sugar.
  notation: 12101010141110
  valid from: 2020-10-03
source accessed on: 2023-07-03T18:11:29Z
source last accessed on: 2024-06-05T14:42:36Z
definition: This segment includes companies that produce beet sugar.
notation: 12101010141110
valid from: 2020-10-03

Cane Sugar Refining
type: BicsLevel7Segment
type: Classifier
type: NamedIndividual
is level7 segment of: Sugar
replaces: Cane Sugar Refining
created with: infer-bics.sql
derived from: Cane Sugar Refining
  type: BicsLevel6Segment
  type: Classifier
  type: AnachronousDerivation
  derived from: http://data.ga-group.nl/ics/bics/2014/121010141111
  source accessed on: 2019-12-03T20:05:01Z
  source last accessed on: 2019-12-03T20:05:01Z
  definition: This segment includes companies that produce sugar products from purchased raw cane sugar.
  notation: 121010141111
  valid from: 2014-08-08
  valid till: 2020-10-03
derived from: Cane Sugar Refining
  type: BicsLevel7Segment
  type: Classifier
  type: ContemporaryDerivation
  derived from: http://data.ga-group.nl/ics/bics/2020/12101010141111
  derived from: http://data.ga-group.nl/ics/bics/2024/12101010141111
  source accessed on: 2023-07-03T18:11:29Z
  source last accessed on: 2024-06-05T14:42:36Z
  definition: This segment includes companies that produce sugar products from purchased raw cane sugar.
  notation: 12101010141111
  valid from: 2020-10-03
source accessed on: 2023-07-03T18:11:29Z
source last accessed on: 2024-06-05T14:42:36Z
definition: This segment includes companies that produce sugar products from purchased raw cane sugar.
notation: 12101010141111
valid from: 2020-10-03

Sugarcane Mills
type: BicsLevel7Segment
type: Classifier
type: NamedIndividual
is level7 segment of: Sugar
replaces: Sugarcane Mills
created with: infer-bics.sql
derived from: Sugarcane Mills
  type: BicsLevel6Segment
  type: Classifier
  type: AnachronousDerivation
  derived from: http://data.ga-group.nl/ics/bics/2014/121010141112
  source accessed on: 2019-12-03T20:05:01Z
  source last accessed on: 2019-12-03T20:05:01Z
  definition: This segment includes companies that produce sugar manufactured in their own sugarcane mills. Such sugar includes brown sugar, white sugar and molasses.
  notation: 121010141112
  valid from: 2014-08-08
  valid till: 2020-10-03
derived from: Sugarcane Mills
  type: BicsLevel7Segment
  type: Classifier
  type: ContemporaryDerivation
  derived from: http://data.ga-group.nl/ics/bics/2020/12101010141112
  derived from: http://data.ga-group.nl/ics/bics/2024/12101010141112
  source accessed on: 2023-07-03T18:11:29Z
  source last accessed on: 2024-06-05T14:42:36Z
  definition: This segment includes companies that produce sugar manufactured by their own sugarcane mills, including brown sugar, white sugar, and molasses.
  notation: 12101010141112
  valid from: 2020-10-03
source accessed on: 2023-07-03T18:11:29Z
source last accessed on: 2024-06-05T14:42:36Z
definition: This segment includes companies that produce sugar manufactured by their own sugarcane mills, including brown sugar, white sugar, and molasses.
notation: 12101010141112
valid from: 2020-10-03

Sugar
type: BicsLevel6Segment
type: Classifier
type: NamedIndividual
is level6 segment of: Food Crop Processing
replaces: Sugar
created with: infer-bics.sql
derived from: Sugar
  type: BicsLevel5Segment
  type: Classifier
  type: AnachronousDerivation
  derived from: http://data.ga-group.nl/ics/bics/2014/1210101411
  source accessed on: 2019-12-03T20:05:01Z
  source last accessed on: 2019-12-03T20:05:01Z
  definition: This segment includes companies that produce sugar in all forms.
  notation: 1210101411
  valid from: 2014-08-08
  valid till: 2020-10-03
derived from: Sugar
  type: BicsLevel6Segment
  type: Classifier
  type: ContemporaryDerivation
  derived from: http://data.ga-group.nl/ics/bics/2020/121010101411
  derived from: http://data.ga-group.nl/ics/bics/2024/121010101411
  source accessed on: 2023-07-03T18:11:29Z
  source last accessed on: 2024-06-05T14:42:36Z
  definition: This segment includes companies that produce sugar in all forms.
  notation: 121010101411
  valid from: 2020-10-03
source accessed on: 2023-07-03T18:11:29Z
source last accessed on: 2024-06-05T14:42:36Z
definition: This segment includes companies that produce sugar in all forms.
notation: 121010101411
valid from: 2020-10-03

Cocoa Processing
type: BicsLevel7Segment
type: Classifier
type: NamedIndividual
is level7 segment of: Cocoa & Coffee Processing
created with: infer-bics.sql
derived from: Cocoa Processing
  type: BicsLevel7Segment
  type: Classifier
  type: ContemporaryDerivation
  derived from: http://data.ga-group.nl/ics/bics/2024/12101010141210
  source accessed on: 2024-06-05T14:42:36Z
  source last accessed on: 2024-06-05T14:42:36Z
  definition: This segment includes companies that process cocoa beans or seeds.
  notation: 12101010141210
  valid from: 2024-06-07
source accessed on: 2024-06-05T14:42:36Z
source last accessed on: 2024-06-05T14:42:36Z
definition: This segment includes companies that process cocoa beans or seeds.
notation: 12101010141210
valid from: 2024-06-07

Coffee Processing
type: BicsLevel7Segment
type: Classifier
type: NamedIndividual
is level7 segment of: Cocoa & Coffee Processing
created with: infer-bics.sql
derived from: Coffee Processing
  type: BicsLevel7Segment
  type: Classifier
  type: ContemporaryDerivation
  derived from: http://data.ga-group.nl/ics/bics/2024/12101010141211
  source accessed on: 2024-06-05T14:42:36Z
  source last accessed on: 2024-06-05T14:42:36Z
  definition: This segment includes companies that process coffee beans or seeds.
  notation: 12101010141211
  valid from: 2024-06-07
source accessed on: 2024-06-05T14:42:36Z
source last accessed on: 2024-06-05T14:42:36Z
definition: This segment includes companies that process coffee beans or seeds.
notation: 12101010141211
valid from: 2024-06-07

Cocoa & Coffee Processing
type: BicsLevel6Segment
type: Classifier
type: NamedIndividual
is level6 segment of: Food Crop Processing
created with: infer-bics.sql
derived from: Cocoa & Coffee Processing
  type: BicsLevel6Segment
  type: Classifier
  type: ContemporaryDerivation
  derived from: http://data.ga-group.nl/ics/bics/2024/121010101412
  source accessed on: 2024-06-05T14:42:36Z
  source last accessed on: 2024-06-05T14:42:36Z
  definition: This segment includes companies that process cocoa and coffee beans or seeds.
  notation: 121010101412
  valid from: 2024-06-07
source accessed on: 2024-06-05T14:42:36Z
source last accessed on: 2024-06-05T14:42:36Z
definition: This segment includes companies that process cocoa and coffee beans or seeds.
notation: 121010101412
valid from: 2024-06-07

Food Crop Processing
type: BicsLevel5Segment
type: Classifier
type: NamedIndividual
is level5 segment of: Agricultural Producers
created with: infer-bics.sql
derived from: Sugar, Grain & Oilseed Mill
  type: BicsLevel4SubIndustry
  type: Classifier
  type: AnachronousDerivation
  derived from: http://data.ga-group.nl/ics/bics/2014/12101014
  source accessed on: 2019-12-03T20:05:01Z
  source last accessed on: 2019-12-03T20:05:01Z
  definition: This industry subgroup includes companies that produce sugar, grind various grains and produce consumable oils from fruits and vegetables.
  notation: 12101014
  valid from: 2014-08-08
  valid till: 2020-10-03
derived from: Sugar, Grain & Oilseed Mill
  type: BicsLevel5Segment
  type: Classifier
  type: ContemporaryDerivation
  derived from: http://data.ga-group.nl/ics/bics/2020/1210101014
  source accessed on: 2023-07-03T18:11:29Z
  source last accessed on: 2023-07-03T18:11:29Z
  definition: This segment includes companies that produce sugar, grind various grains, and produce consumable oils from fruits and vegetables.
  notation: 1210101014
  valid from: 2020-10-03
  valid till: 2024-06-07
derived from: Food Crop Processing
  type: BicsLevel5Segment
  type: Classifier
  type: ContemporaryDerivation
  derived from: http://data.ga-group.nl/ics/bics/2024/1210101014
  source accessed on: 2024-06-05T14:42:36Z
  source last accessed on: 2024-06-05T14:42:36Z
  definition: This segment includes companies that produce consumables from the processing of sugar, grains, seeds, fruits, vegetables, and other plants.
  notation: 1210101014
  valid from: 2024-06-07
source accessed on: 2023-07-03T18:11:29Z
source last accessed on: 2024-06-05T14:42:36Z
definition: This segment includes companies that produce consumables from the processing of sugar, grains, seeds, fruits, vegetables, and other plants.
notation: 1210101014
valid from: 2020-10-03

Agricultural Producers
type: BicsLevel4SubIndustry
type: Classifier
type: NamedIndividual
replaces: Food
created with: infer-bics.sql
derived from: Agricultural Producers
  type: BicsLevel3Industry
  type: Classifier
  type: AnachronousDerivation
  derived from: http://data.ga-group.nl/ics/bics/2014/121010
  source accessed on: 2019-12-03T20:05:01Z
  source last accessed on: 2019-12-03T20:05:01Z
  definition: This industry involves companies that grow crops like fruits, vegetables and grain. Also includes companies that raise, breed and process livestock, such as cattle and poultry, as well as fish or shellfish. Typically, these companies do not market or package their products for retail sales but are suppliers to food manufacturing companies and other commercial customers. Excludes crops not utilized for food consumption purposes, such as ornamental plants, tobacco, cotton or rubber trees.
  notation: 121010
  valid from: 2014-08-08
  valid till: 2020-10-03
derived from: Animal Feed
  type: BicsLevel4SubIndustry
  type: Classifier
  type: ContemporaryDerivation
  derived from: http://data.ga-group.nl/ics/bics/2014/12101010
  source accessed on: 2019-12-03T20:05:01Z
  source last accessed on: 2019-12-03T20:05:01Z
  definition: This industry subgroup includes companies that produce food consumed by farm and other animals.
  notation: 12101010
  valid from: 2014-08-08
  valid till: 2020-10-03
derived from: Agricultural Producers
  type: BicsLevel4SubIndustry
  type: Classifier
  type: ContemporaryDerivation
  derived from: http://data.ga-group.nl/ics/bics/2020/12101010
  derived from: http://data.ga-group.nl/ics/bics/2024/12101010
  source accessed on: 2023-07-03T18:11:29Z
  source last accessed on: 2024-06-05T14:42:36Z
  definition: This industry subgroup includes companies that grow, raise or produce raw crop or animal ingredient for consumption. Typically, these companies do not market or package their products for retail sales but are suppliers to food manufacturing companies and other commercial customers. Excludes crops not utilized for food consumption purposes, such as ornamental plants, tobacco, cotton or rubber trees.
  notation: 12101010
  valid from: 2020-10-03
source accessed on: 2019-12-03T20:05:01Z
source last accessed on: 2024-06-05T14:42:36Z
definition: This industry subgroup includes companies that grow, raise or produce raw crop or animal ingredient for consumption. Typically, these companies do not market or package their products for retail sales but are suppliers to food manufacturing companies and other commercial customers. Excludes crops not utilized for food consumption purposes, such as ornamental plants, tobacco, cotton or rubber trees.
notation: 12101010
valid from: 2014-08-08

Baked Goods
type: BicsLevel6Segment
type: Classifier
type: NamedIndividual
is level6 segment of: Bakery Products
is replaced by: Beef Cattle Ranch & Farming
replaces: Brewers
created with: infer-bics.sql
derived from: Beef Cattle Ranch & Farming
  type: BicsLevel6Segment
  type: Classifier
  type: ContemporaryDerivation
  derived from: http://data.ga-group.nl/ics/bics/2014/121010111010
  source accessed on: 2019-12-03T20:05:01Z
  source last accessed on: 2019-12-03T20:05:01Z
  definition: This segment includes companies that raise cattle for beef.
  notation: 121010111010
  valid from: 2014-08-08
  valid till: 2020-10-03
derived from: Baked Goods
  type: BicsLevel5Segment
  type: Classifier
  type: AnachronousDerivation
  derived from: http://data.ga-group.nl/ics/bics/2014/1210111010
  source accessed on: 2019-12-03T20:05:01Z
  source last accessed on: 2019-12-03T20:05:01Z
  definition: This segment includes companies that produce baked goods, such as bread, biscuits, croutons, doughnuts, pies and pastries.
  notation: 1210111010
  valid from: 2014-08-08
  valid till: 2020-10-03
derived from: Baked Goods
  type: BicsLevel6Segment
  type: Classifier
  type: ContemporaryDerivation
  derived from: http://data.ga-group.nl/ics/bics/2020/121010111010
  source accessed on: 2023-07-03T18:11:29Z
  source last accessed on: 2023-07-03T18:11:29Z
  definition: This segment includes companies that produce fresh baked goods.
  notation: 121010111010
  valid from: 2020-10-03
  valid till: 2024-06-07
derived from: Baked Goods
  type: BicsLevel6Segment
  type: Classifier
  type: ContemporaryDerivation
  derived from: http://data.ga-group.nl/ics/bics/2024/121010111010
  source accessed on: 2024-06-05T14:42:36Z
  source last accessed on: 2024-06-05T14:42:36Z
  definition: This segment includes companies that produce fresh baked goods, such as bread, biscuits, croutons, doughnuts, pies and pastries.
  notation: 121010111010
  valid from: 2024-06-07
source accessed on: 2019-12-03T20:05:01Z
source last accessed on: 2024-06-05T14:42:36Z
definition: This segment includes companies that produce fresh baked goods, such as bread, biscuits, croutons, doughnuts, pies and pastries.
notation: 121010111010
valid from: 2014-08-08

Frozen Cakes & Pastries
type: BicsLevel6Segment
type: Classifier
type: NamedIndividual
is level6 segment of: Bakery Products
is replaced by: Dairy Cattle & Milk Production
replaces: Vintners
created with: infer-bics.sql
derived from: Dairy Cattle & Milk Production
  type: BicsLevel6Segment
  type: Classifier
  type: ContemporaryDerivation
  derived from: http://data.ga-group.nl/ics/bics/2014/121010111011
  source accessed on: 2019-12-03T20:05:01Z
  source last accessed on: 2019-12-03T20:05:01Z
  definition: This segment includes companies that raise and breed dairy cattle as well as companies that produce raw milk.
  notation: 121010111011
  valid from: 2014-08-08
  valid till: 2020-10-03
derived from: Frozen Cakes & Pastries
  type: BicsLevel5Segment
  type: Classifier
  type: AnachronousDerivation
  derived from: http://data.ga-group.nl/ics/bics/2014/1210111012
  source accessed on: 2019-12-03T20:05:01Z
  source last accessed on: 2019-12-03T20:05:01Z
  definition: This segment includes companies that produce cakes, pastries and other baked goods that are frozen for mass distribution.
  notation: 1210111012
  valid from: 2014-08-08
  valid till: 2020-10-03
derived from: Frozen Cakes & Pastries
  type: BicsLevel6Segment
  type: Classifier
  type: ContemporaryDerivation
  derived from: http://data.ga-group.nl/ics/bics/2020/121010111011
  derived from: http://data.ga-group.nl/ics/bics/2024/121010111011
  source accessed on: 2023-07-03T18:11:29Z
  source last accessed on: 2024-06-05T14:42:36Z
  definition: This segment includes companies that produce frozen baked goods.
  notation: 121010111011
  valid from: 2020-10-03
source accessed on: 2019-12-03T20:05:01Z
source last accessed on: 2024-06-05T14:42:36Z
definition: This segment includes companies that produce frozen baked goods.
notation: 121010111011
valid from: 2014-08-08

Bakery Products
type: BicsLevel5Segment
type: Classifier
type: NamedIndividual
is level5 segment of: Packaged Food
is replaced by: Cattle Ranching & Farming
created with: infer-bics.sql
derived from: Cattle Ranching & Farming
  type: BicsLevel5Segment
  type: Classifier
  type: ContemporaryDerivation
  derived from: http://data.ga-group.nl/ics/bics/2014/1210101110
  source accessed on: 2019-12-03T20:05:01Z
  source last accessed on: 2019-12-03T20:05:01Z
  definition: This segment includes companies that raise cattle.
  notation: 1210101110
  valid from: 2014-08-08
  valid till: 2020-10-03
derived from: Bread & Bakery Products
  type: BicsLevel4SubIndustry
  type: Classifier
  type: AnachronousDerivation
  derived from: http://data.ga-group.nl/ics/bics/2014/12101110
  source accessed on: 2019-12-03T20:05:01Z
  source last accessed on: 2019-12-03T20:05:01Z
  definition: This industry subgroup includes companies that provide baked bread goods directly to consumers.
  notation: 12101110
  valid from: 2014-08-08
  valid till: 2020-10-03
derived from: Bakery Products
  type: BicsLevel5Segment
  type: Classifier
  type: ContemporaryDerivation
  derived from: http://data.ga-group.nl/ics/bics/2020/1210101110
  derived from: http://data.ga-group.nl/ics/bics/2024/1210101110
  source accessed on: 2023-07-03T18:11:29Z
  source last accessed on: 2024-06-05T14:42:36Z
  definition: This segment includes companies that provide baked grain products.
  notation: 1210101110
  valid from: 2020-10-03
source accessed on: 2019-12-03T20:05:01Z
source last accessed on: 2024-06-05T14:42:36Z
definition: This segment includes companies that provide baked grain products.
notation: 1210101110
valid from: 2014-08-08

Pasta
type: BicsLevel6Segment
type: Classifier
type: NamedIndividual
is level6 segment of: Pasta, Noodles & Rice
replaces: Dry Pasta
created with: infer-bics.sql
derived from: Dry Pasta
  type: BicsLevel6Segment
  type: Classifier
  type: AnachronousDerivation
  derived from: http://data.ga-group.nl/ics/bics/2014/121011101110
  source accessed on: 2019-12-03T20:05:01Z
  source last accessed on: 2019-12-03T20:05:01Z
  definition: This segment includes companies that produce dry pasta, noodles and spaghetti.
  notation: 121011101110
  valid from: 2014-08-08
  valid till: 2020-10-03
derived from: Pasta
  type: BicsLevel6Segment
  type: Classifier
  type: ContemporaryDerivation
  derived from: http://data.ga-group.nl/ics/bics/2020/121010111110
  derived from: http://data.ga-group.nl/ics/bics/2024/121010111110
  source accessed on: 2023-07-03T18:11:29Z
  source last accessed on: 2024-06-05T14:42:36Z
  definition: This segment includes companies that produce pasta.
  notation: 121010111110
  valid from: 2020-10-03
source accessed on: 2023-07-03T18:11:29Z
source last accessed on: 2024-06-05T14:42:36Z
definition: This segment includes companies that produce pasta.
notation: 121010111110
valid from: 2020-10-03

Noodles
type: BicsLevel6Segment
type: Classifier
type: NamedIndividual
is level6 segment of: Pasta, Noodles & Rice
replaces: Noodles
created with: infer-bics.sql
derived from: Noodles
  type: BicsLevel6Segment
  type: Classifier
  type: AnachronousDerivation
  derived from: http://data.ga-group.nl/ics/bics/2014/121011101112
  source accessed on: 2019-12-03T20:05:01Z
  source last accessed on: 2019-12-03T20:05:01Z
  definition: This segment includes companies that manufacture instant noodles.
  notation: 121011101112
  valid from: 2014-08-08
  valid till: 2020-10-03
derived from: Noodles
  type: BicsLevel6Segment
  type: Classifier
  type: ContemporaryDerivation
  derived from: http://data.ga-group.nl/ics/bics/2020/121010111111
  derived from: http://data.ga-group.nl/ics/bics/2024/121010111111
  source accessed on: 2023-07-03T18:11:29Z
  source last accessed on: 2024-06-05T14:42:36Z
  definition: This segment includes companies that manufacture instant noodles.
  notation: 121010111111
  valid from: 2020-10-03
source accessed on: 2023-07-03T18:11:29Z
source last accessed on: 2024-06-05T14:42:36Z
definition: This segment includes companies that manufacture instant noodles.
notation: 121010111111
valid from: 2020-10-03

Rice
type: BicsLevel6Segment
type: Classifier
type: NamedIndividual
is level6 segment of: Pasta, Noodles & Rice
created with: infer-bics.sql
derived from: Rice
  type: BicsLevel6Segment
  type: Classifier
  type: ContemporaryDerivation
  derived from: http://data.ga-group.nl/ics/bics/2020/121010111112
  derived from: http://data.ga-group.nl/ics/bics/2024/121010111112
  source accessed on: 2023-07-03T18:11:29Z
  source last accessed on: 2024-06-05T14:42:36Z
  definition: This segment includes companies that package rice or produce flavored rice blends, pre-cooked rice products, or rice meals.
  notation: 121010111112
  valid from: 2020-10-03
source accessed on: 2023-07-03T18:11:29Z
source last accessed on: 2024-06-05T14:42:36Z
definition: This segment includes companies that package rice or produce flavored rice blends, pre-cooked rice products, or rice meals.
notation: 121010111112
valid from: 2020-10-03

Pasta, Noodles & Rice
type: BicsLevel5Segment
type: Classifier
type: NamedIndividual
is level5 segment of: Packaged Food
is replaced by: Hog & Pig Farming
replaces: Distillers
created with: infer-bics.sql
derived from: Hog & Pig Farming
  type: BicsLevel5Segment
  type: Classifier
  type: ContemporaryDerivation
  derived from: http://data.ga-group.nl/ics/bics/2014/1210101111
  source accessed on: 2019-12-03T20:05:01Z
  source last accessed on: 2019-12-03T20:05:01Z
  definition: This segment includes companies that raise and breed hogs and pigs.
  notation: 1210101111
  valid from: 2014-08-08
  valid till: 2020-10-03
derived from: Flour Products (Non-Bread)
  type: BicsLevel5Segment
  type: Classifier
  type: AnachronousDerivation
  derived from: http://data.ga-group.nl/ics/bics/2014/1210111011
  source accessed on: 2019-12-03T20:05:01Z
  source last accessed on: 2019-12-03T20:05:01Z
  definition: This segment includes companies that produce flour products other than bread.
  notation: 1210111011
  valid from: 2014-08-08
  valid till: 2020-10-03
derived from: Pasta, Noodles & Rice
  type: BicsLevel5Segment
  type: Classifier
  type: ContemporaryDerivation
  derived from: http://data.ga-group.nl/ics/bics/2020/1210101111
  derived from: http://data.ga-group.nl/ics/bics/2024/1210101111
  source accessed on: 2023-07-03T18:11:29Z
  source last accessed on: 2024-06-05T14:42:36Z
  definition: This segment includes companies that produce pasta, noodles, rice, and other non-baked grain products.
  notation: 1210101111
  valid from: 2020-10-03
source accessed on: 2019-12-03T20:05:01Z
source last accessed on: 2024-06-05T14:42:36Z
definition: This segment includes companies that produce pasta, noodles, rice, and other non-baked grain products.
notation: 1210101111
valid from: 2014-08-08

Sauces, Dressings & Condiments
type: BicsLevel5Segment
type: Classifier
type: NamedIndividual
is level5 segment of: Packaged Food
is replaced by: Poultry Farming
created with: infer-bics.sql
derived from: Poultry Farming
  type: BicsLevel5Segment
  type: Classifier
  type: ContemporaryDerivation
  derived from: http://data.ga-group.nl/ics/bics/2014/1210101112
  source accessed on: 2019-12-03T20:05:01Z
  source last accessed on: 2019-12-03T20:05:01Z
  definition: This segment includes companies that hatch poultry and eggs of various types.
  notation: 1210101112
  valid from: 2014-08-08
  valid till: 2020-10-03
derived from: Condiments
  type: BicsLevel4SubIndustry
  type: Classifier
  type: AnachronousDerivation
  derived from: http://data.ga-group.nl/ics/bics/2014/12101111
  source accessed on: 2019-12-03T20:05:01Z
  source last accessed on: 2019-12-03T20:05:01Z
  definition: This industry subgroup includes companies that manufacture condiments.
  notation: 12101111
  valid from: 2014-08-08
  valid till: 2020-10-03
derived from: Sauces, Dressings & Condiments
  type: BicsLevel5Segment
  type: Classifier
  type: ContemporaryDerivation
  derived from: http://data.ga-group.nl/ics/bics/2020/1210101112
  derived from: http://data.ga-group.nl/ics/bics/2024/1210101112
  source accessed on: 2023-07-03T18:11:29Z
  source last accessed on: 2024-06-05T14:42:36Z
  definition: This segment includes companies that manufacture sauces, dressing, condiments, and other complex mixtures used as a flavor additive.
  notation: 1210101112
  valid from: 2020-10-03
source accessed on: 2019-12-03T20:05:01Z
source last accessed on: 2024-06-05T14:42:36Z
definition: This segment includes companies that manufacture sauces, dressing, condiments, and other complex mixtures used as a flavor additive.
notation: 1210101112
valid from: 2014-08-08

Butter
type: BicsLevel6Segment
type: Classifier
type: NamedIndividual
is level6 segment of: Dairy Products
is replaced by: Meat Processing
replaces: Butter
created with: infer-bics.sql
derived from: Meat Processing
  type: BicsLevel6Segment
  type: Classifier
  type: ContemporaryDerivation
  derived from: http://data.ga-group.nl/ics/bics/2014/121010111310
  source accessed on: 2019-12-03T20:05:01Z
  source last accessed on: 2019-12-03T20:05:01Z
  definition: This segment includes companies that slaughter, dress and process animals.
  notation: 121010111310
  valid from: 2014-08-08
  valid till: 2020-10-03
derived from: Butter
  type: BicsLevel5Segment
  type: Classifier
  type: AnachronousDerivation
  derived from: http://data.ga-group.nl/ics/bics/2014/1210111210
  source accessed on: 2019-12-03T20:05:01Z
  source last accessed on: 2019-12-03T20:05:01Z
  definition: This segment includes companies that produce butter. It does not include companies that produce margarine.
  notation: 1210111210
  valid from: 2014-08-08
  valid till: 2020-10-03
derived from: Butter
  type: BicsLevel6Segment
  type: Classifier
  type: ContemporaryDerivation
  derived from: http://data.ga-group.nl/ics/bics/2020/121010111310
  derived from: http://data.ga-group.nl/ics/bics/2024/121010111310
  source accessed on: 2023-07-03T18:11:29Z
  source last accessed on: 2024-06-05T14:42:36Z
  definition: This segment includes companies that produce butter. Excludes manufacturers of margarine (see Oils & Fats).
  notation: 121010111310
  valid from: 2020-10-03
source accessed on: 2019-12-03T20:05:01Z
source last accessed on: 2024-06-05T14:42:36Z
definition: This segment includes companies that produce butter. Excludes manufacturers of margarine (see Oils & Fats).
notation: 121010111310
valid from: 2014-08-08

Cheese
type: BicsLevel6Segment
type: Classifier
type: NamedIndividual
is level6 segment of: Dairy Products
is replaced by: Poultry Processing
replaces: Cheese
created with: infer-bics.sql
derived from: Poultry Processing
  type: BicsLevel6Segment
  type: Classifier
  type: ContemporaryDerivation
  derived from: http://data.ga-group.nl/ics/bics/2014/121010111311
  source accessed on: 2019-12-03T20:05:01Z
  source last accessed on: 2019-12-03T20:05:01Z
  definition: This segment includes companies that slaughter, dress and process poultry, such as chickens, turkeys, ducks and geese. This includes processing meat for use in lunch and sandwich meats.
  notation: 121010111311
  valid from: 2014-08-08
  valid till: 2020-10-03
derived from: Cheese
  type: BicsLevel5Segment
  type: Classifier
  type: AnachronousDerivation
  derived from: http://data.ga-group.nl/ics/bics/2014/1210111211
  source accessed on: 2019-12-03T20:05:01Z
  source last accessed on: 2019-12-03T20:05:01Z
  definition: This segment includes companies that produce all types of cheese.
  notation: 1210111211
  valid from: 2014-08-08
  valid till: 2020-10-03
derived from: Cheese
  type: BicsLevel6Segment
  type: Classifier
  type: ContemporaryDerivation
  derived from: http://data.ga-group.nl/ics/bics/2020/121010111311
  derived from: http://data.ga-group.nl/ics/bics/2024/121010111311
  source accessed on: 2023-07-03T18:11:29Z
  source last accessed on: 2024-06-05T14:42:36Z
  definition: This segment includes companies that produce all types of cheese.
  notation: 121010111311
  valid from: 2020-10-03
source accessed on: 2019-12-03T20:05:01Z
source last accessed on: 2024-06-05T14:42:36Z
definition: This segment includes companies that produce all types of cheese.
notation: 121010111311
valid from: 2014-08-08

Dry & Condensed Dairy Products
type: BicsLevel6Segment
type: Classifier
type: NamedIndividual
is level6 segment of: Dairy Products
is replaced by: Rendering & Meat Byproducts
replaces: Dry & Condensed Dairy Products
created with: infer-bics.sql
derived from: Rendering & Meat Byproducts
  type: BicsLevel6Segment
  type: Classifier
  type: ContemporaryDerivation
  derived from: http://data.ga-group.nl/ics/bics/2014/121010111312
  source accessed on: 2019-12-03T20:05:01Z
  source last accessed on: 2019-12-03T20:05:01Z
  definition: This segment includes companies that render fats and oils from animals and plants. It includes companies that render grease and lard.
  notation: 121010111312
  valid from: 2014-08-08
  valid till: 2020-10-03
derived from: Dry & Condensed Dairy Products
  type: BicsLevel5Segment
  type: Classifier
  type: AnachronousDerivation
  derived from: http://data.ga-group.nl/ics/bics/2014/1210111212
  source accessed on: 2019-12-03T20:05:01Z
  source last accessed on: 2019-12-03T20:05:01Z
  definition: This segment includes companies that produce dry and condensed dairy, such as powdered milk and dulce de leche.
  notation: 1210111212
  valid from: 2014-08-08
  valid till: 2020-10-03
derived from: Dry & Condensed Dairy Products
  type: BicsLevel6Segment
  type: Classifier
  type: ContemporaryDerivation
  derived from: http://data.ga-group.nl/ics/bics/2020/121010111312
  derived from: http://data.ga-group.nl/ics/bics/2024/121010111312
  source accessed on: 2023-07-03T18:11:29Z
  source last accessed on: 2024-06-05T14:42:36Z
  definition: This segment includes companies that produce dry and condensed dairy, such as powdered milk, canned milk products, and coffee creamers.
  notation: 121010111312
  valid from: 2020-10-03
source accessed on: 2019-12-03T20:05:01Z
source last accessed on: 2024-06-05T14:42:36Z
definition: This segment includes companies that produce dry and condensed dairy, such as powdered milk, canned milk products, and coffee creamers.
notation: 121010111312
valid from: 2014-08-08

Eggs
type: BicsLevel6Segment
type: Classifier
type: NamedIndividual
is level6 segment of: Dairy Products
replaces: Eggs
created with: infer-bics.sql
derived from: Eggs
  type: BicsLevel5Segment
  type: Classifier
  type: AnachronousDerivation
  derived from: http://data.ga-group.nl/ics/bics/2014/1210111213
  source accessed on: 2019-12-03T20:05:01Z
  source last accessed on: 2019-12-03T20:05:01Z
  definition: This segment includes companies that produce poultry eggs.
  notation: 1210111213
  valid from: 2014-08-08
  valid till: 2020-10-03
derived from: Eggs
  type: BicsLevel6Segment
  type: Classifier
  type: ContemporaryDerivation
  derived from: http://data.ga-group.nl/ics/bics/2020/121010111313
  derived from: http://data.ga-group.nl/ics/bics/2024/121010111313
  source accessed on: 2023-07-03T18:11:29Z
  source last accessed on: 2024-06-05T14:42:36Z
  definition: This segment includes companies that produce poultry eggs.
  notation: 121010111313
  valid from: 2020-10-03
source accessed on: 2023-07-03T18:11:29Z
source last accessed on: 2024-06-05T14:42:36Z
definition: This segment includes companies that produce poultry eggs.
notation: 121010111313
valid from: 2020-10-03

Milk
type: BicsLevel6Segment
type: Classifier
type: NamedIndividual
is level6 segment of: Dairy Products
replaces: Fluid Milk
created with: infer-bics.sql
derived from: Fluid Milk
  type: BicsLevel5Segment
  type: Classifier
  type: AnachronousDerivation
  derived from: http://data.ga-group.nl/ics/bics/2014/1210111214
  source accessed on: 2019-12-03T20:05:01Z
  source last accessed on: 2019-12-03T20:05:01Z
  definition: This segment includes companies that produce milk, non-frozen yogurt, cream, buttermilk and cottage cheese. It does not include companies that produce soy-based products.
  notation: 1210111214
  valid from: 2014-08-08
  valid till: 2020-10-03
derived from: Milk
  type: BicsLevel6Segment
  type: Classifier
  type: ContemporaryDerivation
  derived from: http://data.ga-group.nl/ics/bics/2020/121010111314
  derived from: http://data.ga-group.nl/ics/bics/2024/121010111314
  source accessed on: 2023-07-03T18:11:29Z
  source last accessed on: 2024-06-05T14:42:36Z
  definition: This segment includes companies that produce milk. Excludes yogurt beverages, flavored milk beverages, non-dairy milk alternatives, and dry or condensed milk. (See Non-Alcoholic Beverages).
  notation: 121010111314
  valid from: 2020-10-03
source accessed on: 2023-07-03T18:11:29Z
source last accessed on: 2024-06-05T14:42:36Z
definition: This segment includes companies that produce milk. Excludes yogurt beverages, flavored milk beverages, non-dairy milk alternatives, and dry or condensed milk. (See Non-Alcoholic Beverages).
notation: 121010111314
valid from: 2020-10-03

Ice Cream
type: BicsLevel6Segment
type: Classifier
type: NamedIndividual
is level6 segment of: Dairy Products
replaces: Ice Cream
created with: infer-bics.sql
derived from: Ice Cream
  type: BicsLevel5Segment
  type: Classifier
  type: AnachronousDerivation
  derived from: http://data.ga-group.nl/ics/bics/2014/1210111215
  source accessed on: 2019-12-03T20:05:01Z
  source last accessed on: 2019-12-03T20:05:01Z
  definition: This segment includes companies that produce ice cream, sherbet, frozen yogurt, custard and any other frozen desserts.
  notation: 1210111215
  valid from: 2014-08-08
  valid till: 2020-10-03
derived from: Ice Cream
  type: BicsLevel6Segment
  type: Classifier
  type: ContemporaryDerivation
  derived from: http://data.ga-group.nl/ics/bics/2020/121010111315
  derived from: http://data.ga-group.nl/ics/bics/2024/121010111315
  source accessed on: 2023-07-03T18:11:29Z
  source last accessed on: 2024-06-05T14:42:36Z
  definition: This segment includes companies that produce ice cream, sherbet, frozen yogurt, custard, and any other frozen desserts.
  notation: 121010111315
  valid from: 2020-10-03
source accessed on: 2023-07-03T18:11:29Z
source last accessed on: 2024-06-05T14:42:36Z
definition: This segment includes companies that produce ice cream, sherbet, frozen yogurt, custard, and any other frozen desserts.
notation: 121010111315
valid from: 2020-10-03

Dairy Products
type: BicsLevel5Segment
type: Classifier
type: NamedIndividual
is level5 segment of: Packaged Food
is replaced by: Animal Processing
created with: infer-bics.sql
derived from: Animal Processing
  type: BicsLevel5Segment
  type: Classifier
  type: ContemporaryDerivation
  derived from: http://data.ga-group.nl/ics/bics/2014/1210101113
  source accessed on: 2019-12-03T20:05:01Z
  source last accessed on: 2019-12-03T20:05:01Z
  definition: This segment includes companies that are involved in animal processing.
  notation: 1210101113
  valid from: 2014-08-08
  valid till: 2020-10-03
derived from: Dairy & Egg Products
  type: BicsLevel4SubIndustry
  type: Classifier
  type: AnachronousDerivation
  derived from: http://data.ga-group.nl/ics/bics/2014/12101112
  source accessed on: 2019-12-03T20:05:01Z
  source last accessed on: 2019-12-03T20:05:01Z
  definition: This industry subgroup includes companies that process dairy products.
  notation: 12101112
  valid from: 2014-08-08
  valid till: 2020-10-03
derived from: Dairy Products
  type: BicsLevel5Segment
  type: Classifier
  type: ContemporaryDerivation
  derived from: http://data.ga-group.nl/ics/bics/2020/1210101113
  derived from: http://data.ga-group.nl/ics/bics/2024/1210101113
  source accessed on: 2023-07-03T18:11:29Z
  source last accessed on: 2024-06-05T14:42:36Z
  definition: This segment includes companies that process dairy based products. Also includes companies that produce poultry eggs.
  notation: 1210101113
  valid from: 2020-10-03
source accessed on: 2019-12-03T20:05:01Z
source last accessed on: 2024-06-05T14:42:36Z
definition: This segment includes companies that process dairy based products. Also includes companies that produce poultry eggs.
notation: 1210101113
valid from: 2014-08-08

Flour Mixes & Dough
type: BicsLevel6Segment
type: Classifier
type: NamedIndividual
is level6 segment of: Food Ingredients
replaces: Flour Mixes & Dough
created with: infer-bics.sql
derived from: Flour Mixes & Dough
  type: BicsLevel6Segment
  type: Classifier
  type: AnachronousDerivation
  derived from: http://data.ga-group.nl/ics/bics/2014/121011101111
  source accessed on: 2019-12-03T20:05:01Z
  source last accessed on: 2019-12-03T20:05:01Z
  definition: This segment includes companies that produce, or mixes raw flour and dough.
  notation: 121011101111
  valid from: 2014-08-08
  valid till: 2020-10-03
derived from: Flour Mixes & Dough
  type: BicsLevel6Segment
  type: Classifier
  type: ContemporaryDerivation
  derived from: http://data.ga-group.nl/ics/bics/2020/121010111410
  derived from: http://data.ga-group.nl/ics/bics/2024/121010111410
  source accessed on: 2023-07-03T18:11:29Z
  source last accessed on: 2024-06-05T14:42:36Z
  definition: This segment includes companies that produce flour mixes and dough.
  notation: 121010111410
  valid from: 2020-10-03
source accessed on: 2023-07-03T18:11:29Z
source last accessed on: 2024-06-05T14:42:36Z
definition: This segment includes companies that produce flour mixes and dough.
notation: 121010111410
valid from: 2020-10-03

Syrup, Sugar & Sweeteners
type: BicsLevel6Segment
type: Classifier
type: NamedIndividual
is level6 segment of: Food Ingredients
replaces: Coffee
created with: infer-bics.sql
derived from: Flavoring Syrup & Concentrate
  type: BicsLevel5Segment
  type: Classifier
  type: AnachronousDerivation
  derived from: http://data.ga-group.nl/ics/bics/2014/1210111110
  source accessed on: 2019-12-03T20:05:01Z
  source last accessed on: 2019-12-03T20:05:01Z
  definition: This segment includes companies that produce syrup drink concentrates that are used in fountain drinks or soft drinks.
  notation: 1210111110
  valid from: 2014-08-08
  valid till: 2020-10-03
derived from: Syrup, Sugar & Sweeteners
  type: BicsLevel6Segment
  type: Classifier
  type: ContemporaryDerivation
  derived from: http://data.ga-group.nl/ics/bics/2020/121010111411
  derived from: http://data.ga-group.nl/ics/bics/2024/121010111411
  source accessed on: 2023-07-03T18:11:29Z
  source last accessed on: 2024-06-05T14:42:36Z
  definition: This segment includes companies that produce natural or artificial sweeteners in solid or syrup form.
  notation: 121010111411
  valid from: 2020-10-03
source accessed on: 2023-07-03T18:11:29Z
source last accessed on: 2024-06-05T14:42:36Z
definition: This segment includes companies that produce natural or artificial sweeteners in solid or syrup form.
notation: 121010111411
valid from: 2020-10-03

Spices, Extracts & Flavorings
type: BicsLevel6Segment
type: Classifier
type: NamedIndividual
is level6 segment of: Food Ingredients
replaces: Bottled Water
created with: infer-bics.sql
derived from: Spice & Extract
  type: BicsLevel5Segment
  type: Classifier
  type: AnachronousDerivation
  derived from: http://data.ga-group.nl/ics/bics/2014/1210111112
  source accessed on: 2019-12-03T20:05:01Z
  source last accessed on: 2019-12-03T20:05:01Z
  definition: This segment includes companies that produce spices, salt and seasonings.
  notation: 1210111112
  valid from: 2014-08-08
  valid till: 2020-10-03
derived from: Spices, Extracts & Flavorings
  type: BicsLevel6Segment
  type: Classifier
  type: ContemporaryDerivation
  derived from: http://data.ga-group.nl/ics/bics/2020/121010111412
  derived from: http://data.ga-group.nl/ics/bics/2024/121010111412
  source accessed on: 2023-07-03T18:11:29Z
  source last accessed on: 2024-06-05T14:42:36Z
  definition: This segment includes companies that produce spices, salt, or liquid flavor extracts.
  notation: 121010111412
  valid from: 2020-10-03
source accessed on: 2023-07-03T18:11:29Z
source last accessed on: 2024-06-05T14:42:36Z
definition: This segment includes companies that produce spices, salt, or liquid flavor extracts.
notation: 121010111412
valid from: 2020-10-03

Oils & Fats
type: BicsLevel6Segment
type: Classifier
type: NamedIndividual
is level6 segment of: Food Ingredients
created with: infer-bics.sql
derived from: Oils & Fats
  type: BicsLevel6Segment
  type: Classifier
  type: ContemporaryDerivation
  derived from: http://data.ga-group.nl/ics/bics/2020/121010111413
  derived from: http://data.ga-group.nl/ics/bics/2024/121010111413
  source accessed on: 2023-07-03T18:11:29Z
  source last accessed on: 2024-06-05T14:42:36Z
  definition: This segment includes companies that produce solid or liquid cooking oils, fats, and margarine.
  notation: 121010111413
  valid from: 2020-10-03
source accessed on: 2023-07-03T18:11:29Z
source last accessed on: 2024-06-05T14:42:36Z
definition: This segment includes companies that produce solid or liquid cooking oils, fats, and margarine.
notation: 121010111413
valid from: 2020-10-03

Food Ingredients
type: BicsLevel5Segment
type: Classifier
type: NamedIndividual
is level5 segment of: Packaged Food
created with: infer-bics.sql
derived from: Food Ingredients
  type: BicsLevel4SubIndustry
  type: Classifier
  type: AnachronousDerivation
  derived from: http://data.ga-group.nl/ics/bics/2014/12101113
  source accessed on: 2019-12-03T20:05:01Z
  source last accessed on: 2019-12-03T20:05:01Z
  definition: This industry subgroup includes companies that manufacture and produce basic food ingredients. Includes food ingredients (both natural and artificial), food additives (both natural and artificial) and color additives (both natural and artificial).
  notation: 12101113
  valid from: 2014-08-08
  valid till: 2020-10-03
derived from: Food Ingredients
  type: BicsLevel5Segment
  type: Classifier
  type: ContemporaryDerivation
  derived from: http://data.ga-group.nl/ics/bics/2020/1210101114
  derived from: http://data.ga-group.nl/ics/bics/2024/1210101114
  source accessed on: 2023-07-03T18:11:29Z
  source last accessed on: 2024-06-05T14:42:36Z
  definition: This segment includes companies that manufacture and produce basic, natural, or artificial consumer facing food ingredients. Excludes additives primarily used by food processing companies (see Food Additives).
  notation: 1210101114
  valid from: 2020-10-03
source accessed on: 2023-07-03T18:11:29Z
source last accessed on: 2024-06-05T14:42:36Z
definition: This segment includes companies that manufacture and produce basic, natural, or artificial consumer facing food ingredients. Excludes additives primarily used by food processing companies (see Food Additives).
notation: 1210101114
valid from: 2020-10-03

Fruit & Vegetable Canning
type: BicsLevel7Segment
type: Classifier
type: NamedIndividual
is level7 segment of: Canned Food
replaces: Fruit & Vegetable Canning
created with: infer-bics.sql
derived from: Fruit & Vegetable Canning
  type: BicsLevel6Segment
  type: Classifier
  type: AnachronousDerivation
  derived from: http://data.ga-group.nl/ics/bics/2014/121011141010
  source accessed on: 2019-12-03T20:05:01Z
  source last accessed on: 2019-12-03T20:05:01Z
  definition: This segment includes companies that can fruit and vegetable products.
  notation: 121011141010
  valid from: 2014-08-08
  valid till: 2020-10-03
derived from: Fruit & Vegetable Canning
  type: BicsLevel7Segment
  type: Classifier
  type: ContemporaryDerivation
  derived from: http://data.ga-group.nl/ics/bics/2020/12101011151010
  derived from: http://data.ga-group.nl/ics/bics/2024/12101011151010
  source accessed on: 2023-07-03T18:11:29Z
  source last accessed on: 2024-06-05T14:42:36Z
  definition: This segment includes companies that can fruit and vegetable products.
  notation: 12101011151010
  valid from: 2020-10-03
source accessed on: 2023-07-03T18:11:29Z
source last accessed on: 2024-06-05T14:42:36Z
definition: This segment includes companies that can fruit and vegetable products.
notation: 12101011151010
valid from: 2020-10-03

Specialty Canning
type: BicsLevel7Segment
type: Classifier
type: NamedIndividual
is level7 segment of: Canned Food
replaces: Specialty Canning
created with: infer-bics.sql
derived from: Specialty Canning
  type: BicsLevel6Segment
  type: Classifier
  type: AnachronousDerivation
  derived from: http://data.ga-group.nl/ics/bics/2014/121011141011
  source accessed on: 2019-12-03T20:05:01Z
  source last accessed on: 2019-12-03T20:05:01Z
  definition: This segment includes companies that can products, excluding fruits and vegetables.
  notation: 121011141011
  valid from: 2014-08-08
  valid till: 2020-10-03
derived from: Specialty Canning
  type: BicsLevel7Segment
  type: Classifier
  type: ContemporaryDerivation
  derived from: http://data.ga-group.nl/ics/bics/2020/12101011151011
  derived from: http://data.ga-group.nl/ics/bics/2024/12101011151011
  source accessed on: 2023-07-03T18:11:29Z
  source last accessed on: 2024-06-05T14:42:36Z
  definition: This segment includes companies that can complex food products such as soups and meal dishes.
  notation: 12101011151011
  valid from: 2020-10-03
source accessed on: 2023-07-03T18:11:29Z
source last accessed on: 2024-06-05T14:42:36Z
definition: This segment includes companies that can complex food products such as soups and meal dishes.
notation: 12101011151011
valid from: 2020-10-03

Canned Food
type: BicsLevel6Segment
type: Classifier
type: NamedIndividual
is level6 segment of: Frozen, Canned & Perish Food
replaces: Canned Food
created with: infer-bics.sql
derived from: Canned Food
  type: BicsLevel5Segment
  type: Classifier
  type: AnachronousDerivation
  derived from: http://data.ga-group.nl/ics/bics/2014/1210111410
  source accessed on: 2019-12-03T20:05:01Z
  source last accessed on: 2019-12-03T20:05:01Z
  definition: This segment includes companies that can fruits, vegetables and other food products excluding seafood.
  notation: 1210111410
  valid from: 2014-08-08
  valid till: 2020-10-03
derived from: Canned Food
  type: BicsLevel6Segment
  type: Classifier
  type: ContemporaryDerivation
  derived from: http://data.ga-group.nl/ics/bics/2020/121010111510
  derived from: http://data.ga-group.nl/ics/bics/2024/121010111510
  source accessed on: 2023-07-03T18:11:29Z
  source last accessed on: 2024-06-05T14:42:36Z
  definition: This segment includes companies that can fruits, vegetables, and soups. Excludes canned seafood (see Seafood Canning).
  notation: 121010111510
  valid from: 2020-10-03
source accessed on: 2023-07-03T18:11:29Z
source last accessed on: 2024-06-05T14:42:36Z
definition: This segment includes companies that can fruits, vegetables, and soups. Excludes canned seafood (see Seafood Canning).
notation: 121010111510
valid from: 2020-10-03

Dried & Dehydrated Food
type: BicsLevel6Segment
type: Classifier
type: NamedIndividual
is level6 segment of: Frozen, Canned & Perish Food
replaces: Dried & Dehydrated Food
created with: infer-bics.sql
derived from: Dried & Dehydrated Food
  type: BicsLevel5Segment
  type: Classifier
  type: AnachronousDerivation
  derived from: http://data.ga-group.nl/ics/bics/2014/1210111411
  source accessed on: 2019-12-03T20:05:01Z
  source last accessed on: 2019-12-03T20:05:01Z
  definition: This segment includes companies that produce dried fruits, vegetables and other food products, such as dried figs, dates, apricots, raisins and prunes.
  notation: 1210111411
  valid from: 2014-08-08
  valid till: 2020-10-03
derived from: Dried & Dehydrated Food
  type: BicsLevel6Segment
  type: Classifier
  type: ContemporaryDerivation
  derived from: http://data.ga-group.nl/ics/bics/2020/121010111511
  derived from: http://data.ga-group.nl/ics/bics/2024/121010111511
  source accessed on: 2023-07-03T18:11:29Z
  source last accessed on: 2024-06-05T14:42:36Z
  definition: This segment includes companies that produce dried fruit and vegetable products, such as dried figs, dates, apricots, raisins, and prunes.
  notation: 121010111511
  valid from: 2020-10-03
source accessed on: 2023-07-03T18:11:29Z
source last accessed on: 2024-06-05T14:42:36Z
definition: This segment includes companies that produce dried fruit and vegetable products, such as dried figs, dates, apricots, raisins, and prunes.
notation: 121010111511
valid from: 2020-10-03

Frozen Fruit & Vegetable
type: BicsLevel7Segment
type: Classifier
type: NamedIndividual
is level7 segment of: Frozen Food
replaces: Frozen Fruit, Juice & Vegetable
created with: infer-bics.sql
derived from: Frozen Fruit, Juice & Vegetable
  type: BicsLevel6Segment
  type: Classifier
  type: AnachronousDerivation
  derived from: http://data.ga-group.nl/ics/bics/2014/121011141210
  source accessed on: 2019-12-03T20:05:01Z
  source last accessed on: 2019-12-03T20:05:01Z
  definition: This segment includes companies that produce frozen fruit, vegetables and concentrated juices.
  notation: 121011141210
  valid from: 2014-08-08
  valid till: 2020-10-03
derived from: Frozen Fruit & Vegetable
  type: BicsLevel7Segment
  type: Classifier
  type: ContemporaryDerivation
  derived from: http://data.ga-group.nl/ics/bics/2020/12101011151210
  derived from: http://data.ga-group.nl/ics/bics/2024/12101011151210
  source accessed on: 2023-07-03T18:11:29Z
  source last accessed on: 2024-06-05T14:42:36Z
  definition: This segment includes companies that produce frozen fruits, vegetables, or concentrated juices.
  notation: 12101011151210
  valid from: 2020-10-03
source accessed on: 2023-07-03T18:11:29Z
source last accessed on: 2024-06-05T14:42:36Z
definition: This segment includes companies that produce frozen fruits, vegetables, or concentrated juices.
notation: 12101011151210
valid from: 2020-10-03

Frozen Specialty Food
type: BicsLevel7Segment
type: Classifier
type: NamedIndividual
is level7 segment of: Frozen Food
replaces: Frozen Specialty Food
created with: infer-bics.sql
derived from: Frozen Specialty Food
  type: BicsLevel6Segment
  type: Classifier
  type: AnachronousDerivation
  derived from: http://data.ga-group.nl/ics/bics/2014/121011141211
  source accessed on: 2019-12-03T20:05:01Z
  source last accessed on: 2019-12-03T20:05:01Z
  definition: This segment includes companies that produce other frozen specialty foods, such as dinners, noodles and microwave dishes.
  notation: 121011141211
  valid from: 2014-08-08
  valid till: 2020-10-03
derived from: Frozen Specialty Food
  type: BicsLevel7Segment
  type: Classifier
  type: ContemporaryDerivation
  derived from: http://data.ga-group.nl/ics/bics/2020/12101011151211
  derived from: http://data.ga-group.nl/ics/bics/2024/12101011151211
  source accessed on: 2023-07-03T18:11:29Z
  source last accessed on: 2024-06-05T14:42:36Z
  definition: This segment includes companies that produce other frozen specialty foods, such as dinners, noodles, and microwave dishes.
  notation: 12101011151211
  valid from: 2020-10-03
source accessed on: 2023-07-03T18:11:29Z
source last accessed on: 2024-06-05T14:42:36Z
definition: This segment includes companies that produce other frozen specialty foods, such as dinners, noodles, and microwave dishes.
notation: 12101011151211
valid from: 2020-10-03

Frozen Food
type: BicsLevel6Segment
type: Classifier
type: NamedIndividual
is level6 segment of: Frozen, Canned & Perish Food
replaces: Frozen Food
created with: infer-bics.sql
derived from: Frozen Food
  type: BicsLevel5Segment
  type: Classifier
  type: AnachronousDerivation
  derived from: http://data.ga-group.nl/ics/bics/2014/1210111412
  source accessed on: 2019-12-03T20:05:01Z
  source last accessed on: 2019-12-03T20:05:01Z
  definition: This segment includes companies that produce frozen, packaged food products.
  notation: 1210111412
  valid from: 2014-08-08
  valid till: 2020-10-03
derived from: Frozen Food
  type: BicsLevel6Segment
  type: Classifier
  type: ContemporaryDerivation
  derived from: http://data.ga-group.nl/ics/bics/2020/121010111512
  derived from: http://data.ga-group.nl/ics/bics/2024/121010111512
  source accessed on: 2023-07-03T18:11:29Z
  source last accessed on: 2024-06-05T14:42:36Z
  definition: This segment includes companies that produce frozen, packaged food products.
  notation: 121010111512
  valid from: 2020-10-03
source accessed on: 2023-07-03T18:11:29Z
source last accessed on: 2024-06-05T14:42:36Z
definition: This segment includes companies that produce frozen, packaged food products.
notation: 121010111512
valid from: 2020-10-03

Perishable Prepared Food
type: BicsLevel6Segment
type: Classifier
type: NamedIndividual
is level6 segment of: Frozen, Canned & Perish Food
replaces: Perishable Prepared Food
created with: infer-bics.sql
derived from: Perishable Prepared Food
  type: BicsLevel5Segment
  type: Classifier
  type: AnachronousDerivation
  derived from: http://data.ga-group.nl/ics/bics/2014/1210111413
  source accessed on: 2019-12-03T20:05:01Z
  source last accessed on: 2019-12-03T20:05:01Z
  definition: This segment includes companies that prepare and package perishable foods, such as salads, pizza, macaroni and boxed lunches. This does not include companies that produce frozen or microwave meals.
  notation: 1210111413
  valid from: 2014-08-08
  valid till: 2020-10-03
derived from: Perishable Prepared Food
  type: BicsLevel6Segment
  type: Classifier
  type: ContemporaryDerivation
  derived from: http://data.ga-group.nl/ics/bics/2020/121010111513
  derived from: http://data.ga-group.nl/ics/bics/2024/121010111513
  source accessed on: 2023-07-03T18:11:29Z
  source last accessed on: 2024-06-05T14:42:36Z
  definition: This segment includes companies that prepare and package perishable foods, primarily pre-made meals. This does not include companies that produce frozen or microwave meals.
  notation: 121010111513
  valid from: 2020-10-03
source accessed on: 2023-07-03T18:11:29Z
source last accessed on: 2024-06-05T14:42:36Z
definition: This segment includes companies that prepare and package perishable foods, primarily pre-made meals. This does not include companies that produce frozen or microwave meals.
notation: 121010111513
valid from: 2020-10-03

Fresh & Frozen Seafood Process
type: BicsLevel7Segment
type: Classifier
type: NamedIndividual
is level7 segment of: Seafood Products Prep & Pkg
replaces: Fresh & Frozen Seafood Process
created with: infer-bics.sql
derived from: Fresh & Frozen Seafood Process
  type: BicsLevel6Segment
  type: Classifier
  type: AnachronousDerivation
  derived from: http://data.ga-group.nl/ics/bics/2014/121011141410
  source accessed on: 2019-12-03T20:05:01Z
  source last accessed on: 2019-12-03T20:05:01Z
  definition: This segment includes companies that prepare and package fresh and frozen seafood products.
  notation: 121011141410
  valid from: 2014-08-08
  valid till: 2020-10-03
derived from: Fresh & Frozen Seafood Process
  type: BicsLevel7Segment
  type: Classifier
  type: ContemporaryDerivation
  derived from: http://data.ga-group.nl/ics/bics/2020/12101011151410
  derived from: http://data.ga-group.nl/ics/bics/2024/12101011151410
  source accessed on: 2023-07-03T18:11:29Z
  source last accessed on: 2024-06-05T14:42:36Z
  definition: This segment includes companies that prepare and package fresh and frozen seafood products.
  notation: 12101011151410
  valid from: 2020-10-03
source accessed on: 2023-07-03T18:11:29Z
source last accessed on: 2024-06-05T14:42:36Z
definition: This segment includes companies that prepare and package fresh and frozen seafood products.
notation: 12101011151410
valid from: 2020-10-03

Seafood Canning
type: BicsLevel7Segment
type: Classifier
type: NamedIndividual
is level7 segment of: Seafood Products Prep & Pkg
replaces: Seafood Canning
created with: infer-bics.sql
derived from: Seafood Canning
  type: BicsLevel6Segment
  type: Classifier
  type: AnachronousDerivation
  derived from: http://data.ga-group.nl/ics/bics/2014/121011141411
  source accessed on: 2019-12-03T20:05:01Z
  source last accessed on: 2019-12-03T20:05:01Z
  definition: This segment includes companies that can purchased seafood products but are not involved in fishing or fish farming.
  notation: 121011141411
  valid from: 2014-08-08
  valid till: 2020-10-03
derived from: Seafood Canning
  type: BicsLevel7Segment
  type: Classifier
  type: ContemporaryDerivation
  derived from: http://data.ga-group.nl/ics/bics/2020/12101011151411
  derived from: http://data.ga-group.nl/ics/bics/2024/12101011151411
  source accessed on: 2023-07-03T18:11:29Z
  source last accessed on: 2024-06-05T14:42:36Z
  definition: This segment includes companies that can purchased seafood products but are not involved in fishing or fish farming.
  notation: 12101011151411
  valid from: 2020-10-03
source accessed on: 2023-07-03T18:11:29Z
source last accessed on: 2024-06-05T14:42:36Z
definition: This segment includes companies that can purchased seafood products but are not involved in fishing or fish farming.
notation: 12101011151411
valid from: 2020-10-03

Seafood Products Prep & Pkg
type: BicsLevel6Segment
type: Classifier
type: NamedIndividual
is level6 segment of: Frozen, Canned & Perish Food
replaces: Seafood Products Prep & Pkg
created with: infer-bics.sql
derived from: Seafood Products Prep & Pkg
  type: BicsLevel5Segment
  type: Classifier
  type: AnachronousDerivation
  derived from: http://data.ga-group.nl/ics/bics/2014/1210111414
  source accessed on: 2019-12-03T20:05:01Z
  source last accessed on: 2019-12-03T20:05:01Z
  definition: This segment includes companies that prepare and package seafood, including fish and shellfish.
  notation: 1210111414
  valid from: 2014-08-08
  valid till: 2020-10-03
derived from: Seafood Products Prep & Pkg
  type: BicsLevel6Segment
  type: Classifier
  type: ContemporaryDerivation
  derived from: http://data.ga-group.nl/ics/bics/2020/121010111514
  derived from: http://data.ga-group.nl/ics/bics/2024/121010111514
  source accessed on: 2023-07-03T18:11:29Z
  source last accessed on: 2024-06-05T14:42:36Z
  definition: This segment includes companies that prepare and package seafood, including fish and shellfish.
  notation: 121010111514
  valid from: 2020-10-03
source accessed on: 2023-07-03T18:11:29Z
source last accessed on: 2024-06-05T14:42:36Z
definition: This segment includes companies that prepare and package seafood, including fish and shellfish.
notation: 121010111514
valid from: 2020-10-03

Frozen, Canned & Perish Food
type: BicsLevel5Segment
type: Classifier
type: NamedIndividual
is level5 segment of: Packaged Food
created with: infer-bics.sql
derived from: Frozen, Canned & Perish Food
  type: BicsLevel4SubIndustry
  type: Classifier
  type: AnachronousDerivation
  derived from: http://data.ga-group.nl/ics/bics/2014/12101114
  source accessed on: 2019-12-03T20:05:01Z
  source last accessed on: 2019-12-03T20:05:01Z
  definition: This industry subgroup includes companies that produce canned fruits, vegetables and other food products, excluding seafood.
  notation: 12101114
  valid from: 2014-08-08
  valid till: 2020-10-03
derived from: Frozen, Canned & Perish Food
  type: BicsLevel5Segment
  type: Classifier
  type: ContemporaryDerivation
  derived from: http://data.ga-group.nl/ics/bics/2020/1210101115
  derived from: http://data.ga-group.nl/ics/bics/2024/1210101115
  source accessed on: 2023-07-03T18:11:29Z
  source last accessed on: 2024-06-05T14:42:36Z
  definition: This segment includes companies that specialize in manufacturing preserved foods by canning, drying, or freezing. Also includes companies that manufacture pre-prepared perishable meals.
  notation: 1210101115
  valid from: 2020-10-03
source accessed on: 2023-07-03T18:11:29Z
source last accessed on: 2024-06-05T14:42:36Z
definition: This segment includes companies that specialize in manufacturing preserved foods by canning, drying, or freezing. Also includes companies that manufacture pre-prepared perishable meals.
notation: 1210101115
valid from: 2020-10-03

Cured & Smoked Meat
type: BicsLevel6Segment
type: Classifier
type: NamedIndividual
is level6 segment of: Meat Products
replaces: Cured & Smoked Meat
created with: infer-bics.sql
derived from: Cured & Smoked Meat
  type: BicsLevel5Segment
  type: Classifier
  type: AnachronousDerivation
  derived from: http://data.ga-group.nl/ics/bics/2014/1210111510
  source accessed on: 2019-12-03T20:05:01Z
  source last accessed on: 2019-12-03T20:05:01Z
  definition: This segment includes companies that process cured and smoked meat, typically for use in sandwiches. Such meats include bacon, bologna, hams, pastrami and canned meats.
  notation: 1210111510
  valid from: 2014-08-08
  valid till: 2020-10-03
derived from: Cured & Smoked Meat
  type: BicsLevel6Segment
  type: Classifier
  type: ContemporaryDerivation
  derived from: http://data.ga-group.nl/ics/bics/2020/121010111610
  derived from: http://data.ga-group.nl/ics/bics/2024/121010111610
  source accessed on: 2023-07-03T18:11:29Z
  source last accessed on: 2024-06-05T14:42:36Z
  definition: This segment includes companies that process cured and smoked meat, typically for use in sandwiches. Such meats include bacon, bologna, hams, pastrami and canned meats.
  notation: 121010111610
  valid from: 2020-10-03
source accessed on: 2023-07-03T18:11:29Z
source last accessed on: 2024-06-05T14:42:36Z
definition: This segment includes companies that process cured and smoked meat, typically for use in sandwiches. Such meats include bacon, bologna, hams, pastrami and canned meats.
notation: 121010111610
valid from: 2020-10-03

Fresh Meat Products
type: BicsLevel6Segment
type: Classifier
type: NamedIndividual
is level6 segment of: Meat Products
replaces: Fresh Meat Products
created with: infer-bics.sql
derived from: Fresh Meat Products
  type: BicsLevel5Segment
  type: Classifier
  type: AnachronousDerivation
  derived from: http://data.ga-group.nl/ics/bics/2014/1210111511
  source accessed on: 2019-12-03T20:05:01Z
  source last accessed on: 2019-12-03T20:05:01Z
  definition: This segment includes companies that produce and package fresh meat. These are the products produced from animal slaughtering and processing but have been packaged for retail sales.
  notation: 1210111511
  valid from: 2014-08-08
  valid till: 2020-10-03
derived from: Fresh Meat Products
  type: BicsLevel6Segment
  type: Classifier
  type: ContemporaryDerivation
  derived from: http://data.ga-group.nl/ics/bics/2020/121010111611
  derived from: http://data.ga-group.nl/ics/bics/2024/121010111611
  source accessed on: 2023-07-03T18:11:29Z
  source last accessed on: 2024-06-05T14:42:36Z
  definition: This segment includes companies that produce and package fresh meat.
  notation: 121010111611
  valid from: 2020-10-03
source accessed on: 2023-07-03T18:11:29Z
source last accessed on: 2024-06-05T14:42:36Z
definition: This segment includes companies that produce and package fresh meat.
notation: 121010111611
valid from: 2020-10-03

Poultry Products
type: BicsLevel6Segment
type: Classifier
type: NamedIndividual
is level6 segment of: Meat Products
replaces: Meat Type Chicken Products
created with: infer-bics.sql
derived from: Meat Type Chicken Products
  type: BicsLevel5Segment
  type: Classifier
  type: AnachronousDerivation
  derived from: http://data.ga-group.nl/ics/bics/2014/1210111512
  source accessed on: 2019-12-03T20:05:01Z
  source last accessed on: 2019-12-03T20:05:01Z
  definition: This segment includes companies that produce and package chicken meat products. These packaged chicken products are typically pre-prepared chicken dishes. Includes chicken nuggets, sauced chicken wings, cordon bleu, chicken kebabs and chicken patties.
  notation: 1210111512
  valid from: 2014-08-08
  valid till: 2020-10-03
derived from: Poultry Products
  type: BicsLevel6Segment
  type: Classifier
  type: ContemporaryDerivation
  derived from: http://data.ga-group.nl/ics/bics/2020/121010111612
  derived from: http://data.ga-group.nl/ics/bics/2024/121010111612
  source accessed on: 2023-07-03T18:11:29Z
  source last accessed on: 2024-06-05T14:42:36Z
  definition: This segment includes companies that produce fresh or packaged chicken meat products. Includes chicken nuggets, sauced chicken wings, cordon bleu, chicken kebabs and chicken patties.
  notation: 121010111612
  valid from: 2020-10-03
source accessed on: 2023-07-03T18:11:29Z
source last accessed on: 2024-06-05T14:42:36Z
definition: This segment includes companies that produce fresh or packaged chicken meat products. Includes chicken nuggets, sauced chicken wings, cordon bleu, chicken kebabs and chicken patties.
notation: 121010111612
valid from: 2020-10-03

Meat Products
type: BicsLevel5Segment
type: Classifier
type: NamedIndividual
is level5 segment of: Packaged Food
created with: infer-bics.sql
derived from: Meat Products
  type: BicsLevel4SubIndustry
  type: Classifier
  type: AnachronousDerivation
  derived from: http://data.ga-group.nl/ics/bics/2014/12101115
  source accessed on: 2019-12-03T20:05:01Z
  source last accessed on: 2019-12-03T20:05:01Z
  definition: This industry subgroup includes companies that produce packaged meat products.
  notation: 12101115
  valid from: 2014-08-08
  valid till: 2020-10-03
derived from: Meat Products
  type: BicsLevel5Segment
  type: Classifier
  type: ContemporaryDerivation
  derived from: http://data.ga-group.nl/ics/bics/2020/1210101116
  derived from: http://data.ga-group.nl/ics/bics/2024/1210101116
  source accessed on: 2023-07-03T18:11:29Z
  source last accessed on: 2024-06-05T14:42:36Z
  definition: This segment includes companies that produce packaged meat products.
  notation: 1210101116
  valid from: 2020-10-03
source accessed on: 2023-07-03T18:11:29Z
source last accessed on: 2024-06-05T14:42:36Z
definition: This segment includes companies that produce packaged meat products.
notation: 1210101116
valid from: 2020-10-03

Pet Food
type: BicsLevel5Segment
type: Classifier
type: NamedIndividual
is level5 segment of: Packaged Food
created with: infer-bics.sql
derived from: Pet Food
  type: BicsLevel4SubIndustry
  type: Classifier
  type: AnachronousDerivation
  derived from: http://data.ga-group.nl/ics/bics/2014/12101116
  source accessed on: 2019-12-03T20:05:01Z
  source last accessed on: 2019-12-03T20:05:01Z
  definition: This industry subgroup includes companies that produce food consumed by household pets.
  notation: 12101116
  valid from: 2014-08-08
  valid till: 2020-10-03
derived from: Pet Food
  type: BicsLevel5Segment
  type: Classifier
  type: ContemporaryDerivation
  derived from: http://data.ga-group.nl/ics/bics/2020/1210101117
  derived from: http://data.ga-group.nl/ics/bics/2024/1210101117
  source accessed on: 2023-07-03T18:11:29Z
  source last accessed on: 2024-06-05T14:42:36Z
  definition: This segment includes companies that produce food consumed by household pets.
  notation: 1210101117
  valid from: 2020-10-03
source accessed on: 2023-07-03T18:11:29Z
source last accessed on: 2024-06-05T14:42:36Z
definition: This segment includes companies that produce food consumed by household pets.
notation: 1210101117
valid from: 2020-10-03

Chocolate Confectionery
type: BicsLevel7Segment
type: Classifier
type: NamedIndividual
is level7 segment of: Confectionery
replaces: Chocolate Confectionery
created with: infer-bics.sql
derived from: Chocolate Confectionery
  type: BicsLevel6Segment
  type: Classifier
  type: AnachronousDerivation
  derived from: http://data.ga-group.nl/ics/bics/2014/121011171010
  source accessed on: 2019-12-03T20:05:01Z
  source last accessed on: 2019-12-03T20:05:01Z
  definition: This segment includes companies that produce confectionary products, such as candies and other desserts primarily made of chocolate.
  notation: 121011171010
  valid from: 2014-08-08
  valid till: 2020-10-03
derived from: Chocolate Confectionery
  type: BicsLevel7Segment
  type: Classifier
  type: ContemporaryDerivation
  derived from: http://data.ga-group.nl/ics/bics/2020/12101011181010
  source accessed on: 2023-07-03T18:11:29Z
  source last accessed on: 2023-07-03T18:11:29Z
  definition: This segment includes companies that produce confectionary products, such as candy and other desserts, that are primarily made of chocolate.
  notation: 12101011181010
  valid from: 2020-10-03
  valid till: 2024-06-07
derived from: Chocolate Confectionery
  type: BicsLevel7Segment
  type: Classifier
  type: ContemporaryDerivation
  derived from: http://data.ga-group.nl/ics/bics/2024/12101011181010
  source accessed on: 2024-06-05T14:42:36Z
  source last accessed on: 2024-06-05T14:42:36Z
  definition: This segment includes companies that produce confectionery products, such as candy and other desserts, that are primarily made of chocolate.
  notation: 12101011181010
  valid from: 2024-06-07
source accessed on: 2023-07-03T18:11:29Z
source last accessed on: 2024-06-05T14:42:36Z
definition: This segment includes companies that produce confectionery products, such as candy and other desserts, that are primarily made of chocolate.
notation: 12101011181010
valid from: 2020-10-03

Sugar & Other Confectionery
type: BicsLevel7Segment
type: Classifier
type: NamedIndividual
is level7 segment of: Confectionery
replaces: Non-Chocolate Confection
created with: infer-bics.sql
derived from: Non-Chocolate Confection
  type: BicsLevel6Segment
  type: Classifier
  type: AnachronousDerivation
  derived from: http://data.ga-group.nl/ics/bics/2014/121011171011
  source accessed on: 2019-12-03T20:05:01Z
  source last accessed on: 2019-12-03T20:05:01Z
  definition: This segment includes companies that produce confectionary products, such as candies and other desserts that are not primarily made of chocolate. Such products include chewing gum.
  notation: 121011171011
  valid from: 2014-08-08
  valid till: 2020-10-03
derived from: Sugar & Other Confectionary
  type: BicsLevel7Segment
  type: Classifier
  type: ContemporaryDerivation
  derived from: http://data.ga-group.nl/ics/bics/2020/12101011181011
  source accessed on: 2023-07-03T18:11:29Z
  source last accessed on: 2023-07-03T18:11:29Z
  definition: This segment includes companies that produce confectionary products, such as candy and other desserts, that are not primarily made of chocolate.
  notation: 12101011181011
  valid from: 2020-10-03
  valid till: 2024-06-07
derived from: Sugar & Other Confectionery
  type: BicsLevel7Segment
  type: Classifier
  type: ContemporaryDerivation
  derived from: http://data.ga-group.nl/ics/bics/2024/12101011181011
  source accessed on: 2024-06-05T14:42:36Z
  source last accessed on: 2024-06-05T14:42:36Z
  definition: This segment includes companies that produce confectionery products, such as candy and other desserts, that are not primarily made of chocolate.
  notation: 12101011181011
  valid from: 2024-06-07
source accessed on: 2023-07-03T18:11:29Z
source last accessed on: 2024-06-05T14:42:36Z
definition: This segment includes companies that produce confectionery products, such as candy and other desserts, that are not primarily made of chocolate.
notation: 12101011181011
valid from: 2020-10-03

Confectionery
type: BicsLevel6Segment
type: Classifier
type: NamedIndividual
is level6 segment of: Snack Food & Confectionery
replaces: Confectionery
created with: infer-bics.sql
derived from: Confectionery
  type: BicsLevel5Segment
  type: Classifier
  type: AnachronousDerivation
  derived from: http://data.ga-group.nl/ics/bics/2014/1210111710
  source accessed on: 2019-12-03T20:05:01Z
  source last accessed on: 2019-12-03T20:05:01Z
  definition: This segment includes companies that produce confectionary products.
  notation: 1210111710
  valid from: 2014-08-08
  valid till: 2020-10-03
derived from: Confectionery
  type: BicsLevel6Segment
  type: Classifier
  type: ContemporaryDerivation
  derived from: http://data.ga-group.nl/ics/bics/2020/121010111810
  source accessed on: 2023-07-03T18:11:29Z
  source last accessed on: 2023-07-03T18:11:29Z
  definition: This segment includes companies that produce confectionary products.
  notation: 121010111810
  valid from: 2020-10-03
  valid till: 2024-06-07
derived from: Confectionery
  type: BicsLevel6Segment
  type: Classifier
  type: ContemporaryDerivation
  derived from: http://data.ga-group.nl/ics/bics/2024/121010111810
  source accessed on: 2024-06-05T14:42:36Z
  source last accessed on: 2024-06-05T14:42:36Z
  definition: This segment includes companies that produce confectionery products.
  notation: 121010111810
  valid from: 2024-06-07
source accessed on: 2023-07-03T18:11:29Z
source last accessed on: 2024-06-05T14:42:36Z
definition: This segment includes companies that produce confectionery products.
notation: 121010111810
valid from: 2020-10-03

Breakfast Cereal
type: BicsLevel7Segment
type: Classifier
type: NamedIndividual
is level7 segment of: Snack Food
replaces: Breakfast Cereal
created with: infer-bics.sql
derived from: Breakfast Cereal
  type: BicsLevel6Segment
  type: Classifier
  type: AnachronousDerivation
  derived from: http://data.ga-group.nl/ics/bics/2014/121011171110
  source accessed on: 2019-12-03T20:05:01Z
  source last accessed on: 2019-12-03T20:05:01Z
  definition: This segment includes companies that produce breakfast cereals, such as granola, oatmeal and corn-based cereals.
  notation: 121011171110
  valid from: 2014-08-08
  valid till: 2020-10-03
derived from: Breakfast Cereal
  type: BicsLevel7Segment
  type: Classifier
  type: ContemporaryDerivation
  derived from: http://data.ga-group.nl/ics/bics/2020/12101011181110
  derived from: http://data.ga-group.nl/ics/bics/2024/12101011181110
  source accessed on: 2023-07-03T18:11:29Z
  source last accessed on: 2024-06-05T14:42:36Z
  definition: This segment includes companies that produce breakfast cereals, such as granola, oatmeal, and corn-based cereals.
  notation: 12101011181110
  valid from: 2020-10-03
source accessed on: 2023-07-03T18:11:29Z
source last accessed on: 2024-06-05T14:42:36Z
definition: This segment includes companies that produce breakfast cereals, such as granola, oatmeal, and corn-based cereals.
notation: 12101011181110
valid from: 2020-10-03

Cookies & Crackers
type: BicsLevel7Segment
type: Classifier
type: NamedIndividual
is level7 segment of: Snack Food
replaces: Cookies & Crackers
created with: infer-bics.sql
derived from: Cookies & Crackers
  type: BicsLevel6Segment
  type: Classifier
  type: AnachronousDerivation
  derived from: http://data.ga-group.nl/ics/bics/2014/121011171111
  source accessed on: 2019-12-03T20:05:01Z
  source last accessed on: 2019-12-03T20:05:01Z
  definition: This segment includes companies that produce cookies and crackers.
  notation: 121011171111
  valid from: 2014-08-08
  valid till: 2020-10-03
derived from: Cookies & Crackers
  type: BicsLevel7Segment
  type: Classifier
  type: ContemporaryDerivation
  derived from: http://data.ga-group.nl/ics/bics/2020/12101011181111
  derived from: http://data.ga-group.nl/ics/bics/2024/12101011181111
  source accessed on: 2023-07-03T18:11:29Z
  source last accessed on: 2024-06-05T14:42:36Z
  definition: This segment includes companies that produce cookies and crackers.
  notation: 12101011181111
  valid from: 2020-10-03
source accessed on: 2023-07-03T18:11:29Z
source last accessed on: 2024-06-05T14:42:36Z
definition: This segment includes companies that produce cookies and crackers.
notation: 12101011181111
valid from: 2020-10-03

Roast Nuts & Peanut Butter
type: BicsLevel7Segment
type: Classifier
type: NamedIndividual
is level7 segment of: Snack Food
replaces: Roast Nuts & Peanut Butter
created with: infer-bics.sql
derived from: Roast Nuts & Peanut Butter
  type: BicsLevel6Segment
  type: Classifier
  type: AnachronousDerivation
  derived from: http://data.ga-group.nl/ics/bics/2014/121011171112
  source accessed on: 2019-12-03T20:05:01Z
  source last accessed on: 2019-12-03T20:05:01Z
  definition: This segment includes companies that roast and preserve nuts, nut foods or pastes like peanut butter.
  notation: 121011171112
  valid from: 2014-08-08
  valid till: 2020-10-03
derived from: Roast Nuts & Peanut Butter
  type: BicsLevel7Segment
  type: Classifier
  type: ContemporaryDerivation
  derived from: http://data.ga-group.nl/ics/bics/2020/12101011181112
  derived from: http://data.ga-group.nl/ics/bics/2024/12101011181112
  source accessed on: 2023-07-03T18:11:29Z
  source last accessed on: 2024-06-05T14:42:36Z
  definition: This segment includes companies that roast and preserve nuts, nut foods, or pastes like peanut butter.
  notation: 12101011181112
  valid from: 2020-10-03
source accessed on: 2023-07-03T18:11:29Z
source last accessed on: 2024-06-05T14:42:36Z
definition: This segment includes companies that roast and preserve nuts, nut foods, or pastes like peanut butter.
notation: 12101011181112
valid from: 2020-10-03

Snack Food
type: BicsLevel6Segment
type: Classifier
type: NamedIndividual
is level6 segment of: Snack Food & Confectionery
replaces: Snack Food
created with: infer-bics.sql
derived from: Snack Food
  type: BicsLevel5Segment
  type: Classifier
  type: AnachronousDerivation
  derived from: http://data.ga-group.nl/ics/bics/2014/1210111711
  source accessed on: 2019-12-03T20:05:01Z
  source last accessed on: 2019-12-03T20:05:01Z
  definition: This segment includes companies that manufacture snack foods.
  notation: 1210111711
  valid from: 2014-08-08
  valid till: 2020-10-03
derived from: Snack Food
  type: BicsLevel6Segment
  type: Classifier
  type: ContemporaryDerivation
  derived from: http://data.ga-group.nl/ics/bics/2020/121010111811
  derived from: http://data.ga-group.nl/ics/bics/2024/121010111811
  source accessed on: 2023-07-03T18:11:29Z
  source last accessed on: 2024-06-05T14:42:36Z
  definition: This segment includes companies that manufacture snack foods.
  notation: 121010111811
  valid from: 2020-10-03
source accessed on: 2023-07-03T18:11:29Z
source last accessed on: 2024-06-05T14:42:36Z
definition: This segment includes companies that manufacture snack foods.
notation: 121010111811
valid from: 2020-10-03

Snack Food & Confectionery
type: BicsLevel5Segment
type: Classifier
type: NamedIndividual
is level5 segment of: Packaged Food
created with: infer-bics.sql
derived from: Snack Food & Confectionary
  type: BicsLevel4SubIndustry
  type: Classifier
  type: AnachronousDerivation
  derived from: http://data.ga-group.nl/ics/bics/2014/12101117
  source accessed on: 2019-12-03T20:05:01Z
  source last accessed on: 2019-12-03T20:05:01Z
  definition: This industry subgroup includes companies that produce snack foods and confectionary products.
  notation: 12101117
  valid from: 2014-08-08
  valid till: 2020-10-03
derived from: Snack Food & Confectionary
  type: BicsLevel5Segment
  type: Classifier
  type: ContemporaryDerivation
  derived from: http://data.ga-group.nl/ics/bics/2020/1210101118
  source accessed on: 2023-07-03T18:11:29Z
  source last accessed on: 2023-07-03T18:11:29Z
  definition: This segment includes companies that produce snack foods and confectionary products.
  notation: 1210101118
  valid from: 2020-10-03
  valid till: 2024-06-07
derived from: Snack Food & Confectionery
  type: BicsLevel5Segment
  type: Classifier
  type: ContemporaryDerivation
  derived from: http://data.ga-group.nl/ics/bics/2024/1210101118
  source accessed on: 2024-06-05T14:42:36Z
  source last accessed on: 2024-06-05T14:42:36Z
  definition: This segment includes companies that produce snack foods and confectionery products.
  notation: 1210101118
  valid from: 2024-06-07
source accessed on: 2023-07-03T18:11:29Z
source last accessed on: 2024-06-05T14:42:36Z
definition: This segment includes companies that produce snack foods and confectionery products.
notation: 1210101118
valid from: 2020-10-03

Nutritional Supplements
type: BicsLevel5Segment
type: Classifier
type: NamedIndividual
is level5 segment of: Packaged Food
created with: infer-bics.sql
derived from: Nutritional Supplements
  type: BicsLevel5Segment
  type: Classifier
  type: ContemporaryDerivation
  derived from: http://data.ga-group.nl/ics/bics/2020/1210101119
  source accessed on: 2023-07-03T18:11:29Z
  source last accessed on: 2023-07-03T18:11:29Z
  definition: This segment includes companies that produce dietary supplements used to add nutritional value. Includes vitamins, dietary minerals, amino acids, proteins, meal supplements, baby formulas, sports nutrition, and other dietary supplements.
  notation: 1210101119
  valid from: 2020-10-03
  valid till: 2024-06-07
derived from: Nutritional Supplements
  type: BicsLevel5Segment
  type: Classifier
  type: ContemporaryDerivation
  derived from: http://data.ga-group.nl/ics/bics/2024/1210101119
  source accessed on: 2024-06-05T14:42:36Z
  source last accessed on: 2024-06-05T14:42:36Z
  definition: This segment includes companies that produce food or shakes that focus on adding nutritional value for dietary health or fitness. Includes protein shakes, baby formulas, sports nutrition, and other meal replacement shakes. Excludes vitamins, dietary minerals, and amino acids (see Consumer Healthcare Products)
  notation: 1210101119
  valid from: 2024-06-07
source accessed on: 2023-07-03T18:11:29Z
source last accessed on: 2024-06-05T14:42:36Z
definition: This segment includes companies that produce food or shakes that focus on adding nutritional value for dietary health or fitness. Includes protein shakes, baby formulas, sports nutrition, and other meal replacement shakes. Excludes vitamins, dietary minerals, and amino acids (see Consumer Healthcare Products)
notation: 1210101119
valid from: 2020-10-03

Dairy Alternatives
type: BicsLevel6Segment
type: Classifier
type: NamedIndividual
is level6 segment of: Protein, Dairy & Other Food Alt
created with: infer-bics.sql
derived from: Dairy Alternatives
  type: BicsLevel6Segment
  type: Classifier
  type: ContemporaryDerivation
  derived from: http://data.ga-group.nl/ics/bics/2024/121010112010
  source accessed on: 2024-06-05T14:42:36Z
  source last accessed on: 2024-06-05T14:42:36Z
  definition: This segment includes companies that produce milk and traditionally milk based products made from something other than dairy. Dairy alternatives are commonly sourced from oats, nuts and vegetables.
  notation: 121010112010
  valid from: 2024-06-07
source accessed on: 2024-06-05T14:42:36Z
source last accessed on: 2024-06-05T14:42:36Z
definition: This segment includes companies that produce milk and traditionally milk based products made from something other than dairy. Dairy alternatives are commonly sourced from oats, nuts and vegetables.
notation: 121010112010
valid from: 2024-06-07

Protein Alternatives
type: BicsLevel6Segment
type: Classifier
type: NamedIndividual
is level6 segment of: Protein, Dairy & Other Food Alt
created with: infer-bics.sql
derived from: Protein Alternatives
  type: BicsLevel6Segment
  type: Classifier
  type: ContemporaryDerivation
  derived from: http://data.ga-group.nl/ics/bics/2024/121010112011
  source accessed on: 2024-06-05T14:42:36Z
  source last accessed on: 2024-06-05T14:42:36Z
  definition: This segment includes companies that produce alternative protein foods such as plant based meat analogs and lab-grown meat. Excludes long standing meat alternatives such as tofu.
  notation: 121010112011
  valid from: 2024-06-07
source accessed on: 2024-06-05T14:42:36Z
source last accessed on: 2024-06-05T14:42:36Z
definition: This segment includes companies that produce alternative protein foods such as plant based meat analogs and lab-grown meat. Excludes long standing meat alternatives such as tofu.
notation: 121010112011
valid from: 2024-06-07

Protein, Dairy & Other Food Alt
type: BicsLevel5Segment
type: Classifier
type: NamedIndividual
is level5 segment of: Packaged Food
created with: infer-bics.sql
derived from: Protein, Dairy & Other Food Alt
  type: BicsLevel5Segment
  type: Classifier
  type: ContemporaryDerivation
  derived from: http://data.ga-group.nl/ics/bics/2024/1210101120
  source accessed on: 2024-06-05T14:42:36Z
  source last accessed on: 2024-06-05T14:42:36Z
  definition: This segment includes companies that produce alternatives to traditional protein, dairy and other packaged food products.
  notation: 1210101120
  valid from: 2024-06-07
source accessed on: 2024-06-05T14:42:36Z
source last accessed on: 2024-06-05T14:42:36Z
definition: This segment includes companies that produce alternatives to traditional protein, dairy and other packaged food products.
notation: 1210101120
valid from: 2024-06-07

Packaged Food
type: BicsLevel4SubIndustry
type: Classifier
type: NamedIndividual
replaces: Beverages
created with: infer-bics.sql
derived from: Animal Production & Process
  type: BicsLevel4SubIndustry
  type: Classifier
  type: ContemporaryDerivation
  derived from: http://data.ga-group.nl/ics/bics/2014/12101011
  source accessed on: 2019-12-03T20:05:01Z
  source last accessed on: 2019-12-03T20:05:01Z
  definition: This industry subgroup includes companies that process meat and slaughter animals for use in food products.
  notation: 12101011
  valid from: 2014-08-08
  valid till: 2020-10-03
derived from: Packaged Food
  type: BicsLevel3Industry
  type: Classifier
  type: AnachronousDerivation
  derived from: http://data.ga-group.nl/ics/bics/2014/121011
  source accessed on: 2019-12-03T20:05:01Z
  source last accessed on: 2019-12-03T20:05:01Z
  definition: This industry includes companies that process and package foods like bread, dairy, frozen foods, snack foods and condiments for retail consumer consumption. It also includes packaged pet foods. Typically, these products are packaged and marketed for retail consumers and can be found on food retailer's shelves.
  notation: 121011
  valid from: 2014-08-08
  valid till: 2020-10-03
derived from: Packaged Food
  type: BicsLevel4SubIndustry
  type: Classifier
  type: ContemporaryDerivation
  derived from: http://data.ga-group.nl/ics/bics/2020/12101011
  derived from: http://data.ga-group.nl/ics/bics/2024/12101011
  source accessed on: 2023-07-03T18:11:29Z
  source last accessed on: 2024-06-05T14:42:36Z
  definition: This industry subgroup includes companies that process and package finished food products. Typically, these products are marketed for retail consumers, carry a brand name, and can be found on food retailer's shelves. Also includes packaged pet foods.
  notation: 12101011
  valid from: 2020-10-03
source accessed on: 2019-12-03T20:05:01Z
source last accessed on: 2024-06-05T14:42:36Z
definition: This industry subgroup includes companies that process and package finished food products. Typically, these products are marketed for retail consumers, carry a brand name, and can be found on food retailer's shelves. Also includes packaged pet foods.
notation: 12101011
valid from: 2014-08-08

Finfish Farm & Fish Hatcheries
type: BicsLevel6Segment
type: Classifier
type: NamedIndividual
is level6 segment of: Aquaculture
is replaced by: Finfish Farm & Fish Hatcheries
created with: infer-bics.sql
derived from: Finfish Farm & Fish Hatcheries
  type: BicsLevel6Segment
  type: Classifier
  type: ContemporaryDerivation
  derived from: http://data.ga-group.nl/ics/bics/2014/121010121010
  source accessed on: 2019-12-03T20:05:01Z
  source last accessed on: 2019-12-03T20:05:01Z
  definition: This segment includes companies that farm finfish.
  notation: 121010121010
  valid from: 2014-08-08
  valid till: 2020-10-03
source accessed on: 2019-12-03T20:05:01Z
source last accessed on: 2019-12-03T20:05:01Z
definition: This segment includes companies that farm finfish.
notation: 121010121010
valid from: 2014-08-08
valid till: 2020-10-03

Shellfish Farming
type: BicsLevel6Segment
type: Classifier
type: NamedIndividual
is level6 segment of: Aquaculture
is replaced by: Shellfish Farming
created with: infer-bics.sql
derived from: Shellfish Farming
  type: BicsLevel6Segment
  type: Classifier
  type: ContemporaryDerivation
  derived from: http://data.ga-group.nl/ics/bics/2014/121010121011
  source accessed on: 2019-12-03T20:05:01Z
  source last accessed on: 2019-12-03T20:05:01Z
  definition: This segment includes companies that farm shellfish.
  notation: 121010121011
  valid from: 2014-08-08
  valid till: 2020-10-03
source accessed on: 2019-12-03T20:05:01Z
source last accessed on: 2019-12-03T20:05:01Z
definition: This segment includes companies that farm shellfish.
notation: 121010121011
valid from: 2014-08-08
valid till: 2020-10-03

Other Aquaculture
type: BicsLevel6Segment
type: Classifier
type: NamedIndividual
is level6 segment of: Aquaculture
created with: infer-bics.sql
derived from: Other Aquaculture
  type: BicsLevel6Segment
  type: Classifier
  type: ContemporaryDerivation
  derived from: http://data.ga-group.nl/ics/bics/2014/121010121012
  source accessed on: 2019-12-03T20:05:01Z
  source last accessed on: 2019-12-03T20:05:01Z
  definition: This segment includes companies that are involved in other aquaculture activities not elsewhere classified.
  notation: 121010121012
  valid from: 2014-08-08
  valid till: 2020-10-03
source accessed on: 2019-12-03T20:05:01Z
source last accessed on: 2019-12-03T20:05:01Z
definition: This segment includes companies that are involved in other aquaculture activities not elsewhere classified.
notation: 121010121012
valid from: 2014-08-08
valid till: 2020-10-03

Aquaculture
type: BicsLevel5Segment
type: Classifier
type: NamedIndividual
is level5 segment of: Aquaculture Fishing
is replaced by: Aquaculture
created with: infer-bics.sql
derived from: Aquaculture
  type: BicsLevel5Segment
  type: Classifier
  type: ContemporaryDerivation
  derived from: http://data.ga-group.nl/ics/bics/2014/1210101210
  source accessed on: 2019-12-03T20:05:01Z
  source last accessed on: 2019-12-03T20:05:01Z
  definition: This segment includes companies that farm aquatic life.
  notation: 1210101210
  valid from: 2014-08-08
  valid till: 2020-10-03
source accessed on: 2019-12-03T20:05:01Z
source last accessed on: 2019-12-03T20:05:01Z
definition: This segment includes companies that farm aquatic life.
notation: 1210101210
valid from: 2014-08-08
valid till: 2020-10-03

Finfish Fishing
type: BicsLevel6Segment
type: Classifier
type: NamedIndividual
is level6 segment of: Fishing
is replaced by: Finfish Fishing
created with: infer-bics.sql
derived from: Finfish Fishing
  type: BicsLevel6Segment
  type: Classifier
  type: ContemporaryDerivation
  derived from: http://data.ga-group.nl/ics/bics/2014/121010121110
  source accessed on: 2019-12-03T20:05:01Z
  source last accessed on: 2019-12-03T20:05:01Z
  definition: This segment includes companies that catch finfish in their natural habitat.
  notation: 121010121110
  valid from: 2014-08-08
  valid till: 2020-10-03
source accessed on: 2019-12-03T20:05:01Z
source last accessed on: 2019-12-03T20:05:01Z
definition: This segment includes companies that catch finfish in their natural habitat.
notation: 121010121110
valid from: 2014-08-08
valid till: 2020-10-03

Shellfish Fishing
type: BicsLevel6Segment
type: Classifier
type: NamedIndividual
is level6 segment of: Fishing
is replaced by: Shellfish Fishing
created with: infer-bics.sql
derived from: Shellfish Fishing
  type: BicsLevel6Segment
  type: Classifier
  type: ContemporaryDerivation
  derived from: http://data.ga-group.nl/ics/bics/2014/121010121111
  source accessed on: 2019-12-03T20:05:01Z
  source last accessed on: 2019-12-03T20:05:01Z
  definition: This segment includes companies that catch shellfish in their natural habitat.
  notation: 121010121111
  valid from: 2014-08-08
  valid till: 2020-10-03
source accessed on: 2019-12-03T20:05:01Z
source last accessed on: 2019-12-03T20:05:01Z
definition: This segment includes companies that catch shellfish in their natural habitat.
notation: 121010121111
valid from: 2014-08-08
valid till: 2020-10-03

Other Marine Fishing
type: BicsLevel6Segment
type: Classifier
type: NamedIndividual
is level6 segment of: Fishing
created with: infer-bics.sql
derived from: Other Marine Fishing
  type: BicsLevel6Segment
  type: Classifier
  type: ContemporaryDerivation
  derived from: http://data.ga-group.nl/ics/bics/2014/121010121112
  source accessed on: 2019-12-03T20:05:01Z
  source last accessed on: 2019-12-03T20:05:01Z
  definition: This segment includes companies that catch marine life in their natural habitat not elsewhere classified.
  notation: 121010121112
  valid from: 2014-08-08
  valid till: 2020-10-03
source accessed on: 2019-12-03T20:05:01Z
source last accessed on: 2019-12-03T20:05:01Z
definition: This segment includes companies that catch marine life in their natural habitat not elsewhere classified.
notation: 121010121112
valid from: 2014-08-08
valid till: 2020-10-03

Fishing
type: BicsLevel5Segment
type: Classifier
type: NamedIndividual
is level5 segment of: Aquaculture Fishing
is replaced by: Fishing
created with: infer-bics.sql
derived from: Fishing
  type: BicsLevel5Segment
  type: Classifier
  type: ContemporaryDerivation
  derived from: http://data.ga-group.nl/ics/bics/2014/1210101211
  source accessed on: 2019-12-03T20:05:01Z
  source last accessed on: 2019-12-03T20:05:01Z
  definition: This segment includes companies that fish.
  notation: 1210101211
  valid from: 2014-08-08
  valid till: 2020-10-03
source accessed on: 2019-12-03T20:05:01Z
source last accessed on: 2019-12-03T20:05:01Z
definition: This segment includes companies that fish.
notation: 1210101211
valid from: 2014-08-08
valid till: 2020-10-03

Aquaculture Fishing
type: BicsLevel4SubIndustry
type: Classifier
type: NamedIndividual
created with: infer-bics.sql
derived from: Aquaculture Fishing
  type: BicsLevel4SubIndustry
  type: Classifier
  type: ContemporaryDerivation
  derived from: http://data.ga-group.nl/ics/bics/2014/12101012
  source accessed on: 2019-12-03T20:05:01Z
  source last accessed on: 2019-12-03T20:05:01Z
  definition: This industry subgroup includes companies involved in aquaculture and fishing.
  notation: 12101012
  valid from: 2014-08-08
  valid till: 2020-10-03
source accessed on: 2019-12-03T20:05:01Z
source last accessed on: 2019-12-03T20:05:01Z
definition: This industry subgroup includes companies involved in aquaculture and fishing.
notation: 12101012
valid from: 2014-08-08
valid till: 2020-10-03

Cocoa Farming
type: BicsLevel5Segment
type: Classifier
type: NamedIndividual
is level5 segment of: Food Crop Production
is replaced by: Cocoa Farming
created with: infer-bics.sql
derived from: Cocoa Farming
  type: BicsLevel5Segment
  type: Classifier
  type: ContemporaryDerivation
  derived from: http://data.ga-group.nl/ics/bics/2014/1210101310
  source accessed on: 2019-12-03T20:05:01Z
  source last accessed on: 2019-12-03T20:05:01Z
  definition: This segment includes companies that grow cocoa.
  notation: 1210101310
  valid from: 2014-08-08
  valid till: 2020-10-03
source accessed on: 2019-12-03T20:05:01Z
source last accessed on: 2019-12-03T20:05:01Z
definition: This segment includes companies that grow cocoa.
notation: 1210101310
valid from: 2014-08-08
valid till: 2020-10-03

Apple Orchards
type: BicsLevel6Segment
type: Classifier
type: NamedIndividual
is level6 segment of: Fruit Farming
is replaced by: Apple Orchards
created with: infer-bics.sql
derived from: Apple Orchards
  type: BicsLevel6Segment
  type: Classifier
  type: ContemporaryDerivation
  derived from: http://data.ga-group.nl/ics/bics/2014/121010131110
  source accessed on: 2019-12-03T20:05:01Z
  source last accessed on: 2019-12-03T20:05:01Z
  definition: This segment includes companies that grow apples.
  notation: 121010131110
  valid from: 2014-08-08
  valid till: 2020-10-03
source accessed on: 2019-12-03T20:05:01Z
source last accessed on: 2019-12-03T20:05:01Z
definition: This segment includes companies that grow apples.
notation: 121010131110
valid from: 2014-08-08
valid till: 2020-10-03

Citrus Groves excl Oranges
type: BicsLevel6Segment
type: Classifier
type: NamedIndividual
is level6 segment of: Fruit Farming
is replaced by: Citrus Groves (excl Oranges)
created with: infer-bics.sql
derived from: Citrus Groves excl Oranges
  type: BicsLevel6Segment
  type: Classifier
  type: ContemporaryDerivation
  derived from: http://data.ga-group.nl/ics/bics/2014/121010131111
  source accessed on: 2019-12-03T20:05:01Z
  source last accessed on: 2019-12-03T20:05:01Z
  definition: This segment includes companies that grow citrus fruits other than oranges.
  notation: 121010131111
  valid from: 2014-08-08
  valid till: 2020-10-03
source accessed on: 2019-12-03T20:05:01Z
source last accessed on: 2019-12-03T20:05:01Z
definition: This segment includes companies that grow citrus fruits other than oranges.
notation: 121010131111
valid from: 2014-08-08
valid till: 2020-10-03

Grape Vineyards
type: BicsLevel6Segment
type: Classifier
type: NamedIndividual
is level6 segment of: Fruit Farming
is replaced by: Grape Vineyards
created with: infer-bics.sql
derived from: Grape Vineyards
  type: BicsLevel6Segment
  type: Classifier
  type: ContemporaryDerivation
  derived from: http://data.ga-group.nl/ics/bics/2014/121010131112
  source accessed on: 2019-12-03T20:05:01Z
  source last accessed on: 2019-12-03T20:05:01Z
  definition: This segment includes companies that grow grapes.
  notation: 121010131112
  valid from: 2014-08-08
  valid till: 2020-10-03
source accessed on: 2019-12-03T20:05:01Z
source last accessed on: 2019-12-03T20:05:01Z
definition: This segment includes companies that grow grapes.
notation: 121010131112
valid from: 2014-08-08
valid till: 2020-10-03

Orange Groves
type: BicsLevel6Segment
type: Classifier
type: NamedIndividual
is level6 segment of: Fruit Farming
is replaced by: Orange Groves
created with: infer-bics.sql
derived from: Orange Groves
  type: BicsLevel6Segment
  type: Classifier
  type: ContemporaryDerivation
  derived from: http://data.ga-group.nl/ics/bics/2014/121010131113
  source accessed on: 2019-12-03T20:05:01Z
  source last accessed on: 2019-12-03T20:05:01Z
  definition: This segment includes companies that grow oranges.
  notation: 121010131113
  valid from: 2014-08-08
  valid till: 2020-10-03
source accessed on: 2019-12-03T20:05:01Z
source last accessed on: 2019-12-03T20:05:01Z
definition: This segment includes companies that grow oranges.
notation: 121010131113
valid from: 2014-08-08
valid till: 2020-10-03

Strawberry Farming
type: BicsLevel6Segment
type: Classifier
type: NamedIndividual
is level6 segment of: Fruit Farming
is replaced by: Strawberry Farming
created with: infer-bics.sql
derived from: Strawberry Farming
  type: BicsLevel6Segment
  type: Classifier
  type: ContemporaryDerivation
  derived from: http://data.ga-group.nl/ics/bics/2014/121010131114
  source accessed on: 2019-12-03T20:05:01Z
  source last accessed on: 2019-12-03T20:05:01Z
  definition: This segment includes companies that grow strawberries.
  notation: 121010131114
  valid from: 2014-08-08
  valid till: 2020-10-03
source accessed on: 2019-12-03T20:05:01Z
source last accessed on: 2019-12-03T20:05:01Z
definition: This segment includes companies that grow strawberries.
notation: 121010131114
valid from: 2014-08-08
valid till: 2020-10-03

Other Noncitrus Fruit Farm
type: BicsLevel6Segment
type: Classifier
type: NamedIndividual
is level6 segment of: Fruit Farming
created with: infer-bics.sql
derived from: Other Noncitrus Fruit Farm
  type: BicsLevel6Segment
  type: Classifier
  type: ContemporaryDerivation
  derived from: http://data.ga-group.nl/ics/bics/2014/121010131115
  source accessed on: 2019-12-03T20:05:01Z
  source last accessed on: 2019-12-03T20:05:01Z
  definition: This segment includes companies that grow non-citrus fruit not elsewhere classified.
  notation: 121010131115
  valid from: 2014-08-08
  valid till: 2020-10-03
source accessed on: 2019-12-03T20:05:01Z
source last accessed on: 2019-12-03T20:05:01Z
definition: This segment includes companies that grow non-citrus fruit not elsewhere classified.
notation: 121010131115
valid from: 2014-08-08
valid till: 2020-10-03

Fruit Farming
type: BicsLevel5Segment
type: Classifier
type: NamedIndividual
is level5 segment of: Food Crop Production
is replaced by: Fruit Farming
created with: infer-bics.sql
derived from: Fruit Farming
  type: BicsLevel5Segment
  type: Classifier
  type: ContemporaryDerivation
  derived from: http://data.ga-group.nl/ics/bics/2014/1210101311
  source accessed on: 2019-12-03T20:05:01Z
  source last accessed on: 2019-12-03T20:05:01Z
  definition: This segment includes companies that grow fruit.
  notation: 1210101311
  valid from: 2014-08-08
  valid till: 2020-10-03
source accessed on: 2019-12-03T20:05:01Z
source last accessed on: 2019-12-03T20:05:01Z
definition: This segment includes companies that grow fruit.
notation: 1210101311
valid from: 2014-08-08
valid till: 2020-10-03

Corn Farming
type: BicsLevel6Segment
type: Classifier
type: NamedIndividual
is level6 segment of: Grain Farming
is replaced by: Corn Farming
created with: infer-bics.sql
derived from: Corn Farming
  type: BicsLevel6Segment
  type: Classifier
  type: ContemporaryDerivation
  derived from: http://data.ga-group.nl/ics/bics/2014/121010131210
  source accessed on: 2019-12-03T20:05:01Z
  source last accessed on: 2019-12-03T20:05:01Z
  definition: This segment includes companies that grow corn or corn by-products.
  notation: 121010131210
  valid from: 2014-08-08
  valid till: 2020-10-03
source accessed on: 2019-12-03T20:05:01Z
source last accessed on: 2019-12-03T20:05:01Z
definition: This segment includes companies that grow corn or corn by-products.
notation: 121010131210
valid from: 2014-08-08
valid till: 2020-10-03

Rice Farming
type: BicsLevel6Segment
type: Classifier
type: NamedIndividual
is level6 segment of: Grain Farming
is replaced by: Rice Farming
created with: infer-bics.sql
derived from: Rice Farming
  type: BicsLevel6Segment
  type: Classifier
  type: ContemporaryDerivation
  derived from: http://data.ga-group.nl/ics/bics/2014/121010131211
  source accessed on: 2019-12-03T20:05:01Z
  source last accessed on: 2019-12-03T20:05:01Z
  definition: This segment includes companies that grow rice or rice by-products.
  notation: 121010131211
  valid from: 2014-08-08
  valid till: 2020-10-03
source accessed on: 2019-12-03T20:05:01Z
source last accessed on: 2019-12-03T20:05:01Z
definition: This segment includes companies that grow rice or rice by-products.
notation: 121010131211
valid from: 2014-08-08
valid till: 2020-10-03

Wheat Farming
type: BicsLevel6Segment
type: Classifier
type: NamedIndividual
is level6 segment of: Grain Farming
is replaced by: Wheat Farming
created with: infer-bics.sql
derived from: Wheat Farming
  type: BicsLevel6Segment
  type: Classifier
  type: ContemporaryDerivation
  derived from: http://data.ga-group.nl/ics/bics/2014/121010131212
  source accessed on: 2019-12-03T20:05:01Z
  source last accessed on: 2019-12-03T20:05:01Z
  definition: This segment includes companies that grow wheat or wheat by-products.
  notation: 121010131212
  valid from: 2014-08-08
  valid till: 2020-10-03
source accessed on: 2019-12-03T20:05:01Z
source last accessed on: 2019-12-03T20:05:01Z
definition: This segment includes companies that grow wheat or wheat by-products.
notation: 121010131212
valid from: 2014-08-08
valid till: 2020-10-03

Other Grain Farming
type: BicsLevel6Segment
type: Classifier
type: NamedIndividual
is level6 segment of: Grain Farming
created with: infer-bics.sql
derived from: Other Grain Farming
  type: BicsLevel6Segment
  type: Classifier
  type: ContemporaryDerivation
  derived from: http://data.ga-group.nl/ics/bics/2014/121010131213
  source accessed on: 2019-12-03T20:05:01Z
  source last accessed on: 2019-12-03T20:05:01Z
  definition: This segment includes companies that grow other grains not elsewhere classified. Products include barley, broomcorn, buckwheat, milo, oats, rye and sorghum.
  notation: 121010131213
  valid from: 2014-08-08
  valid till: 2020-10-03
source accessed on: 2019-12-03T20:05:01Z
source last accessed on: 2019-12-03T20:05:01Z
definition: This segment includes companies that grow other grains not elsewhere classified. Products include barley, broomcorn, buckwheat, milo, oats, rye and sorghum.
notation: 121010131213
valid from: 2014-08-08
valid till: 2020-10-03

Grain Farming
type: BicsLevel5Segment
type: Classifier
type: NamedIndividual
is level5 segment of: Food Crop Production
is replaced by: Grain Farming
created with: infer-bics.sql
derived from: Grain Farming
  type: BicsLevel5Segment
  type: Classifier
  type: ContemporaryDerivation
  derived from: http://data.ga-group.nl/ics/bics/2014/1210101312
  source accessed on: 2019-12-03T20:05:01Z
  source last accessed on: 2019-12-03T20:05:01Z
  definition: This segment includes companies that grow grains, such as corn, wheat and soybeans.
  notation: 1210101312
  valid from: 2014-08-08
  valid till: 2020-10-03
source accessed on: 2019-12-03T20:05:01Z
source last accessed on: 2019-12-03T20:05:01Z
definition: This segment includes companies that grow grains, such as corn, wheat and soybeans.
notation: 1210101312
valid from: 2014-08-08
valid till: 2020-10-03

Mushroom Production
type: BicsLevel5Segment
type: Classifier
type: NamedIndividual
is level5 segment of: Food Crop Production
is replaced by: Mushroom Production
created with: infer-bics.sql
derived from: Mushroom Production
  type: BicsLevel5Segment
  type: Classifier
  type: ContemporaryDerivation
  derived from: http://data.ga-group.nl/ics/bics/2014/1210101313
  source accessed on: 2019-12-03T20:05:01Z
  source last accessed on: 2019-12-03T20:05:01Z
  definition: This segment includes companies that grow mushrooms in various environments.
  notation: 1210101313
  valid from: 2014-08-08
  valid till: 2020-10-03
source accessed on: 2019-12-03T20:05:01Z
source last accessed on: 2019-12-03T20:05:01Z
definition: This segment includes companies that grow mushrooms in various environments.
notation: 1210101313
valid from: 2014-08-08
valid till: 2020-10-03

Palm Oil Farming
type: BicsLevel6Segment
type: Classifier
type: NamedIndividual
is level6 segment of: Oilseed Farming
is replaced by: Palm Oil Farming
created with: infer-bics.sql
derived from: Palm Oil Farming
  type: BicsLevel6Segment
  type: Classifier
  type: ContemporaryDerivation
  derived from: http://data.ga-group.nl/ics/bics/2014/121010131410
  source accessed on: 2019-12-03T20:05:01Z
  source last accessed on: 2019-12-03T20:05:01Z
  definition: This segment includes companies that grow palms for palm oil production.
  notation: 121010131410
  valid from: 2014-08-08
  valid till: 2020-10-03
source accessed on: 2019-12-03T20:05:01Z
source last accessed on: 2019-12-03T20:05:01Z
definition: This segment includes companies that grow palms for palm oil production.
notation: 121010131410
valid from: 2014-08-08
valid till: 2020-10-03

Soybean Farming
type: BicsLevel6Segment
type: Classifier
type: NamedIndividual
is level6 segment of: Oilseed Farming
is replaced by: Soybean Farming
created with: infer-bics.sql
derived from: Soybean Farming
  type: BicsLevel6Segment
  type: Classifier
  type: ContemporaryDerivation
  derived from: http://data.ga-group.nl/ics/bics/2014/121010131411
  source accessed on: 2019-12-03T20:05:01Z
  source last accessed on: 2019-12-03T20:05:01Z
  definition: This segment includes companies that grow soybeans or soybean by-products.
  notation: 121010131411
  valid from: 2014-08-08
  valid till: 2020-10-03
source accessed on: 2019-12-03T20:05:01Z
source last accessed on: 2019-12-03T20:05:01Z
definition: This segment includes companies that grow soybeans or soybean by-products.
notation: 121010131411
valid from: 2014-08-08
valid till: 2020-10-03

Other Oilseed Farming
type: BicsLevel6Segment
type: Classifier
type: NamedIndividual
is level6 segment of: Oilseed Farming
created with: infer-bics.sql
derived from: Other Oilseed Farming
  type: BicsLevel6Segment
  type: Classifier
  type: ContemporaryDerivation
  derived from: http://data.ga-group.nl/ics/bics/2014/121010131412
  source accessed on: 2019-12-03T20:05:01Z
  source last accessed on: 2019-12-03T20:05:01Z
  definition: This segment includes companies that grow oilseed-producing plants not elsewhere classified. Plants include sunflowers, safflower, flax, cape, canola and sesame.
  notation: 121010131412
  valid from: 2014-08-08
  valid till: 2020-10-03
source accessed on: 2019-12-03T20:05:01Z
source last accessed on: 2019-12-03T20:05:01Z
definition: This segment includes companies that grow oilseed-producing plants not elsewhere classified. Plants include sunflowers, safflower, flax, cape, canola and sesame.
notation: 121010131412
valid from: 2014-08-08
valid till: 2020-10-03

Oilseed Farming
type: BicsLevel5Segment
type: Classifier
type: NamedIndividual
is level5 segment of: Food Crop Production
is replaced by: Oilseed Farming
created with: infer-bics.sql
derived from: Oilseed Farming
  type: BicsLevel5Segment
  type: Classifier
  type: ContemporaryDerivation
  derived from: http://data.ga-group.nl/ics/bics/2014/1210101314
  source accessed on: 2019-12-03T20:05:01Z
  source last accessed on: 2019-12-03T20:05:01Z
  definition: This segment includes companies that grow oilseed-producing plants, such as sunflowers, safflower, flax, cape, canola and sesame.
  notation: 1210101314
  valid from: 2014-08-08
  valid till: 2020-10-03
source accessed on: 2019-12-03T20:05:01Z
source last accessed on: 2019-12-03T20:05:01Z
definition: This segment includes companies that grow oilseed-producing plants, such as sunflowers, safflower, flax, cape, canola and sesame.
notation: 1210101314
valid from: 2014-08-08
valid till: 2020-10-03

Sugarcane Farming
type: BicsLevel5Segment
type: Classifier
type: NamedIndividual
is level5 segment of: Food Crop Production
is replaced by: Sugarcane Farming
created with: infer-bics.sql
derived from: Sugarcane Farming
  type: BicsLevel5Segment
  type: Classifier
  type: ContemporaryDerivation
  derived from: http://data.ga-group.nl/ics/bics/2014/1210101315
  source accessed on: 2019-12-03T20:05:01Z
  source last accessed on: 2019-12-03T20:05:01Z
  definition: This segment includes companies that grow sugarcane.
  notation: 1210101315
  valid from: 2014-08-08
  valid till: 2020-10-03
source accessed on: 2019-12-03T20:05:01Z
source last accessed on: 2019-12-03T20:05:01Z
definition: This segment includes companies that grow sugarcane.
notation: 1210101315
valid from: 2014-08-08
valid till: 2020-10-03

Tree Nut Farming
type: BicsLevel5Segment
type: Classifier
type: NamedIndividual
is level5 segment of: Food Crop Production
is replaced by: Tree Nut Farming
created with: infer-bics.sql
derived from: Tree Nut Farming
  type: BicsLevel5Segment
  type: Classifier
  type: ContemporaryDerivation
  derived from: http://data.ga-group.nl/ics/bics/2014/1210101316
  source accessed on: 2019-12-03T20:05:01Z
  source last accessed on: 2019-12-03T20:05:01Z
  definition: This segment includes companies that grow tree nuts.
  notation: 1210101316
  valid from: 2014-08-08
  valid till: 2020-10-03
source accessed on: 2019-12-03T20:05:01Z
source last accessed on: 2019-12-03T20:05:01Z
definition: This segment includes companies that grow tree nuts.
notation: 1210101316
valid from: 2014-08-08
valid till: 2020-10-03

Potato Farming
type: BicsLevel6Segment
type: Classifier
type: NamedIndividual
is level6 segment of: Vegetable Farming
created with: infer-bics.sql
derived from: Potato Farming
  type: BicsLevel6Segment
  type: Classifier
  type: ContemporaryDerivation
  derived from: http://data.ga-group.nl/ics/bics/2014/121010131710
  source accessed on: 2019-12-03T20:05:01Z
  source last accessed on: 2019-12-03T20:05:01Z
  definition: This segment includes companies that grow potatoes.
  notation: 121010131710
  valid from: 2014-08-08
  valid till: 2020-10-03
source accessed on: 2019-12-03T20:05:01Z
source last accessed on: 2019-12-03T20:05:01Z
definition: This segment includes companies that grow potatoes.
notation: 121010131710
valid from: 2014-08-08
valid till: 2020-10-03

Other Vegetable Farming
type: BicsLevel6Segment
type: Classifier
type: NamedIndividual
is level6 segment of: Vegetable Farming
created with: infer-bics.sql
derived from: Other Vegetable Farming
  type: BicsLevel6Segment
  type: Classifier
  type: ContemporaryDerivation
  derived from: http://data.ga-group.nl/ics/bics/2014/121010131711
  source accessed on: 2019-12-03T20:05:01Z
  source last accessed on: 2019-12-03T20:05:01Z
  definition: This segment includes companies that grow various other vegetables not elsewhere classified.
  notation: 121010131711
  valid from: 2014-08-08
  valid till: 2020-10-03
source accessed on: 2019-12-03T20:05:01Z
source last accessed on: 2019-12-03T20:05:01Z
definition: This segment includes companies that grow various other vegetables not elsewhere classified.
notation: 121010131711
valid from: 2014-08-08
valid till: 2020-10-03

Vegetable Farming
type: BicsLevel5Segment
type: Classifier
type: NamedIndividual
is level5 segment of: Food Crop Production
is replaced by: Vegetable Farming
created with: infer-bics.sql
derived from: Vegetable Farming
  type: BicsLevel5Segment
  type: Classifier
  type: ContemporaryDerivation
  derived from: http://data.ga-group.nl/ics/bics/2014/1210101317
  source accessed on: 2019-12-03T20:05:01Z
  source last accessed on: 2019-12-03T20:05:01Z
  definition: This segment includes companies that grow vegetables.
  notation: 1210101317
  valid from: 2014-08-08
  valid till: 2020-10-03
source accessed on: 2019-12-03T20:05:01Z
source last accessed on: 2019-12-03T20:05:01Z
definition: This segment includes companies that grow vegetables.
notation: 1210101317
valid from: 2014-08-08
valid till: 2020-10-03

Support Services - Crop Prod
type: BicsLevel5Segment
type: Classifier
type: NamedIndividual
is level5 segment of: Food Crop Production
is replaced by: Support Services - Crop Prod
created with: infer-bics.sql
derived from: Support Services - Crop Prod
  type: BicsLevel5Segment
  type: Classifier
  type: ContemporaryDerivation
  derived from: http://data.ga-group.nl/ics/bics/2014/1210101318
  source accessed on: 2019-12-03T20:05:01Z
  source last accessed on: 2019-12-03T20:05:01Z
  definition: This segment includes companies that support activities (either pre- or post-harvest) for crop production.
  notation: 1210101318
  valid from: 2014-08-08
  valid till: 2020-10-03
source accessed on: 2019-12-03T20:05:01Z
source last accessed on: 2019-12-03T20:05:01Z
definition: This segment includes companies that support activities (either pre- or post-harvest) for crop production.
notation: 1210101318
valid from: 2014-08-08
valid till: 2020-10-03

Food Crop Production
type: BicsLevel4SubIndustry
type: Classifier
type: NamedIndividual
created with: infer-bics.sql
derived from: Food Crop Production
  type: BicsLevel4SubIndustry
  type: Classifier
  type: ContemporaryDerivation
  derived from: http://data.ga-group.nl/ics/bics/2014/12101013
  source accessed on: 2019-12-03T20:05:01Z
  source last accessed on: 2019-12-03T20:05:01Z
  definition: This industry subgroup includes companies that produce crops for food consumption.
  notation: 12101013
  valid from: 2014-08-08
  valid till: 2020-10-03
source accessed on: 2019-12-03T20:05:01Z
source last accessed on: 2019-12-03T20:05:01Z
definition: This industry subgroup includes companies that produce crops for food consumption.
notation: 12101013
valid from: 2014-08-08
valid till: 2020-10-03

Fats & Oil Refining
type: BicsLevel6Segment
type: Classifier
type: NamedIndividual
is level6 segment of: Grain & Oilseed Milling
is replaced by: Fats & Oil Refining
created with: infer-bics.sql
derived from: Fats & Oil Refining
  type: BicsLevel6Segment
  type: Classifier
  type: ContemporaryDerivation
  derived from: http://data.ga-group.nl/ics/bics/2014/121010141010
  source accessed on: 2019-12-03T20:05:01Z
  source last accessed on: 2019-12-03T20:05:01Z
  definition: This segment includes companies that refine cooking oils from purchased fats.
  notation: 121010141010
  valid from: 2014-08-08
  valid till: 2020-10-03
source accessed on: 2019-12-03T20:05:01Z
source last accessed on: 2019-12-03T20:05:01Z
definition: This segment includes companies that refine cooking oils from purchased fats.
notation: 121010141010
valid from: 2014-08-08
valid till: 2020-10-03

Flour Milling
type: BicsLevel6Segment
type: Classifier
type: NamedIndividual
is level6 segment of: Grain & Oilseed Milling
is replaced by: Flour Milling
created with: infer-bics.sql
derived from: Flour Milling
  type: BicsLevel6Segment
  type: Classifier
  type: ContemporaryDerivation
  derived from: http://data.ga-group.nl/ics/bics/2014/121010141011
  source accessed on: 2019-12-03T20:05:01Z
  source last accessed on: 2019-12-03T20:05:01Z
  definition: This segment includes companies that mill grains into flour used in food products.
  notation: 121010141011
  valid from: 2014-08-08
  valid till: 2020-10-03
source accessed on: 2019-12-03T20:05:01Z
source last accessed on: 2019-12-03T20:05:01Z
definition: This segment includes companies that mill grains into flour used in food products.
notation: 121010141011
valid from: 2014-08-08
valid till: 2020-10-03

Malt
type: BicsLevel6Segment
type: Classifier
type: NamedIndividual
is level6 segment of: Grain & Oilseed Milling
is replaced by: Malt
created with: infer-bics.sql
derived from: Malt
  type: BicsLevel6Segment
  type: Classifier
  type: ContemporaryDerivation
  derived from: http://data.ga-group.nl/ics/bics/2014/121010141012
  source accessed on: 2019-12-03T20:05:01Z
  source last accessed on: 2019-12-03T20:05:01Z
  definition: This segment includes companies that process grain into malt for wholesale to breweries and distilleries. The companies purchase barley or grow their own barley and use a multi-step process to dry, steep, germinate and kiln the barley into malt.
  notation: 121010141012
  valid from: 2014-08-08
  valid till: 2020-10-03
source accessed on: 2019-12-03T20:05:01Z
source last accessed on: 2019-12-03T20:05:01Z
definition: This segment includes companies that process grain into malt for wholesale to breweries and distilleries. The companies purchase barley or grow their own barley and use a multi-step process to dry, steep, germinate and kiln the barley into malt.
notation: 121010141012
valid from: 2014-08-08
valid till: 2020-10-03

Palm Oil Processing
type: BicsLevel6Segment
type: Classifier
type: NamedIndividual
is level6 segment of: Grain & Oilseed Milling
is replaced by: Palm Oil Processing
created with: infer-bics.sql
derived from: Palm Oil Processing
  type: BicsLevel6Segment
  type: Classifier
  type: ContemporaryDerivation
  derived from: http://data.ga-group.nl/ics/bics/2014/121010141013
  source accessed on: 2019-12-03T20:05:01Z
  source last accessed on: 2019-12-03T20:05:01Z
  definition: This segment includes companies that produce palm oil.
  notation: 121010141013
  valid from: 2014-08-08
  valid till: 2020-10-03
source accessed on: 2019-12-03T20:05:01Z
source last accessed on: 2019-12-03T20:05:01Z
definition: This segment includes companies that produce palm oil.
notation: 121010141013
valid from: 2014-08-08
valid till: 2020-10-03

Rice Milling
type: BicsLevel6Segment
type: Classifier
type: NamedIndividual
is level6 segment of: Grain & Oilseed Milling
is replaced by: Rice Milling
created with: infer-bics.sql
derived from: Rice Milling
  type: BicsLevel6Segment
  type: Classifier
  type: ContemporaryDerivation
  derived from: http://data.ga-group.nl/ics/bics/2014/121010141014
  source accessed on: 2019-12-03T20:05:01Z
  source last accessed on: 2019-12-03T20:05:01Z
  definition: This segment includes companies that mill rice, typically using a rice huller that separates the seed from the chaff.
  notation: 121010141014
  valid from: 2014-08-08
  valid till: 2020-10-03
source accessed on: 2019-12-03T20:05:01Z
source last accessed on: 2019-12-03T20:05:01Z
definition: This segment includes companies that mill rice, typically using a rice huller that separates the seed from the chaff.
notation: 121010141014
valid from: 2014-08-08
valid till: 2020-10-03

Soybean Processing
type: BicsLevel6Segment
type: Classifier
type: NamedIndividual
is level6 segment of: Grain & Oilseed Milling
is replaced by: Soybean Processing
created with: infer-bics.sql
derived from: Soybean Processing
  type: BicsLevel6Segment
  type: Classifier
  type: ContemporaryDerivation
  derived from: http://data.ga-group.nl/ics/bics/2014/121010141015
  source accessed on: 2019-12-03T20:05:01Z
  source last accessed on: 2019-12-03T20:05:01Z
  definition: This segment includes companies that process soybeans into tofu, oils, animal feed and other edible forms.
  notation: 121010141015
  valid from: 2014-08-08
  valid till: 2020-10-03
source accessed on: 2019-12-03T20:05:01Z
source last accessed on: 2019-12-03T20:05:01Z
definition: This segment includes companies that process soybeans into tofu, oils, animal feed and other edible forms.
notation: 121010141015
valid from: 2014-08-08
valid till: 2020-10-03

Wet Corn Milling
type: BicsLevel6Segment
type: Classifier
type: NamedIndividual
is level6 segment of: Grain & Oilseed Milling
is replaced by: Wet Corn Milling
created with: infer-bics.sql
derived from: Wet Corn Milling
  type: BicsLevel6Segment
  type: Classifier
  type: ContemporaryDerivation
  derived from: http://data.ga-group.nl/ics/bics/2014/121010141016
  source accessed on: 2019-12-03T20:05:01Z
  source last accessed on: 2019-12-03T20:05:01Z
  definition: This segment includes companies that mill wet corn into corn flour.
  notation: 121010141016
  valid from: 2014-08-08
  valid till: 2020-10-03
source accessed on: 2019-12-03T20:05:01Z
source last accessed on: 2019-12-03T20:05:01Z
definition: This segment includes companies that mill wet corn into corn flour.
notation: 121010141016
valid from: 2014-08-08
valid till: 2020-10-03

Other Oilseed Processing
type: BicsLevel6Segment
type: Classifier
type: NamedIndividual
is level6 segment of: Grain & Oilseed Milling
created with: infer-bics.sql
derived from: Other Oilseed Processing
  type: BicsLevel6Segment
  type: Classifier
  type: ContemporaryDerivation
  derived from: http://data.ga-group.nl/ics/bics/2014/121010141017
  source accessed on: 2019-12-03T20:05:01Z
  source last accessed on: 2019-12-03T20:05:01Z
  definition: This segment includes companies that process grains, vegetables, and olives into oils used in cooking. Such oil includes canola oil, flaxseed oil and coconut oil, as well as margarines.
  notation: 121010141017
  valid from: 2014-08-08
  valid till: 2020-10-03
source accessed on: 2019-12-03T20:05:01Z
source last accessed on: 2019-12-03T20:05:01Z
definition: This segment includes companies that process grains, vegetables, and olives into oils used in cooking. Such oil includes canola oil, flaxseed oil and coconut oil, as well as margarines.
notation: 121010141017
valid from: 2014-08-08
valid till: 2020-10-03

Grain & Oilseed Milling
type: BicsLevel5Segment
type: Classifier
type: NamedIndividual
is level5 segment of: Sugar, Grain & Oilseed Mill
is replaced by: Grain & Oilseed Milling
created with: infer-bics.sql
derived from: Grain & Oilseed Milling
  type: BicsLevel5Segment
  type: Classifier
  type: ContemporaryDerivation
  derived from: http://data.ga-group.nl/ics/bics/2014/1210101410
  source accessed on: 2019-12-03T20:05:01Z
  source last accessed on: 2019-12-03T20:05:01Z
  definition: This segment includes companies that grind various grains and produce consumable oils from fruits and vegetables.
  notation: 1210101410
  valid from: 2014-08-08
  valid till: 2020-10-03
source accessed on: 2019-12-03T20:05:01Z
source last accessed on: 2019-12-03T20:05:01Z
definition: This segment includes companies that grind various grains and produce consumable oils from fruits and vegetables.
notation: 1210101410
valid from: 2014-08-08
valid till: 2020-10-03

Beet Sugar
type: BicsLevel6Segment
type: Classifier
type: NamedIndividual
is level6 segment of: Sugar
is replaced by: Beet Sugar
created with: infer-bics.sql
derived from: Beet Sugar
  type: BicsLevel6Segment
  type: Classifier
  type: ContemporaryDerivation
  derived from: http://data.ga-group.nl/ics/bics/2014/121010141110
  source accessed on: 2019-12-03T20:05:01Z
  source last accessed on: 2019-12-03T20:05:01Z
  definition: This segment includes companies that produce beet sugar.
  notation: 121010141110
  valid from: 2014-08-08
  valid till: 2020-10-03
source accessed on: 2019-12-03T20:05:01Z
source last accessed on: 2019-12-03T20:05:01Z
definition: This segment includes companies that produce beet sugar.
notation: 121010141110
valid from: 2014-08-08
valid till: 2020-10-03

Cane Sugar Refining
type: BicsLevel6Segment
type: Classifier
type: NamedIndividual
is level6 segment of: Sugar
is replaced by: Cane Sugar Refining
created with: infer-bics.sql
derived from: Cane Sugar Refining
  type: BicsLevel6Segment
  type: Classifier
  type: ContemporaryDerivation
  derived from: http://data.ga-group.nl/ics/bics/2014/121010141111
  source accessed on: 2019-12-03T20:05:01Z
  source last accessed on: 2019-12-03T20:05:01Z
  definition: This segment includes companies that produce sugar products from purchased raw cane sugar.
  notation: 121010141111
  valid from: 2014-08-08
  valid till: 2020-10-03
source accessed on: 2019-12-03T20:05:01Z
source last accessed on: 2019-12-03T20:05:01Z
definition: This segment includes companies that produce sugar products from purchased raw cane sugar.
notation: 121010141111
valid from: 2014-08-08
valid till: 2020-10-03

Sugarcane Mills
type: BicsLevel6Segment
type: Classifier
type: NamedIndividual
is level6 segment of: Sugar
is replaced by: Sugarcane Mills
created with: infer-bics.sql
derived from: Sugarcane Mills
  type: BicsLevel6Segment
  type: Classifier
  type: ContemporaryDerivation
  derived from: http://data.ga-group.nl/ics/bics/2014/121010141112
  source accessed on: 2019-12-03T20:05:01Z
  source last accessed on: 2019-12-03T20:05:01Z
  definition: This segment includes companies that produce sugar manufactured in their own sugarcane mills. Such sugar includes brown sugar, white sugar and molasses.
  notation: 121010141112
  valid from: 2014-08-08
  valid till: 2020-10-03
source accessed on: 2019-12-03T20:05:01Z
source last accessed on: 2019-12-03T20:05:01Z
definition: This segment includes companies that produce sugar manufactured in their own sugarcane mills. Such sugar includes brown sugar, white sugar and molasses.
notation: 121010141112
valid from: 2014-08-08
valid till: 2020-10-03

Sugar
type: BicsLevel5Segment
type: Classifier
type: NamedIndividual
is level5 segment of: Sugar, Grain & Oilseed Mill
is replaced by: Sugar
created with: infer-bics.sql
derived from: Sugar
  type: BicsLevel5Segment
  type: Classifier
  type: ContemporaryDerivation
  derived from: http://data.ga-group.nl/ics/bics/2014/1210101411
  source accessed on: 2019-12-03T20:05:01Z
  source last accessed on: 2019-12-03T20:05:01Z
  definition: This segment includes companies that produce sugar in all forms.
  notation: 1210101411
  valid from: 2014-08-08
  valid till: 2020-10-03
source accessed on: 2019-12-03T20:05:01Z
source last accessed on: 2019-12-03T20:05:01Z
definition: This segment includes companies that produce sugar in all forms.
notation: 1210101411
valid from: 2014-08-08
valid till: 2020-10-03

Sugar, Grain & Oilseed Mill
type: BicsLevel4SubIndustry
type: Classifier
type: NamedIndividual
created with: infer-bics.sql
derived from: Sugar, Grain & Oilseed Mill
  type: BicsLevel4SubIndustry
  type: Classifier
  type: ContemporaryDerivation
  derived from: http://data.ga-group.nl/ics/bics/2014/12101014
  source accessed on: 2019-12-03T20:05:01Z
  source last accessed on: 2019-12-03T20:05:01Z
  definition: This industry subgroup includes companies that produce sugar, grind various grains and produce consumable oils from fruits and vegetables.
  notation: 12101014
  valid from: 2014-08-08
  valid till: 2020-10-03
source accessed on: 2019-12-03T20:05:01Z
source last accessed on: 2019-12-03T20:05:01Z
definition: This industry subgroup includes companies that produce sugar, grind various grains and produce consumable oils from fruits and vegetables.
notation: 12101014
valid from: 2014-08-08
valid till: 2020-10-03

Food
type: BicsLevel3Industry
type: Classifier
type: NamedIndividual
is industry of: Consumer Staple Products
is replaced by: Agricultural Producers
created with: infer-bics.sql
derived from: Agricultural Producers
  type: BicsLevel3Industry
  type: Classifier
  type: ContemporaryDerivation
  derived from: http://data.ga-group.nl/ics/bics/2014/121010
  source accessed on: 2019-12-03T20:05:01Z
  source last accessed on: 2019-12-03T20:05:01Z
  definition: This industry involves companies that grow crops like fruits, vegetables and grain. Also includes companies that raise, breed and process livestock, such as cattle and poultry, as well as fish or shellfish. Typically, these companies do not market or package their products for retail sales but are suppliers to food manufacturing companies and other commercial customers. Excludes crops not utilized for food consumption purposes, such as ornamental plants, tobacco, cotton or rubber trees.
  notation: 121010
  valid from: 2014-08-08
  valid till: 2020-10-03
derived from: Food
  type: BicsLevel3Industry
  type: Classifier
  type: ContemporaryDerivation
  derived from: http://data.ga-group.nl/ics/bics/2020/121010
  derived from: http://data.ga-group.nl/ics/bics/2024/121010
  source accessed on: 2023-07-03T18:11:29Z
  source last accessed on: 2024-06-05T14:42:36Z
  definition: This industry includes companies that grow, produce, or manufacture food.
  notation: 121010
  valid from: 2020-10-03
source accessed on: 2019-12-03T20:05:01Z
source last accessed on: 2024-06-05T14:42:36Z
definition: This industry includes companies that grow, produce, or manufacture food.
notation: 121010
valid from: 2014-08-08

Brewers
type: BicsLevel5Segment
type: Classifier
type: NamedIndividual
is level5 segment of: Alcoholic Beverages
is replaced by: Baked Goods
replaces: Tobacco Farming
created with: infer-bics.sql
derived from: Baked Goods
  type: BicsLevel5Segment
  type: Classifier
  type: ContemporaryDerivation
  derived from: http://data.ga-group.nl/ics/bics/2014/1210111010
  source accessed on: 2019-12-03T20:05:01Z
  source last accessed on: 2019-12-03T20:05:01Z
  definition: This segment includes companies that produce baked goods, such as bread, biscuits, croutons, doughnuts, pies and pastries.
  notation: 1210111010
  valid from: 2014-08-08
  valid till: 2020-10-03
derived from: Brewers
  type: BicsLevel5Segment
  type: Classifier
  type: AnachronousDerivation
  derived from: http://data.ga-group.nl/ics/bics/2014/1210121010
  source accessed on: 2019-12-03T20:05:01Z
  source last accessed on: 2019-12-03T20:05:01Z
  definition: This segment includes companies that produce beer, malt liquor and non-alcoholic beer.
  notation: 1210121010
  valid from: 2014-08-08
  valid till: 2020-10-03
derived from: Brewers
  type: BicsLevel5Segment
  type: Classifier
  type: ContemporaryDerivation
  derived from: http://data.ga-group.nl/ics/bics/2020/1210111010
  derived from: http://data.ga-group.nl/ics/bics/2024/1210111010
  source accessed on: 2023-07-03T18:11:29Z
  source last accessed on: 2024-06-05T14:42:36Z
  definition: This segment includes companies that produce beer, malt liquor, and non-alcoholic beer.
  notation: 1210111010
  valid from: 2020-10-03
source accessed on: 2019-12-03T20:05:01Z
source last accessed on: 2024-06-05T14:42:36Z
definition: This segment includes companies that produce beer, malt liquor, and non-alcoholic beer.
notation: 1210111010
valid from: 2014-08-08

Dry Pasta
type: BicsLevel6Segment
type: Classifier
type: NamedIndividual
is level6 segment of: Distillers
is replaced by: Pasta
created with: infer-bics.sql
derived from: Dry Pasta
  type: BicsLevel6Segment
  type: Classifier
  type: ContemporaryDerivation
  derived from: http://data.ga-group.nl/ics/bics/2014/121011101110
  source accessed on: 2019-12-03T20:05:01Z
  source last accessed on: 2019-12-03T20:05:01Z
  definition: This segment includes companies that produce dry pasta, noodles and spaghetti.
  notation: 121011101110
  valid from: 2014-08-08
  valid till: 2020-10-03
source accessed on: 2019-12-03T20:05:01Z
source last accessed on: 2019-12-03T20:05:01Z
definition: This segment includes companies that produce dry pasta, noodles and spaghetti.
notation: 121011101110
valid from: 2014-08-08
valid till: 2020-10-03

Flour Mixes & Dough
type: BicsLevel6Segment
type: Classifier
type: NamedIndividual
is level6 segment of: Distillers
is replaced by: Flour Mixes & Dough
created with: infer-bics.sql
derived from: Flour Mixes & Dough
  type: BicsLevel6Segment
  type: Classifier
  type: ContemporaryDerivation
  derived from: http://data.ga-group.nl/ics/bics/2014/121011101111
  source accessed on: 2019-12-03T20:05:01Z
  source last accessed on: 2019-12-03T20:05:01Z
  definition: This segment includes companies that produce, or mixes raw flour and dough.
  notation: 121011101111
  valid from: 2014-08-08
  valid till: 2020-10-03
source accessed on: 2019-12-03T20:05:01Z
source last accessed on: 2019-12-03T20:05:01Z
definition: This segment includes companies that produce, or mixes raw flour and dough.
notation: 121011101111
valid from: 2014-08-08
valid till: 2020-10-03

Noodles
type: BicsLevel6Segment
type: Classifier
type: NamedIndividual
is level6 segment of: Distillers
is replaced by: Noodles
created with: infer-bics.sql
derived from: Noodles
  type: BicsLevel6Segment
  type: Classifier
  type: ContemporaryDerivation
  derived from: http://data.ga-group.nl/ics/bics/2014/121011101112
  source accessed on: 2019-12-03T20:05:01Z
  source last accessed on: 2019-12-03T20:05:01Z
  definition: This segment includes companies that manufacture instant noodles.
  notation: 121011101112
  valid from: 2014-08-08
  valid till: 2020-10-03
source accessed on: 2019-12-03T20:05:01Z
source last accessed on: 2019-12-03T20:05:01Z
definition: This segment includes companies that manufacture instant noodles.
notation: 121011101112
valid from: 2014-08-08
valid till: 2020-10-03

Tortilla
type: BicsLevel6Segment
type: Classifier
type: NamedIndividual
is level6 segment of: Distillers
created with: infer-bics.sql
derived from: Tortilla
  type: BicsLevel6Segment
  type: Classifier
  type: ContemporaryDerivation
  derived from: http://data.ga-group.nl/ics/bics/2014/121011101113
  source accessed on: 2019-12-03T20:05:01Z
  source last accessed on: 2019-12-03T20:05:01Z
  definition: This segment includes companies that produce tortillas from corn flour.
  notation: 121011101113
  valid from: 2014-08-08
  valid till: 2020-10-03
source accessed on: 2019-12-03T20:05:01Z
source last accessed on: 2019-12-03T20:05:01Z
definition: This segment includes companies that produce tortillas from corn flour.
notation: 121011101113
valid from: 2014-08-08
valid till: 2020-10-03

Distillers
type: BicsLevel5Segment
type: Classifier
type: NamedIndividual
is level5 segment of: Alcoholic Beverages
is replaced by: Pasta, Noodles & Rice
replaces: Tobacco Leaf
created with: infer-bics.sql
derived from: Flour Products (Non-Bread)
  type: BicsLevel5Segment
  type: Classifier
  type: ContemporaryDerivation
  derived from: http://data.ga-group.nl/ics/bics/2014/1210111011
  source accessed on: 2019-12-03T20:05:01Z
  source last accessed on: 2019-12-03T20:05:01Z
  definition: This segment includes companies that produce flour products other than bread.
  notation: 1210111011
  valid from: 2014-08-08
  valid till: 2020-10-03
derived from: Distillers
  type: BicsLevel5Segment
  type: Classifier
  type: AnachronousDerivation
  derived from: http://data.ga-group.nl/ics/bics/2014/1210121011
  source accessed on: 2019-12-03T20:05:01Z
  source last accessed on: 2019-12-03T20:05:01Z
  definition: This segment includes companies that produce distilled, potable, alcoholic beverages like bourbon, scotch and gin.
  notation: 1210121011
  valid from: 2014-08-08
  valid till: 2020-10-03
derived from: Distillers
  type: BicsLevel5Segment
  type: Classifier
  type: ContemporaryDerivation
  derived from: http://data.ga-group.nl/ics/bics/2020/1210111011
  derived from: http://data.ga-group.nl/ics/bics/2024/1210111011
  source accessed on: 2023-07-03T18:11:29Z
  source last accessed on: 2024-06-05T14:42:36Z
  definition: This segment includes companies that produce distilled, potable, alcoholic beverages like bourbon, scotch, and gin.
  notation: 1210111011
  valid from: 2020-10-03
source accessed on: 2019-12-03T20:05:01Z
source last accessed on: 2024-06-05T14:42:36Z
definition: This segment includes companies that produce distilled, potable, alcoholic beverages like bourbon, scotch, and gin.
notation: 1210111011
valid from: 2014-08-08

Vintners
type: BicsLevel5Segment
type: Classifier
type: NamedIndividual
is level5 segment of: Alcoholic Beverages
is replaced by: Frozen Cakes & Pastries
replaces: Tobacco Products
created with: infer-bics.sql
derived from: Frozen Cakes & Pastries
  type: BicsLevel5Segment
  type: Classifier
  type: ContemporaryDerivation
  derived from: http://data.ga-group.nl/ics/bics/2014/1210111012
  source accessed on: 2019-12-03T20:05:01Z
  source last accessed on: 2019-12-03T20:05:01Z
  definition: This segment includes companies that produce cakes, pastries and other baked goods that are frozen for mass distribution.
  notation: 1210111012
  valid from: 2014-08-08
  valid till: 2020-10-03
derived from: Vintners
  type: BicsLevel5Segment
  type: Classifier
  type: AnachronousDerivation
  derived from: http://data.ga-group.nl/ics/bics/2014/1210121012
  source accessed on: 2019-12-03T20:05:01Z
  source last accessed on: 2019-12-03T20:05:01Z
  definition: This segment includes companies that produce wine, brandies and other fruit-based alcoholic drinks.
  notation: 1210121012
  valid from: 2014-08-08
  valid till: 2020-10-03
derived from: Vintners
  type: BicsLevel5Segment
  type: Classifier
  type: ContemporaryDerivation
  derived from: http://data.ga-group.nl/ics/bics/2020/1210111012
  derived from: http://data.ga-group.nl/ics/bics/2024/1210111012
  source accessed on: 2023-07-03T18:11:29Z
  source last accessed on: 2024-06-05T14:42:36Z
  definition: This segment includes companies that produce wine, brandies, and other fruit-based alcoholic drinks.
  notation: 1210111012
  valid from: 2020-10-03
source accessed on: 2019-12-03T20:05:01Z
source last accessed on: 2024-06-05T14:42:36Z
definition: This segment includes companies that produce wine, brandies, and other fruit-based alcoholic drinks.
notation: 1210111012
valid from: 2014-08-08

Alcoholic Beverages
type: BicsLevel4SubIndustry
type: Classifier
type: NamedIndividual
created with: infer-bics.sql
derived from: Bread & Bakery Products
  type: BicsLevel4SubIndustry
  type: Classifier
  type: ContemporaryDerivation
  derived from: http://data.ga-group.nl/ics/bics/2014/12101110
  source accessed on: 2019-12-03T20:05:01Z
  source last accessed on: 2019-12-03T20:05:01Z
  definition: This industry subgroup includes companies that provide baked bread goods directly to consumers.
  notation: 12101110
  valid from: 2014-08-08
  valid till: 2020-10-03
derived from: Alcoholic Beverages
  type: BicsLevel4SubIndustry
  type: Classifier
  type: AnachronousDerivation
  derived from: http://data.ga-group.nl/ics/bics/2014/12101210
  source accessed on: 2019-12-03T20:05:01Z
  source last accessed on: 2019-12-03T20:05:01Z
  definition: This industry subgroup includes companies that brew beer, manufacture wine and brandies, and distill and mix liquors.
  notation: 12101210
  valid from: 2014-08-08
  valid till: 2020-10-03
derived from: Alcoholic Beverages
  type: BicsLevel4SubIndustry
  type: Classifier
  type: ContemporaryDerivation
  derived from: http://data.ga-group.nl/ics/bics/2020/12101110
  derived from: http://data.ga-group.nl/ics/bics/2024/12101110
  source accessed on: 2023-07-03T18:11:29Z
  source last accessed on: 2024-06-05T14:42:36Z
  definition: This industry subgroup includes companies that brew beer, manufacture wine and brandies, and distill and mix liquors.
  notation: 12101110
  valid from: 2020-10-03
source accessed on: 2019-12-03T20:05:01Z
source last accessed on: 2024-06-05T14:42:36Z
definition: This industry subgroup includes companies that brew beer, manufacture wine and brandies, and distill and mix liquors.
notation: 12101110
valid from: 2014-08-08

Coffee
type: BicsLevel5Segment
type: Classifier
type: NamedIndividual
is level5 segment of: Non-Alcoholic Beverages
is replaced by: Syrup, Sugar & Sweeteners
replaces: Coffee
created with: infer-bics.sql
derived from: Flavoring Syrup & Concentrate
  type: BicsLevel5Segment
  type: Classifier
  type: ContemporaryDerivation
  derived from: http://data.ga-group.nl/ics/bics/2014/1210111110
  source accessed on: 2019-12-03T20:05:01Z
  source last accessed on: 2019-12-03T20:05:01Z
  definition: This segment includes companies that produce syrup drink concentrates that are used in fountain drinks or soft drinks.
  notation: 1210111110
  valid from: 2014-08-08
  valid till: 2020-10-03
derived from: Coffee
  type: BicsLevel6Segment
  type: Classifier
  type: AnachronousDerivation
  derived from: http://data.ga-group.nl/ics/bics/2014/121012111010
  source accessed on: 2019-12-03T20:05:01Z
  source last accessed on: 2019-12-03T20:05:01Z
  definition: This segment includes companies that manufacture and roast coffee.
  notation: 121012111010
  valid from: 2014-08-08
  valid till: 2020-10-03
derived from: Coffee
  type: BicsLevel5Segment
  type: Classifier
  type: ContemporaryDerivation
  derived from: http://data.ga-group.nl/ics/bics/2020/1210111110
  derived from: http://data.ga-group.nl/ics/bics/2024/1210111110
  source accessed on: 2023-07-03T18:11:29Z
  source last accessed on: 2024-06-05T14:42:36Z
  definition: This segment includes companies that manufacture bottled coffee beverages or roasted coffee beans.
  notation: 1210111110
  valid from: 2020-10-03
source accessed on: 2019-12-03T20:05:01Z
source last accessed on: 2024-06-05T14:42:36Z
definition: This segment includes companies that manufacture bottled coffee beverages or roasted coffee beans.
notation: 1210111110
valid from: 2014-08-08

Tea
type: BicsLevel5Segment
type: Classifier
type: NamedIndividual
is level5 segment of: Non-Alcoholic Beverages
replaces: Tea
created with: infer-bics.sql
derived from: Mayonnaise & Other Sauces
  type: BicsLevel5Segment
  type: Classifier
  type: ContemporaryDerivation
  derived from: http://data.ga-group.nl/ics/bics/2014/1210111111
  source accessed on: 2019-12-03T20:05:01Z
  source last accessed on: 2019-12-03T20:05:01Z
  definition: This segment includes companies that produce mayonnaise, salad dressing, vinegar, mustard, soy sauce and other prepared sauces.
  notation: 1210111111
  valid from: 2014-08-08
  valid till: 2020-10-03
derived from: Tea
  type: BicsLevel6Segment
  type: Classifier
  type: AnachronousDerivation
  derived from: http://data.ga-group.nl/ics/bics/2014/121012111011
  source accessed on: 2019-12-03T20:05:01Z
  source last accessed on: 2019-12-03T20:05:01Z
  definition: This segment includes companies that manufacture bagged teas, boxed teas and loose-leaf teas.
  notation: 121012111011
  valid from: 2014-08-08
  valid till: 2020-10-03
derived from: Tea
  type: BicsLevel5Segment
  type: Classifier
  type: ContemporaryDerivation
  derived from: http://data.ga-group.nl/ics/bics/2020/1210111111
  derived from: http://data.ga-group.nl/ics/bics/2024/1210111111
  source accessed on: 2023-07-03T18:11:29Z
  source last accessed on: 2024-06-05T14:42:36Z
  definition: This segment includes companies that manufacture bottled tea beverages, bagged teas, boxed teas, and loose-leaf teas.
  notation: 1210111111
  valid from: 2020-10-03
source accessed on: 2019-12-03T20:05:01Z
source last accessed on: 2024-06-05T14:42:36Z
definition: This segment includes companies that manufacture bottled tea beverages, bagged teas, boxed teas, and loose-leaf teas.
notation: 1210111111
valid from: 2014-08-08

Bottled Water
type: BicsLevel5Segment
type: Classifier
type: NamedIndividual
is level5 segment of: Non-Alcoholic Beverages
is replaced by: Spices, Extracts & Flavorings
replaces: Bottled Water
created with: infer-bics.sql
derived from: Spice & Extract
  type: BicsLevel5Segment
  type: Classifier
  type: ContemporaryDerivation
  derived from: http://data.ga-group.nl/ics/bics/2014/1210111112
  source accessed on: 2019-12-03T20:05:01Z
  source last accessed on: 2019-12-03T20:05:01Z
  definition: This segment includes companies that produce spices, salt and seasonings.
  notation: 1210111112
  valid from: 2014-08-08
  valid till: 2020-10-03
derived from: Bottled Water
  type: BicsLevel6Segment
  type: Classifier
  type: AnachronousDerivation
  derived from: http://data.ga-group.nl/ics/bics/2014/121012111110
  source accessed on: 2019-12-03T20:05:01Z
  source last accessed on: 2019-12-03T20:05:01Z
  definition: This segment includes companies that manufacture bottled water.
  notation: 121012111110
  valid from: 2014-08-08
  valid till: 2020-10-03
derived from: Bottled Water
  type: BicsLevel5Segment
  type: Classifier
  type: ContemporaryDerivation
  derived from: http://data.ga-group.nl/ics/bics/2020/1210111112
  derived from: http://data.ga-group.nl/ics/bics/2024/1210111112
  source accessed on: 2023-07-03T18:11:29Z
  source last accessed on: 2024-06-05T14:42:36Z
  definition: This segment includes companies that manufacture bottled water.
  notation: 1210111112
  valid from: 2020-10-03
source accessed on: 2019-12-03T20:05:01Z
source last accessed on: 2024-06-05T14:42:36Z
definition: This segment includes companies that manufacture bottled water.
notation: 1210111112
valid from: 2014-08-08

Carbonated Soft Drinks
type: BicsLevel5Segment
type: Classifier
type: NamedIndividual
is level5 segment of: Non-Alcoholic Beverages
replaces: Soft Drink
created with: infer-bics.sql
derived from: Soft Drink
  type: BicsLevel6Segment
  type: Classifier
  type: AnachronousDerivation
  derived from: http://data.ga-group.nl/ics/bics/2014/121012111112
  source accessed on: 2019-12-03T20:05:01Z
  source last accessed on: 2019-12-03T20:05:01Z
  definition: This segment includes companies that manufacture soft drinks and juice beverages. Also known as soda, pop and carbonated beverage.
  notation: 121012111112
  valid from: 2014-08-08
  valid till: 2020-10-03
derived from: Carbonated Soft Drinks
  type: BicsLevel5Segment
  type: Classifier
  type: ContemporaryDerivation
  derived from: http://data.ga-group.nl/ics/bics/2020/1210111113
  derived from: http://data.ga-group.nl/ics/bics/2024/1210111113
  source accessed on: 2023-07-03T18:11:29Z
  source last accessed on: 2024-06-05T14:42:36Z
  definition: This segment includes companies that manufacture soft drinks.
  notation: 1210111113
  valid from: 2020-10-03
source accessed on: 2023-07-03T18:11:29Z
source last accessed on: 2024-06-05T14:42:36Z
definition: This segment includes companies that manufacture soft drinks.
notation: 1210111113
valid from: 2020-10-03

Fruit & Vegetable Juice
type: BicsLevel5Segment
type: Classifier
type: NamedIndividual
is level5 segment of: Non-Alcoholic Beverages
created with: infer-bics.sql
derived from: Fruit & Vegetable Juice
  type: BicsLevel5Segment
  type: Classifier
  type: ContemporaryDerivation
  derived from: http://data.ga-group.nl/ics/bics/2020/1210111114
  derived from: http://data.ga-group.nl/ics/bics/2024/1210111114
  source accessed on: 2023-07-03T18:11:29Z
  source last accessed on: 2024-06-05T14:42:36Z
  definition: This segment includes companies that manufacture fruit, vegetable, nut, and bean based beverages.
  notation: 1210111114
  valid from: 2020-10-03
source accessed on: 2023-07-03T18:11:29Z
source last accessed on: 2024-06-05T14:42:36Z
definition: This segment includes companies that manufacture fruit, vegetable, nut, and bean based beverages.
notation: 1210111114
valid from: 2020-10-03

Sports & Energy Drinks
type: BicsLevel5Segment
type: Classifier
type: NamedIndividual
is level5 segment of: Non-Alcoholic Beverages
created with: infer-bics.sql
derived from: Sports & Energy Drinks
  type: BicsLevel5Segment
  type: Classifier
  type: ContemporaryDerivation
  derived from: http://data.ga-group.nl/ics/bics/2020/1210111115
  derived from: http://data.ga-group.nl/ics/bics/2024/1210111115
  source accessed on: 2023-07-03T18:11:29Z
  source last accessed on: 2024-06-05T14:42:36Z
  definition: This segment includes companies that manufacture beverages that are marketed to restore energy or are marketed to provide hydration in sports applications.
  notation: 1210111115
  valid from: 2020-10-03
source accessed on: 2023-07-03T18:11:29Z
source last accessed on: 2024-06-05T14:42:36Z
definition: This segment includes companies that manufacture beverages that are marketed to restore energy or are marketed to provide hydration in sports applications.
notation: 1210111115
valid from: 2020-10-03

Non-Alcoholic Beverages
type: BicsLevel4SubIndustry
type: Classifier
type: NamedIndividual
created with: infer-bics.sql
derived from: Condiments
  type: BicsLevel4SubIndustry
  type: Classifier
  type: ContemporaryDerivation
  derived from: http://data.ga-group.nl/ics/bics/2014/12101111
  source accessed on: 2019-12-03T20:05:01Z
  source last accessed on: 2019-12-03T20:05:01Z
  definition: This industry subgroup includes companies that manufacture condiments.
  notation: 12101111
  valid from: 2014-08-08
  valid till: 2020-10-03
derived from: Non-Alcoholic Beverages
  type: BicsLevel4SubIndustry
  type: Classifier
  type: AnachronousDerivation
  derived from: http://data.ga-group.nl/ics/bics/2014/12101211
  source accessed on: 2019-12-03T20:05:01Z
  source last accessed on: 2019-12-03T20:05:01Z
  definition: This industry subgroup includes companies that manufacture non-alcoholic beverages as well as coffee and tea. Excludes dairy based beverages (see Dairy & Egg Products).
  notation: 12101211
  valid from: 2014-08-08
  valid till: 2020-10-03
derived from: Non-Alcoholic Beverages
  type: BicsLevel4SubIndustry
  type: Classifier
  type: ContemporaryDerivation
  derived from: http://data.ga-group.nl/ics/bics/2020/12101111
  derived from: http://data.ga-group.nl/ics/bics/2024/12101111
  source accessed on: 2023-07-03T18:11:29Z
  source last accessed on: 2024-06-05T14:42:36Z
  definition: This industry subgroup includes companies that manufacture non-alcoholic beverages.
  notation: 12101111
  valid from: 2020-10-03
source accessed on: 2019-12-03T20:05:01Z
source last accessed on: 2024-06-05T14:42:36Z
definition: This industry subgroup includes companies that manufacture non-alcoholic beverages.
notation: 12101111
valid from: 2014-08-08

Butter
type: BicsLevel5Segment
type: Classifier
type: NamedIndividual
is level5 segment of: Dairy & Egg Products
is replaced by: Butter
created with: infer-bics.sql
derived from: Butter
  type: BicsLevel5Segment
  type: Classifier
  type: ContemporaryDerivation
  derived from: http://data.ga-group.nl/ics/bics/2014/1210111210
  source accessed on: 2019-12-03T20:05:01Z
  source last accessed on: 2019-12-03T20:05:01Z
  definition: This segment includes companies that produce butter. It does not include companies that produce margarine.
  notation: 1210111210
  valid from: 2014-08-08
  valid till: 2020-10-03
source accessed on: 2019-12-03T20:05:01Z
source last accessed on: 2019-12-03T20:05:01Z
definition: This segment includes companies that produce butter. It does not include companies that produce margarine.
notation: 1210111210
valid from: 2014-08-08
valid till: 2020-10-03

Cheese
type: BicsLevel5Segment
type: Classifier
type: NamedIndividual
is level5 segment of: Dairy & Egg Products
is replaced by: Cheese
created with: infer-bics.sql
derived from: Cheese
  type: BicsLevel5Segment
  type: Classifier
  type: ContemporaryDerivation
  derived from: http://data.ga-group.nl/ics/bics/2014/1210111211
  source accessed on: 2019-12-03T20:05:01Z
  source last accessed on: 2019-12-03T20:05:01Z
  definition: This segment includes companies that produce all types of cheese.
  notation: 1210111211
  valid from: 2014-08-08
  valid till: 2020-10-03
source accessed on: 2019-12-03T20:05:01Z
source last accessed on: 2019-12-03T20:05:01Z
definition: This segment includes companies that produce all types of cheese.
notation: 1210111211
valid from: 2014-08-08
valid till: 2020-10-03

Dry & Condensed Dairy Products
type: BicsLevel5Segment
type: Classifier
type: NamedIndividual
is level5 segment of: Dairy & Egg Products
is replaced by: Dry & Condensed Dairy Products
created with: infer-bics.sql
derived from: Dry & Condensed Dairy Products
  type: BicsLevel5Segment
  type: Classifier
  type: ContemporaryDerivation
  derived from: http://data.ga-group.nl/ics/bics/2014/1210111212
  source accessed on: 2019-12-03T20:05:01Z
  source last accessed on: 2019-12-03T20:05:01Z
  definition: This segment includes companies that produce dry and condensed dairy, such as powdered milk and dulce de leche.
  notation: 1210111212
  valid from: 2014-08-08
  valid till: 2020-10-03
source accessed on: 2019-12-03T20:05:01Z
source last accessed on: 2019-12-03T20:05:01Z
definition: This segment includes companies that produce dry and condensed dairy, such as powdered milk and dulce de leche.
notation: 1210111212
valid from: 2014-08-08
valid till: 2020-10-03

Eggs
type: BicsLevel5Segment
type: Classifier
type: NamedIndividual
is level5 segment of: Dairy & Egg Products
is replaced by: Eggs
created with: infer-bics.sql
derived from: Eggs
  type: BicsLevel5Segment
  type: Classifier
  type: ContemporaryDerivation
  derived from: http://data.ga-group.nl/ics/bics/2014/1210111213
  source accessed on: 2019-12-03T20:05:01Z
  source last accessed on: 2019-12-03T20:05:01Z
  definition: This segment includes companies that produce poultry eggs.
  notation: 1210111213
  valid from: 2014-08-08
  valid till: 2020-10-03
source accessed on: 2019-12-03T20:05:01Z
source last accessed on: 2019-12-03T20:05:01Z
definition: This segment includes companies that produce poultry eggs.
notation: 1210111213
valid from: 2014-08-08
valid till: 2020-10-03

Fluid Milk
type: BicsLevel5Segment
type: Classifier
type: NamedIndividual
is level5 segment of: Dairy & Egg Products
is replaced by: Milk
created with: infer-bics.sql
derived from: Fluid Milk
  type: BicsLevel5Segment
  type: Classifier
  type: ContemporaryDerivation
  derived from: http://data.ga-group.nl/ics/bics/2014/1210111214
  source accessed on: 2019-12-03T20:05:01Z
  source last accessed on: 2019-12-03T20:05:01Z
  definition: This segment includes companies that produce milk, non-frozen yogurt, cream, buttermilk and cottage cheese. It does not include companies that produce soy-based products.
  notation: 1210111214
  valid from: 2014-08-08
  valid till: 2020-10-03
source accessed on: 2019-12-03T20:05:01Z
source last accessed on: 2019-12-03T20:05:01Z
definition: This segment includes companies that produce milk, non-frozen yogurt, cream, buttermilk and cottage cheese. It does not include companies that produce soy-based products.
notation: 1210111214
valid from: 2014-08-08
valid till: 2020-10-03

Ice Cream
type: BicsLevel5Segment
type: Classifier
type: NamedIndividual
is level5 segment of: Dairy & Egg Products
is replaced by: Ice Cream
created with: infer-bics.sql
derived from: Ice Cream
  type: BicsLevel5Segment
  type: Classifier
  type: ContemporaryDerivation
  derived from: http://data.ga-group.nl/ics/bics/2014/1210111215
  source accessed on: 2019-12-03T20:05:01Z
  source last accessed on: 2019-12-03T20:05:01Z
  definition: This segment includes companies that produce ice cream, sherbet, frozen yogurt, custard and any other frozen desserts.
  notation: 1210111215
  valid from: 2014-08-08
  valid till: 2020-10-03
source accessed on: 2019-12-03T20:05:01Z
source last accessed on: 2019-12-03T20:05:01Z
definition: This segment includes companies that produce ice cream, sherbet, frozen yogurt, custard and any other frozen desserts.
notation: 1210111215
valid from: 2014-08-08
valid till: 2020-10-03

Dairy & Egg Products
type: BicsLevel4SubIndustry
type: Classifier
type: NamedIndividual
created with: infer-bics.sql
derived from: Dairy & Egg Products
  type: BicsLevel4SubIndustry
  type: Classifier
  type: ContemporaryDerivation
  derived from: http://data.ga-group.nl/ics/bics/2014/12101112
  source accessed on: 2019-12-03T20:05:01Z
  source last accessed on: 2019-12-03T20:05:01Z
  definition: This industry subgroup includes companies that process dairy products.
  notation: 12101112
  valid from: 2014-08-08
  valid till: 2020-10-03
source accessed on: 2019-12-03T20:05:01Z
source last accessed on: 2019-12-03T20:05:01Z
definition: This industry subgroup includes companies that process dairy products.
notation: 12101112
valid from: 2014-08-08
valid till: 2020-10-03

Food Ingredients
type: BicsLevel4SubIndustry
type: Classifier
type: NamedIndividual
created with: infer-bics.sql
derived from: Food Ingredients
  type: BicsLevel4SubIndustry
  type: Classifier
  type: ContemporaryDerivation
  derived from: http://data.ga-group.nl/ics/bics/2014/12101113
  source accessed on: 2019-12-03T20:05:01Z
  source last accessed on: 2019-12-03T20:05:01Z
  definition: This industry subgroup includes companies that manufacture and produce basic food ingredients. Includes food ingredients (both natural and artificial), food additives (both natural and artificial) and color additives (both natural and artificial).
  notation: 12101113
  valid from: 2014-08-08
  valid till: 2020-10-03
source accessed on: 2019-12-03T20:05:01Z
source last accessed on: 2019-12-03T20:05:01Z
definition: This industry subgroup includes companies that manufacture and produce basic food ingredients. Includes food ingredients (both natural and artificial), food additives (both natural and artificial) and color additives (both natural and artificial).
notation: 12101113
valid from: 2014-08-08
valid till: 2020-10-03

Fruit & Vegetable Canning
type: BicsLevel6Segment
type: Classifier
type: NamedIndividual
is level6 segment of: Canned Food
is replaced by: Fruit & Vegetable Canning
created with: infer-bics.sql
derived from: Fruit & Vegetable Canning
  type: BicsLevel6Segment
  type: Classifier
  type: ContemporaryDerivation
  derived from: http://data.ga-group.nl/ics/bics/2014/121011141010
  source accessed on: 2019-12-03T20:05:01Z
  source last accessed on: 2019-12-03T20:05:01Z
  definition: This segment includes companies that can fruit and vegetable products.
  notation: 121011141010
  valid from: 2014-08-08
  valid till: 2020-10-03
source accessed on: 2019-12-03T20:05:01Z
source last accessed on: 2019-12-03T20:05:01Z
definition: This segment includes companies that can fruit and vegetable products.
notation: 121011141010
valid from: 2014-08-08
valid till: 2020-10-03

Specialty Canning
type: BicsLevel6Segment
type: Classifier
type: NamedIndividual
is level6 segment of: Canned Food
is replaced by: Specialty Canning
created with: infer-bics.sql
derived from: Specialty Canning
  type: BicsLevel6Segment
  type: Classifier
  type: ContemporaryDerivation
  derived from: http://data.ga-group.nl/ics/bics/2014/121011141011
  source accessed on: 2019-12-03T20:05:01Z
  source last accessed on: 2019-12-03T20:05:01Z
  definition: This segment includes companies that can products, excluding fruits and vegetables.
  notation: 121011141011
  valid from: 2014-08-08
  valid till: 2020-10-03
source accessed on: 2019-12-03T20:05:01Z
source last accessed on: 2019-12-03T20:05:01Z
definition: This segment includes companies that can products, excluding fruits and vegetables.
notation: 121011141011
valid from: 2014-08-08
valid till: 2020-10-03

Canned Food
type: BicsLevel5Segment
type: Classifier
type: NamedIndividual
is level5 segment of: Frozen, Canned & Perish Food
is replaced by: Canned Food
created with: infer-bics.sql
derived from: Canned Food
  type: BicsLevel5Segment
  type: Classifier
  type: ContemporaryDerivation
  derived from: http://data.ga-group.nl/ics/bics/2014/1210111410
  source accessed on: 2019-12-03T20:05:01Z
  source last accessed on: 2019-12-03T20:05:01Z
  definition: This segment includes companies that can fruits, vegetables and other food products excluding seafood.
  notation: 1210111410
  valid from: 2014-08-08
  valid till: 2020-10-03
source accessed on: 2019-12-03T20:05:01Z
source last accessed on: 2019-12-03T20:05:01Z
definition: This segment includes companies that can fruits, vegetables and other food products excluding seafood.
notation: 1210111410
valid from: 2014-08-08
valid till: 2020-10-03

Dried & Dehydrated Food
type: BicsLevel5Segment
type: Classifier
type: NamedIndividual
is level5 segment of: Frozen, Canned & Perish Food
is replaced by: Dried & Dehydrated Food
created with: infer-bics.sql
derived from: Dried & Dehydrated Food
  type: BicsLevel5Segment
  type: Classifier
  type: ContemporaryDerivation
  derived from: http://data.ga-group.nl/ics/bics/2014/1210111411
  source accessed on: 2019-12-03T20:05:01Z
  source last accessed on: 2019-12-03T20:05:01Z
  definition: This segment includes companies that produce dried fruits, vegetables and other food products, such as dried figs, dates, apricots, raisins and prunes.
  notation: 1210111411
  valid from: 2014-08-08
  valid till: 2020-10-03
source accessed on: 2019-12-03T20:05:01Z
source last accessed on: 2019-12-03T20:05:01Z
definition: This segment includes companies that produce dried fruits, vegetables and other food products, such as dried figs, dates, apricots, raisins and prunes.
notation: 1210111411
valid from: 2014-08-08
valid till: 2020-10-03

Frozen Fruit, Juice & Vegetable
type: BicsLevel6Segment
type: Classifier
type: NamedIndividual
is level6 segment of: Frozen Food
is replaced by: Frozen Fruit & Vegetable
created with: infer-bics.sql
derived from: Frozen Fruit, Juice & Vegetable
  type: BicsLevel6Segment
  type: Classifier
  type: ContemporaryDerivation
  derived from: http://data.ga-group.nl/ics/bics/2014/121011141210
  source accessed on: 2019-12-03T20:05:01Z
  source last accessed on: 2019-12-03T20:05:01Z
  definition: This segment includes companies that produce frozen fruit, vegetables and concentrated juices.
  notation: 121011141210
  valid from: 2014-08-08
  valid till: 2020-10-03
source accessed on: 2019-12-03T20:05:01Z
source last accessed on: 2019-12-03T20:05:01Z
definition: This segment includes companies that produce frozen fruit, vegetables and concentrated juices.
notation: 121011141210
valid from: 2014-08-08
valid till: 2020-10-03

Frozen Specialty Food
type: BicsLevel6Segment
type: Classifier
type: NamedIndividual
is level6 segment of: Frozen Food
is replaced by: Frozen Specialty Food
created with: infer-bics.sql
derived from: Frozen Specialty Food
  type: BicsLevel6Segment
  type: Classifier
  type: ContemporaryDerivation
  derived from: http://data.ga-group.nl/ics/bics/2014/121011141211
  source accessed on: 2019-12-03T20:05:01Z
  source last accessed on: 2019-12-03T20:05:01Z
  definition: This segment includes companies that produce other frozen specialty foods, such as dinners, noodles and microwave dishes.
  notation: 121011141211
  valid from: 2014-08-08
  valid till: 2020-10-03
source accessed on: 2019-12-03T20:05:01Z
source last accessed on: 2019-12-03T20:05:01Z
definition: This segment includes companies that produce other frozen specialty foods, such as dinners, noodles and microwave dishes.
notation: 121011141211
valid from: 2014-08-08
valid till: 2020-10-03

Frozen Food
type: BicsLevel5Segment
type: Classifier
type: NamedIndividual
is level5 segment of: Frozen, Canned & Perish Food
is replaced by: Frozen Food
created with: infer-bics.sql
derived from: Frozen Food
  type: BicsLevel5Segment
  type: Classifier
  type: ContemporaryDerivation
  derived from: http://data.ga-group.nl/ics/bics/2014/1210111412
  source accessed on: 2019-12-03T20:05:01Z
  source last accessed on: 2019-12-03T20:05:01Z
  definition: This segment includes companies that produce frozen, packaged food products.
  notation: 1210111412
  valid from: 2014-08-08
  valid till: 2020-10-03
source accessed on: 2019-12-03T20:05:01Z
source last accessed on: 2019-12-03T20:05:01Z
definition: This segment includes companies that produce frozen, packaged food products.
notation: 1210111412
valid from: 2014-08-08
valid till: 2020-10-03

Perishable Prepared Food
type: BicsLevel5Segment
type: Classifier
type: NamedIndividual
is level5 segment of: Frozen, Canned & Perish Food
is replaced by: Perishable Prepared Food
created with: infer-bics.sql
derived from: Perishable Prepared Food
  type: BicsLevel5Segment
  type: Classifier
  type: ContemporaryDerivation
  derived from: http://data.ga-group.nl/ics/bics/2014/1210111413
  source accessed on: 2019-12-03T20:05:01Z
  source last accessed on: 2019-12-03T20:05:01Z
  definition: This segment includes companies that prepare and package perishable foods, such as salads, pizza, macaroni and boxed lunches. This does not include companies that produce frozen or microwave meals.
  notation: 1210111413
  valid from: 2014-08-08
  valid till: 2020-10-03
source accessed on: 2019-12-03T20:05:01Z
source last accessed on: 2019-12-03T20:05:01Z
definition: This segment includes companies that prepare and package perishable foods, such as salads, pizza, macaroni and boxed lunches. This does not include companies that produce frozen or microwave meals.
notation: 1210111413
valid from: 2014-08-08
valid till: 2020-10-03

Fresh & Frozen Seafood Process
type: BicsLevel6Segment
type: Classifier
type: NamedIndividual
is level6 segment of: Seafood Products Prep & Pkg
is replaced by: Fresh & Frozen Seafood Process
created with: infer-bics.sql
derived from: Fresh & Frozen Seafood Process
  type: BicsLevel6Segment
  type: Classifier
  type: ContemporaryDerivation
  derived from: http://data.ga-group.nl/ics/bics/2014/121011141410
  source accessed on: 2019-12-03T20:05:01Z
  source last accessed on: 2019-12-03T20:05:01Z
  definition: This segment includes companies that prepare and package fresh and frozen seafood products.
  notation: 121011141410
  valid from: 2014-08-08
  valid till: 2020-10-03
source accessed on: 2019-12-03T20:05:01Z
source last accessed on: 2019-12-03T20:05:01Z
definition: This segment includes companies that prepare and package fresh and frozen seafood products.
notation: 121011141410
valid from: 2014-08-08
valid till: 2020-10-03

Seafood Canning
type: BicsLevel6Segment
type: Classifier
type: NamedIndividual
is level6 segment of: Seafood Products Prep & Pkg
is replaced by: Seafood Canning
created with: infer-bics.sql
derived from: Seafood Canning
  type: BicsLevel6Segment
  type: Classifier
  type: ContemporaryDerivation
  derived from: http://data.ga-group.nl/ics/bics/2014/121011141411
  source accessed on: 2019-12-03T20:05:01Z
  source last accessed on: 2019-12-03T20:05:01Z
  definition: This segment includes companies that can purchased seafood products but are not involved in fishing or fish farming.
  notation: 121011141411
  valid from: 2014-08-08
  valid till: 2020-10-03
source accessed on: 2019-12-03T20:05:01Z
source last accessed on: 2019-12-03T20:05:01Z
definition: This segment includes companies that can purchased seafood products but are not involved in fishing or fish farming.
notation: 121011141411
valid from: 2014-08-08
valid till: 2020-10-03

Seafood Products Prep & Pkg
type: BicsLevel5Segment
type: Classifier
type: NamedIndividual
is level5 segment of: Frozen, Canned & Perish Food
is replaced by: Seafood Products Prep & Pkg
created with: infer-bics.sql
derived from: Seafood Products Prep & Pkg
  type: BicsLevel5Segment
  type: Classifier
  type: ContemporaryDerivation
  derived from: http://data.ga-group.nl/ics/bics/2014/1210111414
  source accessed on: 2019-12-03T20:05:01Z
  source last accessed on: 2019-12-03T20:05:01Z
  definition: This segment includes companies that prepare and package seafood, including fish and shellfish.
  notation: 1210111414
  valid from: 2014-08-08
  valid till: 2020-10-03
source accessed on: 2019-12-03T20:05:01Z
source last accessed on: 2019-12-03T20:05:01Z
definition: This segment includes companies that prepare and package seafood, including fish and shellfish.
notation: 1210111414
valid from: 2014-08-08
valid till: 2020-10-03

Frozen, Canned & Perish Food
type: BicsLevel4SubIndustry
type: Classifier
type: NamedIndividual
created with: infer-bics.sql
derived from: Frozen, Canned & Perish Food
  type: BicsLevel4SubIndustry
  type: Classifier
  type: ContemporaryDerivation
  derived from: http://data.ga-group.nl/ics/bics/2014/12101114
  source accessed on: 2019-12-03T20:05:01Z
  source last accessed on: 2019-12-03T20:05:01Z
  definition: This industry subgroup includes companies that produce canned fruits, vegetables and other food products, excluding seafood.
  notation: 12101114
  valid from: 2014-08-08
  valid till: 2020-10-03
source accessed on: 2019-12-03T20:05:01Z
source last accessed on: 2019-12-03T20:05:01Z
definition: This industry subgroup includes companies that produce canned fruits, vegetables and other food products, excluding seafood.
notation: 12101114
valid from: 2014-08-08
valid till: 2020-10-03

Cured & Smoked Meat
type: BicsLevel5Segment
type: Classifier
type: NamedIndividual
is level5 segment of: Meat Products
is replaced by: Cured & Smoked Meat
created with: infer-bics.sql
derived from: Cured & Smoked Meat
  type: BicsLevel5Segment
  type: Classifier
  type: ContemporaryDerivation
  derived from: http://data.ga-group.nl/ics/bics/2014/1210111510
  source accessed on: 2019-12-03T20:05:01Z
  source last accessed on: 2019-12-03T20:05:01Z
  definition: This segment includes companies that process cured and smoked meat, typically for use in sandwiches. Such meats include bacon, bologna, hams, pastrami and canned meats.
  notation: 1210111510
  valid from: 2014-08-08
  valid till: 2020-10-03
source accessed on: 2019-12-03T20:05:01Z
source last accessed on: 2019-12-03T20:05:01Z
definition: This segment includes companies that process cured and smoked meat, typically for use in sandwiches. Such meats include bacon, bologna, hams, pastrami and canned meats.
notation: 1210111510
valid from: 2014-08-08
valid till: 2020-10-03

Fresh Meat Products
type: BicsLevel5Segment
type: Classifier
type: NamedIndividual
is level5 segment of: Meat Products
is replaced by: Fresh Meat Products
created with: infer-bics.sql
derived from: Fresh Meat Products
  type: BicsLevel5Segment
  type: Classifier
  type: ContemporaryDerivation
  derived from: http://data.ga-group.nl/ics/bics/2014/1210111511
  source accessed on: 2019-12-03T20:05:01Z
  source last accessed on: 2019-12-03T20:05:01Z
  definition: This segment includes companies that produce and package fresh meat. These are the products produced from animal slaughtering and processing but have been packaged for retail sales.
  notation: 1210111511
  valid from: 2014-08-08
  valid till: 2020-10-03
source accessed on: 2019-12-03T20:05:01Z
source last accessed on: 2019-12-03T20:05:01Z
definition: This segment includes companies that produce and package fresh meat. These are the products produced from animal slaughtering and processing but have been packaged for retail sales.
notation: 1210111511
valid from: 2014-08-08
valid till: 2020-10-03

Meat Type Chicken Products
type: BicsLevel5Segment
type: Classifier
type: NamedIndividual
is level5 segment of: Meat Products
is replaced by: Poultry Products
created with: infer-bics.sql
derived from: Meat Type Chicken Products
  type: BicsLevel5Segment
  type: Classifier
  type: ContemporaryDerivation
  derived from: http://data.ga-group.nl/ics/bics/2014/1210111512
  source accessed on: 2019-12-03T20:05:01Z
  source last accessed on: 2019-12-03T20:05:01Z
  definition: This segment includes companies that produce and package chicken meat products. These packaged chicken products are typically pre-prepared chicken dishes. Includes chicken nuggets, sauced chicken wings, cordon bleu, chicken kebabs and chicken patties.
  notation: 1210111512
  valid from: 2014-08-08
  valid till: 2020-10-03
source accessed on: 2019-12-03T20:05:01Z
source last accessed on: 2019-12-03T20:05:01Z
definition: This segment includes companies that produce and package chicken meat products. These packaged chicken products are typically pre-prepared chicken dishes. Includes chicken nuggets, sauced chicken wings, cordon bleu, chicken kebabs and chicken patties.
notation: 1210111512
valid from: 2014-08-08
valid till: 2020-10-03

Meat Products
type: BicsLevel4SubIndustry
type: Classifier
type: NamedIndividual
created with: infer-bics.sql
derived from: Meat Products
  type: BicsLevel4SubIndustry
  type: Classifier
  type: ContemporaryDerivation
  derived from: http://data.ga-group.nl/ics/bics/2014/12101115
  source accessed on: 2019-12-03T20:05:01Z
  source last accessed on: 2019-12-03T20:05:01Z
  definition: This industry subgroup includes companies that produce packaged meat products.
  notation: 12101115
  valid from: 2014-08-08
  valid till: 2020-10-03
source accessed on: 2019-12-03T20:05:01Z
source last accessed on: 2019-12-03T20:05:01Z
definition: This industry subgroup includes companies that produce packaged meat products.
notation: 12101115
valid from: 2014-08-08
valid till: 2020-10-03

Pet Food
type: BicsLevel4SubIndustry
type: Classifier
type: NamedIndividual
created with: infer-bics.sql
derived from: Pet Food
  type: BicsLevel4SubIndustry
  type: Classifier
  type: ContemporaryDerivation
  derived from: http://data.ga-group.nl/ics/bics/2014/12101116
  source accessed on: 2019-12-03T20:05:01Z
  source last accessed on: 2019-12-03T20:05:01Z
  definition: This industry subgroup includes companies that produce food consumed by household pets.
  notation: 12101116
  valid from: 2014-08-08
  valid till: 2020-10-03
source accessed on: 2019-12-03T20:05:01Z
source last accessed on: 2019-12-03T20:05:01Z
definition: This industry subgroup includes companies that produce food consumed by household pets.
notation: 12101116
valid from: 2014-08-08
valid till: 2020-10-03

Chocolate Confectionery
type: BicsLevel6Segment
type: Classifier
type: NamedIndividual
is level6 segment of: Confectionery
is replaced by: Chocolate Confectionery
created with: infer-bics.sql
derived from: Chocolate Confectionery
  type: BicsLevel6Segment
  type: Classifier
  type: ContemporaryDerivation
  derived from: http://data.ga-group.nl/ics/bics/2014/121011171010
  source accessed on: 2019-12-03T20:05:01Z
  source last accessed on: 2019-12-03T20:05:01Z
  definition: This segment includes companies that produce confectionary products, such as candies and other desserts primarily made of chocolate.
  notation: 121011171010
  valid from: 2014-08-08
  valid till: 2020-10-03
source accessed on: 2019-12-03T20:05:01Z
source last accessed on: 2019-12-03T20:05:01Z
definition: This segment includes companies that produce confectionary products, such as candies and other desserts primarily made of chocolate.
notation: 121011171010
valid from: 2014-08-08
valid till: 2020-10-03

Non-Chocolate Confection
type: BicsLevel6Segment
type: Classifier
type: NamedIndividual
is level6 segment of: Confectionery
is replaced by: Sugar & Other Confectionery
created with: infer-bics.sql
derived from: Non-Chocolate Confection
  type: BicsLevel6Segment
  type: Classifier
  type: ContemporaryDerivation
  derived from: http://data.ga-group.nl/ics/bics/2014/121011171011
  source accessed on: 2019-12-03T20:05:01Z
  source last accessed on: 2019-12-03T20:05:01Z
  definition: This segment includes companies that produce confectionary products, such as candies and other desserts that are not primarily made of chocolate. Such products include chewing gum.
  notation: 121011171011
  valid from: 2014-08-08
  valid till: 2020-10-03
source accessed on: 2019-12-03T20:05:01Z
source last accessed on: 2019-12-03T20:05:01Z
definition: This segment includes companies that produce confectionary products, such as candies and other desserts that are not primarily made of chocolate. Such products include chewing gum.
notation: 121011171011
valid from: 2014-08-08
valid till: 2020-10-03

Confectionery
type: BicsLevel5Segment
type: Classifier
type: NamedIndividual
is level5 segment of: Snack Food & Confectionary
is replaced by: Confectionery
created with: infer-bics.sql
derived from: Confectionery
  type: BicsLevel5Segment
  type: Classifier
  type: ContemporaryDerivation
  derived from: http://data.ga-group.nl/ics/bics/2014/1210111710
  source accessed on: 2019-12-03T20:05:01Z
  source last accessed on: 2019-12-03T20:05:01Z
  definition: This segment includes companies that produce confectionary products.
  notation: 1210111710
  valid from: 2014-08-08
  valid till: 2020-10-03
source accessed on: 2019-12-03T20:05:01Z
source last accessed on: 2019-12-03T20:05:01Z
definition: This segment includes companies that produce confectionary products.
notation: 1210111710
valid from: 2014-08-08
valid till: 2020-10-03

Breakfast Cereal
type: BicsLevel6Segment
type: Classifier
type: NamedIndividual
is level6 segment of: Snack Food
is replaced by: Breakfast Cereal
created with: infer-bics.sql
derived from: Breakfast Cereal
  type: BicsLevel6Segment
  type: Classifier
  type: ContemporaryDerivation
  derived from: http://data.ga-group.nl/ics/bics/2014/121011171110
  source accessed on: 2019-12-03T20:05:01Z
  source last accessed on: 2019-12-03T20:05:01Z
  definition: This segment includes companies that produce breakfast cereals, such as granola, oatmeal and corn-based cereals.
  notation: 121011171110
  valid from: 2014-08-08
  valid till: 2020-10-03
source accessed on: 2019-12-03T20:05:01Z
source last accessed on: 2019-12-03T20:05:01Z
definition: This segment includes companies that produce breakfast cereals, such as granola, oatmeal and corn-based cereals.
notation: 121011171110
valid from: 2014-08-08
valid till: 2020-10-03

Cookies & Crackers
type: BicsLevel6Segment
type: Classifier
type: NamedIndividual
is level6 segment of: Snack Food
is replaced by: Cookies & Crackers
created with: infer-bics.sql
derived from: Cookies & Crackers
  type: BicsLevel6Segment
  type: Classifier
  type: ContemporaryDerivation
  derived from: http://data.ga-group.nl/ics/bics/2014/121011171111
  source accessed on: 2019-12-03T20:05:01Z
  source last accessed on: 2019-12-03T20:05:01Z
  definition: This segment includes companies that produce cookies and crackers.
  notation: 121011171111
  valid from: 2014-08-08
  valid till: 2020-10-03
source accessed on: 2019-12-03T20:05:01Z
source last accessed on: 2019-12-03T20:05:01Z
definition: This segment includes companies that produce cookies and crackers.
notation: 121011171111
valid from: 2014-08-08
valid till: 2020-10-03

Roast Nuts & Peanut Butter
type: BicsLevel6Segment
type: Classifier
type: NamedIndividual
is level6 segment of: Snack Food
is replaced by: Roast Nuts & Peanut Butter
created with: infer-bics.sql
derived from: Roast Nuts & Peanut Butter
  type: BicsLevel6Segment
  type: Classifier
  type: ContemporaryDerivation
  derived from: http://data.ga-group.nl/ics/bics/2014/121011171112
  source accessed on: 2019-12-03T20:05:01Z
  source last accessed on: 2019-12-03T20:05:01Z
  definition: This segment includes companies that roast and preserve nuts, nut foods or pastes like peanut butter.
  notation: 121011171112
  valid from: 2014-08-08
  valid till: 2020-10-03
source accessed on: 2019-12-03T20:05:01Z
source last accessed on: 2019-12-03T20:05:01Z
definition: This segment includes companies that roast and preserve nuts, nut foods or pastes like peanut butter.
notation: 121011171112
valid from: 2014-08-08
valid till: 2020-10-03

Other Snack Food
type: BicsLevel6Segment
type: Classifier
type: NamedIndividual
is level6 segment of: Snack Food
created with: infer-bics.sql
derived from: Other Snack Food
  type: BicsLevel6Segment
  type: Classifier
  type: ContemporaryDerivation
  derived from: http://data.ga-group.nl/ics/bics/2014/121011171113
  source accessed on: 2019-12-03T20:05:01Z
  source last accessed on: 2019-12-03T20:05:01Z
  definition: This segment includes companies that produce snack foods not elsewhere classified. Such foods include potato chips, corn chips and pretzels.
  notation: 121011171113
  valid from: 2014-08-08
  valid till: 2020-10-03
source accessed on: 2019-12-03T20:05:01Z
source last accessed on: 2019-12-03T20:05:01Z
definition: This segment includes companies that produce snack foods not elsewhere classified. Such foods include potato chips, corn chips and pretzels.
notation: 121011171113
valid from: 2014-08-08
valid till: 2020-10-03

Snack Food
type: BicsLevel5Segment
type: Classifier
type: NamedIndividual
is level5 segment of: Snack Food & Confectionary
is replaced by: Snack Food
created with: infer-bics.sql
derived from: Snack Food
  type: BicsLevel5Segment
  type: Classifier
  type: ContemporaryDerivation
  derived from: http://data.ga-group.nl/ics/bics/2014/1210111711
  source accessed on: 2019-12-03T20:05:01Z
  source last accessed on: 2019-12-03T20:05:01Z
  definition: This segment includes companies that manufacture snack foods.
  notation: 1210111711
  valid from: 2014-08-08
  valid till: 2020-10-03
source accessed on: 2019-12-03T20:05:01Z
source last accessed on: 2019-12-03T20:05:01Z
definition: This segment includes companies that manufacture snack foods.
notation: 1210111711
valid from: 2014-08-08
valid till: 2020-10-03

Snack Food & Confectionary
type: BicsLevel4SubIndustry
type: Classifier
type: NamedIndividual
created with: infer-bics.sql
derived from: Snack Food & Confectionary
  type: BicsLevel4SubIndustry
  type: Classifier
  type: ContemporaryDerivation
  derived from: http://data.ga-group.nl/ics/bics/2014/12101117
  source accessed on: 2019-12-03T20:05:01Z
  source last accessed on: 2019-12-03T20:05:01Z
  definition: This industry subgroup includes companies that produce snack foods and confectionary products.
  notation: 12101117
  valid from: 2014-08-08
  valid till: 2020-10-03
source accessed on: 2019-12-03T20:05:01Z
source last accessed on: 2019-12-03T20:05:01Z
definition: This industry subgroup includes companies that produce snack foods and confectionary products.
notation: 12101117
valid from: 2014-08-08
valid till: 2020-10-03

Other Food
type: BicsLevel4SubIndustry
type: Classifier
type: NamedIndividual
created with: infer-bics.sql
derived from: Other Food
  type: BicsLevel4SubIndustry
  type: Classifier
  type: ContemporaryDerivation
  derived from: http://data.ga-group.nl/ics/bics/2014/12101118
  source accessed on: 2019-12-03T20:05:01Z
  source last accessed on: 2019-12-03T20:05:01Z
  definition: This industry subgroup includes companies that produce packaged food products not elsewhere classified.
  notation: 12101118
  valid from: 2014-08-08
  valid till: 2020-10-03
source accessed on: 2019-12-03T20:05:01Z
source last accessed on: 2019-12-03T20:05:01Z
definition: This industry subgroup includes companies that produce packaged food products not elsewhere classified.
notation: 12101118
valid from: 2014-08-08
valid till: 2020-10-03

Beverages
type: BicsLevel3Industry
type: Classifier
type: NamedIndividual
is industry of: Consumer Staple Products
is replaced by: Packaged Food
replaces: Tobacco & Cannabis
created with: infer-bics.sql
derived from: Packaged Food
  type: BicsLevel3Industry
  type: Classifier
  type: ContemporaryDerivation
  derived from: http://data.ga-group.nl/ics/bics/2014/121011
  source accessed on: 2019-12-03T20:05:01Z
  source last accessed on: 2019-12-03T20:05:01Z
  definition: This industry includes companies that process and package foods like bread, dairy, frozen foods, snack foods and condiments for retail consumer consumption. It also includes packaged pet foods. Typically, these products are packaged and marketed for retail consumers and can be found on food retailer's shelves.
  notation: 121011
  valid from: 2014-08-08
  valid till: 2020-10-03
derived from: Beverages
  type: BicsLevel3Industry
  type: Classifier
  type: AnachronousDerivation
  derived from: http://data.ga-group.nl/ics/bics/2014/121012
  source accessed on: 2019-12-03T20:05:01Z
  source last accessed on: 2019-12-03T20:05:01Z
  definition: This industry includes companies that manufacture alcoholic beverages, non-alcoholic beverages, coffees and teas.
  notation: 121012
  valid from: 2014-08-08
  valid till: 2020-10-03
derived from: Beverages
  type: BicsLevel3Industry
  type: Classifier
  type: ContemporaryDerivation
  derived from: http://data.ga-group.nl/ics/bics/2020/121011
  derived from: http://data.ga-group.nl/ics/bics/2024/121011
  source accessed on: 2023-07-03T18:11:29Z
  source last accessed on: 2024-06-05T14:42:36Z
  definition: This industry includes companies that manufacture alcoholic beverages, non-alcoholic beverages, coffees, and teas.
  notation: 121011
  valid from: 2020-10-03
source accessed on: 2019-12-03T20:05:01Z
source last accessed on: 2024-06-05T14:42:36Z
definition: This industry includes companies that manufacture alcoholic beverages, non-alcoholic beverages, coffees, and teas.
notation: 121011
valid from: 2014-08-08

Tobacco Farming
type: BicsLevel5Segment
type: Classifier
type: NamedIndividual
is level5 segment of: Tobacco
is replaced by: Brewers
created with: infer-bics.sql
derived from: Brewers
  type: BicsLevel5Segment
  type: Classifier
  type: ContemporaryDerivation
  derived from: http://data.ga-group.nl/ics/bics/2014/1210121010
  source accessed on: 2019-12-03T20:05:01Z
  source last accessed on: 2019-12-03T20:05:01Z
  definition: This segment includes companies that produce beer, malt liquor and non-alcoholic beer.
  notation: 1210121010
  valid from: 2014-08-08
  valid till: 2020-10-03
derived from: Tobacco Farming
  type: BicsLevel4SubIndustry
  type: Classifier
  type: AnachronousDerivation
  derived from: http://data.ga-group.nl/ics/bics/2014/12101310
  source accessed on: 2019-12-03T20:05:01Z
  source last accessed on: 2019-12-03T20:05:01Z
  definition: This industry subgroup includes companies that grow tobacco plants.
  notation: 12101310
  valid from: 2014-08-08
  valid till: 2020-10-03
derived from: Tobacco Farming
  type: BicsLevel5Segment
  type: Classifier
  type: ContemporaryDerivation
  derived from: http://data.ga-group.nl/ics/bics/2020/1210121010
  derived from: http://data.ga-group.nl/ics/bics/2024/1210121010
  source accessed on: 2023-07-03T18:11:29Z
  source last accessed on: 2024-06-05T14:42:36Z
  definition: This segment includes companies that grow tobacco plants.
  notation: 1210121010
  valid from: 2020-10-03
source accessed on: 2019-12-03T20:05:01Z
source last accessed on: 2024-06-05T14:42:36Z
definition: This segment includes companies that grow tobacco plants.
notation: 1210121010
valid from: 2014-08-08

Tobacco Leaf
type: BicsLevel5Segment
type: Classifier
type: NamedIndividual
is level5 segment of: Tobacco
is replaced by: Distillers
created with: infer-bics.sql
derived from: Distillers
  type: BicsLevel5Segment
  type: Classifier
  type: ContemporaryDerivation
  derived from: http://data.ga-group.nl/ics/bics/2014/1210121011
  source accessed on: 2019-12-03T20:05:01Z
  source last accessed on: 2019-12-03T20:05:01Z
  definition: This segment includes companies that produce distilled, potable, alcoholic beverages like bourbon, scotch and gin.
  notation: 1210121011
  valid from: 2014-08-08
  valid till: 2020-10-03
derived from: Tobacco Leaf
  type: BicsLevel4SubIndustry
  type: Classifier
  type: AnachronousDerivation
  derived from: http://data.ga-group.nl/ics/bics/2014/12101311
  source accessed on: 2019-12-03T20:05:01Z
  source last accessed on: 2019-12-03T20:05:01Z
  definition: This industry subgroup includes companies that process tobacco leaf from which other companies produce finished tobacco products.
  notation: 12101311
  valid from: 2014-08-08
  valid till: 2020-10-03
derived from: Tobacco Leaf
  type: BicsLevel5Segment
  type: Classifier
  type: ContemporaryDerivation
  derived from: http://data.ga-group.nl/ics/bics/2020/1210121011
  derived from: http://data.ga-group.nl/ics/bics/2024/1210121011
  source accessed on: 2023-07-03T18:11:29Z
  source last accessed on: 2024-06-05T14:42:36Z
  definition: This segment includes companies that process tobacco leaf from which other companies produce finished tobacco products.
  notation: 1210121011
  valid from: 2020-10-03
source accessed on: 2019-12-03T20:05:01Z
source last accessed on: 2024-06-05T14:42:36Z
definition: This segment includes companies that process tobacco leaf from which other companies produce finished tobacco products.
notation: 1210121011
valid from: 2014-08-08

Cigar
type: BicsLevel6Segment
type: Classifier
type: NamedIndividual
is level6 segment of: Tobacco Products
replaces: Cigar
created with: infer-bics.sql
derived from: Cigar
  type: BicsLevel5Segment
  type: Classifier
  type: AnachronousDerivation
  derived from: http://data.ga-group.nl/ics/bics/2014/1210131210
  source accessed on: 2019-12-03T20:05:01Z
  source last accessed on: 2019-12-03T20:05:01Z
  definition: This segment includes companies that manufacture cigars.
  notation: 1210131210
  valid from: 2014-08-08
  valid till: 2020-10-03
derived from: Cigar
  type: BicsLevel6Segment
  type: Classifier
  type: ContemporaryDerivation
  derived from: http://data.ga-group.nl/ics/bics/2020/121012101210
  derived from: http://data.ga-group.nl/ics/bics/2024/121012101210
  source accessed on: 2023-07-03T18:11:29Z
  source last accessed on: 2024-06-05T14:42:36Z
  definition: This segment includes companies that manufacture cigars.
  notation: 121012101210
  valid from: 2020-10-03
source accessed on: 2023-07-03T18:11:29Z
source last accessed on: 2024-06-05T14:42:36Z
definition: This segment includes companies that manufacture cigars.
notation: 121012101210
valid from: 2020-10-03

Cigarette
type: BicsLevel6Segment
type: Classifier
type: NamedIndividual
is level6 segment of: Tobacco Products
replaces: Cigarette
created with: infer-bics.sql
derived from: Cigarette
  type: BicsLevel5Segment
  type: Classifier
  type: AnachronousDerivation
  derived from: http://data.ga-group.nl/ics/bics/2014/1210131211
  source accessed on: 2019-12-03T20:05:01Z
  source last accessed on: 2019-12-03T20:05:01Z
  definition: This segment includes companies that manufacture cigarettes.
  notation: 1210131211
  valid from: 2014-08-08
  valid till: 2020-10-03
derived from: Cigarette
  type: BicsLevel6Segment
  type: Classifier
  type: ContemporaryDerivation
  derived from: http://data.ga-group.nl/ics/bics/2020/121012101211
  derived from: http://data.ga-group.nl/ics/bics/2024/121012101211
  source accessed on: 2023-07-03T18:11:29Z
  source last accessed on: 2024-06-05T14:42:36Z
  definition: This segment includes companies that manufacture cigarettes.
  notation: 121012101211
  valid from: 2020-10-03
source accessed on: 2023-07-03T18:11:29Z
source last accessed on: 2024-06-05T14:42:36Z
definition: This segment includes companies that manufacture cigarettes.
notation: 121012101211
valid from: 2020-10-03

Smokeless Tobacco
type: BicsLevel6Segment
type: Classifier
type: NamedIndividual
is level6 segment of: Tobacco Products
replaces: Smokeless Tobacco
created with: infer-bics.sql
derived from: Smokeless Tobacco
  type: BicsLevel5Segment
  type: Classifier
  type: AnachronousDerivation
  derived from: http://data.ga-group.nl/ics/bics/2014/1210131212
  source accessed on: 2019-12-03T20:05:01Z
  source last accessed on: 2019-12-03T20:05:01Z
  definition: This segment includes companies that produce smokeless tobacco products.
  notation: 1210131212
  valid from: 2014-08-08
  valid till: 2020-10-03
derived from: Smokeless Tobacco
  type: BicsLevel6Segment
  type: Classifier
  type: ContemporaryDerivation
  derived from: http://data.ga-group.nl/ics/bics/2020/121012101212
  derived from: http://data.ga-group.nl/ics/bics/2024/121012101212
  source accessed on: 2023-07-03T18:11:29Z
  source last accessed on: 2024-06-05T14:42:36Z
  definition: This segment includes companies that produce smokeless tobacco products or nicotine delivery products such as chewing tobacco, snuff, electronic cigarettes, or vaporizers.
  notation: 121012101212
  valid from: 2020-10-03
source accessed on: 2023-07-03T18:11:29Z
source last accessed on: 2024-06-05T14:42:36Z
definition: This segment includes companies that produce smokeless tobacco products or nicotine delivery products such as chewing tobacco, snuff, electronic cigarettes, or vaporizers.
notation: 121012101212
valid from: 2020-10-03

Tobacco Products
type: BicsLevel5Segment
type: Classifier
type: NamedIndividual
is level5 segment of: Tobacco
is replaced by: Vintners
created with: infer-bics.sql
derived from: Vintners
  type: BicsLevel5Segment
  type: Classifier
  type: ContemporaryDerivation
  derived from: http://data.ga-group.nl/ics/bics/2014/1210121012
  source accessed on: 2019-12-03T20:05:01Z
  source last accessed on: 2019-12-03T20:05:01Z
  definition: This segment includes companies that produce wine, brandies and other fruit-based alcoholic drinks.
  notation: 1210121012
  valid from: 2014-08-08
  valid till: 2020-10-03
derived from: Tobacco Products
  type: BicsLevel4SubIndustry
  type: Classifier
  type: AnachronousDerivation
  derived from: http://data.ga-group.nl/ics/bics/2014/12101312
  source accessed on: 2019-12-03T20:05:01Z
  source last accessed on: 2019-12-03T20:05:01Z
  definition: This industry subgroup includes companies that produce finished consumer tobacco products.
  notation: 12101312
  valid from: 2014-08-08
  valid till: 2020-10-03
derived from: Tobacco Products
  type: BicsLevel5Segment
  type: Classifier
  type: ContemporaryDerivation
  derived from: http://data.ga-group.nl/ics/bics/2020/1210121012
  derived from: http://data.ga-group.nl/ics/bics/2024/1210121012
  source accessed on: 2023-07-03T18:11:29Z
  source last accessed on: 2024-06-05T14:42:36Z
  definition: This segment includes companies that produce finished consumer tobacco products as well related equipment or accessories.
  notation: 1210121012
  valid from: 2020-10-03
source accessed on: 2019-12-03T20:05:01Z
source last accessed on: 2024-06-05T14:42:36Z
definition: This segment includes companies that produce finished consumer tobacco products as well related equipment or accessories.
notation: 1210121012
valid from: 2014-08-08

Tobacco
type: BicsLevel4SubIndustry
type: Classifier
type: NamedIndividual
replaces: Household Products
created with: infer-bics.sql
derived from: Alcoholic Beverages
  type: BicsLevel4SubIndustry
  type: Classifier
  type: ContemporaryDerivation
  derived from: http://data.ga-group.nl/ics/bics/2014/12101210
  source accessed on: 2019-12-03T20:05:01Z
  source last accessed on: 2019-12-03T20:05:01Z
  definition: This industry subgroup includes companies that brew beer, manufacture wine and brandies, and distill and mix liquors.
  notation: 12101210
  valid from: 2014-08-08
  valid till: 2020-10-03
derived from: Tobacco
  type: BicsLevel3Industry
  type: Classifier
  type: AnachronousDerivation
  derived from: http://data.ga-group.nl/ics/bics/2014/121013
  source accessed on: 2019-12-03T20:05:01Z
  source last accessed on: 2019-12-03T20:05:01Z
  definition: This industry includes companies that process tobacco leaf and/or produce finished tobacco products.
  notation: 121013
  valid from: 2014-08-08
  valid till: 2020-10-03
derived from: Tobacco
  type: BicsLevel4SubIndustry
  type: Classifier
  type: ContemporaryDerivation
  derived from: http://data.ga-group.nl/ics/bics/2020/12101210
  derived from: http://data.ga-group.nl/ics/bics/2024/12101210
  source accessed on: 2023-07-03T18:11:29Z
  source last accessed on: 2024-06-05T14:42:36Z
  definition: This industry subgroup includes companies that process tobacco leaf and/or produce finished tobacco products.
  notation: 12101210
  valid from: 2020-10-03
source accessed on: 2019-12-03T20:05:01Z
source last accessed on: 2024-06-05T14:42:36Z
definition: This industry subgroup includes companies that process tobacco leaf and/or produce finished tobacco products.
notation: 12101210
valid from: 2014-08-08

Coffee
type: BicsLevel6Segment
type: Classifier
type: NamedIndividual
is level6 segment of: Coffee & Tea
is replaced by: Coffee
created with: infer-bics.sql
derived from: Coffee
  type: BicsLevel6Segment
  type: Classifier
  type: ContemporaryDerivation
  derived from: http://data.ga-group.nl/ics/bics/2014/121012111010
  source accessed on: 2019-12-03T20:05:01Z
  source last accessed on: 2019-12-03T20:05:01Z
  definition: This segment includes companies that manufacture and roast coffee.
  notation: 121012111010
  valid from: 2014-08-08
  valid till: 2020-10-03
source accessed on: 2019-12-03T20:05:01Z
source last accessed on: 2019-12-03T20:05:01Z
definition: This segment includes companies that manufacture and roast coffee.
notation: 121012111010
valid from: 2014-08-08
valid till: 2020-10-03

Tea
type: BicsLevel6Segment
type: Classifier
type: NamedIndividual
is level6 segment of: Coffee & Tea
is replaced by: Tea
created with: infer-bics.sql
derived from: Tea
  type: BicsLevel6Segment
  type: Classifier
  type: ContemporaryDerivation
  derived from: http://data.ga-group.nl/ics/bics/2014/121012111011
  source accessed on: 2019-12-03T20:05:01Z
  source last accessed on: 2019-12-03T20:05:01Z
  definition: This segment includes companies that manufacture bagged teas, boxed teas and loose-leaf teas.
  notation: 121012111011
  valid from: 2014-08-08
  valid till: 2020-10-03
source accessed on: 2019-12-03T20:05:01Z
source last accessed on: 2019-12-03T20:05:01Z
definition: This segment includes companies that manufacture bagged teas, boxed teas and loose-leaf teas.
notation: 121012111011
valid from: 2014-08-08
valid till: 2020-10-03

Coffee & Tea
type: BicsLevel5Segment
type: Classifier
type: NamedIndividual
is level5 segment of: Cannabis
created with: infer-bics.sql
derived from: Coffee & Tea
  type: BicsLevel5Segment
  type: Classifier
  type: ContemporaryDerivation
  derived from: http://data.ga-group.nl/ics/bics/2014/1210121110
  source accessed on: 2019-12-03T20:05:01Z
  source last accessed on: 2019-12-03T20:05:01Z
  definition: This segment includes companies that produce coffee and tea products.
  notation: 1210121110
  valid from: 2014-08-08
  valid till: 2020-10-03
source accessed on: 2019-12-03T20:05:01Z
source last accessed on: 2019-12-03T20:05:01Z
definition: This segment includes companies that produce coffee and tea products.
notation: 1210121110
valid from: 2014-08-08
valid till: 2020-10-03

Bottled Water
type: BicsLevel6Segment
type: Classifier
type: NamedIndividual
is level6 segment of: Soft Drink & Ice
is replaced by: Bottled Water
created with: infer-bics.sql
derived from: Bottled Water
  type: BicsLevel6Segment
  type: Classifier
  type: ContemporaryDerivation
  derived from: http://data.ga-group.nl/ics/bics/2014/121012111110
  source accessed on: 2019-12-03T20:05:01Z
  source last accessed on: 2019-12-03T20:05:01Z
  definition: This segment includes companies that manufacture bottled water.
  notation: 121012111110
  valid from: 2014-08-08
  valid till: 2020-10-03
source accessed on: 2019-12-03T20:05:01Z
source last accessed on: 2019-12-03T20:05:01Z
definition: This segment includes companies that manufacture bottled water.
notation: 121012111110
valid from: 2014-08-08
valid till: 2020-10-03

Ice
type: BicsLevel6Segment
type: Classifier
type: NamedIndividual
is level6 segment of: Soft Drink & Ice
created with: infer-bics.sql
derived from: Ice
  type: BicsLevel6Segment
  type: Classifier
  type: ContemporaryDerivation
  derived from: http://data.ga-group.nl/ics/bics/2014/121012111111
  source accessed on: 2019-12-03T20:05:01Z
  source last accessed on: 2019-12-03T20:05:01Z
  definition: This segment includes companies that manufacture ice.
  notation: 121012111111
  valid from: 2014-08-08
  valid till: 2020-10-03
source accessed on: 2019-12-03T20:05:01Z
source last accessed on: 2019-12-03T20:05:01Z
definition: This segment includes companies that manufacture ice.
notation: 121012111111
valid from: 2014-08-08
valid till: 2020-10-03

Soft Drink
type: BicsLevel6Segment
type: Classifier
type: NamedIndividual
is level6 segment of: Soft Drink & Ice
is replaced by: Carbonated Soft Drinks
created with: infer-bics.sql
derived from: Soft Drink
  type: BicsLevel6Segment
  type: Classifier
  type: ContemporaryDerivation
  derived from: http://data.ga-group.nl/ics/bics/2014/121012111112
  source accessed on: 2019-12-03T20:05:01Z
  source last accessed on: 2019-12-03T20:05:01Z
  definition: This segment includes companies that manufacture soft drinks and juice beverages. Also known as soda, pop and carbonated beverage.
  notation: 121012111112
  valid from: 2014-08-08
  valid till: 2020-10-03
source accessed on: 2019-12-03T20:05:01Z
source last accessed on: 2019-12-03T20:05:01Z
definition: This segment includes companies that manufacture soft drinks and juice beverages. Also known as soda, pop and carbonated beverage.
notation: 121012111112
valid from: 2014-08-08
valid till: 2020-10-03

Soft Drink & Ice
type: BicsLevel5Segment
type: Classifier
type: NamedIndividual
is level5 segment of: Cannabis
created with: infer-bics.sql
derived from: Soft Drink & Ice
  type: BicsLevel5Segment
  type: Classifier
  type: ContemporaryDerivation
  derived from: http://data.ga-group.nl/ics/bics/2014/1210121111
  source accessed on: 2019-12-03T20:05:01Z
  source last accessed on: 2019-12-03T20:05:01Z
  definition: This segment includes companies that manufacture soft drinks, bottled water and ice.
  notation: 1210121111
  valid from: 2014-08-08
  valid till: 2020-10-03
source accessed on: 2019-12-03T20:05:01Z
source last accessed on: 2019-12-03T20:05:01Z
definition: This segment includes companies that manufacture soft drinks, bottled water and ice.
notation: 1210121111
valid from: 2014-08-08
valid till: 2020-10-03

Cannabis
type: BicsLevel4SubIndustry
type: Classifier
type: NamedIndividual
created with: infer-bics.sql
derived from: Non-Alcoholic Beverages
  type: BicsLevel4SubIndustry
  type: Classifier
  type: ContemporaryDerivation
  derived from: http://data.ga-group.nl/ics/bics/2014/12101211
  source accessed on: 2019-12-03T20:05:01Z
  source last accessed on: 2019-12-03T20:05:01Z
  definition: This industry subgroup includes companies that manufacture non-alcoholic beverages as well as coffee and tea. Excludes dairy based beverages (see Dairy & Egg Products).
  notation: 12101211
  valid from: 2014-08-08
  valid till: 2020-10-03
derived from: Cannabis
  type: BicsLevel4SubIndustry
  type: Classifier
  type: ContemporaryDerivation
  derived from: http://data.ga-group.nl/ics/bics/2020/12101211
  derived from: http://data.ga-group.nl/ics/bics/2024/12101211
  source accessed on: 2023-07-03T18:11:29Z
  source last accessed on: 2024-06-05T14:42:36Z
  definition: This industry subgroup includes companies involved in growing, manufacturing, wholesaling, or retailing cannabis products used for recreational or medicinal purposes. Excludes companies indirectly involved in the supply chain such as consultants or equipment manufacturers.
  notation: 12101211
  valid from: 2020-10-03
source accessed on: 2019-12-03T20:05:01Z
source last accessed on: 2024-06-05T14:42:36Z
definition: This industry subgroup includes companies involved in growing, manufacturing, wholesaling, or retailing cannabis products used for recreational or medicinal purposes. Excludes companies indirectly involved in the supply chain such as consultants or equipment manufacturers.
notation: 12101211
valid from: 2014-08-08

Tobacco & Cannabis
type: BicsLevel3Industry
type: Classifier
type: NamedIndividual
is industry of: Consumer Staple Products
is replaced by: Beverages
created with: infer-bics.sql
derived from: Beverages
  type: BicsLevel3Industry
  type: Classifier
  type: ContemporaryDerivation
  derived from: http://data.ga-group.nl/ics/bics/2014/121012
  source accessed on: 2019-12-03T20:05:01Z
  source last accessed on: 2019-12-03T20:05:01Z
  definition: This industry includes companies that manufacture alcoholic beverages, non-alcoholic beverages, coffees and teas.
  notation: 121012
  valid from: 2014-08-08
  valid till: 2020-10-03
derived from: Tobacco & Cannabis
  type: BicsLevel3Industry
  type: Classifier
  type: ContemporaryDerivation
  derived from: http://data.ga-group.nl/ics/bics/2020/121012
  derived from: http://data.ga-group.nl/ics/bics/2024/121012
  source accessed on: 2023-07-03T18:11:29Z
  source last accessed on: 2024-06-05T14:42:36Z
  definition: This industry includes companies involved in the creation of tobacco or cannabis products.
  notation: 121012
  valid from: 2020-10-03
source accessed on: 2019-12-03T20:05:01Z
source last accessed on: 2024-06-05T14:42:36Z
definition: This industry includes companies involved in the creation of tobacco or cannabis products.
notation: 121012
valid from: 2014-08-08

Electric Lamp Bulb & Parts
type: BicsLevel5Segment
type: Classifier
type: NamedIndividual
is level5 segment of: Home Products
replaces: Electric Lamp Bulb & Parts
created with: infer-bics.sql
derived from: Electric Lamp Bulb & Parts
  type: BicsLevel5Segment
  type: Classifier
  type: AnachronousDerivation
  derived from: http://data.ga-group.nl/ics/bics/2014/1210141010
  source accessed on: 2019-12-03T20:05:01Z
  source last accessed on: 2019-12-03T20:05:01Z
  definition: This segment includes companies that manufacture electric lamp bulbs and associated parts.
  notation: 1210141010
  valid from: 2014-08-08
  valid till: 2020-10-03
derived from: Electric Lamp Bulb & Parts
  type: BicsLevel5Segment
  type: Classifier
  type: ContemporaryDerivation
  derived from: http://data.ga-group.nl/ics/bics/2020/1210131010
  derived from: http://data.ga-group.nl/ics/bics/2024/1210131010
  source accessed on: 2023-07-03T18:11:29Z
  source last accessed on: 2024-06-05T14:42:36Z
  definition: This segment includes companies that manufacture electric lamp bulbs and associated parts.
  notation: 1210131010
  valid from: 2020-10-03
source accessed on: 2023-07-03T18:11:29Z
source last accessed on: 2024-06-05T14:42:36Z
definition: This segment includes companies that manufacture electric lamp bulbs and associated parts.
notation: 1210131010
valid from: 2020-10-03

Home Cleaning & Detergents
type: BicsLevel5Segment
type: Classifier
type: NamedIndividual
is level5 segment of: Home Products
replaces: Household Cleaning Products
created with: infer-bics.sql
derived from: Household Cleaning Products
  type: BicsLevel5Segment
  type: Classifier
  type: AnachronousDerivation
  derived from: http://data.ga-group.nl/ics/bics/2014/1210141011
  source accessed on: 2019-12-03T20:05:01Z
  source last accessed on: 2019-12-03T20:05:01Z
  definition: This segment includes companies that manufacture household cleaning products, such as ammonia, bleaches, degreasers, disinfectants, polishes, fabric softeners, and bathroom cleaners.
  notation: 1210141011
  valid from: 2014-08-08
  valid till: 2020-10-03
derived from: Home Cleaning & Detergents
  type: BicsLevel5Segment
  type: Classifier
  type: ContemporaryDerivation
  derived from: http://data.ga-group.nl/ics/bics/2020/1210131011
  derived from: http://data.ga-group.nl/ics/bics/2024/1210131011
  source accessed on: 2023-07-03T18:11:29Z
  source last accessed on: 2024-06-05T14:42:36Z
  definition: This segment includes companies that manufacture household cleaning products, such as ammonia, bleaches, degreasers, disinfectants, polishes, fabric softeners, laundry detergent, dish soap, and bathroom cleaners.
  notation: 1210131011
  valid from: 2020-10-03
source accessed on: 2023-07-03T18:11:29Z
source last accessed on: 2024-06-05T14:42:36Z
definition: This segment includes companies that manufacture household cleaning products, such as ammonia, bleaches, degreasers, disinfectants, polishes, fabric softeners, laundry detergent, dish soap, and bathroom cleaners.
notation: 1210131011
valid from: 2020-10-03

Household Batteries
type: BicsLevel5Segment
type: Classifier
type: NamedIndividual
is level5 segment of: Home Products
replaces: Household Batteries
created with: infer-bics.sql
derived from: Household Batteries
  type: BicsLevel5Segment
  type: Classifier
  type: AnachronousDerivation
  derived from: http://data.ga-group.nl/ics/bics/2014/1210141012
  source accessed on: 2019-12-03T20:05:01Z
  source last accessed on: 2019-12-03T20:05:01Z
  definition: This segment includes companies that manufacture disposable and rechargeable household batteries. Products include alkaline batteries, lithium batteries, watch batteries, and dry cell primary batteries (AAA, AA, C, D, 9V).
  notation: 1210141012
  valid from: 2014-08-08
  valid till: 2020-10-03
derived from: Household Batteries
  type: BicsLevel5Segment
  type: Classifier
  type: ContemporaryDerivation
  derived from: http://data.ga-group.nl/ics/bics/2020/1210131012
  derived from: http://data.ga-group.nl/ics/bics/2024/1210131012
  source accessed on: 2023-07-03T18:11:29Z
  source last accessed on: 2024-06-05T14:42:36Z
  definition: This segment includes companies that manufacture disposable and rechargeable household batteries. Includes alkaline batteries, lithium batteries, watch batteries, and dry cell primary batteries (AAA, AA, C, D, 9V).
  notation: 1210131012
  valid from: 2020-10-03
source accessed on: 2023-07-03T18:11:29Z
source last accessed on: 2024-06-05T14:42:36Z
definition: This segment includes companies that manufacture disposable and rechargeable household batteries. Includes alkaline batteries, lithium batteries, watch batteries, and dry cell primary batteries (AAA, AA, C, D, 9V).
notation: 1210131012
valid from: 2020-10-03

Home Products
type: BicsLevel4SubIndustry
type: Classifier
type: NamedIndividual
created with: infer-bics.sql
derived from: Tobacco Farming
  type: BicsLevel4SubIndustry
  type: Classifier
  type: ContemporaryDerivation
  derived from: http://data.ga-group.nl/ics/bics/2014/12101310
  source accessed on: 2019-12-03T20:05:01Z
  source last accessed on: 2019-12-03T20:05:01Z
  definition: This industry subgroup includes companies that grow tobacco plants.
  notation: 12101310
  valid from: 2014-08-08
  valid till: 2020-10-03
derived from: Home Products
  type: BicsLevel4SubIndustry
  type: Classifier
  type: AnachronousDerivation
  derived from: http://data.ga-group.nl/ics/bics/2014/12101410
  source accessed on: 2019-12-03T20:05:01Z
  source last accessed on: 2019-12-03T20:05:01Z
  definition: This industry subgroup includes companies that manufacture products that consumers typically use in their homes.
  notation: 12101410
  valid from: 2014-08-08
  valid till: 2020-10-03
derived from: Home Products
  type: BicsLevel4SubIndustry
  type: Classifier
  type: ContemporaryDerivation
  derived from: http://data.ga-group.nl/ics/bics/2020/12101310
  derived from: http://data.ga-group.nl/ics/bics/2024/12101310
  source accessed on: 2023-07-03T18:11:29Z
  source last accessed on: 2024-06-05T14:42:36Z
  definition: This industry subgroup includes companies that manufacture products that consumers typically need to maintain or operate their house.
  notation: 12101310
  valid from: 2020-10-03
source accessed on: 2019-12-03T20:05:01Z
source last accessed on: 2024-06-05T14:42:36Z
definition: This industry subgroup includes companies that manufacture products that consumers typically need to maintain or operate their house.
notation: 12101310
valid from: 2014-08-08

Cosmetics
type: BicsLevel5Segment
type: Classifier
type: NamedIndividual
is level5 segment of: Personal Care Products
replaces: Cosmetics
created with: infer-bics.sql
derived from: Cosmetics
  type: BicsLevel5Segment
  type: Classifier
  type: AnachronousDerivation
  derived from: http://data.ga-group.nl/ics/bics/2014/1210141110
  source accessed on: 2019-12-03T20:05:01Z
  source last accessed on: 2019-12-03T20:05:01Z
  definition: This segment includes companies that manufacture cosmetics.
  notation: 1210141110
  valid from: 2014-08-08
  valid till: 2020-10-03
derived from: Cosmetics
  type: BicsLevel5Segment
  type: Classifier
  type: ContemporaryDerivation
  derived from: http://data.ga-group.nl/ics/bics/2020/1210131110
  derived from: http://data.ga-group.nl/ics/bics/2024/1210131110
  source accessed on: 2023-07-03T18:11:29Z
  source last accessed on: 2024-06-05T14:42:36Z
  definition: This segment includes companies that manufacture cosmetics.
  notation: 1210131110
  valid from: 2020-10-03
source accessed on: 2023-07-03T18:11:29Z
source last accessed on: 2024-06-05T14:42:36Z
definition: This segment includes companies that manufacture cosmetics.
notation: 1210131110
valid from: 2020-10-03

Razor & Razor Blade
type: BicsLevel5Segment
type: Classifier
type: NamedIndividual
is level5 segment of: Personal Care Products
replaces: Razor & Razor Blade
created with: infer-bics.sql
derived from: Razor & Razor Blade
  type: BicsLevel5Segment
  type: Classifier
  type: AnachronousDerivation
  derived from: http://data.ga-group.nl/ics/bics/2014/1210141111
  source accessed on: 2019-12-03T20:05:01Z
  source last accessed on: 2019-12-03T20:05:01Z
  definition: This segment includes companies that manufacture razors and razor blades. Products include manual and electric razors.
  notation: 1210141111
  valid from: 2014-08-08
  valid till: 2020-10-03
derived from: Razor & Razor Blade
  type: BicsLevel5Segment
  type: Classifier
  type: ContemporaryDerivation
  derived from: http://data.ga-group.nl/ics/bics/2020/1210131111
  derived from: http://data.ga-group.nl/ics/bics/2024/1210131111
  source accessed on: 2023-07-03T18:11:29Z
  source last accessed on: 2024-06-05T14:42:36Z
  definition: This segment includes companies that manufacture manual and electric razors and razor blades.
  notation: 1210131111
  valid from: 2020-10-03
source accessed on: 2023-07-03T18:11:29Z
source last accessed on: 2024-06-05T14:42:36Z
definition: This segment includes companies that manufacture manual and electric razors and razor blades.
notation: 1210131111
valid from: 2020-10-03

Sanitary Paper Products
type: BicsLevel5Segment
type: Classifier
type: NamedIndividual
is level5 segment of: Personal Care Products
replaces: Sanitary Paper Products
created with: infer-bics.sql
derived from: Sanitary Paper Products
  type: BicsLevel5Segment
  type: Classifier
  type: AnachronousDerivation
  derived from: http://data.ga-group.nl/ics/bics/2014/1210141112
  source accessed on: 2019-12-03T20:05:01Z
  source last accessed on: 2019-12-03T20:05:01Z
  definition: This segment includes companies that manufacture sanitary paper-based products. Such products include diapers, facial tissues, table napkins, toilet paper, paper towels, sanitary napkins, tampons and incontinent pads.
  notation: 1210141112
  valid from: 2014-08-08
  valid till: 2020-10-03
derived from: Sanitary Paper Products
  type: BicsLevel5Segment
  type: Classifier
  type: ContemporaryDerivation
  derived from: http://data.ga-group.nl/ics/bics/2020/1210131112
  derived from: http://data.ga-group.nl/ics/bics/2024/1210131112
  source accessed on: 2023-07-03T18:11:29Z
  source last accessed on: 2024-06-05T14:42:36Z
  definition: This segment includes companies that manufacture sanitary paper-based products.
  notation: 1210131112
  valid from: 2020-10-03
source accessed on: 2023-07-03T18:11:29Z
source last accessed on: 2024-06-05T14:42:36Z
definition: This segment includes companies that manufacture sanitary paper-based products.
notation: 1210131112
valid from: 2020-10-03

Hand & Body Soap
type: BicsLevel5Segment
type: Classifier
type: NamedIndividual
is level5 segment of: Personal Care Products
replaces: Soap & Other Detergent
created with: infer-bics.sql
derived from: Soap & Other Detergent
  type: BicsLevel5Segment
  type: Classifier
  type: AnachronousDerivation
  derived from: http://data.ga-group.nl/ics/bics/2014/1210141113
  source accessed on: 2019-12-03T20:05:01Z
  source last accessed on: 2019-12-03T20:05:01Z
  definition: This segment includes companies that manufacture soaps and detergents, such as bar soap, laundry detergent, dishwashing detergent and hand soap.
  notation: 1210141113
  valid from: 2014-08-08
  valid till: 2020-10-03
derived from: Hand & Body Soap
  type: BicsLevel5Segment
  type: Classifier
  type: ContemporaryDerivation
  derived from: http://data.ga-group.nl/ics/bics/2020/1210131113
  derived from: http://data.ga-group.nl/ics/bics/2024/1210131113
  source accessed on: 2023-07-03T18:11:29Z
  source last accessed on: 2024-06-05T14:42:36Z
  definition: This segment includes companies that manufacture soaps that are applied directly to the body for hygienic purposes.
  notation: 1210131113
  valid from: 2020-10-03
source accessed on: 2023-07-03T18:11:29Z
source last accessed on: 2024-06-05T14:42:36Z
definition: This segment includes companies that manufacture soaps that are applied directly to the body for hygienic purposes.
notation: 1210131113
valid from: 2020-10-03

Personal Care Products
type: BicsLevel4SubIndustry
type: Classifier
type: NamedIndividual
created with: infer-bics.sql
derived from: Tobacco Leaf
  type: BicsLevel4SubIndustry
  type: Classifier
  type: ContemporaryDerivation
  derived from: http://data.ga-group.nl/ics/bics/2014/12101311
  source accessed on: 2019-12-03T20:05:01Z
  source last accessed on: 2019-12-03T20:05:01Z
  definition: This industry subgroup includes companies that process tobacco leaf from which other companies produce finished tobacco products.
  notation: 12101311
  valid from: 2014-08-08
  valid till: 2020-10-03
derived from: Personal Care Products
  type: BicsLevel4SubIndustry
  type: Classifier
  type: AnachronousDerivation
  derived from: http://data.ga-group.nl/ics/bics/2014/12101411
  source accessed on: 2019-12-03T20:05:01Z
  source last accessed on: 2019-12-03T20:05:01Z
  definition: This industry subgroup includes companies that manufacture personal hygiene products. Products include shaving preparations, hair care products, mouthwash, toothpaste, deodorant, baby powder and birth control products.
  notation: 12101411
  valid from: 2014-08-08
  valid till: 2020-10-03
derived from: Personal Care Products
  type: BicsLevel4SubIndustry
  type: Classifier
  type: ContemporaryDerivation
  derived from: http://data.ga-group.nl/ics/bics/2020/12101311
  derived from: http://data.ga-group.nl/ics/bics/2024/12101311
  source accessed on: 2023-07-03T18:11:29Z
  source last accessed on: 2024-06-05T14:42:36Z
  definition: This industry subgroup includes companies that manufacture personal hygiene products.
  notation: 12101311
  valid from: 2020-10-03
source accessed on: 2019-12-03T20:05:01Z
source last accessed on: 2024-06-05T14:42:36Z
definition: This industry subgroup includes companies that manufacture personal hygiene products.
notation: 12101311
valid from: 2014-08-08

Cigar
type: BicsLevel5Segment
type: Classifier
type: NamedIndividual
is level5 segment of: Tobacco Products
is replaced by: Cigar
created with: infer-bics.sql
derived from: Cigar
  type: BicsLevel5Segment
  type: Classifier
  type: ContemporaryDerivation
  derived from: http://data.ga-group.nl/ics/bics/2014/1210131210
  source accessed on: 2019-12-03T20:05:01Z
  source last accessed on: 2019-12-03T20:05:01Z
  definition: This segment includes companies that manufacture cigars.
  notation: 1210131210
  valid from: 2014-08-08
  valid till: 2020-10-03
source accessed on: 2019-12-03T20:05:01Z
source last accessed on: 2019-12-03T20:05:01Z
definition: This segment includes companies that manufacture cigars.
notation: 1210131210
valid from: 2014-08-08
valid till: 2020-10-03

Cigarette
type: BicsLevel5Segment
type: Classifier
type: NamedIndividual
is level5 segment of: Tobacco Products
is replaced by: Cigarette
created with: infer-bics.sql
derived from: Cigarette
  type: BicsLevel5Segment
  type: Classifier
  type: ContemporaryDerivation
  derived from: http://data.ga-group.nl/ics/bics/2014/1210131211
  source accessed on: 2019-12-03T20:05:01Z
  source last accessed on: 2019-12-03T20:05:01Z
  definition: This segment includes companies that manufacture cigarettes.
  notation: 1210131211
  valid from: 2014-08-08
  valid till: 2020-10-03
source accessed on: 2019-12-03T20:05:01Z
source last accessed on: 2019-12-03T20:05:01Z
definition: This segment includes companies that manufacture cigarettes.
notation: 1210131211
valid from: 2014-08-08
valid till: 2020-10-03

Smokeless Tobacco
type: BicsLevel5Segment
type: Classifier
type: NamedIndividual
is level5 segment of: Tobacco Products
is replaced by: Smokeless Tobacco
created with: infer-bics.sql
derived from: Smokeless Tobacco
  type: BicsLevel5Segment
  type: Classifier
  type: ContemporaryDerivation
  derived from: http://data.ga-group.nl/ics/bics/2014/1210131212
  source accessed on: 2019-12-03T20:05:01Z
  source last accessed on: 2019-12-03T20:05:01Z
  definition: This segment includes companies that produce smokeless tobacco products.
  notation: 1210131212
  valid from: 2014-08-08
  valid till: 2020-10-03
source accessed on: 2019-12-03T20:05:01Z
source last accessed on: 2019-12-03T20:05:01Z
definition: This segment includes companies that produce smokeless tobacco products.
notation: 1210131212
valid from: 2014-08-08
valid till: 2020-10-03

Tobacco Products
type: BicsLevel4SubIndustry
type: Classifier
type: NamedIndividual
created with: infer-bics.sql
derived from: Tobacco Products
  type: BicsLevel4SubIndustry
  type: Classifier
  type: ContemporaryDerivation
  derived from: http://data.ga-group.nl/ics/bics/2014/12101312
  source accessed on: 2019-12-03T20:05:01Z
  source last accessed on: 2019-12-03T20:05:01Z
  definition: This industry subgroup includes companies that produce finished consumer tobacco products.
  notation: 12101312
  valid from: 2014-08-08
  valid till: 2020-10-03
source accessed on: 2019-12-03T20:05:01Z
source last accessed on: 2019-12-03T20:05:01Z
definition: This industry subgroup includes companies that produce finished consumer tobacco products.
notation: 12101312
valid from: 2014-08-08
valid till: 2020-10-03

Household Products
type: BicsLevel3Industry
type: Classifier
type: NamedIndividual
is industry of: Consumer Staple Products
is replaced by: Tobacco
replaces: Household Products
created with: infer-bics.sql
derived from: Tobacco
  type: BicsLevel3Industry
  type: Classifier
  type: ContemporaryDerivation
  derived from: http://data.ga-group.nl/ics/bics/2014/121013
  source accessed on: 2019-12-03T20:05:01Z
  source last accessed on: 2019-12-03T20:05:01Z
  definition: This industry includes companies that process tobacco leaf and/or produce finished tobacco products.
  notation: 121013
  valid from: 2014-08-08
  valid till: 2020-10-03
derived from: Household Products
  type: BicsLevel3Industry
  type: Classifier
  type: AnachronousDerivation
  derived from: http://data.ga-group.nl/ics/bics/2014/121014
  source accessed on: 2019-12-03T20:05:01Z
  source last accessed on: 2019-12-03T20:05:01Z
  definition: This industry includes companies that manufacture household cleaning products (including soaps, detergents, polishes, degreasers, bleaches, ammonia, disinfectants and bathroom cleaners) and office products.
  notation: 121014
  valid from: 2014-08-08
  valid till: 2020-10-03
derived from: Household Products
  type: BicsLevel3Industry
  type: Classifier
  type: ContemporaryDerivation
  derived from: http://data.ga-group.nl/ics/bics/2020/121013
  derived from: http://data.ga-group.nl/ics/bics/2024/121013
  source accessed on: 2023-07-03T18:11:29Z
  source last accessed on: 2024-06-05T14:42:36Z
  definition: This industry includes companies that manufacture products or supplies needed for basic household maintenance and operation.
  notation: 121013
  valid from: 2020-10-03
source accessed on: 2019-12-03T20:05:01Z
source last accessed on: 2024-06-05T14:42:36Z
definition: This industry includes companies that manufacture products or supplies needed for basic household maintenance and operation.
notation: 121013
valid from: 2014-08-08

Electric Lamp Bulb & Parts
type: BicsLevel5Segment
type: Classifier
type: NamedIndividual
is level5 segment of: Home Products
is replaced by: Electric Lamp Bulb & Parts
created with: infer-bics.sql
derived from: Electric Lamp Bulb & Parts
  type: BicsLevel5Segment
  type: Classifier
  type: ContemporaryDerivation
  derived from: http://data.ga-group.nl/ics/bics/2014/1210141010
  source accessed on: 2019-12-03T20:05:01Z
  source last accessed on: 2019-12-03T20:05:01Z
  definition: This segment includes companies that manufacture electric lamp bulbs and associated parts.
  notation: 1210141010
  valid from: 2014-08-08
  valid till: 2020-10-03
source accessed on: 2019-12-03T20:05:01Z
source last accessed on: 2019-12-03T20:05:01Z
definition: This segment includes companies that manufacture electric lamp bulbs and associated parts.
notation: 1210141010
valid from: 2014-08-08
valid till: 2020-10-03

Household Cleaning Products
type: BicsLevel5Segment
type: Classifier
type: NamedIndividual
is level5 segment of: Home Products
is replaced by: Home Cleaning & Detergents
created with: infer-bics.sql
derived from: Household Cleaning Products
  type: BicsLevel5Segment
  type: Classifier
  type: ContemporaryDerivation
  derived from: http://data.ga-group.nl/ics/bics/2014/1210141011
  source accessed on: 2019-12-03T20:05:01Z
  source last accessed on: 2019-12-03T20:05:01Z
  definition: This segment includes companies that manufacture household cleaning products, such as ammonia, bleaches, degreasers, disinfectants, polishes, fabric softeners, and bathroom cleaners.
  notation: 1210141011
  valid from: 2014-08-08
  valid till: 2020-10-03
source accessed on: 2019-12-03T20:05:01Z
source last accessed on: 2019-12-03T20:05:01Z
definition: This segment includes companies that manufacture household cleaning products, such as ammonia, bleaches, degreasers, disinfectants, polishes, fabric softeners, and bathroom cleaners.
notation: 1210141011
valid from: 2014-08-08
valid till: 2020-10-03

Household Batteries
type: BicsLevel5Segment
type: Classifier
type: NamedIndividual
is level5 segment of: Home Products
is replaced by: Household Batteries
created with: infer-bics.sql
derived from: Household Batteries
  type: BicsLevel5Segment
  type: Classifier
  type: ContemporaryDerivation
  derived from: http://data.ga-group.nl/ics/bics/2014/1210141012
  source accessed on: 2019-12-03T20:05:01Z
  source last accessed on: 2019-12-03T20:05:01Z
  definition: This segment includes companies that manufacture disposable and rechargeable household batteries. Products include alkaline batteries, lithium batteries, watch batteries, and dry cell primary batteries (AAA, AA, C, D, 9V).
  notation: 1210141012
  valid from: 2014-08-08
  valid till: 2020-10-03
source accessed on: 2019-12-03T20:05:01Z
source last accessed on: 2019-12-03T20:05:01Z
definition: This segment includes companies that manufacture disposable and rechargeable household batteries. Products include alkaline batteries, lithium batteries, watch batteries, and dry cell primary batteries (AAA, AA, C, D, 9V).
notation: 1210141012
valid from: 2014-08-08
valid till: 2020-10-03

Home Products
type: BicsLevel4SubIndustry
type: Classifier
type: NamedIndividual
created with: infer-bics.sql
derived from: Home Products
  type: BicsLevel4SubIndustry
  type: Classifier
  type: ContemporaryDerivation
  derived from: http://data.ga-group.nl/ics/bics/2014/12101410
  source accessed on: 2019-12-03T20:05:01Z
  source last accessed on: 2019-12-03T20:05:01Z
  definition: This industry subgroup includes companies that manufacture products that consumers typically use in their homes.
  notation: 12101410
  valid from: 2014-08-08
  valid till: 2020-10-03
source accessed on: 2019-12-03T20:05:01Z
source last accessed on: 2019-12-03T20:05:01Z
definition: This industry subgroup includes companies that manufacture products that consumers typically use in their homes.
notation: 12101410
valid from: 2014-08-08
valid till: 2020-10-03

Cosmetics
type: BicsLevel5Segment
type: Classifier
type: NamedIndividual
is level5 segment of: Personal Care Products
is replaced by: Cosmetics
created with: infer-bics.sql
derived from: Cosmetics
  type: BicsLevel5Segment
  type: Classifier
  type: ContemporaryDerivation
  derived from: http://data.ga-group.nl/ics/bics/2014/1210141110
  source accessed on: 2019-12-03T20:05:01Z
  source last accessed on: 2019-12-03T20:05:01Z
  definition: This segment includes companies that manufacture cosmetics.
  notation: 1210141110
  valid from: 2014-08-08
  valid till: 2020-10-03
source accessed on: 2019-12-03T20:05:01Z
source last accessed on: 2019-12-03T20:05:01Z
definition: This segment includes companies that manufacture cosmetics.
notation: 1210141110
valid from: 2014-08-08
valid till: 2020-10-03

Razor & Razor Blade
type: BicsLevel5Segment
type: Classifier
type: NamedIndividual
is level5 segment of: Personal Care Products
is replaced by: Razor & Razor Blade
created with: infer-bics.sql
derived from: Razor & Razor Blade
  type: BicsLevel5Segment
  type: Classifier
  type: ContemporaryDerivation
  derived from: http://data.ga-group.nl/ics/bics/2014/1210141111
  source accessed on: 2019-12-03T20:05:01Z
  source last accessed on: 2019-12-03T20:05:01Z
  definition: This segment includes companies that manufacture razors and razor blades. Products include manual and electric razors.
  notation: 1210141111
  valid from: 2014-08-08
  valid till: 2020-10-03
source accessed on: 2019-12-03T20:05:01Z
source last accessed on: 2019-12-03T20:05:01Z
definition: This segment includes companies that manufacture razors and razor blades. Products include manual and electric razors.
notation: 1210141111
valid from: 2014-08-08
valid till: 2020-10-03

Sanitary Paper Products
type: BicsLevel5Segment
type: Classifier
type: NamedIndividual
is level5 segment of: Personal Care Products
is replaced by: Sanitary Paper Products
created with: infer-bics.sql
derived from: Sanitary Paper Products
  type: BicsLevel5Segment
  type: Classifier
  type: ContemporaryDerivation
  derived from: http://data.ga-group.nl/ics/bics/2014/1210141112
  source accessed on: 2019-12-03T20:05:01Z
  source last accessed on: 2019-12-03T20:05:01Z
  definition: This segment includes companies that manufacture sanitary paper-based products. Such products include diapers, facial tissues, table napkins, toilet paper, paper towels, sanitary napkins, tampons and incontinent pads.
  notation: 1210141112
  valid from: 2014-08-08
  valid till: 2020-10-03
source accessed on: 2019-12-03T20:05:01Z
source last accessed on: 2019-12-03T20:05:01Z
definition: This segment includes companies that manufacture sanitary paper-based products. Such products include diapers, facial tissues, table napkins, toilet paper, paper towels, sanitary napkins, tampons and incontinent pads.
notation: 1210141112
valid from: 2014-08-08
valid till: 2020-10-03

Soap & Other Detergent
type: BicsLevel5Segment
type: Classifier
type: NamedIndividual
is level5 segment of: Personal Care Products
is replaced by: Hand & Body Soap
created with: infer-bics.sql
derived from: Soap & Other Detergent
  type: BicsLevel5Segment
  type: Classifier
  type: ContemporaryDerivation
  derived from: http://data.ga-group.nl/ics/bics/2014/1210141113
  source accessed on: 2019-12-03T20:05:01Z
  source last accessed on: 2019-12-03T20:05:01Z
  definition: This segment includes companies that manufacture soaps and detergents, such as bar soap, laundry detergent, dishwashing detergent and hand soap.
  notation: 1210141113
  valid from: 2014-08-08
  valid till: 2020-10-03
source accessed on: 2019-12-03T20:05:01Z
source last accessed on: 2019-12-03T20:05:01Z
definition: This segment includes companies that manufacture soaps and detergents, such as bar soap, laundry detergent, dishwashing detergent and hand soap.
notation: 1210141113
valid from: 2014-08-08
valid till: 2020-10-03

Other Personal Care Products
type: BicsLevel5Segment
type: Classifier
type: NamedIndividual
is level5 segment of: Personal Care Products
created with: infer-bics.sql
derived from: Other Personal Care Products
  type: BicsLevel5Segment
  type: Classifier
  type: ContemporaryDerivation
  derived from: http://data.ga-group.nl/ics/bics/2014/1210141114
  source accessed on: 2019-12-03T20:05:01Z
  source last accessed on: 2019-12-03T20:05:01Z
  definition: This segment includes companies that manufacture other personal care products not elsewhere classified.
  notation: 1210141114
  valid from: 2014-08-08
  valid till: 2020-10-03
source accessed on: 2019-12-03T20:05:01Z
source last accessed on: 2019-12-03T20:05:01Z
definition: This segment includes companies that manufacture other personal care products not elsewhere classified.
notation: 1210141114
valid from: 2014-08-08
valid till: 2020-10-03

Personal Care Products
type: BicsLevel4SubIndustry
type: Classifier
type: NamedIndividual
created with: infer-bics.sql
derived from: Personal Care Products
  type: BicsLevel4SubIndustry
  type: Classifier
  type: ContemporaryDerivation
  derived from: http://data.ga-group.nl/ics/bics/2014/12101411
  source accessed on: 2019-12-03T20:05:01Z
  source last accessed on: 2019-12-03T20:05:01Z
  definition: This industry subgroup includes companies that manufacture personal hygiene products. Products include shaving preparations, hair care products, mouthwash, toothpaste, deodorant, baby powder and birth control products.
  notation: 12101411
  valid from: 2014-08-08
  valid till: 2020-10-03
source accessed on: 2019-12-03T20:05:01Z
source last accessed on: 2019-12-03T20:05:01Z
definition: This industry subgroup includes companies that manufacture personal hygiene products. Products include shaving preparations, hair care products, mouthwash, toothpaste, deodorant, baby powder and birth control products.
notation: 12101411
valid from: 2014-08-08
valid till: 2020-10-03

Household Products
type: BicsLevel3Industry
type: Classifier
type: NamedIndividual
is industry of: Consumer Staple Products
is replaced by: Household Products
created with: infer-bics.sql
derived from: Household Products
  type: BicsLevel3Industry
  type: Classifier
  type: ContemporaryDerivation
  derived from: http://data.ga-group.nl/ics/bics/2014/121014
  source accessed on: 2019-12-03T20:05:01Z
  source last accessed on: 2019-12-03T20:05:01Z
  definition: This industry includes companies that manufacture household cleaning products (including soaps, detergents, polishes, degreasers, bleaches, ammonia, disinfectants and bathroom cleaners) and office products.
  notation: 121014
  valid from: 2014-08-08
  valid till: 2020-10-03
source accessed on: 2019-12-03T20:05:01Z
source last accessed on: 2019-12-03T20:05:01Z
definition: This industry includes companies that manufacture household cleaning products (including soaps, detergents, polishes, degreasers, bleaches, ammonia, disinfectants and bathroom cleaners) and office products.
notation: 121014
valid from: 2014-08-08
valid till: 2020-10-03

Other Consumer Products
type: BicsLevel3Industry
type: Classifier
type: NamedIndividual
is industry of: Consumer Staple Products
created with: infer-bics.sql
derived from: Other Consumer Products
  type: BicsLevel3Industry
  type: Classifier
  type: ContemporaryDerivation
  derived from: http://data.ga-group.nl/ics/bics/2014/121015
  source accessed on: 2019-12-03T20:05:01Z
  source last accessed on: 2019-12-03T20:05:01Z
  definition: This industry includes companies that manufacture other consumer products not elsewhere classified.
  notation: 121015
  valid from: 2014-08-08
  valid till: 2020-10-03
source accessed on: 2019-12-03T20:05:01Z
source last accessed on: 2019-12-03T20:05:01Z
definition: This industry includes companies that manufacture other consumer products not elsewhere classified.
notation: 121015
valid from: 2014-08-08
valid till: 2020-10-03

Consumer Staple Products
type: BicsLevel2IndustryGroup
type: Classifier
type: NamedIndividual
is industry group of: Consumer Staples
created with: infer-bics.sql
derived from: Consumer Products
  type: BicsLevel2IndustryGroup
  type: Classifier
  type: ContemporaryDerivation
  derived from: http://data.ga-group.nl/ics/bics/2014/1210
  source accessed on: 2019-12-03T20:05:01Z
  source last accessed on: 2019-12-03T20:05:01Z
  definition: This industry group includes companies that manufacture noncyclical products for household consumer consumption. Includes food, beverage, tobacco and household products.
  notation: 1210
  valid from: 2014-08-08
  valid till: 2020-10-03
derived from: Consumer Staple Products
  type: BicsLevel2IndustryGroup
  type: Classifier
  type: ContemporaryDerivation
  derived from: http://data.ga-group.nl/ics/bics/2020/1210
  derived from: http://data.ga-group.nl/ics/bics/2024/1210
  source accessed on: 2023-07-03T18:11:29Z
  source last accessed on: 2024-06-05T14:42:36Z
  definition: This industry group includes companies that manufacture noncyclical products for household and consumer consumption.
  notation: 1210
  valid from: 2020-10-03
source accessed on: 2019-12-03T20:05:01Z
source last accessed on: 2024-06-05T14:42:36Z
definition: This industry group includes companies that manufacture noncyclical products for household and consumer consumption.
notation: 1210
valid from: 2014-08-08

Farm Supplies Wholesalers
type: BicsLevel5Segment
type: Classifier
type: NamedIndividual
is level5 segment of: Agricultural Products Whslrs
created with: infer-bics.sql
derived from: Farm Supplies Wholesalers
  type: BicsLevel4SubIndustry
  type: Classifier
  type: AnachronousDerivation
  derived from: http://data.ga-group.nl/ics/bics/2014/12111010
  source accessed on: 2019-12-03T20:05:01Z
  source last accessed on: 2019-12-03T20:05:01Z
  definition: This industry subgroup includes companies that wholesale and distribute farm and garden supplies.
  notation: 12111010
  valid from: 2014-08-08
  valid till: 2020-10-03
derived from: Farm Supplies Wholesalers
  type: BicsLevel5Segment
  type: Classifier
  type: ContemporaryDerivation
  derived from: http://data.ga-group.nl/ics/bics/2020/1211101010
  derived from: http://data.ga-group.nl/ics/bics/2024/1211101010
  source accessed on: 2023-07-03T18:11:29Z
  source last accessed on: 2024-06-05T14:42:36Z
  definition: This segment includes companies that wholesale and distribute consumable farm and garden supplies.
  notation: 1211101010
  valid from: 2020-10-03
source accessed on: 2023-07-03T18:11:29Z
source last accessed on: 2024-06-05T14:42:36Z
definition: This segment includes companies that wholesale and distribute consumable farm and garden supplies.
notation: 1211101010
valid from: 2020-10-03

Grain & Field Bean Whslrs
type: BicsLevel5Segment
type: Classifier
type: NamedIndividual
is level5 segment of: Agricultural Products Whslrs
created with: infer-bics.sql
derived from: Grain & Field Bean Whslrs
  type: BicsLevel4SubIndustry
  type: Classifier
  type: AnachronousDerivation
  derived from: http://data.ga-group.nl/ics/bics/2014/12111011
  source accessed on: 2019-12-03T20:05:01Z
  source last accessed on: 2019-12-03T20:05:01Z
  definition: This industry subgroup includes companies that wholesale and distribute grains and beans.
  notation: 12111011
  valid from: 2014-08-08
  valid till: 2020-10-03
derived from: Grain & Field Bean Whslrs
  type: BicsLevel5Segment
  type: Classifier
  type: ContemporaryDerivation
  derived from: http://data.ga-group.nl/ics/bics/2020/1211101011
  derived from: http://data.ga-group.nl/ics/bics/2024/1211101011
  source accessed on: 2023-07-03T18:11:29Z
  source last accessed on: 2024-06-05T14:42:36Z
  definition: This segment includes companies that wholesale and distribute grains and beans.
  notation: 1211101011
  valid from: 2020-10-03
source accessed on: 2023-07-03T18:11:29Z
source last accessed on: 2024-06-05T14:42:36Z
definition: This segment includes companies that wholesale and distribute grains and beans.
notation: 1211101011
valid from: 2020-10-03

Livestock Wholesalers
type: BicsLevel5Segment
type: Classifier
type: NamedIndividual
is level5 segment of: Agricultural Products Whslrs
created with: infer-bics.sql
derived from: Livestock Wholesalers
  type: BicsLevel4SubIndustry
  type: Classifier
  type: AnachronousDerivation
  derived from: http://data.ga-group.nl/ics/bics/2014/12111012
  source accessed on: 2019-12-03T20:05:01Z
  source last accessed on: 2019-12-03T20:05:01Z
  definition: This industry subgroup includes companies that wholesale and distribute livestock.
  notation: 12111012
  valid from: 2014-08-08
  valid till: 2020-10-03
derived from: Livestock Wholesalers
  type: BicsLevel5Segment
  type: Classifier
  type: ContemporaryDerivation
  derived from: http://data.ga-group.nl/ics/bics/2020/1211101012
  derived from: http://data.ga-group.nl/ics/bics/2024/1211101012
  source accessed on: 2023-07-03T18:11:29Z
  source last accessed on: 2024-06-05T14:42:36Z
  definition: This segment includes companies that wholesale and distribute livestock.
  notation: 1211101012
  valid from: 2020-10-03
source accessed on: 2023-07-03T18:11:29Z
source last accessed on: 2024-06-05T14:42:36Z
definition: This segment includes companies that wholesale and distribute livestock.
notation: 1211101012
valid from: 2020-10-03

Agricultural Products Whslrs
type: BicsLevel4SubIndustry
type: Classifier
type: NamedIndividual
replaces: Wholesale - Consumer Staples
created with: infer-bics.sql
derived from: Agricultural Products Whslrs
  type: BicsLevel3Industry
  type: Classifier
  type: AnachronousDerivation
  derived from: http://data.ga-group.nl/ics/bics/2014/121110
  source accessed on: 2019-12-03T20:05:01Z
  source last accessed on: 2019-12-03T20:05:01Z
  definition: This industry includes companies that wholesale and distribute agricultural products, such as grains, beans, livestock, farm supplies and farm and garden machinery.
  notation: 121110
  valid from: 2014-08-08
  valid till: 2020-10-03
derived from: Farm Supplies Wholesalers
  type: BicsLevel4SubIndustry
  type: Classifier
  type: ContemporaryDerivation
  derived from: http://data.ga-group.nl/ics/bics/2014/12111010
  source accessed on: 2019-12-03T20:05:01Z
  source last accessed on: 2019-12-03T20:05:01Z
  definition: This industry subgroup includes companies that wholesale and distribute farm and garden supplies.
  notation: 12111010
  valid from: 2014-08-08
  valid till: 2020-10-03
derived from: Agricultural Products Whslrs
  type: BicsLevel4SubIndustry
  type: Classifier
  type: ContemporaryDerivation
  derived from: http://data.ga-group.nl/ics/bics/2020/12111010
  derived from: http://data.ga-group.nl/ics/bics/2024/12111010
  source accessed on: 2023-07-03T18:11:29Z
  source last accessed on: 2024-06-05T14:42:36Z
  definition: This industry subgroup includes companies that wholesale and distribute agricultural supplies, such as grains, beans, livestock, and other farm supplies. Excludes companies that wholesale agricultural machinery and equipment (see Farm/Garden Mach/Equip Whslrs).
  notation: 12111010
  valid from: 2020-10-03
source accessed on: 2019-12-03T20:05:01Z
source last accessed on: 2024-06-05T14:42:36Z
definition: This industry subgroup includes companies that wholesale and distribute agricultural supplies, such as grains, beans, livestock, and other farm supplies. Excludes companies that wholesale agricultural machinery and equipment (see Farm/Garden Mach/Equip Whslrs).
notation: 12111010
valid from: 2014-08-08

Beer & Ale Wholesalers
type: BicsLevel5Segment
type: Classifier
type: NamedIndividual
is level5 segment of: Food & Beverage Wholesalers
created with: infer-bics.sql
derived from: Beer & Ale Wholesalers
  type: BicsLevel4SubIndustry
  type: Classifier
  type: AnachronousDerivation
  derived from: http://data.ga-group.nl/ics/bics/2014/12111110
  source accessed on: 2019-12-03T20:05:01Z
  source last accessed on: 2019-12-03T20:05:01Z
  definition: This industry subgroup includes companies that wholesale and distribute beer and malt beverages.
  notation: 12111110
  valid from: 2014-08-08
  valid till: 2020-10-03
derived from: Beer & Ale Wholesalers
  type: BicsLevel5Segment
  type: Classifier
  type: ContemporaryDerivation
  derived from: http://data.ga-group.nl/ics/bics/2020/1211101110
  derived from: http://data.ga-group.nl/ics/bics/2024/1211101110
  source accessed on: 2023-07-03T18:11:29Z
  source last accessed on: 2024-06-05T14:42:36Z
  definition: This segment includes companies that wholesale and distribute beer and malt beverages.
  notation: 1211101110
  valid from: 2020-10-03
source accessed on: 2023-07-03T18:11:29Z
source last accessed on: 2024-06-05T14:42:36Z
definition: This segment includes companies that wholesale and distribute beer and malt beverages.
notation: 1211101110
valid from: 2020-10-03

Confectionery Wholesalers
type: BicsLevel5Segment
type: Classifier
type: NamedIndividual
is level5 segment of: Food & Beverage Wholesalers
created with: infer-bics.sql
derived from: Confectionery Wholesalers
  type: BicsLevel4SubIndustry
  type: Classifier
  type: AnachronousDerivation
  derived from: http://data.ga-group.nl/ics/bics/2014/12111111
  source accessed on: 2019-12-03T20:05:01Z
  source last accessed on: 2019-12-03T20:05:01Z
  definition: This industry subgroup includes companies that wholesale and distribute confectionaries, nuts, chips and fountain syrups.
  notation: 12111111
  valid from: 2014-08-08
  valid till: 2020-10-03
derived from: Confectionery Wholesalers
  type: BicsLevel5Segment
  type: Classifier
  type: ContemporaryDerivation
  derived from: http://data.ga-group.nl/ics/bics/2020/1211101111
  source accessed on: 2023-07-03T18:11:29Z
  source last accessed on: 2023-07-03T18:11:29Z
  definition: This segment includes companies that wholesale and distribute confectionaries, nuts, chips, and fountain syrups.
  notation: 1211101111
  valid from: 2020-10-03
  valid till: 2024-06-07
derived from: Confectionery Wholesalers
  type: BicsLevel5Segment
  type: Classifier
  type: ContemporaryDerivation
  derived from: http://data.ga-group.nl/ics/bics/2024/1211101111
  source accessed on: 2024-06-05T14:42:36Z
  source last accessed on: 2024-06-05T14:42:36Z
  definition: This segment includes companies that wholesale and distribute confectioneries, nuts, chips, and fountain syrups.
  notation: 1211101111
  valid from: 2024-06-07
source accessed on: 2023-07-03T18:11:29Z
source last accessed on: 2024-06-05T14:42:36Z
definition: This segment includes companies that wholesale and distribute confectioneries, nuts, chips, and fountain syrups.
notation: 1211101111
valid from: 2020-10-03

Dairy Prods Whslrs (ex Dry/Can)
type: BicsLevel5Segment
type: Classifier
type: NamedIndividual
is level5 segment of: Food & Beverage Wholesalers
created with: infer-bics.sql
derived from: Dairy Prods Whslrs (ex Dry/Can)
  type: BicsLevel4SubIndustry
  type: Classifier
  type: AnachronousDerivation
  derived from: http://data.ga-group.nl/ics/bics/2014/12111112
  source accessed on: 2019-12-03T20:05:01Z
  source last accessed on: 2019-12-03T20:05:01Z
  definition: This industry subgroup includes companies that wholesale and distribute dairy products, except for dried or canned dairy products.
  notation: 12111112
  valid from: 2014-08-08
  valid till: 2020-10-03
derived from: Dairy Prods Whslrs (ex Dry/Can)
  type: BicsLevel5Segment
  type: Classifier
  type: ContemporaryDerivation
  derived from: http://data.ga-group.nl/ics/bics/2020/1211101112
  derived from: http://data.ga-group.nl/ics/bics/2024/1211101112
  source accessed on: 2023-07-03T18:11:29Z
  source last accessed on: 2024-06-05T14:42:36Z
  definition: This segment includes companies that wholesale and distribute dairy products, excluding dried or canned dairy products.
  notation: 1211101112
  valid from: 2020-10-03
source accessed on: 2023-07-03T18:11:29Z
source last accessed on: 2024-06-05T14:42:36Z
definition: This segment includes companies that wholesale and distribute dairy products, excluding dried or canned dairy products.
notation: 1211101112
valid from: 2020-10-03

Fish & Seafood Wholesalers
type: BicsLevel5Segment
type: Classifier
type: NamedIndividual
is level5 segment of: Food & Beverage Wholesalers
created with: infer-bics.sql
derived from: Fish & Seafood Wholesalers
  type: BicsLevel4SubIndustry
  type: Classifier
  type: AnachronousDerivation
  derived from: http://data.ga-group.nl/ics/bics/2014/12111113
  source accessed on: 2019-12-03T20:05:01Z
  source last accessed on: 2019-12-03T20:05:01Z
  definition: This industry subgroup includes companies that wholesale and distribute fish and other seafood.
  notation: 12111113
  valid from: 2014-08-08
  valid till: 2020-10-03
derived from: Fish & Seafood Wholesalers
  type: BicsLevel5Segment
  type: Classifier
  type: ContemporaryDerivation
  derived from: http://data.ga-group.nl/ics/bics/2020/1211101113
  derived from: http://data.ga-group.nl/ics/bics/2024/1211101113
  source accessed on: 2023-07-03T18:11:29Z
  source last accessed on: 2024-06-05T14:42:36Z
  definition: This segment includes companies that wholesale and distribute fish and other seafood.
  notation: 1211101113
  valid from: 2020-10-03
source accessed on: 2023-07-03T18:11:29Z
source last accessed on: 2024-06-05T14:42:36Z
definition: This segment includes companies that wholesale and distribute fish and other seafood.
notation: 1211101113
valid from: 2020-10-03

Fresh Fruit & Vegetable Whslrs
type: BicsLevel5Segment
type: Classifier
type: NamedIndividual
is level5 segment of: Food & Beverage Wholesalers
created with: infer-bics.sql
derived from: Fresh Fruit & Vegetable Whslrs
  type: BicsLevel4SubIndustry
  type: Classifier
  type: AnachronousDerivation
  derived from: http://data.ga-group.nl/ics/bics/2014/12111114
  source accessed on: 2019-12-03T20:05:01Z
  source last accessed on: 2019-12-03T20:05:01Z
  definition: This industry subgroup includes companies that wholesale fresh fruit and vegetables to retailers.
  notation: 12111114
  valid from: 2014-08-08
  valid till: 2020-10-03
derived from: Fresh Fruit & Vegetable Whslrs
  type: BicsLevel5Segment
  type: Classifier
  type: ContemporaryDerivation
  derived from: http://data.ga-group.nl/ics/bics/2020/1211101114
  derived from: http://data.ga-group.nl/ics/bics/2024/1211101114
  source accessed on: 2023-07-03T18:11:29Z
  source last accessed on: 2024-06-05T14:42:36Z
  definition: This segment includes companies that wholesale and distribute fresh fruit and vegetables.
  notation: 1211101114
  valid from: 2020-10-03
source accessed on: 2023-07-03T18:11:29Z
source last accessed on: 2024-06-05T14:42:36Z
definition: This segment includes companies that wholesale and distribute fresh fruit and vegetables.
notation: 1211101114
valid from: 2020-10-03

General-Line Grocery Whslrs
type: BicsLevel5Segment
type: Classifier
type: NamedIndividual
is level5 segment of: Food & Beverage Wholesalers
created with: infer-bics.sql
derived from: General-Line Grocery Whslrs
  type: BicsLevel4SubIndustry
  type: Classifier
  type: AnachronousDerivation
  derived from: http://data.ga-group.nl/ics/bics/2014/12111115
  source accessed on: 2019-12-03T20:05:01Z
  source last accessed on: 2019-12-03T20:05:01Z
  definition: This industry subgroup includes companies that wholesale and distribute general groceries.
  notation: 12111115
  valid from: 2014-08-08
  valid till: 2020-10-03
derived from: General-Line Grocery Whslrs
  type: BicsLevel5Segment
  type: Classifier
  type: ContemporaryDerivation
  derived from: http://data.ga-group.nl/ics/bics/2020/1211101115
  derived from: http://data.ga-group.nl/ics/bics/2024/1211101115
  source accessed on: 2023-07-03T18:11:29Z
  source last accessed on: 2024-06-05T14:42:36Z
  definition: This segment includes companies that wholesale and distribute general groceries.
  notation: 1211101115
  valid from: 2020-10-03
source accessed on: 2023-07-03T18:11:29Z
source last accessed on: 2024-06-05T14:42:36Z
definition: This segment includes companies that wholesale and distribute general groceries.
notation: 1211101115
valid from: 2020-10-03

Meat Products Wholesalers
type: BicsLevel5Segment
type: Classifier
type: NamedIndividual
is level5 segment of: Food & Beverage Wholesalers
created with: infer-bics.sql
derived from: Meat Products Wholesalers
  type: BicsLevel4SubIndustry
  type: Classifier
  type: AnachronousDerivation
  derived from: http://data.ga-group.nl/ics/bics/2014/12111116
  source accessed on: 2019-12-03T20:05:01Z
  source last accessed on: 2019-12-03T20:05:01Z
  definition: This industry subgroup includes companies that wholesale and distribute fresh meat and other meat products.
  notation: 12111116
  valid from: 2014-08-08
  valid till: 2020-10-03
derived from: Meat Products Wholesalers
  type: BicsLevel5Segment
  type: Classifier
  type: ContemporaryDerivation
  derived from: http://data.ga-group.nl/ics/bics/2020/1211101116
  derived from: http://data.ga-group.nl/ics/bics/2024/1211101116
  source accessed on: 2023-07-03T18:11:29Z
  source last accessed on: 2024-06-05T14:42:36Z
  definition: This segment includes companies that wholesale and distribute fresh meat and other meat products.
  notation: 1211101116
  valid from: 2020-10-03
source accessed on: 2023-07-03T18:11:29Z
source last accessed on: 2024-06-05T14:42:36Z
definition: This segment includes companies that wholesale and distribute fresh meat and other meat products.
notation: 1211101116
valid from: 2020-10-03

Packaged Frozen Food Whslrs
type: BicsLevel5Segment
type: Classifier
type: NamedIndividual
is level5 segment of: Food & Beverage Wholesalers
created with: infer-bics.sql
derived from: Packaged Frozen Food Whslrs
  type: BicsLevel4SubIndustry
  type: Classifier
  type: AnachronousDerivation
  derived from: http://data.ga-group.nl/ics/bics/2014/12111117
  source accessed on: 2019-12-03T20:05:01Z
  source last accessed on: 2019-12-03T20:05:01Z
  definition: This industry subgroup includes companies that wholesale and distribute packaged frozen foods.
  notation: 12111117
  valid from: 2014-08-08
  valid till: 2020-10-03
derived from: Packaged Frozen Food Whslrs
  type: BicsLevel5Segment
  type: Classifier
  type: ContemporaryDerivation
  derived from: http://data.ga-group.nl/ics/bics/2020/1211101117
  derived from: http://data.ga-group.nl/ics/bics/2024/1211101117
  source accessed on: 2023-07-03T18:11:29Z
  source last accessed on: 2024-06-05T14:42:36Z
  definition: This segment includes companies that wholesale and distribute packaged frozen foods.
  notation: 1211101117
  valid from: 2020-10-03
source accessed on: 2023-07-03T18:11:29Z
source last accessed on: 2024-06-05T14:42:36Z
definition: This segment includes companies that wholesale and distribute packaged frozen foods.
notation: 1211101117
valid from: 2020-10-03

Poultry Products Wholesalers
type: BicsLevel5Segment
type: Classifier
type: NamedIndividual
is level5 segment of: Food & Beverage Wholesalers
created with: infer-bics.sql
derived from: Poultry Products Wholesalers
  type: BicsLevel4SubIndustry
  type: Classifier
  type: AnachronousDerivation
  derived from: http://data.ga-group.nl/ics/bics/2014/12111118
  source accessed on: 2019-12-03T20:05:01Z
  source last accessed on: 2019-12-03T20:05:01Z
  definition: This industry subgroup includes companies that wholesale and distribute fresh poultry and poultry-based products.
  notation: 12111118
  valid from: 2014-08-08
  valid till: 2020-10-03
derived from: Poultry Products Wholesalers
  type: BicsLevel5Segment
  type: Classifier
  type: ContemporaryDerivation
  derived from: http://data.ga-group.nl/ics/bics/2020/1211101118
  derived from: http://data.ga-group.nl/ics/bics/2024/1211101118
  source accessed on: 2023-07-03T18:11:29Z
  source last accessed on: 2024-06-05T14:42:36Z
  definition: This segment includes companies that wholesale and distribute fresh poultry and poultry-based products.
  notation: 1211101118
  valid from: 2020-10-03
source accessed on: 2023-07-03T18:11:29Z
source last accessed on: 2024-06-05T14:42:36Z
definition: This segment includes companies that wholesale and distribute fresh poultry and poultry-based products.
notation: 1211101118
valid from: 2020-10-03

Tobacco Products Wholesalers
type: BicsLevel5Segment
type: Classifier
type: NamedIndividual
is level5 segment of: Food & Beverage Wholesalers
created with: infer-bics.sql
derived from: Tobacco Products Wholesalers
  type: BicsLevel4SubIndustry
  type: Classifier
  type: AnachronousDerivation
  derived from: http://data.ga-group.nl/ics/bics/2014/12111119
  source accessed on: 2019-12-03T20:05:01Z
  source last accessed on: 2019-12-03T20:05:01Z
  definition: This industry subgroup includes companies that wholesale and distribute tobacco and other tobacco-based products.
  notation: 12111119
  valid from: 2014-08-08
  valid till: 2020-10-03
derived from: Tobacco Products Wholesalers
  type: BicsLevel5Segment
  type: Classifier
  type: ContemporaryDerivation
  derived from: http://data.ga-group.nl/ics/bics/2020/1211101119
  derived from: http://data.ga-group.nl/ics/bics/2024/1211101119
  source accessed on: 2023-07-03T18:11:29Z
  source last accessed on: 2024-06-05T14:42:36Z
  definition: This segment includes companies that wholesale and distribute tobacco and other tobacco-based products.
  notation: 1211101119
  valid from: 2020-10-03
source accessed on: 2023-07-03T18:11:29Z
source last accessed on: 2024-06-05T14:42:36Z
definition: This segment includes companies that wholesale and distribute tobacco and other tobacco-based products.
notation: 1211101119
valid from: 2020-10-03

Wine & Distilled Alcohol Whslrs
type: BicsLevel5Segment
type: Classifier
type: NamedIndividual
is level5 segment of: Food & Beverage Wholesalers
created with: infer-bics.sql
derived from: Wine & Distilled Alcohol Whslrs
  type: BicsLevel4SubIndustry
  type: Classifier
  type: AnachronousDerivation
  derived from: http://data.ga-group.nl/ics/bics/2014/12111120
  source accessed on: 2019-12-03T20:05:01Z
  source last accessed on: 2019-12-03T20:05:01Z
  definition: This industry subgroup includes companies that wholesale and distribute wine and distilled alcoholic beverages.
  notation: 12111120
  valid from: 2014-08-08
  valid till: 2020-10-03
derived from: Wine & Distilled Alcohol Whslrs
  type: BicsLevel5Segment
  type: Classifier
  type: ContemporaryDerivation
  derived from: http://data.ga-group.nl/ics/bics/2020/1211101120
  derived from: http://data.ga-group.nl/ics/bics/2024/1211101120
  source accessed on: 2023-07-03T18:11:29Z
  source last accessed on: 2024-06-05T14:42:36Z
  definition: This segment includes companies that wholesale and distribute wine and distilled alcoholic beverages.
  notation: 1211101120
  valid from: 2020-10-03
source accessed on: 2023-07-03T18:11:29Z
source last accessed on: 2024-06-05T14:42:36Z
definition: This segment includes companies that wholesale and distribute wine and distilled alcoholic beverages.
notation: 1211101120
valid from: 2020-10-03

Food & Beverage Wholesalers
type: BicsLevel4SubIndustry
type: Classifier
type: NamedIndividual
replaces: Retail - Consumer Staples
created with: infer-bics.sql
derived from: Grain & Field Bean Whslrs
  type: BicsLevel4SubIndustry
  type: Classifier
  type: ContemporaryDerivation
  derived from: http://data.ga-group.nl/ics/bics/2014/12111011
  source accessed on: 2019-12-03T20:05:01Z
  source last accessed on: 2019-12-03T20:05:01Z
  definition: This industry subgroup includes companies that wholesale and distribute grains and beans.
  notation: 12111011
  valid from: 2014-08-08
  valid till: 2020-10-03
derived from: Food Products Wholesalers
  type: BicsLevel3Industry
  type: Classifier
  type: AnachronousDerivation
  derived from: http://data.ga-group.nl/ics/bics/2014/121111
  source accessed on: 2019-12-03T20:05:01Z
  source last accessed on: 2019-12-03T20:05:01Z
  definition: This industry includes companies that wholesale, procure and deliver food products, such as fresh produce, dairy, meat and seafood. The may also wholesale general merchandise, health/beauty care products and tobacco products as well as assist with assortment planning and retail pricing support.
  notation: 121111
  valid from: 2014-08-08
  valid till: 2020-10-03
derived from: Food & Beverage Wholesalers
  type: BicsLevel4SubIndustry
  type: Classifier
  type: ContemporaryDerivation
  derived from: http://data.ga-group.nl/ics/bics/2020/12111011
  derived from: http://data.ga-group.nl/ics/bics/2024/12111011
  source accessed on: 2023-07-03T18:11:29Z
  source last accessed on: 2024-06-05T14:42:36Z
  definition: This industry subgroup includes companies that wholesale and distribute food and beverages.
  notation: 12111011
  valid from: 2020-10-03
source accessed on: 2019-12-03T20:05:01Z
source last accessed on: 2024-06-05T14:42:36Z
definition: This industry subgroup includes companies that wholesale and distribute food and beverages.
notation: 12111011
valid from: 2014-08-08

Other Wholesalers - Staples
type: BicsLevel4SubIndustry
type: Classifier
type: NamedIndividual
replaces: Other Wholesalers - Staples
created with: infer-bics.sql
derived from: Livestock Wholesalers
  type: BicsLevel4SubIndustry
  type: Classifier
  type: ContemporaryDerivation
  derived from: http://data.ga-group.nl/ics/bics/2014/12111012
  source accessed on: 2019-12-03T20:05:01Z
  source last accessed on: 2019-12-03T20:05:01Z
  definition: This industry subgroup includes companies that wholesale and distribute livestock.
  notation: 12111012
  valid from: 2014-08-08
  valid till: 2020-10-03
derived from: Other Wholesalers - Staples
  type: BicsLevel3Industry
  type: Classifier
  type: AnachronousDerivation
  derived from: http://data.ga-group.nl/ics/bics/2014/121112
  source accessed on: 2019-12-03T20:05:01Z
  source last accessed on: 2019-12-03T20:05:01Z
  definition: This industry includes companies that wholesale and distribute consumer staples not elsewhere classified.
  notation: 121112
  valid from: 2014-08-08
  valid till: 2020-10-03
derived from: Other Wholesalers - Staples
  type: BicsLevel4SubIndustry
  type: Classifier
  type: ContemporaryDerivation
  derived from: http://data.ga-group.nl/ics/bics/2020/12111012
  derived from: http://data.ga-group.nl/ics/bics/2024/12111012
  source accessed on: 2023-07-03T18:11:29Z
  source last accessed on: 2024-06-05T14:42:36Z
  definition: This industry subgroup includes companies that wholesale and distribute consumer staples not elsewhere classified.
  notation: 12111012
  valid from: 2020-10-03
source accessed on: 2019-12-03T20:05:01Z
source last accessed on: 2024-06-05T14:42:36Z
definition: This industry subgroup includes companies that wholesale and distribute consumer staples not elsewhere classified.
notation: 12111012
valid from: 2014-08-08

Other Farm Raw Material Whslrs
type: BicsLevel4SubIndustry
type: Classifier
type: NamedIndividual
created with: infer-bics.sql
derived from: Other Farm Raw Material Whslrs
  type: BicsLevel4SubIndustry
  type: Classifier
  type: ContemporaryDerivation
  derived from: http://data.ga-group.nl/ics/bics/2014/12111013
  source accessed on: 2019-12-03T20:05:01Z
  source last accessed on: 2019-12-03T20:05:01Z
  definition: This industry subgroup includes companies that wholesale and distribute other forms of product raw materials not elsewhere classified. Products include animal hair, cotton, cocoa beans, furs, horses, oilseeds, sugar and wool. Includes animal hair, cocoa beans, furs, horses, oilseeds, sugar and wool.
  notation: 12111013
  valid from: 2014-08-08
  valid till: 2020-10-03
source accessed on: 2019-12-03T20:05:01Z
source last accessed on: 2019-12-03T20:05:01Z
definition: This industry subgroup includes companies that wholesale and distribute other forms of product raw materials not elsewhere classified. Products include animal hair, cotton, cocoa beans, furs, horses, oilseeds, sugar and wool. Includes animal hair, cocoa beans, furs, horses, oilseeds, sugar and wool.
notation: 12111013
valid from: 2014-08-08
valid till: 2020-10-03

Wholesale - Consumer Staples
type: BicsLevel3Industry
type: Classifier
type: NamedIndividual
is industry of: Retail & Wholesale - Staples
is replaced by: Agricultural Products Whslrs
replaces: Retail & Wholesale - Staples
created with: infer-bics.sql
derived from: Distributors - Consumer Staples
  type: BicsLevel2IndustryGroup
  type: Classifier
  type: AnachronousDerivation
  derived from: http://data.ga-group.nl/ics/bics/2014/1211
  source accessed on: 2019-12-03T20:05:01Z
  source last accessed on: 2019-12-03T20:05:01Z
  definition: This industry group includes companies that wholesale and distribute other food- and agricultural- related products.
  notation: 1211
  valid from: 2014-08-08
  valid till: 2020-10-03
derived from: Agricultural Products Whslrs
  type: BicsLevel3Industry
  type: Classifier
  type: ContemporaryDerivation
  derived from: http://data.ga-group.nl/ics/bics/2014/121110
  source accessed on: 2019-12-03T20:05:01Z
  source last accessed on: 2019-12-03T20:05:01Z
  definition: This industry includes companies that wholesale and distribute agricultural products, such as grains, beans, livestock, farm supplies and farm and garden machinery.
  notation: 121110
  valid from: 2014-08-08
  valid till: 2020-10-03
derived from: Wholesale - Consumer Staples
  type: BicsLevel3Industry
  type: Classifier
  type: ContemporaryDerivation
  derived from: http://data.ga-group.nl/ics/bics/2020/121110
  derived from: http://data.ga-group.nl/ics/bics/2024/121110
  source accessed on: 2023-07-03T18:11:29Z
  source last accessed on: 2024-06-05T14:42:36Z
  definition: This industry includes companies that wholesale and distribute consumer staple products. These companies do not produce their own products but instead distribute other companies' products in bulk to intermediaries in the supply chain or to commercial and industrial clients.
  notation: 121110
  valid from: 2020-10-03
source accessed on: 2019-12-03T20:05:01Z
source last accessed on: 2024-06-05T14:42:36Z
definition: This industry includes companies that wholesale and distribute consumer staple products. These companies do not produce their own products but instead distribute other companies' products in bulk to intermediaries in the supply chain or to commercial and industrial clients.
notation: 121110
valid from: 2014-08-08

Hypermarkets
type: BicsLevel6Segment
type: Classifier
type: NamedIndividual
is level6 segment of: Supermarkets
replaces: Hypermarkets
created with: infer-bics.sql
derived from: Hypermarkets
  type: BicsLevel5Segment
  type: Classifier
  type: AnachronousDerivation
  derived from: http://data.ga-group.nl/ics/bics/2014/1212101010
  source accessed on: 2019-12-03T20:05:01Z
  source last accessed on: 2019-12-03T20:05:01Z
  definition: This segment includes companies that operate very large food stores that also carry a wide selection of general merchandise.
  notation: 1212101010
  valid from: 2014-08-08
  valid till: 2020-10-03
derived from: Hypermarkets
  type: BicsLevel6Segment
  type: Classifier
  type: ContemporaryDerivation
  derived from: http://data.ga-group.nl/ics/bics/2020/121111101010
  source accessed on: 2023-07-03T18:11:29Z
  source last accessed on: 2023-07-03T18:11:29Z
  definition: This segment includes large stores that originally specialized in retailing fresh food products but over time diversified into general merchandise. Excludes large general merchandise stores who overtime diversified into retailing fresh food. (See Supercenters).
  notation: 121111101010
  valid from: 2020-10-03
  valid till: 2024-06-07
derived from: Hypermarkets
  type: BicsLevel6Segment
  type: Classifier
  type: ContemporaryDerivation
  derived from: http://data.ga-group.nl/ics/bics/2024/121111101010
  source accessed on: 2024-06-05T14:42:36Z
  source last accessed on: 2024-06-05T14:42:36Z
  definition: This segment includes large stores that originally specialized in retailing fresh food products but overtime diversified into general merchandise. Excludes large general merchandise stores who overtime diversified into retailing fresh food. (See Supercenters).
  notation: 121111101010
  valid from: 2024-06-07
source accessed on: 2023-07-03T18:11:29Z
source last accessed on: 2024-06-05T14:42:36Z
definition: This segment includes large stores that originally specialized in retailing fresh food products but overtime diversified into general merchandise. Excludes large general merchandise stores who overtime diversified into retailing fresh food. (See Supercenters).
notation: 121111101010
valid from: 2020-10-03

Traditional Supermarkets
type: BicsLevel6Segment
type: Classifier
type: NamedIndividual
is level6 segment of: Supermarkets
replaces: Traditional Supermarkets
created with: infer-bics.sql
derived from: Traditional Supermarkets
  type: BicsLevel5Segment
  type: Classifier
  type: AnachronousDerivation
  derived from: http://data.ga-group.nl/ics/bics/2014/1212101012
  source accessed on: 2019-12-03T20:05:01Z
  source last accessed on: 2019-12-03T20:05:01Z
  definition: This segment includes companies that operate smaller self-service food stores, which carry a wide range of packaged, fresh food and household products.
  notation: 1212101012
  valid from: 2014-08-08
  valid till: 2020-10-03
derived from: Traditional Supermarkets
  type: BicsLevel6Segment
  type: Classifier
  type: ContemporaryDerivation
  derived from: http://data.ga-group.nl/ics/bics/2020/121111101011
  derived from: http://data.ga-group.nl/ics/bics/2024/121111101011
  source accessed on: 2023-07-03T18:11:29Z
  source last accessed on: 2024-06-05T14:42:36Z
  definition: This segment includes smaller food stores that retail a wide range of packaged food, fresh food and household products.
  notation: 121111101011
  valid from: 2020-10-03
source accessed on: 2023-07-03T18:11:29Z
source last accessed on: 2024-06-05T14:42:36Z
definition: This segment includes smaller food stores that retail a wide range of packaged food, fresh food and household products.
notation: 121111101011
valid from: 2020-10-03

Supermarket - Online
type: BicsLevel6Segment
type: Classifier
type: NamedIndividual
is level6 segment of: Supermarkets
replaces: Supermarket - Online
created with: infer-bics.sql
derived from: Supermarket - Online
  type: BicsLevel5Segment
  type: Classifier
  type: AnachronousDerivation
  derived from: http://data.ga-group.nl/ics/bics/2014/1212101016
  source accessed on: 2019-12-03T20:05:01Z
  source last accessed on: 2019-12-03T20:05:01Z
  definition: This segment includes companies that operate an Internet site and distribution center as well as carry a wide range of packaged, fresh food and household products and delivery trucks.
  notation: 1212101016
  valid from: 2014-08-08
  valid till: 2020-10-03
derived from: Supermarket - Online
  type: BicsLevel6Segment
  type: Classifier
  type: ContemporaryDerivation
  derived from: http://data.ga-group.nl/ics/bics/2020/121111101012
  derived from: http://data.ga-group.nl/ics/bics/2024/121111101012
  source accessed on: 2023-07-03T18:11:29Z
  source last accessed on: 2024-06-05T14:42:36Z
  definition: This segment includes companies that retail a wide range of packaged food, fresh food, and household products on the Internet.
  notation: 121111101012
  valid from: 2020-10-03
source accessed on: 2023-07-03T18:11:29Z
source last accessed on: 2024-06-05T14:42:36Z
definition: This segment includes companies that retail a wide range of packaged food, fresh food, and household products on the Internet.
notation: 121111101012
valid from: 2020-10-03

Supermarkets
type: BicsLevel5Segment
type: Classifier
type: NamedIndividual
is level5 segment of: Food & Drug Stores
created with: infer-bics.sql
derived from: Supermarkets
  type: BicsLevel4SubIndustry
  type: Classifier
  type: AnachronousDerivation
  derived from: http://data.ga-group.nl/ics/bics/2014/12121010
  source accessed on: 2019-12-03T20:05:01Z
  source last accessed on: 2019-12-03T20:05:01Z
  definition: This industry subgroup includes companies that operate self-service food stores, which carry a wide range of packaged, fresh food and household products.
  notation: 12121010
  valid from: 2014-08-08
  valid till: 2020-10-03
derived from: Supermarkets
  type: BicsLevel5Segment
  type: Classifier
  type: ContemporaryDerivation
  derived from: http://data.ga-group.nl/ics/bics/2020/1211111010
  derived from: http://data.ga-group.nl/ics/bics/2024/1211111010
  source accessed on: 2023-07-03T18:11:29Z
  source last accessed on: 2024-06-05T14:42:36Z
  definition: This segment includes stores that retail a wide range of packaged food, fresh food, and household products.
  notation: 1211111010
  valid from: 2020-10-03
source accessed on: 2023-07-03T18:11:29Z
source last accessed on: 2024-06-05T14:42:36Z
definition: This segment includes stores that retail a wide range of packaged food, fresh food, and household products.
notation: 1211111010
valid from: 2020-10-03

Retail Bakeries
type: BicsLevel6Segment
type: Classifier
type: NamedIndividual
is level6 segment of: Specialty Food & Staples Stores
replaces: Retail Bakeries
created with: infer-bics.sql
derived from: Retail Bakeries
  type: BicsLevel5Segment
  type: Classifier
  type: AnachronousDerivation
  derived from: http://data.ga-group.nl/ics/bics/2014/1212101110
  source accessed on: 2019-12-03T20:05:01Z
  source last accessed on: 2019-12-03T20:05:01Z
  definition: This segment includes companies that retail baked goods, such as bread, biscuits, croutons, doughnuts, pies and pastries.
  notation: 1212101110
  valid from: 2014-08-08
  valid till: 2020-10-03
derived from: Retail Bakeries
  type: BicsLevel6Segment
  type: Classifier
  type: ContemporaryDerivation
  derived from: http://data.ga-group.nl/ics/bics/2020/121111101110
  derived from: http://data.ga-group.nl/ics/bics/2024/121111101110
  source accessed on: 2023-07-03T18:11:29Z
  source last accessed on: 2024-06-05T14:42:36Z
  definition: This segment includes stores that specialize in retailing baked goods.
  notation: 121111101110
  valid from: 2020-10-03
source accessed on: 2023-07-03T18:11:29Z
source last accessed on: 2024-06-05T14:42:36Z
definition: This segment includes stores that specialize in retailing baked goods.
notation: 121111101110
valid from: 2020-10-03

Beer, Wine & Liquor Stores
type: BicsLevel6Segment
type: Classifier
type: NamedIndividual
is level6 segment of: Specialty Food & Staples Stores
replaces: Beer, Wine & Liquor Stores
created with: infer-bics.sql
derived from: Beer, Wine & Liquor Stores
  type: BicsLevel5Segment
  type: Classifier
  type: AnachronousDerivation
  derived from: http://data.ga-group.nl/ics/bics/2014/1212101111
  source accessed on: 2019-12-03T20:05:01Z
  source last accessed on: 2019-12-03T20:05:01Z
  definition: This segment includes companies that retail packaged alcoholic beverages.
  notation: 1212101111
  valid from: 2014-08-08
  valid till: 2020-10-03
derived from: Beer, Wine & Liquor Stores
  type: BicsLevel6Segment
  type: Classifier
  type: ContemporaryDerivation
  derived from: http://data.ga-group.nl/ics/bics/2020/121111101111
  derived from: http://data.ga-group.nl/ics/bics/2024/121111101111
  source accessed on: 2023-07-03T18:11:29Z
  source last accessed on: 2024-06-05T14:42:36Z
  definition: This segment includes stores that specialize in retailing packaged alcoholic beverages.
  notation: 121111101111
  valid from: 2020-10-03
source accessed on: 2023-07-03T18:11:29Z
source last accessed on: 2024-06-05T14:42:36Z
definition: This segment includes stores that specialize in retailing packaged alcoholic beverages.
notation: 121111101111
valid from: 2020-10-03

Health & Natural Food Stores
type: BicsLevel6Segment
type: Classifier
type: NamedIndividual
is level6 segment of: Specialty Food & Staples Stores
replaces: Health & Natural Food Stores
created with: infer-bics.sql
derived from: Health & Natural Food Stores
  type: BicsLevel5Segment
  type: Classifier
  type: AnachronousDerivation
  derived from: http://data.ga-group.nl/ics/bics/2014/1212101112
  source accessed on: 2019-12-03T20:05:01Z
  source last accessed on: 2019-12-03T20:05:01Z
  definition: This segment includes companies that retail foods considered to be healthy and/or derived from natural ingredients.
  notation: 1212101112
  valid from: 2014-08-08
  valid till: 2020-10-03
derived from: Health & Natural Food Stores
  type: BicsLevel6Segment
  type: Classifier
  type: ContemporaryDerivation
  derived from: http://data.ga-group.nl/ics/bics/2020/121111101112
  derived from: http://data.ga-group.nl/ics/bics/2024/121111101112
  source accessed on: 2023-07-03T18:11:29Z
  source last accessed on: 2024-06-05T14:42:36Z
  definition: This segment includes stores that specialize in retailing food products considered to be healthy and/or derived from natural ingredients.
  notation: 121111101112
  valid from: 2020-10-03
source accessed on: 2023-07-03T18:11:29Z
source last accessed on: 2024-06-05T14:42:36Z
definition: This segment includes stores that specialize in retailing food products considered to be healthy and/or derived from natural ingredients.
notation: 121111101112
valid from: 2020-10-03

Specialty Food & Staples Stores
type: BicsLevel5Segment
type: Classifier
type: NamedIndividual
is level5 segment of: Food & Drug Stores
created with: infer-bics.sql
derived from: Specialty Food & Staples Stores
  type: BicsLevel4SubIndustry
  type: Classifier
  type: AnachronousDerivation
  derived from: http://data.ga-group.nl/ics/bics/2014/12121011
  source accessed on: 2019-12-03T20:05:01Z
  source last accessed on: 2019-12-03T20:05:01Z
  definition: This industry subgroup includes companies that retail primarily one type of food or beverage product.
  notation: 12121011
  valid from: 2014-08-08
  valid till: 2020-10-03
derived from: Specialty Food & Staples Stores
  type: BicsLevel5Segment
  type: Classifier
  type: ContemporaryDerivation
  derived from: http://data.ga-group.nl/ics/bics/2020/1211111011
  derived from: http://data.ga-group.nl/ics/bics/2024/1211111011
  source accessed on: 2023-07-03T18:11:29Z
  source last accessed on: 2024-06-05T14:42:36Z
  definition: This segment includes stores that specialize in retailing a specific type of food or beverage product.
  notation: 1211111011
  valid from: 2020-10-03
source accessed on: 2023-07-03T18:11:29Z
source last accessed on: 2024-06-05T14:42:36Z
definition: This segment includes stores that specialize in retailing a specific type of food or beverage product.
notation: 1211111011
valid from: 2020-10-03

Convenience Stores
type: BicsLevel5Segment
type: Classifier
type: NamedIndividual
is level5 segment of: Food & Drug Stores
created with: infer-bics.sql
derived from: Convenience Stores
  type: BicsLevel4SubIndustry
  type: Classifier
  type: AnachronousDerivation
  derived from: http://data.ga-group.nl/ics/bics/2014/12121012
  source accessed on: 2019-12-03T20:05:01Z
  source last accessed on: 2019-12-03T20:05:01Z
  definition: This industry includes companies that retail a limited selection of groceries, beverages and tobacco. This segment includes company-owned and franchise revenue.
  notation: 12121012
  valid from: 2014-08-08
  valid till: 2020-10-03
derived from: Convenience Stores
  type: BicsLevel5Segment
  type: Classifier
  type: ContemporaryDerivation
  derived from: http://data.ga-group.nl/ics/bics/2020/1211111012
  derived from: http://data.ga-group.nl/ics/bics/2024/1211111012
  source accessed on: 2023-07-03T18:11:29Z
  source last accessed on: 2024-06-05T14:42:36Z
  definition: This segment includes stores that specialize in retailing a limited selection of everyday consumer staple products.
  notation: 1211111012
  valid from: 2020-10-03
source accessed on: 2023-07-03T18:11:29Z
source last accessed on: 2024-06-05T14:42:36Z
definition: This segment includes stores that specialize in retailing a limited selection of everyday consumer staple products.
notation: 1211111012
valid from: 2020-10-03

Pharmacies
type: BicsLevel6Segment
type: Classifier
type: NamedIndividual
is level6 segment of: Pharmacies & Drug Stores
replaces: Pharmacy Drugstores
created with: infer-bics.sql
derived from: Pharmacy Drugstores
  type: BicsLevel5Segment
  type: Classifier
  type: AnachronousDerivation
  derived from: http://data.ga-group.nl/ics/bics/2014/1212101310
  source accessed on: 2019-12-03T20:05:01Z
  source last accessed on: 2019-12-03T20:05:01Z
  definition: This segment includes companies that operate bricks-and-mortar and online stores and whose pharmacy revenue accounts for the majority of sales.
  notation: 1212101310
  valid from: 2014-08-08
  valid till: 2020-10-03
derived from: Pharmacies
  type: BicsLevel6Segment
  type: Classifier
  type: ContemporaryDerivation
  derived from: http://data.ga-group.nl/ics/bics/2020/121111101310
  derived from: http://data.ga-group.nl/ics/bics/2024/121111101310
  source accessed on: 2023-07-03T18:11:29Z
  source last accessed on: 2024-06-05T14:42:36Z
  definition: This segment includes companies that operate stores where pharmacy revenue accounts for the majority of sales.
  notation: 121111101310
  valid from: 2020-10-03
source accessed on: 2023-07-03T18:11:29Z
source last accessed on: 2024-06-05T14:42:36Z
definition: This segment includes companies that operate stores where pharmacy revenue accounts for the majority of sales.
notation: 121111101310
valid from: 2020-10-03

Drug Stores
type: BicsLevel6Segment
type: Classifier
type: NamedIndividual
is level6 segment of: Pharmacies & Drug Stores
replaces: Toiletry Drugstores
created with: infer-bics.sql
derived from: Toiletry Drugstores
  type: BicsLevel5Segment
  type: Classifier
  type: AnachronousDerivation
  derived from: http://data.ga-group.nl/ics/bics/2014/1212101311
  source accessed on: 2019-12-03T20:05:01Z
  source last accessed on: 2019-12-03T20:05:01Z
  definition: This segment includes stores that sell toiletries and health care products, and often include a pharmacy but where pharmacy revenue is a small proportion of total sales.
  notation: 1212101311
  valid from: 2014-08-08
  valid till: 2020-10-03
derived from: Drug Stores
  type: BicsLevel6Segment
  type: Classifier
  type: ContemporaryDerivation
  derived from: http://data.ga-group.nl/ics/bics/2020/121111101311
  derived from: http://data.ga-group.nl/ics/bics/2024/121111101311
  source accessed on: 2023-07-03T18:11:29Z
  source last accessed on: 2024-06-05T14:42:36Z
  definition: This segment includes stores that specialize in retailing toiletries, health care products, and prescriptions, but where pharmacy revenue is a small portion of total sales.
  notation: 121111101311
  valid from: 2020-10-03
source accessed on: 2023-07-03T18:11:29Z
source last accessed on: 2024-06-05T14:42:36Z
definition: This segment includes stores that specialize in retailing toiletries, health care products, and prescriptions, but where pharmacy revenue is a small portion of total sales.
notation: 121111101311
valid from: 2020-10-03

Pharmacies & Drug - Online
type: BicsLevel6Segment
type: Classifier
type: NamedIndividual
is level6 segment of: Pharmacies & Drug Stores
replaces: Pharmacies & Drug - Online
created with: infer-bics.sql
derived from: Pharmacies & Drug - Online
  type: BicsLevel5Segment
  type: Classifier
  type: AnachronousDerivation
  derived from: http://data.ga-group.nl/ics/bics/2014/1212101312
  source accessed on: 2019-12-03T20:05:01Z
  source last accessed on: 2019-12-03T20:05:01Z
  definition: This segment includes pure-play Internet companies that retail prescription or non-prescription drugs and medicines on the Internet.
  notation: 1212101312
  valid from: 2014-08-08
  valid till: 2020-10-03
derived from: Pharmacies & Drug - Online
  type: BicsLevel6Segment
  type: Classifier
  type: ContemporaryDerivation
  derived from: http://data.ga-group.nl/ics/bics/2020/121111101312
  derived from: http://data.ga-group.nl/ics/bics/2024/121111101312
  source accessed on: 2023-07-03T18:11:29Z
  source last accessed on: 2024-06-05T14:42:36Z
  definition: This segment includes companies that specialize in retailing prescription drugs and medications on the Internet.
  notation: 121111101312
  valid from: 2020-10-03
source accessed on: 2023-07-03T18:11:29Z
source last accessed on: 2024-06-05T14:42:36Z
definition: This segment includes companies that specialize in retailing prescription drugs and medications on the Internet.
notation: 121111101312
valid from: 2020-10-03

Pharmacies & Drug Stores
type: BicsLevel5Segment
type: Classifier
type: NamedIndividual
is level5 segment of: Food & Drug Stores
created with: infer-bics.sql
derived from: Pharmacies & Drug Stores
  type: BicsLevel4SubIndustry
  type: Classifier
  type: AnachronousDerivation
  derived from: http://data.ga-group.nl/ics/bics/2014/12121013
  source accessed on: 2019-12-03T20:05:01Z
  source last accessed on: 2019-12-03T20:05:01Z
  definition: This industry subgroup includes companies that retail prescription drugs and medications through brick-and-mortar and online stores.
  notation: 12121013
  valid from: 2014-08-08
  valid till: 2020-10-03
derived from: Pharmacies & Drug Stores
  type: BicsLevel5Segment
  type: Classifier
  type: ContemporaryDerivation
  derived from: http://data.ga-group.nl/ics/bics/2020/1211111013
  derived from: http://data.ga-group.nl/ics/bics/2024/1211111013
  source accessed on: 2023-07-03T18:11:29Z
  source last accessed on: 2024-06-05T14:42:36Z
  definition: This segment includes stores that specialize in retailing prescription drugs and medications.
  notation: 1211111013
  valid from: 2020-10-03
source accessed on: 2023-07-03T18:11:29Z
source last accessed on: 2024-06-05T14:42:36Z
definition: This segment includes stores that specialize in retailing prescription drugs and medications.
notation: 1211111013
valid from: 2020-10-03

Food & Drug Stores
type: BicsLevel4SubIndustry
type: Classifier
type: NamedIndividual
replaces: Food & Drug Stores
created with: infer-bics.sql
derived from: Beer & Ale Wholesalers
  type: BicsLevel4SubIndustry
  type: Classifier
  type: ContemporaryDerivation
  derived from: http://data.ga-group.nl/ics/bics/2014/12111110
  source accessed on: 2019-12-03T20:05:01Z
  source last accessed on: 2019-12-03T20:05:01Z
  definition: This industry subgroup includes companies that wholesale and distribute beer and malt beverages.
  notation: 12111110
  valid from: 2014-08-08
  valid till: 2020-10-03
derived from: Food & Drug Stores
  type: BicsLevel3Industry
  type: Classifier
  type: AnachronousDerivation
  derived from: http://data.ga-group.nl/ics/bics/2014/121210
  source accessed on: 2019-12-03T20:05:01Z
  source last accessed on: 2019-12-03T20:05:01Z
  definition: The industry includes specialty food businesses and mixed retail businesses in which food or pharmaceuticals is the predominant category.
  notation: 121210
  valid from: 2014-08-08
  valid till: 2020-10-03
derived from: Food & Drug Stores
  type: BicsLevel4SubIndustry
  type: Classifier
  type: ContemporaryDerivation
  derived from: http://data.ga-group.nl/ics/bics/2020/12111110
  derived from: http://data.ga-group.nl/ics/bics/2024/12111110
  source accessed on: 2023-07-03T18:11:29Z
  source last accessed on: 2024-06-05T14:42:36Z
  definition: This industry subgroup includes stores that specialize in retailing food, beverages, or pharmaceuticals.
  notation: 12111110
  valid from: 2020-10-03
source accessed on: 2019-12-03T20:05:01Z
source last accessed on: 2024-06-05T14:42:36Z
definition: This industry subgroup includes stores that specialize in retailing food, beverages, or pharmaceuticals.
notation: 12111110
valid from: 2014-08-08

Supercenters
type: BicsLevel5Segment
type: Classifier
type: NamedIndividual
is level5 segment of: Mass Merchants
created with: infer-bics.sql
derived from: SuperCenters
  type: BicsLevel4SubIndustry
  type: Classifier
  type: AnachronousDerivation
  derived from: http://data.ga-group.nl/ics/bics/2014/12121110
  source accessed on: 2019-12-03T20:05:01Z
  source last accessed on: 2019-12-03T20:05:01Z
  definition: This industry subgroup includes companies that operate very large self-service stores that also carry a wide selection of general merchandise and food.
  notation: 12121110
  valid from: 2014-08-08
  valid till: 2020-10-03
derived from: Supercenters
  type: BicsLevel5Segment
  type: Classifier
  type: ContemporaryDerivation
  derived from: http://data.ga-group.nl/ics/bics/2020/1211111110
  derived from: http://data.ga-group.nl/ics/bics/2024/1211111110
  source accessed on: 2023-07-03T18:11:29Z
  source last accessed on: 2024-06-05T14:42:36Z
  definition: This segment includes big-box stores that carry a wide selection of general merchandise and food.
  notation: 1211111110
  valid from: 2020-10-03
source accessed on: 2023-07-03T18:11:29Z
source last accessed on: 2024-06-05T14:42:36Z
definition: This segment includes big-box stores that carry a wide selection of general merchandise and food.
notation: 1211111110
valid from: 2020-10-03

Warehouse Clubs
type: BicsLevel5Segment
type: Classifier
type: NamedIndividual
is level5 segment of: Mass Merchants
created with: infer-bics.sql
derived from: Warehouse Clubs
  type: BicsLevel4SubIndustry
  type: Classifier
  type: AnachronousDerivation
  derived from: http://data.ga-group.nl/ics/bics/2014/12121111
  source accessed on: 2019-12-03T20:05:01Z
  source last accessed on: 2019-12-03T20:05:01Z
  definition: This industry subgroup includes companies that usually sell a wide variety of merchandise, in which customers pay annual membership fees in order to shop. In addition, customers are required to buy large, wholesale quantities of the store's products. This can include Internet sales of brick-and-mortar stores.
  notation: 12121111
  valid from: 2014-08-08
  valid till: 2020-10-03
derived from: Warehouse Clubs
  type: BicsLevel5Segment
  type: Classifier
  type: ContemporaryDerivation
  derived from: http://data.ga-group.nl/ics/bics/2020/1211111111
  derived from: http://data.ga-group.nl/ics/bics/2024/1211111111
  source accessed on: 2023-07-03T18:11:29Z
  source last accessed on: 2024-06-05T14:42:36Z
  definition: This segment includes stores that offer a wide variety of merchandise, usually in wholesale quantities, and require an annual membership in order to shop.
  notation: 1211111111
  valid from: 2020-10-03
source accessed on: 2023-07-03T18:11:29Z
source last accessed on: 2024-06-05T14:42:36Z
definition: This segment includes stores that offer a wide variety of merchandise, usually in wholesale quantities, and require an annual membership in order to shop.
notation: 1211111111
valid from: 2020-10-03

Discount Stores
type: BicsLevel5Segment
type: Classifier
type: NamedIndividual
is level5 segment of: Mass Merchants
created with: infer-bics.sql
derived from: Discount Stores
  type: BicsLevel4SubIndustry
  type: Classifier
  type: AnachronousDerivation
  derived from: http://data.ga-group.nl/ics/bics/2014/12121112
  source accessed on: 2019-12-03T20:05:01Z
  source last accessed on: 2019-12-03T20:05:01Z
  definition: This industry subgroup includes companies that sell a wide range of general merchandise at prices lower than those asked by traditional retail outlets.
  notation: 12121112
  valid from: 2014-08-08
  valid till: 2020-10-03
derived from: Discount Stores
  type: BicsLevel5Segment
  type: Classifier
  type: ContemporaryDerivation
  derived from: http://data.ga-group.nl/ics/bics/2020/1211111112
  derived from: http://data.ga-group.nl/ics/bics/2024/1211111112
  source accessed on: 2023-07-03T18:11:29Z
  source last accessed on: 2024-06-05T14:42:36Z
  definition: This segment includes stores that offer a wide range of general merchandise at discounted prices.
  notation: 1211111112
  valid from: 2020-10-03
source accessed on: 2023-07-03T18:11:29Z
source last accessed on: 2024-06-05T14:42:36Z
definition: This segment includes stores that offer a wide range of general merchandise at discounted prices.
notation: 1211111112
valid from: 2020-10-03

Dollar Stores
type: BicsLevel5Segment
type: Classifier
type: NamedIndividual
is level5 segment of: Mass Merchants
created with: infer-bics.sql
derived from: Dollar Stores
  type: BicsLevel4SubIndustry
  type: Classifier
  type: AnachronousDerivation
  derived from: http://data.ga-group.nl/ics/bics/2014/12121113
  source accessed on: 2019-12-03T20:05:01Z
  source last accessed on: 2019-12-03T20:05:01Z
  definition: This segment includes companies that sell a wide range of general merchandise and food, usually at lower prices than conventional stores.
  notation: 12121113
  valid from: 2014-08-08
  valid till: 2020-10-03
derived from: Dollar Stores
  type: BicsLevel5Segment
  type: Classifier
  type: ContemporaryDerivation
  derived from: http://data.ga-group.nl/ics/bics/2020/1211111113
  derived from: http://data.ga-group.nl/ics/bics/2024/1211111113
  source accessed on: 2023-07-03T18:11:29Z
  source last accessed on: 2024-06-05T14:42:36Z
  definition: This segment includes stores that offer a wide range of general merchandise at a single targeted price-point.
  notation: 1211111113
  valid from: 2020-10-03
source accessed on: 2023-07-03T18:11:29Z
source last accessed on: 2024-06-05T14:42:36Z
definition: This segment includes stores that offer a wide range of general merchandise at a single targeted price-point.
notation: 1211111113
valid from: 2020-10-03

Mass Merchants
type: BicsLevel4SubIndustry
type: Classifier
type: NamedIndividual
replaces: Mass Merchants
created with: infer-bics.sql
derived from: Confectionery Wholesalers
  type: BicsLevel4SubIndustry
  type: Classifier
  type: ContemporaryDerivation
  derived from: http://data.ga-group.nl/ics/bics/2014/12111111
  source accessed on: 2019-12-03T20:05:01Z
  source last accessed on: 2019-12-03T20:05:01Z
  definition: This industry subgroup includes companies that wholesale and distribute confectionaries, nuts, chips and fountain syrups.
  notation: 12111111
  valid from: 2014-08-08
  valid till: 2020-10-03
derived from: Mass Merchants
  type: BicsLevel3Industry
  type: Classifier
  type: AnachronousDerivation
  derived from: http://data.ga-group.nl/ics/bics/2014/121211
  source accessed on: 2019-12-03T20:05:01Z
  source last accessed on: 2019-12-03T20:05:01Z
  definition: This industry includes retail stores that carry a broad range of merchandise but where food is the largest single category.
  notation: 121211
  valid from: 2014-08-08
  valid till: 2020-10-03
derived from: Mass Merchants
  type: BicsLevel4SubIndustry
  type: Classifier
  type: ContemporaryDerivation
  derived from: http://data.ga-group.nl/ics/bics/2020/12111111
  derived from: http://data.ga-group.nl/ics/bics/2024/12111111
  source accessed on: 2023-07-03T18:11:29Z
  source last accessed on: 2024-06-05T14:42:36Z
  definition: This industry subgroup includes retail stores that carry a broad range of merchandise.
  notation: 12111111
  valid from: 2020-10-03
source accessed on: 2019-12-03T20:05:01Z
source last accessed on: 2024-06-05T14:42:36Z
definition: This industry subgroup includes retail stores that carry a broad range of merchandise.
notation: 12111111
valid from: 2014-08-08

Dairy Prods Whslrs (ex Dry/Can)
type: BicsLevel4SubIndustry
type: Classifier
type: NamedIndividual
created with: infer-bics.sql
derived from: Dairy Prods Whslrs (ex Dry/Can)
  type: BicsLevel4SubIndustry
  type: Classifier
  type: ContemporaryDerivation
  derived from: http://data.ga-group.nl/ics/bics/2014/12111112
  source accessed on: 2019-12-03T20:05:01Z
  source last accessed on: 2019-12-03T20:05:01Z
  definition: This industry subgroup includes companies that wholesale and distribute dairy products, except for dried or canned dairy products.
  notation: 12111112
  valid from: 2014-08-08
  valid till: 2020-10-03
source accessed on: 2019-12-03T20:05:01Z
source last accessed on: 2019-12-03T20:05:01Z
definition: This industry subgroup includes companies that wholesale and distribute dairy products, except for dried or canned dairy products.
notation: 12111112
valid from: 2014-08-08
valid till: 2020-10-03

Fish & Seafood Wholesalers
type: BicsLevel4SubIndustry
type: Classifier
type: NamedIndividual
created with: infer-bics.sql
derived from: Fish & Seafood Wholesalers
  type: BicsLevel4SubIndustry
  type: Classifier
  type: ContemporaryDerivation
  derived from: http://data.ga-group.nl/ics/bics/2014/12111113
  source accessed on: 2019-12-03T20:05:01Z
  source last accessed on: 2019-12-03T20:05:01Z
  definition: This industry subgroup includes companies that wholesale and distribute fish and other seafood.
  notation: 12111113
  valid from: 2014-08-08
  valid till: 2020-10-03
source accessed on: 2019-12-03T20:05:01Z
source last accessed on: 2019-12-03T20:05:01Z
definition: This industry subgroup includes companies that wholesale and distribute fish and other seafood.
notation: 12111113
valid from: 2014-08-08
valid till: 2020-10-03

Fresh Fruit & Vegetable Whslrs
type: BicsLevel4SubIndustry
type: Classifier
type: NamedIndividual
created with: infer-bics.sql
derived from: Fresh Fruit & Vegetable Whslrs
  type: BicsLevel4SubIndustry
  type: Classifier
  type: ContemporaryDerivation
  derived from: http://data.ga-group.nl/ics/bics/2014/12111114
  source accessed on: 2019-12-03T20:05:01Z
  source last accessed on: 2019-12-03T20:05:01Z
  definition: This industry subgroup includes companies that wholesale fresh fruit and vegetables to retailers.
  notation: 12111114
  valid from: 2014-08-08
  valid till: 2020-10-03
source accessed on: 2019-12-03T20:05:01Z
source last accessed on: 2019-12-03T20:05:01Z
definition: This industry subgroup includes companies that wholesale fresh fruit and vegetables to retailers.
notation: 12111114
valid from: 2014-08-08
valid till: 2020-10-03

General-Line Grocery Whslrs
type: BicsLevel4SubIndustry
type: Classifier
type: NamedIndividual
created with: infer-bics.sql
derived from: General-Line Grocery Whslrs
  type: BicsLevel4SubIndustry
  type: Classifier
  type: ContemporaryDerivation
  derived from: http://data.ga-group.nl/ics/bics/2014/12111115
  source accessed on: 2019-12-03T20:05:01Z
  source last accessed on: 2019-12-03T20:05:01Z
  definition: This industry subgroup includes companies that wholesale and distribute general groceries.
  notation: 12111115
  valid from: 2014-08-08
  valid till: 2020-10-03
source accessed on: 2019-12-03T20:05:01Z
source last accessed on: 2019-12-03T20:05:01Z
definition: This industry subgroup includes companies that wholesale and distribute general groceries.
notation: 12111115
valid from: 2014-08-08
valid till: 2020-10-03

Meat Products Wholesalers
type: BicsLevel4SubIndustry
type: Classifier
type: NamedIndividual
created with: infer-bics.sql
derived from: Meat Products Wholesalers
  type: BicsLevel4SubIndustry
  type: Classifier
  type: ContemporaryDerivation
  derived from: http://data.ga-group.nl/ics/bics/2014/12111116
  source accessed on: 2019-12-03T20:05:01Z
  source last accessed on: 2019-12-03T20:05:01Z
  definition: This industry subgroup includes companies that wholesale and distribute fresh meat and other meat products.
  notation: 12111116
  valid from: 2014-08-08
  valid till: 2020-10-03
source accessed on: 2019-12-03T20:05:01Z
source last accessed on: 2019-12-03T20:05:01Z
definition: This industry subgroup includes companies that wholesale and distribute fresh meat and other meat products.
notation: 12111116
valid from: 2014-08-08
valid till: 2020-10-03

Packaged Frozen Food Whslrs
type: BicsLevel4SubIndustry
type: Classifier
type: NamedIndividual
created with: infer-bics.sql
derived from: Packaged Frozen Food Whslrs
  type: BicsLevel4SubIndustry
  type: Classifier
  type: ContemporaryDerivation
  derived from: http://data.ga-group.nl/ics/bics/2014/12111117
  source accessed on: 2019-12-03T20:05:01Z
  source last accessed on: 2019-12-03T20:05:01Z
  definition: This industry subgroup includes companies that wholesale and distribute packaged frozen foods.
  notation: 12111117
  valid from: 2014-08-08
  valid till: 2020-10-03
source accessed on: 2019-12-03T20:05:01Z
source last accessed on: 2019-12-03T20:05:01Z
definition: This industry subgroup includes companies that wholesale and distribute packaged frozen foods.
notation: 12111117
valid from: 2014-08-08
valid till: 2020-10-03

Poultry Products Wholesalers
type: BicsLevel4SubIndustry
type: Classifier
type: NamedIndividual
created with: infer-bics.sql
derived from: Poultry Products Wholesalers
  type: BicsLevel4SubIndustry
  type: Classifier
  type: ContemporaryDerivation
  derived from: http://data.ga-group.nl/ics/bics/2014/12111118
  source accessed on: 2019-12-03T20:05:01Z
  source last accessed on: 2019-12-03T20:05:01Z
  definition: This industry subgroup includes companies that wholesale and distribute fresh poultry and poultry-based products.
  notation: 12111118
  valid from: 2014-08-08
  valid till: 2020-10-03
source accessed on: 2019-12-03T20:05:01Z
source last accessed on: 2019-12-03T20:05:01Z
definition: This industry subgroup includes companies that wholesale and distribute fresh poultry and poultry-based products.
notation: 12111118
valid from: 2014-08-08
valid till: 2020-10-03

Tobacco Products Wholesalers
type: BicsLevel4SubIndustry
type: Classifier
type: NamedIndividual
created with: infer-bics.sql
derived from: Tobacco Products Wholesalers
  type: BicsLevel4SubIndustry
  type: Classifier
  type: ContemporaryDerivation
  derived from: http://data.ga-group.nl/ics/bics/2014/12111119
  source accessed on: 2019-12-03T20:05:01Z
  source last accessed on: 2019-12-03T20:05:01Z
  definition: This industry subgroup includes companies that wholesale and distribute tobacco and other tobacco-based products.
  notation: 12111119
  valid from: 2014-08-08
  valid till: 2020-10-03
source accessed on: 2019-12-03T20:05:01Z
source last accessed on: 2019-12-03T20:05:01Z
definition: This industry subgroup includes companies that wholesale and distribute tobacco and other tobacco-based products.
notation: 12111119
valid from: 2014-08-08
valid till: 2020-10-03

Wine & Distilled Alcohol Whslrs
type: BicsLevel4SubIndustry
type: Classifier
type: NamedIndividual
created with: infer-bics.sql
derived from: Wine & Distilled Alcohol Whslrs
  type: BicsLevel4SubIndustry
  type: Classifier
  type: ContemporaryDerivation
  derived from: http://data.ga-group.nl/ics/bics/2014/12111120
  source accessed on: 2019-12-03T20:05:01Z
  source last accessed on: 2019-12-03T20:05:01Z
  definition: This industry subgroup includes companies that wholesale and distribute wine and distilled alcoholic beverages.
  notation: 12111120
  valid from: 2014-08-08
  valid till: 2020-10-03
source accessed on: 2019-12-03T20:05:01Z
source last accessed on: 2019-12-03T20:05:01Z
definition: This industry subgroup includes companies that wholesale and distribute wine and distilled alcoholic beverages.
notation: 12111120
valid from: 2014-08-08
valid till: 2020-10-03

Other Grocery Products Whslrs
type: BicsLevel4SubIndustry
type: Classifier
type: NamedIndividual
created with: infer-bics.sql
derived from: Other Grocery Products Whslrs
  type: BicsLevel4SubIndustry
  type: Classifier
  type: ContemporaryDerivation
  derived from: http://data.ga-group.nl/ics/bics/2014/12111121
  source accessed on: 2019-12-03T20:05:01Z
  source last accessed on: 2019-12-03T20:05:01Z
  definition: This industry subgroup includes companies that wholesale and distribute grocery products not elsewhere classified.
  notation: 12111121
  valid from: 2014-08-08
  valid till: 2020-10-03
source accessed on: 2019-12-03T20:05:01Z
source last accessed on: 2019-12-03T20:05:01Z
definition: This industry subgroup includes companies that wholesale and distribute grocery products not elsewhere classified.
notation: 12111121
valid from: 2014-08-08
valid till: 2020-10-03

Retail - Consumer Staples
type: BicsLevel3Industry
type: Classifier
type: NamedIndividual
is industry of: Retail & Wholesale - Staples
is replaced by: Food & Beverage Wholesalers
replaces: Retail - Consumer Staples
created with: infer-bics.sql
derived from: Food Products Wholesalers
  type: BicsLevel3Industry
  type: Classifier
  type: ContemporaryDerivation
  derived from: http://data.ga-group.nl/ics/bics/2014/121111
  source accessed on: 2019-12-03T20:05:01Z
  source last accessed on: 2019-12-03T20:05:01Z
  definition: This industry includes companies that wholesale, procure and deliver food products, such as fresh produce, dairy, meat and seafood. The may also wholesale general merchandise, health/beauty care products and tobacco products as well as assist with assortment planning and retail pricing support.
  notation: 121111
  valid from: 2014-08-08
  valid till: 2020-10-03
derived from: Retail - Consumer Staples
  type: BicsLevel2IndustryGroup
  type: Classifier
  type: AnachronousDerivation
  derived from: http://data.ga-group.nl/ics/bics/2014/1212
  source accessed on: 2019-12-03T20:05:01Z
  source last accessed on: 2019-12-03T20:05:01Z
  definition: This industry group includes companies that retail consumer necessities products through storefront operations.
  notation: 1212
  valid from: 2014-08-08
  valid till: 2020-10-03
derived from: Retail - Consumer Staples
  type: BicsLevel3Industry
  type: Classifier
  type: ContemporaryDerivation
  derived from: http://data.ga-group.nl/ics/bics/2020/121111
  derived from: http://data.ga-group.nl/ics/bics/2024/121111
  source accessed on: 2023-07-03T18:11:29Z
  source last accessed on: 2024-06-05T14:42:36Z
  definition: This industry includes companies that retail consumer staple products through storefront operations.
  notation: 121111
  valid from: 2020-10-03
source accessed on: 2019-12-03T20:05:01Z
source last accessed on: 2024-06-05T14:42:36Z
definition: This industry includes companies that retail consumer staple products through storefront operations.
notation: 121111
valid from: 2014-08-08

Other Wholesalers - Staples
type: BicsLevel3Industry
type: Classifier
type: NamedIndividual
is industry of: Retail & Wholesale - Staples
is replaced by: Other Wholesalers - Staples
created with: infer-bics.sql
derived from: Other Wholesalers - Staples
  type: BicsLevel3Industry
  type: Classifier
  type: ContemporaryDerivation
  derived from: http://data.ga-group.nl/ics/bics/2014/121112
  source accessed on: 2019-12-03T20:05:01Z
  source last accessed on: 2019-12-03T20:05:01Z
  definition: This industry includes companies that wholesale and distribute consumer staples not elsewhere classified.
  notation: 121112
  valid from: 2014-08-08
  valid till: 2020-10-03
source accessed on: 2019-12-03T20:05:01Z
source last accessed on: 2019-12-03T20:05:01Z
definition: This industry includes companies that wholesale and distribute consumer staples not elsewhere classified.
notation: 121112
valid from: 2014-08-08
valid till: 2020-10-03

Retail & Wholesale - Staples
type: BicsLevel2IndustryGroup
type: Classifier
type: NamedIndividual
is industry group of: Consumer Staples
is replaced by: Wholesale - Consumer Staples
created with: infer-bics.sql
derived from: Distributors - Consumer Staples
  type: BicsLevel2IndustryGroup
  type: Classifier
  type: ContemporaryDerivation
  derived from: http://data.ga-group.nl/ics/bics/2014/1211
  source accessed on: 2019-12-03T20:05:01Z
  source last accessed on: 2019-12-03T20:05:01Z
  definition: This industry group includes companies that wholesale and distribute other food- and agricultural- related products.
  notation: 1211
  valid from: 2014-08-08
  valid till: 2020-10-03
derived from: Retail & Wholesale - Staples
  type: BicsLevel2IndustryGroup
  type: Classifier
  type: ContemporaryDerivation
  derived from: http://data.ga-group.nl/ics/bics/2020/1211
  derived from: http://data.ga-group.nl/ics/bics/2024/1211
  source accessed on: 2023-07-03T18:11:29Z
  source last accessed on: 2024-06-05T14:42:36Z
  definition: This industry group includes companies that provide distribution channels for consumer staple products.
  notation: 1211
  valid from: 2020-10-03
source accessed on: 2019-12-03T20:05:01Z
source last accessed on: 2024-06-05T14:42:36Z
definition: This industry group includes companies that provide distribution channels for consumer staple products.
notation: 1211
valid from: 2014-08-08

Hypermarkets
type: BicsLevel5Segment
type: Classifier
type: NamedIndividual
is level5 segment of: Supermarkets
is replaced by: Hypermarkets
created with: infer-bics.sql
derived from: Hypermarkets
  type: BicsLevel5Segment
  type: Classifier
  type: ContemporaryDerivation
  derived from: http://data.ga-group.nl/ics/bics/2014/1212101010
  source accessed on: 2019-12-03T20:05:01Z
  source last accessed on: 2019-12-03T20:05:01Z
  definition: This segment includes companies that operate very large food stores that also carry a wide selection of general merchandise.
  notation: 1212101010
  valid from: 2014-08-08
  valid till: 2020-10-03
source accessed on: 2019-12-03T20:05:01Z
source last accessed on: 2019-12-03T20:05:01Z
definition: This segment includes companies that operate very large food stores that also carry a wide selection of general merchandise.
notation: 1212101010
valid from: 2014-08-08
valid till: 2020-10-03

Superstores
type: BicsLevel5Segment
type: Classifier
type: NamedIndividual
is level5 segment of: Supermarkets
created with: infer-bics.sql
derived from: Superstores
  type: BicsLevel5Segment
  type: Classifier
  type: ContemporaryDerivation
  derived from: http://data.ga-group.nl/ics/bics/2014/1212101011
  source accessed on: 2019-12-03T20:05:01Z
  source last accessed on: 2019-12-03T20:05:01Z
  definition: This segment includes companies that operate larger self-service food stores, which carry an enhanced range of packaged, fresh food and household products.
  notation: 1212101011
  valid from: 2014-08-08
  valid till: 2020-10-03
source accessed on: 2019-12-03T20:05:01Z
source last accessed on: 2019-12-03T20:05:01Z
definition: This segment includes companies that operate larger self-service food stores, which carry an enhanced range of packaged, fresh food and household products.
notation: 1212101011
valid from: 2014-08-08
valid till: 2020-10-03

Traditional Supermarkets
type: BicsLevel5Segment
type: Classifier
type: NamedIndividual
is level5 segment of: Supermarkets
is replaced by: Traditional Supermarkets
created with: infer-bics.sql
derived from: Traditional Supermarkets
  type: BicsLevel5Segment
  type: Classifier
  type: ContemporaryDerivation
  derived from: http://data.ga-group.nl/ics/bics/2014/1212101012
  source accessed on: 2019-12-03T20:05:01Z
  source last accessed on: 2019-12-03T20:05:01Z
  definition: This segment includes companies that operate smaller self-service food stores, which carry a wide range of packaged, fresh food and household products.
  notation: 1212101012
  valid from: 2014-08-08
  valid till: 2020-10-03
source accessed on: 2019-12-03T20:05:01Z
source last accessed on: 2019-12-03T20:05:01Z
definition: This segment includes companies that operate smaller self-service food stores, which carry a wide range of packaged, fresh food and household products.
notation: 1212101012
valid from: 2014-08-08
valid till: 2020-10-03

Fresh Format
type: BicsLevel5Segment
type: Classifier
type: NamedIndividual
is level5 segment of: Supermarkets
created with: infer-bics.sql
derived from: Fresh Format
  type: BicsLevel5Segment
  type: Classifier
  type: ContemporaryDerivation
  derived from: http://data.ga-group.nl/ics/bics/2014/1212101013
  source accessed on: 2019-12-03T20:05:01Z
  source last accessed on: 2019-12-03T20:05:01Z
  definition: This segment includes supermarkets that have a well above average proportion of fresh food, often at higher price points.
  notation: 1212101013
  valid from: 2014-08-08
  valid till: 2020-10-03
source accessed on: 2019-12-03T20:05:01Z
source last accessed on: 2019-12-03T20:05:01Z
definition: This segment includes supermarkets that have a well above average proportion of fresh food, often at higher price points.
notation: 1212101013
valid from: 2014-08-08
valid till: 2020-10-03

Limited Assortment Stores
type: BicsLevel5Segment
type: Classifier
type: NamedIndividual
is level5 segment of: Supermarkets
created with: infer-bics.sql
derived from: Limited Assortment Stores
  type: BicsLevel5Segment
  type: Classifier
  type: ContemporaryDerivation
  derived from: http://data.ga-group.nl/ics/bics/2014/1212101014
  source accessed on: 2019-12-03T20:05:01Z
  source last accessed on: 2019-12-03T20:05:01Z
  definition: This segment includes food stores restricted in size, service and variety to keep costs and prices low. Companies often sell a restricted selection of general merchandise at very low prices.
  notation: 1212101014
  valid from: 2014-08-08
  valid till: 2020-10-03
source accessed on: 2019-12-03T20:05:01Z
source last accessed on: 2019-12-03T20:05:01Z
definition: This segment includes food stores restricted in size, service and variety to keep costs and prices low. Companies often sell a restricted selection of general merchandise at very low prices.
notation: 1212101014
valid from: 2014-08-08
valid till: 2020-10-03

Cash & Carry
type: BicsLevel5Segment
type: Classifier
type: NamedIndividual
is level5 segment of: Supermarkets
created with: infer-bics.sql
derived from: Cash & Carry
  type: BicsLevel5Segment
  type: Classifier
  type: ContemporaryDerivation
  derived from: http://data.ga-group.nl/ics/bics/2014/1212101015
  source accessed on: 2019-12-03T20:05:01Z
  source last accessed on: 2019-12-03T20:05:01Z
  definition: This segment includes companies that operate outlets in which access is restricted to certain classes of customers (usually those who have VAT registration) but where retail clients are a significant proportion of the trade.
  notation: 1212101015
  valid from: 2014-08-08
  valid till: 2020-10-03
source accessed on: 2019-12-03T20:05:01Z
source last accessed on: 2019-12-03T20:05:01Z
definition: This segment includes companies that operate outlets in which access is restricted to certain classes of customers (usually those who have VAT registration) but where retail clients are a significant proportion of the trade.
notation: 1212101015
valid from: 2014-08-08
valid till: 2020-10-03

Supermarket - Online
type: BicsLevel5Segment
type: Classifier
type: NamedIndividual
is level5 segment of: Supermarkets
is replaced by: Supermarket - Online
created with: infer-bics.sql
derived from: Supermarket - Online
  type: BicsLevel5Segment
  type: Classifier
  type: ContemporaryDerivation
  derived from: http://data.ga-group.nl/ics/bics/2014/1212101016
  source accessed on: 2019-12-03T20:05:01Z
  source last accessed on: 2019-12-03T20:05:01Z
  definition: This segment includes companies that operate an Internet site and distribution center as well as carry a wide range of packaged, fresh food and household products and delivery trucks.
  notation: 1212101016
  valid from: 2014-08-08
  valid till: 2020-10-03
source accessed on: 2019-12-03T20:05:01Z
source last accessed on: 2019-12-03T20:05:01Z
definition: This segment includes companies that operate an Internet site and distribution center as well as carry a wide range of packaged, fresh food and household products and delivery trucks.
notation: 1212101016
valid from: 2014-08-08
valid till: 2020-10-03

Supermarkets
type: BicsLevel4SubIndustry
type: Classifier
type: NamedIndividual
created with: infer-bics.sql
derived from: Supermarkets
  type: BicsLevel4SubIndustry
  type: Classifier
  type: ContemporaryDerivation
  derived from: http://data.ga-group.nl/ics/bics/2014/12121010
  source accessed on: 2019-12-03T20:05:01Z
  source last accessed on: 2019-12-03T20:05:01Z
  definition: This industry subgroup includes companies that operate self-service food stores, which carry a wide range of packaged, fresh food and household products.
  notation: 12121010
  valid from: 2014-08-08
  valid till: 2020-10-03
source accessed on: 2019-12-03T20:05:01Z
source last accessed on: 2019-12-03T20:05:01Z
definition: This industry subgroup includes companies that operate self-service food stores, which carry a wide range of packaged, fresh food and household products.
notation: 12121010
valid from: 2014-08-08
valid till: 2020-10-03

Retail Bakeries
type: BicsLevel5Segment
type: Classifier
type: NamedIndividual
is level5 segment of: Specialty Food & Staples Stores
is replaced by: Retail Bakeries
created with: infer-bics.sql
derived from: Retail Bakeries
  type: BicsLevel5Segment
  type: Classifier
  type: ContemporaryDerivation
  derived from: http://data.ga-group.nl/ics/bics/2014/1212101110
  source accessed on: 2019-12-03T20:05:01Z
  source last accessed on: 2019-12-03T20:05:01Z
  definition: This segment includes companies that retail baked goods, such as bread, biscuits, croutons, doughnuts, pies and pastries.
  notation: 1212101110
  valid from: 2014-08-08
  valid till: 2020-10-03
source accessed on: 2019-12-03T20:05:01Z
source last accessed on: 2019-12-03T20:05:01Z
definition: This segment includes companies that retail baked goods, such as bread, biscuits, croutons, doughnuts, pies and pastries.
notation: 1212101110
valid from: 2014-08-08
valid till: 2020-10-03

Beer, Wine & Liquor Stores
type: BicsLevel5Segment
type: Classifier
type: NamedIndividual
is level5 segment of: Specialty Food & Staples Stores
is replaced by: Beer, Wine & Liquor Stores
created with: infer-bics.sql
derived from: Beer, Wine & Liquor Stores
  type: BicsLevel5Segment
  type: Classifier
  type: ContemporaryDerivation
  derived from: http://data.ga-group.nl/ics/bics/2014/1212101111
  source accessed on: 2019-12-03T20:05:01Z
  source last accessed on: 2019-12-03T20:05:01Z
  definition: This segment includes companies that retail packaged alcoholic beverages.
  notation: 1212101111
  valid from: 2014-08-08
  valid till: 2020-10-03
source accessed on: 2019-12-03T20:05:01Z
source last accessed on: 2019-12-03T20:05:01Z
definition: This segment includes companies that retail packaged alcoholic beverages.
notation: 1212101111
valid from: 2014-08-08
valid till: 2020-10-03

Health & Natural Food Stores
type: BicsLevel5Segment
type: Classifier
type: NamedIndividual
is level5 segment of: Specialty Food & Staples Stores
is replaced by: Health & Natural Food Stores
created with: infer-bics.sql
derived from: Health & Natural Food Stores
  type: BicsLevel5Segment
  type: Classifier
  type: ContemporaryDerivation
  derived from: http://data.ga-group.nl/ics/bics/2014/1212101112
  source accessed on: 2019-12-03T20:05:01Z
  source last accessed on: 2019-12-03T20:05:01Z
  definition: This segment includes companies that retail foods considered to be healthy and/or derived from natural ingredients.
  notation: 1212101112
  valid from: 2014-08-08
  valid till: 2020-10-03
source accessed on: 2019-12-03T20:05:01Z
source last accessed on: 2019-12-03T20:05:01Z
definition: This segment includes companies that retail foods considered to be healthy and/or derived from natural ingredients.
notation: 1212101112
valid from: 2014-08-08
valid till: 2020-10-03

Other Specialty Food Stores
type: BicsLevel5Segment
type: Classifier
type: NamedIndividual
is level5 segment of: Specialty Food & Staples Stores
created with: infer-bics.sql
derived from: Other Specialty Food Stores
  type: BicsLevel5Segment
  type: Classifier
  type: ContemporaryDerivation
  derived from: http://data.ga-group.nl/ics/bics/2014/1212101113
  source accessed on: 2019-12-03T20:05:01Z
  source last accessed on: 2019-12-03T20:05:01Z
  definition: This segment includes companies that retail other product lines as their main business, such as meat or fish.
  notation: 1212101113
  valid from: 2014-08-08
  valid till: 2020-10-03
source accessed on: 2019-12-03T20:05:01Z
source last accessed on: 2019-12-03T20:05:01Z
definition: This segment includes companies that retail other product lines as their main business, such as meat or fish.
notation: 1212101113
valid from: 2014-08-08
valid till: 2020-10-03

Specialty Food & Staples Stores
type: BicsLevel4SubIndustry
type: Classifier
type: NamedIndividual
created with: infer-bics.sql
derived from: Specialty Food & Staples Stores
  type: BicsLevel4SubIndustry
  type: Classifier
  type: ContemporaryDerivation
  derived from: http://data.ga-group.nl/ics/bics/2014/12121011
  source accessed on: 2019-12-03T20:05:01Z
  source last accessed on: 2019-12-03T20:05:01Z
  definition: This industry subgroup includes companies that retail primarily one type of food or beverage product.
  notation: 12121011
  valid from: 2014-08-08
  valid till: 2020-10-03
source accessed on: 2019-12-03T20:05:01Z
source last accessed on: 2019-12-03T20:05:01Z
definition: This industry subgroup includes companies that retail primarily one type of food or beverage product.
notation: 12121011
valid from: 2014-08-08
valid till: 2020-10-03

Convenience Stores
type: BicsLevel4SubIndustry
type: Classifier
type: NamedIndividual
created with: infer-bics.sql
derived from: Convenience Stores
  type: BicsLevel4SubIndustry
  type: Classifier
  type: ContemporaryDerivation
  derived from: http://data.ga-group.nl/ics/bics/2014/12121012
  source accessed on: 2019-12-03T20:05:01Z
  source last accessed on: 2019-12-03T20:05:01Z
  definition: This industry includes companies that retail a limited selection of groceries, beverages and tobacco. This segment includes company-owned and franchise revenue.
  notation: 12121012
  valid from: 2014-08-08
  valid till: 2020-10-03
source accessed on: 2019-12-03T20:05:01Z
source last accessed on: 2019-12-03T20:05:01Z
definition: This industry includes companies that retail a limited selection of groceries, beverages and tobacco. This segment includes company-owned and franchise revenue.
notation: 12121012
valid from: 2014-08-08
valid till: 2020-10-03

Pharmacy Drugstores
type: BicsLevel5Segment
type: Classifier
type: NamedIndividual
is level5 segment of: Pharmacies & Drug Stores
is replaced by: Pharmacies
created with: infer-bics.sql
derived from: Pharmacy Drugstores
  type: BicsLevel5Segment
  type: Classifier
  type: ContemporaryDerivation
  derived from: http://data.ga-group.nl/ics/bics/2014/1212101310
  source accessed on: 2019-12-03T20:05:01Z
  source last accessed on: 2019-12-03T20:05:01Z
  definition: This segment includes companies that operate bricks-and-mortar and online stores and whose pharmacy revenue accounts for the majority of sales.
  notation: 1212101310
  valid from: 2014-08-08
  valid till: 2020-10-03
source accessed on: 2019-12-03T20:05:01Z
source last accessed on: 2019-12-03T20:05:01Z
definition: This segment includes companies that operate bricks-and-mortar and online stores and whose pharmacy revenue accounts for the majority of sales.
notation: 1212101310
valid from: 2014-08-08
valid till: 2020-10-03

Toiletry Drugstores
type: BicsLevel5Segment
type: Classifier
type: NamedIndividual
is level5 segment of: Pharmacies & Drug Stores
is replaced by: Drug Stores
created with: infer-bics.sql
derived from: Toiletry Drugstores
  type: BicsLevel5Segment
  type: Classifier
  type: ContemporaryDerivation
  derived from: http://data.ga-group.nl/ics/bics/2014/1212101311
  source accessed on: 2019-12-03T20:05:01Z
  source last accessed on: 2019-12-03T20:05:01Z
  definition: This segment includes stores that sell toiletries and health care products, and often include a pharmacy but where pharmacy revenue is a small proportion of total sales.
  notation: 1212101311
  valid from: 2014-08-08
  valid till: 2020-10-03
source accessed on: 2019-12-03T20:05:01Z
source last accessed on: 2019-12-03T20:05:01Z
definition: This segment includes stores that sell toiletries and health care products, and often include a pharmacy but where pharmacy revenue is a small proportion of total sales.
notation: 1212101311
valid from: 2014-08-08
valid till: 2020-10-03

Pharmacies & Drug - Online
type: BicsLevel5Segment
type: Classifier
type: NamedIndividual
is level5 segment of: Pharmacies & Drug Stores
is replaced by: Pharmacies & Drug - Online
created with: infer-bics.sql
derived from: Pharmacies & Drug - Online
  type: BicsLevel5Segment
  type: Classifier
  type: ContemporaryDerivation
  derived from: http://data.ga-group.nl/ics/bics/2014/1212101312
  source accessed on: 2019-12-03T20:05:01Z
  source last accessed on: 2019-12-03T20:05:01Z
  definition: This segment includes pure-play Internet companies that retail prescription or non-prescription drugs and medicines on the Internet.
  notation: 1212101312
  valid from: 2014-08-08
  valid till: 2020-10-03
source accessed on: 2019-12-03T20:05:01Z
source last accessed on: 2019-12-03T20:05:01Z
definition: This segment includes pure-play Internet companies that retail prescription or non-prescription drugs and medicines on the Internet.
notation: 1212101312
valid from: 2014-08-08
valid till: 2020-10-03

Pharmacies & Drug Stores
type: BicsLevel4SubIndustry
type: Classifier
type: NamedIndividual
created with: infer-bics.sql
derived from: Pharmacies & Drug Stores
  type: BicsLevel4SubIndustry
  type: Classifier
  type: ContemporaryDerivation
  derived from: http://data.ga-group.nl/ics/bics/2014/12121013
  source accessed on: 2019-12-03T20:05:01Z
  source last accessed on: 2019-12-03T20:05:01Z
  definition: This industry subgroup includes companies that retail prescription drugs and medications through brick-and-mortar and online stores.
  notation: 12121013
  valid from: 2014-08-08
  valid till: 2020-10-03
source accessed on: 2019-12-03T20:05:01Z
source last accessed on: 2019-12-03T20:05:01Z
definition: This industry subgroup includes companies that retail prescription drugs and medications through brick-and-mortar and online stores.
notation: 12121013
valid from: 2014-08-08
valid till: 2020-10-03

Food & Drug Stores
type: BicsLevel3Industry
type: Classifier
type: NamedIndividual
is industry of: Retail - Consumer Staples
is replaced by: Food & Drug Stores
created with: infer-bics.sql
derived from: Food & Drug Stores
  type: BicsLevel3Industry
  type: Classifier
  type: ContemporaryDerivation
  derived from: http://data.ga-group.nl/ics/bics/2014/121210
  source accessed on: 2019-12-03T20:05:01Z
  source last accessed on: 2019-12-03T20:05:01Z
  definition: The industry includes specialty food businesses and mixed retail businesses in which food or pharmaceuticals is the predominant category.
  notation: 121210
  valid from: 2014-08-08
  valid till: 2020-10-03
source accessed on: 2019-12-03T20:05:01Z
source last accessed on: 2019-12-03T20:05:01Z
definition: The industry includes specialty food businesses and mixed retail businesses in which food or pharmaceuticals is the predominant category.
notation: 121210
valid from: 2014-08-08
valid till: 2020-10-03

SuperCenters
type: BicsLevel4SubIndustry
type: Classifier
type: NamedIndividual
created with: infer-bics.sql
derived from: SuperCenters
  type: BicsLevel4SubIndustry
  type: Classifier
  type: ContemporaryDerivation
  derived from: http://data.ga-group.nl/ics/bics/2014/12121110
  source accessed on: 2019-12-03T20:05:01Z
  source last accessed on: 2019-12-03T20:05:01Z
  definition: This industry subgroup includes companies that operate very large self-service stores that also carry a wide selection of general merchandise and food.
  notation: 12121110
  valid from: 2014-08-08
  valid till: 2020-10-03
source accessed on: 2019-12-03T20:05:01Z
source last accessed on: 2019-12-03T20:05:01Z
definition: This industry subgroup includes companies that operate very large self-service stores that also carry a wide selection of general merchandise and food.
notation: 12121110
valid from: 2014-08-08
valid till: 2020-10-03

Warehouse Clubs
type: BicsLevel4SubIndustry
type: Classifier
type: NamedIndividual
created with: infer-bics.sql
derived from: Warehouse Clubs
  type: BicsLevel4SubIndustry
  type: Classifier
  type: ContemporaryDerivation
  derived from: http://data.ga-group.nl/ics/bics/2014/12121111
  source accessed on: 2019-12-03T20:05:01Z
  source last accessed on: 2019-12-03T20:05:01Z
  definition: This industry subgroup includes companies that usually sell a wide variety of merchandise, in which customers pay annual membership fees in order to shop. In addition, customers are required to buy large, wholesale quantities of the store's products. This can include Internet sales of brick-and-mortar stores.
  notation: 12121111
  valid from: 2014-08-08
  valid till: 2020-10-03
source accessed on: 2019-12-03T20:05:01Z
source last accessed on: 2019-12-03T20:05:01Z
definition: This industry subgroup includes companies that usually sell a wide variety of merchandise, in which customers pay annual membership fees in order to shop. In addition, customers are required to buy large, wholesale quantities of the store's products. This can include Internet sales of brick-and-mortar stores.
notation: 12121111
valid from: 2014-08-08
valid till: 2020-10-03

Discount Stores
type: BicsLevel4SubIndustry
type: Classifier
type: NamedIndividual
created with: infer-bics.sql
derived from: Discount Stores
  type: BicsLevel4SubIndustry
  type: Classifier
  type: ContemporaryDerivation
  derived from: http://data.ga-group.nl/ics/bics/2014/12121112
  source accessed on: 2019-12-03T20:05:01Z
  source last accessed on: 2019-12-03T20:05:01Z
  definition: This industry subgroup includes companies that sell a wide range of general merchandise at prices lower than those asked by traditional retail outlets.
  notation: 12121112
  valid from: 2014-08-08
  valid till: 2020-10-03
source accessed on: 2019-12-03T20:05:01Z
source last accessed on: 2019-12-03T20:05:01Z
definition: This industry subgroup includes companies that sell a wide range of general merchandise at prices lower than those asked by traditional retail outlets.
notation: 12121112
valid from: 2014-08-08
valid till: 2020-10-03

Dollar Stores
type: BicsLevel4SubIndustry
type: Classifier
type: NamedIndividual
created with: infer-bics.sql
derived from: Dollar Stores
  type: BicsLevel4SubIndustry
  type: Classifier
  type: ContemporaryDerivation
  derived from: http://data.ga-group.nl/ics/bics/2014/12121113
  source accessed on: 2019-12-03T20:05:01Z
  source last accessed on: 2019-12-03T20:05:01Z
  definition: This segment includes companies that sell a wide range of general merchandise and food, usually at lower prices than conventional stores.
  notation: 12121113
  valid from: 2014-08-08
  valid till: 2020-10-03
source accessed on: 2019-12-03T20:05:01Z
source last accessed on: 2019-12-03T20:05:01Z
definition: This segment includes companies that sell a wide range of general merchandise and food, usually at lower prices than conventional stores.
notation: 12121113
valid from: 2014-08-08
valid till: 2020-10-03

Mass Merchants
type: BicsLevel3Industry
type: Classifier
type: NamedIndividual
is industry of: Retail - Consumer Staples
is replaced by: Mass Merchants
created with: infer-bics.sql
derived from: Mass Merchants
  type: BicsLevel3Industry
  type: Classifier
  type: ContemporaryDerivation
  derived from: http://data.ga-group.nl/ics/bics/2014/121211
  source accessed on: 2019-12-03T20:05:01Z
  source last accessed on: 2019-12-03T20:05:01Z
  definition: This industry includes retail stores that carry a broad range of merchandise but where food is the largest single category.
  notation: 121211
  valid from: 2014-08-08
  valid till: 2020-10-03
source accessed on: 2019-12-03T20:05:01Z
source last accessed on: 2019-12-03T20:05:01Z
definition: This industry includes retail stores that carry a broad range of merchandise but where food is the largest single category.
notation: 121211
valid from: 2014-08-08
valid till: 2020-10-03

Other Specialty Retail - Staples
type: BicsLevel3Industry
type: Classifier
type: NamedIndividual
is industry of: Retail - Consumer Staples
created with: infer-bics.sql
derived from: Other Specialty Retail - Staples
  type: BicsLevel3Industry
  type: Classifier
  type: ContemporaryDerivation
  derived from: http://data.ga-group.nl/ics/bics/2014/121212
  source accessed on: 2019-12-03T20:05:01Z
  source last accessed on: 2019-12-03T20:05:01Z
  definition: This industry includes companies that retail other staple products not elsewhere classified.
  notation: 121212
  valid from: 2014-08-08
  valid till: 2020-10-03
source accessed on: 2019-12-03T20:05:01Z
source last accessed on: 2019-12-03T20:05:01Z
definition: This industry includes companies that retail other staple products not elsewhere classified.
notation: 121212
valid from: 2014-08-08
valid till: 2020-10-03

Retail - Consumer Staples
type: BicsLevel2IndustryGroup
type: Classifier
type: NamedIndividual
is industry group of: Consumer Staples
is replaced by: Retail - Consumer Staples
created with: infer-bics.sql
derived from: Retail - Consumer Staples
  type: BicsLevel2IndustryGroup
  type: Classifier
  type: ContemporaryDerivation
  derived from: http://data.ga-group.nl/ics/bics/2014/1212
  source accessed on: 2019-12-03T20:05:01Z
  source last accessed on: 2019-12-03T20:05:01Z
  definition: This industry group includes companies that retail consumer necessities products through storefront operations.
  notation: 1212
  valid from: 2014-08-08
  valid till: 2020-10-03
source accessed on: 2019-12-03T20:05:01Z
source last accessed on: 2019-12-03T20:05:01Z
definition: This industry group includes companies that retail consumer necessities products through storefront operations.
notation: 1212
valid from: 2014-08-08
valid till: 2020-10-03

Consumer Staples
type: BicsLevel1Sector
type: Classifier
type: NamedIndividual
created with: infer-bics.sql
derived from: Consumer Staples
  type: BicsLevel1Sector
  type: Classifier
  type: ContemporaryDerivation
  derived from: http://data.ga-group.nl/ics/bics/2014/12
  source accessed on: 2019-12-03T20:05:01Z
  source last accessed on: 2019-12-03T20:05:01Z
  definition: This sector includes companies that produce, manufacture, distribute or retail consumer staple goods and services.
  notation: 12
  valid from: 2014-08-08
  valid till: 2020-10-03
derived from: Consumer Staples
  type: BicsLevel1Sector
  type: Classifier
  type: ContemporaryDerivation
  derived from: http://data.ga-group.nl/ics/bics/2020/12
  derived from: http://data.ga-group.nl/ics/bics/2024/12
  source accessed on: 2023-07-03T18:11:29Z
  source last accessed on: 2024-06-05T14:42:36Z
  definition: This sector includes companies that produce, manufacture, distribute, or retail consumer staple goods and services.
  notation: 12
  valid from: 2020-10-03
source accessed on: 2019-12-03T20:05:01Z
source last accessed on: 2024-06-05T14:42:36Z
definition: This sector includes companies that produce, manufacture, distribute, or retail consumer staple goods and services.
notation: 12
valid from: 2014-08-08

Integrated Oils
type: BicsLevel4SubIndustry
type: Classifier
type: NamedIndividual
replaces: Oil & Gas Supply Chain
created with: infer-bics.sql
derived from: Integrated Oils
  type: BicsLevel3Industry
  type: Classifier
  type: AnachronousDerivation
  derived from: http://data.ga-group.nl/ics/bics/2014/131010
  source accessed on: 2019-12-03T20:05:01Z
  source last accessed on: 2019-12-03T20:05:01Z
  definition: This industry includes companies that are considered integrated oil producers. These companies are involved in all aspects of the oil industry, from exploration and production to distribution and chemical production.
  notation: 131010
  valid from: 2014-08-08
  valid till: 2020-10-03
derived from: Integrated Oils
  type: BicsLevel4SubIndustry
  type: Classifier
  type: ContemporaryDerivation
  derived from: http://data.ga-group.nl/ics/bics/2020/13101010
  derived from: http://data.ga-group.nl/ics/bics/2024/13101010
  source accessed on: 2023-07-03T18:11:29Z
  source last accessed on: 2024-06-05T14:42:36Z
  definition: This industry subgroup includes large companies that are vertically integrated into exploration, production, and refining.
  notation: 13101010
  valid from: 2020-10-03
source accessed on: 2023-07-03T18:11:29Z
source last accessed on: 2024-06-05T14:42:36Z
definition: This industry subgroup includes large companies that are vertically integrated into exploration, production, and refining.
notation: 13101010
valid from: 2020-10-03

Crude Oil Production
type: BicsLevel6Segment
type: Classifier
type: NamedIndividual
is level6 segment of: Crude Oil & Natural Gas E&P
replaces: Onshore Drilling
created with: infer-bics.sql
derived from: Crude Oil Production
  type: BicsLevel5Segment
  type: Classifier
  type: AnachronousDerivation
  derived from: http://data.ga-group.nl/ics/bics/2014/1310111010
  source accessed on: 2019-12-03T20:05:01Z
  source last accessed on: 2019-12-03T20:05:01Z
  definition: This segment includes companies that explore and develop crude oil deposits. Such deposits include those found on land and sea.
  notation: 1310111010
  valid from: 2014-08-08
  valid till: 2020-10-03
derived from: Crude Oil Production
  type: BicsLevel6Segment
  type: Classifier
  type: ContemporaryDerivation
  derived from: http://data.ga-group.nl/ics/bics/2020/131010111010
  derived from: http://data.ga-group.nl/ics/bics/2024/131010111010
  source accessed on: 2023-07-03T18:11:29Z
  source last accessed on: 2024-06-05T14:42:36Z
  definition: This segment includes companies that explore and develop crude oil deposits on land or sea.
  notation: 131010111010
  valid from: 2020-10-03
source accessed on: 2023-07-03T18:11:29Z
source last accessed on: 2024-06-05T14:42:36Z
definition: This segment includes companies that explore and develop crude oil deposits on land or sea.
notation: 131010111010
valid from: 2020-10-03

Oil Sands Production
type: BicsLevel6Segment
type: Classifier
type: NamedIndividual
is level6 segment of: Crude Oil & Natural Gas E&P
replaces: Offshore Drilling
created with: infer-bics.sql
derived from: Oil Sands Production
  type: BicsLevel5Segment
  type: Classifier
  type: AnachronousDerivation
  derived from: http://data.ga-group.nl/ics/bics/2014/1310111011
  source accessed on: 2019-12-03T20:05:01Z
  source last accessed on: 2019-12-03T20:05:01Z
  definition: This segment includes companies that explore for and develop oil sands deposits.
  notation: 1310111011
  valid from: 2014-08-08
  valid till: 2020-10-03
derived from: Oil Sands Production
  type: BicsLevel6Segment
  type: Classifier
  type: ContemporaryDerivation
  derived from: http://data.ga-group.nl/ics/bics/2020/131010111011
  derived from: http://data.ga-group.nl/ics/bics/2024/131010111011
  source accessed on: 2023-07-03T18:11:29Z
  source last accessed on: 2024-06-05T14:42:36Z
  definition: This segment includes companies that find and develop oil sands deposits.
  notation: 131010111011
  valid from: 2020-10-03
source accessed on: 2023-07-03T18:11:29Z
source last accessed on: 2024-06-05T14:42:36Z
definition: This segment includes companies that find and develop oil sands deposits.
notation: 131010111011
valid from: 2020-10-03

Natural Gas Liquids Production
type: BicsLevel6Segment
type: Classifier
type: NamedIndividual
is level6 segment of: Crude Oil & Natural Gas E&P
replaces: Drill Support
created with: infer-bics.sql
derived from: Natural Gas Liquids Production
  type: BicsLevel5Segment
  type: Classifier
  type: AnachronousDerivation
  derived from: http://data.ga-group.nl/ics/bics/2014/1310111012
  source accessed on: 2019-12-03T20:05:01Z
  source last accessed on: 2019-12-03T20:05:01Z
  definition: This segment includes companies that produce natural gas liquids (NGLs).
  notation: 1310111012
  valid from: 2014-08-08
  valid till: 2020-10-03
derived from: Natural Gas Liquids Production
  type: BicsLevel6Segment
  type: Classifier
  type: ContemporaryDerivation
  derived from: http://data.ga-group.nl/ics/bics/2020/131010111012
  derived from: http://data.ga-group.nl/ics/bics/2024/131010111012
  source accessed on: 2023-07-03T18:11:29Z
  source last accessed on: 2024-06-05T14:42:36Z
  definition: This segment includes companies that produce natural gas liquids (NGLs).
  notation: 131010111012
  valid from: 2020-10-03
source accessed on: 2023-07-03T18:11:29Z
source last accessed on: 2024-06-05T14:42:36Z
definition: This segment includes companies that produce natural gas liquids (NGLs).
notation: 131010111012
valid from: 2020-10-03

Natural Gas Production
type: BicsLevel6Segment
type: Classifier
type: NamedIndividual
is level6 segment of: Crude Oil & Natural Gas E&P
replaces: Natural Gas Production
created with: infer-bics.sql
derived from: Natural Gas Production
  type: BicsLevel5Segment
  type: Classifier
  type: AnachronousDerivation
  derived from: http://data.ga-group.nl/ics/bics/2014/1310111013
  source accessed on: 2019-12-03T20:05:01Z
  source last accessed on: 2019-12-03T20:05:01Z
  definition: This segment includes companies that explore and develop natural gas deposits.
  notation: 1310111013
  valid from: 2014-08-08
  valid till: 2020-10-03
derived from: Natural Gas Production
  type: BicsLevel6Segment
  type: Classifier
  type: ContemporaryDerivation
  derived from: http://data.ga-group.nl/ics/bics/2020/131010111013
  derived from: http://data.ga-group.nl/ics/bics/2024/131010111013
  source accessed on: 2023-07-03T18:11:29Z
  source last accessed on: 2024-06-05T14:42:36Z
  definition: This segment includes companies that find and develop natural gas deposits.
  notation: 131010111013
  valid from: 2020-10-03
source accessed on: 2023-07-03T18:11:29Z
source last accessed on: 2024-06-05T14:42:36Z
definition: This segment includes companies that find and develop natural gas deposits.
notation: 131010111013
valid from: 2020-10-03

Negative Royalties
type: BicsLevel6Segment
type: Classifier
type: NamedIndividual
is level6 segment of: Crude Oil & Natural Gas E&P
replaces: Negative Royalties
created with: infer-bics.sql
derived from: Negative Royalties
  type: BicsLevel5Segment
  type: Classifier
  type: AnachronousDerivation
  derived from: http://data.ga-group.nl/ics/bics/2014/1310111014
  source accessed on: 2019-12-03T20:05:01Z
  source last accessed on: 2019-12-03T20:05:01Z
  definition: This segment includes companies that pay royalty fees to government bodies for the production of fossil fuels.
  notation: 1310111014
  valid from: 2014-08-08
  valid till: 2020-10-03
derived from: Negative Royalties
  type: BicsLevel6Segment
  type: Classifier
  type: ContemporaryDerivation
  derived from: http://data.ga-group.nl/ics/bics/2020/131010111014
  derived from: http://data.ga-group.nl/ics/bics/2024/131010111014
  source accessed on: 2023-07-03T18:11:29Z
  source last accessed on: 2024-06-05T14:42:36Z
  definition: This segment includes companies that pay royalty fees to government bodies for the production of fossil fuels.
  notation: 131010111014
  valid from: 2020-10-03
source accessed on: 2023-07-03T18:11:29Z
source last accessed on: 2024-06-05T14:42:36Z
definition: This segment includes companies that pay royalty fees to government bodies for the production of fossil fuels.
notation: 131010111014
valid from: 2020-10-03

Crude Oil & Natural Gas E&P
type: BicsLevel5Segment
type: Classifier
type: NamedIndividual
is level5 segment of: Exploration & Production
created with: infer-bics.sql
derived from: Crude Oil & Natural Gas E&P
  type: BicsLevel4SubIndustry
  type: Classifier
  type: AnachronousDerivation
  derived from: http://data.ga-group.nl/ics/bics/2014/13101110
  source accessed on: 2019-12-03T20:05:01Z
  source last accessed on: 2019-12-03T20:05:01Z
  definition: This industry subgroup includes companies that explore and develop deposits of crude oil and natural gas.
  notation: 13101110
  valid from: 2014-08-08
  valid till: 2020-10-03
derived from: Crude Oil & Natural Gas E&P
  type: BicsLevel5Segment
  type: Classifier
  type: ContemporaryDerivation
  derived from: http://data.ga-group.nl/ics/bics/2020/1310101110
  derived from: http://data.ga-group.nl/ics/bics/2024/1310101110
  source accessed on: 2023-07-03T18:11:29Z
  source last accessed on: 2024-06-05T14:42:36Z
  definition: This segment includes companies that explore and develop deposits of crude oil and natural gas.
  notation: 1310101110
  valid from: 2020-10-03
source accessed on: 2023-07-03T18:11:29Z
source last accessed on: 2024-06-05T14:42:36Z
definition: This segment includes companies that explore and develop deposits of crude oil and natural gas.
notation: 1310101110
valid from: 2020-10-03

Oil & Natural Gas Mkt & Trading
type: BicsLevel5Segment
type: Classifier
type: NamedIndividual
is level5 segment of: Exploration & Production
created with: infer-bics.sql
derived from: Oil & Natural Gas Mkt & Trading
  type: BicsLevel4SubIndustry
  type: Classifier
  type: AnachronousDerivation
  derived from: http://data.ga-group.nl/ics/bics/2014/13101111
  source accessed on: 2019-12-03T20:05:01Z
  source last accessed on: 2019-12-03T20:05:01Z
  definition: This industry subgroup includes segments of exploration and production companies that market and resell third-party purchased crude oil and natural gas volumes.
  notation: 13101111
  valid from: 2014-08-08
  valid till: 2020-10-03
derived from: Oil & Natural Gas Mkt & Trading
  type: BicsLevel5Segment
  type: Classifier
  type: ContemporaryDerivation
  derived from: http://data.ga-group.nl/ics/bics/2020/1310101111
  derived from: http://data.ga-group.nl/ics/bics/2024/1310101111
  source accessed on: 2023-07-03T18:11:29Z
  source last accessed on: 2024-06-05T14:42:36Z
  definition: This segment includes companies that market and resell third-party purchased raw crude oil and natural gas volumes.
  notation: 1310101111
  valid from: 2020-10-03
source accessed on: 2023-07-03T18:11:29Z
source last accessed on: 2024-06-05T14:42:36Z
definition: This segment includes companies that market and resell third-party purchased raw crude oil and natural gas volumes.
notation: 1310101111
valid from: 2020-10-03

Royalty Income - Oil & Gas
type: BicsLevel5Segment
type: Classifier
type: NamedIndividual
is level5 segment of: Exploration & Production
created with: infer-bics.sql
derived from: Royalty Income - Oil & Gas
  type: BicsLevel4SubIndustry
  type: Classifier
  type: AnachronousDerivation
  derived from: http://data.ga-group.nl/ics/bics/2014/13101112
  source accessed on: 2019-12-03T20:05:01Z
  source last accessed on: 2019-12-03T20:05:01Z
  definition: This industry subgroup includes companies that receive royalties from energy properties, such as oil fields.
  notation: 13101112
  valid from: 2014-08-08
  valid till: 2020-10-03
derived from: Royalty Income - Oil & Gas
  type: BicsLevel5Segment
  type: Classifier
  type: ContemporaryDerivation
  derived from: http://data.ga-group.nl/ics/bics/2020/1310101112
  derived from: http://data.ga-group.nl/ics/bics/2024/1310101112
  source accessed on: 2023-07-03T18:11:29Z
  source last accessed on: 2024-06-05T14:42:36Z
  definition: This segment includes companies that receive royalties from energy properties, such as oil and gas fields.
  notation: 1310101112
  valid from: 2020-10-03
source accessed on: 2023-07-03T18:11:29Z
source last accessed on: 2024-06-05T14:42:36Z
definition: This segment includes companies that receive royalties from energy properties, such as oil and gas fields.
notation: 1310101112
valid from: 2020-10-03

Exploration & Production
type: BicsLevel4SubIndustry
type: Classifier
type: NamedIndividual
replaces: Oil & Gas Services & Equip
created with: infer-bics.sql
derived from: Exploration & Production
  type: BicsLevel3Industry
  type: Classifier
  type: AnachronousDerivation
  derived from: http://data.ga-group.nl/ics/bics/2014/131011
  source accessed on: 2019-12-03T20:05:01Z
  source last accessed on: 2019-12-03T20:05:01Z
  definition: This industry includes companies that explore for, extract or produce energy products. Such products include crude oil, natural gas, liquefied natural gas and liquefied petroleum. This industry also includes royalties received from these energy properties.
  notation: 131011
  valid from: 2014-08-08
  valid till: 2020-10-03
derived from: Exploration & Production
  type: BicsLevel4SubIndustry
  type: Classifier
  type: ContemporaryDerivation
  derived from: http://data.ga-group.nl/ics/bics/2020/13101011
  derived from: http://data.ga-group.nl/ics/bics/2024/13101011
  source accessed on: 2023-07-03T18:11:29Z
  source last accessed on: 2024-06-05T14:42:36Z
  definition: This industry subgroup includes companies that explore for, extract, or produce crude oil and natural gas products.
  notation: 13101011
  valid from: 2020-10-03
source accessed on: 2023-07-03T18:11:29Z
source last accessed on: 2024-06-05T14:42:36Z
definition: This industry subgroup includes companies that explore for, extract, or produce crude oil and natural gas products.
notation: 13101011
valid from: 2020-10-03

Crude Oil Pipelines & Storage
type: BicsLevel7Segment
type: Classifier
type: NamedIndividual
is level7 segment of: Oil Pipelines & Storage
replaces: Crude Oil Pipelines & Storage
created with: infer-bics.sql
derived from: Crude Oil Pipelines & Storage
  type: BicsLevel6Segment
  type: Classifier
  type: AnachronousDerivation
  derived from: http://data.ga-group.nl/ics/bics/2014/131012101010
  source accessed on: 2019-12-03T20:05:01Z
  source last accessed on: 2019-12-03T20:05:01Z
  definition: This segment includes companies that own and operate pipelines and terminal facilities for crude oil. These companies may realize revenue through toll transportation and storage services or through purchasing and reselling of the underlying products. These companies utilize their distribution network to link crude-oil production companies and refineries.
  notation: 131012101010
  valid from: 2014-08-08
  valid till: 2020-10-03
derived from: Crude Oil Pipelines & Storage
  type: BicsLevel7Segment
  type: Classifier
  type: ContemporaryDerivation
  derived from: http://data.ga-group.nl/ics/bics/2020/13101012101010
  derived from: http://data.ga-group.nl/ics/bics/2024/13101012101010
  source accessed on: 2023-07-03T18:11:29Z
  source last accessed on: 2024-06-05T14:42:36Z
  definition: This segment includes companies that own and operate pipelines and terminal facilities for crude oil. These companies utilize their distribution network to link crude-oil production companies and refineries.
  notation: 13101012101010
  valid from: 2020-10-03
source accessed on: 2023-07-03T18:11:29Z
source last accessed on: 2024-06-05T14:42:36Z
definition: This segment includes companies that own and operate pipelines and terminal facilities for crude oil. These companies utilize their distribution network to link crude-oil production companies and refineries.
notation: 13101012101010
valid from: 2020-10-03

Refined Products Pipelines & Sto
type: BicsLevel7Segment
type: Classifier
type: NamedIndividual
is level7 segment of: Oil Pipelines & Storage
replaces: Refined Products Pipelines & Sto
created with: infer-bics.sql
derived from: Refined Products Pipelines & Sto
  type: BicsLevel6Segment
  type: Classifier
  type: AnachronousDerivation
  derived from: http://data.ga-group.nl/ics/bics/2014/131012101011
  source accessed on: 2019-12-03T20:05:01Z
  source last accessed on: 2019-12-03T20:05:01Z
  definition: This segment includes companies that own and operate pipelines and terminal facilities for refined oil products. These companies may realize revenue through toll transportation and storage services or through purchasing and reselling of the underlying products. These companies utilize their distribution network to link refineries to their end users.
  notation: 131012101011
  valid from: 2014-08-08
  valid till: 2020-10-03
derived from: Refined Products Pipelines & Sto
  type: BicsLevel7Segment
  type: Classifier
  type: ContemporaryDerivation
  derived from: http://data.ga-group.nl/ics/bics/2020/13101012101011
  derived from: http://data.ga-group.nl/ics/bics/2024/13101012101011
  source accessed on: 2023-07-03T18:11:29Z
  source last accessed on: 2024-06-05T14:42:36Z
  definition: This segment includes companies that own and operate pipelines and terminal facilities for refined oil products. These companies utilize their distribution network to link refineries to their end users.
  notation: 13101012101011
  valid from: 2020-10-03
source accessed on: 2023-07-03T18:11:29Z
source last accessed on: 2024-06-05T14:42:36Z
definition: This segment includes companies that own and operate pipelines and terminal facilities for refined oil products. These companies utilize their distribution network to link refineries to their end users.
notation: 13101012101011
valid from: 2020-10-03

Oil Pipelines & Storage
type: BicsLevel6Segment
type: Classifier
type: NamedIndividual
is level6 segment of: Oil & Liquid Rich Gas Pipelines
replaces: Oil Pipelines & Storage
created with: infer-bics.sql
derived from: Oil Pipelines & Storage
  type: BicsLevel5Segment
  type: Classifier
  type: AnachronousDerivation
  derived from: http://data.ga-group.nl/ics/bics/2014/1310121010
  source accessed on: 2019-12-03T20:05:01Z
  source last accessed on: 2019-12-03T20:05:01Z
  definition: This segment includes companies that own and operate pipelines and terminal facilities for oil products. These companies may realize revenue through toll transportation and storage services or through purchasing and reselling of the underlying products.
  notation: 1310121010
  valid from: 2014-08-08
  valid till: 2020-10-03
derived from: Oil Pipelines & Storage
  type: BicsLevel6Segment
  type: Classifier
  type: ContemporaryDerivation
  derived from: http://data.ga-group.nl/ics/bics/2020/131010121010
  derived from: http://data.ga-group.nl/ics/bics/2024/131010121010
  source accessed on: 2023-07-03T18:11:29Z
  source last accessed on: 2024-06-05T14:42:36Z
  definition: This segment includes companies that own and operate pipelines and terminal facilities for oil products.
  notation: 131010121010
  valid from: 2020-10-03
source accessed on: 2023-07-03T18:11:29Z
source last accessed on: 2024-06-05T14:42:36Z
definition: This segment includes companies that own and operate pipelines and terminal facilities for oil products.
notation: 131010121010
valid from: 2020-10-03

Nat Gas Gathering & Processing
type: BicsLevel7Segment
type: Classifier
type: NamedIndividual
is level7 segment of: NGL Pipelines & Services
replaces: Nat Gas Gathering & Processing
created with: infer-bics.sql
derived from: Nat Gas Gathering & Processing
  type: BicsLevel6Segment
  type: Classifier
  type: AnachronousDerivation
  derived from: http://data.ga-group.nl/ics/bics/2014/131012101110
  source accessed on: 2019-12-03T20:05:01Z
  source last accessed on: 2019-12-03T20:05:01Z
  definition: This segment includes companies that own and operates pipelines that transport raw natural gas from wellheads. Also includes companies that treat, process and finally separate raw natural gas into dry natural gas and natural gas liquids. These companies may realize revenue through toll transportation, processing and storage services or through purchasing, processing and reselling of the underlying products.
  notation: 131012101110
  valid from: 2014-08-08
  valid till: 2020-10-03
derived from: Nat Gas Gathering & Processing
  type: BicsLevel7Segment
  type: Classifier
  type: ContemporaryDerivation
  derived from: http://data.ga-group.nl/ics/bics/2020/13101012101110
  derived from: http://data.ga-group.nl/ics/bics/2024/13101012101110
  source accessed on: 2023-07-03T18:11:29Z
  source last accessed on: 2024-06-05T14:42:36Z
  definition: This segment includes companies that own and operates pipelines that transport raw natural gas from wellheads. Also includes companies that treat, process, and finally separate raw natural gas into dry natural gas and natural gas liquids.
  notation: 13101012101110
  valid from: 2020-10-03
source accessed on: 2023-07-03T18:11:29Z
source last accessed on: 2024-06-05T14:42:36Z
definition: This segment includes companies that own and operates pipelines that transport raw natural gas from wellheads. Also includes companies that treat, process, and finally separate raw natural gas into dry natural gas and natural gas liquids.
notation: 13101012101110
valid from: 2020-10-03

NGL Fractionation & Marketing
type: BicsLevel7Segment
type: Classifier
type: NamedIndividual
is level7 segment of: NGL Pipelines & Services
replaces: NGL Fractionation & Marketing
created with: infer-bics.sql
derived from: NGL Fractionation & Marketing
  type: BicsLevel6Segment
  type: Classifier
  type: AnachronousDerivation
  derived from: http://data.ga-group.nl/ics/bics/2014/131012101111
  source accessed on: 2019-12-03T20:05:01Z
  source last accessed on: 2019-12-03T20:05:01Z
  definition: This segment includes companies that break natural gas liquids (NGLs) into different liquids, such as ethane, propane and butane.
  notation: 131012101111
  valid from: 2014-08-08
  valid till: 2020-10-03
derived from: NGL Fractionation & Marketing
  type: BicsLevel7Segment
  type: Classifier
  type: ContemporaryDerivation
  derived from: http://data.ga-group.nl/ics/bics/2020/13101012101111
  derived from: http://data.ga-group.nl/ics/bics/2024/13101012101111
  source accessed on: 2023-07-03T18:11:29Z
  source last accessed on: 2024-06-05T14:42:36Z
  definition: This segment includes companies that separate natural gas liquids (NGLs) into different liquids, such as ethane, propane, and butane.
  notation: 13101012101111
  valid from: 2020-10-03
source accessed on: 2023-07-03T18:11:29Z
source last accessed on: 2024-06-05T14:42:36Z
definition: This segment includes companies that separate natural gas liquids (NGLs) into different liquids, such as ethane, propane, and butane.
notation: 13101012101111
valid from: 2020-10-03

Nat Gas Liquids Pipelines
type: BicsLevel7Segment
type: Classifier
type: NamedIndividual
is level7 segment of: NGL Pipelines & Services
replaces: Nat Gas Liquids Pipelines
created with: infer-bics.sql
derived from: Nat Gas Liquids Pipelines
  type: BicsLevel6Segment
  type: Classifier
  type: AnachronousDerivation
  derived from: http://data.ga-group.nl/ics/bics/2014/131012101112
  source accessed on: 2019-12-03T20:05:01Z
  source last accessed on: 2019-12-03T20:05:01Z
  definition: This segment includes companies that own and operate pipelines for natural gas liquids. These companies may realize revenue through toll transportation and storage services or through purchasing and reselling of the underlying products. These companies utilize their distribution network to link raw natural gas processing plants to NGL fractionation plants.
  notation: 131012101112
  valid from: 2014-08-08
  valid till: 2020-10-03
derived from: Nat Gas Liquids Pipelines
  type: BicsLevel7Segment
  type: Classifier
  type: ContemporaryDerivation
  derived from: http://data.ga-group.nl/ics/bics/2020/13101012101112
  derived from: http://data.ga-group.nl/ics/bics/2024/13101012101112
  source accessed on: 2023-07-03T18:11:29Z
  source last accessed on: 2024-06-05T14:42:36Z
  definition: This segment includes companies that own and operate pipelines for natural gas liquids. These companies utilize their distribution network to link raw natural gas processing plants to NGL fractionation plants.
  notation: 13101012101112
  valid from: 2020-10-03
source accessed on: 2023-07-03T18:11:29Z
source last accessed on: 2024-06-05T14:42:36Z
definition: This segment includes companies that own and operate pipelines for natural gas liquids. These companies utilize their distribution network to link raw natural gas processing plants to NGL fractionation plants.
notation: 13101012101112
valid from: 2020-10-03

NGL Pipelines & Services
type: BicsLevel6Segment
type: Classifier
type: NamedIndividual
is level6 segment of: Oil & Liquid Rich Gas Pipelines
replaces: NGL Pipelines & Services
created with: infer-bics.sql
derived from: NGL Pipelines & Services
  type: BicsLevel5Segment
  type: Classifier
  type: AnachronousDerivation
  derived from: http://data.ga-group.nl/ics/bics/2014/1310121011
  source accessed on: 2019-12-03T20:05:01Z
  source last accessed on: 2019-12-03T20:05:01Z
  definition: This segment includes companies that transport, store and process raw natural gas and their NGL byproducts. These companies may realize revenue through toll transportation and storage services or through purchasing and reselling of the underlying products.
  notation: 1310121011
  valid from: 2014-08-08
  valid till: 2020-10-03
derived from: NGL Pipelines & Services
  type: BicsLevel6Segment
  type: Classifier
  type: ContemporaryDerivation
  derived from: http://data.ga-group.nl/ics/bics/2020/131010121011
  derived from: http://data.ga-group.nl/ics/bics/2024/131010121011
  source accessed on: 2023-07-03T18:11:29Z
  source last accessed on: 2024-06-05T14:42:36Z
  definition: This segment includes companies that transport, store, and process raw natural gas and their NGL byproducts.
  notation: 131010121011
  valid from: 2020-10-03
source accessed on: 2023-07-03T18:11:29Z
source last accessed on: 2024-06-05T14:42:36Z
definition: This segment includes companies that transport, store, and process raw natural gas and their NGL byproducts.
notation: 131010121011
valid from: 2020-10-03

Oil & Liquid Rich Gas Pipelines
type: BicsLevel5Segment
type: Classifier
type: NamedIndividual
is level5 segment of: Midstream - Oil & Gas
created with: infer-bics.sql
derived from: Oil & Liquid Rich Gas Pipelines
  type: BicsLevel4SubIndustry
  type: Classifier
  type: AnachronousDerivation
  derived from: http://data.ga-group.nl/ics/bics/2014/13101210
  source accessed on: 2019-12-03T20:05:01Z
  source last accessed on: 2019-12-03T20:05:01Z
  definition: This industry subgroup includes companies that own and operate pipelines and terminal facilities for oil and liquid rich gas. Also includes companies that process liquid rich gas into final end products. These companies may realize revenue through toll transportation and storage services or through purchasing and reselling of the underlying products.
  notation: 13101210
  valid from: 2014-08-08
  valid till: 2020-10-03
derived from: Oil & Liquid Rich Gas Pipelines
  type: BicsLevel5Segment
  type: Classifier
  type: ContemporaryDerivation
  derived from: http://data.ga-group.nl/ics/bics/2020/1310101210
  derived from: http://data.ga-group.nl/ics/bics/2024/1310101210
  source accessed on: 2023-07-03T18:11:29Z
  source last accessed on: 2024-06-05T14:42:36Z
  definition: This segment includes companies that own and operate pipelines and terminal facilities for oil and liquid rich gas. Also includes companies that process liquid rich gas into final end products.
  notation: 1310101210
  valid from: 2020-10-03
source accessed on: 2023-07-03T18:11:29Z
source last accessed on: 2024-06-05T14:42:36Z
definition: This segment includes companies that own and operate pipelines and terminal facilities for oil and liquid rich gas. Also includes companies that process liquid rich gas into final end products.
notation: 1310101210
valid from: 2020-10-03

Dry Natural Gas Pipelines
type: BicsLevel5Segment
type: Classifier
type: NamedIndividual
is level5 segment of: Midstream - Oil & Gas
created with: infer-bics.sql
derived from: Dry Natural Gas Pipelines
  type: BicsLevel4SubIndustry
  type: Classifier
  type: AnachronousDerivation
  derived from: http://data.ga-group.nl/ics/bics/2014/13101211
  source accessed on: 2019-12-03T20:05:01Z
  source last accessed on: 2019-12-03T20:05:01Z
  definition: This industry subgroup includes companies that own and operate pipelines for dry natural gas. These companies may realize revenue through toll transportation and storage services or through purchasing and reselling of the underlying products. These companies utilize their distribution network to link raw natural gas processing plants to utilities, liquefied natural gas (LNG) facilities and other end users.
  notation: 13101211
  valid from: 2014-08-08
  valid till: 2020-10-03
derived from: Dry Natural Gas Pipelines
  type: BicsLevel5Segment
  type: Classifier
  type: ContemporaryDerivation
  derived from: http://data.ga-group.nl/ics/bics/2020/1310101211
  derived from: http://data.ga-group.nl/ics/bics/2024/1310101211
  source accessed on: 2023-07-03T18:11:29Z
  source last accessed on: 2024-06-05T14:42:36Z
  definition: This segment includes companies that own and operate pipelines for dry natural gas. These companies utilize their distribution network to link raw natural gas processing plants to utilities, liquefied natural gas (LNG) facilities, and other end users.
  notation: 1310101211
  valid from: 2020-10-03
source accessed on: 2023-07-03T18:11:29Z
source last accessed on: 2024-06-05T14:42:36Z
definition: This segment includes companies that own and operate pipelines for dry natural gas. These companies utilize their distribution network to link raw natural gas processing plants to utilities, liquefied natural gas (LNG) facilities, and other end users.
notation: 1310101211
valid from: 2020-10-03

LNG Liquefaction
type: BicsLevel6Segment
type: Classifier
type: NamedIndividual
is level6 segment of: Liquefied Natural Gas (LNG)
replaces: LNG Liquefaction
created with: infer-bics.sql
derived from: LNG Liquefaction
  type: BicsLevel5Segment
  type: Classifier
  type: AnachronousDerivation
  derived from: http://data.ga-group.nl/ics/bics/2014/1310121210
  source accessed on: 2019-12-03T20:05:01Z
  source last accessed on: 2019-12-03T20:05:01Z
  definition: This segment includes companies that own or operate facilities where liquefied natural gas (LNG) is cooled to a liquid state for shipping.
  notation: 1310121210
  valid from: 2014-08-08
  valid till: 2020-10-03
derived from: LNG Liquefaction
  type: BicsLevel6Segment
  type: Classifier
  type: ContemporaryDerivation
  derived from: http://data.ga-group.nl/ics/bics/2020/131010121210
  derived from: http://data.ga-group.nl/ics/bics/2024/131010121210
  source accessed on: 2023-07-03T18:11:29Z
  source last accessed on: 2024-06-05T14:42:36Z
  definition: This segment includes companies that own or operate facilities where liquefied natural gas (LNG) is cooled to a liquid state for shipping.
  notation: 131010121210
  valid from: 2020-10-03
source accessed on: 2023-07-03T18:11:29Z
source last accessed on: 2024-06-05T14:42:36Z
definition: This segment includes companies that own or operate facilities where liquefied natural gas (LNG) is cooled to a liquid state for shipping.
notation: 131010121210
valid from: 2020-10-03

LNG Regasification
type: BicsLevel6Segment
type: Classifier
type: NamedIndividual
is level6 segment of: Liquefied Natural Gas (LNG)
replaces: LNG Regasification
created with: infer-bics.sql
derived from: LNG Regasification
  type: BicsLevel5Segment
  type: Classifier
  type: AnachronousDerivation
  derived from: http://data.ga-group.nl/ics/bics/2014/1310121211
  source accessed on: 2019-12-03T20:05:01Z
  source last accessed on: 2019-12-03T20:05:01Z
  definition: This segment includes companies that own or operate facilities where liquefied natural gas (LNG) is heated back to methane into a gaseous state for distribution to the transmission network.
  notation: 1310121211
  valid from: 2014-08-08
  valid till: 2020-10-03
derived from: LNG Regasification
  type: BicsLevel6Segment
  type: Classifier
  type: ContemporaryDerivation
  derived from: http://data.ga-group.nl/ics/bics/2020/131010121211
  derived from: http://data.ga-group.nl/ics/bics/2024/131010121211
  source accessed on: 2023-07-03T18:11:29Z
  source last accessed on: 2024-06-05T14:42:36Z
  definition: This segment includes companies that own or operate facilities where liquefied natural gas (LNG) is heated back to its gaseous state, making it ready for transmission and distribution along utility networks.
  notation: 131010121211
  valid from: 2020-10-03
source accessed on: 2023-07-03T18:11:29Z
source last accessed on: 2024-06-05T14:42:36Z
definition: This segment includes companies that own or operate facilities where liquefied natural gas (LNG) is heated back to its gaseous state, making it ready for transmission and distribution along utility networks.
notation: 131010121211
valid from: 2020-10-03

Liquefied Natural Gas (LNG)
type: BicsLevel5Segment
type: Classifier
type: NamedIndividual
is level5 segment of: Midstream - Oil & Gas
created with: infer-bics.sql
derived from: Liquefied Natural Gas (LNG)
  type: BicsLevel4SubIndustry
  type: Classifier
  type: AnachronousDerivation
  derived from: http://data.ga-group.nl/ics/bics/2014/13101212
  source accessed on: 2019-12-03T20:05:01Z
  source last accessed on: 2019-12-03T20:05:01Z
  definition: This industry subgroup includes companies that operate liquefied natural gas (LNG) infrastructure. LNG is methane (natural) gas, cryogenically cooled to ‒260 degrees F (‒162 degrees C), at which point the vapor condenses to a liquid suitable for waterborne transport.
  notation: 13101212
  valid from: 2014-08-08
  valid till: 2020-10-03
derived from: Liquefied Natural Gas (LNG)
  type: BicsLevel5Segment
  type: Classifier
  type: ContemporaryDerivation
  derived from: http://data.ga-group.nl/ics/bics/2020/1310101212
  derived from: http://data.ga-group.nl/ics/bics/2024/1310101212
  source accessed on: 2023-07-03T18:11:29Z
  source last accessed on: 2024-06-05T14:42:36Z
  definition: This segment includes companies that operate infrastructure used to for the transport of natural gas in its liquified state. Includes infrastructure used for the liquification, storage, tanker loading and offloading, and regassification of liquefied natural gas (LNG).
  notation: 1310101212
  valid from: 2020-10-03
source accessed on: 2023-07-03T18:11:29Z
source last accessed on: 2024-06-05T14:42:36Z
definition: This segment includes companies that operate infrastructure used to for the transport of natural gas in its liquified state. Includes infrastructure used for the liquification, storage, tanker loading and offloading, and regassification of liquefied natural gas (LNG).
notation: 1310101212
valid from: 2020-10-03

Midstream - Oil & Gas
type: BicsLevel4SubIndustry
type: Classifier
type: NamedIndividual
replaces: Midstream - Oil & Gas
created with: infer-bics.sql
derived from: Midstream - Oil & Gas
  type: BicsLevel3Industry
  type: Classifier
  type: AnachronousDerivation
  derived from: http://data.ga-group.nl/ics/bics/2014/131012
  source accessed on: 2019-12-03T20:05:01Z
  source last accessed on: 2019-12-03T20:05:01Z
  definition: This industry includes companies that transport oil, oil products and natural gas through pipelines. This segment also includes companies that operate bulk station terminals.
  notation: 131012
  valid from: 2014-08-08
  valid till: 2020-10-03
derived from: Midstream - Oil & Gas
  type: BicsLevel4SubIndustry
  type: Classifier
  type: ContemporaryDerivation
  derived from: http://data.ga-group.nl/ics/bics/2020/13101012
  derived from: http://data.ga-group.nl/ics/bics/2024/13101012
  source accessed on: 2023-07-03T18:11:29Z
  source last accessed on: 2024-06-05T14:42:36Z
  definition: This industry subgroup includes companies that own and operate infrastructure used to transport oil, oil products, and natural gas. These companies may realize revenue through toll transportation and storage services or through purchasing and reselling the underlying products after transportation.
  notation: 13101012
  valid from: 2020-10-03
source accessed on: 2023-07-03T18:11:29Z
source last accessed on: 2024-06-05T14:42:36Z
definition: This industry subgroup includes companies that own and operate infrastructure used to transport oil, oil products, and natural gas. These companies may realize revenue through toll transportation and storage services or through purchasing and reselling the underlying products after transportation.
notation: 13101012
valid from: 2020-10-03

Petroleum Refining
type: BicsLevel5Segment
type: Classifier
type: NamedIndividual
is level5 segment of: Refining & Marketing
created with: infer-bics.sql
derived from: Petroleum Refining
  type: BicsLevel4SubIndustry
  type: Classifier
  type: AnachronousDerivation
  derived from: http://data.ga-group.nl/ics/bics/2014/13101410
  source accessed on: 2019-12-03T20:05:01Z
  source last accessed on: 2019-12-03T20:05:01Z
  definition: This industry subgroup includes companies that refine crude oil feedstock and other products into various distillates. These companies own and operate oil refineries. Excludes petrochemicals (see Organic Base Chem & Interms).
  notation: 13101410
  valid from: 2014-08-08
  valid till: 2020-10-03
derived from: Petroleum Refining
  type: BicsLevel5Segment
  type: Classifier
  type: ContemporaryDerivation
  derived from: http://data.ga-group.nl/ics/bics/2020/1310101310
  derived from: http://data.ga-group.nl/ics/bics/2024/1310101310
  source accessed on: 2023-07-03T18:11:29Z
  source last accessed on: 2024-06-05T14:42:36Z
  definition: This segment includes companies that own and operate refineries which produce refined petroleum product such as gasoline, liquefied petroleum gas, diesel, and kerosene. Excludes petrochemicals (see Organic Chem & Intermediates) or lubricants (see Fluid & Lubricant Additives).
  notation: 1310101310
  valid from: 2020-10-03
source accessed on: 2023-07-03T18:11:29Z
source last accessed on: 2024-06-05T14:42:36Z
definition: This segment includes companies that own and operate refineries which produce refined petroleum product such as gasoline, liquefied petroleum gas, diesel, and kerosene. Excludes petrochemicals (see Organic Chem & Intermediates) or lubricants (see Fluid & Lubricant Additives).
notation: 1310101310
valid from: 2020-10-03

Company Owned Stations
type: BicsLevel7Segment
type: Classifier
type: NamedIndividual
is level7 segment of: Petroleum Retailers
replaces: Company Owned Stations
created with: infer-bics.sql
derived from: Company Owned Stations
  type: BicsLevel6Segment
  type: Classifier
  type: AnachronousDerivation
  derived from: http://data.ga-group.nl/ics/bics/2014/131014111010
  source accessed on: 2019-12-03T20:05:01Z
  source last accessed on: 2019-12-03T20:05:01Z
  definition: This segment includes companies that own and operate gas stations that are integrated with an oil and gas company. Typically, these would be retailing arms of integrated oil or petroleum refining companies.
  notation: 131014111010
  valid from: 2014-08-08
  valid till: 2020-10-03
derived from: Company Owned Stations
  type: BicsLevel7Segment
  type: Classifier
  type: ContemporaryDerivation
  derived from: http://data.ga-group.nl/ics/bics/2020/13101013111010
  derived from: http://data.ga-group.nl/ics/bics/2024/13101013111010
  source accessed on: 2023-07-03T18:11:29Z
  source last accessed on: 2024-06-05T14:42:36Z
  definition: This segment includes companies that own and operate gas stations that are integrated with an oil and gas company. Typically, these would be retailing arms of integrated oil or petroleum refining companies.
  notation: 13101013111010
  valid from: 2020-10-03
source accessed on: 2023-07-03T18:11:29Z
source last accessed on: 2024-06-05T14:42:36Z
definition: This segment includes companies that own and operate gas stations that are integrated with an oil and gas company. Typically, these would be retailing arms of integrated oil or petroleum refining companies.
notation: 13101013111010
valid from: 2020-10-03

Filling Stations
type: BicsLevel7Segment
type: Classifier
type: NamedIndividual
is level7 segment of: Petroleum Retailers
replaces: Filling Stations
created with: infer-bics.sql
derived from: Filling Stations
  type: BicsLevel6Segment
  type: Classifier
  type: AnachronousDerivation
  derived from: http://data.ga-group.nl/ics/bics/2014/131014111011
  source accessed on: 2019-12-03T20:05:01Z
  source last accessed on: 2019-12-03T20:05:01Z
  definition: This segment includes companies that own and operate independent gas stations.
  notation: 131014111011
  valid from: 2014-08-08
  valid till: 2020-10-03
derived from: Filling Stations
  type: BicsLevel7Segment
  type: Classifier
  type: ContemporaryDerivation
  derived from: http://data.ga-group.nl/ics/bics/2020/13101013111011
  derived from: http://data.ga-group.nl/ics/bics/2024/13101013111011
  source accessed on: 2023-07-03T18:11:29Z
  source last accessed on: 2024-06-05T14:42:36Z
  definition: This segment includes companies that own and operate independent gas stations.
  notation: 13101013111011
  valid from: 2020-10-03
source accessed on: 2023-07-03T18:11:29Z
source last accessed on: 2024-06-05T14:42:36Z
definition: This segment includes companies that own and operate independent gas stations.
notation: 13101013111011
valid from: 2020-10-03

Petroleum Retailers
type: BicsLevel6Segment
type: Classifier
type: NamedIndividual
is level6 segment of: Petroleum Marketing
replaces: Petroleum Retailers
created with: infer-bics.sql
derived from: Petroleum Retailers
  type: BicsLevel5Segment
  type: Classifier
  type: AnachronousDerivation
  derived from: http://data.ga-group.nl/ics/bics/2014/1310141110
  source accessed on: 2019-12-03T20:05:01Z
  source last accessed on: 2019-12-03T20:05:01Z
  definition: This segment includes companies that sell and distribute gasoline products on the retail level.
  notation: 1310141110
  valid from: 2014-08-08
  valid till: 2020-10-03
derived from: Petroleum Retailers
  type: BicsLevel6Segment
  type: Classifier
  type: ContemporaryDerivation
  derived from: http://data.ga-group.nl/ics/bics/2020/131010131110
  derived from: http://data.ga-group.nl/ics/bics/2024/131010131110
  source accessed on: 2023-07-03T18:11:29Z
  source last accessed on: 2024-06-05T14:42:36Z
  definition: This segment includes companies that retail refined petroleum products through storefront operations.
  notation: 131010131110
  valid from: 2020-10-03
source accessed on: 2023-07-03T18:11:29Z
source last accessed on: 2024-06-05T14:42:36Z
definition: This segment includes companies that retail refined petroleum products through storefront operations.
notation: 131010131110
valid from: 2020-10-03

Petroleum Wholesalers
type: BicsLevel6Segment
type: Classifier
type: NamedIndividual
is level6 segment of: Petroleum Marketing
replaces: Petroleum Wholesalers
created with: infer-bics.sql
derived from: Petroleum Wholesalers
  type: BicsLevel5Segment
  type: Classifier
  type: AnachronousDerivation
  derived from: http://data.ga-group.nl/ics/bics/2014/1310141111
  source accessed on: 2019-12-03T20:05:01Z
  source last accessed on: 2019-12-03T20:05:01Z
  definition: This segment includes companies that wholesale refined petroleum products.
  notation: 1310141111
  valid from: 2014-08-08
  valid till: 2020-10-03
derived from: Petroleum Wholesalers
  type: BicsLevel6Segment
  type: Classifier
  type: ContemporaryDerivation
  derived from: http://data.ga-group.nl/ics/bics/2020/131010131111
  derived from: http://data.ga-group.nl/ics/bics/2024/131010131111
  source accessed on: 2023-07-03T18:11:29Z
  source last accessed on: 2024-06-05T14:42:36Z
  definition: This segment includes companies that wholesale and distribute refined petroleum products. These companies do not produce their own products but instead distribute other companies' products in bulk to intermediaries in the supply chain or to commercial and industrial clients.
  notation: 131010131111
  valid from: 2020-10-03
source accessed on: 2023-07-03T18:11:29Z
source last accessed on: 2024-06-05T14:42:36Z
definition: This segment includes companies that wholesale and distribute refined petroleum products. These companies do not produce their own products but instead distribute other companies' products in bulk to intermediaries in the supply chain or to commercial and industrial clients.
notation: 131010131111
valid from: 2020-10-03

Petroleum Marketing
type: BicsLevel5Segment
type: Classifier
type: NamedIndividual
is level5 segment of: Refining & Marketing
created with: infer-bics.sql
derived from: Petroleum Marketing
  type: BicsLevel4SubIndustry
  type: Classifier
  type: AnachronousDerivation
  derived from: http://data.ga-group.nl/ics/bics/2014/13101411
  source accessed on: 2019-12-03T20:05:01Z
  source last accessed on: 2019-12-03T20:05:01Z
  definition: This industry subgroup includes companies that sell and distribute petroleum products both on the wholesale and retail level.
  notation: 13101411
  valid from: 2014-08-08
  valid till: 2020-10-03
derived from: Petroleum Marketing
  type: BicsLevel5Segment
  type: Classifier
  type: ContemporaryDerivation
  derived from: http://data.ga-group.nl/ics/bics/2020/1310101311
  derived from: http://data.ga-group.nl/ics/bics/2024/1310101311
  source accessed on: 2023-07-03T18:11:29Z
  source last accessed on: 2024-06-05T14:42:36Z
  definition: This segment includes companies that provide distribution channels for refined petroleum products.
  notation: 1310101311
  valid from: 2020-10-03
source accessed on: 2023-07-03T18:11:29Z
source last accessed on: 2024-06-05T14:42:36Z
definition: This segment includes companies that provide distribution channels for refined petroleum products.
notation: 1310101311
valid from: 2020-10-03

Refining & Marketing
type: BicsLevel4SubIndustry
type: Classifier
type: NamedIndividual
replaces: Refining & Marketing
created with: infer-bics.sql
derived from: Refining & Marketing
  type: BicsLevel3Industry
  type: Classifier
  type: AnachronousDerivation
  derived from: http://data.ga-group.nl/ics/bics/2014/131014
  source accessed on: 2019-12-03T20:05:01Z
  source last accessed on: 2019-12-03T20:05:01Z
  definition: This industry includes companies that use refining techniques to separate crude petroleum into distillate products, such as gasoline and kerosene. They also market these products downstream or sell them through wholesalers and retail gas stations.
  notation: 131014
  valid from: 2014-08-08
  valid till: 2020-10-03
derived from: Refining & Marketing
  type: BicsLevel4SubIndustry
  type: Classifier
  type: ContemporaryDerivation
  derived from: http://data.ga-group.nl/ics/bics/2020/13101013
  derived from: http://data.ga-group.nl/ics/bics/2024/13101013
  source accessed on: 2023-07-03T18:11:29Z
  source last accessed on: 2024-06-05T14:42:36Z
  definition: This industry subgroup includes companies that process crude petroleum into refined petroleum products, such as gasoline and kerosene. Also includes companies that market these refined petroleum products to downstream users.
  notation: 13101013
  valid from: 2020-10-03
source accessed on: 2023-07-03T18:11:29Z
source last accessed on: 2024-06-05T14:42:36Z
definition: This industry subgroup includes companies that process crude petroleum into refined petroleum products, such as gasoline and kerosene. Also includes companies that market these refined petroleum products to downstream users.
notation: 13101013
valid from: 2020-10-03

Oil & Gas Supply Chain
type: BicsLevel3Industry
type: Classifier
type: NamedIndividual
is industry of: Oil & Gas
is replaced by: Integrated Oils
created with: infer-bics.sql
derived from: Integrated Oils
  type: BicsLevel3Industry
  type: Classifier
  type: ContemporaryDerivation
  derived from: http://data.ga-group.nl/ics/bics/2014/131010
  source accessed on: 2019-12-03T20:05:01Z
  source last accessed on: 2019-12-03T20:05:01Z
  definition: This industry includes companies that are considered integrated oil producers. These companies are involved in all aspects of the oil industry, from exploration and production to distribution and chemical production.
  notation: 131010
  valid from: 2014-08-08
  valid till: 2020-10-03
derived from: Oil & Gas Producers
  type: BicsLevel3Industry
  type: Classifier
  type: ContemporaryDerivation
  derived from: http://data.ga-group.nl/ics/bics/2020/131010
  source accessed on: 2023-07-03T18:11:29Z
  source last accessed on: 2023-07-03T18:11:29Z
  definition: This industry includes companies that extract, transport, and/or process fossil fuels and have a direct commodity exposure.
  notation: 131010
  valid from: 2020-10-03
  valid till: 2024-06-07
derived from: Oil & Gas Supply Chain
  type: BicsLevel3Industry
  type: Classifier
  type: ContemporaryDerivation
  derived from: http://data.ga-group.nl/ics/bics/2024/131010
  source accessed on: 2024-06-05T14:42:36Z
  source last accessed on: 2024-06-05T14:42:36Z
  definition: This industry includes companies that extract, transport, process, wholesale, distribute, or retail fossil fuel energy resources.
  notation: 131010
  valid from: 2024-06-07
source accessed on: 2019-12-03T20:05:01Z
source last accessed on: 2024-06-05T14:42:36Z
definition: This industry includes companies that extract, transport, process, wholesale, distribute, or retail fossil fuel energy resources.
notation: 131010
valid from: 2014-08-08

Onshore Drilling
type: BicsLevel5Segment
type: Classifier
type: NamedIndividual
is level5 segment of: Drilling & Drilling Support
is replaced by: Crude Oil Production
replaces: Onshore Drilling
created with: infer-bics.sql
derived from: Crude Oil Production
  type: BicsLevel5Segment
  type: Classifier
  type: ContemporaryDerivation
  derived from: http://data.ga-group.nl/ics/bics/2014/1310111010
  source accessed on: 2019-12-03T20:05:01Z
  source last accessed on: 2019-12-03T20:05:01Z
  definition: This segment includes companies that explore and develop crude oil deposits. Such deposits include those found on land and sea.
  notation: 1310111010
  valid from: 2014-08-08
  valid till: 2020-10-03
derived from: Onshore Drilling
  type: BicsLevel5Segment
  type: Classifier
  type: AnachronousDerivation
  derived from: http://data.ga-group.nl/ics/bics/2014/1310151012
  source accessed on: 2019-12-03T20:05:01Z
  source last accessed on: 2019-12-03T20:05:01Z
  definition: This segment includes companies that drill for oil and natural gas onshore on a contract basis.
  notation: 1310151012
  valid from: 2014-08-08
  valid till: 2020-10-03
derived from: Onshore Drilling
  type: BicsLevel5Segment
  type: Classifier
  type: ContemporaryDerivation
  derived from: http://data.ga-group.nl/ics/bics/2020/1310111010
  derived from: http://data.ga-group.nl/ics/bics/2024/1310111010
  source accessed on: 2023-07-03T18:11:29Z
  source last accessed on: 2024-06-05T14:42:36Z
  definition: This segment includes companies that drill for oil and natural gas onshore on a contract basis.
  notation: 1310111010
  valid from: 2020-10-03
source accessed on: 2019-12-03T20:05:01Z
source last accessed on: 2024-06-05T14:42:36Z
definition: This segment includes companies that drill for oil and natural gas onshore on a contract basis.
notation: 1310111010
valid from: 2014-08-08

Offshore Drilling
type: BicsLevel5Segment
type: Classifier
type: NamedIndividual
is level5 segment of: Drilling & Drilling Support
is replaced by: Oil Sands Production
replaces: Offshore Drilling
created with: infer-bics.sql
derived from: Oil Sands Production
  type: BicsLevel5Segment
  type: Classifier
  type: ContemporaryDerivation
  derived from: http://data.ga-group.nl/ics/bics/2014/1310111011
  source accessed on: 2019-12-03T20:05:01Z
  source last accessed on: 2019-12-03T20:05:01Z
  definition: This segment includes companies that explore for and develop oil sands deposits.
  notation: 1310111011
  valid from: 2014-08-08
  valid till: 2020-10-03
derived from: Offshore Drilling
  type: BicsLevel5Segment
  type: Classifier
  type: AnachronousDerivation
  derived from: http://data.ga-group.nl/ics/bics/2014/1310151011
  source accessed on: 2019-12-03T20:05:01Z
  source last accessed on: 2019-12-03T20:05:01Z
  definition: This segment includes companies that drill for oil and natural gas offshore on a contract basis. These companies own and operate various drilling rigs in order to provide these services for exploration and production companies.
  notation: 1310151011
  valid from: 2014-08-08
  valid till: 2020-10-03
derived from: Offshore Drilling
  type: BicsLevel5Segment
  type: Classifier
  type: ContemporaryDerivation
  derived from: http://data.ga-group.nl/ics/bics/2020/1310111011
  derived from: http://data.ga-group.nl/ics/bics/2024/1310111011
  source accessed on: 2023-07-03T18:11:29Z
  source last accessed on: 2024-06-05T14:42:36Z
  definition: This segment includes companies that drill for oil and natural gas offshore on a contract basis. These companies own and operate various drilling rigs in order to provide these services for exploration and production companies.
  notation: 1310111011
  valid from: 2020-10-03
source accessed on: 2019-12-03T20:05:01Z
source last accessed on: 2024-06-05T14:42:36Z
definition: This segment includes companies that drill for oil and natural gas offshore on a contract basis. These companies own and operate various drilling rigs in order to provide these services for exploration and production companies.
notation: 1310111011
valid from: 2014-08-08

Drill Support
type: BicsLevel5Segment
type: Classifier
type: NamedIndividual
is level5 segment of: Drilling & Drilling Support
is replaced by: Natural Gas Liquids Production
replaces: Drill Support
created with: infer-bics.sql
derived from: Natural Gas Liquids Production
  type: BicsLevel5Segment
  type: Classifier
  type: ContemporaryDerivation
  derived from: http://data.ga-group.nl/ics/bics/2014/1310111012
  source accessed on: 2019-12-03T20:05:01Z
  source last accessed on: 2019-12-03T20:05:01Z
  definition: This segment includes companies that produce natural gas liquids (NGLs).
  notation: 1310111012
  valid from: 2014-08-08
  valid till: 2020-10-03
derived from: Drill Support
  type: BicsLevel5Segment
  type: Classifier
  type: AnachronousDerivation
  derived from: http://data.ga-group.nl/ics/bics/2014/1310151010
  source accessed on: 2019-12-03T20:05:01Z
  source last accessed on: 2019-12-03T20:05:01Z
  definition: This segment includes companies that provide support services for drilling operations or manufacture specialized drilling equipment. Support services include supplying of oil country tubular goods, casing, drilling and completion fluids, and equipment to drilling platforms. Also includes services such as cementing, logging-while-drilling, specialty waste management, inspection and transportation services. Specialized drilling hardware and equipment includes drill bits, reamers and stabilizers.
  notation: 1310151010
  valid from: 2014-08-08
  valid till: 2020-10-03
derived from: Drill Support
  type: BicsLevel5Segment
  type: Classifier
  type: ContemporaryDerivation
  derived from: http://data.ga-group.nl/ics/bics/2020/1310111012
  derived from: http://data.ga-group.nl/ics/bics/2024/1310111012
  source accessed on: 2023-07-03T18:11:29Z
  source last accessed on: 2024-06-05T14:42:36Z
  definition: This segment includes companies that provide support services for drilling operations or manufacture specialized drilling equipment. Support services include supplying oil country tubular goods, casing, drilling and completion fluids, and equipment to drilling platforms. Also includes services such as cementing, logging-while-drilling, specialty waste management, inspection, and transportation services. Specialized drilling hardware and equipment includes drill bits, reamers, and stabilizers.
  notation: 1310111012
  valid from: 2020-10-03
source accessed on: 2019-12-03T20:05:01Z
source last accessed on: 2024-06-05T14:42:36Z
definition: This segment includes companies that provide support services for drilling operations or manufacture specialized drilling equipment. Support services include supplying oil country tubular goods, casing, drilling and completion fluids, and equipment to drilling platforms. Also includes services such as cementing, logging-while-drilling, specialty waste management, inspection, and transportation services. Specialized drilling hardware and equipment includes drill bits, reamers, and stabilizers.
notation: 1310111012
valid from: 2014-08-08

Natural Gas Production
type: BicsLevel5Segment
type: Classifier
type: NamedIndividual
is level5 segment of: Drilling & Drilling Support
is replaced by: Natural Gas Production
created with: infer-bics.sql
derived from: Natural Gas Production
  type: BicsLevel5Segment
  type: Classifier
  type: ContemporaryDerivation
  derived from: http://data.ga-group.nl/ics/bics/2014/1310111013
  source accessed on: 2019-12-03T20:05:01Z
  source last accessed on: 2019-12-03T20:05:01Z
  definition: This segment includes companies that explore and develop natural gas deposits.
  notation: 1310111013
  valid from: 2014-08-08
  valid till: 2020-10-03
source accessed on: 2019-12-03T20:05:01Z
source last accessed on: 2019-12-03T20:05:01Z
definition: This segment includes companies that explore and develop natural gas deposits.
notation: 1310111013
valid from: 2014-08-08
valid till: 2020-10-03

Negative Royalties
type: BicsLevel5Segment
type: Classifier
type: NamedIndividual
is level5 segment of: Drilling & Drilling Support
is replaced by: Negative Royalties
created with: infer-bics.sql
derived from: Negative Royalties
  type: BicsLevel5Segment
  type: Classifier
  type: ContemporaryDerivation
  derived from: http://data.ga-group.nl/ics/bics/2014/1310111014
  source accessed on: 2019-12-03T20:05:01Z
  source last accessed on: 2019-12-03T20:05:01Z
  definition: This segment includes companies that pay royalty fees to government bodies for the production of fossil fuels.
  notation: 1310111014
  valid from: 2014-08-08
  valid till: 2020-10-03
source accessed on: 2019-12-03T20:05:01Z
source last accessed on: 2019-12-03T20:05:01Z
definition: This segment includes companies that pay royalty fees to government bodies for the production of fossil fuels.
notation: 1310111014
valid from: 2014-08-08
valid till: 2020-10-03

Drilling & Drilling Support
type: BicsLevel4SubIndustry
type: Classifier
type: NamedIndividual
created with: infer-bics.sql
derived from: Crude Oil & Natural Gas E&P
  type: BicsLevel4SubIndustry
  type: Classifier
  type: ContemporaryDerivation
  derived from: http://data.ga-group.nl/ics/bics/2014/13101110
  source accessed on: 2019-12-03T20:05:01Z
  source last accessed on: 2019-12-03T20:05:01Z
  definition: This industry subgroup includes companies that explore and develop deposits of crude oil and natural gas.
  notation: 13101110
  valid from: 2014-08-08
  valid till: 2020-10-03
derived from: Drilling & Drilling Support
  type: BicsLevel4SubIndustry
  type: Classifier
  type: AnachronousDerivation
  derived from: http://data.ga-group.nl/ics/bics/2014/13101510
  source accessed on: 2019-12-03T20:05:01Z
  source last accessed on: 2019-12-03T20:05:01Z
  definition: This industry subgroup includes companies that provide contract drilling services or provide support services for drilling operations and drilling platforms.
  notation: 13101510
  valid from: 2014-08-08
  valid till: 2020-10-03
derived from: Drilling & Drilling Support
  type: BicsLevel4SubIndustry
  type: Classifier
  type: ContemporaryDerivation
  derived from: http://data.ga-group.nl/ics/bics/2020/13101110
  derived from: http://data.ga-group.nl/ics/bics/2024/13101110
  source accessed on: 2023-07-03T18:11:29Z
  source last accessed on: 2024-06-05T14:42:36Z
  definition: This industry subgroup includes companies that provide contract drilling services or provide support services for drilling operations and drilling platforms.
  notation: 13101110
  valid from: 2020-10-03
source accessed on: 2019-12-03T20:05:01Z
source last accessed on: 2024-06-05T14:42:36Z
definition: This industry subgroup includes companies that provide contract drilling services or provide support services for drilling operations and drilling platforms.
notation: 13101110
valid from: 2014-08-08

Onshore Oilfield Services
type: BicsLevel5Segment
type: Classifier
type: NamedIndividual
is level5 segment of: Oilfield Services & Equipment
replaces: Diversified Oilfield Svcs
created with: infer-bics.sql
derived from: Diversified Oilfield Svcs
  type: BicsLevel5Segment
  type: Classifier
  type: AnachronousDerivation
  derived from: http://data.ga-group.nl/ics/bics/2014/1310151110
  source accessed on: 2019-12-03T20:05:01Z
  source last accessed on: 2019-12-03T20:05:01Z
  definition: This segment includes companies that provide a diversified portfolio of services and equipment to meet the needs of the exploration and production clients.
  notation: 1310151110
  valid from: 2014-08-08
  valid till: 2020-10-03
derived from: Onshore Oilfield Services
  type: BicsLevel5Segment
  type: Classifier
  type: ContemporaryDerivation
  derived from: http://data.ga-group.nl/ics/bics/2020/1310111110
  derived from: http://data.ga-group.nl/ics/bics/2024/1310111110
  source accessed on: 2023-07-03T18:11:29Z
  source last accessed on: 2024-06-05T14:42:36Z
  definition: This segment includes companies that provide oilfield services and equipment in onshore applications.
  notation: 1310111110
  valid from: 2020-10-03
source accessed on: 2023-07-03T18:11:29Z
source last accessed on: 2024-06-05T14:42:36Z
definition: This segment includes companies that provide oilfield services and equipment in onshore applications.
notation: 1310111110
valid from: 2020-10-03

Subsea & Offshore Oilfield Svcs
type: BicsLevel5Segment
type: Classifier
type: NamedIndividual
is level5 segment of: Oilfield Services & Equipment
replaces: Subsea Oilfield Services
created with: infer-bics.sql
derived from: Subsea Oilfield Services
  type: BicsLevel5Segment
  type: Classifier
  type: AnachronousDerivation
  derived from: http://data.ga-group.nl/ics/bics/2014/1310151111
  source accessed on: 2019-12-03T20:05:01Z
  source last accessed on: 2019-12-03T20:05:01Z
  definition: This segment includes companies that provide oilfield services in subsea applications. Includes underwater installation, inspection, repair and decommissioning services of subsea pipelines, wells and umbilicals.
  notation: 1310151111
  valid from: 2014-08-08
  valid till: 2020-10-03
derived from: Subsea & Offshore Oilfield Svcs
  type: BicsLevel5Segment
  type: Classifier
  type: ContemporaryDerivation
  derived from: http://data.ga-group.nl/ics/bics/2020/1310111111
  derived from: http://data.ga-group.nl/ics/bics/2024/1310111111
  source accessed on: 2023-07-03T18:11:29Z
  source last accessed on: 2024-06-05T14:42:36Z
  definition: This segment includes companies that provide oilfield services and equipment in offshore and subsea applications. Includes underwater installation, inspection, repair, and decommissioning services of subsea pipelines, wells, and umbilicals.
  notation: 1310111111
  valid from: 2020-10-03
source accessed on: 2023-07-03T18:11:29Z
source last accessed on: 2024-06-05T14:42:36Z
definition: This segment includes companies that provide oilfield services and equipment in offshore and subsea applications. Includes underwater installation, inspection, repair, and decommissioning services of subsea pipelines, wells, and umbilicals.
notation: 1310111111
valid from: 2020-10-03

Seismic Surveying
type: BicsLevel5Segment
type: Classifier
type: NamedIndividual
is level5 segment of: Oilfield Services & Equipment
replaces: Seismic Surveying
created with: infer-bics.sql
derived from: Seismic Surveying
  type: BicsLevel5Segment
  type: Classifier
  type: AnachronousDerivation
  derived from: http://data.ga-group.nl/ics/bics/2014/1310151112
  source accessed on: 2019-12-03T20:05:01Z
  source last accessed on: 2019-12-03T20:05:01Z
  definition: This segment includes companies that survey oil and natural gas fields through seismic technology.
  notation: 1310151112
  valid from: 2014-08-08
  valid till: 2020-10-03
derived from: Seismic Surveying
  type: BicsLevel5Segment
  type: Classifier
  type: ContemporaryDerivation
  derived from: http://data.ga-group.nl/ics/bics/2020/1310111112
  derived from: http://data.ga-group.nl/ics/bics/2024/1310111112
  source accessed on: 2023-07-03T18:11:29Z
  source last accessed on: 2024-06-05T14:42:36Z
  definition: This segment includes companies that survey oil and natural gas fields through seismic technology.
  notation: 1310111112
  valid from: 2020-10-03
source accessed on: 2023-07-03T18:11:29Z
source last accessed on: 2024-06-05T14:42:36Z
definition: This segment includes companies that survey oil and natural gas fields through seismic technology.
notation: 1310111112
valid from: 2020-10-03

Oilfield Services & Equipment
type: BicsLevel4SubIndustry
type: Classifier
type: NamedIndividual
created with: infer-bics.sql
derived from: Oil & Natural Gas Mkt & Trading
  type: BicsLevel4SubIndustry
  type: Classifier
  type: ContemporaryDerivation
  derived from: http://data.ga-group.nl/ics/bics/2014/13101111
  source accessed on: 2019-12-03T20:05:01Z
  source last accessed on: 2019-12-03T20:05:01Z
  definition: This industry subgroup includes segments of exploration and production companies that market and resell third-party purchased crude oil and natural gas volumes.
  notation: 13101111
  valid from: 2014-08-08
  valid till: 2020-10-03
derived from: Oilfield Services & Equipment
  type: BicsLevel4SubIndustry
  type: Classifier
  type: AnachronousDerivation
  derived from: http://data.ga-group.nl/ics/bics/2014/13101511
  source accessed on: 2019-12-03T20:05:01Z
  source last accessed on: 2019-12-03T20:05:01Z
  definition: This industry subgroup includes companies that provide services or manufacture equipment for non-drilling applications. Includes services such as well servicing and maintenance, fluid handling, snubbing, coiled-tubing, pressure pumping, wire-line, artificial lift and production testing. Also includes suppliers or manufacturers of subsea, completion and surface equipment.
  notation: 13101511
  valid from: 2014-08-08
  valid till: 2020-10-03
derived from: Oilfield Services & Equipment
  type: BicsLevel4SubIndustry
  type: Classifier
  type: ContemporaryDerivation
  derived from: http://data.ga-group.nl/ics/bics/2020/13101111
  derived from: http://data.ga-group.nl/ics/bics/2024/13101111
  source accessed on: 2023-07-03T18:11:29Z
  source last accessed on: 2024-06-05T14:42:36Z
  definition: This industry subgroup includes companies that provide services or manufacture equipment for non-drilling applications. Includes services such as well servicing and maintenance, fluid handling, snubbing, coiled-tubing, pressure pumping, wire-line, artificial lift, and production testing. Also includes suppliers or manufacturers of subsea, completion, and surface equipment and hydraulic fracturing proppants.
  notation: 13101111
  valid from: 2020-10-03
source accessed on: 2019-12-03T20:05:01Z
source last accessed on: 2024-06-05T14:42:36Z
definition: This industry subgroup includes companies that provide services or manufacture equipment for non-drilling applications. Includes services such as well servicing and maintenance, fluid handling, snubbing, coiled-tubing, pressure pumping, wire-line, artificial lift, and production testing. Also includes suppliers or manufacturers of subsea, completion, and surface equipment and hydraulic fracturing proppants.
notation: 13101111
valid from: 2014-08-08

Royalty Income - Oil & Gas
type: BicsLevel4SubIndustry
type: Classifier
type: NamedIndividual
created with: infer-bics.sql
derived from: Royalty Income - Oil & Gas
  type: BicsLevel4SubIndustry
  type: Classifier
  type: ContemporaryDerivation
  derived from: http://data.ga-group.nl/ics/bics/2014/13101112
  source accessed on: 2019-12-03T20:05:01Z
  source last accessed on: 2019-12-03T20:05:01Z
  definition: This industry subgroup includes companies that receive royalties from energy properties, such as oil fields.
  notation: 13101112
  valid from: 2014-08-08
  valid till: 2020-10-03
source accessed on: 2019-12-03T20:05:01Z
source last accessed on: 2019-12-03T20:05:01Z
definition: This industry subgroup includes companies that receive royalties from energy properties, such as oil fields.
notation: 13101112
valid from: 2014-08-08
valid till: 2020-10-03

Oil & Gas Services & Equip
type: BicsLevel3Industry
type: Classifier
type: NamedIndividual
is industry of: Oil & Gas
is replaced by: Exploration & Production
replaces: Oil & Gas Services & Equip
created with: infer-bics.sql
derived from: Exploration & Production
  type: BicsLevel3Industry
  type: Classifier
  type: ContemporaryDerivation
  derived from: http://data.ga-group.nl/ics/bics/2014/131011
  source accessed on: 2019-12-03T20:05:01Z
  source last accessed on: 2019-12-03T20:05:01Z
  definition: This industry includes companies that explore for, extract or produce energy products. Such products include crude oil, natural gas, liquefied natural gas and liquefied petroleum. This industry also includes royalties received from these energy properties.
  notation: 131011
  valid from: 2014-08-08
  valid till: 2020-10-03
derived from: Oil & Gas Services & Equip
  type: BicsLevel3Industry
  type: Classifier
  type: AnachronousDerivation
  derived from: http://data.ga-group.nl/ics/bics/2014/131015
  source accessed on: 2019-12-03T20:05:01Z
  source last accessed on: 2019-12-03T20:05:01Z
  definition: This industry includes companies that specialize in providing support services or manufacture equipment for oil and natural gas exploration and production companies.
  notation: 131015
  valid from: 2014-08-08
  valid till: 2020-10-03
derived from: Oil & Gas Services & Equip
  type: BicsLevel3Industry
  type: Classifier
  type: ContemporaryDerivation
  derived from: http://data.ga-group.nl/ics/bics/2020/131011
  derived from: http://data.ga-group.nl/ics/bics/2024/131011
  source accessed on: 2023-07-03T18:11:29Z
  source last accessed on: 2024-06-05T14:42:36Z
  definition: This industry includes companies that specialize in providing support services or manufacture equipment for oil and natural gas exploration and production companies.
  notation: 131011
  valid from: 2020-10-03
source accessed on: 2019-12-03T20:05:01Z
source last accessed on: 2024-06-05T14:42:36Z
definition: This industry includes companies that specialize in providing support services or manufacture equipment for oil and natural gas exploration and production companies.
notation: 131011
valid from: 2014-08-08

Crude Oil Pipelines & Storage
type: BicsLevel6Segment
type: Classifier
type: NamedIndividual
is level6 segment of: Oil Pipelines & Storage
is replaced by: Crude Oil Pipelines & Storage
created with: infer-bics.sql
derived from: Crude Oil Pipelines & Storage
  type: BicsLevel6Segment
  type: Classifier
  type: ContemporaryDerivation
  derived from: http://data.ga-group.nl/ics/bics/2014/131012101010
  source accessed on: 2019-12-03T20:05:01Z
  source last accessed on: 2019-12-03T20:05:01Z
  definition: This segment includes companies that own and operate pipelines and terminal facilities for crude oil. These companies may realize revenue through toll transportation and storage services or through purchasing and reselling of the underlying products. These companies utilize their distribution network to link crude-oil production companies and refineries.
  notation: 131012101010
  valid from: 2014-08-08
  valid till: 2020-10-03
source accessed on: 2019-12-03T20:05:01Z
source last accessed on: 2019-12-03T20:05:01Z
definition: This segment includes companies that own and operate pipelines and terminal facilities for crude oil. These companies may realize revenue through toll transportation and storage services or through purchasing and reselling of the underlying products. These companies utilize their distribution network to link crude-oil production companies and refineries.
notation: 131012101010
valid from: 2014-08-08
valid till: 2020-10-03

Refined Products Pipelines & Sto
type: BicsLevel6Segment
type: Classifier
type: NamedIndividual
is level6 segment of: Oil Pipelines & Storage
is replaced by: Refined Products Pipelines & Sto
created with: infer-bics.sql
derived from: Refined Products Pipelines & Sto
  type: BicsLevel6Segment
  type: Classifier
  type: ContemporaryDerivation
  derived from: http://data.ga-group.nl/ics/bics/2014/131012101011
  source accessed on: 2019-12-03T20:05:01Z
  source last accessed on: 2019-12-03T20:05:01Z
  definition: This segment includes companies that own and operate pipelines and terminal facilities for refined oil products. These companies may realize revenue through toll transportation and storage services or through purchasing and reselling of the underlying products. These companies utilize their distribution network to link refineries to their end users.
  notation: 131012101011
  valid from: 2014-08-08
  valid till: 2020-10-03
source accessed on: 2019-12-03T20:05:01Z
source last accessed on: 2019-12-03T20:05:01Z
definition: This segment includes companies that own and operate pipelines and terminal facilities for refined oil products. These companies may realize revenue through toll transportation and storage services or through purchasing and reselling of the underlying products. These companies utilize their distribution network to link refineries to their end users.
notation: 131012101011
valid from: 2014-08-08
valid till: 2020-10-03

Oil Pipelines & Storage
type: BicsLevel5Segment
type: Classifier
type: NamedIndividual
is level5 segment of: Oil & Liquid Rich Gas Pipelines
is replaced by: Oil Pipelines & Storage
created with: infer-bics.sql
derived from: Oil Pipelines & Storage
  type: BicsLevel5Segment
  type: Classifier
  type: ContemporaryDerivation
  derived from: http://data.ga-group.nl/ics/bics/2014/1310121010
  source accessed on: 2019-12-03T20:05:01Z
  source last accessed on: 2019-12-03T20:05:01Z
  definition: This segment includes companies that own and operate pipelines and terminal facilities for oil products. These companies may realize revenue through toll transportation and storage services or through purchasing and reselling of the underlying products.
  notation: 1310121010
  valid from: 2014-08-08
  valid till: 2020-10-03
source accessed on: 2019-12-03T20:05:01Z
source last accessed on: 2019-12-03T20:05:01Z
definition: This segment includes companies that own and operate pipelines and terminal facilities for oil products. These companies may realize revenue through toll transportation and storage services or through purchasing and reselling of the underlying products.
notation: 1310121010
valid from: 2014-08-08
valid till: 2020-10-03

Nat Gas Gathering & Processing
type: BicsLevel6Segment
type: Classifier
type: NamedIndividual
is level6 segment of: NGL Pipelines & Services
is replaced by: Nat Gas Gathering & Processing
created with: infer-bics.sql
derived from: Nat Gas Gathering & Processing
  type: BicsLevel6Segment
  type: Classifier
  type: ContemporaryDerivation
  derived from: http://data.ga-group.nl/ics/bics/2014/131012101110
  source accessed on: 2019-12-03T20:05:01Z
  source last accessed on: 2019-12-03T20:05:01Z
  definition: This segment includes companies that own and operates pipelines that transport raw natural gas from wellheads. Also includes companies that treat, process and finally separate raw natural gas into dry natural gas and natural gas liquids. These companies may realize revenue through toll transportation, processing and storage services or through purchasing, processing and reselling of the underlying products.
  notation: 131012101110
  valid from: 2014-08-08
  valid till: 2020-10-03
source accessed on: 2019-12-03T20:05:01Z
source last accessed on: 2019-12-03T20:05:01Z
definition: This segment includes companies that own and operates pipelines that transport raw natural gas from wellheads. Also includes companies that treat, process and finally separate raw natural gas into dry natural gas and natural gas liquids. These companies may realize revenue through toll transportation, processing and storage services or through purchasing, processing and reselling of the underlying products.
notation: 131012101110
valid from: 2014-08-08
valid till: 2020-10-03

NGL Fractionation & Marketing
type: BicsLevel6Segment
type: Classifier
type: NamedIndividual
is level6 segment of: NGL Pipelines & Services
is replaced by: NGL Fractionation & Marketing
created with: infer-bics.sql
derived from: NGL Fractionation & Marketing
  type: BicsLevel6Segment
  type: Classifier
  type: ContemporaryDerivation
  derived from: http://data.ga-group.nl/ics/bics/2014/131012101111
  source accessed on: 2019-12-03T20:05:01Z
  source last accessed on: 2019-12-03T20:05:01Z
  definition: This segment includes companies that break natural gas liquids (NGLs) into different liquids, such as ethane, propane and butane.
  notation: 131012101111
  valid from: 2014-08-08
  valid till: 2020-10-03
source accessed on: 2019-12-03T20:05:01Z
source last accessed on: 2019-12-03T20:05:01Z
definition: This segment includes companies that break natural gas liquids (NGLs) into different liquids, such as ethane, propane and butane.
notation: 131012101111
valid from: 2014-08-08
valid till: 2020-10-03

Nat Gas Liquids Pipelines
type: BicsLevel6Segment
type: Classifier
type: NamedIndividual
is level6 segment of: NGL Pipelines & Services
is replaced by: Nat Gas Liquids Pipelines
created with: infer-bics.sql
derived from: Nat Gas Liquids Pipelines
  type: BicsLevel6Segment
  type: Classifier
  type: ContemporaryDerivation
  derived from: http://data.ga-group.nl/ics/bics/2014/131012101112
  source accessed on: 2019-12-03T20:05:01Z
  source last accessed on: 2019-12-03T20:05:01Z
  definition: This segment includes companies that own and operate pipelines for natural gas liquids. These companies may realize revenue through toll transportation and storage services or through purchasing and reselling of the underlying products. These companies utilize their distribution network to link raw natural gas processing plants to NGL fractionation plants.
  notation: 131012101112
  valid from: 2014-08-08
  valid till: 2020-10-03
source accessed on: 2019-12-03T20:05:01Z
source last accessed on: 2019-12-03T20:05:01Z
definition: This segment includes companies that own and operate pipelines for natural gas liquids. These companies may realize revenue through toll transportation and storage services or through purchasing and reselling of the underlying products. These companies utilize their distribution network to link raw natural gas processing plants to NGL fractionation plants.
notation: 131012101112
valid from: 2014-08-08
valid till: 2020-10-03

NGL Pipelines & Services
type: BicsLevel5Segment
type: Classifier
type: NamedIndividual
is level5 segment of: Oil & Liquid Rich Gas Pipelines
is replaced by: NGL Pipelines & Services
created with: infer-bics.sql
derived from: NGL Pipelines & Services
  type: BicsLevel5Segment
  type: Classifier
  type: ContemporaryDerivation
  derived from: http://data.ga-group.nl/ics/bics/2014/1310121011
  source accessed on: 2019-12-03T20:05:01Z
  source last accessed on: 2019-12-03T20:05:01Z
  definition: This segment includes companies that transport, store and process raw natural gas and their NGL byproducts. These companies may realize revenue through toll transportation and storage services or through purchasing and reselling of the underlying products.
  notation: 1310121011
  valid from: 2014-08-08
  valid till: 2020-10-03
source accessed on: 2019-12-03T20:05:01Z
source last accessed on: 2019-12-03T20:05:01Z
definition: This segment includes companies that transport, store and process raw natural gas and their NGL byproducts. These companies may realize revenue through toll transportation and storage services or through purchasing and reselling of the underlying products.
notation: 1310121011
valid from: 2014-08-08
valid till: 2020-10-03

Oil & Liquid Rich Gas Pipelines
type: BicsLevel4SubIndustry
type: Classifier
type: NamedIndividual
created with: infer-bics.sql
derived from: Oil & Liquid Rich Gas Pipelines
  type: BicsLevel4SubIndustry
  type: Classifier
  type: ContemporaryDerivation
  derived from: http://data.ga-group.nl/ics/bics/2014/13101210
  source accessed on: 2019-12-03T20:05:01Z
  source last accessed on: 2019-12-03T20:05:01Z
  definition: This industry subgroup includes companies that own and operate pipelines and terminal facilities for oil and liquid rich gas. Also includes companies that process liquid rich gas into final end products. These companies may realize revenue through toll transportation and storage services or through purchasing and reselling of the underlying products.
  notation: 13101210
  valid from: 2014-08-08
  valid till: 2020-10-03
source accessed on: 2019-12-03T20:05:01Z
source last accessed on: 2019-12-03T20:05:01Z
definition: This industry subgroup includes companies that own and operate pipelines and terminal facilities for oil and liquid rich gas. Also includes companies that process liquid rich gas into final end products. These companies may realize revenue through toll transportation and storage services or through purchasing and reselling of the underlying products.
notation: 13101210
valid from: 2014-08-08
valid till: 2020-10-03

Dry Natural Gas Pipelines
type: BicsLevel4SubIndustry
type: Classifier
type: NamedIndividual
created with: infer-bics.sql
derived from: Dry Natural Gas Pipelines
  type: BicsLevel4SubIndustry
  type: Classifier
  type: ContemporaryDerivation
  derived from: http://data.ga-group.nl/ics/bics/2014/13101211
  source accessed on: 2019-12-03T20:05:01Z
  source last accessed on: 2019-12-03T20:05:01Z
  definition: This industry subgroup includes companies that own and operate pipelines for dry natural gas. These companies may realize revenue through toll transportation and storage services or through purchasing and reselling of the underlying products. These companies utilize their distribution network to link raw natural gas processing plants to utilities, liquefied natural gas (LNG) facilities and other end users.
  notation: 13101211
  valid from: 2014-08-08
  valid till: 2020-10-03
source accessed on: 2019-12-03T20:05:01Z
source last accessed on: 2019-12-03T20:05:01Z
definition: This industry subgroup includes companies that own and operate pipelines for dry natural gas. These companies may realize revenue through toll transportation and storage services or through purchasing and reselling of the underlying products. These companies utilize their distribution network to link raw natural gas processing plants to utilities, liquefied natural gas (LNG) facilities and other end users.
notation: 13101211
valid from: 2014-08-08
valid till: 2020-10-03

LNG Liquefaction - Reg
type: BicsLevel6Segment
type: Classifier
type: NamedIndividual
is level6 segment of: LNG Liquefaction
created with: infer-bics.sql
derived from: LNG Liquefaction - Reg
  type: BicsLevel6Segment
  type: Classifier
  type: ContemporaryDerivation
  derived from: http://data.ga-group.nl/ics/bics/2014/131012121010
  source accessed on: 2019-12-03T20:05:01Z
  source last accessed on: 2019-12-03T20:05:01Z
  definition: This segment includes companies that own or operate facilities where natural gas is cooled to a liquid state (LNG) for shipping. Revenue at such facilities is regulated by independent (elected) or politically appointed regulators.
  notation: 131012121010
  valid from: 2014-08-08
  valid till: 2020-10-03
source accessed on: 2019-12-03T20:05:01Z
source last accessed on: 2019-12-03T20:05:01Z
definition: This segment includes companies that own or operate facilities where natural gas is cooled to a liquid state (LNG) for shipping. Revenue at such facilities is regulated by independent (elected) or politically appointed regulators.
notation: 131012121010
valid from: 2014-08-08
valid till: 2020-10-03

LNG Liquefaction - Unreg
type: BicsLevel6Segment
type: Classifier
type: NamedIndividual
is level6 segment of: LNG Liquefaction
created with: infer-bics.sql
derived from: LNG Liquefaction - Unreg
  type: BicsLevel6Segment
  type: Classifier
  type: ContemporaryDerivation
  derived from: http://data.ga-group.nl/ics/bics/2014/131012121011
  source accessed on: 2019-12-03T20:05:01Z
  source last accessed on: 2019-12-03T20:05:01Z
  definition: This segment includes companies that own or operate facilities where natural gas is cooled to a liquid state (LNG) for shipping. Revenue at such facilities is unregulated or conducted through other merchant revenue arrangements.
  notation: 131012121011
  valid from: 2014-08-08
  valid till: 2020-10-03
source accessed on: 2019-12-03T20:05:01Z
source last accessed on: 2019-12-03T20:05:01Z
definition: This segment includes companies that own or operate facilities where natural gas is cooled to a liquid state (LNG) for shipping. Revenue at such facilities is unregulated or conducted through other merchant revenue arrangements.
notation: 131012121011
valid from: 2014-08-08
valid till: 2020-10-03

LNG Liquefaction
type: BicsLevel5Segment
type: Classifier
type: NamedIndividual
is level5 segment of: Liquefied Natural Gas (LNG)
is replaced by: LNG Liquefaction
created with: infer-bics.sql
derived from: LNG Liquefaction
  type: BicsLevel5Segment
  type: Classifier
  type: ContemporaryDerivation
  derived from: http://data.ga-group.nl/ics/bics/2014/1310121210
  source accessed on: 2019-12-03T20:05:01Z
  source last accessed on: 2019-12-03T20:05:01Z
  definition: This segment includes companies that own or operate facilities where liquefied natural gas (LNG) is cooled to a liquid state for shipping.
  notation: 1310121210
  valid from: 2014-08-08
  valid till: 2020-10-03
source accessed on: 2019-12-03T20:05:01Z
source last accessed on: 2019-12-03T20:05:01Z
definition: This segment includes companies that own or operate facilities where liquefied natural gas (LNG) is cooled to a liquid state for shipping.
notation: 1310121210
valid from: 2014-08-08
valid till: 2020-10-03

LNG Regasification - Reg
type: BicsLevel6Segment
type: Classifier
type: NamedIndividual
is level6 segment of: LNG Regasification
created with: infer-bics.sql
derived from: LNG Regasification - Reg
  type: BicsLevel6Segment
  type: Classifier
  type: ContemporaryDerivation
  derived from: http://data.ga-group.nl/ics/bics/2014/131012121110
  source accessed on: 2019-12-03T20:05:01Z
  source last accessed on: 2019-12-03T20:05:01Z
  definition: This segment includes companies that own or operate facilities where liquefied natural gas (LNG) is heated back to methane in a gaseous state for distribution to the transmission network. Revenue at such facilities is regulated by independent (elected) or politically appointed regulators.
  notation: 131012121110
  valid from: 2014-08-08
  valid till: 2020-10-03
source accessed on: 2019-12-03T20:05:01Z
source last accessed on: 2019-12-03T20:05:01Z
definition: This segment includes companies that own or operate facilities where liquefied natural gas (LNG) is heated back to methane in a gaseous state for distribution to the transmission network. Revenue at such facilities is regulated by independent (elected) or politically appointed regulators.
notation: 131012121110
valid from: 2014-08-08
valid till: 2020-10-03

LNG Regasification - Unreg
type: BicsLevel6Segment
type: Classifier
type: NamedIndividual
is level6 segment of: LNG Regasification
created with: infer-bics.sql
derived from: LNG Regasification - Unreg
  type: BicsLevel6Segment
  type: Classifier
  type: ContemporaryDerivation
  derived from: http://data.ga-group.nl/ics/bics/2014/131012121111
  source accessed on: 2019-12-03T20:05:01Z
  source last accessed on: 2019-12-03T20:05:01Z
  definition: This segment includes companies that own or operate facilities where liquefied natural gas (LNG) is heated back to methane in a gaseous state for distribution to the transmission network. Revenue at such facilities is unregulated or conducted through other merchant revenue arrangements.
  notation: 131012121111
  valid from: 2014-08-08
  valid till: 2020-10-03
source accessed on: 2019-12-03T20:05:01Z
source last accessed on: 2019-12-03T20:05:01Z
definition: This segment includes companies that own or operate facilities where liquefied natural gas (LNG) is heated back to methane in a gaseous state for distribution to the transmission network. Revenue at such facilities is unregulated or conducted through other merchant revenue arrangements.
notation: 131012121111
valid from: 2014-08-08
valid till: 2020-10-03

LNG Regasification
type: BicsLevel5Segment
type: Classifier
type: NamedIndividual
is level5 segment of: Liquefied Natural Gas (LNG)
is replaced by: LNG Regasification
created with: infer-bics.sql
derived from: LNG Regasification
  type: BicsLevel5Segment
  type: Classifier
  type: ContemporaryDerivation
  derived from: http://data.ga-group.nl/ics/bics/2014/1310121211
  source accessed on: 2019-12-03T20:05:01Z
  source last accessed on: 2019-12-03T20:05:01Z
  definition: This segment includes companies that own or operate facilities where liquefied natural gas (LNG) is heated back to methane into a gaseous state for distribution to the transmission network.
  notation: 1310121211
  valid from: 2014-08-08
  valid till: 2020-10-03
source accessed on: 2019-12-03T20:05:01Z
source last accessed on: 2019-12-03T20:05:01Z
definition: This segment includes companies that own or operate facilities where liquefied natural gas (LNG) is heated back to methane into a gaseous state for distribution to the transmission network.
notation: 1310121211
valid from: 2014-08-08
valid till: 2020-10-03

Liquefied Natural Gas (LNG)
type: BicsLevel4SubIndustry
type: Classifier
type: NamedIndividual
created with: infer-bics.sql
derived from: Liquefied Natural Gas (LNG)
  type: BicsLevel4SubIndustry
  type: Classifier
  type: ContemporaryDerivation
  derived from: http://data.ga-group.nl/ics/bics/2014/13101212
  source accessed on: 2019-12-03T20:05:01Z
  source last accessed on: 2019-12-03T20:05:01Z
  definition: This industry subgroup includes companies that operate liquefied natural gas (LNG) infrastructure. LNG is methane (natural) gas, cryogenically cooled to ‒260 degrees F (‒162 degrees C), at which point the vapor condenses to a liquid suitable for waterborne transport.
  notation: 13101212
  valid from: 2014-08-08
  valid till: 2020-10-03
source accessed on: 2019-12-03T20:05:01Z
source last accessed on: 2019-12-03T20:05:01Z
definition: This industry subgroup includes companies that operate liquefied natural gas (LNG) infrastructure. LNG is methane (natural) gas, cryogenically cooled to ‒260 degrees F (‒162 degrees C), at which point the vapor condenses to a liquid suitable for waterborne transport.
notation: 13101212
valid from: 2014-08-08
valid till: 2020-10-03

Midstream - Oil & Gas
type: BicsLevel3Industry
type: Classifier
type: NamedIndividual
is industry of: Oil & Gas
is replaced by: Midstream - Oil & Gas
created with: infer-bics.sql
derived from: Midstream - Oil & Gas
  type: BicsLevel3Industry
  type: Classifier
  type: ContemporaryDerivation
  derived from: http://data.ga-group.nl/ics/bics/2014/131012
  source accessed on: 2019-12-03T20:05:01Z
  source last accessed on: 2019-12-03T20:05:01Z
  definition: This industry includes companies that transport oil, oil products and natural gas through pipelines. This segment also includes companies that operate bulk station terminals.
  notation: 131012
  valid from: 2014-08-08
  valid till: 2020-10-03
source accessed on: 2019-12-03T20:05:01Z
source last accessed on: 2019-12-03T20:05:01Z
definition: This industry includes companies that transport oil, oil products and natural gas through pipelines. This segment also includes companies that operate bulk station terminals.
notation: 131012
valid from: 2014-08-08
valid till: 2020-10-03

Midstream - Oil & Gas MLP
type: BicsLevel3Industry
type: Classifier
type: NamedIndividual
is industry of: Oil & Gas
created with: infer-bics.sql
derived from: Midstream - Oil & Gas MLP
  type: BicsLevel3Industry
  type: Classifier
  type: ContemporaryDerivation
  derived from: http://data.ga-group.nl/ics/bics/2014/131013
  source accessed on: 2019-12-03T20:05:01Z
  source last accessed on: 2019-12-03T20:05:01Z
  definition: This industry includes companies that transport oil, oil products and natural gas through pipelines. This segment also includes companies that operate bulk station terminals. The companies in this industry are organized as Master Limited Partnerships (MLP), which requires distributions to be made to limited partners.
  notation: 131013
  valid from: 2014-08-08
  valid till: 2020-10-03
source accessed on: 2019-12-03T20:05:01Z
source last accessed on: 2019-12-03T20:05:01Z
definition: This industry includes companies that transport oil, oil products and natural gas through pipelines. This segment also includes companies that operate bulk station terminals. The companies in this industry are organized as Master Limited Partnerships (MLP), which requires distributions to be made to limited partners.
notation: 131013
valid from: 2014-08-08
valid till: 2020-10-03

Gasoline
type: BicsLevel6Segment
type: Classifier
type: NamedIndividual
is level6 segment of: Light Refined Products
created with: infer-bics.sql
derived from: Gasoline
  type: BicsLevel6Segment
  type: Classifier
  type: ContemporaryDerivation
  derived from: http://data.ga-group.nl/ics/bics/2014/131014101010
  source accessed on: 2019-12-03T20:05:01Z
  source last accessed on: 2019-12-03T20:05:01Z
  definition: This segment includes companies that refine crude oil and other products into gasoline and blendstocks.
  notation: 131014101010
  valid from: 2014-08-08
  valid till: 2020-10-03
source accessed on: 2019-12-03T20:05:01Z
source last accessed on: 2019-12-03T20:05:01Z
definition: This segment includes companies that refine crude oil and other products into gasoline and blendstocks.
notation: 131014101010
valid from: 2014-08-08
valid till: 2020-10-03

Liquefied Petroleum Gas
type: BicsLevel6Segment
type: Classifier
type: NamedIndividual
is level6 segment of: Light Refined Products
created with: infer-bics.sql
derived from: Liquefied Petroleum Gas
  type: BicsLevel6Segment
  type: Classifier
  type: ContemporaryDerivation
  derived from: http://data.ga-group.nl/ics/bics/2014/131014101011
  source accessed on: 2019-12-03T20:05:01Z
  source last accessed on: 2019-12-03T20:05:01Z
  definition: This segment includes companies that produce or extract liquefied petroleum gas (LPG) from crude oil. LPG is composed propane, butane or a combination of the two.
  notation: 131014101011
  valid from: 2014-08-08
  valid till: 2020-10-03
source accessed on: 2019-12-03T20:05:01Z
source last accessed on: 2019-12-03T20:05:01Z
definition: This segment includes companies that produce or extract liquefied petroleum gas (LPG) from crude oil. LPG is composed propane, butane or a combination of the two.
notation: 131014101011
valid from: 2014-08-08
valid till: 2020-10-03

Naphtha
type: BicsLevel6Segment
type: Classifier
type: NamedIndividual
is level6 segment of: Light Refined Products
created with: infer-bics.sql
derived from: Naphtha
  type: BicsLevel6Segment
  type: Classifier
  type: ContemporaryDerivation
  derived from: http://data.ga-group.nl/ics/bics/2014/131014101012
  source accessed on: 2019-12-03T20:05:01Z
  source last accessed on: 2019-12-03T20:05:01Z
  definition: This segment includes companies that refine crude oil and other products into naphtha.
  notation: 131014101012
  valid from: 2014-08-08
  valid till: 2020-10-03
source accessed on: 2019-12-03T20:05:01Z
source last accessed on: 2019-12-03T20:05:01Z
definition: This segment includes companies that refine crude oil and other products into naphtha.
notation: 131014101012
valid from: 2014-08-08
valid till: 2020-10-03

Other Refined Products
type: BicsLevel6Segment
type: Classifier
type: NamedIndividual
is level6 segment of: Light Refined Products
created with: infer-bics.sql
derived from: Other Refined Products
  type: BicsLevel6Segment
  type: Classifier
  type: ContemporaryDerivation
  derived from: http://data.ga-group.nl/ics/bics/2014/131014101013
  source accessed on: 2019-12-03T20:05:01Z
  source last accessed on: 2019-12-03T20:05:01Z
  definition: This segment includes companies that refine crude oil and other products into products not elsewhere classified.
  notation: 131014101013
  valid from: 2014-08-08
  valid till: 2020-10-03
source accessed on: 2019-12-03T20:05:01Z
source last accessed on: 2019-12-03T20:05:01Z
definition: This segment includes companies that refine crude oil and other products into products not elsewhere classified.
notation: 131014101013
valid from: 2014-08-08
valid till: 2020-10-03

Light Refined Products
type: BicsLevel5Segment
type: Classifier
type: NamedIndividual
is level5 segment of: Petroleum Refining
created with: infer-bics.sql
derived from: Light Refined Products
  type: BicsLevel5Segment
  type: Classifier
  type: ContemporaryDerivation
  derived from: http://data.ga-group.nl/ics/bics/2014/1310141010
  source accessed on: 2019-12-03T20:05:01Z
  source last accessed on: 2019-12-03T20:05:01Z
  definition: This segment includes companies that refine crude oil and other products into light refined distillates.
  notation: 1310141010
  valid from: 2014-08-08
  valid till: 2020-10-03
source accessed on: 2019-12-03T20:05:01Z
source last accessed on: 2019-12-03T20:05:01Z
definition: This segment includes companies that refine crude oil and other products into light refined distillates.
notation: 1310141010
valid from: 2014-08-08
valid till: 2020-10-03

Diesel
type: BicsLevel6Segment
type: Classifier
type: NamedIndividual
is level6 segment of: Medium Refined Products
created with: infer-bics.sql
derived from: Diesel
  type: BicsLevel6Segment
  type: Classifier
  type: ContemporaryDerivation
  derived from: http://data.ga-group.nl/ics/bics/2014/131014101110
  source accessed on: 2019-12-03T20:05:01Z
  source last accessed on: 2019-12-03T20:05:01Z
  definition: This segment includes companies that refine crude oil and other products into diesel fuel.
  notation: 131014101110
  valid from: 2014-08-08
  valid till: 2020-10-03
source accessed on: 2019-12-03T20:05:01Z
source last accessed on: 2019-12-03T20:05:01Z
definition: This segment includes companies that refine crude oil and other products into diesel fuel.
notation: 131014101110
valid from: 2014-08-08
valid till: 2020-10-03

Heating Oil
type: BicsLevel6Segment
type: Classifier
type: NamedIndividual
is level6 segment of: Medium Refined Products
created with: infer-bics.sql
derived from: Heating Oil
  type: BicsLevel6Segment
  type: Classifier
  type: ContemporaryDerivation
  derived from: http://data.ga-group.nl/ics/bics/2014/131014101111
  source accessed on: 2019-12-03T20:05:01Z
  source last accessed on: 2019-12-03T20:05:01Z
  definition: This segment includes companies that refine crude oil and other products into heating oil.
  notation: 131014101111
  valid from: 2014-08-08
  valid till: 2020-10-03
source accessed on: 2019-12-03T20:05:01Z
source last accessed on: 2019-12-03T20:05:01Z
definition: This segment includes companies that refine crude oil and other products into heating oil.
notation: 131014101111
valid from: 2014-08-08
valid till: 2020-10-03

Jet Fuel & Kerosene
type: BicsLevel6Segment
type: Classifier
type: NamedIndividual
is level6 segment of: Medium Refined Products
created with: infer-bics.sql
derived from: Jet Fuel & Kerosene
  type: BicsLevel6Segment
  type: Classifier
  type: ContemporaryDerivation
  derived from: http://data.ga-group.nl/ics/bics/2014/131014101112
  source accessed on: 2019-12-03T20:05:01Z
  source last accessed on: 2019-12-03T20:05:01Z
  definition: This segment includes companies that refine crude oil and other products into jet fuel.
  notation: 131014101112
  valid from: 2014-08-08
  valid till: 2020-10-03
source accessed on: 2019-12-03T20:05:01Z
source last accessed on: 2019-12-03T20:05:01Z
definition: This segment includes companies that refine crude oil and other products into jet fuel.
notation: 131014101112
valid from: 2014-08-08
valid till: 2020-10-03

Medium Refined Products
type: BicsLevel5Segment
type: Classifier
type: NamedIndividual
is level5 segment of: Petroleum Refining
created with: infer-bics.sql
derived from: Medium Refined Products
  type: BicsLevel5Segment
  type: Classifier
  type: ContemporaryDerivation
  derived from: http://data.ga-group.nl/ics/bics/2014/1310141011
  source accessed on: 2019-12-03T20:05:01Z
  source last accessed on: 2019-12-03T20:05:01Z
  definition: This segment includes companies that refine crude oil and other products into medium refined distillates.
  notation: 1310141011
  valid from: 2014-08-08
  valid till: 2020-10-03
source accessed on: 2019-12-03T20:05:01Z
source last accessed on: 2019-12-03T20:05:01Z
definition: This segment includes companies that refine crude oil and other products into medium refined distillates.
notation: 1310141011
valid from: 2014-08-08
valid till: 2020-10-03

Residual Fuel
type: BicsLevel6Segment
type: Classifier
type: NamedIndividual
is level6 segment of: Heavy Refined Products
created with: infer-bics.sql
derived from: Residual Fuel
  type: BicsLevel6Segment
  type: Classifier
  type: ContemporaryDerivation
  derived from: http://data.ga-group.nl/ics/bics/2014/131014101210
  source accessed on: 2019-12-03T20:05:01Z
  source last accessed on: 2019-12-03T20:05:01Z
  definition: This segment includes companies that refine crude oil and other products into residual fuel.
  notation: 131014101210
  valid from: 2014-08-08
  valid till: 2020-10-03
source accessed on: 2019-12-03T20:05:01Z
source last accessed on: 2019-12-03T20:05:01Z
definition: This segment includes companies that refine crude oil and other products into residual fuel.
notation: 131014101210
valid from: 2014-08-08
valid till: 2020-10-03

Heavy Refined Products
type: BicsLevel5Segment
type: Classifier
type: NamedIndividual
is level5 segment of: Petroleum Refining
created with: infer-bics.sql
derived from: Heavy Refined Products
  type: BicsLevel5Segment
  type: Classifier
  type: ContemporaryDerivation
  derived from: http://data.ga-group.nl/ics/bics/2014/1310141012
  source accessed on: 2019-12-03T20:05:01Z
  source last accessed on: 2019-12-03T20:05:01Z
  definition: This segment includes companies that refine crude oil and other products into heavy refined distillates. Excludes asphalt and tar (see Asphalt).
  notation: 1310141012
  valid from: 2014-08-08
  valid till: 2020-10-03
source accessed on: 2019-12-03T20:05:01Z
source last accessed on: 2019-12-03T20:05:01Z
definition: This segment includes companies that refine crude oil and other products into heavy refined distillates. Excludes asphalt and tar (see Asphalt).
notation: 1310141012
valid from: 2014-08-08
valid till: 2020-10-03

Petroleum Refining
type: BicsLevel4SubIndustry
type: Classifier
type: NamedIndividual
created with: infer-bics.sql
derived from: Petroleum Refining
  type: BicsLevel4SubIndustry
  type: Classifier
  type: ContemporaryDerivation
  derived from: http://data.ga-group.nl/ics/bics/2014/13101410
  source accessed on: 2019-12-03T20:05:01Z
  source last accessed on: 2019-12-03T20:05:01Z
  definition: This industry subgroup includes companies that refine crude oil feedstock and other products into various distillates. These companies own and operate oil refineries. Excludes petrochemicals (see Organic Base Chem & Interms).
  notation: 13101410
  valid from: 2014-08-08
  valid till: 2020-10-03
source accessed on: 2019-12-03T20:05:01Z
source last accessed on: 2019-12-03T20:05:01Z
definition: This industry subgroup includes companies that refine crude oil feedstock and other products into various distillates. These companies own and operate oil refineries. Excludes petrochemicals (see Organic Base Chem & Interms).
notation: 13101410
valid from: 2014-08-08
valid till: 2020-10-03

Distillates - Owned Stations
type: BicsLevel7Segment
type: Classifier
type: NamedIndividual
is level7 segment of: Company Owned Stations
created with: infer-bics.sql
derived from: Distillates - Owned Stations
  type: BicsLevel7Segment
  type: Classifier
  type: ContemporaryDerivation
  derived from: http://data.ga-group.nl/ics/bics/2014/13101411101010
  source accessed on: 2019-12-03T20:05:01Z
  source last accessed on: 2019-12-03T20:05:01Z
  definition: This segment includes revenue derived from the sale of distillates, such as diesel fuel, CNG, LPG, LNG and heating oil in company owned stations. Excludes revenue from gasoline sales (see Gasoline - Owned Stations).
  notation: 13101411101010
  valid from: 2014-08-08
  valid till: 2020-10-03
source accessed on: 2019-12-03T20:05:01Z
source last accessed on: 2019-12-03T20:05:01Z
definition: This segment includes revenue derived from the sale of distillates, such as diesel fuel, CNG, LPG, LNG and heating oil in company owned stations. Excludes revenue from gasoline sales (see Gasoline - Owned Stations).
notation: 13101411101010
valid from: 2014-08-08
valid till: 2020-10-03

Gasoline - Owned Stations
type: BicsLevel7Segment
type: Classifier
type: NamedIndividual
is level7 segment of: Company Owned Stations
created with: infer-bics.sql
derived from: Gasoline - Owned Stations
  type: BicsLevel7Segment
  type: Classifier
  type: ContemporaryDerivation
  derived from: http://data.ga-group.nl/ics/bics/2014/13101411101011
  source accessed on: 2019-12-03T20:05:01Z
  source last accessed on: 2019-12-03T20:05:01Z
  definition: This segment includes revenue derived from the sale of gasoline and blendstocks in company owned stations.
  notation: 13101411101011
  valid from: 2014-08-08
  valid till: 2020-10-03
source accessed on: 2019-12-03T20:05:01Z
source last accessed on: 2019-12-03T20:05:01Z
definition: This segment includes revenue derived from the sale of gasoline and blendstocks in company owned stations.
notation: 13101411101011
valid from: 2014-08-08
valid till: 2020-10-03

Company Owned Stations
type: BicsLevel6Segment
type: Classifier
type: NamedIndividual
is level6 segment of: Petroleum Retailers
is replaced by: Company Owned Stations
created with: infer-bics.sql
derived from: Company Owned Stations
  type: BicsLevel6Segment
  type: Classifier
  type: ContemporaryDerivation
  derived from: http://data.ga-group.nl/ics/bics/2014/131014111010
  source accessed on: 2019-12-03T20:05:01Z
  source last accessed on: 2019-12-03T20:05:01Z
  definition: This segment includes companies that own and operate gas stations that are integrated with an oil and gas company. Typically, these would be retailing arms of integrated oil or petroleum refining companies.
  notation: 131014111010
  valid from: 2014-08-08
  valid till: 2020-10-03
source accessed on: 2019-12-03T20:05:01Z
source last accessed on: 2019-12-03T20:05:01Z
definition: This segment includes companies that own and operate gas stations that are integrated with an oil and gas company. Typically, these would be retailing arms of integrated oil or petroleum refining companies.
notation: 131014111010
valid from: 2014-08-08
valid till: 2020-10-03

Distillates - Filling Stations
type: BicsLevel7Segment
type: Classifier
type: NamedIndividual
is level7 segment of: Filling Stations
created with: infer-bics.sql
derived from: Distillates - Filling Stations
  type: BicsLevel7Segment
  type: Classifier
  type: ContemporaryDerivation
  derived from: http://data.ga-group.nl/ics/bics/2014/13101411101110
  source accessed on: 2019-12-03T20:05:01Z
  source last accessed on: 2019-12-03T20:05:01Z
  definition: This segment includes revenue derived from the sale of distillates, such as diesel fuel, CNG, LPG, LNG and heating oil in filling stations. Excludes revenue from gasoline sales (see Gasoline - Filling Stations).
  notation: 13101411101110
  valid from: 2014-08-08
  valid till: 2020-10-03
source accessed on: 2019-12-03T20:05:01Z
source last accessed on: 2019-12-03T20:05:01Z
definition: This segment includes revenue derived from the sale of distillates, such as diesel fuel, CNG, LPG, LNG and heating oil in filling stations. Excludes revenue from gasoline sales (see Gasoline - Filling Stations).
notation: 13101411101110
valid from: 2014-08-08
valid till: 2020-10-03

Gasoline - Filling Stations
type: BicsLevel7Segment
type: Classifier
type: NamedIndividual
is level7 segment of: Filling Stations
created with: infer-bics.sql
derived from: Gasoline - Filling Stations
  type: BicsLevel7Segment
  type: Classifier
  type: ContemporaryDerivation
  derived from: http://data.ga-group.nl/ics/bics/2014/13101411101111
  source accessed on: 2019-12-03T20:05:01Z
  source last accessed on: 2019-12-03T20:05:01Z
  definition: This segment includes revenue derived from the sale of gasoline and blendstocks in filling stations.
  notation: 13101411101111
  valid from: 2014-08-08
  valid till: 2020-10-03
source accessed on: 2019-12-03T20:05:01Z
source last accessed on: 2019-12-03T20:05:01Z
definition: This segment includes revenue derived from the sale of gasoline and blendstocks in filling stations.
notation: 13101411101111
valid from: 2014-08-08
valid till: 2020-10-03

Filling Stations
type: BicsLevel6Segment
type: Classifier
type: NamedIndividual
is level6 segment of: Petroleum Retailers
is replaced by: Filling Stations
created with: infer-bics.sql
derived from: Filling Stations
  type: BicsLevel6Segment
  type: Classifier
  type: ContemporaryDerivation
  derived from: http://data.ga-group.nl/ics/bics/2014/131014111011
  source accessed on: 2019-12-03T20:05:01Z
  source last accessed on: 2019-12-03T20:05:01Z
  definition: This segment includes companies that own and operate independent gas stations.
  notation: 131014111011
  valid from: 2014-08-08
  valid till: 2020-10-03
source accessed on: 2019-12-03T20:05:01Z
source last accessed on: 2019-12-03T20:05:01Z
definition: This segment includes companies that own and operate independent gas stations.
notation: 131014111011
valid from: 2014-08-08
valid till: 2020-10-03

Petroleum Retailers
type: BicsLevel5Segment
type: Classifier
type: NamedIndividual
is level5 segment of: Petroleum Marketing
is replaced by: Petroleum Retailers
created with: infer-bics.sql
derived from: Petroleum Retailers
  type: BicsLevel5Segment
  type: Classifier
  type: ContemporaryDerivation
  derived from: http://data.ga-group.nl/ics/bics/2014/1310141110
  source accessed on: 2019-12-03T20:05:01Z
  source last accessed on: 2019-12-03T20:05:01Z
  definition: This segment includes companies that sell and distribute gasoline products on the retail level.
  notation: 1310141110
  valid from: 2014-08-08
  valid till: 2020-10-03
source accessed on: 2019-12-03T20:05:01Z
source last accessed on: 2019-12-03T20:05:01Z
definition: This segment includes companies that sell and distribute gasoline products on the retail level.
notation: 1310141110
valid from: 2014-08-08
valid till: 2020-10-03

Distillates Wholesalers
type: BicsLevel6Segment
type: Classifier
type: NamedIndividual
is level6 segment of: Petroleum Wholesalers
created with: infer-bics.sql
derived from: Distillates Wholesalers
  type: BicsLevel6Segment
  type: Classifier
  type: ContemporaryDerivation
  derived from: http://data.ga-group.nl/ics/bics/2014/131014111110
  source accessed on: 2019-12-03T20:05:01Z
  source last accessed on: 2019-12-03T20:05:01Z
  definition: This segment includes companies that wholesale and distribute distillates, such as diesel, LPG, naphtha, kerosene, jet fuel, residual fuel and heating oil.
  notation: 131014111110
  valid from: 2014-08-08
  valid till: 2020-10-03
source accessed on: 2019-12-03T20:05:01Z
source last accessed on: 2019-12-03T20:05:01Z
definition: This segment includes companies that wholesale and distribute distillates, such as diesel, LPG, naphtha, kerosene, jet fuel, residual fuel and heating oil.
notation: 131014111110
valid from: 2014-08-08
valid till: 2020-10-03

Gasoline Wholesalers
type: BicsLevel6Segment
type: Classifier
type: NamedIndividual
is level6 segment of: Petroleum Wholesalers
created with: infer-bics.sql
derived from: Gasoline Wholesalers
  type: BicsLevel6Segment
  type: Classifier
  type: ContemporaryDerivation
  derived from: http://data.ga-group.nl/ics/bics/2014/131014111111
  source accessed on: 2019-12-03T20:05:01Z
  source last accessed on: 2019-12-03T20:05:01Z
  definition: This segment includes companies that wholesale and distribute gasoline and blendstocks.
  notation: 131014111111
  valid from: 2014-08-08
  valid till: 2020-10-03
source accessed on: 2019-12-03T20:05:01Z
source last accessed on: 2019-12-03T20:05:01Z
definition: This segment includes companies that wholesale and distribute gasoline and blendstocks.
notation: 131014111111
valid from: 2014-08-08
valid till: 2020-10-03

Lubricant Wholesalers
type: BicsLevel6Segment
type: Classifier
type: NamedIndividual
is level6 segment of: Petroleum Wholesalers
created with: infer-bics.sql
derived from: Lubricant Wholesalers
  type: BicsLevel6Segment
  type: Classifier
  type: ContemporaryDerivation
  derived from: http://data.ga-group.nl/ics/bics/2014/131014111112
  source accessed on: 2019-12-03T20:05:01Z
  source last accessed on: 2019-12-03T20:05:01Z
  definition: This segment includes companies that wholesale and distribute lubricants. Includes wholesaling of engine oil and transmission oil.
  notation: 131014111112
  valid from: 2014-08-08
  valid till: 2020-10-03
source accessed on: 2019-12-03T20:05:01Z
source last accessed on: 2019-12-03T20:05:01Z
definition: This segment includes companies that wholesale and distribute lubricants. Includes wholesaling of engine oil and transmission oil.
notation: 131014111112
valid from: 2014-08-08
valid till: 2020-10-03

Other Petroleum Wholesalers
type: BicsLevel6Segment
type: Classifier
type: NamedIndividual
is level6 segment of: Petroleum Wholesalers
created with: infer-bics.sql
derived from: Other Petroleum Wholesalers
  type: BicsLevel6Segment
  type: Classifier
  type: ContemporaryDerivation
  derived from: http://data.ga-group.nl/ics/bics/2014/131014111113
  source accessed on: 2019-12-03T20:05:01Z
  source last accessed on: 2019-12-03T20:05:01Z
  definition: This segment includes companies that wholesale and distribute refined petroleum products not elsewhere classified.
  notation: 131014111113
  valid from: 2014-08-08
  valid till: 2020-10-03
source accessed on: 2019-12-03T20:05:01Z
source last accessed on: 2019-12-03T20:05:01Z
definition: This segment includes companies that wholesale and distribute refined petroleum products not elsewhere classified.
notation: 131014111113
valid from: 2014-08-08
valid till: 2020-10-03

Petroleum Wholesalers
type: BicsLevel5Segment
type: Classifier
type: NamedIndividual
is level5 segment of: Petroleum Marketing
is replaced by: Petroleum Wholesalers
created with: infer-bics.sql
derived from: Petroleum Wholesalers
  type: BicsLevel5Segment
  type: Classifier
  type: ContemporaryDerivation
  derived from: http://data.ga-group.nl/ics/bics/2014/1310141111
  source accessed on: 2019-12-03T20:05:01Z
  source last accessed on: 2019-12-03T20:05:01Z
  definition: This segment includes companies that wholesale refined petroleum products.
  notation: 1310141111
  valid from: 2014-08-08
  valid till: 2020-10-03
source accessed on: 2019-12-03T20:05:01Z
source last accessed on: 2019-12-03T20:05:01Z
definition: This segment includes companies that wholesale refined petroleum products.
notation: 1310141111
valid from: 2014-08-08
valid till: 2020-10-03

Petroleum Marketing
type: BicsLevel4SubIndustry
type: Classifier
type: NamedIndividual
created with: infer-bics.sql
derived from: Petroleum Marketing
  type: BicsLevel4SubIndustry
  type: Classifier
  type: ContemporaryDerivation
  derived from: http://data.ga-group.nl/ics/bics/2014/13101411
  source accessed on: 2019-12-03T20:05:01Z
  source last accessed on: 2019-12-03T20:05:01Z
  definition: This industry subgroup includes companies that sell and distribute petroleum products both on the wholesale and retail level.
  notation: 13101411
  valid from: 2014-08-08
  valid till: 2020-10-03
source accessed on: 2019-12-03T20:05:01Z
source last accessed on: 2019-12-03T20:05:01Z
definition: This industry subgroup includes companies that sell and distribute petroleum products both on the wholesale and retail level.
notation: 13101411
valid from: 2014-08-08
valid till: 2020-10-03

Refining & Marketing
type: BicsLevel3Industry
type: Classifier
type: NamedIndividual
is industry of: Oil & Gas
is replaced by: Refining & Marketing
created with: infer-bics.sql
derived from: Refining & Marketing
  type: BicsLevel3Industry
  type: Classifier
  type: ContemporaryDerivation
  derived from: http://data.ga-group.nl/ics/bics/2014/131014
  source accessed on: 2019-12-03T20:05:01Z
  source last accessed on: 2019-12-03T20:05:01Z
  definition: This industry includes companies that use refining techniques to separate crude petroleum into distillate products, such as gasoline and kerosene. They also market these products downstream or sell them through wholesalers and retail gas stations.
  notation: 131014
  valid from: 2014-08-08
  valid till: 2020-10-03
source accessed on: 2019-12-03T20:05:01Z
source last accessed on: 2019-12-03T20:05:01Z
definition: This industry includes companies that use refining techniques to separate crude petroleum into distillate products, such as gasoline and kerosene. They also market these products downstream or sell them through wholesalers and retail gas stations.
notation: 131014
valid from: 2014-08-08
valid till: 2020-10-03

Drill Support
type: BicsLevel5Segment
type: Classifier
type: NamedIndividual
is level5 segment of: Drilling & Drilling Support
is replaced by: Drill Support
created with: infer-bics.sql
derived from: Drill Support
  type: BicsLevel5Segment
  type: Classifier
  type: ContemporaryDerivation
  derived from: http://data.ga-group.nl/ics/bics/2014/1310151010
  source accessed on: 2019-12-03T20:05:01Z
  source last accessed on: 2019-12-03T20:05:01Z
  definition: This segment includes companies that provide support services for drilling operations or manufacture specialized drilling equipment. Support services include supplying of oil country tubular goods, casing, drilling and completion fluids, and equipment to drilling platforms. Also includes services such as cementing, logging-while-drilling, specialty waste management, inspection and transportation services. Specialized drilling hardware and equipment includes drill bits, reamers and stabilizers.
  notation: 1310151010
  valid from: 2014-08-08
  valid till: 2020-10-03
source accessed on: 2019-12-03T20:05:01Z
source last accessed on: 2019-12-03T20:05:01Z
definition: This segment includes companies that provide support services for drilling operations or manufacture specialized drilling equipment. Support services include supplying of oil country tubular goods, casing, drilling and completion fluids, and equipment to drilling platforms. Also includes services such as cementing, logging-while-drilling, specialty waste management, inspection and transportation services. Specialized drilling hardware and equipment includes drill bits, reamers and stabilizers.
notation: 1310151010
valid from: 2014-08-08
valid till: 2020-10-03

Offshore Drilling
type: BicsLevel5Segment
type: Classifier
type: NamedIndividual
is level5 segment of: Drilling & Drilling Support
is replaced by: Offshore Drilling
created with: infer-bics.sql
derived from: Offshore Drilling
  type: BicsLevel5Segment
  type: Classifier
  type: ContemporaryDerivation
  derived from: http://data.ga-group.nl/ics/bics/2014/1310151011
  source accessed on: 2019-12-03T20:05:01Z
  source last accessed on: 2019-12-03T20:05:01Z
  definition: This segment includes companies that drill for oil and natural gas offshore on a contract basis. These companies own and operate various drilling rigs in order to provide these services for exploration and production companies.
  notation: 1310151011
  valid from: 2014-08-08
  valid till: 2020-10-03
source accessed on: 2019-12-03T20:05:01Z
source last accessed on: 2019-12-03T20:05:01Z
definition: This segment includes companies that drill for oil and natural gas offshore on a contract basis. These companies own and operate various drilling rigs in order to provide these services for exploration and production companies.
notation: 1310151011
valid from: 2014-08-08
valid till: 2020-10-03

Onshore Drilling
type: BicsLevel5Segment
type: Classifier
type: NamedIndividual
is level5 segment of: Drilling & Drilling Support
is replaced by: Onshore Drilling
created with: infer-bics.sql
derived from: Onshore Drilling
  type: BicsLevel5Segment
  type: Classifier
  type: ContemporaryDerivation
  derived from: http://data.ga-group.nl/ics/bics/2014/1310151012
  source accessed on: 2019-12-03T20:05:01Z
  source last accessed on: 2019-12-03T20:05:01Z
  definition: This segment includes companies that drill for oil and natural gas onshore on a contract basis.
  notation: 1310151012
  valid from: 2014-08-08
  valid till: 2020-10-03
source accessed on: 2019-12-03T20:05:01Z
source last accessed on: 2019-12-03T20:05:01Z
definition: This segment includes companies that drill for oil and natural gas onshore on a contract basis.
notation: 1310151012
valid from: 2014-08-08
valid till: 2020-10-03

Drilling & Drilling Support
type: BicsLevel4SubIndustry
type: Classifier
type: NamedIndividual
created with: infer-bics.sql
derived from: Drilling & Drilling Support
  type: BicsLevel4SubIndustry
  type: Classifier
  type: ContemporaryDerivation
  derived from: http://data.ga-group.nl/ics/bics/2014/13101510
  source accessed on: 2019-12-03T20:05:01Z
  source last accessed on: 2019-12-03T20:05:01Z
  definition: This industry subgroup includes companies that provide contract drilling services or provide support services for drilling operations and drilling platforms.
  notation: 13101510
  valid from: 2014-08-08
  valid till: 2020-10-03
source accessed on: 2019-12-03T20:05:01Z
source last accessed on: 2019-12-03T20:05:01Z
definition: This industry subgroup includes companies that provide contract drilling services or provide support services for drilling operations and drilling platforms.
notation: 13101510
valid from: 2014-08-08
valid till: 2020-10-03

Diversified Oilfield Svcs
type: BicsLevel5Segment
type: Classifier
type: NamedIndividual
is level5 segment of: Oilfield Services & Equipment
is replaced by: Onshore Oilfield Services
created with: infer-bics.sql
derived from: Diversified Oilfield Svcs
  type: BicsLevel5Segment
  type: Classifier
  type: ContemporaryDerivation
  derived from: http://data.ga-group.nl/ics/bics/2014/1310151110
  source accessed on: 2019-12-03T20:05:01Z
  source last accessed on: 2019-12-03T20:05:01Z
  definition: This segment includes companies that provide a diversified portfolio of services and equipment to meet the needs of the exploration and production clients.
  notation: 1310151110
  valid from: 2014-08-08
  valid till: 2020-10-03
source accessed on: 2019-12-03T20:05:01Z
source last accessed on: 2019-12-03T20:05:01Z
definition: This segment includes companies that provide a diversified portfolio of services and equipment to meet the needs of the exploration and production clients.
notation: 1310151110
valid from: 2014-08-08
valid till: 2020-10-03

Subsea Oilfield Services
type: BicsLevel5Segment
type: Classifier
type: NamedIndividual
is level5 segment of: Oilfield Services & Equipment
is replaced by: Subsea & Offshore Oilfield Svcs
created with: infer-bics.sql
derived from: Subsea Oilfield Services
  type: BicsLevel5Segment
  type: Classifier
  type: ContemporaryDerivation
  derived from: http://data.ga-group.nl/ics/bics/2014/1310151111
  source accessed on: 2019-12-03T20:05:01Z
  source last accessed on: 2019-12-03T20:05:01Z
  definition: This segment includes companies that provide oilfield services in subsea applications. Includes underwater installation, inspection, repair and decommissioning services of subsea pipelines, wells and umbilicals.
  notation: 1310151111
  valid from: 2014-08-08
  valid till: 2020-10-03
source accessed on: 2019-12-03T20:05:01Z
source last accessed on: 2019-12-03T20:05:01Z
definition: This segment includes companies that provide oilfield services in subsea applications. Includes underwater installation, inspection, repair and decommissioning services of subsea pipelines, wells and umbilicals.
notation: 1310151111
valid from: 2014-08-08
valid till: 2020-10-03

Seismic Surveying
type: BicsLevel5Segment
type: Classifier
type: NamedIndividual
is level5 segment of: Oilfield Services & Equipment
is replaced by: Seismic Surveying
created with: infer-bics.sql
derived from: Seismic Surveying
  type: BicsLevel5Segment
  type: Classifier
  type: ContemporaryDerivation
  derived from: http://data.ga-group.nl/ics/bics/2014/1310151112
  source accessed on: 2019-12-03T20:05:01Z
  source last accessed on: 2019-12-03T20:05:01Z
  definition: This segment includes companies that survey oil and natural gas fields through seismic technology.
  notation: 1310151112
  valid from: 2014-08-08
  valid till: 2020-10-03
source accessed on: 2019-12-03T20:05:01Z
source last accessed on: 2019-12-03T20:05:01Z
definition: This segment includes companies that survey oil and natural gas fields through seismic technology.
notation: 1310151112
valid from: 2014-08-08
valid till: 2020-10-03

Oilfield Services & Equipment
type: BicsLevel4SubIndustry
type: Classifier
type: NamedIndividual
created with: infer-bics.sql
derived from: Oilfield Services & Equipment
  type: BicsLevel4SubIndustry
  type: Classifier
  type: ContemporaryDerivation
  derived from: http://data.ga-group.nl/ics/bics/2014/13101511
  source accessed on: 2019-12-03T20:05:01Z
  source last accessed on: 2019-12-03T20:05:01Z
  definition: This industry subgroup includes companies that provide services or manufacture equipment for non-drilling applications. Includes services such as well servicing and maintenance, fluid handling, snubbing, coiled-tubing, pressure pumping, wire-line, artificial lift and production testing. Also includes suppliers or manufacturers of subsea, completion and surface equipment.
  notation: 13101511
  valid from: 2014-08-08
  valid till: 2020-10-03
source accessed on: 2019-12-03T20:05:01Z
source last accessed on: 2019-12-03T20:05:01Z
definition: This industry subgroup includes companies that provide services or manufacture equipment for non-drilling applications. Includes services such as well servicing and maintenance, fluid handling, snubbing, coiled-tubing, pressure pumping, wire-line, artificial lift and production testing. Also includes suppliers or manufacturers of subsea, completion and surface equipment.
notation: 13101511
valid from: 2014-08-08
valid till: 2020-10-03

Oil & Gas Services & Equip
type: BicsLevel3Industry
type: Classifier
type: NamedIndividual
is industry of: Oil & Gas
is replaced by: Oil & Gas Services & Equip
created with: infer-bics.sql
derived from: Oil & Gas Services & Equip
  type: BicsLevel3Industry
  type: Classifier
  type: ContemporaryDerivation
  derived from: http://data.ga-group.nl/ics/bics/2014/131015
  source accessed on: 2019-12-03T20:05:01Z
  source last accessed on: 2019-12-03T20:05:01Z
  definition: This industry includes companies that specialize in providing support services or manufacture equipment for oil and natural gas exploration and production companies.
  notation: 131015
  valid from: 2014-08-08
  valid till: 2020-10-03
source accessed on: 2019-12-03T20:05:01Z
source last accessed on: 2019-12-03T20:05:01Z
definition: This industry includes companies that specialize in providing support services or manufacture equipment for oil and natural gas exploration and production companies.
notation: 131015
valid from: 2014-08-08
valid till: 2020-10-03

Bitum Coal & Lignite Surface
type: BicsLevel6Segment
type: Classifier
type: NamedIndividual
is level6 segment of: Coal - Surface & Underground
is replaced by: http://data.ga-group.nl/ics/bics/181015141010
created with: infer-bics.sql
derived from: Bitum Coal & Lignite Surface
  type: BicsLevel6Segment
  type: Classifier
  type: ContemporaryDerivation
  derived from: http://data.ga-group.nl/ics/bics/2014/131016101010
  source accessed on: 2019-12-03T20:05:01Z
  source last accessed on: 2019-12-03T20:05:01Z
  definition: This segment includes companies that mine surface bituminous coal and lignite.
  notation: 131016101010
  valid from: 2014-08-08
  valid till: 2020-10-03
source accessed on: 2019-12-03T20:05:01Z
source last accessed on: 2019-12-03T20:05:01Z
definition: This segment includes companies that mine surface bituminous coal and lignite.
notation: 131016101010
valid from: 2014-08-08
valid till: 2020-10-03

Bituminous Coal Underground
type: BicsLevel6Segment
type: Classifier
type: NamedIndividual
is level6 segment of: Coal - Surface & Underground
is replaced by: http://data.ga-group.nl/ics/bics/181015141011
created with: infer-bics.sql
derived from: Bituminous Coal Underground
  type: BicsLevel6Segment
  type: Classifier
  type: ContemporaryDerivation
  derived from: http://data.ga-group.nl/ics/bics/2014/131016101011
  source accessed on: 2019-12-03T20:05:01Z
  source last accessed on: 2019-12-03T20:05:01Z
  definition: This segment includes companies that mine underground bituminous coal.
  notation: 131016101011
  valid from: 2014-08-08
  valid till: 2020-10-03
source accessed on: 2019-12-03T20:05:01Z
source last accessed on: 2019-12-03T20:05:01Z
definition: This segment includes companies that mine underground bituminous coal.
notation: 131016101011
valid from: 2014-08-08
valid till: 2020-10-03

Coal - Surface & Underground
type: BicsLevel5Segment
type: Classifier
type: NamedIndividual
is level5 segment of: Coal Mining
created with: infer-bics.sql
derived from: Coal - Surface & Underground
  type: BicsLevel5Segment
  type: Classifier
  type: ContemporaryDerivation
  derived from: http://data.ga-group.nl/ics/bics/2014/1310161010
  source accessed on: 2019-12-03T20:05:01Z
  source last accessed on: 2019-12-03T20:05:01Z
  definition: This segment includes companies that mine surface and underground coal.
  notation: 1310161010
  valid from: 2014-08-08
  valid till: 2020-10-03
source accessed on: 2019-12-03T20:05:01Z
source last accessed on: 2019-12-03T20:05:01Z
definition: This segment includes companies that mine surface and underground coal.
notation: 1310161010
valid from: 2014-08-08
valid till: 2020-10-03

Coal Mining
type: BicsLevel4SubIndustry
type: Classifier
type: NamedIndividual
created with: infer-bics.sql
derived from: Coal Mining
  type: BicsLevel4SubIndustry
  type: Classifier
  type: ContemporaryDerivation
  derived from: http://data.ga-group.nl/ics/bics/2014/13101610
  source accessed on: 2019-12-03T20:05:01Z
  source last accessed on: 2019-12-03T20:05:01Z
  definition: This industry subgroup includes companies that mine coal for energy production purposes. Also known as thermal coal or steam coal. Excludes companies that mine or process coal for use as steel production ingredients (see Metallurgical Coal).
  notation: 13101610
  valid from: 2014-08-08
  valid till: 2020-10-03
source accessed on: 2019-12-03T20:05:01Z
source last accessed on: 2019-12-03T20:05:01Z
definition: This industry subgroup includes companies that mine coal for energy production purposes. Also known as thermal coal or steam coal. Excludes companies that mine or process coal for use as steel production ingredients (see Metallurgical Coal).
notation: 13101610
valid from: 2014-08-08
valid till: 2020-10-03

Anthracite Mining
type: BicsLevel5Segment
type: Classifier
type: NamedIndividual
is level5 segment of: Other Petroleum & Coal Prods
created with: infer-bics.sql
derived from: Anthracite Mining
  type: BicsLevel5Segment
  type: Classifier
  type: ContemporaryDerivation
  derived from: http://data.ga-group.nl/ics/bics/2014/1310161110
  source accessed on: 2019-12-03T20:05:01Z
  source last accessed on: 2019-12-03T20:05:01Z
  definition: This segment includes companies that mine anthracite.
  notation: 1310161110
  valid from: 2014-08-08
  valid till: 2020-10-03
source accessed on: 2019-12-03T20:05:01Z
source last accessed on: 2019-12-03T20:05:01Z
definition: This segment includes companies that mine anthracite.
notation: 1310161110
valid from: 2014-08-08
valid till: 2020-10-03

Other Petroleum & Coal Prods
type: BicsLevel4SubIndustry
type: Classifier
type: NamedIndividual
created with: infer-bics.sql
derived from: Other Petroleum & Coal Prods
  type: BicsLevel4SubIndustry
  type: Classifier
  type: ContemporaryDerivation
  derived from: http://data.ga-group.nl/ics/bics/2014/13101611
  source accessed on: 2019-12-03T20:05:01Z
  source last accessed on: 2019-12-03T20:05:01Z
  definition: This industry subgroup includes companies that manufacture all other petroleum and coal products not elsewhere classified.
  notation: 13101611
  valid from: 2014-08-08
  valid till: 2020-10-03
source accessed on: 2019-12-03T20:05:01Z
source last accessed on: 2019-12-03T20:05:01Z
definition: This industry subgroup includes companies that manufacture all other petroleum and coal products not elsewhere classified.
notation: 13101611
valid from: 2014-08-08
valid till: 2020-10-03

Coal Operations
type: BicsLevel3Industry
type: Classifier
type: NamedIndividual
is industry of: Oil & Gas
is replaced by: http://data.ga-group.nl/ics/bics/18101514
created with: infer-bics.sql
derived from: Coal Operations
  type: BicsLevel3Industry
  type: Classifier
  type: ContemporaryDerivation
  derived from: http://data.ga-group.nl/ics/bics/2014/131016
  source accessed on: 2019-12-03T20:05:01Z
  source last accessed on: 2019-12-03T20:05:01Z
  definition: This industry includes companies that conduct coal operations. Activities include coal mining and coal products manufacturing.
  notation: 131016
  valid from: 2014-08-08
  valid till: 2020-10-03
source accessed on: 2019-12-03T20:05:01Z
source last accessed on: 2019-12-03T20:05:01Z
definition: This industry includes companies that conduct coal operations. Activities include coal mining and coal products manufacturing.
notation: 131016
valid from: 2014-08-08
valid till: 2020-10-03

Oil & Gas
type: BicsLevel2IndustryGroup
type: Classifier
type: NamedIndividual
is industry group of: Energy
created with: infer-bics.sql
derived from: Oil, Gas & Coal
  type: BicsLevel2IndustryGroup
  type: Classifier
  type: ContemporaryDerivation
  derived from: http://data.ga-group.nl/ics/bics/2014/1310
  source accessed on: 2019-12-03T20:05:01Z
  source last accessed on: 2019-12-03T20:05:01Z
  definition: This industry group includes companies that are involved in the traditional energy complex, which includes upstream, midstream or downstream operations, and/or are involved in the creations of biofuels.
  notation: 1310
  valid from: 2014-08-08
  valid till: 2020-10-03
derived from: Oil & Gas
  type: BicsLevel2IndustryGroup
  type: Classifier
  type: ContemporaryDerivation
  derived from: http://data.ga-group.nl/ics/bics/2020/1310
  derived from: http://data.ga-group.nl/ics/bics/2024/1310
  source accessed on: 2023-07-03T18:11:29Z
  source last accessed on: 2024-06-05T14:42:36Z
  definition: This industry group includes companies involved in the extraction and processing of fossil fuel resources.
  notation: 1310
  valid from: 2020-10-03
source accessed on: 2019-12-03T20:05:01Z
source last accessed on: 2024-06-05T14:42:36Z
definition: This industry group includes companies involved in the extraction and processing of fossil fuel resources.
notation: 1310
valid from: 2014-08-08

Biofuel Feedstock Suppliers
type: BicsLevel5Segment
type: Classifier
type: NamedIndividual
is level5 segment of: Biofuels
created with: infer-bics.sql
derived from: Biofuel Feedstock Suppliers
  type: BicsLevel4SubIndustry
  type: Classifier
  type: AnachronousDerivation
  derived from: http://data.ga-group.nl/ics/bics/2014/13111010
  source accessed on: 2019-12-03T20:05:01Z
  source last accessed on: 2019-12-03T20:05:01Z
  definition: This industry subgroup includes companies that produce the raw material feedstock for biofuel production.
  notation: 13111010
  valid from: 2014-08-08
  valid till: 2020-10-03
derived from: Biodiesel Feedstock Suppliers
  type: BicsLevel5Segment
  type: Classifier
  type: ContemporaryDerivation
  derived from: http://data.ga-group.nl/ics/bics/2014/1311101010
  source accessed on: 2019-12-03T20:05:01Z
  source last accessed on: 2019-12-03T20:05:01Z
  definition: This segment includes companies that produce the raw material feedstock for biodiesel production.
  notation: 1311101010
  valid from: 2014-08-08
  valid till: 2020-10-03
derived from: Biofuel Feedstock Suppliers
  type: BicsLevel5Segment
  type: Classifier
  type: ContemporaryDerivation
  derived from: http://data.ga-group.nl/ics/bics/2020/1311101010
  derived from: http://data.ga-group.nl/ics/bics/2024/1311101010
  source accessed on: 2023-07-03T18:11:29Z
  source last accessed on: 2024-06-05T14:42:36Z
  definition: This segment includes companies that produce raw material feedstock for biofuel production.
  notation: 1311101010
  valid from: 2020-10-03
source accessed on: 2019-12-03T20:05:01Z
source last accessed on: 2024-06-05T14:42:36Z
definition: This segment includes companies that produce raw material feedstock for biofuel production.
notation: 1311101010
valid from: 2014-08-08

Diesel Substitutes
type: BicsLevel5Segment
type: Classifier
type: NamedIndividual
is level5 segment of: Biofuels
created with: infer-bics.sql
derived from: Ethanol Feedstock Suppliers
  type: BicsLevel5Segment
  type: Classifier
  type: ContemporaryDerivation
  derived from: http://data.ga-group.nl/ics/bics/2014/1311101011
  source accessed on: 2019-12-03T20:05:01Z
  source last accessed on: 2019-12-03T20:05:01Z
  definition: This segment includes companies that produce the raw material feedstock for ethanol production.
  notation: 1311101011
  valid from: 2014-08-08
  valid till: 2020-10-03
derived from: Diesel Substitutes
  type: BicsLevel4SubIndustry
  type: Classifier
  type: AnachronousDerivation
  derived from: http://data.ga-group.nl/ics/bics/2014/13111011
  source accessed on: 2019-12-03T20:05:01Z
  source last accessed on: 2019-12-03T20:05:01Z
  definition: This industry subgroup includes companies that produce biodiesel. Biodiesel is a fossil fuel substitute created from vegetable oil or animal fats. Biodiesel usually contains a percentage of traditional diesel fuel.
  notation: 13111011
  valid from: 2014-08-08
  valid till: 2020-10-03
derived from: Diesel Substitutes
  type: BicsLevel5Segment
  type: Classifier
  type: ContemporaryDerivation
  derived from: http://data.ga-group.nl/ics/bics/2020/1311101011
  derived from: http://data.ga-group.nl/ics/bics/2024/1311101011
  source accessed on: 2023-07-03T18:11:29Z
  source last accessed on: 2024-06-05T14:42:36Z
  definition: This segment includes companies that produce diesel substitutes primarily from vegetable oil or animal fats.
  notation: 1311101011
  valid from: 2020-10-03
source accessed on: 2019-12-03T20:05:01Z
source last accessed on: 2024-06-05T14:42:36Z
definition: This segment includes companies that produce diesel substitutes primarily from vegetable oil or animal fats.
notation: 1311101011
valid from: 2014-08-08

Gasoline Substitutes
type: BicsLevel5Segment
type: Classifier
type: NamedIndividual
is level5 segment of: Biofuels
created with: infer-bics.sql
derived from: Gasoline Substitutes
  type: BicsLevel4SubIndustry
  type: Classifier
  type: AnachronousDerivation
  derived from: http://data.ga-group.nl/ics/bics/2014/13111012
  source accessed on: 2019-12-03T20:05:01Z
  source last accessed on: 2019-12-03T20:05:01Z
  definition: This industry subgroup includes companies that produce ethanol. Ethanol is a fuel additive typically made from corn or sugar that reduces carbon emissions and lowers the amount of fossil fuels needed.
  notation: 13111012
  valid from: 2014-08-08
  valid till: 2020-10-03
derived from: Gasoline Substitutes
  type: BicsLevel5Segment
  type: Classifier
  type: ContemporaryDerivation
  derived from: http://data.ga-group.nl/ics/bics/2020/1311101012
  derived from: http://data.ga-group.nl/ics/bics/2024/1311101012
  source accessed on: 2023-07-03T18:11:29Z
  source last accessed on: 2024-06-05T14:42:36Z
  definition: This segment includes companies that produce ethanol fuel additives, typically made from corn or sugar.
  notation: 1311101012
  valid from: 2020-10-03
source accessed on: 2023-07-03T18:11:29Z
source last accessed on: 2024-06-05T14:42:36Z
definition: This segment includes companies that produce ethanol fuel additives, typically made from corn or sugar.
notation: 1311101012
valid from: 2020-10-03

Biofuels
type: BicsLevel4SubIndustry
type: Classifier
type: NamedIndividual
replaces: Renewable Energy
created with: infer-bics.sql
derived from: Biofuels
  type: BicsLevel3Industry
  type: Classifier
  type: AnachronousDerivation
  derived from: http://data.ga-group.nl/ics/bics/2014/131110
  source accessed on: 2019-12-03T20:05:01Z
  source last accessed on: 2019-12-03T20:05:01Z
  definition: This industry includes companies that produce ethanol and or biodiesel.
  notation: 131110
  valid from: 2014-08-08
  valid till: 2020-10-03
derived from: Biofuel Feedstock Suppliers
  type: BicsLevel4SubIndustry
  type: Classifier
  type: ContemporaryDerivation
  derived from: http://data.ga-group.nl/ics/bics/2014/13111010
  source accessed on: 2019-12-03T20:05:01Z
  source last accessed on: 2019-12-03T20:05:01Z
  definition: This industry subgroup includes companies that produce the raw material feedstock for biofuel production.
  notation: 13111010
  valid from: 2014-08-08
  valid till: 2020-10-03
derived from: Biofuels
  type: BicsLevel4SubIndustry
  type: Classifier
  type: ContemporaryDerivation
  derived from: http://data.ga-group.nl/ics/bics/2020/13111010
  derived from: http://data.ga-group.nl/ics/bics/2024/13111010
  source accessed on: 2023-07-03T18:11:29Z
  source last accessed on: 2024-06-05T14:42:36Z
  definition: This industry subgroup includes companies that produce fuel by using renewable resources rather than fossil fuels.
  notation: 13111010
  valid from: 2020-10-03
source accessed on: 2019-12-03T20:05:01Z
source last accessed on: 2024-06-05T14:42:36Z
definition: This industry subgroup includes companies that produce fuel by using renewable resources rather than fossil fuels.
notation: 13111010
valid from: 2014-08-08

Polysilicon
type: BicsLevel6Segment
type: Classifier
type: NamedIndividual
is level6 segment of: Solar Energy Equipment
replaces: Polysilicon
created with: infer-bics.sql
derived from: Polysilicon
  type: BicsLevel5Segment
  type: Classifier
  type: AnachronousDerivation
  derived from: http://data.ga-group.nl/ics/bics/2014/1311111010
  source accessed on: 2019-12-03T20:05:01Z
  source last accessed on: 2019-12-03T20:05:01Z
  definition: This segment includes companies that manufacture polysilicon feedstock for the solar energy industry.
  notation: 1311111010
  valid from: 2014-08-08
  valid till: 2020-10-03
derived from: Polysilicon
  type: BicsLevel6Segment
  type: Classifier
  type: ContemporaryDerivation
  derived from: http://data.ga-group.nl/ics/bics/2020/131110111010
  derived from: http://data.ga-group.nl/ics/bics/2024/131110111010
  source accessed on: 2023-07-03T18:11:29Z
  source last accessed on: 2024-06-05T14:42:36Z
  definition: This segment includes companies that manufacture polysilicon feedstock for solar energy equipment.
  notation: 131110111010
  valid from: 2020-10-03
source accessed on: 2023-07-03T18:11:29Z
source last accessed on: 2024-06-05T14:42:36Z
definition: This segment includes companies that manufacture polysilicon feedstock for solar energy equipment.
notation: 131110111010
valid from: 2020-10-03

PV Cells
type: BicsLevel6Segment
type: Classifier
type: NamedIndividual
is level6 segment of: Solar Energy Equipment
replaces: PV Cells
created with: infer-bics.sql
derived from: PV Cells
  type: BicsLevel5Segment
  type: Classifier
  type: AnachronousDerivation
  derived from: http://data.ga-group.nl/ics/bics/2014/1311111011
  source accessed on: 2019-12-03T20:05:01Z
  source last accessed on: 2019-12-03T20:05:01Z
  definition: This segment includes companies that manufacture solar cells and other photovoltaic equipment. Such equipment can include solar cells, solar modules and related components.
  notation: 1311111011
  valid from: 2014-08-08
  valid till: 2020-10-03
derived from: PV Cells
  type: BicsLevel6Segment
  type: Classifier
  type: ContemporaryDerivation
  derived from: http://data.ga-group.nl/ics/bics/2020/131110111011
  derived from: http://data.ga-group.nl/ics/bics/2024/131110111011
  source accessed on: 2023-07-03T18:11:29Z
  source last accessed on: 2024-06-05T14:42:36Z
  definition: This segment includes companies that manufacture photovoltaic (PV) cells, also known as solar cells.
  notation: 131110111011
  valid from: 2020-10-03
source accessed on: 2023-07-03T18:11:29Z
source last accessed on: 2024-06-05T14:42:36Z
definition: This segment includes companies that manufacture photovoltaic (PV) cells, also known as solar cells.
notation: 131110111011
valid from: 2020-10-03

PV Modules
type: BicsLevel6Segment
type: Classifier
type: NamedIndividual
is level6 segment of: Solar Energy Equipment
replaces: PV Modules
created with: infer-bics.sql
derived from: PV Modules
  type: BicsLevel5Segment
  type: Classifier
  type: AnachronousDerivation
  derived from: http://data.ga-group.nl/ics/bics/2014/1311111012
  source accessed on: 2019-12-03T20:05:01Z
  source last accessed on: 2019-12-03T20:05:01Z
  definition: This segment includes companies that manufacture photovoltaic solar modules.
  notation: 1311111012
  valid from: 2014-08-08
  valid till: 2020-10-03
derived from: PV Modules
  type: BicsLevel6Segment
  type: Classifier
  type: ContemporaryDerivation
  derived from: http://data.ga-group.nl/ics/bics/2020/131110111012
  derived from: http://data.ga-group.nl/ics/bics/2024/131110111012
  source accessed on: 2023-07-03T18:11:29Z
  source last accessed on: 2024-06-05T14:42:36Z
  definition: This segment includes companies that manufacture photovoltaic (PV) modules, also known as solar modules.
  notation: 131110111012
  valid from: 2020-10-03
source accessed on: 2023-07-03T18:11:29Z
source last accessed on: 2024-06-05T14:42:36Z
definition: This segment includes companies that manufacture photovoltaic (PV) modules, also known as solar modules.
notation: 131110111012
valid from: 2020-10-03

PV Wafers
type: BicsLevel6Segment
type: Classifier
type: NamedIndividual
is level6 segment of: Solar Energy Equipment
replaces: PV Wafers
created with: infer-bics.sql
derived from: PV Wafers
  type: BicsLevel5Segment
  type: Classifier
  type: AnachronousDerivation
  derived from: http://data.ga-group.nl/ics/bics/2014/1311111013
  source accessed on: 2019-12-03T20:05:01Z
  source last accessed on: 2019-12-03T20:05:01Z
  definition: This segment includes companies that manufacture wafers used in the creation of solar cells or modules.
  notation: 1311111013
  valid from: 2014-08-08
  valid till: 2020-10-03
derived from: PV Wafers
  type: BicsLevel6Segment
  type: Classifier
  type: ContemporaryDerivation
  derived from: http://data.ga-group.nl/ics/bics/2020/131110111013
  derived from: http://data.ga-group.nl/ics/bics/2024/131110111013
  source accessed on: 2023-07-03T18:11:29Z
  source last accessed on: 2024-06-05T14:42:36Z
  definition: This segment includes companies that manufacture PV wafers used in the creation of PV cells.
  notation: 131110111013
  valid from: 2020-10-03
source accessed on: 2023-07-03T18:11:29Z
source last accessed on: 2024-06-05T14:42:36Z
definition: This segment includes companies that manufacture PV wafers used in the creation of PV cells.
notation: 131110111013
valid from: 2020-10-03

Solar Inverters
type: BicsLevel6Segment
type: Classifier
type: NamedIndividual
is level6 segment of: Solar Energy Equipment
replaces: Solar Inverters
created with: infer-bics.sql
derived from: Solar Inverters
  type: BicsLevel5Segment
  type: Classifier
  type: AnachronousDerivation
  derived from: http://data.ga-group.nl/ics/bics/2014/1311111014
  source accessed on: 2019-12-03T20:05:01Z
  source last accessed on: 2019-12-03T20:05:01Z
  definition: This segment includes companies that manufacture inverter equipment for the Solar Energy industry.
  notation: 1311111014
  valid from: 2014-08-08
  valid till: 2020-10-03
derived from: Solar Inverters
  type: BicsLevel6Segment
  type: Classifier
  type: ContemporaryDerivation
  derived from: http://data.ga-group.nl/ics/bics/2020/131110111014
  derived from: http://data.ga-group.nl/ics/bics/2024/131110111014
  source accessed on: 2023-07-03T18:11:29Z
  source last accessed on: 2024-06-05T14:42:36Z
  definition: This segment includes companies that manufacture inverter equipment for use with solar panel arrays.
  notation: 131110111014
  valid from: 2020-10-03
source accessed on: 2023-07-03T18:11:29Z
source last accessed on: 2024-06-05T14:42:36Z
definition: This segment includes companies that manufacture inverter equipment for use with solar panel arrays.
notation: 131110111014
valid from: 2020-10-03

Solar Thermal Elec Gen Equip
type: BicsLevel6Segment
type: Classifier
type: NamedIndividual
is level6 segment of: Solar Energy Equipment
replaces: Solar Thermal Elec Gen Equip
created with: infer-bics.sql
derived from: Solar Thermal Elec Gen Equip
  type: BicsLevel5Segment
  type: Classifier
  type: AnachronousDerivation
  derived from: http://data.ga-group.nl/ics/bics/2014/1311111015
  source accessed on: 2019-12-03T20:05:01Z
  source last accessed on: 2019-12-03T20:05:01Z
  definition: This segment includes companies that manufacture solar thermal electricity generation equipment.
  notation: 1311111015
  valid from: 2014-08-08
  valid till: 2020-10-03
derived from: Solar Thermal Elec Gen Equip
  type: BicsLevel6Segment
  type: Classifier
  type: ContemporaryDerivation
  derived from: http://data.ga-group.nl/ics/bics/2020/131110111015
  derived from: http://data.ga-group.nl/ics/bics/2024/131110111015
  source accessed on: 2023-07-03T18:11:29Z
  source last accessed on: 2024-06-05T14:42:36Z
  definition: This segment includes companies that manufacture solar thermal electricity generation equipment.
  notation: 131110111015
  valid from: 2020-10-03
source accessed on: 2023-07-03T18:11:29Z
source last accessed on: 2024-06-05T14:42:36Z
definition: This segment includes companies that manufacture solar thermal electricity generation equipment.
notation: 131110111015
valid from: 2020-10-03

Thin Film Modules
type: BicsLevel6Segment
type: Classifier
type: NamedIndividual
is level6 segment of: Solar Energy Equipment
replaces: Thin Film Modules
created with: infer-bics.sql
derived from: Thin Film Modules
  type: BicsLevel5Segment
  type: Classifier
  type: AnachronousDerivation
  derived from: http://data.ga-group.nl/ics/bics/2014/1311111016
  source accessed on: 2019-12-03T20:05:01Z
  source last accessed on: 2019-12-03T20:05:01Z
  definition: This segment includes companies that manufacture photovoltaic solar thin film modules.
  notation: 1311111016
  valid from: 2014-08-08
  valid till: 2020-10-03
derived from: Thin Film Modules
  type: BicsLevel6Segment
  type: Classifier
  type: ContemporaryDerivation
  derived from: http://data.ga-group.nl/ics/bics/2020/131110111016
  derived from: http://data.ga-group.nl/ics/bics/2024/131110111016
  source accessed on: 2023-07-03T18:11:29Z
  source last accessed on: 2024-06-05T14:42:36Z
  definition: This segment includes companies that manufacture thin film photovoltaic (PV) modules, also known as thin film solar modules.
  notation: 131110111016
  valid from: 2020-10-03
source accessed on: 2023-07-03T18:11:29Z
source last accessed on: 2024-06-05T14:42:36Z
definition: This segment includes companies that manufacture thin film photovoltaic (PV) modules, also known as thin film solar modules.
notation: 131110111016
valid from: 2020-10-03

Solar Energy Equipment
type: BicsLevel5Segment
type: Classifier
type: NamedIndividual
is level5 segment of: Renewable Energy Equipment
created with: infer-bics.sql
derived from: Gasification - FT Synthesis
  type: BicsLevel5Segment
  type: Classifier
  type: ContemporaryDerivation
  derived from: http://data.ga-group.nl/ics/bics/2014/1311101110
  source accessed on: 2019-12-03T20:05:01Z
  source last accessed on: 2019-12-03T20:05:01Z
  definition: This segment includes companies that produce biodiesel utilizing a gasification process.
  notation: 1311101110
  valid from: 2014-08-08
  valid till: 2020-10-03
derived from: Solar Energy Equipment
  type: BicsLevel4SubIndustry
  type: Classifier
  type: AnachronousDerivation
  derived from: http://data.ga-group.nl/ics/bics/2014/13111110
  source accessed on: 2019-12-03T20:05:01Z
  source last accessed on: 2019-12-03T20:05:01Z
  definition: This industry subgroup includes companies that manufacture solar energy equipment, such as polysilicon feedstock, thin film, modules, concentrated photovoltaics, crystalline silicon wafers, cells, modules and related equipment.
  notation: 13111110
  valid from: 2014-08-08
  valid till: 2020-10-03
derived from: Solar Energy Equipment
  type: BicsLevel5Segment
  type: Classifier
  type: ContemporaryDerivation
  derived from: http://data.ga-group.nl/ics/bics/2020/1311101110
  derived from: http://data.ga-group.nl/ics/bics/2024/1311101110
  source accessed on: 2023-07-03T18:11:29Z
  source last accessed on: 2024-06-05T14:42:36Z
  definition: This segment includes companies that manufacture equipment used to capture solar energy, such as polysilicon feedstock, photovoltaic (PV) panels, PV cells, PV modules, thin film modules, concentrated photovoltaics, crystalline silicon wafers, and related equipment.
  notation: 1311101110
  valid from: 2020-10-03
source accessed on: 2019-12-03T20:05:01Z
source last accessed on: 2024-06-05T14:42:36Z
definition: This segment includes companies that manufacture equipment used to capture solar energy, such as polysilicon feedstock, photovoltaic (PV) panels, PV cells, PV modules, thin film modules, concentrated photovoltaics, crystalline silicon wafers, and related equipment.
notation: 1311101110
valid from: 2014-08-08

Wind Turbines
type: BicsLevel6Segment
type: Classifier
type: NamedIndividual
is level6 segment of: Wind Energy Equipment
replaces: Wind Turbines
created with: infer-bics.sql
derived from: Wind Turbines
  type: BicsLevel5Segment
  type: Classifier
  type: AnachronousDerivation
  derived from: http://data.ga-group.nl/ics/bics/2014/1311111110
  source accessed on: 2019-12-03T20:05:01Z
  source last accessed on: 2019-12-03T20:05:01Z
  definition: This segment includes companies that manufacture wind-power generation machinery.
  notation: 1311111110
  valid from: 2014-08-08
  valid till: 2020-10-03
derived from: Wind Turbines
  type: BicsLevel6Segment
  type: Classifier
  type: ContemporaryDerivation
  derived from: http://data.ga-group.nl/ics/bics/2020/131110111110
  derived from: http://data.ga-group.nl/ics/bics/2024/131110111110
  source accessed on: 2023-07-03T18:11:29Z
  source last accessed on: 2024-06-05T14:42:36Z
  definition: This segment includes companies that manufacture wind turbines. Excludes companies that only manufacture specific parts of wind turbines (see "Wind Turbine Components").
  notation: 131110111110
  valid from: 2020-10-03
source accessed on: 2023-07-03T18:11:29Z
source last accessed on: 2024-06-05T14:42:36Z
definition: This segment includes companies that manufacture wind turbines. Excludes companies that only manufacture specific parts of wind turbines (see "Wind Turbine Components").
notation: 131110111110
valid from: 2020-10-03

Wind Turbine Components
type: BicsLevel6Segment
type: Classifier
type: NamedIndividual
is level6 segment of: Wind Energy Equipment
replaces: Wind Turbine Components
created with: infer-bics.sql
derived from: Wind Turbine Components
  type: BicsLevel5Segment
  type: Classifier
  type: AnachronousDerivation
  derived from: http://data.ga-group.nl/ics/bics/2014/1311111111
  source accessed on: 2019-12-03T20:05:01Z
  source last accessed on: 2019-12-03T20:05:01Z
  definition: This segment includes companies that manufacture components for the wind energy industry, such as bearings, blades, gearboxes, generators, pitch systems, towers and tower foundations.
  notation: 1311111111
  valid from: 2014-08-08
  valid till: 2020-10-03
derived from: Wind Turbine Components
  type: BicsLevel6Segment
  type: Classifier
  type: ContemporaryDerivation
  derived from: http://data.ga-group.nl/ics/bics/2020/131110111111
  derived from: http://data.ga-group.nl/ics/bics/2024/131110111111
  source accessed on: 2023-07-03T18:11:29Z
  source last accessed on: 2024-06-05T14:42:36Z
  definition: This segment includes companies that manufacture components for wind turbines, such as bearings, blades, gearboxes, generators, pitch systems, towers, and tower foundations.
  notation: 131110111111
  valid from: 2020-10-03
source accessed on: 2023-07-03T18:11:29Z
source last accessed on: 2024-06-05T14:42:36Z
definition: This segment includes companies that manufacture components for wind turbines, such as bearings, blades, gearboxes, generators, pitch systems, towers, and tower foundations.
notation: 131110111111
valid from: 2020-10-03

Wind Energy Equipment
type: BicsLevel5Segment
type: Classifier
type: NamedIndividual
is level5 segment of: Renewable Energy Equipment
created with: infer-bics.sql
derived from: Hydrotreatment
  type: BicsLevel5Segment
  type: Classifier
  type: ContemporaryDerivation
  derived from: http://data.ga-group.nl/ics/bics/2014/1311101111
  source accessed on: 2019-12-03T20:05:01Z
  source last accessed on: 2019-12-03T20:05:01Z
  definition: This segment includes companies that produce biodiesel utilizing a hydrotreatment process.
  notation: 1311101111
  valid from: 2014-08-08
  valid till: 2020-10-03
derived from: Wind Energy Equipment
  type: BicsLevel4SubIndustry
  type: Classifier
  type: AnachronousDerivation
  derived from: http://data.ga-group.nl/ics/bics/2014/13111111
  source accessed on: 2019-12-03T20:05:01Z
  source last accessed on: 2019-12-03T20:05:01Z
  definition: This industry subgroup includes companies that manufacture wind energy equipment, such as wind-power generation machinery, towers and components.
  notation: 13111111
  valid from: 2014-08-08
  valid till: 2020-10-03
derived from: Wind Energy Equipment
  type: BicsLevel5Segment
  type: Classifier
  type: ContemporaryDerivation
  derived from: http://data.ga-group.nl/ics/bics/2020/1311101111
  derived from: http://data.ga-group.nl/ics/bics/2024/1311101111
  source accessed on: 2023-07-03T18:11:29Z
  source last accessed on: 2024-06-05T14:42:36Z
  definition: This segment includes companies that manufacture equipment used to capture wind energy, such as wind-power generation machinery, towers, and components.
  notation: 1311101111
  valid from: 2020-10-03
source accessed on: 2019-12-03T20:05:01Z
source last accessed on: 2024-06-05T14:42:36Z
definition: This segment includes companies that manufacture equipment used to capture wind energy, such as wind-power generation machinery, towers, and components.
notation: 1311101111
valid from: 2014-08-08

Geothermal Energy Equipment
type: BicsLevel5Segment
type: Classifier
type: NamedIndividual
is level5 segment of: Renewable Energy Equipment
created with: infer-bics.sql
derived from: Transesterification
  type: BicsLevel5Segment
  type: Classifier
  type: ContemporaryDerivation
  derived from: http://data.ga-group.nl/ics/bics/2014/1311101112
  source accessed on: 2019-12-03T20:05:01Z
  source last accessed on: 2019-12-03T20:05:01Z
  definition: This segment includes companies that produce biodiesel utilizing a transesterification process.
  notation: 1311101112
  valid from: 2014-08-08
  valid till: 2020-10-03
derived from: Geothermal Energy Equipment
  type: BicsLevel4SubIndustry
  type: Classifier
  type: AnachronousDerivation
  derived from: http://data.ga-group.nl/ics/bics/2014/13111112
  source accessed on: 2019-12-03T20:05:01Z
  source last accessed on: 2019-12-03T20:05:01Z
  definition: This industry subgroup includes companies that manufacture equipment used in geothermal energy production. This includes geothermal equipment, thermoelectric generators and other geothermal energy components.
  notation: 13111112
  valid from: 2014-08-08
  valid till: 2020-10-03
derived from: Geothermal Energy Equipment
  type: BicsLevel5Segment
  type: Classifier
  type: ContemporaryDerivation
  derived from: http://data.ga-group.nl/ics/bics/2020/1311101112
  derived from: http://data.ga-group.nl/ics/bics/2024/1311101112
  source accessed on: 2023-07-03T18:11:29Z
  source last accessed on: 2024-06-05T14:42:36Z
  definition: This segment includes companies that manufacture equipment used to capture geothermal energy, such as thermoelectric generators and other geothermal energy components.
  notation: 1311101112
  valid from: 2020-10-03
source accessed on: 2019-12-03T20:05:01Z
source last accessed on: 2024-06-05T14:42:36Z
definition: This segment includes companies that manufacture equipment used to capture geothermal energy, such as thermoelectric generators and other geothermal energy components.
notation: 1311101112
valid from: 2014-08-08

Hydro Energy Equipment
type: BicsLevel5Segment
type: Classifier
type: NamedIndividual
is level5 segment of: Renewable Energy Equipment
created with: infer-bics.sql
derived from: Hydro Energy Equipment
  type: BicsLevel4SubIndustry
  type: Classifier
  type: AnachronousDerivation
  derived from: http://data.ga-group.nl/ics/bics/2014/13111113
  source accessed on: 2019-12-03T20:05:01Z
  source last accessed on: 2019-12-03T20:05:01Z
  definition: This industry subgroup includes companies that manufacture hydro energy equipment used in hydroelectric dams.
  notation: 13111113
  valid from: 2014-08-08
  valid till: 2020-10-03
derived from: Hydro Energy Equipment
  type: BicsLevel5Segment
  type: Classifier
  type: ContemporaryDerivation
  derived from: http://data.ga-group.nl/ics/bics/2020/1311101113
  derived from: http://data.ga-group.nl/ics/bics/2024/1311101113
  source accessed on: 2023-07-03T18:11:29Z
  source last accessed on: 2024-06-05T14:42:36Z
  definition: This segment includes companies that manufacture equipment used to capture energy from the storage and movement of water.
  notation: 1311101113
  valid from: 2020-10-03
source accessed on: 2023-07-03T18:11:29Z
source last accessed on: 2024-06-05T14:42:36Z
definition: This segment includes companies that manufacture equipment used to capture energy from the storage and movement of water.
notation: 1311101113
valid from: 2020-10-03

Marine Energy Equipment
type: BicsLevel5Segment
type: Classifier
type: NamedIndividual
is level5 segment of: Renewable Energy Equipment
created with: infer-bics.sql
derived from: Marine Energy Equipment
  type: BicsLevel4SubIndustry
  type: Classifier
  type: AnachronousDerivation
  derived from: http://data.ga-group.nl/ics/bics/2014/13111114
  source accessed on: 2019-12-03T20:05:01Z
  source last accessed on: 2019-12-03T20:05:01Z
  definition: This industry subgroup includes companies that manufacture marine energy equipment, such as ocean thermal convertors, wave energy convertors, tidal stream turbines and other marine energy equipment components.
  notation: 13111114
  valid from: 2014-08-08
  valid till: 2020-10-03
derived from: Marine Energy Equipment
  type: BicsLevel5Segment
  type: Classifier
  type: ContemporaryDerivation
  derived from: http://data.ga-group.nl/ics/bics/2020/1311101114
  derived from: http://data.ga-group.nl/ics/bics/2024/1311101114
  source accessed on: 2023-07-03T18:11:29Z
  source last accessed on: 2024-06-05T14:42:36Z
  definition: This segment includes companies that manufacture equipment used to capture energy from the ocean, such as ocean thermal convertors, wave energy convertors, tidal stream turbines, and other marine energy equipment components.
  notation: 1311101114
  valid from: 2020-10-03
source accessed on: 2023-07-03T18:11:29Z
source last accessed on: 2024-06-05T14:42:36Z
definition: This segment includes companies that manufacture equipment used to capture energy from the ocean, such as ocean thermal convertors, wave energy convertors, tidal stream turbines, and other marine energy equipment components.
notation: 1311101114
valid from: 2020-10-03

Fuel Cells
type: BicsLevel6Segment
type: Classifier
type: NamedIndividual
is level6 segment of: Other Renewable Energy Equip
replaces: Fuel Cells
created with: infer-bics.sql
derived from: Fuel Cells
  type: BicsLevel5Segment
  type: Classifier
  type: AnachronousDerivation
  derived from: http://data.ga-group.nl/ics/bics/2014/1311111513
  source accessed on: 2019-12-03T20:05:01Z
  source last accessed on: 2019-12-03T20:05:01Z
  definition: This segment includes companies that manufacture fuel cell equipment that is primarily for industrial- or utility-scale purposes.
  notation: 1311111513
  valid from: 2014-08-08
  valid till: 2020-10-03
derived from: Fuel Cells
  type: BicsLevel6Segment
  type: Classifier
  type: ContemporaryDerivation
  derived from: http://data.ga-group.nl/ics/bics/2020/131110111510
  derived from: http://data.ga-group.nl/ics/bics/2024/131110111510
  source accessed on: 2023-07-03T18:11:29Z
  source last accessed on: 2024-06-05T14:42:36Z
  definition: This segment includes companies that manufacture fuel cell equipment that is primarily for industrial- or utility-scale purposes.
  notation: 131110111510
  valid from: 2020-10-03
source accessed on: 2023-07-03T18:11:29Z
source last accessed on: 2024-06-05T14:42:36Z
definition: This segment includes companies that manufacture fuel cell equipment that is primarily for industrial- or utility-scale purposes.
notation: 131110111510
valid from: 2020-10-03

Smart Grid Equipment
type: BicsLevel6Segment
type: Classifier
type: NamedIndividual
is level6 segment of: Other Renewable Energy Equip
created with: infer-bics.sql
derived from: Smart Grid Equipment
  type: BicsLevel4SubIndustry
  type: Classifier
  type: AnachronousDerivation
  derived from: http://data.ga-group.nl/ics/bics/2014/13111116
  source accessed on: 2019-12-03T20:05:01Z
  source last accessed on: 2019-12-03T20:05:01Z
  definition: This industry subgroup includes companies that manufacture smart grid equipment.
  notation: 13111116
  valid from: 2014-08-08
  valid till: 2020-10-03
derived from: Smart Grid Equipment
  type: BicsLevel6Segment
  type: Classifier
  type: ContemporaryDerivation
  derived from: http://data.ga-group.nl/ics/bics/2020/131110111511
  derived from: http://data.ga-group.nl/ics/bics/2024/131110111511
  source accessed on: 2023-07-03T18:11:29Z
  source last accessed on: 2024-06-05T14:42:36Z
  definition: This segment includes companies that manufacture equipment used to improve the efficiency of an electrical grid by interacting with software, improving monitoring, and increasing automation.
  notation: 131110111511
  valid from: 2020-10-03
source accessed on: 2023-07-03T18:11:29Z
source last accessed on: 2024-06-05T14:42:36Z
definition: This segment includes companies that manufacture equipment used to improve the efficiency of an electrical grid by interacting with software, improving monitoring, and increasing automation.
notation: 131110111511
valid from: 2020-10-03

Energy Storage Systems
type: BicsLevel6Segment
type: Classifier
type: NamedIndividual
is level6 segment of: Other Renewable Energy Equip
replaces: Industrial Batteries
created with: infer-bics.sql
derived from: Industrial Batteries
  type: BicsLevel5Segment
  type: Classifier
  type: AnachronousDerivation
  derived from: http://data.ga-group.nl/ics/bics/2014/1311111510
  source accessed on: 2019-12-03T20:05:01Z
  source last accessed on: 2019-12-03T20:05:01Z
  definition: This segment includes companies that manufacture industrial-scale energy storage batteries.
  notation: 1311111510
  valid from: 2014-08-08
  valid till: 2020-10-03
derived from: Energy Storage Systems
  type: BicsLevel6Segment
  type: Classifier
  type: ContemporaryDerivation
  derived from: http://data.ga-group.nl/ics/bics/2020/131110111512
  derived from: http://data.ga-group.nl/ics/bics/2024/131110111512
  source accessed on: 2023-07-03T18:11:29Z
  source last accessed on: 2024-06-05T14:42:36Z
  definition: This segment includes companies that manufacture industrial or utility scale systems which store captured energy for future use. Includes large scale battery banks and gravity or kinetic energy-based storage systems.
  notation: 131110111512
  valid from: 2020-10-03
source accessed on: 2023-07-03T18:11:29Z
source last accessed on: 2024-06-05T14:42:36Z
definition: This segment includes companies that manufacture industrial or utility scale systems which store captured energy for future use. Includes large scale battery banks and gravity or kinetic energy-based storage systems.
notation: 131110111512
valid from: 2020-10-03

Other Renewable Energy Equip
type: BicsLevel5Segment
type: Classifier
type: NamedIndividual
is level5 segment of: Renewable Energy Equipment
created with: infer-bics.sql
derived from: Other Renewable Energy Equip
  type: BicsLevel4SubIndustry
  type: Classifier
  type: AnachronousDerivation
  derived from: http://data.ga-group.nl/ics/bics/2014/13111118
  source accessed on: 2019-12-03T20:05:01Z
  source last accessed on: 2019-12-03T20:05:01Z
  definition: This industry subgroup includes companies that manufacture alternative energy generation machinery, excluding wind-power machinery, solar cells and fuel cells. It also includes equipment used for geothermal and wave power.
  notation: 13111118
  valid from: 2014-08-08
  valid till: 2020-10-03
derived from: Other Renewable Energy Equip
  type: BicsLevel5Segment
  type: Classifier
  type: ContemporaryDerivation
  derived from: http://data.ga-group.nl/ics/bics/2020/1311101115
  derived from: http://data.ga-group.nl/ics/bics/2024/1311101115
  source accessed on: 2023-07-03T18:11:29Z
  source last accessed on: 2024-06-05T14:42:36Z
  definition: This segment includes companies that manufacture equipment used to capture energy from renewable energy sources not elsewhere classified, as well as equipment used to improve the efficiency of electricity use and storage.
  notation: 1311101115
  valid from: 2020-10-03
source accessed on: 2023-07-03T18:11:29Z
source last accessed on: 2024-06-05T14:42:36Z
definition: This segment includes companies that manufacture equipment used to capture energy from renewable energy sources not elsewhere classified, as well as equipment used to improve the efficiency of electricity use and storage.
notation: 1311101115
valid from: 2020-10-03

Renewable Energy Equipment
type: BicsLevel4SubIndustry
type: Classifier
type: NamedIndividual
replaces: Renewable Energy Equipment
created with: infer-bics.sql
derived from: Diesel Substitutes
  type: BicsLevel4SubIndustry
  type: Classifier
  type: ContemporaryDerivation
  derived from: http://data.ga-group.nl/ics/bics/2014/13111011
  source accessed on: 2019-12-03T20:05:01Z
  source last accessed on: 2019-12-03T20:05:01Z
  definition: This industry subgroup includes companies that produce biodiesel. Biodiesel is a fossil fuel substitute created from vegetable oil or animal fats. Biodiesel usually contains a percentage of traditional diesel fuel.
  notation: 13111011
  valid from: 2014-08-08
  valid till: 2020-10-03
derived from: Renewable Energy Equipment
  type: BicsLevel3Industry
  type: Classifier
  type: AnachronousDerivation
  derived from: http://data.ga-group.nl/ics/bics/2014/131111
  source accessed on: 2019-12-03T20:05:01Z
  source last accessed on: 2019-12-03T20:05:01Z
  definition: This industry includes companies that manufacture alternative energy generation machinery, such as wind-power machinery, solar cells, fuel cells and other alternative energy machinery. This segment can include research and development revenue.
  notation: 131111
  valid from: 2014-08-08
  valid till: 2020-10-03
derived from: Renewable Energy Equipment
  type: BicsLevel4SubIndustry
  type: Classifier
  type: ContemporaryDerivation
  derived from: http://data.ga-group.nl/ics/bics/2020/13111011
  derived from: http://data.ga-group.nl/ics/bics/2024/13111011
  source accessed on: 2023-07-03T18:11:29Z
  source last accessed on: 2024-06-05T14:42:36Z
  definition: This industry subgroup includes companies that manufacture equipment used to capture or store power from renewable energy sources.
  notation: 13111011
  valid from: 2020-10-03
source accessed on: 2019-12-03T20:05:01Z
source last accessed on: 2024-06-05T14:42:36Z
definition: This industry subgroup includes companies that manufacture equipment used to capture or store power from renewable energy sources.
notation: 13111011
valid from: 2014-08-08

Biomass Plant Construction
type: BicsLevel6Segment
type: Classifier
type: NamedIndividual
is level6 segment of: Development & Construction
replaces: Biomass Plant Construction
created with: infer-bics.sql
derived from: Biomass Plant Construction
  type: BicsLevel5Segment
  type: Classifier
  type: AnachronousDerivation
  derived from: http://data.ga-group.nl/ics/bics/2014/1311121010
  source accessed on: 2019-12-03T20:05:01Z
  source last accessed on: 2019-12-03T20:05:01Z
  definition: This segment includes companies that develop, build and manage biomass energy projects.
  notation: 1311121010
  valid from: 2014-08-08
  valid till: 2020-10-03
derived from: Biomass Plant Construction
  type: BicsLevel6Segment
  type: Classifier
  type: ContemporaryDerivation
  derived from: http://data.ga-group.nl/ics/bics/2020/131110121010
  derived from: http://data.ga-group.nl/ics/bics/2024/131110121010
  source accessed on: 2023-07-03T18:11:29Z
  source last accessed on: 2024-06-05T14:42:36Z
  definition: This segment includes companies that develop, build, and manage biomass energy projects.
  notation: 131110121010
  valid from: 2020-10-03
source accessed on: 2023-07-03T18:11:29Z
source last accessed on: 2024-06-05T14:42:36Z
definition: This segment includes companies that develop, build, and manage biomass energy projects.
notation: 131110121010
valid from: 2020-10-03

Solar Plant Construction
type: BicsLevel6Segment
type: Classifier
type: NamedIndividual
is level6 segment of: Development & Construction
replaces: Solar Plant Construction
created with: infer-bics.sql
derived from: Solar Plant Construction
  type: BicsLevel5Segment
  type: Classifier
  type: AnachronousDerivation
  derived from: http://data.ga-group.nl/ics/bics/2014/1311121011
  source accessed on: 2019-12-03T20:05:01Z
  source last accessed on: 2019-12-03T20:05:01Z
  definition: This segment includes companies that develop, build and manage solar energy projects.
  notation: 1311121011
  valid from: 2014-08-08
  valid till: 2020-10-03
derived from: Solar Plant Construction
  type: BicsLevel6Segment
  type: Classifier
  type: ContemporaryDerivation
  derived from: http://data.ga-group.nl/ics/bics/2020/131110121011
  derived from: http://data.ga-group.nl/ics/bics/2024/131110121011
  source accessed on: 2023-07-03T18:11:29Z
  source last accessed on: 2024-06-05T14:42:36Z
  definition: This segment includes companies that develop, build, and manage solar energy projects.
  notation: 131110121011
  valid from: 2020-10-03
source accessed on: 2023-07-03T18:11:29Z
source last accessed on: 2024-06-05T14:42:36Z
definition: This segment includes companies that develop, build, and manage solar energy projects.
notation: 131110121011
valid from: 2020-10-03

Wind Farm Construction
type: BicsLevel6Segment
type: Classifier
type: NamedIndividual
is level6 segment of: Development & Construction
replaces: Wind Farm Construction
created with: infer-bics.sql
derived from: Wind Farm Construction
  type: BicsLevel5Segment
  type: Classifier
  type: AnachronousDerivation
  derived from: http://data.ga-group.nl/ics/bics/2014/1311121012
  source accessed on: 2019-12-03T20:05:01Z
  source last accessed on: 2019-12-03T20:05:01Z
  definition: This segment includes companies that develop, build and manage wind energy projects.
  notation: 1311121012
  valid from: 2014-08-08
  valid till: 2020-10-03
derived from: Wind Farm Construction
  type: BicsLevel6Segment
  type: Classifier
  type: ContemporaryDerivation
  derived from: http://data.ga-group.nl/ics/bics/2020/131110121012
  derived from: http://data.ga-group.nl/ics/bics/2024/131110121012
  source accessed on: 2023-07-03T18:11:29Z
  source last accessed on: 2024-06-05T14:42:36Z
  definition: This segment includes companies that develop, build, and manage wind energy projects.
  notation: 131110121012
  valid from: 2020-10-03
source accessed on: 2023-07-03T18:11:29Z
source last accessed on: 2024-06-05T14:42:36Z
definition: This segment includes companies that develop, build, and manage wind energy projects.
notation: 131110121012
valid from: 2020-10-03

Development & Construction
type: BicsLevel5Segment
type: Classifier
type: NamedIndividual
is level5 segment of: Renewable Energy Project Dev
created with: infer-bics.sql
derived from: Enzymatic Hydrolysis
  type: BicsLevel5Segment
  type: Classifier
  type: ContemporaryDerivation
  derived from: http://data.ga-group.nl/ics/bics/2014/1311101210
  source accessed on: 2019-12-03T20:05:01Z
  source last accessed on: 2019-12-03T20:05:01Z
  definition: This segment includes companies that produce ethanol utilizing an enzymatic hydrolysis process.
  notation: 1311101210
  valid from: 2014-08-08
  valid till: 2020-10-03
derived from: Development & Construction
  type: BicsLevel4SubIndustry
  type: Classifier
  type: AnachronousDerivation
  derived from: http://data.ga-group.nl/ics/bics/2014/13111210
  source accessed on: 2019-12-03T20:05:01Z
  source last accessed on: 2019-12-03T20:05:01Z
  definition: This industry subgroup includes companies that develop, build and manage renewable energy projects.
  notation: 13111210
  valid from: 2014-08-08
  valid till: 2020-10-03
derived from: Development & Construction
  type: BicsLevel5Segment
  type: Classifier
  type: ContemporaryDerivation
  derived from: http://data.ga-group.nl/ics/bics/2020/1311101210
  derived from: http://data.ga-group.nl/ics/bics/2024/1311101210
  source accessed on: 2023-07-03T18:11:29Z
  source last accessed on: 2024-06-05T14:42:36Z
  definition: This segment includes companies that develop, build, and manage renewable energy projects.
  notation: 1311101210
  valid from: 2020-10-03
source accessed on: 2019-12-03T20:05:01Z
source last accessed on: 2024-06-05T14:42:36Z
definition: This segment includes companies that develop, build, and manage renewable energy projects.
notation: 1311101210
valid from: 2014-08-08

Operations & Maintenance
type: BicsLevel5Segment
type: Classifier
type: NamedIndividual
is level5 segment of: Renewable Energy Project Dev
created with: infer-bics.sql
derived from: Gasification Fermentation
  type: BicsLevel5Segment
  type: Classifier
  type: ContemporaryDerivation
  derived from: http://data.ga-group.nl/ics/bics/2014/1311101211
  source accessed on: 2019-12-03T20:05:01Z
  source last accessed on: 2019-12-03T20:05:01Z
  definition: This segment includes companies that produce ethanol utilizing a gasification fermentation process.
  notation: 1311101211
  valid from: 2014-08-08
  valid till: 2020-10-03
derived from: Operations & Maintenance
  type: BicsLevel4SubIndustry
  type: Classifier
  type: AnachronousDerivation
  derived from: http://data.ga-group.nl/ics/bics/2014/13111211
  source accessed on: 2019-12-03T20:05:01Z
  source last accessed on: 2019-12-03T20:05:01Z
  definition: This industry subgroup includes companies that provide operations and maintenance services for renewable energy projects.
  notation: 13111211
  valid from: 2014-08-08
  valid till: 2020-10-03
derived from: Operations & Maintenance
  type: BicsLevel5Segment
  type: Classifier
  type: ContemporaryDerivation
  derived from: http://data.ga-group.nl/ics/bics/2020/1311101211
  derived from: http://data.ga-group.nl/ics/bics/2024/1311101211
  source accessed on: 2023-07-03T18:11:29Z
  source last accessed on: 2024-06-05T14:42:36Z
  definition: This segment includes companies that provide operations and maintenance services for renewable energy projects, including repair and day-to-day upkeep of these sites.
  notation: 1311101211
  valid from: 2020-10-03
source accessed on: 2019-12-03T20:05:01Z
source last accessed on: 2024-06-05T14:42:36Z
definition: This segment includes companies that provide operations and maintenance services for renewable energy projects, including repair and day-to-day upkeep of these sites.
notation: 1311101211
valid from: 2014-08-08

Starch & Sugar Fermentation
type: BicsLevel5Segment
type: Classifier
type: NamedIndividual
is level5 segment of: Renewable Energy Project Dev
created with: infer-bics.sql
derived from: Starch & Sugar Fermentation
  type: BicsLevel5Segment
  type: Classifier
  type: ContemporaryDerivation
  derived from: http://data.ga-group.nl/ics/bics/2014/1311101212
  source accessed on: 2019-12-03T20:05:01Z
  source last accessed on: 2019-12-03T20:05:01Z
  definition: This segment includes companies that produce ethanol utilizing a starch/sugar fermentation process.
  notation: 1311101212
  valid from: 2014-08-08
  valid till: 2020-10-03
source accessed on: 2019-12-03T20:05:01Z
source last accessed on: 2019-12-03T20:05:01Z
definition: This segment includes companies that produce ethanol utilizing a starch/sugar fermentation process.
notation: 1311101212
valid from: 2014-08-08
valid till: 2020-10-03

Renewable Energy Project Dev
type: BicsLevel4SubIndustry
type: Classifier
type: NamedIndividual
replaces: Renewable Energy Project Dev
created with: infer-bics.sql
derived from: Gasoline Substitutes
  type: BicsLevel4SubIndustry
  type: Classifier
  type: ContemporaryDerivation
  derived from: http://data.ga-group.nl/ics/bics/2014/13111012
  source accessed on: 2019-12-03T20:05:01Z
  source last accessed on: 2019-12-03T20:05:01Z
  definition: This industry subgroup includes companies that produce ethanol. Ethanol is a fuel additive typically made from corn or sugar that reduces carbon emissions and lowers the amount of fossil fuels needed.
  notation: 13111012
  valid from: 2014-08-08
  valid till: 2020-10-03
derived from: Renewable Energy Project Dev
  type: BicsLevel3Industry
  type: Classifier
  type: AnachronousDerivation
  derived from: http://data.ga-group.nl/ics/bics/2014/131112
  source accessed on: 2019-12-03T20:05:01Z
  source last accessed on: 2019-12-03T20:05:01Z
  definition: This industry includes companies that develop, build and manage renewable energy projects. It also includes companies that provide operations and maintenance services.
  notation: 131112
  valid from: 2014-08-08
  valid till: 2020-10-03
derived from: Renewable Energy Project Dev
  type: BicsLevel4SubIndustry
  type: Classifier
  type: ContemporaryDerivation
  derived from: http://data.ga-group.nl/ics/bics/2020/13111012
  derived from: http://data.ga-group.nl/ics/bics/2024/13111012
  source accessed on: 2023-07-03T18:11:29Z
  source last accessed on: 2024-06-05T14:42:36Z
  definition: This industry subgroup includes companies that develop, build, and manage renewable energy projects. Includes companies that provide operations and maintenance services.
  notation: 13111012
  valid from: 2020-10-03
source accessed on: 2019-12-03T20:05:01Z
source last accessed on: 2024-06-05T14:42:36Z
definition: This industry subgroup includes companies that develop, build, and manage renewable energy projects. Includes companies that provide operations and maintenance services.
notation: 13111012
valid from: 2014-08-08

Renewable Energy
type: BicsLevel3Industry
type: Classifier
type: NamedIndividual
is industry of: Renewable Energy
is replaced by: Biofuels
replaces: Renewable Energy
created with: infer-bics.sql
derived from: Renewable Energy
  type: BicsLevel2IndustryGroup
  type: Classifier
  type: AnachronousDerivation
  derived from: http://data.ga-group.nl/ics/bics/2014/1311
  source accessed on: 2019-12-03T20:05:01Z
  source last accessed on: 2019-12-03T20:05:01Z
  definition: This industry group includes companies involved in the production of energy from renewable sources, such as wind, solar, biomass, geothermal, hydroelectric, wave, tidal and fuel cells. Industries include alternative energy equipment manufacturers, alternative energy power plant developers and alternative energy utilities.
  notation: 1311
  valid from: 2014-08-08
  valid till: 2020-10-03
derived from: Biofuels
  type: BicsLevel3Industry
  type: Classifier
  type: ContemporaryDerivation
  derived from: http://data.ga-group.nl/ics/bics/2014/131110
  source accessed on: 2019-12-03T20:05:01Z
  source last accessed on: 2019-12-03T20:05:01Z
  definition: This industry includes companies that produce ethanol and or biodiesel.
  notation: 131110
  valid from: 2014-08-08
  valid till: 2020-10-03
derived from: Renewable Energy
  type: BicsLevel3Industry
  type: Classifier
  type: ContemporaryDerivation
  derived from: http://data.ga-group.nl/ics/bics/2020/131110
  derived from: http://data.ga-group.nl/ics/bics/2024/131110
  source accessed on: 2023-07-03T18:11:29Z
  source last accessed on: 2024-06-05T14:42:36Z
  definition: This industry includes companies that are involved in the extraction and capturing of renewable energy resources.
  notation: 131110
  valid from: 2020-10-03
source accessed on: 2019-12-03T20:05:01Z
source last accessed on: 2024-06-05T14:42:36Z
definition: This industry includes companies that are involved in the extraction and capturing of renewable energy resources.
notation: 131110
valid from: 2014-08-08

Monocrystalline Silicon
type: BicsLevel6Segment
type: Classifier
type: NamedIndividual
is level6 segment of: Polysilicon
created with: infer-bics.sql
derived from: Monocrystalline Silicon
  type: BicsLevel6Segment
  type: Classifier
  type: ContemporaryDerivation
  derived from: http://data.ga-group.nl/ics/bics/2014/131111101010
  source accessed on: 2019-12-03T20:05:01Z
  source last accessed on: 2019-12-03T20:05:01Z
  definition: This segment includes companies that manufacture monocrystalline silicon ingots for the solar energy industry.
  notation: 131111101010
  valid from: 2014-08-08
  valid till: 2020-10-03
source accessed on: 2019-12-03T20:05:01Z
source last accessed on: 2019-12-03T20:05:01Z
definition: This segment includes companies that manufacture monocrystalline silicon ingots for the solar energy industry.
notation: 131111101010
valid from: 2014-08-08
valid till: 2020-10-03

Multicrystalline Silicon
type: BicsLevel6Segment
type: Classifier
type: NamedIndividual
is level6 segment of: Polysilicon
created with: infer-bics.sql
derived from: Multicrystalline Silicon
  type: BicsLevel6Segment
  type: Classifier
  type: ContemporaryDerivation
  derived from: http://data.ga-group.nl/ics/bics/2014/131111101011
  source accessed on: 2019-12-03T20:05:01Z
  source last accessed on: 2019-12-03T20:05:01Z
  definition: This segment includes companies involved in the manufacturing of multicrystalline silicon ingots for the solar energy industry.
  notation: 131111101011
  valid from: 2014-08-08
  valid till: 2020-10-03
source accessed on: 2019-12-03T20:05:01Z
source last accessed on: 2019-12-03T20:05:01Z
definition: This segment includes companies involved in the manufacturing of multicrystalline silicon ingots for the solar energy industry.
notation: 131111101011
valid from: 2014-08-08
valid till: 2020-10-03

Polysilicon Solar Grade
type: BicsLevel6Segment
type: Classifier
type: NamedIndividual
is level6 segment of: Polysilicon
created with: infer-bics.sql
derived from: Polysilicon Solar Grade
  type: BicsLevel6Segment
  type: Classifier
  type: ContemporaryDerivation
  derived from: http://data.ga-group.nl/ics/bics/2014/131111101012
  source accessed on: 2019-12-03T20:05:01Z
  source last accessed on: 2019-12-03T20:05:01Z
  definition: This segment includes companies that manufacture solar-grade polysilicon for the solar energy industry.
  notation: 131111101012
  valid from: 2014-08-08
  valid till: 2020-10-03
source accessed on: 2019-12-03T20:05:01Z
source last accessed on: 2019-12-03T20:05:01Z
definition: This segment includes companies that manufacture solar-grade polysilicon for the solar energy industry.
notation: 131111101012
valid from: 2014-08-08
valid till: 2020-10-03

Polysilicon Upgrd Metallurgical
type: BicsLevel6Segment
type: Classifier
type: NamedIndividual
is level6 segment of: Polysilicon
created with: infer-bics.sql
derived from: Polysilicon Upgrd Metallurgical
  type: BicsLevel6Segment
  type: Classifier
  type: ContemporaryDerivation
  derived from: http://data.ga-group.nl/ics/bics/2014/131111101013
  source accessed on: 2019-12-03T20:05:01Z
  source last accessed on: 2019-12-03T20:05:01Z
  definition: This segment includes companies that manufacture upgraded metallurgical polysilicon for the solar energy industry.
  notation: 131111101013
  valid from: 2014-08-08
  valid till: 2020-10-03
source accessed on: 2019-12-03T20:05:01Z
source last accessed on: 2019-12-03T20:05:01Z
definition: This segment includes companies that manufacture upgraded metallurgical polysilicon for the solar energy industry.
notation: 131111101013
valid from: 2014-08-08
valid till: 2020-10-03

Silane
type: BicsLevel6Segment
type: Classifier
type: NamedIndividual
is level6 segment of: Polysilicon
created with: infer-bics.sql
derived from: Silane
  type: BicsLevel6Segment
  type: Classifier
  type: ContemporaryDerivation
  derived from: http://data.ga-group.nl/ics/bics/2014/131111101014
  source accessed on: 2019-12-03T20:05:01Z
  source last accessed on: 2019-12-03T20:05:01Z
  definition: This segment includes companies that manufacture silane for the solar energy industry.
  notation: 131111101014
  valid from: 2014-08-08
  valid till: 2020-10-03
source accessed on: 2019-12-03T20:05:01Z
source last accessed on: 2019-12-03T20:05:01Z
definition: This segment includes companies that manufacture silane for the solar energy industry.
notation: 131111101014
valid from: 2014-08-08
valid till: 2020-10-03

Polysilicon
type: BicsLevel5Segment
type: Classifier
type: NamedIndividual
is level5 segment of: Solar Energy Equipment
is replaced by: Polysilicon
created with: infer-bics.sql
derived from: Polysilicon
  type: BicsLevel5Segment
  type: Classifier
  type: ContemporaryDerivation
  derived from: http://data.ga-group.nl/ics/bics/2014/1311111010
  source accessed on: 2019-12-03T20:05:01Z
  source last accessed on: 2019-12-03T20:05:01Z
  definition: This segment includes companies that manufacture polysilicon feedstock for the solar energy industry.
  notation: 1311111010
  valid from: 2014-08-08
  valid till: 2020-10-03
source accessed on: 2019-12-03T20:05:01Z
source last accessed on: 2019-12-03T20:05:01Z
definition: This segment includes companies that manufacture polysilicon feedstock for the solar energy industry.
notation: 1311111010
valid from: 2014-08-08
valid till: 2020-10-03

PV Cells CPV
type: BicsLevel6Segment
type: Classifier
type: NamedIndividual
is level6 segment of: PV Cells
created with: infer-bics.sql
derived from: PV Cells CPV
  type: BicsLevel6Segment
  type: Classifier
  type: ContemporaryDerivation
  derived from: http://data.ga-group.nl/ics/bics/2014/131111101110
  source accessed on: 2019-12-03T20:05:01Z
  source last accessed on: 2019-12-03T20:05:01Z
  definition: This segment includes companies that manufacture concentrated photovoltaic (CPV) solar cells.
  notation: 131111101110
  valid from: 2014-08-08
  valid till: 2020-10-03
source accessed on: 2019-12-03T20:05:01Z
source last accessed on: 2019-12-03T20:05:01Z
definition: This segment includes companies that manufacture concentrated photovoltaic (CPV) solar cells.
notation: 131111101110
valid from: 2014-08-08
valid till: 2020-10-03

PV Cells Crystalline Silicon
type: BicsLevel6Segment
type: Classifier
type: NamedIndividual
is level6 segment of: PV Cells
created with: infer-bics.sql
derived from: PV Cells Crystalline Silicon
  type: BicsLevel6Segment
  type: Classifier
  type: ContemporaryDerivation
  derived from: http://data.ga-group.nl/ics/bics/2014/131111101111
  source accessed on: 2019-12-03T20:05:01Z
  source last accessed on: 2019-12-03T20:05:01Z
  definition: This segment includes companies that manufacture crystalline silicon solar cells.
  notation: 131111101111
  valid from: 2014-08-08
  valid till: 2020-10-03
source accessed on: 2019-12-03T20:05:01Z
source last accessed on: 2019-12-03T20:05:01Z
definition: This segment includes companies that manufacture crystalline silicon solar cells.
notation: 131111101111
valid from: 2014-08-08
valid till: 2020-10-03

PV Cells Gallium Arsenide
type: BicsLevel6Segment
type: Classifier
type: NamedIndividual
is level6 segment of: PV Cells
created with: infer-bics.sql
derived from: PV Cells Gallium Arsenide
  type: BicsLevel6Segment
  type: Classifier
  type: ContemporaryDerivation
  derived from: http://data.ga-group.nl/ics/bics/2014/131111101112
  source accessed on: 2019-12-03T20:05:01Z
  source last accessed on: 2019-12-03T20:05:01Z
  definition: This segment includes companies that manufacture gallium arsenide solar cells.
  notation: 131111101112
  valid from: 2014-08-08
  valid till: 2020-10-03
source accessed on: 2019-12-03T20:05:01Z
source last accessed on: 2019-12-03T20:05:01Z
definition: This segment includes companies that manufacture gallium arsenide solar cells.
notation: 131111101112
valid from: 2014-08-08
valid till: 2020-10-03

PV Cells Nanostructured & Dyed
type: BicsLevel6Segment
type: Classifier
type: NamedIndividual
is level6 segment of: PV Cells
created with: infer-bics.sql
derived from: PV Cells Nanostructured & Dyed
  type: BicsLevel6Segment
  type: Classifier
  type: ContemporaryDerivation
  derived from: http://data.ga-group.nl/ics/bics/2014/131111101113
  source accessed on: 2019-12-03T20:05:01Z
  source last accessed on: 2019-12-03T20:05:01Z
  definition: This segment includes companies that manufacture nanostructured or dye-based solar cells.
  notation: 131111101113
  valid from: 2014-08-08
  valid till: 2020-10-03
source accessed on: 2019-12-03T20:05:01Z
source last accessed on: 2019-12-03T20:05:01Z
definition: This segment includes companies that manufacture nanostructured or dye-based solar cells.
notation: 131111101113
valid from: 2014-08-08
valid till: 2020-10-03

PV Cells Other
type: BicsLevel6Segment
type: Classifier
type: NamedIndividual
is level6 segment of: PV Cells
created with: infer-bics.sql
derived from: PV Cells Other
  type: BicsLevel6Segment
  type: Classifier
  type: ContemporaryDerivation
  derived from: http://data.ga-group.nl/ics/bics/2014/131111101114
  source accessed on: 2019-12-03T20:05:01Z
  source last accessed on: 2019-12-03T20:05:01Z
  definition: This segment includes companies that manufacture other forms of solar cells not elsewhere classified.
  notation: 131111101114
  valid from: 2014-08-08
  valid till: 2020-10-03
source accessed on: 2019-12-03T20:05:01Z
source last accessed on: 2019-12-03T20:05:01Z
definition: This segment includes companies that manufacture other forms of solar cells not elsewhere classified.
notation: 131111101114
valid from: 2014-08-08
valid till: 2020-10-03

PV Cells
type: BicsLevel5Segment
type: Classifier
type: NamedIndividual
is level5 segment of: Solar Energy Equipment
is replaced by: PV Cells
created with: infer-bics.sql
derived from: PV Cells
  type: BicsLevel5Segment
  type: Classifier
  type: ContemporaryDerivation
  derived from: http://data.ga-group.nl/ics/bics/2014/1311111011
  source accessed on: 2019-12-03T20:05:01Z
  source last accessed on: 2019-12-03T20:05:01Z
  definition: This segment includes companies that manufacture solar cells and other photovoltaic equipment. Such equipment can include solar cells, solar modules and related components.
  notation: 1311111011
  valid from: 2014-08-08
  valid till: 2020-10-03
source accessed on: 2019-12-03T20:05:01Z
source last accessed on: 2019-12-03T20:05:01Z
definition: This segment includes companies that manufacture solar cells and other photovoltaic equipment. Such equipment can include solar cells, solar modules and related components.
notation: 1311111011
valid from: 2014-08-08
valid till: 2020-10-03

PV Modules Crystal Silicon
type: BicsLevel6Segment
type: Classifier
type: NamedIndividual
is level6 segment of: PV Modules
created with: infer-bics.sql
derived from: PV Modules Crystal Silicon
  type: BicsLevel6Segment
  type: Classifier
  type: ContemporaryDerivation
  derived from: http://data.ga-group.nl/ics/bics/2014/131111101210
  source accessed on: 2019-12-03T20:05:01Z
  source last accessed on: 2019-12-03T20:05:01Z
  definition: This segment includes companies that manufacture crystalline silicon photovoltaic (PV) solar modules.
  notation: 131111101210
  valid from: 2014-08-08
  valid till: 2020-10-03
source accessed on: 2019-12-03T20:05:01Z
source last accessed on: 2019-12-03T20:05:01Z
definition: This segment includes companies that manufacture crystalline silicon photovoltaic (PV) solar modules.
notation: 131111101210
valid from: 2014-08-08
valid till: 2020-10-03

PV Modules Gallium Arsenide
type: BicsLevel6Segment
type: Classifier
type: NamedIndividual
is level6 segment of: PV Modules
created with: infer-bics.sql
derived from: PV Modules Gallium Arsenide
  type: BicsLevel6Segment
  type: Classifier
  type: ContemporaryDerivation
  derived from: http://data.ga-group.nl/ics/bics/2014/131111101211
  source accessed on: 2019-12-03T20:05:01Z
  source last accessed on: 2019-12-03T20:05:01Z
  definition: This segment includes companies that manufacture gallium arsenide photovoltaic (PV) solar modules.
  notation: 131111101211
  valid from: 2014-08-08
  valid till: 2020-10-03
source accessed on: 2019-12-03T20:05:01Z
source last accessed on: 2019-12-03T20:05:01Z
definition: This segment includes companies that manufacture gallium arsenide photovoltaic (PV) solar modules.
notation: 131111101211
valid from: 2014-08-08
valid till: 2020-10-03

PV Modules Nanostruct & Dyed
type: BicsLevel6Segment
type: Classifier
type: NamedIndividual
is level6 segment of: PV Modules
created with: infer-bics.sql
derived from: PV Modules Nanostruct & Dyed
  type: BicsLevel6Segment
  type: Classifier
  type: ContemporaryDerivation
  derived from: http://data.ga-group.nl/ics/bics/2014/131111101212
  source accessed on: 2019-12-03T20:05:01Z
  source last accessed on: 2019-12-03T20:05:01Z
  definition: This segment includes companies that manufacture nanostructured or dye-based photovoltaic (PV) solar modules.
  notation: 131111101212
  valid from: 2014-08-08
  valid till: 2020-10-03
source accessed on: 2019-12-03T20:05:01Z
source last accessed on: 2019-12-03T20:05:01Z
definition: This segment includes companies that manufacture nanostructured or dye-based photovoltaic (PV) solar modules.
notation: 131111101212
valid from: 2014-08-08
valid till: 2020-10-03

PV Modules Other
type: BicsLevel6Segment
type: Classifier
type: NamedIndividual
is level6 segment of: PV Modules
created with: infer-bics.sql
derived from: PV Modules Other
  type: BicsLevel6Segment
  type: Classifier
  type: ContemporaryDerivation
  derived from: http://data.ga-group.nl/ics/bics/2014/131111101213
  source accessed on: 2019-12-03T20:05:01Z
  source last accessed on: 2019-12-03T20:05:01Z
  definition: This segment includes companies that manufacture other forms of photovoltaic (PV) solar modules not elsewhere classified.
  notation: 131111101213
  valid from: 2014-08-08
  valid till: 2020-10-03
source accessed on: 2019-12-03T20:05:01Z
source last accessed on: 2019-12-03T20:05:01Z
definition: This segment includes companies that manufacture other forms of photovoltaic (PV) solar modules not elsewhere classified.
notation: 131111101213
valid from: 2014-08-08
valid till: 2020-10-03

PV Modules
type: BicsLevel5Segment
type: Classifier
type: NamedIndividual
is level5 segment of: Solar Energy Equipment
is replaced by: PV Modules
created with: infer-bics.sql
derived from: PV Modules
  type: BicsLevel5Segment
  type: Classifier
  type: ContemporaryDerivation
  derived from: http://data.ga-group.nl/ics/bics/2014/1311111012
  source accessed on: 2019-12-03T20:05:01Z
  source last accessed on: 2019-12-03T20:05:01Z
  definition: This segment includes companies that manufacture photovoltaic solar modules.
  notation: 1311111012
  valid from: 2014-08-08
  valid till: 2020-10-03
source accessed on: 2019-12-03T20:05:01Z
source last accessed on: 2019-12-03T20:05:01Z
definition: This segment includes companies that manufacture photovoltaic solar modules.
notation: 1311111012
valid from: 2014-08-08
valid till: 2020-10-03

PV Wafers
type: BicsLevel5Segment
type: Classifier
type: NamedIndividual
is level5 segment of: Solar Energy Equipment
is replaced by: PV Wafers
created with: infer-bics.sql
derived from: PV Wafers
  type: BicsLevel5Segment
  type: Classifier
  type: ContemporaryDerivation
  derived from: http://data.ga-group.nl/ics/bics/2014/1311111013
  source accessed on: 2019-12-03T20:05:01Z
  source last accessed on: 2019-12-03T20:05:01Z
  definition: This segment includes companies that manufacture wafers used in the creation of solar cells or modules.
  notation: 1311111013
  valid from: 2014-08-08
  valid till: 2020-10-03
source accessed on: 2019-12-03T20:05:01Z
source last accessed on: 2019-12-03T20:05:01Z
definition: This segment includes companies that manufacture wafers used in the creation of solar cells or modules.
notation: 1311111013
valid from: 2014-08-08
valid till: 2020-10-03

Solar Inverters
type: BicsLevel5Segment
type: Classifier
type: NamedIndividual
is level5 segment of: Solar Energy Equipment
is replaced by: Solar Inverters
created with: infer-bics.sql
derived from: Solar Inverters
  type: BicsLevel5Segment
  type: Classifier
  type: ContemporaryDerivation
  derived from: http://data.ga-group.nl/ics/bics/2014/1311111014
  source accessed on: 2019-12-03T20:05:01Z
  source last accessed on: 2019-12-03T20:05:01Z
  definition: This segment includes companies that manufacture inverter equipment for the Solar Energy industry.
  notation: 1311111014
  valid from: 2014-08-08
  valid till: 2020-10-03
source accessed on: 2019-12-03T20:05:01Z
source last accessed on: 2019-12-03T20:05:01Z
definition: This segment includes companies that manufacture inverter equipment for the Solar Energy industry.
notation: 1311111014
valid from: 2014-08-08
valid till: 2020-10-03

STEG Fresnel Linear Reflector
type: BicsLevel6Segment
type: Classifier
type: NamedIndividual
is level6 segment of: Solar Thermal Elec Gen Equip
created with: infer-bics.sql
derived from: STEG Fresnel Linear Reflector
  type: BicsLevel6Segment
  type: Classifier
  type: ContemporaryDerivation
  derived from: http://data.ga-group.nl/ics/bics/2014/131111101510
  source accessed on: 2019-12-03T20:05:01Z
  source last accessed on: 2019-12-03T20:05:01Z
  definition: This segment includes companies that manufacture Fresnel Linear Reflectors for solar thermal electricity generation (STEG) equipment.
  notation: 131111101510
  valid from: 2014-08-08
  valid till: 2020-10-03
source accessed on: 2019-12-03T20:05:01Z
source last accessed on: 2019-12-03T20:05:01Z
definition: This segment includes companies that manufacture Fresnel Linear Reflectors for solar thermal electricity generation (STEG) equipment.
notation: 131111101510
valid from: 2014-08-08
valid till: 2020-10-03

STEG Parabolic Dish
type: BicsLevel6Segment
type: Classifier
type: NamedIndividual
is level6 segment of: Solar Thermal Elec Gen Equip
created with: infer-bics.sql
derived from: STEG Parabolic Dish
  type: BicsLevel6Segment
  type: Classifier
  type: ContemporaryDerivation
  derived from: http://data.ga-group.nl/ics/bics/2014/131111101511
  source accessed on: 2019-12-03T20:05:01Z
  source last accessed on: 2019-12-03T20:05:01Z
  definition: This segment includes companies that manufacture parabolic dishes for solar thermal electricity generation (STEG) equipment.
  notation: 131111101511
  valid from: 2014-08-08
  valid till: 2020-10-03
source accessed on: 2019-12-03T20:05:01Z
source last accessed on: 2019-12-03T20:05:01Z
definition: This segment includes companies that manufacture parabolic dishes for solar thermal electricity generation (STEG) equipment.
notation: 131111101511
valid from: 2014-08-08
valid till: 2020-10-03

STEG Parabolic Trough
type: BicsLevel6Segment
type: Classifier
type: NamedIndividual
is level6 segment of: Solar Thermal Elec Gen Equip
created with: infer-bics.sql
derived from: STEG Parabolic Trough
  type: BicsLevel6Segment
  type: Classifier
  type: ContemporaryDerivation
  derived from: http://data.ga-group.nl/ics/bics/2014/131111101512
  source accessed on: 2019-12-03T20:05:01Z
  source last accessed on: 2019-12-03T20:05:01Z
  definition: This segment includes companies that manufacture parabolic troughs for solar thermal electricity generation (STEG) equipment.
  notation: 131111101512
  valid from: 2014-08-08
  valid till: 2020-10-03
source accessed on: 2019-12-03T20:05:01Z
source last accessed on: 2019-12-03T20:05:01Z
definition: This segment includes companies that manufacture parabolic troughs for solar thermal electricity generation (STEG) equipment.
notation: 131111101512
valid from: 2014-08-08
valid till: 2020-10-03

STEG Solar Chimney
type: BicsLevel6Segment
type: Classifier
type: NamedIndividual
is level6 segment of: Solar Thermal Elec Gen Equip
created with: infer-bics.sql
derived from: STEG Solar Chimney
  type: BicsLevel6Segment
  type: Classifier
  type: ContemporaryDerivation
  derived from: http://data.ga-group.nl/ics/bics/2014/131111101513
  source accessed on: 2019-12-03T20:05:01Z
  source last accessed on: 2019-12-03T20:05:01Z
  definition: This segment includes companies that manufacture solar chimneys for solar thermal electricity generation (STEG) equipment.
  notation: 131111101513
  valid from: 2014-08-08
  valid till: 2020-10-03
source accessed on: 2019-12-03T20:05:01Z
source last accessed on: 2019-12-03T20:05:01Z
definition: This segment includes companies that manufacture solar chimneys for solar thermal electricity generation (STEG) equipment.
notation: 131111101513
valid from: 2014-08-08
valid till: 2020-10-03

STEG Tower & Heliostat
type: BicsLevel6Segment
type: Classifier
type: NamedIndividual
is level6 segment of: Solar Thermal Elec Gen Equip
created with: infer-bics.sql
derived from: STEG Tower & Heliostat
  type: BicsLevel6Segment
  type: Classifier
  type: ContemporaryDerivation
  derived from: http://data.ga-group.nl/ics/bics/2014/131111101514
  source accessed on: 2019-12-03T20:05:01Z
  source last accessed on: 2019-12-03T20:05:01Z
  definition: This segment includes companies that manufacture towers and heliostats for solar thermal electricity generation equipment.
  notation: 131111101514
  valid from: 2014-08-08
  valid till: 2020-10-03
source accessed on: 2019-12-03T20:05:01Z
source last accessed on: 2019-12-03T20:05:01Z
definition: This segment includes companies that manufacture towers and heliostats for solar thermal electricity generation equipment.
notation: 131111101514
valid from: 2014-08-08
valid till: 2020-10-03

STEG Other
type: BicsLevel6Segment
type: Classifier
type: NamedIndividual
is level6 segment of: Solar Thermal Elec Gen Equip
created with: infer-bics.sql
derived from: STEG Other
  type: BicsLevel6Segment
  type: Classifier
  type: ContemporaryDerivation
  derived from: http://data.ga-group.nl/ics/bics/2014/131111101515
  source accessed on: 2019-12-03T20:05:01Z
  source last accessed on: 2019-12-03T20:05:01Z
  definition: This segment includes companies that manufacture other components for solar thermal electricity generation (STEG) equipment.
  notation: 131111101515
  valid from: 2014-08-08
  valid till: 2020-10-03
source accessed on: 2019-12-03T20:05:01Z
source last accessed on: 2019-12-03T20:05:01Z
definition: This segment includes companies that manufacture other components for solar thermal electricity generation (STEG) equipment.
notation: 131111101515
valid from: 2014-08-08
valid till: 2020-10-03

Solar Thermal Elec Gen Equip
type: BicsLevel5Segment
type: Classifier
type: NamedIndividual
is level5 segment of: Solar Energy Equipment
is replaced by: Solar Thermal Elec Gen Equip
created with: infer-bics.sql
derived from: Solar Thermal Elec Gen Equip
  type: BicsLevel5Segment
  type: Classifier
  type: ContemporaryDerivation
  derived from: http://data.ga-group.nl/ics/bics/2014/1311111015
  source accessed on: 2019-12-03T20:05:01Z
  source last accessed on: 2019-12-03T20:05:01Z
  definition: This segment includes companies that manufacture solar thermal electricity generation equipment.
  notation: 1311111015
  valid from: 2014-08-08
  valid till: 2020-10-03
source accessed on: 2019-12-03T20:05:01Z
source last accessed on: 2019-12-03T20:05:01Z
definition: This segment includes companies that manufacture solar thermal electricity generation equipment.
notation: 1311111015
valid from: 2014-08-08
valid till: 2020-10-03

PV Thin Film Non-Silicon Modules
type: BicsLevel6Segment
type: Classifier
type: NamedIndividual
is level6 segment of: Thin Film Modules
created with: infer-bics.sql
derived from: PV Thin Film Non-Silicon Modules
  type: BicsLevel6Segment
  type: Classifier
  type: ContemporaryDerivation
  derived from: http://data.ga-group.nl/ics/bics/2014/131111101610
  source accessed on: 2019-12-03T20:05:01Z
  source last accessed on: 2019-12-03T20:05:01Z
  definition: This segment includes companies that manufacture photovoltaic (PV) solar thin film non-silicon modules.
  notation: 131111101610
  valid from: 2014-08-08
  valid till: 2020-10-03
source accessed on: 2019-12-03T20:05:01Z
source last accessed on: 2019-12-03T20:05:01Z
definition: This segment includes companies that manufacture photovoltaic (PV) solar thin film non-silicon modules.
notation: 131111101610
valid from: 2014-08-08
valid till: 2020-10-03

PV Thin Film Silicon Modules
type: BicsLevel6Segment
type: Classifier
type: NamedIndividual
is level6 segment of: Thin Film Modules
created with: infer-bics.sql
derived from: PV Thin Film Silicon Modules
  type: BicsLevel6Segment
  type: Classifier
  type: ContemporaryDerivation
  derived from: http://data.ga-group.nl/ics/bics/2014/131111101611
  source accessed on: 2019-12-03T20:05:01Z
  source last accessed on: 2019-12-03T20:05:01Z
  definition: This segment includes companies that manufacture photovoltaic (PV) solar thin film silicon modules.
  notation: 131111101611
  valid from: 2014-08-08
  valid till: 2020-10-03
source accessed on: 2019-12-03T20:05:01Z
source last accessed on: 2019-12-03T20:05:01Z
definition: This segment includes companies that manufacture photovoltaic (PV) solar thin film silicon modules.
notation: 131111101611
valid from: 2014-08-08
valid till: 2020-10-03

PV Thin Film Other
type: BicsLevel6Segment
type: Classifier
type: NamedIndividual
is level6 segment of: Thin Film Modules
created with: infer-bics.sql
derived from: PV Thin Film Other
  type: BicsLevel6Segment
  type: Classifier
  type: ContemporaryDerivation
  derived from: http://data.ga-group.nl/ics/bics/2014/131111101612
  source accessed on: 2019-12-03T20:05:01Z
  source last accessed on: 2019-12-03T20:05:01Z
  definition: This segment includes companies that manufacture other forms of photovoltaic (PV) solar thin film modules not elsewhere classified.
  notation: 131111101612
  valid from: 2014-08-08
  valid till: 2020-10-03
source accessed on: 2019-12-03T20:05:01Z
source last accessed on: 2019-12-03T20:05:01Z
definition: This segment includes companies that manufacture other forms of photovoltaic (PV) solar thin film modules not elsewhere classified.
notation: 131111101612
valid from: 2014-08-08
valid till: 2020-10-03

Thin Film Modules
type: BicsLevel5Segment
type: Classifier
type: NamedIndividual
is level5 segment of: Solar Energy Equipment
is replaced by: Thin Film Modules
created with: infer-bics.sql
derived from: Thin Film Modules
  type: BicsLevel5Segment
  type: Classifier
  type: ContemporaryDerivation
  derived from: http://data.ga-group.nl/ics/bics/2014/1311111016
  source accessed on: 2019-12-03T20:05:01Z
  source last accessed on: 2019-12-03T20:05:01Z
  definition: This segment includes companies that manufacture photovoltaic solar thin film modules.
  notation: 1311111016
  valid from: 2014-08-08
  valid till: 2020-10-03
source accessed on: 2019-12-03T20:05:01Z
source last accessed on: 2019-12-03T20:05:01Z
definition: This segment includes companies that manufacture photovoltaic solar thin film modules.
notation: 1311111016
valid from: 2014-08-08
valid till: 2020-10-03

Other Solar Energy Components
type: BicsLevel5Segment
type: Classifier
type: NamedIndividual
is level5 segment of: Solar Energy Equipment
created with: infer-bics.sql
derived from: Other Solar Energy Components
  type: BicsLevel5Segment
  type: Classifier
  type: ContemporaryDerivation
  derived from: http://data.ga-group.nl/ics/bics/2014/1311111017
  source accessed on: 2019-12-03T20:05:01Z
  source last accessed on: 2019-12-03T20:05:01Z
  definition: This segment includes companies that manufacture other solar energy equipment not elsewhere classified. This includes equipment, such as mirrors, tracking devices and inverters for the solar energy industry.
  notation: 1311111017
  valid from: 2014-08-08
  valid till: 2020-10-03
source accessed on: 2019-12-03T20:05:01Z
source last accessed on: 2019-12-03T20:05:01Z
definition: This segment includes companies that manufacture other solar energy equipment not elsewhere classified. This includes equipment, such as mirrors, tracking devices and inverters for the solar energy industry.
notation: 1311111017
valid from: 2014-08-08
valid till: 2020-10-03

Solar Energy Equipment
type: BicsLevel4SubIndustry
type: Classifier
type: NamedIndividual
created with: infer-bics.sql
derived from: Solar Energy Equipment
  type: BicsLevel4SubIndustry
  type: Classifier
  type: ContemporaryDerivation
  derived from: http://data.ga-group.nl/ics/bics/2014/13111110
  source accessed on: 2019-12-03T20:05:01Z
  source last accessed on: 2019-12-03T20:05:01Z
  definition: This industry subgroup includes companies that manufacture solar energy equipment, such as polysilicon feedstock, thin film, modules, concentrated photovoltaics, crystalline silicon wafers, cells, modules and related equipment.
  notation: 13111110
  valid from: 2014-08-08
  valid till: 2020-10-03
source accessed on: 2019-12-03T20:05:01Z
source last accessed on: 2019-12-03T20:05:01Z
definition: This industry subgroup includes companies that manufacture solar energy equipment, such as polysilicon feedstock, thin film, modules, concentrated photovoltaics, crystalline silicon wafers, cells, modules and related equipment.
notation: 13111110
valid from: 2014-08-08
valid till: 2020-10-03

Wind Turbine Offshore
type: BicsLevel6Segment
type: Classifier
type: NamedIndividual
is level6 segment of: Wind Turbines
created with: infer-bics.sql
derived from: Wind Turbine Offshore
  type: BicsLevel6Segment
  type: Classifier
  type: ContemporaryDerivation
  derived from: http://data.ga-group.nl/ics/bics/2014/131111111010
  source accessed on: 2019-12-03T20:05:01Z
  source last accessed on: 2019-12-03T20:05:01Z
  definition: This segment includes companies that manufacture integrated wind-power generation machinery for use in offshore locations.
  notation: 131111111010
  valid from: 2014-08-08
  valid till: 2020-10-03
source accessed on: 2019-12-03T20:05:01Z
source last accessed on: 2019-12-03T20:05:01Z
definition: This segment includes companies that manufacture integrated wind-power generation machinery for use in offshore locations.
notation: 131111111010
valid from: 2014-08-08
valid till: 2020-10-03

Wind Turbine Onshore - Lg Scale
type: BicsLevel7Segment
type: Classifier
type: NamedIndividual
is level7 segment of: Wind Turbine Onshore
created with: infer-bics.sql
derived from: Wind Turbine Onshore - Lg Scale
  type: BicsLevel7Segment
  type: Classifier
  type: ContemporaryDerivation
  derived from: http://data.ga-group.nl/ics/bics/2014/13111111101110
  source accessed on: 2019-12-03T20:05:01Z
  source last accessed on: 2019-12-03T20:05:01Z
  definition: This segment includes companies that manufacture large-scale, integrated wind-power generation machinery used in onshore locations.
  notation: 13111111101110
  valid from: 2014-08-08
  valid till: 2020-10-03
source accessed on: 2019-12-03T20:05:01Z
source last accessed on: 2019-12-03T20:05:01Z
definition: This segment includes companies that manufacture large-scale, integrated wind-power generation machinery used in onshore locations.
notation: 13111111101110
valid from: 2014-08-08
valid till: 2020-10-03

Wind Turb Onshore - Lg 2 Blade
type: BicsLevel7Segment
type: Classifier
type: NamedIndividual
is level7 segment of: Wind Turbine Onshore
created with: infer-bics.sql
derived from: Wind Turb Onshore - Lg 2 Blade
  type: BicsLevel7Segment
  type: Classifier
  type: ContemporaryDerivation
  derived from: http://data.ga-group.nl/ics/bics/2014/13111111101111
  source accessed on: 2019-12-03T20:05:01Z
  source last accessed on: 2019-12-03T20:05:01Z
  definition: This segment includes companies that manufacture large-scale, two-blade, integrated wind-power generation machinery used in onshore locations.
  notation: 13111111101111
  valid from: 2014-08-08
  valid till: 2020-10-03
source accessed on: 2019-12-03T20:05:01Z
source last accessed on: 2019-12-03T20:05:01Z
definition: This segment includes companies that manufacture large-scale, two-blade, integrated wind-power generation machinery used in onshore locations.
notation: 13111111101111
valid from: 2014-08-08
valid till: 2020-10-03

Wind Turb Onsh - Lg Vert Axis
type: BicsLevel7Segment
type: Classifier
type: NamedIndividual
is level7 segment of: Wind Turbine Onshore
created with: infer-bics.sql
derived from: Wind Turb Onsh - Lg Vert Axis
  type: BicsLevel7Segment
  type: Classifier
  type: ContemporaryDerivation
  derived from: http://data.ga-group.nl/ics/bics/2014/13111111101112
  source accessed on: 2019-12-03T20:05:01Z
  source last accessed on: 2019-12-03T20:05:01Z
  definition: This segment includes companies that manufacture large-scale, vertical-axis, integrated wind power generation machinery used in onshore locations.
  notation: 13111111101112
  valid from: 2014-08-08
  valid till: 2020-10-03
source accessed on: 2019-12-03T20:05:01Z
source last accessed on: 2019-12-03T20:05:01Z
definition: This segment includes companies that manufacture large-scale, vertical-axis, integrated wind power generation machinery used in onshore locations.
notation: 13111111101112
valid from: 2014-08-08
valid till: 2020-10-03

Wind Turb Onshore - Micro Scale
type: BicsLevel7Segment
type: Classifier
type: NamedIndividual
is level7 segment of: Wind Turbine Onshore
created with: infer-bics.sql
derived from: Wind Turb Onshore - Micro Scale
  type: BicsLevel7Segment
  type: Classifier
  type: ContemporaryDerivation
  derived from: http://data.ga-group.nl/ics/bics/2014/13111111101113
  source accessed on: 2019-12-03T20:05:01Z
  source last accessed on: 2019-12-03T20:05:01Z
  definition: This segment includes companies that manufacture micro-scale, integrated wind power generation machinery used in onshore locations.
  notation: 13111111101113
  valid from: 2014-08-08
  valid till: 2020-10-03
source accessed on: 2019-12-03T20:05:01Z
source last accessed on: 2019-12-03T20:05:01Z
definition: This segment includes companies that manufacture micro-scale, integrated wind power generation machinery used in onshore locations.
notation: 13111111101113
valid from: 2014-08-08
valid till: 2020-10-03

Wind Turbine Onshore
type: BicsLevel6Segment
type: Classifier
type: NamedIndividual
is level6 segment of: Wind Turbines
created with: infer-bics.sql
derived from: Wind Turbine Onshore
  type: BicsLevel6Segment
  type: Classifier
  type: ContemporaryDerivation
  derived from: http://data.ga-group.nl/ics/bics/2014/131111111011
  source accessed on: 2019-12-03T20:05:01Z
  source last accessed on: 2019-12-03T20:05:01Z
  definition: This segment includes companies that manufacture integrated wind-power generation machinery for use in onshore locations.
  notation: 131111111011
  valid from: 2014-08-08
  valid till: 2020-10-03
source accessed on: 2019-12-03T20:05:01Z
source last accessed on: 2019-12-03T20:05:01Z
definition: This segment includes companies that manufacture integrated wind-power generation machinery for use in onshore locations.
notation: 131111111011
valid from: 2014-08-08
valid till: 2020-10-03

Wind Turbines
type: BicsLevel5Segment
type: Classifier
type: NamedIndividual
is level5 segment of: Wind Energy Equipment
is replaced by: Wind Turbines
created with: infer-bics.sql
derived from: Wind Turbines
  type: BicsLevel5Segment
  type: Classifier
  type: ContemporaryDerivation
  derived from: http://data.ga-group.nl/ics/bics/2014/1311111110
  source accessed on: 2019-12-03T20:05:01Z
  source last accessed on: 2019-12-03T20:05:01Z
  definition: This segment includes companies that manufacture wind-power generation machinery.
  notation: 1311111110
  valid from: 2014-08-08
  valid till: 2020-10-03
source accessed on: 2019-12-03T20:05:01Z
source last accessed on: 2019-12-03T20:05:01Z
definition: This segment includes companies that manufacture wind-power generation machinery.
notation: 1311111110
valid from: 2014-08-08
valid till: 2020-10-03

Wind Turbine Bearings
type: BicsLevel6Segment
type: Classifier
type: NamedIndividual
is level6 segment of: Wind Turbine Components
created with: infer-bics.sql
derived from: Wind Turbine Bearings
  type: BicsLevel6Segment
  type: Classifier
  type: ContemporaryDerivation
  derived from: http://data.ga-group.nl/ics/bics/2014/131111111110
  source accessed on: 2019-12-03T20:05:01Z
  source last accessed on: 2019-12-03T20:05:01Z
  definition: This segment includes companies that manufacture bearings for the wind energy industry.
  notation: 131111111110
  valid from: 2014-08-08
  valid till: 2020-10-03
source accessed on: 2019-12-03T20:05:01Z
source last accessed on: 2019-12-03T20:05:01Z
definition: This segment includes companies that manufacture bearings for the wind energy industry.
notation: 131111111110
valid from: 2014-08-08
valid till: 2020-10-03

Wind Turbine Blades
type: BicsLevel6Segment
type: Classifier
type: NamedIndividual
is level6 segment of: Wind Turbine Components
created with: infer-bics.sql
derived from: Wind Turbine Blades
  type: BicsLevel6Segment
  type: Classifier
  type: ContemporaryDerivation
  derived from: http://data.ga-group.nl/ics/bics/2014/131111111111
  source accessed on: 2019-12-03T20:05:01Z
  source last accessed on: 2019-12-03T20:05:01Z
  definition: This segment includes companies that manufacture blades for the wind energy industry.
  notation: 131111111111
  valid from: 2014-08-08
  valid till: 2020-10-03
source accessed on: 2019-12-03T20:05:01Z
source last accessed on: 2019-12-03T20:05:01Z
definition: This segment includes companies that manufacture blades for the wind energy industry.
notation: 131111111111
valid from: 2014-08-08
valid till: 2020-10-03

Wind Turbine Gearboxes
type: BicsLevel6Segment
type: Classifier
type: NamedIndividual
is level6 segment of: Wind Turbine Components
created with: infer-bics.sql
derived from: Wind Turbine Gearboxes
  type: BicsLevel6Segment
  type: Classifier
  type: ContemporaryDerivation
  derived from: http://data.ga-group.nl/ics/bics/2014/131111111112
  source accessed on: 2019-12-03T20:05:01Z
  source last accessed on: 2019-12-03T20:05:01Z
  definition: This segment includes companies that manufacture gearboxes for the wind energy industry.
  notation: 131111111112
  valid from: 2014-08-08
  valid till: 2020-10-03
source accessed on: 2019-12-03T20:05:01Z
source last accessed on: 2019-12-03T20:05:01Z
definition: This segment includes companies that manufacture gearboxes for the wind energy industry.
notation: 131111111112
valid from: 2014-08-08
valid till: 2020-10-03

Wind Turbine Generators
type: BicsLevel6Segment
type: Classifier
type: NamedIndividual
is level6 segment of: Wind Turbine Components
created with: infer-bics.sql
derived from: Wind Turbine Generators
  type: BicsLevel6Segment
  type: Classifier
  type: ContemporaryDerivation
  derived from: http://data.ga-group.nl/ics/bics/2014/131111111113
  source accessed on: 2019-12-03T20:05:01Z
  source last accessed on: 2019-12-03T20:05:01Z
  definition: This segment includes companies that manufacture generators for the wind energy industry.
  notation: 131111111113
  valid from: 2014-08-08
  valid till: 2020-10-03
source accessed on: 2019-12-03T20:05:01Z
source last accessed on: 2019-12-03T20:05:01Z
definition: This segment includes companies that manufacture generators for the wind energy industry.
notation: 131111111113
valid from: 2014-08-08
valid till: 2020-10-03

Wind Turbine Pitch
type: BicsLevel6Segment
type: Classifier
type: NamedIndividual
is level6 segment of: Wind Turbine Components
created with: infer-bics.sql
derived from: Wind Turbine Pitch
  type: BicsLevel6Segment
  type: Classifier
  type: ContemporaryDerivation
  derived from: http://data.ga-group.nl/ics/bics/2014/131111111114
  source accessed on: 2019-12-03T20:05:01Z
  source last accessed on: 2019-12-03T20:05:01Z
  definition: This segment includes companies that manufacture pitch systems for the wind energy industry.
  notation: 131111111114
  valid from: 2014-08-08
  valid till: 2020-10-03
source accessed on: 2019-12-03T20:05:01Z
source last accessed on: 2019-12-03T20:05:01Z
definition: This segment includes companies that manufacture pitch systems for the wind energy industry.
notation: 131111111114
valid from: 2014-08-08
valid till: 2020-10-03

Wind Turbine Tower Foundation
type: BicsLevel6Segment
type: Classifier
type: NamedIndividual
is level6 segment of: Wind Turbine Components
created with: infer-bics.sql
derived from: Wind Turbine Tower Foundation
  type: BicsLevel6Segment
  type: Classifier
  type: ContemporaryDerivation
  derived from: http://data.ga-group.nl/ics/bics/2014/131111111115
  source accessed on: 2019-12-03T20:05:01Z
  source last accessed on: 2019-12-03T20:05:01Z
  definition: This segment includes companies that manufacture tower foundations for the wind energy industry.
  notation: 131111111115
  valid from: 2014-08-08
  valid till: 2020-10-03
source accessed on: 2019-12-03T20:05:01Z
source last accessed on: 2019-12-03T20:05:01Z
definition: This segment includes companies that manufacture tower foundations for the wind energy industry.
notation: 131111111115
valid from: 2014-08-08
valid till: 2020-10-03

Wind Turbine Towers
type: BicsLevel6Segment
type: Classifier
type: NamedIndividual
is level6 segment of: Wind Turbine Components
created with: infer-bics.sql
derived from: Wind Turbine Towers
  type: BicsLevel6Segment
  type: Classifier
  type: ContemporaryDerivation
  derived from: http://data.ga-group.nl/ics/bics/2014/131111111116
  source accessed on: 2019-12-03T20:05:01Z
  source last accessed on: 2019-12-03T20:05:01Z
  definition: This segment includes companies that manufacture towers for the wind energy industry.
  notation: 131111111116
  valid from: 2014-08-08
  valid till: 2020-10-03
source accessed on: 2019-12-03T20:05:01Z
source last accessed on: 2019-12-03T20:05:01Z
definition: This segment includes companies that manufacture towers for the wind energy industry.
notation: 131111111116
valid from: 2014-08-08
valid till: 2020-10-03

Other Wind Turbine Components
type: BicsLevel6Segment
type: Classifier
type: NamedIndividual
is level6 segment of: Wind Turbine Components
created with: infer-bics.sql
derived from: Other Wind Turbine Components
  type: BicsLevel6Segment
  type: Classifier
  type: ContemporaryDerivation
  derived from: http://data.ga-group.nl/ics/bics/2014/131111111117
  source accessed on: 2019-12-03T20:05:01Z
  source last accessed on: 2019-12-03T20:05:01Z
  definition: This segment includes companies that manufacture other components for the wind energy industry not elsewhere classified.
  notation: 131111111117
  valid from: 2014-08-08
  valid till: 2020-10-03
source accessed on: 2019-12-03T20:05:01Z
source last accessed on: 2019-12-03T20:05:01Z
definition: This segment includes companies that manufacture other components for the wind energy industry not elsewhere classified.
notation: 131111111117
valid from: 2014-08-08
valid till: 2020-10-03

Wind Turbine Components
type: BicsLevel5Segment
type: Classifier
type: NamedIndividual
is level5 segment of: Wind Energy Equipment
is replaced by: Wind Turbine Components
created with: infer-bics.sql
derived from: Wind Turbine Components
  type: BicsLevel5Segment
  type: Classifier
  type: ContemporaryDerivation
  derived from: http://data.ga-group.nl/ics/bics/2014/1311111111
  source accessed on: 2019-12-03T20:05:01Z
  source last accessed on: 2019-12-03T20:05:01Z
  definition: This segment includes companies that manufacture components for the wind energy industry, such as bearings, blades, gearboxes, generators, pitch systems, towers and tower foundations.
  notation: 1311111111
  valid from: 2014-08-08
  valid till: 2020-10-03
source accessed on: 2019-12-03T20:05:01Z
source last accessed on: 2019-12-03T20:05:01Z
definition: This segment includes companies that manufacture components for the wind energy industry, such as bearings, blades, gearboxes, generators, pitch systems, towers and tower foundations.
notation: 1311111111
valid from: 2014-08-08
valid till: 2020-10-03

Wind Energy Equipment
type: BicsLevel4SubIndustry
type: Classifier
type: NamedIndividual
created with: infer-bics.sql
derived from: Wind Energy Equipment
  type: BicsLevel4SubIndustry
  type: Classifier
  type: ContemporaryDerivation
  derived from: http://data.ga-group.nl/ics/bics/2014/13111111
  source accessed on: 2019-12-03T20:05:01Z
  source last accessed on: 2019-12-03T20:05:01Z
  definition: This industry subgroup includes companies that manufacture wind energy equipment, such as wind-power generation machinery, towers and components.
  notation: 13111111
  valid from: 2014-08-08
  valid till: 2020-10-03
source accessed on: 2019-12-03T20:05:01Z
source last accessed on: 2019-12-03T20:05:01Z
definition: This industry subgroup includes companies that manufacture wind energy equipment, such as wind-power generation machinery, towers and components.
notation: 13111111
valid from: 2014-08-08
valid till: 2020-10-03

Geothermal Equipment
type: BicsLevel5Segment
type: Classifier
type: NamedIndividual
is level5 segment of: Geothermal Energy Equipment
created with: infer-bics.sql
derived from: Geothermal Equipment
  type: BicsLevel5Segment
  type: Classifier
  type: ContemporaryDerivation
  derived from: http://data.ga-group.nl/ics/bics/2014/1311111210
  source accessed on: 2019-12-03T20:05:01Z
  source last accessed on: 2019-12-03T20:05:01Z
  definition: This segment includes companies that manufacture geothermal energy equipment.
  notation: 1311111210
  valid from: 2014-08-08
  valid till: 2020-10-03
source accessed on: 2019-12-03T20:05:01Z
source last accessed on: 2019-12-03T20:05:01Z
definition: This segment includes companies that manufacture geothermal energy equipment.
notation: 1311111210
valid from: 2014-08-08
valid till: 2020-10-03

Thermoelectric Generators
type: BicsLevel5Segment
type: Classifier
type: NamedIndividual
is level5 segment of: Geothermal Energy Equipment
created with: infer-bics.sql
derived from: Thermoelectric Generators
  type: BicsLevel5Segment
  type: Classifier
  type: ContemporaryDerivation
  derived from: http://data.ga-group.nl/ics/bics/2014/1311111211
  source accessed on: 2019-12-03T20:05:01Z
  source last accessed on: 2019-12-03T20:05:01Z
  definition: This segment includes companies that manufacture thermoelectric generators for geothermal energy production.
  notation: 1311111211
  valid from: 2014-08-08
  valid till: 2020-10-03
source accessed on: 2019-12-03T20:05:01Z
source last accessed on: 2019-12-03T20:05:01Z
definition: This segment includes companies that manufacture thermoelectric generators for geothermal energy production.
notation: 1311111211
valid from: 2014-08-08
valid till: 2020-10-03

Other Geothermal Energy Cmpnts
type: BicsLevel5Segment
type: Classifier
type: NamedIndividual
is level5 segment of: Geothermal Energy Equipment
created with: infer-bics.sql
derived from: Other Geothermal Energy Cmpnts
  type: BicsLevel5Segment
  type: Classifier
  type: ContemporaryDerivation
  derived from: http://data.ga-group.nl/ics/bics/2014/1311111212
  source accessed on: 2019-12-03T20:05:01Z
  source last accessed on: 2019-12-03T20:05:01Z
  definition: This segment includes companies that manufacture other geothermal energy components not elsewhere classified.
  notation: 1311111212
  valid from: 2014-08-08
  valid till: 2020-10-03
source accessed on: 2019-12-03T20:05:01Z
source last accessed on: 2019-12-03T20:05:01Z
definition: This segment includes companies that manufacture other geothermal energy components not elsewhere classified.
notation: 1311111212
valid from: 2014-08-08
valid till: 2020-10-03

Geothermal Energy Equipment
type: BicsLevel4SubIndustry
type: Classifier
type: NamedIndividual
created with: infer-bics.sql
derived from: Geothermal Energy Equipment
  type: BicsLevel4SubIndustry
  type: Classifier
  type: ContemporaryDerivation
  derived from: http://data.ga-group.nl/ics/bics/2014/13111112
  source accessed on: 2019-12-03T20:05:01Z
  source last accessed on: 2019-12-03T20:05:01Z
  definition: This industry subgroup includes companies that manufacture equipment used in geothermal energy production. This includes geothermal equipment, thermoelectric generators and other geothermal energy components.
  notation: 13111112
  valid from: 2014-08-08
  valid till: 2020-10-03
source accessed on: 2019-12-03T20:05:01Z
source last accessed on: 2019-12-03T20:05:01Z
definition: This industry subgroup includes companies that manufacture equipment used in geothermal energy production. This includes geothermal equipment, thermoelectric generators and other geothermal energy components.
notation: 13111112
valid from: 2014-08-08
valid till: 2020-10-03

Hydro Energy Micro Turbines
type: BicsLevel5Segment
type: Classifier
type: NamedIndividual
is level5 segment of: Hydro Energy Equipment
created with: infer-bics.sql
derived from: Hydro Energy Micro Turbines
  type: BicsLevel5Segment
  type: Classifier
  type: ContemporaryDerivation
  derived from: http://data.ga-group.nl/ics/bics/2014/1311111310
  source accessed on: 2019-12-03T20:05:01Z
  source last accessed on: 2019-12-03T20:05:01Z
  definition: This segment includes companies that manufacture hydro energy microturbine equipment used in hydroelectric dams.
  notation: 1311111310
  valid from: 2014-08-08
  valid till: 2020-10-03
source accessed on: 2019-12-03T20:05:01Z
source last accessed on: 2019-12-03T20:05:01Z
definition: This segment includes companies that manufacture hydro energy microturbine equipment used in hydroelectric dams.
notation: 1311111310
valid from: 2014-08-08
valid till: 2020-10-03

Hydro Energy Pico Turbines
type: BicsLevel5Segment
type: Classifier
type: NamedIndividual
is level5 segment of: Hydro Energy Equipment
created with: infer-bics.sql
derived from: Hydro Energy Pico Turbines
  type: BicsLevel5Segment
  type: Classifier
  type: ContemporaryDerivation
  derived from: http://data.ga-group.nl/ics/bics/2014/1311111311
  source accessed on: 2019-12-03T20:05:01Z
  source last accessed on: 2019-12-03T20:05:01Z
  definition: This segment includes companies that manufacture hydro energy pico turbine equipment used in hydroelectric dams.
  notation: 1311111311
  valid from: 2014-08-08
  valid till: 2020-10-03
source accessed on: 2019-12-03T20:05:01Z
source last accessed on: 2019-12-03T20:05:01Z
definition: This segment includes companies that manufacture hydro energy pico turbine equipment used in hydroelectric dams.
notation: 1311111311
valid from: 2014-08-08
valid till: 2020-10-03

Hydro Energy Turbines
type: BicsLevel5Segment
type: Classifier
type: NamedIndividual
is level5 segment of: Hydro Energy Equipment
created with: infer-bics.sql
derived from: Hydro Energy Turbines
  type: BicsLevel5Segment
  type: Classifier
  type: ContemporaryDerivation
  derived from: http://data.ga-group.nl/ics/bics/2014/1311111312
  source accessed on: 2019-12-03T20:05:01Z
  source last accessed on: 2019-12-03T20:05:01Z
  definition: This segment includes companies that manufacture hydro energy turbine equipment used in hydroelectric dams.
  notation: 1311111312
  valid from: 2014-08-08
  valid till: 2020-10-03
source accessed on: 2019-12-03T20:05:01Z
source last accessed on: 2019-12-03T20:05:01Z
definition: This segment includes companies that manufacture hydro energy turbine equipment used in hydroelectric dams.
notation: 1311111312
valid from: 2014-08-08
valid till: 2020-10-03

Other Hydro Energy Components
type: BicsLevel5Segment
type: Classifier
type: NamedIndividual
is level5 segment of: Hydro Energy Equipment
created with: infer-bics.sql
derived from: Other Hydro Energy Components
  type: BicsLevel5Segment
  type: Classifier
  type: ContemporaryDerivation
  derived from: http://data.ga-group.nl/ics/bics/2014/1311111313
  source accessed on: 2019-12-03T20:05:01Z
  source last accessed on: 2019-12-03T20:05:01Z
  definition: This segment includes companies that manufacture other hydro energy components not elsewhere classified.
  notation: 1311111313
  valid from: 2014-08-08
  valid till: 2020-10-03
source accessed on: 2019-12-03T20:05:01Z
source last accessed on: 2019-12-03T20:05:01Z
definition: This segment includes companies that manufacture other hydro energy components not elsewhere classified.
notation: 1311111313
valid from: 2014-08-08
valid till: 2020-10-03

Hydro Energy Equipment
type: BicsLevel4SubIndustry
type: Classifier
type: NamedIndividual
created with: infer-bics.sql
derived from: Hydro Energy Equipment
  type: BicsLevel4SubIndustry
  type: Classifier
  type: ContemporaryDerivation
  derived from: http://data.ga-group.nl/ics/bics/2014/13111113
  source accessed on: 2019-12-03T20:05:01Z
  source last accessed on: 2019-12-03T20:05:01Z
  definition: This industry subgroup includes companies that manufacture hydro energy equipment used in hydroelectric dams.
  notation: 13111113
  valid from: 2014-08-08
  valid till: 2020-10-03
source accessed on: 2019-12-03T20:05:01Z
source last accessed on: 2019-12-03T20:05:01Z
definition: This industry subgroup includes companies that manufacture hydro energy equipment used in hydroelectric dams.
notation: 13111113
valid from: 2014-08-08
valid till: 2020-10-03

Ocean Thermal Convertors
type: BicsLevel5Segment
type: Classifier
type: NamedIndividual
is level5 segment of: Marine Energy Equipment
created with: infer-bics.sql
derived from: Ocean Thermal Convertors
  type: BicsLevel5Segment
  type: Classifier
  type: ContemporaryDerivation
  derived from: http://data.ga-group.nl/ics/bics/2014/1311111410
  source accessed on: 2019-12-03T20:05:01Z
  source last accessed on: 2019-12-03T20:05:01Z
  definition: This segment includes companies that manufacture ocean thermal convertors.
  notation: 1311111410
  valid from: 2014-08-08
  valid till: 2020-10-03
source accessed on: 2019-12-03T20:05:01Z
source last accessed on: 2019-12-03T20:05:01Z
definition: This segment includes companies that manufacture ocean thermal convertors.
notation: 1311111410
valid from: 2014-08-08
valid till: 2020-10-03

Tidal Stream Turbines
type: BicsLevel5Segment
type: Classifier
type: NamedIndividual
is level5 segment of: Marine Energy Equipment
created with: infer-bics.sql
derived from: Tidal Stream Turbines
  type: BicsLevel5Segment
  type: Classifier
  type: ContemporaryDerivation
  derived from: http://data.ga-group.nl/ics/bics/2014/1311111411
  source accessed on: 2019-12-03T20:05:01Z
  source last accessed on: 2019-12-03T20:05:01Z
  definition: This segment includes companies that manufacture tidal stream turbine equipment.
  notation: 1311111411
  valid from: 2014-08-08
  valid till: 2020-10-03
source accessed on: 2019-12-03T20:05:01Z
source last accessed on: 2019-12-03T20:05:01Z
definition: This segment includes companies that manufacture tidal stream turbine equipment.
notation: 1311111411
valid from: 2014-08-08
valid till: 2020-10-03

Wave Convertors
type: BicsLevel5Segment
type: Classifier
type: NamedIndividual
is level5 segment of: Marine Energy Equipment
created with: infer-bics.sql
derived from: Wave Convertors
  type: BicsLevel5Segment
  type: Classifier
  type: ContemporaryDerivation
  derived from: http://data.ga-group.nl/ics/bics/2014/1311111412
  source accessed on: 2019-12-03T20:05:01Z
  source last accessed on: 2019-12-03T20:05:01Z
  definition: This segment includes companies that manufacture wave convertor equipment.
  notation: 1311111412
  valid from: 2014-08-08
  valid till: 2020-10-03
source accessed on: 2019-12-03T20:05:01Z
source last accessed on: 2019-12-03T20:05:01Z
definition: This segment includes companies that manufacture wave convertor equipment.
notation: 1311111412
valid from: 2014-08-08
valid till: 2020-10-03

Other Marine Energy Components
type: BicsLevel5Segment
type: Classifier
type: NamedIndividual
is level5 segment of: Marine Energy Equipment
created with: infer-bics.sql
derived from: Other Marine Energy Components
  type: BicsLevel5Segment
  type: Classifier
  type: ContemporaryDerivation
  derived from: http://data.ga-group.nl/ics/bics/2014/1311111413
  source accessed on: 2019-12-03T20:05:01Z
  source last accessed on: 2019-12-03T20:05:01Z
  definition: This segment includes companies that manufacture other marine energy equipment components not elsewhere classified.
  notation: 1311111413
  valid from: 2014-08-08
  valid till: 2020-10-03
source accessed on: 2019-12-03T20:05:01Z
source last accessed on: 2019-12-03T20:05:01Z
definition: This segment includes companies that manufacture other marine energy equipment components not elsewhere classified.
notation: 1311111413
valid from: 2014-08-08
valid till: 2020-10-03

Marine Energy Equipment
type: BicsLevel4SubIndustry
type: Classifier
type: NamedIndividual
created with: infer-bics.sql
derived from: Marine Energy Equipment
  type: BicsLevel4SubIndustry
  type: Classifier
  type: ContemporaryDerivation
  derived from: http://data.ga-group.nl/ics/bics/2014/13111114
  source accessed on: 2019-12-03T20:05:01Z
  source last accessed on: 2019-12-03T20:05:01Z
  definition: This industry subgroup includes companies that manufacture marine energy equipment, such as ocean thermal convertors, wave energy convertors, tidal stream turbines and other marine energy equipment components.
  notation: 13111114
  valid from: 2014-08-08
  valid till: 2020-10-03
source accessed on: 2019-12-03T20:05:01Z
source last accessed on: 2019-12-03T20:05:01Z
definition: This industry subgroup includes companies that manufacture marine energy equipment, such as ocean thermal convertors, wave energy convertors, tidal stream turbines and other marine energy equipment components.
notation: 13111114
valid from: 2014-08-08
valid till: 2020-10-03

Lithium-based Batteries
type: BicsLevel6Segment
type: Classifier
type: NamedIndividual
is level6 segment of: Industrial Batteries
created with: infer-bics.sql
derived from: Lithium-based Batteries
  type: BicsLevel6Segment
  type: Classifier
  type: ContemporaryDerivation
  derived from: http://data.ga-group.nl/ics/bics/2014/131111151010
  source accessed on: 2019-12-03T20:05:01Z
  source last accessed on: 2019-12-03T20:05:01Z
  definition: This segment includes companies that manufacture industrial-scale energy storage lithium-based batteries.
  notation: 131111151010
  valid from: 2014-08-08
  valid till: 2020-10-03
source accessed on: 2019-12-03T20:05:01Z
source last accessed on: 2019-12-03T20:05:01Z
definition: This segment includes companies that manufacture industrial-scale energy storage lithium-based batteries.
notation: 131111151010
valid from: 2014-08-08
valid till: 2020-10-03

Nickel-based Batteries
type: BicsLevel6Segment
type: Classifier
type: NamedIndividual
is level6 segment of: Industrial Batteries
created with: infer-bics.sql
derived from: Nickel-based Batteries
  type: BicsLevel6Segment
  type: Classifier
  type: ContemporaryDerivation
  derived from: http://data.ga-group.nl/ics/bics/2014/131111151011
  source accessed on: 2019-12-03T20:05:01Z
  source last accessed on: 2019-12-03T20:05:01Z
  definition: This segment includes companies that manufacture industrial-scale energy storage nickel-based batteries.
  notation: 131111151011
  valid from: 2014-08-08
  valid till: 2020-10-03
source accessed on: 2019-12-03T20:05:01Z
source last accessed on: 2019-12-03T20:05:01Z
definition: This segment includes companies that manufacture industrial-scale energy storage nickel-based batteries.
notation: 131111151011
valid from: 2014-08-08
valid till: 2020-10-03

Sodium-based Batteries
type: BicsLevel6Segment
type: Classifier
type: NamedIndividual
is level6 segment of: Industrial Batteries
created with: infer-bics.sql
derived from: Sodium-based Batteries
  type: BicsLevel6Segment
  type: Classifier
  type: ContemporaryDerivation
  derived from: http://data.ga-group.nl/ics/bics/2014/131111151012
  source accessed on: 2019-12-03T20:05:01Z
  source last accessed on: 2019-12-03T20:05:01Z
  definition: This segment includes companies that manufacture industrial-scale energy storage sodium-based batteries.
  notation: 131111151012
  valid from: 2014-08-08
  valid till: 2020-10-03
source accessed on: 2019-12-03T20:05:01Z
source last accessed on: 2019-12-03T20:05:01Z
definition: This segment includes companies that manufacture industrial-scale energy storage sodium-based batteries.
notation: 131111151012
valid from: 2014-08-08
valid till: 2020-10-03

Industrial Batteries
type: BicsLevel5Segment
type: Classifier
type: NamedIndividual
is level5 segment of: Fuel Cells & Industrial Batteries
is replaced by: Energy Storage Systems
created with: infer-bics.sql
derived from: Industrial Batteries
  type: BicsLevel5Segment
  type: Classifier
  type: ContemporaryDerivation
  derived from: http://data.ga-group.nl/ics/bics/2014/1311111510
  source accessed on: 2019-12-03T20:05:01Z
  source last accessed on: 2019-12-03T20:05:01Z
  definition: This segment includes companies that manufacture industrial-scale energy storage batteries.
  notation: 1311111510
  valid from: 2014-08-08
  valid till: 2020-10-03
source accessed on: 2019-12-03T20:05:01Z
source last accessed on: 2019-12-03T20:05:01Z
definition: This segment includes companies that manufacture industrial-scale energy storage batteries.
notation: 1311111510
valid from: 2014-08-08
valid till: 2020-10-03

Flow Batteries
type: BicsLevel5Segment
type: Classifier
type: NamedIndividual
is level5 segment of: Fuel Cells & Industrial Batteries
created with: infer-bics.sql
derived from: Flow Batteries
  type: BicsLevel5Segment
  type: Classifier
  type: ContemporaryDerivation
  derived from: http://data.ga-group.nl/ics/bics/2014/1311111511
  source accessed on: 2019-12-03T20:05:01Z
  source last accessed on: 2019-12-03T20:05:01Z
  definition: This segment includes companies that manufacture industrial-scale energy storage flow batteries.
  notation: 1311111511
  valid from: 2014-08-08
  valid till: 2020-10-03
source accessed on: 2019-12-03T20:05:01Z
source last accessed on: 2019-12-03T20:05:01Z
definition: This segment includes companies that manufacture industrial-scale energy storage flow batteries.
notation: 1311111511
valid from: 2014-08-08
valid till: 2020-10-03

Flywheels
type: BicsLevel5Segment
type: Classifier
type: NamedIndividual
is level5 segment of: Fuel Cells & Industrial Batteries
created with: infer-bics.sql
derived from: Flywheels
  type: BicsLevel5Segment
  type: Classifier
  type: ContemporaryDerivation
  derived from: http://data.ga-group.nl/ics/bics/2014/1311111512
  source accessed on: 2019-12-03T20:05:01Z
  source last accessed on: 2019-12-03T20:05:01Z
  definition: This segment includes companies that manufacture industrial-scale energy storage flywheels.
  notation: 1311111512
  valid from: 2014-08-08
  valid till: 2020-10-03
source accessed on: 2019-12-03T20:05:01Z
source last accessed on: 2019-12-03T20:05:01Z
definition: This segment includes companies that manufacture industrial-scale energy storage flywheels.
notation: 1311111512
valid from: 2014-08-08
valid till: 2020-10-03

Fuel Cell Alkaline
type: BicsLevel6Segment
type: Classifier
type: NamedIndividual
is level6 segment of: Fuel Cells
created with: infer-bics.sql
derived from: Fuel Cell Alkaline
  type: BicsLevel6Segment
  type: Classifier
  type: ContemporaryDerivation
  derived from: http://data.ga-group.nl/ics/bics/2014/131111151310
  source accessed on: 2019-12-03T20:05:01Z
  source last accessed on: 2019-12-03T20:05:01Z
  definition: This segment includes companies that manufacture alkaline-based fuel cell equipment. Alkaline fuel cells use an alkaline electrolyte, such as potassium hydroxide.
  notation: 131111151310
  valid from: 2014-08-08
  valid till: 2020-10-03
source accessed on: 2019-12-03T20:05:01Z
source last accessed on: 2019-12-03T20:05:01Z
definition: This segment includes companies that manufacture alkaline-based fuel cell equipment. Alkaline fuel cells use an alkaline electrolyte, such as potassium hydroxide.
notation: 131111151310
valid from: 2014-08-08
valid till: 2020-10-03

Fuel Cell Bio
type: BicsLevel6Segment
type: Classifier
type: NamedIndividual
is level6 segment of: Fuel Cells
created with: infer-bics.sql
derived from: Fuel Cell Bio
  type: BicsLevel6Segment
  type: Classifier
  type: ContemporaryDerivation
  derived from: http://data.ga-group.nl/ics/bics/2014/131111151311
  source accessed on: 2019-12-03T20:05:01Z
  source last accessed on: 2019-12-03T20:05:01Z
  definition: This segment includes companies that manufacture biofuel cell equipment. Fuel cells can run on a variety of fuels, including ones produced directly from biofuels. Instead of catalysts, bio fuel cells use enzymes to break down the fuel into constituent parts during the electrochemical process.
  notation: 131111151311
  valid from: 2014-08-08
  valid till: 2020-10-03
source accessed on: 2019-12-03T20:05:01Z
source last accessed on: 2019-12-03T20:05:01Z
definition: This segment includes companies that manufacture biofuel cell equipment. Fuel cells can run on a variety of fuels, including ones produced directly from biofuels. Instead of catalysts, bio fuel cells use enzymes to break down the fuel into constituent parts during the electrochemical process.
notation: 131111151311
valid from: 2014-08-08
valid till: 2020-10-03

Fuel Cell Direct Methanol
type: BicsLevel6Segment
type: Classifier
type: NamedIndividual
is level6 segment of: Fuel Cells
created with: infer-bics.sql
derived from: Fuel Cell Direct Methanol
  type: BicsLevel6Segment
  type: Classifier
  type: ContemporaryDerivation
  derived from: http://data.ga-group.nl/ics/bics/2014/131111151312
  source accessed on: 2019-12-03T20:05:01Z
  source last accessed on: 2019-12-03T20:05:01Z
  definition: This segment includes companies that manufacture direct methanol fuel cells. These are whole fuel-cell systems that use methanol as an input in lieu of hydrogen.
  notation: 131111151312
  valid from: 2014-08-08
  valid till: 2020-10-03
source accessed on: 2019-12-03T20:05:01Z
source last accessed on: 2019-12-03T20:05:01Z
definition: This segment includes companies that manufacture direct methanol fuel cells. These are whole fuel-cell systems that use methanol as an input in lieu of hydrogen.
notation: 131111151312
valid from: 2014-08-08
valid till: 2020-10-03

Fuel Cell Metal Air
type: BicsLevel6Segment
type: Classifier
type: NamedIndividual
is level6 segment of: Fuel Cells
created with: infer-bics.sql
derived from: Fuel Cell Metal Air
  type: BicsLevel6Segment
  type: Classifier
  type: ContemporaryDerivation
  derived from: http://data.ga-group.nl/ics/bics/2014/131111151313
  source accessed on: 2019-12-03T20:05:01Z
  source last accessed on: 2019-12-03T20:05:01Z
  definition: This segment includes companies that manufacture metal air fuel cells. These are fuel cells that utilize the reaction of air and metal, such as aluminum or zinc.
  notation: 131111151313
  valid from: 2014-08-08
  valid till: 2020-10-03
source accessed on: 2019-12-03T20:05:01Z
source last accessed on: 2019-12-03T20:05:01Z
definition: This segment includes companies that manufacture metal air fuel cells. These are fuel cells that utilize the reaction of air and metal, such as aluminum or zinc.
notation: 131111151313
valid from: 2014-08-08
valid till: 2020-10-03

Fuel Cell Molten Carbonate
type: BicsLevel6Segment
type: Classifier
type: NamedIndividual
is level6 segment of: Fuel Cells
created with: infer-bics.sql
derived from: Fuel Cell Molten Carbonate
  type: BicsLevel6Segment
  type: Classifier
  type: ContemporaryDerivation
  derived from: http://data.ga-group.nl/ics/bics/2014/131111151314
  source accessed on: 2019-12-03T20:05:01Z
  source last accessed on: 2019-12-03T20:05:01Z
  definition: This segment includes companies that manufacture molten carbonate fuel cells. These are high-temperature fuel cells designed for large industrial applications that are based on a molten carbonate electrolyte.
  notation: 131111151314
  valid from: 2014-08-08
  valid till: 2020-10-03
source accessed on: 2019-12-03T20:05:01Z
source last accessed on: 2019-12-03T20:05:01Z
definition: This segment includes companies that manufacture molten carbonate fuel cells. These are high-temperature fuel cells designed for large industrial applications that are based on a molten carbonate electrolyte.
notation: 131111151314
valid from: 2014-08-08
valid till: 2020-10-03

Fuel Cell PEM
type: BicsLevel6Segment
type: Classifier
type: NamedIndividual
is level6 segment of: Fuel Cells
created with: infer-bics.sql
derived from: Fuel Cell PEM
  type: BicsLevel6Segment
  type: Classifier
  type: ContemporaryDerivation
  derived from: http://data.ga-group.nl/ics/bics/2014/131111151315
  source accessed on: 2019-12-03T20:05:01Z
  source last accessed on: 2019-12-03T20:05:01Z
  definition: This segment includes companies that manufacture proton exchange membrane (PEM) fuel cells.
  notation: 131111151315
  valid from: 2014-08-08
  valid till: 2020-10-03
source accessed on: 2019-12-03T20:05:01Z
source last accessed on: 2019-12-03T20:05:01Z
definition: This segment includes companies that manufacture proton exchange membrane (PEM) fuel cells.
notation: 131111151315
valid from: 2014-08-08
valid till: 2020-10-03

Fuel Cell PEM - Micro
type: BicsLevel6Segment
type: Classifier
type: NamedIndividual
is level6 segment of: Fuel Cells
created with: infer-bics.sql
derived from: Fuel Cell PEM - Micro
  type: BicsLevel6Segment
  type: Classifier
  type: ContemporaryDerivation
  derived from: http://data.ga-group.nl/ics/bics/2014/131111151316
  source accessed on: 2019-12-03T20:05:01Z
  source last accessed on: 2019-12-03T20:05:01Z
  definition: This segment includes companies that manufacture small-scale proton exchange membrane (PEM) fuel cells.
  notation: 131111151316
  valid from: 2014-08-08
  valid till: 2020-10-03
source accessed on: 2019-12-03T20:05:01Z
source last accessed on: 2019-12-03T20:05:01Z
definition: This segment includes companies that manufacture small-scale proton exchange membrane (PEM) fuel cells.
notation: 131111151316
valid from: 2014-08-08
valid till: 2020-10-03

Fuel Cell Phosphoric Acid
type: BicsLevel6Segment
type: Classifier
type: NamedIndividual
is level6 segment of: Fuel Cells
created with: infer-bics.sql
derived from: Fuel Cell Phosphoric Acid
  type: BicsLevel6Segment
  type: Classifier
  type: ContemporaryDerivation
  derived from: http://data.ga-group.nl/ics/bics/2014/131111151317
  source accessed on: 2019-12-03T20:05:01Z
  source last accessed on: 2019-12-03T20:05:01Z
  definition: This segment includes companies that manufacture phosphoric acid‒based fuel cells.
  notation: 131111151317
  valid from: 2014-08-08
  valid till: 2020-10-03
source accessed on: 2019-12-03T20:05:01Z
source last accessed on: 2019-12-03T20:05:01Z
definition: This segment includes companies that manufacture phosphoric acid‒based fuel cells.
notation: 131111151317
valid from: 2014-08-08
valid till: 2020-10-03

Fuel Cell Regenerative
type: BicsLevel6Segment
type: Classifier
type: NamedIndividual
is level6 segment of: Fuel Cells
created with: infer-bics.sql
derived from: Fuel Cell Regenerative
  type: BicsLevel6Segment
  type: Classifier
  type: ContemporaryDerivation
  derived from: http://data.ga-group.nl/ics/bics/2014/131111151318
  source accessed on: 2019-12-03T20:05:01Z
  source last accessed on: 2019-12-03T20:05:01Z
  definition: This segment includes companies that manufacture regenerative fuel cells. These are systems that can be run to consume hydrogen and produce electricity and water, or in reverse, consuming electricity and electrolyzing water to produce hydrogen.
  notation: 131111151318
  valid from: 2014-08-08
  valid till: 2020-10-03
source accessed on: 2019-12-03T20:05:01Z
source last accessed on: 2019-12-03T20:05:01Z
definition: This segment includes companies that manufacture regenerative fuel cells. These are systems that can be run to consume hydrogen and produce electricity and water, or in reverse, consuming electricity and electrolyzing water to produce hydrogen.
notation: 131111151318
valid from: 2014-08-08
valid till: 2020-10-03

Fuel Cell Sodium Borohydride
type: BicsLevel6Segment
type: Classifier
type: NamedIndividual
is level6 segment of: Fuel Cells
created with: infer-bics.sql
derived from: Fuel Cell Sodium Borohydride
  type: BicsLevel6Segment
  type: Classifier
  type: ContemporaryDerivation
  derived from: http://data.ga-group.nl/ics/bics/2014/131111151319
  source accessed on: 2019-12-03T20:05:01Z
  source last accessed on: 2019-12-03T20:05:01Z
  definition: This segment includes companies that manufacture sodium borohydride fuel cells.
  notation: 131111151319
  valid from: 2014-08-08
  valid till: 2020-10-03
source accessed on: 2019-12-03T20:05:01Z
source last accessed on: 2019-12-03T20:05:01Z
definition: This segment includes companies that manufacture sodium borohydride fuel cells.
notation: 131111151319
valid from: 2014-08-08
valid till: 2020-10-03

Fuel Cell Solid Oxide
type: BicsLevel6Segment
type: Classifier
type: NamedIndividual
is level6 segment of: Fuel Cells
created with: infer-bics.sql
derived from: Fuel Cell Solid Oxide
  type: BicsLevel6Segment
  type: Classifier
  type: ContemporaryDerivation
  derived from: http://data.ga-group.nl/ics/bics/2014/131111151320
  source accessed on: 2019-12-03T20:05:01Z
  source last accessed on: 2019-12-03T20:05:01Z
  definition: This segment includes companies that manufacture solid oxide fuel cells. These use a ceramic electrolyte instead of a liquid or membrane and operate at temperatures of up to 1,000 degrees Centigrade.
  notation: 131111151320
  valid from: 2014-08-08
  valid till: 2020-10-03
source accessed on: 2019-12-03T20:05:01Z
source last accessed on: 2019-12-03T20:05:01Z
definition: This segment includes companies that manufacture solid oxide fuel cells. These use a ceramic electrolyte instead of a liquid or membrane and operate at temperatures of up to 1,000 degrees Centigrade.
notation: 131111151320
valid from: 2014-08-08
valid till: 2020-10-03

Fuel Cell Urea to Energy
type: BicsLevel6Segment
type: Classifier
type: NamedIndividual
is level6 segment of: Fuel Cells
created with: infer-bics.sql
derived from: Fuel Cell Urea to Energy
  type: BicsLevel6Segment
  type: Classifier
  type: ContemporaryDerivation
  derived from: http://data.ga-group.nl/ics/bics/2014/131111151321
  source accessed on: 2019-12-03T20:05:01Z
  source last accessed on: 2019-12-03T20:05:01Z
  definition: This segment includes companies that manufacture urea-based fuel cells.
  notation: 131111151321
  valid from: 2014-08-08
  valid till: 2020-10-03
source accessed on: 2019-12-03T20:05:01Z
source last accessed on: 2019-12-03T20:05:01Z
definition: This segment includes companies that manufacture urea-based fuel cells.
notation: 131111151321
valid from: 2014-08-08
valid till: 2020-10-03

Fuel Cell Other
type: BicsLevel6Segment
type: Classifier
type: NamedIndividual
is level6 segment of: Fuel Cells
created with: infer-bics.sql
derived from: Fuel Cell Other
  type: BicsLevel6Segment
  type: Classifier
  type: ContemporaryDerivation
  derived from: http://data.ga-group.nl/ics/bics/2014/131111151322
  source accessed on: 2019-12-03T20:05:01Z
  source last accessed on: 2019-12-03T20:05:01Z
  definition: This segment includes companies that manufacture other types of fuel cells that are based on less common electrolytes or principles.
  notation: 131111151322
  valid from: 2014-08-08
  valid till: 2020-10-03
source accessed on: 2019-12-03T20:05:01Z
source last accessed on: 2019-12-03T20:05:01Z
definition: This segment includes companies that manufacture other types of fuel cells that are based on less common electrolytes or principles.
notation: 131111151322
valid from: 2014-08-08
valid till: 2020-10-03

Fuel Cells
type: BicsLevel5Segment
type: Classifier
type: NamedIndividual
is level5 segment of: Fuel Cells & Industrial Batteries
is replaced by: Fuel Cells
created with: infer-bics.sql
derived from: Fuel Cells
  type: BicsLevel5Segment
  type: Classifier
  type: ContemporaryDerivation
  derived from: http://data.ga-group.nl/ics/bics/2014/1311111513
  source accessed on: 2019-12-03T20:05:01Z
  source last accessed on: 2019-12-03T20:05:01Z
  definition: This segment includes companies that manufacture fuel cell equipment that is primarily for industrial- or utility-scale purposes.
  notation: 1311111513
  valid from: 2014-08-08
  valid till: 2020-10-03
source accessed on: 2019-12-03T20:05:01Z
source last accessed on: 2019-12-03T20:05:01Z
definition: This segment includes companies that manufacture fuel cell equipment that is primarily for industrial- or utility-scale purposes.
notation: 1311111513
valid from: 2014-08-08
valid till: 2020-10-03

Fuel Cells & Industrial Batteries
type: BicsLevel4SubIndustry
type: Classifier
type: NamedIndividual
created with: infer-bics.sql
derived from: Fuel Cells & Industrial Batteries
  type: BicsLevel4SubIndustry
  type: Classifier
  type: ContemporaryDerivation
  derived from: http://data.ga-group.nl/ics/bics/2014/13111115
  source accessed on: 2019-12-03T20:05:01Z
  source last accessed on: 2019-12-03T20:05:01Z
  definition: This industry subgroup includes companies that manufacture fuel cells and energy storage equipment that is primarily for industrial or utility-scale purposes. Equipment includes batteries, flow batteries, flywheels and fuel cells.
  notation: 13111115
  valid from: 2014-08-08
  valid till: 2020-10-03
source accessed on: 2019-12-03T20:05:01Z
source last accessed on: 2019-12-03T20:05:01Z
definition: This industry subgroup includes companies that manufacture fuel cells and energy storage equipment that is primarily for industrial or utility-scale purposes. Equipment includes batteries, flow batteries, flywheels and fuel cells.
notation: 13111115
valid from: 2014-08-08
valid till: 2020-10-03

Communication Networks
type: BicsLevel5Segment
type: Classifier
type: NamedIndividual
is level5 segment of: Smart Grid Equipment
created with: infer-bics.sql
derived from: Communication Networks
  type: BicsLevel5Segment
  type: Classifier
  type: ContemporaryDerivation
  derived from: http://data.ga-group.nl/ics/bics/2014/1311111610
  source accessed on: 2019-12-03T20:05:01Z
  source last accessed on: 2019-12-03T20:05:01Z
  definition: This segment includes companies that manufacture communication network smart grid equipment.
  notation: 1311111610
  valid from: 2014-08-08
  valid till: 2020-10-03
source accessed on: 2019-12-03T20:05:01Z
source last accessed on: 2019-12-03T20:05:01Z
definition: This segment includes companies that manufacture communication network smart grid equipment.
notation: 1311111610
valid from: 2014-08-08
valid till: 2020-10-03

Demand Response Systems
type: BicsLevel5Segment
type: Classifier
type: NamedIndividual
is level5 segment of: Smart Grid Equipment
created with: infer-bics.sql
derived from: Demand Response Systems
  type: BicsLevel5Segment
  type: Classifier
  type: ContemporaryDerivation
  derived from: http://data.ga-group.nl/ics/bics/2014/1311111611
  source accessed on: 2019-12-03T20:05:01Z
  source last accessed on: 2019-12-03T20:05:01Z
  definition: This segment includes companies that manufacture demand response smart grid equipment.
  notation: 1311111611
  valid from: 2014-08-08
  valid till: 2020-10-03
source accessed on: 2019-12-03T20:05:01Z
source last accessed on: 2019-12-03T20:05:01Z
definition: This segment includes companies that manufacture demand response smart grid equipment.
notation: 1311111611
valid from: 2014-08-08
valid till: 2020-10-03

Energy Management Systems
type: BicsLevel5Segment
type: Classifier
type: NamedIndividual
is level5 segment of: Smart Grid Equipment
created with: infer-bics.sql
derived from: Energy Management Systems
  type: BicsLevel5Segment
  type: Classifier
  type: ContemporaryDerivation
  derived from: http://data.ga-group.nl/ics/bics/2014/1311111612
  source accessed on: 2019-12-03T20:05:01Z
  source last accessed on: 2019-12-03T20:05:01Z
  definition: This segment includes companies that manufacture energy management smart grid equipment.
  notation: 1311111612
  valid from: 2014-08-08
  valid till: 2020-10-03
source accessed on: 2019-12-03T20:05:01Z
source last accessed on: 2019-12-03T20:05:01Z
definition: This segment includes companies that manufacture energy management smart grid equipment.
notation: 1311111612
valid from: 2014-08-08
valid till: 2020-10-03

Grid Sensors & Controllers
type: BicsLevel5Segment
type: Classifier
type: NamedIndividual
is level5 segment of: Smart Grid Equipment
created with: infer-bics.sql
derived from: Grid Sensors & Controllers
  type: BicsLevel5Segment
  type: Classifier
  type: ContemporaryDerivation
  derived from: http://data.ga-group.nl/ics/bics/2014/1311111613
  source accessed on: 2019-12-03T20:05:01Z
  source last accessed on: 2019-12-03T20:05:01Z
  definition: This segment includes companies that manufacture grid sensors and controller smart grid equipment.
  notation: 1311111613
  valid from: 2014-08-08
  valid till: 2020-10-03
source accessed on: 2019-12-03T20:05:01Z
source last accessed on: 2019-12-03T20:05:01Z
definition: This segment includes companies that manufacture grid sensors and controller smart grid equipment.
notation: 1311111613
valid from: 2014-08-08
valid till: 2020-10-03

Smart Grid Meter Software
type: BicsLevel5Segment
type: Classifier
type: NamedIndividual
is level5 segment of: Smart Grid Equipment
created with: infer-bics.sql
derived from: Smart Grid Meter Software
  type: BicsLevel5Segment
  type: Classifier
  type: ContemporaryDerivation
  derived from: http://data.ga-group.nl/ics/bics/2014/1311111614
  source accessed on: 2019-12-03T20:05:01Z
  source last accessed on: 2019-12-03T20:05:01Z
  definition: This segment includes companies that manufacture meter software for smart grid equipment.
  notation: 1311111614
  valid from: 2014-08-08
  valid till: 2020-10-03
source accessed on: 2019-12-03T20:05:01Z
source last accessed on: 2019-12-03T20:05:01Z
definition: This segment includes companies that manufacture meter software for smart grid equipment.
notation: 1311111614
valid from: 2014-08-08
valid till: 2020-10-03

Smart Meters
type: BicsLevel5Segment
type: Classifier
type: NamedIndividual
is level5 segment of: Smart Grid Equipment
created with: infer-bics.sql
derived from: Smart Meters
  type: BicsLevel5Segment
  type: Classifier
  type: ContemporaryDerivation
  derived from: http://data.ga-group.nl/ics/bics/2014/1311111615
  source accessed on: 2019-12-03T20:05:01Z
  source last accessed on: 2019-12-03T20:05:01Z
  definition: This segment includes companies that manufacture smart meters for smart grid equipment.
  notation: 1311111615
  valid from: 2014-08-08
  valid till: 2020-10-03
source accessed on: 2019-12-03T20:05:01Z
source last accessed on: 2019-12-03T20:05:01Z
definition: This segment includes companies that manufacture smart meters for smart grid equipment.
notation: 1311111615
valid from: 2014-08-08
valid till: 2020-10-03

Smart Grid Equipment
type: BicsLevel4SubIndustry
type: Classifier
type: NamedIndividual
created with: infer-bics.sql
derived from: Smart Grid Equipment
  type: BicsLevel4SubIndustry
  type: Classifier
  type: ContemporaryDerivation
  derived from: http://data.ga-group.nl/ics/bics/2014/13111116
  source accessed on: 2019-12-03T20:05:01Z
  source last accessed on: 2019-12-03T20:05:01Z
  definition: This industry subgroup includes companies that manufacture smart grid equipment.
  notation: 13111116
  valid from: 2014-08-08
  valid till: 2020-10-03
source accessed on: 2019-12-03T20:05:01Z
source last accessed on: 2019-12-03T20:05:01Z
definition: This industry subgroup includes companies that manufacture smart grid equipment.
notation: 13111116
valid from: 2014-08-08
valid till: 2020-10-03

CCS Equipment
type: BicsLevel4SubIndustry
type: Classifier
type: NamedIndividual
created with: infer-bics.sql
derived from: CCS Equipment
  type: BicsLevel4SubIndustry
  type: Classifier
  type: ContemporaryDerivation
  derived from: http://data.ga-group.nl/ics/bics/2014/13111117
  source accessed on: 2019-12-03T20:05:01Z
  source last accessed on: 2019-12-03T20:05:01Z
  definition: This industry subgroup includes companies that manufacture carbon capture and storage equipment.
  notation: 13111117
  valid from: 2014-08-08
  valid till: 2020-10-03
source accessed on: 2019-12-03T20:05:01Z
source last accessed on: 2019-12-03T20:05:01Z
definition: This industry subgroup includes companies that manufacture carbon capture and storage equipment.
notation: 13111117
valid from: 2014-08-08
valid till: 2020-10-03

Other Renewable Energy Equip
type: BicsLevel4SubIndustry
type: Classifier
type: NamedIndividual
created with: infer-bics.sql
derived from: Other Renewable Energy Equip
  type: BicsLevel4SubIndustry
  type: Classifier
  type: ContemporaryDerivation
  derived from: http://data.ga-group.nl/ics/bics/2014/13111118
  source accessed on: 2019-12-03T20:05:01Z
  source last accessed on: 2019-12-03T20:05:01Z
  definition: This industry subgroup includes companies that manufacture alternative energy generation machinery, excluding wind-power machinery, solar cells and fuel cells. It also includes equipment used for geothermal and wave power.
  notation: 13111118
  valid from: 2014-08-08
  valid till: 2020-10-03
source accessed on: 2019-12-03T20:05:01Z
source last accessed on: 2019-12-03T20:05:01Z
definition: This industry subgroup includes companies that manufacture alternative energy generation machinery, excluding wind-power machinery, solar cells and fuel cells. It also includes equipment used for geothermal and wave power.
notation: 13111118
valid from: 2014-08-08
valid till: 2020-10-03

Renewable Energy Equipment
type: BicsLevel3Industry
type: Classifier
type: NamedIndividual
is industry of: Renewable Energy
is replaced by: Renewable Energy Equipment
created with: infer-bics.sql
derived from: Renewable Energy Equipment
  type: BicsLevel3Industry
  type: Classifier
  type: ContemporaryDerivation
  derived from: http://data.ga-group.nl/ics/bics/2014/131111
  source accessed on: 2019-12-03T20:05:01Z
  source last accessed on: 2019-12-03T20:05:01Z
  definition: This industry includes companies that manufacture alternative energy generation machinery, such as wind-power machinery, solar cells, fuel cells and other alternative energy machinery. This segment can include research and development revenue.
  notation: 131111
  valid from: 2014-08-08
  valid till: 2020-10-03
source accessed on: 2019-12-03T20:05:01Z
source last accessed on: 2019-12-03T20:05:01Z
definition: This industry includes companies that manufacture alternative energy generation machinery, such as wind-power machinery, solar cells, fuel cells and other alternative energy machinery. This segment can include research and development revenue.
notation: 131111
valid from: 2014-08-08
valid till: 2020-10-03

Biomass Plant Construction
type: BicsLevel5Segment
type: Classifier
type: NamedIndividual
is level5 segment of: Development & Construction
is replaced by: Biomass Plant Construction
created with: infer-bics.sql
derived from: Biomass Plant Construction
  type: BicsLevel5Segment
  type: Classifier
  type: ContemporaryDerivation
  derived from: http://data.ga-group.nl/ics/bics/2014/1311121010
  source accessed on: 2019-12-03T20:05:01Z
  source last accessed on: 2019-12-03T20:05:01Z
  definition: This segment includes companies that develop, build and manage biomass energy projects.
  notation: 1311121010
  valid from: 2014-08-08
  valid till: 2020-10-03
source accessed on: 2019-12-03T20:05:01Z
source last accessed on: 2019-12-03T20:05:01Z
definition: This segment includes companies that develop, build and manage biomass energy projects.
notation: 1311121010
valid from: 2014-08-08
valid till: 2020-10-03

Solar Plant Construction
type: BicsLevel5Segment
type: Classifier
type: NamedIndividual
is level5 segment of: Development & Construction
is replaced by: Solar Plant Construction
created with: infer-bics.sql
derived from: Solar Plant Construction
  type: BicsLevel5Segment
  type: Classifier
  type: ContemporaryDerivation
  derived from: http://data.ga-group.nl/ics/bics/2014/1311121011
  source accessed on: 2019-12-03T20:05:01Z
  source last accessed on: 2019-12-03T20:05:01Z
  definition: This segment includes companies that develop, build and manage solar energy projects.
  notation: 1311121011
  valid from: 2014-08-08
  valid till: 2020-10-03
source accessed on: 2019-12-03T20:05:01Z
source last accessed on: 2019-12-03T20:05:01Z
definition: This segment includes companies that develop, build and manage solar energy projects.
notation: 1311121011
valid from: 2014-08-08
valid till: 2020-10-03

Wind Farm Construction
type: BicsLevel5Segment
type: Classifier
type: NamedIndividual
is level5 segment of: Development & Construction
is replaced by: Wind Farm Construction
created with: infer-bics.sql
derived from: Wind Farm Construction
  type: BicsLevel5Segment
  type: Classifier
  type: ContemporaryDerivation
  derived from: http://data.ga-group.nl/ics/bics/2014/1311121012
  source accessed on: 2019-12-03T20:05:01Z
  source last accessed on: 2019-12-03T20:05:01Z
  definition: This segment includes companies that develop, build and manage wind energy projects.
  notation: 1311121012
  valid from: 2014-08-08
  valid till: 2020-10-03
source accessed on: 2019-12-03T20:05:01Z
source last accessed on: 2019-12-03T20:05:01Z
definition: This segment includes companies that develop, build and manage wind energy projects.
notation: 1311121012
valid from: 2014-08-08
valid till: 2020-10-03

Other Renew Energy Plant Const
type: BicsLevel5Segment
type: Classifier
type: NamedIndividual
is level5 segment of: Development & Construction
created with: infer-bics.sql
derived from: Other Renew Energy Plant Const
  type: BicsLevel5Segment
  type: Classifier
  type: ContemporaryDerivation
  derived from: http://data.ga-group.nl/ics/bics/2014/1311121013
  source accessed on: 2019-12-03T20:05:01Z
  source last accessed on: 2019-12-03T20:05:01Z
  definition: This segment includes companies that develop, build and manage renewable energy projects not elsewhere classified.
  notation: 1311121013
  valid from: 2014-08-08
  valid till: 2020-10-03
source accessed on: 2019-12-03T20:05:01Z
source last accessed on: 2019-12-03T20:05:01Z
definition: This segment includes companies that develop, build and manage renewable energy projects not elsewhere classified.
notation: 1311121013
valid from: 2014-08-08
valid till: 2020-10-03

Development & Construction
type: BicsLevel4SubIndustry
type: Classifier
type: NamedIndividual
created with: infer-bics.sql
derived from: Development & Construction
  type: BicsLevel4SubIndustry
  type: Classifier
  type: ContemporaryDerivation
  derived from: http://data.ga-group.nl/ics/bics/2014/13111210
  source accessed on: 2019-12-03T20:05:01Z
  source last accessed on: 2019-12-03T20:05:01Z
  definition: This industry subgroup includes companies that develop, build and manage renewable energy projects.
  notation: 13111210
  valid from: 2014-08-08
  valid till: 2020-10-03
source accessed on: 2019-12-03T20:05:01Z
source last accessed on: 2019-12-03T20:05:01Z
definition: This industry subgroup includes companies that develop, build and manage renewable energy projects.
notation: 13111210
valid from: 2014-08-08
valid till: 2020-10-03

Operations & Maintenance
type: BicsLevel4SubIndustry
type: Classifier
type: NamedIndividual
created with: infer-bics.sql
derived from: Operations & Maintenance
  type: BicsLevel4SubIndustry
  type: Classifier
  type: ContemporaryDerivation
  derived from: http://data.ga-group.nl/ics/bics/2014/13111211
  source accessed on: 2019-12-03T20:05:01Z
  source last accessed on: 2019-12-03T20:05:01Z
  definition: This industry subgroup includes companies that provide operations and maintenance services for renewable energy projects.
  notation: 13111211
  valid from: 2014-08-08
  valid till: 2020-10-03
source accessed on: 2019-12-03T20:05:01Z
source last accessed on: 2019-12-03T20:05:01Z
definition: This industry subgroup includes companies that provide operations and maintenance services for renewable energy projects.
notation: 13111211
valid from: 2014-08-08
valid till: 2020-10-03

Special Maint & Construction
type: BicsLevel4SubIndustry
type: Classifier
type: NamedIndividual
created with: infer-bics.sql
derived from: Special Maint & Construction
  type: BicsLevel4SubIndustry
  type: Classifier
  type: ContemporaryDerivation
  derived from: http://data.ga-group.nl/ics/bics/2014/13111212
  source accessed on: 2019-12-03T20:05:01Z
  source last accessed on: 2019-12-03T20:05:01Z
  definition: This industry subgroup includes companies that provide specialist operations, maintenance and construction services for renewable energy projects.
  notation: 13111212
  valid from: 2014-08-08
  valid till: 2020-10-03
source accessed on: 2019-12-03T20:05:01Z
source last accessed on: 2019-12-03T20:05:01Z
definition: This industry subgroup includes companies that provide specialist operations, maintenance and construction services for renewable energy projects.
notation: 13111212
valid from: 2014-08-08
valid till: 2020-10-03

Renewable Energy Project Dev
type: BicsLevel3Industry
type: Classifier
type: NamedIndividual
is industry of: Renewable Energy
is replaced by: Renewable Energy Project Dev
created with: infer-bics.sql
derived from: Renewable Energy Project Dev
  type: BicsLevel3Industry
  type: Classifier
  type: ContemporaryDerivation
  derived from: http://data.ga-group.nl/ics/bics/2014/131112
  source accessed on: 2019-12-03T20:05:01Z
  source last accessed on: 2019-12-03T20:05:01Z
  definition: This industry includes companies that develop, build and manage renewable energy projects. It also includes companies that provide operations and maintenance services.
  notation: 131112
  valid from: 2014-08-08
  valid till: 2020-10-03
source accessed on: 2019-12-03T20:05:01Z
source last accessed on: 2019-12-03T20:05:01Z
definition: This industry includes companies that develop, build and manage renewable energy projects. It also includes companies that provide operations and maintenance services.
notation: 131112
valid from: 2014-08-08
valid till: 2020-10-03

Renewable Energy
type: BicsLevel2IndustryGroup
type: Classifier
type: NamedIndividual
is industry group of: Energy
is replaced by: Renewable Energy
created with: infer-bics.sql
derived from: Renewable Energy
  type: BicsLevel2IndustryGroup
  type: Classifier
  type: ContemporaryDerivation
  derived from: http://data.ga-group.nl/ics/bics/2014/1311
  source accessed on: 2019-12-03T20:05:01Z
  source last accessed on: 2019-12-03T20:05:01Z
  definition: This industry group includes companies involved in the production of energy from renewable sources, such as wind, solar, biomass, geothermal, hydroelectric, wave, tidal and fuel cells. Industries include alternative energy equipment manufacturers, alternative energy power plant developers and alternative energy utilities.
  notation: 1311
  valid from: 2014-08-08
  valid till: 2020-10-03
derived from: Renewable Energy
  type: BicsLevel2IndustryGroup
  type: Classifier
  type: ContemporaryDerivation
  derived from: http://data.ga-group.nl/ics/bics/2020/1311
  derived from: http://data.ga-group.nl/ics/bics/2024/1311
  source accessed on: 2023-07-03T18:11:29Z
  source last accessed on: 2024-06-05T14:42:36Z
  definition: This industry group includes companies that are involved in the extraction and capturing of renewable energy resources.
  notation: 1311
  valid from: 2020-10-03
source accessed on: 2019-12-03T20:05:01Z
source last accessed on: 2024-06-05T14:42:36Z
definition: This industry group includes companies that are involved in the extraction and capturing of renewable energy resources.
notation: 1311
valid from: 2014-08-08

Energy
type: BicsLevel1Sector
type: Classifier
type: NamedIndividual
created with: infer-bics.sql
derived from: Energy
  type: BicsLevel1Sector
  type: Classifier
  type: ContemporaryDerivation
  derived from: http://data.ga-group.nl/ics/bics/2014/13
  source accessed on: 2019-12-03T20:05:01Z
  source last accessed on: 2019-12-03T20:05:01Z
  definition: This sector includes companies that are involved in energy and renewable energy.
  notation: 13
  valid from: 2014-08-08
  valid till: 2020-10-03
derived from: Energy
  type: BicsLevel1Sector
  type: Classifier
  type: ContemporaryDerivation
  derived from: http://data.ga-group.nl/ics/bics/2020/13
  derived from: http://data.ga-group.nl/ics/bics/2024/13
  source accessed on: 2023-07-03T18:11:29Z
  source last accessed on: 2024-06-05T14:42:36Z
  definition: This sector includes companies involved in extracting, capturing, or processing energy producing resources.
  notation: 13
  valid from: 2020-10-03
source accessed on: 2019-12-03T20:05:01Z
source last accessed on: 2024-06-05T14:42:36Z
definition: This sector includes companies involved in extracting, capturing, or processing energy producing resources.
notation: 13
valid from: 2014-08-08

Diversified Banks
type: BicsLevel4SubIndustry
type: Classifier
type: NamedIndividual
replaces: Asset Management
created with: infer-bics.sql
derived from: BDCs
  type: BicsLevel4SubIndustry
  type: Classifier
  type: ContemporaryDerivation
  derived from: http://data.ga-group.nl/ics/bics/2014/14101010
  source accessed on: 2019-12-03T20:05:01Z
  source last accessed on: 2019-12-03T20:05:01Z
  definition: This industry subgroup includes business development companies (BDCs). A BDC operates in the private equity business and helps provide capital and management to early-stage and mature private and small public companies in the initial stage of their development.
  notation: 14101010
  valid from: 2014-08-08
  valid till: 2020-10-03
derived from: Diversified Banks
  type: BicsLevel3Industry
  type: Classifier
  type: AnachronousDerivation
  derived from: http://data.ga-group.nl/ics/bics/2014/141110
  source accessed on: 2019-12-03T20:05:01Z
  source last accessed on: 2019-12-03T20:05:01Z
  definition: This industry includes companies that have multinational bank operations with significant investment banking operations.
  notation: 141110
  valid from: 2014-08-08
  valid till: 2020-10-03
derived from: Diversified Banks
  type: BicsLevel4SubIndustry
  type: Classifier
  type: ContemporaryDerivation
  derived from: http://data.ga-group.nl/ics/bics/2020/14101010
  derived from: http://data.ga-group.nl/ics/bics/2024/14101010
  source accessed on: 2023-07-03T18:11:29Z
  source last accessed on: 2024-06-05T14:42:36Z
  definition: This industry subgroup includes companies that have multinational bank operations with significant institutional brokerage operations.
  notation: 14101010
  valid from: 2020-10-03
source accessed on: 2019-12-03T20:05:01Z
source last accessed on: 2024-06-05T14:42:36Z
definition: This industry subgroup includes companies that have multinational bank operations with significant institutional brokerage operations.
notation: 14101010
valid from: 2014-08-08

Corporate Banking
type: BicsLevel5Segment
type: Classifier
type: NamedIndividual
is level5 segment of: Banks
created with: infer-bics.sql
derived from: Corporate Banking
  type: BicsLevel4SubIndustry
  type: Classifier
  type: AnachronousDerivation
  derived from: http://data.ga-group.nl/ics/bics/2014/14111110
  source accessed on: 2019-12-03T20:05:01Z
  source last accessed on: 2019-12-03T20:05:01Z
  definition: This industry subgroup includes companies that accept deposits and make loans to corporations and large businesses.
  notation: 14111110
  valid from: 2014-08-08
  valid till: 2020-10-03
derived from: Corporate Banking
  type: BicsLevel5Segment
  type: Classifier
  type: ContemporaryDerivation
  derived from: http://data.ga-group.nl/ics/bics/2020/1410101110
  derived from: http://data.ga-group.nl/ics/bics/2024/1410101110
  source accessed on: 2023-07-03T18:11:29Z
  source last accessed on: 2024-06-05T14:42:36Z
  definition: This segment includes companies that accept deposits and make loans to corporations and large businesses.
  notation: 1410101110
  valid from: 2020-10-03
source accessed on: 2023-07-03T18:11:29Z
source last accessed on: 2024-06-05T14:42:36Z
definition: This segment includes companies that accept deposits and make loans to corporations and large businesses.
notation: 1410101110
valid from: 2020-10-03

Retail Banking
type: BicsLevel5Segment
type: Classifier
type: NamedIndividual
is level5 segment of: Banks
created with: infer-bics.sql
derived from: Retail Banking
  type: BicsLevel4SubIndustry
  type: Classifier
  type: AnachronousDerivation
  derived from: http://data.ga-group.nl/ics/bics/2014/14111111
  source accessed on: 2019-12-03T20:05:01Z
  source last accessed on: 2019-12-03T20:05:01Z
  definition: This industry subgroup includes companies that accept deposits and make loans to retail (individual) customers.
  notation: 14111111
  valid from: 2014-08-08
  valid till: 2020-10-03
derived from: Retail Banking
  type: BicsLevel5Segment
  type: Classifier
  type: ContemporaryDerivation
  derived from: http://data.ga-group.nl/ics/bics/2020/1410101111
  derived from: http://data.ga-group.nl/ics/bics/2024/1410101111
  source accessed on: 2023-07-03T18:11:29Z
  source last accessed on: 2024-06-05T14:42:36Z
  definition: This segment includes companies that accept deposits and make loans to retail (individual) customers.
  notation: 1410101111
  valid from: 2020-10-03
source accessed on: 2023-07-03T18:11:29Z
source last accessed on: 2024-06-05T14:42:36Z
definition: This segment includes companies that accept deposits and make loans to retail (individual) customers.
notation: 1410101111
valid from: 2020-10-03

Islamic Banking
type: BicsLevel5Segment
type: Classifier
type: NamedIndividual
is level5 segment of: Banks
replaces: Islamic Banking
created with: infer-bics.sql
derived from: Islamic Banking
  type: BicsLevel3Industry
  type: Classifier
  type: AnachronousDerivation
  derived from: http://data.ga-group.nl/ics/bics/2014/141213
  source accessed on: 2019-12-03T20:05:01Z
  source last accessed on: 2019-12-03T20:05:01Z
  definition: This industry includes companies that provide loans and other financing to businesses in compliance with Shariah law. Such loans cannot charge interest. Instead, the loan is structured using discounts, sale or lease, profit participation, or repurchase agreements.
  notation: 141213
  valid from: 2014-08-08
  valid till: 2020-10-03
derived from: Islamic Banking
  type: BicsLevel5Segment
  type: Classifier
  type: ContemporaryDerivation
  derived from: http://data.ga-group.nl/ics/bics/2020/1410101112
  derived from: http://data.ga-group.nl/ics/bics/2024/1410101112
  source accessed on: 2023-07-03T18:11:29Z
  source last accessed on: 2024-06-05T14:42:36Z
  definition: This segment includes companies that accept deposits and make loans in compliance with Sharia law.
  notation: 1410101112
  valid from: 2020-10-03
source accessed on: 2023-07-03T18:11:29Z
source last accessed on: 2024-06-05T14:42:36Z
definition: This segment includes companies that accept deposits and make loans in compliance with Sharia law.
notation: 1410101112
valid from: 2020-10-03

Banks
type: BicsLevel4SubIndustry
type: Classifier
type: NamedIndividual
replaces: Specialty Finance
created with: infer-bics.sql
derived from: Capital Pools
  type: BicsLevel4SubIndustry
  type: Classifier
  type: ContemporaryDerivation
  derived from: http://data.ga-group.nl/ics/bics/2014/14101011
  source accessed on: 2019-12-03T20:05:01Z
  source last accessed on: 2019-12-03T20:05:01Z
  definition: This industry subgroup includes companies that operate as a capital pool. A capital pool is a financing tool for emerging companies that pairs an eligible private company with a public capital pool company to take the private company public.
  notation: 14101011
  valid from: 2014-08-08
  valid till: 2020-10-03
derived from: Banks
  type: BicsLevel3Industry
  type: Classifier
  type: AnachronousDerivation
  derived from: http://data.ga-group.nl/ics/bics/2014/141111
  source accessed on: 2019-12-03T20:05:01Z
  source last accessed on: 2019-12-03T20:05:01Z
  definition: This industry includes companies that accept deposits and make loans.
  notation: 141111
  valid from: 2014-08-08
  valid till: 2020-10-03
derived from: Banks
  type: BicsLevel4SubIndustry
  type: Classifier
  type: ContemporaryDerivation
  derived from: http://data.ga-group.nl/ics/bics/2020/14101011
  derived from: http://data.ga-group.nl/ics/bics/2024/14101011
  source accessed on: 2023-07-03T18:11:29Z
  source last accessed on: 2024-06-05T14:42:36Z
  definition: This industry subgroup includes companies that accept deposits and make loans.
  notation: 14101011
  valid from: 2020-10-03
source accessed on: 2019-12-03T20:05:01Z
source last accessed on: 2024-06-05T14:42:36Z
definition: This industry subgroup includes companies that accept deposits and make loans.
notation: 14101011
valid from: 2014-08-08

Investment Comps - Resources
type: BicsLevel4SubIndustry
type: Classifier
type: NamedIndividual
created with: infer-bics.sql
derived from: Investment Comps - Resources
  type: BicsLevel4SubIndustry
  type: Classifier
  type: ContemporaryDerivation
  derived from: http://data.ga-group.nl/ics/bics/2014/14101012
  source accessed on: 2019-12-03T20:05:01Z
  source last accessed on: 2019-12-03T20:05:01Z
  definition: This industry subgroup includes companies that invest in natural resources for investment purposes.
  notation: 14101012
  valid from: 2014-08-08
  valid till: 2020-10-03
source accessed on: 2019-12-03T20:05:01Z
source last accessed on: 2019-12-03T20:05:01Z
definition: This industry subgroup includes companies that invest in natural resources for investment purposes.
notation: 14101012
valid from: 2014-08-08
valid till: 2020-10-03

Investment Holding Companies
type: BicsLevel4SubIndustry
type: Classifier
type: NamedIndividual
created with: infer-bics.sql
derived from: Investment Holding Companies
  type: BicsLevel4SubIndustry
  type: Classifier
  type: ContemporaryDerivation
  derived from: http://data.ga-group.nl/ics/bics/2014/14101013
  source accessed on: 2019-12-03T20:05:01Z
  source last accessed on: 2019-12-03T20:05:01Z
  definition: This industry subgroup includes companies that hold securities of other companies for investment purposes.
  notation: 14101013
  valid from: 2014-08-08
  valid till: 2020-10-03
source accessed on: 2019-12-03T20:05:01Z
source last accessed on: 2019-12-03T20:05:01Z
definition: This industry subgroup includes companies that hold securities of other companies for investment purposes.
notation: 14101013
valid from: 2014-08-08
valid till: 2020-10-03

SPAC
type: BicsLevel4SubIndustry
type: Classifier
type: NamedIndividual
created with: infer-bics.sql
derived from: SPAC
  type: BicsLevel4SubIndustry
  type: Classifier
  type: ContemporaryDerivation
  derived from: http://data.ga-group.nl/ics/bics/2014/14101014
  source accessed on: 2019-12-03T20:05:01Z
  source last accessed on: 2019-12-03T20:05:01Z
  definition: This industry subgroup includes companies that operate as a Special Purpose Acquisition Company (SPAC). SPACs are blank shell or blank-check companies that have no business operations but go public with the intention of merging or acquiring a company with the proceeds of the IPO.
  notation: 14101014
  valid from: 2014-08-08
  valid till: 2020-10-03
source accessed on: 2019-12-03T20:05:01Z
source last accessed on: 2019-12-03T20:05:01Z
definition: This industry subgroup includes companies that operate as a Special Purpose Acquisition Company (SPAC). SPACs are blank shell or blank-check companies that have no business operations but go public with the intention of merging or acquiring a company with the proceeds of the IPO.
notation: 14101014
valid from: 2014-08-08
valid till: 2020-10-03

Banking
type: BicsLevel3Industry
type: Classifier
type: NamedIndividual
is industry of: Banking
is replaced by: Investment Companies
replaces: Financial Services
created with: infer-bics.sql
derived from: Investment Companies
  type: BicsLevel3Industry
  type: Classifier
  type: ContemporaryDerivation
  derived from: http://data.ga-group.nl/ics/bics/2014/141010
  source accessed on: 2019-12-03T20:05:01Z
  source last accessed on: 2019-12-03T20:05:01Z
  definition: This industry includes companies that have elected to be treated as a regulated investment company and provide debt and equity financing to firms in its portfolio. This segment also includes special purpose acquisition (SPAC) or blank-check companies set up in order to serve as a vehicle for the acquisition of an operating business.
  notation: 141010
  valid from: 2014-08-08
  valid till: 2020-10-03
derived from: Banking
  type: BicsLevel2IndustryGroup
  type: Classifier
  type: AnachronousDerivation
  derived from: http://data.ga-group.nl/ics/bics/2014/1411
  source accessed on: 2019-12-03T20:05:01Z
  source last accessed on: 2019-12-03T20:05:01Z
  definition: This industry group includes companies that accept deposits and make loans to corporations and individuals through either a commercial banking or savings bank structure.
  notation: 1411
  valid from: 2014-08-08
  valid till: 2020-10-03
derived from: Banking
  type: BicsLevel3Industry
  type: Classifier
  type: ContemporaryDerivation
  derived from: http://data.ga-group.nl/ics/bics/2020/141010
  derived from: http://data.ga-group.nl/ics/bics/2024/141010
  source accessed on: 2023-07-03T18:11:29Z
  source last accessed on: 2024-06-05T14:42:36Z
  definition: This industry includes companies that provide banking services. These companies accept deposits and use these deposits as their primary funding source for their lending activities.
  notation: 141010
  valid from: 2020-10-03
source accessed on: 2019-12-03T20:05:01Z
source last accessed on: 2024-06-05T14:42:36Z
definition: This industry includes companies that provide banking services. These companies accept deposits and use these deposits as their primary funding source for their lending activities.
notation: 141010
valid from: 2014-08-08

Equities
type: BicsLevel4SubIndustry
type: Classifier
type: NamedIndividual
created with: infer-bics.sql
derived from: Equities
  type: BicsLevel4SubIndustry
  type: Classifier
  type: ContemporaryDerivation
  derived from: http://data.ga-group.nl/ics/bics/2014/14101110
  source accessed on: 2019-12-03T20:05:01Z
  source last accessed on: 2019-12-03T20:05:01Z
  definition: This industry subgroup includes companies that provide traditional investment management services for individual and institutional investors by investing in equities.
  notation: 14101110
  valid from: 2014-08-08
  valid till: 2020-10-03
source accessed on: 2019-12-03T20:05:01Z
source last accessed on: 2019-12-03T20:05:01Z
definition: This industry subgroup includes companies that provide traditional investment management services for individual and institutional investors by investing in equities.
notation: 14101110
valid from: 2014-08-08
valid till: 2020-10-03

Fixed Income
type: BicsLevel4SubIndustry
type: Classifier
type: NamedIndividual
created with: infer-bics.sql
derived from: Fixed Income
  type: BicsLevel4SubIndustry
  type: Classifier
  type: ContemporaryDerivation
  derived from: http://data.ga-group.nl/ics/bics/2014/14101111
  source accessed on: 2019-12-03T20:05:01Z
  source last accessed on: 2019-12-03T20:05:01Z
  definition: This industry subgroup includes companies that provide traditional investment management services for individual and institutional investors by investing in fixed income investments. Types of fixed income investments are corporate bonds, government bonds, municipal bonds, asset-backed securities and agency bonds.
  notation: 14101111
  valid from: 2014-08-08
  valid till: 2020-10-03
source accessed on: 2019-12-03T20:05:01Z
source last accessed on: 2019-12-03T20:05:01Z
definition: This industry subgroup includes companies that provide traditional investment management services for individual and institutional investors by investing in fixed income investments. Types of fixed income investments are corporate bonds, government bonds, municipal bonds, asset-backed securities and agency bonds.
notation: 14101111
valid from: 2014-08-08
valid till: 2020-10-03

Directional Investments
type: BicsLevel5Segment
type: Classifier
type: NamedIndividual
is level5 segment of: Hedge Fund Investments
created with: infer-bics.sql
derived from: Directional Investments
  type: BicsLevel5Segment
  type: Classifier
  type: ContemporaryDerivation
  derived from: http://data.ga-group.nl/ics/bics/2014/1410111210
  source accessed on: 2019-12-03T20:05:01Z
  source last accessed on: 2019-12-03T20:05:01Z
  definition: This segment includes companies that provide hedge fund investments that employ a directional investment strategy. Such a strategy is any trading or investment strategy that makes a net long or short position in a market. Types of directional hedge funds are long/short equity, emerging markets, sector funds and quantitative.
  notation: 1410111210
  valid from: 2014-08-08
  valid till: 2020-10-03
source accessed on: 2019-12-03T20:05:01Z
source last accessed on: 2019-12-03T20:05:01Z
definition: This segment includes companies that provide hedge fund investments that employ a directional investment strategy. Such a strategy is any trading or investment strategy that makes a net long or short position in a market. Types of directional hedge funds are long/short equity, emerging markets, sector funds and quantitative.
notation: 1410111210
valid from: 2014-08-08
valid till: 2020-10-03

Event-driven Investments
type: BicsLevel5Segment
type: Classifier
type: NamedIndividual
is level5 segment of: Hedge Fund Investments
created with: infer-bics.sql
derived from: Event-driven Investments
  type: BicsLevel5Segment
  type: Classifier
  type: ContemporaryDerivation
  derived from: http://data.ga-group.nl/ics/bics/2014/1410111211
  source accessed on: 2019-12-03T20:05:01Z
  source last accessed on: 2019-12-03T20:05:01Z
  definition: This segment includes companies that provide hedge fund investments that employ an event-driven investment strategy. Such a strategy is any trading or investment strategy that exploits pricing inefficiencies caused by anticipated specific corporate events. Types of event-driven hedge funds are distressed debt, merger arbitrage, credit arbitrage and activist funds that take large positions in companies to be active in management.
  notation: 1410111211
  valid from: 2014-08-08
  valid till: 2020-10-03
source accessed on: 2019-12-03T20:05:01Z
source last accessed on: 2019-12-03T20:05:01Z
definition: This segment includes companies that provide hedge fund investments that employ an event-driven investment strategy. Such a strategy is any trading or investment strategy that exploits pricing inefficiencies caused by anticipated specific corporate events. Types of event-driven hedge funds are distressed debt, merger arbitrage, credit arbitrage and activist funds that take large positions in companies to be active in management.
notation: 1410111211
valid from: 2014-08-08
valid till: 2020-10-03

Global Macro Investments
type: BicsLevel5Segment
type: Classifier
type: NamedIndividual
is level5 segment of: Hedge Fund Investments
created with: infer-bics.sql
derived from: Global Macro Investments
  type: BicsLevel5Segment
  type: Classifier
  type: ContemporaryDerivation
  derived from: http://data.ga-group.nl/ics/bics/2014/1410111212
  source accessed on: 2019-12-03T20:05:01Z
  source last accessed on: 2019-12-03T20:05:01Z
  definition: This segment includes companies that provide hedge fund investments that employ a global macro investment strategy. Such a strategy is investing around the world using broad macroeconomic factors that forecast interest rate trends, business cycles, government policies, political changes and other broad systemic factors.
  notation: 1410111212
  valid from: 2014-08-08
  valid till: 2020-10-03
source accessed on: 2019-12-03T20:05:01Z
source last accessed on: 2019-12-03T20:05:01Z
definition: This segment includes companies that provide hedge fund investments that employ a global macro investment strategy. Such a strategy is investing around the world using broad macroeconomic factors that forecast interest rate trends, business cycles, government policies, political changes and other broad systemic factors.
notation: 1410111212
valid from: 2014-08-08
valid till: 2020-10-03

Managed Futures Investments
type: BicsLevel5Segment
type: Classifier
type: NamedIndividual
is level5 segment of: Hedge Fund Investments
created with: infer-bics.sql
derived from: Managed Futures Investments
  type: BicsLevel5Segment
  type: Classifier
  type: ContemporaryDerivation
  derived from: http://data.ga-group.nl/ics/bics/2014/1410111213
  source accessed on: 2019-12-03T20:05:01Z
  source last accessed on: 2019-12-03T20:05:01Z
  definition: This segment includes companies that focus on providing hedge fund investments that employ a managed futures investment strategy. Such a strategy uses a proprietary system or discretionary method that involves going long or short in futures contracts in commodities, such as metals, grains, soft commodities and bond futures, as well as currencies and equity indices.
  notation: 1410111213
  valid from: 2014-08-08
  valid till: 2020-10-03
source accessed on: 2019-12-03T20:05:01Z
source last accessed on: 2019-12-03T20:05:01Z
definition: This segment includes companies that focus on providing hedge fund investments that employ a managed futures investment strategy. Such a strategy uses a proprietary system or discretionary method that involves going long or short in futures contracts in commodities, such as metals, grains, soft commodities and bond futures, as well as currencies and equity indices.
notation: 1410111213
valid from: 2014-08-08
valid till: 2020-10-03

Relative Value Investments
type: BicsLevel5Segment
type: Classifier
type: NamedIndividual
is level5 segment of: Hedge Fund Investments
created with: infer-bics.sql
derived from: Relative Value Investments
  type: BicsLevel5Segment
  type: Classifier
  type: ContemporaryDerivation
  derived from: http://data.ga-group.nl/ics/bics/2014/1410111214
  source accessed on: 2019-12-03T20:05:01Z
  source last accessed on: 2019-12-03T20:05:01Z
  definition: This segment includes companies that provide hedge fund investments that employ a relative value investment strategy. Such a strategy exploits pricing inefficiencies between assets that are mispriced. Types of relative value hedge funds are fixed income arbitrage, equity arbitrage, convertible arbitrage and volatility arbitrage.
  notation: 1410111214
  valid from: 2014-08-08
  valid till: 2020-10-03
source accessed on: 2019-12-03T20:05:01Z
source last accessed on: 2019-12-03T20:05:01Z
definition: This segment includes companies that provide hedge fund investments that employ a relative value investment strategy. Such a strategy exploits pricing inefficiencies between assets that are mispriced. Types of relative value hedge funds are fixed income arbitrage, equity arbitrage, convertible arbitrage and volatility arbitrage.
notation: 1410111214
valid from: 2014-08-08
valid till: 2020-10-03

Hedge Fund Investments
type: BicsLevel4SubIndustry
type: Classifier
type: NamedIndividual
created with: infer-bics.sql
derived from: Hedge Fund Investments
  type: BicsLevel4SubIndustry
  type: Classifier
  type: ContemporaryDerivation
  derived from: http://data.ga-group.nl/ics/bics/2014/14101112
  source accessed on: 2019-12-03T20:05:01Z
  source last accessed on: 2019-12-03T20:05:01Z
  definition: This industry subgroup includes companies that provide investment management services for individual and institutional investors by investing in a diverse range of assets, such as equities, bonds and commodities. Hedge funds employ a variety of investment strategies to maintain a hedged portfolio designed to protect investors from downturns in the market and maximize returns in upward markets.
  notation: 14101112
  valid from: 2014-08-08
  valid till: 2020-10-03
source accessed on: 2019-12-03T20:05:01Z
source last accessed on: 2019-12-03T20:05:01Z
definition: This industry subgroup includes companies that provide investment management services for individual and institutional investors by investing in a diverse range of assets, such as equities, bonds and commodities. Hedge funds employ a variety of investment strategies to maintain a hedged portfolio designed to protect investors from downturns in the market and maximize returns in upward markets.
notation: 14101112
valid from: 2014-08-08
valid till: 2020-10-03

Mixed Asset
type: BicsLevel4SubIndustry
type: Classifier
type: NamedIndividual
created with: infer-bics.sql
derived from: Mixed Asset
  type: BicsLevel4SubIndustry
  type: Classifier
  type: ContemporaryDerivation
  derived from: http://data.ga-group.nl/ics/bics/2014/14101113
  source accessed on: 2019-12-03T20:05:01Z
  source last accessed on: 2019-12-03T20:05:01Z
  definition: This industry subgroup includes companies that provide traditional investment management services for individual and institutional investors by investing in a mixed asset portfolio. A mixed asset fund invests in a mix of bonds and equities to spread the investment risk.
  notation: 14101113
  valid from: 2014-08-08
  valid till: 2020-10-03
source accessed on: 2019-12-03T20:05:01Z
source last accessed on: 2019-12-03T20:05:01Z
definition: This industry subgroup includes companies that provide traditional investment management services for individual and institutional investors by investing in a mixed asset portfolio. A mixed asset fund invests in a mix of bonds and equities to spread the investment risk.
notation: 14101113
valid from: 2014-08-08
valid till: 2020-10-03

Investment Management
type: BicsLevel3Industry
type: Classifier
type: NamedIndividual
is industry of: Banking
is replaced by: Investment Management
created with: infer-bics.sql
derived from: Investment Management
  type: BicsLevel3Industry
  type: Classifier
  type: ContemporaryDerivation
  derived from: http://data.ga-group.nl/ics/bics/2014/141011
  source accessed on: 2019-12-03T20:05:01Z
  source last accessed on: 2019-12-03T20:05:01Z
  definition: This industry includes companies that provide traditional investment management services for individual and institutional investors. Major asset classes include equities, fixed income, mixed asset and hedge funds.
  notation: 141011
  valid from: 2014-08-08
  valid till: 2020-10-03
source accessed on: 2019-12-03T20:05:01Z
source last accessed on: 2019-12-03T20:05:01Z
definition: This industry includes companies that provide traditional investment management services for individual and institutional investors. Major asset classes include equities, fixed income, mixed asset and hedge funds.
notation: 141011
valid from: 2014-08-08
valid till: 2020-10-03

Co-Investments
type: BicsLevel4SubIndustry
type: Classifier
type: NamedIndividual
created with: infer-bics.sql
derived from: Co-Investments
  type: BicsLevel4SubIndustry
  type: Classifier
  type: ContemporaryDerivation
  derived from: http://data.ga-group.nl/ics/bics/2014/14101210
  source accessed on: 2019-12-03T20:05:01Z
  source last accessed on: 2019-12-03T20:05:01Z
  definition: This industry subgroup includes companies that invest in a co-investment asset class of private equity financial sponsors. An equity co-investment is a minority investment in an operating company alongside a financial sponsor or other private equity investor in a leveraged buyout, recapitalization or growth capital transaction.
  notation: 14101210
  valid from: 2014-08-08
  valid till: 2020-10-03
source accessed on: 2019-12-03T20:05:01Z
source last accessed on: 2019-12-03T20:05:01Z
definition: This industry subgroup includes companies that invest in a co-investment asset class of private equity financial sponsors. An equity co-investment is a minority investment in an operating company alongside a financial sponsor or other private equity investor in a leveraged buyout, recapitalization or growth capital transaction.
notation: 14101210
valid from: 2014-08-08
valid till: 2020-10-03

Debt Investments
type: BicsLevel4SubIndustry
type: Classifier
type: NamedIndividual
created with: infer-bics.sql
derived from: Debt Investments
  type: BicsLevel4SubIndustry
  type: Classifier
  type: ContemporaryDerivation
  derived from: http://data.ga-group.nl/ics/bics/2014/14101211
  source accessed on: 2019-12-03T20:05:01Z
  source last accessed on: 2019-12-03T20:05:01Z
  definition: This industry subgroup includes companies that invest in a special situation asset class of private equity financial sponsors. A special situation investment refers to investments in equity or debt securities of financially stressed companies. Special situation strategies involve an investment that will provide rescue financing to companies undergoing operational or financial challenges.
  notation: 14101211
  valid from: 2014-08-08
  valid till: 2020-10-03
source accessed on: 2019-12-03T20:05:01Z
source last accessed on: 2019-12-03T20:05:01Z
definition: This industry subgroup includes companies that invest in a special situation asset class of private equity financial sponsors. A special situation investment refers to investments in equity or debt securities of financially stressed companies. Special situation strategies involve an investment that will provide rescue financing to companies undergoing operational or financial challenges.
notation: 14101211
valid from: 2014-08-08
valid till: 2020-10-03

Fund of Funds
type: BicsLevel4SubIndustry
type: Classifier
type: NamedIndividual
created with: infer-bics.sql
derived from: Fund of Funds
  type: BicsLevel4SubIndustry
  type: Classifier
  type: ContemporaryDerivation
  derived from: http://data.ga-group.nl/ics/bics/2014/14101212
  source accessed on: 2019-12-03T20:05:01Z
  source last accessed on: 2019-12-03T20:05:01Z
  definition: This industry subgroup includes companies that operate a fund of funds investment strategy. A fund of funds holds a portfolio composed of investments in other fund types and does not hold direct investments.
  notation: 14101212
  valid from: 2014-08-08
  valid till: 2020-10-03
source accessed on: 2019-12-03T20:05:01Z
source last accessed on: 2019-12-03T20:05:01Z
definition: This industry subgroup includes companies that operate a fund of funds investment strategy. A fund of funds holds a portfolio composed of investments in other fund types and does not hold direct investments.
notation: 14101212
valid from: 2014-08-08
valid till: 2020-10-03

Growth Capital
type: BicsLevel4SubIndustry
type: Classifier
type: NamedIndividual
created with: infer-bics.sql
derived from: Growth Capital
  type: BicsLevel4SubIndustry
  type: Classifier
  type: ContemporaryDerivation
  derived from: http://data.ga-group.nl/ics/bics/2014/14101213
  source accessed on: 2019-12-03T20:05:01Z
  source last accessed on: 2019-12-03T20:05:01Z
  definition: This industry subgroup includes companies that provide growth capital investments. Typically, these are minority investments that are provided to companies that are more mature in their life-cycle development with positive cash flow. These investments may be utilized for facility expansions, product development or equipment.
  notation: 14101213
  valid from: 2014-08-08
  valid till: 2020-10-03
source accessed on: 2019-12-03T20:05:01Z
source last accessed on: 2019-12-03T20:05:01Z
definition: This industry subgroup includes companies that provide growth capital investments. Typically, these are minority investments that are provided to companies that are more mature in their life-cycle development with positive cash flow. These investments may be utilized for facility expansions, product development or equipment.
notation: 14101213
valid from: 2014-08-08
valid till: 2020-10-03

Leveraged Buyout
type: BicsLevel4SubIndustry
type: Classifier
type: NamedIndividual
created with: infer-bics.sql
derived from: Leveraged Buyout
  type: BicsLevel4SubIndustry
  type: Classifier
  type: ContemporaryDerivation
  derived from: http://data.ga-group.nl/ics/bics/2014/14101214
  source accessed on: 2019-12-03T20:05:01Z
  source last accessed on: 2019-12-03T20:05:01Z
  definition: This industry subgroup includes companies that invest in a leveraged buyout asset class of private equity financial sponsors. A leveraged buyout occurs when a financial sponsor acquires a controlling interest in a company's equity and a significant percentage of the purchase price is financed through leverage.
  notation: 14101214
  valid from: 2014-08-08
  valid till: 2020-10-03
source accessed on: 2019-12-03T20:05:01Z
source last accessed on: 2019-12-03T20:05:01Z
definition: This industry subgroup includes companies that invest in a leveraged buyout asset class of private equity financial sponsors. A leveraged buyout occurs when a financial sponsor acquires a controlling interest in a company's equity and a significant percentage of the purchase price is financed through leverage.
notation: 14101214
valid from: 2014-08-08
valid till: 2020-10-03

Real Assets Investments
type: BicsLevel4SubIndustry
type: Classifier
type: NamedIndividual
created with: infer-bics.sql
derived from: Real Assets Investments
  type: BicsLevel4SubIndustry
  type: Classifier
  type: ContemporaryDerivation
  derived from: http://data.ga-group.nl/ics/bics/2014/14101215
  source accessed on: 2019-12-03T20:05:01Z
  source last accessed on: 2019-12-03T20:05:01Z
  definition: This industry subgroup includes companies that invest in an infrastructure asset class of private equity financial sponsors. An infrastructure investment includes transportation, water and waste, and natural resources investments.
  notation: 14101215
  valid from: 2014-08-08
  valid till: 2020-10-03
source accessed on: 2019-12-03T20:05:01Z
source last accessed on: 2019-12-03T20:05:01Z
definition: This industry subgroup includes companies that invest in an infrastructure asset class of private equity financial sponsors. An infrastructure investment includes transportation, water and waste, and natural resources investments.
notation: 14101215
valid from: 2014-08-08
valid till: 2020-10-03

Real Estate Investments
type: BicsLevel4SubIndustry
type: Classifier
type: NamedIndividual
created with: infer-bics.sql
derived from: Real Estate Investments
  type: BicsLevel4SubIndustry
  type: Classifier
  type: ContemporaryDerivation
  derived from: http://data.ga-group.nl/ics/bics/2014/14101216
  source accessed on: 2019-12-03T20:05:01Z
  source last accessed on: 2019-12-03T20:05:01Z
  definition: This industry subgroup includes companies that invest in a real estate asset class of private equity financial sponsors. A real estate investment consists of equity and debt investments in property that involves an active management strategy.
  notation: 14101216
  valid from: 2014-08-08
  valid till: 2020-10-03
source accessed on: 2019-12-03T20:05:01Z
source last accessed on: 2019-12-03T20:05:01Z
definition: This industry subgroup includes companies that invest in a real estate asset class of private equity financial sponsors. A real estate investment consists of equity and debt investments in property that involves an active management strategy.
notation: 14101216
valid from: 2014-08-08
valid till: 2020-10-03

Secondary Transactions
type: BicsLevel4SubIndustry
type: Classifier
type: NamedIndividual
created with: infer-bics.sql
derived from: Secondary Transactions
  type: BicsLevel4SubIndustry
  type: Classifier
  type: ContemporaryDerivation
  derived from: http://data.ga-group.nl/ics/bics/2014/14101217
  source accessed on: 2019-12-03T20:05:01Z
  source last accessed on: 2019-12-03T20:05:01Z
  definition: This industry subgroup includes companies that invest in a secondary transaction asset class of private equity financial sponsors. A secondary transaction investment consists of buying and selling of preexisting investor commitments to private equity and other alternative investment funds. Types of secondary transaction investments are the sale of a limited partnership interest and the sale of a direct interest.
  notation: 14101217
  valid from: 2014-08-08
  valid till: 2020-10-03
source accessed on: 2019-12-03T20:05:01Z
source last accessed on: 2019-12-03T20:05:01Z
definition: This industry subgroup includes companies that invest in a secondary transaction asset class of private equity financial sponsors. A secondary transaction investment consists of buying and selling of preexisting investor commitments to private equity and other alternative investment funds. Types of secondary transaction investments are the sale of a limited partnership interest and the sale of a direct interest.
notation: 14101217
valid from: 2014-08-08
valid till: 2020-10-03

Venture Capital
type: BicsLevel4SubIndustry
type: Classifier
type: NamedIndividual
created with: infer-bics.sql
derived from: Venture Capital
  type: BicsLevel4SubIndustry
  type: Classifier
  type: ContemporaryDerivation
  derived from: http://data.ga-group.nl/ics/bics/2014/14101218
  source accessed on: 2019-12-03T20:05:01Z
  source last accessed on: 2019-12-03T20:05:01Z
  definition: This industry subgroup includes companies that provide venture capital investments. Such investments are provided to early-stage, high-potential, high-risk, growth startup companies.
  notation: 14101218
  valid from: 2014-08-08
  valid till: 2020-10-03
source accessed on: 2019-12-03T20:05:01Z
source last accessed on: 2019-12-03T20:05:01Z
definition: This industry subgroup includes companies that provide venture capital investments. Such investments are provided to early-stage, high-potential, high-risk, growth startup companies.
notation: 14101218
valid from: 2014-08-08
valid till: 2020-10-03

Private Equity
type: BicsLevel3Industry
type: Classifier
type: NamedIndividual
is industry of: Banking
is replaced by: Private Equity
created with: infer-bics.sql
derived from: Private Equity
  type: BicsLevel3Industry
  type: Classifier
  type: ContemporaryDerivation
  derived from: http://data.ga-group.nl/ics/bics/2014/141012
  source accessed on: 2019-12-03T20:05:01Z
  source last accessed on: 2019-12-03T20:05:01Z
  definition: This industry includes companies that are a type of private equity investment firm, particularly those private equity firms that engage in leveraged buyout (LBO) transactions. Financial sponsors rarely manage a company directly and are most active on issues relating to a company's capital structure and balance sheet and strategic initiatives, such as mergers and acquisitions.
  notation: 141012
  valid from: 2014-08-08
  valid till: 2020-10-03
source accessed on: 2019-12-03T20:05:01Z
source last accessed on: 2019-12-03T20:05:01Z
definition: This industry includes companies that are a type of private equity investment firm, particularly those private equity firms that engage in leveraged buyout (LBO) transactions. Financial sponsors rarely manage a company directly and are most active on issues relating to a company's capital structure and balance sheet and strategic initiatives, such as mergers and acquisitions.
notation: 141012
valid from: 2014-08-08
valid till: 2020-10-03

Financial Plan & Invst Advisory
type: BicsLevel4SubIndustry
type: Classifier
type: NamedIndividual
created with: infer-bics.sql
derived from: Financial Plan & Invst Advisory
  type: BicsLevel4SubIndustry
  type: Classifier
  type: ContemporaryDerivation
  derived from: http://data.ga-group.nl/ics/bics/2014/14101310
  source accessed on: 2019-12-03T20:05:01Z
  source last accessed on: 2019-12-03T20:05:01Z
  definition: This industry subgroup includes companies that provide financial planning and investment advice to clients on a fee basis but do not have authority to execute trades. Financial planning involves creating and preserving personal wealth, retirement planning, and tax- and estate-planning services.
  notation: 14101310
  valid from: 2014-08-08
  valid till: 2020-10-03
source accessed on: 2019-12-03T20:05:01Z
source last accessed on: 2019-12-03T20:05:01Z
definition: This industry subgroup includes companies that provide financial planning and investment advice to clients on a fee basis but do not have authority to execute trades. Financial planning involves creating and preserving personal wealth, retirement planning, and tax- and estate-planning services.
notation: 14101310
valid from: 2014-08-08
valid till: 2020-10-03

Private Banking
type: BicsLevel4SubIndustry
type: Classifier
type: NamedIndividual
created with: infer-bics.sql
derived from: Private Banking
  type: BicsLevel4SubIndustry
  type: Classifier
  type: ContemporaryDerivation
  derived from: http://data.ga-group.nl/ics/bics/2014/14101311
  source accessed on: 2019-12-03T20:05:01Z
  source last accessed on: 2019-12-03T20:05:01Z
  definition: This industry subgroup includes commercial banks that provide personalized wealth management services to high net worth individuals.
  notation: 14101311
  valid from: 2014-08-08
  valid till: 2020-10-03
source accessed on: 2019-12-03T20:05:01Z
source last accessed on: 2019-12-03T20:05:01Z
definition: This industry subgroup includes commercial banks that provide personalized wealth management services to high net worth individuals.
notation: 14101311
valid from: 2014-08-08
valid till: 2020-10-03

Retail Securities Brokerage
type: BicsLevel4SubIndustry
type: Classifier
type: NamedIndividual
created with: infer-bics.sql
derived from: Retail Securities Brokerage
  type: BicsLevel4SubIndustry
  type: Classifier
  type: ContemporaryDerivation
  derived from: http://data.ga-group.nl/ics/bics/2014/14101312
  source accessed on: 2019-12-03T20:05:01Z
  source last accessed on: 2019-12-03T20:05:01Z
  definition: This industry subgroup includes companies that provide securities brokerage services to retail investors. Retail investors are individuals who buy or sell securities for their personal account.
  notation: 14101312
  valid from: 2014-08-08
  valid till: 2020-10-03
source accessed on: 2019-12-03T20:05:01Z
source last accessed on: 2019-12-03T20:05:01Z
definition: This industry subgroup includes companies that provide securities brokerage services to retail investors. Retail investors are individuals who buy or sell securities for their personal account.
notation: 14101312
valid from: 2014-08-08
valid till: 2020-10-03

Wealth Management
type: BicsLevel3Industry
type: Classifier
type: NamedIndividual
is industry of: Banking
is replaced by: Wealth Management
created with: infer-bics.sql
derived from: Wealth Management
  type: BicsLevel3Industry
  type: Classifier
  type: ContemporaryDerivation
  derived from: http://data.ga-group.nl/ics/bics/2014/141013
  source accessed on: 2019-12-03T20:05:01Z
  source last accessed on: 2019-12-03T20:05:01Z
  definition: This industry includes companies that manage investment portfolios, such as private banking, trust, retail securities brokerage, and financial planning and investment advisory services.
  notation: 141013
  valid from: 2014-08-08
  valid till: 2020-10-03
source accessed on: 2019-12-03T20:05:01Z
source last accessed on: 2019-12-03T20:05:01Z
definition: This industry includes companies that manage investment portfolios, such as private banking, trust, retail securities brokerage, and financial planning and investment advisory services.
notation: 141013
valid from: 2014-08-08
valid till: 2020-10-03

Banking
type: BicsLevel2IndustryGroup
type: Classifier
type: NamedIndividual
is industry group of: Financials
is replaced by: Asset Management
created with: infer-bics.sql
derived from: Asset Management
  type: BicsLevel2IndustryGroup
  type: Classifier
  type: ContemporaryDerivation
  derived from: http://data.ga-group.nl/ics/bics/2014/1410
  source accessed on: 2019-12-03T20:05:01Z
  source last accessed on: 2019-12-03T20:05:01Z
  definition: This industry group includes companies that manage investment portfolios, such as investment companies, investment management companies, private equity firms and wealth management companies.
  notation: 1410
  valid from: 2014-08-08
  valid till: 2020-10-03
derived from: Banking
  type: BicsLevel2IndustryGroup
  type: Classifier
  type: ContemporaryDerivation
  derived from: http://data.ga-group.nl/ics/bics/2020/1410
  derived from: http://data.ga-group.nl/ics/bics/2024/1410
  source accessed on: 2023-07-03T18:11:29Z
  source last accessed on: 2024-06-05T14:42:36Z
  definition: This industry group includes companies that provide banking services. These companies accept deposits and use these deposits as their primary funding source for their lending activities.
  notation: 1410
  valid from: 2020-10-03
source accessed on: 2019-12-03T20:05:01Z
source last accessed on: 2024-06-05T14:42:36Z
definition: This industry group includes companies that provide banking services. These companies accept deposits and use these deposits as their primary funding source for their lending activities.
notation: 1410
valid from: 2014-08-08

Investment Holding Companies
type: BicsLevel5Segment
type: Classifier
type: NamedIndividual
is level5 segment of: Investment Companies
created with: infer-bics.sql
derived from: Investment Holding Companies
  type: BicsLevel4SubIndustry
  type: Classifier
  type: AnachronousDerivation
  derived from: http://data.ga-group.nl/ics/bics/2014/14101013
  source accessed on: 2019-12-03T20:05:01Z
  source last accessed on: 2019-12-03T20:05:01Z
  definition: This industry subgroup includes companies that hold securities of other companies for investment purposes.
  notation: 14101013
  valid from: 2014-08-08
  valid till: 2020-10-03
derived from: Investment Holding Companies
  type: BicsLevel5Segment
  type: Classifier
  type: ContemporaryDerivation
  derived from: http://data.ga-group.nl/ics/bics/2020/1411101010
  derived from: http://data.ga-group.nl/ics/bics/2024/1411101010
  source accessed on: 2023-07-03T18:11:29Z
  source last accessed on: 2024-06-05T14:42:36Z
  definition: This segment includes companies that hold securities of other companies for investment purposes.
  notation: 1411101010
  valid from: 2020-10-03
source accessed on: 2023-07-03T18:11:29Z
source last accessed on: 2024-06-05T14:42:36Z
definition: This segment includes companies that hold securities of other companies for investment purposes.
notation: 1411101010
valid from: 2020-10-03

BDCs
type: BicsLevel5Segment
type: Classifier
type: NamedIndividual
is level5 segment of: Investment Companies
created with: infer-bics.sql
derived from: BDCs
  type: BicsLevel4SubIndustry
  type: Classifier
  type: AnachronousDerivation
  derived from: http://data.ga-group.nl/ics/bics/2014/14101010
  source accessed on: 2019-12-03T20:05:01Z
  source last accessed on: 2019-12-03T20:05:01Z
  definition: This industry subgroup includes business development companies (BDCs). A BDC operates in the private equity business and helps provide capital and management to early-stage and mature private and small public companies in the initial stage of their development.
  notation: 14101010
  valid from: 2014-08-08
  valid till: 2020-10-03
derived from: BDCs
  type: BicsLevel5Segment
  type: Classifier
  type: ContemporaryDerivation
  derived from: http://data.ga-group.nl/ics/bics/2020/1411101011
  derived from: http://data.ga-group.nl/ics/bics/2024/1411101011
  source accessed on: 2023-07-03T18:11:29Z
  source last accessed on: 2024-06-05T14:42:36Z
  definition: This segment includes business development companies (BDCs). A BDC provides capital and management to primarily private small- and medium-sized companies that may not be able to obtain traditional financing. A company must qualify as a BDC. Companies with other similar structures are included.
  notation: 1411101011
  valid from: 2020-10-03
source accessed on: 2023-07-03T18:11:29Z
source last accessed on: 2024-06-05T14:42:36Z
definition: This segment includes business development companies (BDCs). A BDC provides capital and management to primarily private small- and medium-sized companies that may not be able to obtain traditional financing. A company must qualify as a BDC. Companies with other similar structures are included.
notation: 1411101011
valid from: 2020-10-03

SPAC
type: BicsLevel5Segment
type: Classifier
type: NamedIndividual
is level5 segment of: Investment Companies
created with: infer-bics.sql
derived from: SPAC
  type: BicsLevel4SubIndustry
  type: Classifier
  type: AnachronousDerivation
  derived from: http://data.ga-group.nl/ics/bics/2014/14101014
  source accessed on: 2019-12-03T20:05:01Z
  source last accessed on: 2019-12-03T20:05:01Z
  definition: This industry subgroup includes companies that operate as a Special Purpose Acquisition Company (SPAC). SPACs are blank shell or blank-check companies that have no business operations but go public with the intention of merging or acquiring a company with the proceeds of the IPO.
  notation: 14101014
  valid from: 2014-08-08
  valid till: 2020-10-03
derived from: SPAC
  type: BicsLevel5Segment
  type: Classifier
  type: ContemporaryDerivation
  derived from: http://data.ga-group.nl/ics/bics/2020/1411101012
  source accessed on: 2023-07-03T18:11:29Z
  source last accessed on: 2023-07-03T18:11:29Z
  definition: This segment includes companies that operate as a Special Purpose Acquisition Company (SPAC). SPACs are blank shell or blank-check companies that have no business operations but go public with the intention of merging or acquiring a company with the proceeds of the IPO.
  notation: 1411101012
  valid from: 2020-10-03
  valid till: 2024-06-07
source accessed on: 2023-07-03T18:11:29Z
source last accessed on: 2023-07-03T18:11:29Z
definition: This segment includes companies that operate as a Special Purpose Acquisition Company (SPAC). SPACs are blank shell or blank-check companies that have no business operations but go public with the intention of merging or acquiring a company with the proceeds of the IPO.
notation: 1411101012
valid from: 2020-10-03
valid till: 2024-06-07

Cryptocurrency Investment Co
type: BicsLevel5Segment
type: Classifier
type: NamedIndividual
is level5 segment of: Investment Companies
created with: infer-bics.sql
derived from: Cryptocurrency Investment Co
  type: BicsLevel5Segment
  type: Classifier
  type: ContemporaryDerivation
  derived from: http://data.ga-group.nl/ics/bics/2024/1411101013
  source accessed on: 2024-06-05T14:42:36Z
  source last accessed on: 2024-06-05T14:42:36Z
  definition: This segment includes companies that mine cryptocurrency or hold cryptocurrency as an investment.
  notation: 1411101013
  valid from: 2024-06-07
source accessed on: 2024-06-05T14:42:36Z
source last accessed on: 2024-06-05T14:42:36Z
definition: This segment includes companies that mine cryptocurrency or hold cryptocurrency as an investment.
notation: 1411101013
valid from: 2024-06-07

Investment Companies
type: BicsLevel4SubIndustry
type: Classifier
type: NamedIndividual
replaces: Banking
created with: infer-bics.sql
derived from: Investment Companies
  type: BicsLevel3Industry
  type: Classifier
  type: AnachronousDerivation
  derived from: http://data.ga-group.nl/ics/bics/2014/141010
  source accessed on: 2019-12-03T20:05:01Z
  source last accessed on: 2019-12-03T20:05:01Z
  definition: This industry includes companies that have elected to be treated as a regulated investment company and provide debt and equity financing to firms in its portfolio. This segment also includes special purpose acquisition (SPAC) or blank-check companies set up in order to serve as a vehicle for the acquisition of an operating business.
  notation: 141010
  valid from: 2014-08-08
  valid till: 2020-10-03
derived from: Investment Companies
  type: BicsLevel4SubIndustry
  type: Classifier
  type: ContemporaryDerivation
  derived from: http://data.ga-group.nl/ics/bics/2020/14111010
  derived from: http://data.ga-group.nl/ics/bics/2024/14111010
  source accessed on: 2023-07-03T18:11:29Z
  source last accessed on: 2024-06-05T14:42:36Z
  definition: This industry subgroup includes companies that manage and invest a company-owned portfolio for their own direct gain.
  notation: 14111010
  valid from: 2020-10-03
source accessed on: 2023-07-03T18:11:29Z
source last accessed on: 2024-06-05T14:42:36Z
definition: This industry subgroup includes companies that manage and invest a company-owned portfolio for their own direct gain.
notation: 14111010
valid from: 2020-10-03

Equities
type: BicsLevel5Segment
type: Classifier
type: NamedIndividual
is level5 segment of: Investment Management
created with: infer-bics.sql
derived from: Equities
  type: BicsLevel4SubIndustry
  type: Classifier
  type: AnachronousDerivation
  derived from: http://data.ga-group.nl/ics/bics/2014/14101110
  source accessed on: 2019-12-03T20:05:01Z
  source last accessed on: 2019-12-03T20:05:01Z
  definition: This industry subgroup includes companies that provide traditional investment management services for individual and institutional investors by investing in equities.
  notation: 14101110
  valid from: 2014-08-08
  valid till: 2020-10-03
derived from: Equities
  type: BicsLevel5Segment
  type: Classifier
  type: ContemporaryDerivation
  derived from: http://data.ga-group.nl/ics/bics/2020/1411101110
  derived from: http://data.ga-group.nl/ics/bics/2024/1411101110
  source accessed on: 2023-07-03T18:11:29Z
  source last accessed on: 2024-06-05T14:42:36Z
  definition: This segment includes companies that provide traditional investment management services for individual and institutional investors by investing in equities.
  notation: 1411101110
  valid from: 2020-10-03
source accessed on: 2023-07-03T18:11:29Z
source last accessed on: 2024-06-05T14:42:36Z
definition: This segment includes companies that provide traditional investment management services for individual and institutional investors by investing in equities.
notation: 1411101110
valid from: 2020-10-03

Fixed Income
type: BicsLevel5Segment
type: Classifier
type: NamedIndividual
is level5 segment of: Investment Management
created with: infer-bics.sql
derived from: Fixed Income
  type: BicsLevel4SubIndustry
  type: Classifier
  type: AnachronousDerivation
  derived from: http://data.ga-group.nl/ics/bics/2014/14101111
  source accessed on: 2019-12-03T20:05:01Z
  source last accessed on: 2019-12-03T20:05:01Z
  definition: This industry subgroup includes companies that provide traditional investment management services for individual and institutional investors by investing in fixed income investments. Types of fixed income investments are corporate bonds, government bonds, municipal bonds, asset-backed securities and agency bonds.
  notation: 14101111
  valid from: 2014-08-08
  valid till: 2020-10-03
derived from: Fixed Income
  type: BicsLevel5Segment
  type: Classifier
  type: ContemporaryDerivation
  derived from: http://data.ga-group.nl/ics/bics/2020/1411101111
  derived from: http://data.ga-group.nl/ics/bics/2024/1411101111
  source accessed on: 2023-07-03T18:11:29Z
  source last accessed on: 2024-06-05T14:42:36Z
  definition: This segment includes companies that provide traditional investment management services for individual and institutional investors by investing in fixed income investments.
  notation: 1411101111
  valid from: 2020-10-03
source accessed on: 2023-07-03T18:11:29Z
source last accessed on: 2024-06-05T14:42:36Z
definition: This segment includes companies that provide traditional investment management services for individual and institutional investors by investing in fixed income investments.
notation: 1411101111
valid from: 2020-10-03

Hedge Fund Investments
type: BicsLevel5Segment
type: Classifier
type: NamedIndividual
is level5 segment of: Investment Management
created with: infer-bics.sql
derived from: Hedge Fund Investments
  type: BicsLevel4SubIndustry
  type: Classifier
  type: AnachronousDerivation
  derived from: http://data.ga-group.nl/ics/bics/2014/14101112
  source accessed on: 2019-12-03T20:05:01Z
  source last accessed on: 2019-12-03T20:05:01Z
  definition: This industry subgroup includes companies that provide investment management services for individual and institutional investors by investing in a diverse range of assets, such as equities, bonds and commodities. Hedge funds employ a variety of investment strategies to maintain a hedged portfolio designed to protect investors from downturns in the market and maximize returns in upward markets.
  notation: 14101112
  valid from: 2014-08-08
  valid till: 2020-10-03
derived from: Hedge Fund Investments
  type: BicsLevel5Segment
  type: Classifier
  type: ContemporaryDerivation
  derived from: http://data.ga-group.nl/ics/bics/2020/1411101112
  derived from: http://data.ga-group.nl/ics/bics/2024/1411101112
  source accessed on: 2023-07-03T18:11:29Z
  source last accessed on: 2024-06-05T14:42:36Z
  definition: This segment includes companies that provide investment management services for individual and institutional investors by investing in a diverse range of assets, such as equities, bonds, and commodities. Hedge funds employ a variety of investment strategies to maintain a hedged portfolio designed to protect investors from downturns in the market and maximize returns in upward markets.
  notation: 1411101112
  valid from: 2020-10-03
source accessed on: 2023-07-03T18:11:29Z
source last accessed on: 2024-06-05T14:42:36Z
definition: This segment includes companies that provide investment management services for individual and institutional investors by investing in a diverse range of assets, such as equities, bonds, and commodities. Hedge funds employ a variety of investment strategies to maintain a hedged portfolio designed to protect investors from downturns in the market and maximize returns in upward markets.
notation: 1411101112
valid from: 2020-10-03

Mixed Asset
type: BicsLevel5Segment
type: Classifier
type: NamedIndividual
is level5 segment of: Investment Management
created with: infer-bics.sql
derived from: Mixed Asset
  type: BicsLevel4SubIndustry
  type: Classifier
  type: AnachronousDerivation
  derived from: http://data.ga-group.nl/ics/bics/2014/14101113
  source accessed on: 2019-12-03T20:05:01Z
  source last accessed on: 2019-12-03T20:05:01Z
  definition: This industry subgroup includes companies that provide traditional investment management services for individual and institutional investors by investing in a mixed asset portfolio. A mixed asset fund invests in a mix of bonds and equities to spread the investment risk.
  notation: 14101113
  valid from: 2014-08-08
  valid till: 2020-10-03
derived from: Mixed Asset
  type: BicsLevel5Segment
  type: Classifier
  type: ContemporaryDerivation
  derived from: http://data.ga-group.nl/ics/bics/2020/1411101113
  derived from: http://data.ga-group.nl/ics/bics/2024/1411101113
  source accessed on: 2023-07-03T18:11:29Z
  source last accessed on: 2024-06-05T14:42:36Z
  definition: This segment includes companies that provide traditional investment management services for individual and institutional investors by investing in a mixed asset portfolio. A mixed asset fund invests in a mix of bonds and equities to spread the investment risk.
  notation: 1411101113
  valid from: 2020-10-03
source accessed on: 2023-07-03T18:11:29Z
source last accessed on: 2024-06-05T14:42:36Z
definition: This segment includes companies that provide traditional investment management services for individual and institutional investors by investing in a mixed asset portfolio. A mixed asset fund invests in a mix of bonds and equities to spread the investment risk.
notation: 1411101113
valid from: 2020-10-03

Investment Management
type: BicsLevel4SubIndustry
type: Classifier
type: NamedIndividual
replaces: Investment Management
created with: infer-bics.sql
derived from: Investment Management
  type: BicsLevel3Industry
  type: Classifier
  type: AnachronousDerivation
  derived from: http://data.ga-group.nl/ics/bics/2014/141011
  source accessed on: 2019-12-03T20:05:01Z
  source last accessed on: 2019-12-03T20:05:01Z
  definition: This industry includes companies that provide traditional investment management services for individual and institutional investors. Major asset classes include equities, fixed income, mixed asset and hedge funds.
  notation: 141011
  valid from: 2014-08-08
  valid till: 2020-10-03
derived from: Investment Management
  type: BicsLevel4SubIndustry
  type: Classifier
  type: ContemporaryDerivation
  derived from: http://data.ga-group.nl/ics/bics/2020/14111011
  derived from: http://data.ga-group.nl/ics/bics/2024/14111011
  source accessed on: 2023-07-03T18:11:29Z
  source last accessed on: 2024-06-05T14:42:36Z
  definition: This industry subgroup includes companies that provide traditional investment management services for individual and institutional investors.
  notation: 14111011
  valid from: 2020-10-03
source accessed on: 2023-07-03T18:11:29Z
source last accessed on: 2024-06-05T14:42:36Z
definition: This industry subgroup includes companies that provide traditional investment management services for individual and institutional investors.
notation: 14111011
valid from: 2020-10-03

Co-Investments
type: BicsLevel5Segment
type: Classifier
type: NamedIndividual
is level5 segment of: Private Equity
created with: infer-bics.sql
derived from: Co-Investments
  type: BicsLevel4SubIndustry
  type: Classifier
  type: AnachronousDerivation
  derived from: http://data.ga-group.nl/ics/bics/2014/14101210
  source accessed on: 2019-12-03T20:05:01Z
  source last accessed on: 2019-12-03T20:05:01Z
  definition: This industry subgroup includes companies that invest in a co-investment asset class of private equity financial sponsors. An equity co-investment is a minority investment in an operating company alongside a financial sponsor or other private equity investor in a leveraged buyout, recapitalization or growth capital transaction.
  notation: 14101210
  valid from: 2014-08-08
  valid till: 2020-10-03
derived from: Co-Investments
  type: BicsLevel5Segment
  type: Classifier
  type: ContemporaryDerivation
  derived from: http://data.ga-group.nl/ics/bics/2020/1411101210
  derived from: http://data.ga-group.nl/ics/bics/2024/1411101210
  source accessed on: 2023-07-03T18:11:29Z
  source last accessed on: 2024-06-05T14:42:36Z
  definition: This segment includes companies that invest in a co-investment asset class of private equity financial sponsors.
  notation: 1411101210
  valid from: 2020-10-03
source accessed on: 2023-07-03T18:11:29Z
source last accessed on: 2024-06-05T14:42:36Z
definition: This segment includes companies that invest in a co-investment asset class of private equity financial sponsors.
notation: 1411101210
valid from: 2020-10-03

Debt Investments
type: BicsLevel5Segment
type: Classifier
type: NamedIndividual
is level5 segment of: Private Equity
created with: infer-bics.sql
derived from: Debt Investments
  type: BicsLevel4SubIndustry
  type: Classifier
  type: AnachronousDerivation
  derived from: http://data.ga-group.nl/ics/bics/2014/14101211
  source accessed on: 2019-12-03T20:05:01Z
  source last accessed on: 2019-12-03T20:05:01Z
  definition: This industry subgroup includes companies that invest in a special situation asset class of private equity financial sponsors. A special situation investment refers to investments in equity or debt securities of financially stressed companies. Special situation strategies involve an investment that will provide rescue financing to companies undergoing operational or financial challenges.
  notation: 14101211
  valid from: 2014-08-08
  valid till: 2020-10-03
derived from: Debt Investments
  type: BicsLevel5Segment
  type: Classifier
  type: ContemporaryDerivation
  derived from: http://data.ga-group.nl/ics/bics/2020/1411101211
  derived from: http://data.ga-group.nl/ics/bics/2024/1411101211
  source accessed on: 2023-07-03T18:11:29Z
  source last accessed on: 2024-06-05T14:42:36Z
  definition: This segment includes companies that invest in the fixed income asset class of private equity financial sponsors. These debt investments will provide rescue financing to companies undergoing operational or financial challenges.
  notation: 1411101211
  valid from: 2020-10-03
source accessed on: 2023-07-03T18:11:29Z
source last accessed on: 2024-06-05T14:42:36Z
definition: This segment includes companies that invest in the fixed income asset class of private equity financial sponsors. These debt investments will provide rescue financing to companies undergoing operational or financial challenges.
notation: 1411101211
valid from: 2020-10-03

Fund of Funds
type: BicsLevel5Segment
type: Classifier
type: NamedIndividual
is level5 segment of: Private Equity
created with: infer-bics.sql
derived from: Fund of Funds
  type: BicsLevel4SubIndustry
  type: Classifier
  type: AnachronousDerivation
  derived from: http://data.ga-group.nl/ics/bics/2014/14101212
  source accessed on: 2019-12-03T20:05:01Z
  source last accessed on: 2019-12-03T20:05:01Z
  definition: This industry subgroup includes companies that operate a fund of funds investment strategy. A fund of funds holds a portfolio composed of investments in other fund types and does not hold direct investments.
  notation: 14101212
  valid from: 2014-08-08
  valid till: 2020-10-03
derived from: Fund of Funds
  type: BicsLevel5Segment
  type: Classifier
  type: ContemporaryDerivation
  derived from: http://data.ga-group.nl/ics/bics/2020/1411101212
  derived from: http://data.ga-group.nl/ics/bics/2024/1411101212
  source accessed on: 2023-07-03T18:11:29Z
  source last accessed on: 2024-06-05T14:42:36Z
  definition: This segment includes companies that operate a fund of funds investment strategy. A fund of funds holds a portfolio composed of investments in other fund types and does not hold direct investments.
  notation: 1411101212
  valid from: 2020-10-03
source accessed on: 2023-07-03T18:11:29Z
source last accessed on: 2024-06-05T14:42:36Z
definition: This segment includes companies that operate a fund of funds investment strategy. A fund of funds holds a portfolio composed of investments in other fund types and does not hold direct investments.
notation: 1411101212
valid from: 2020-10-03

Growth Capital
type: BicsLevel5Segment
type: Classifier
type: NamedIndividual
is level5 segment of: Private Equity
created with: infer-bics.sql
derived from: Growth Capital
  type: BicsLevel4SubIndustry
  type: Classifier
  type: AnachronousDerivation
  derived from: http://data.ga-group.nl/ics/bics/2014/14101213
  source accessed on: 2019-12-03T20:05:01Z
  source last accessed on: 2019-12-03T20:05:01Z
  definition: This industry subgroup includes companies that provide growth capital investments. Typically, these are minority investments that are provided to companies that are more mature in their life-cycle development with positive cash flow. These investments may be utilized for facility expansions, product development or equipment.
  notation: 14101213
  valid from: 2014-08-08
  valid till: 2020-10-03
derived from: Growth Capital
  type: BicsLevel5Segment
  type: Classifier
  type: ContemporaryDerivation
  derived from: http://data.ga-group.nl/ics/bics/2020/1411101213
  derived from: http://data.ga-group.nl/ics/bics/2024/1411101213
  source accessed on: 2023-07-03T18:11:29Z
  source last accessed on: 2024-06-05T14:42:36Z
  definition: This segment includes companies that provide growth capital investments. Typically, these are minority investments that are provided to companies that are more mature in their life-cycle development with positive cash flow. These investments may be utilized for facility expansions, product development, or equipment.
  notation: 1411101213
  valid from: 2020-10-03
source accessed on: 2023-07-03T18:11:29Z
source last accessed on: 2024-06-05T14:42:36Z
definition: This segment includes companies that provide growth capital investments. Typically, these are minority investments that are provided to companies that are more mature in their life-cycle development with positive cash flow. These investments may be utilized for facility expansions, product development, or equipment.
notation: 1411101213
valid from: 2020-10-03

Leveraged Buyout
type: BicsLevel5Segment
type: Classifier
type: NamedIndividual
is level5 segment of: Private Equity
created with: infer-bics.sql
derived from: Leveraged Buyout
  type: BicsLevel4SubIndustry
  type: Classifier
  type: AnachronousDerivation
  derived from: http://data.ga-group.nl/ics/bics/2014/14101214
  source accessed on: 2019-12-03T20:05:01Z
  source last accessed on: 2019-12-03T20:05:01Z
  definition: This industry subgroup includes companies that invest in a leveraged buyout asset class of private equity financial sponsors. A leveraged buyout occurs when a financial sponsor acquires a controlling interest in a company's equity and a significant percentage of the purchase price is financed through leverage.
  notation: 14101214
  valid from: 2014-08-08
  valid till: 2020-10-03
derived from: Leveraged Buyout
  type: BicsLevel5Segment
  type: Classifier
  type: ContemporaryDerivation
  derived from: http://data.ga-group.nl/ics/bics/2020/1411101214
  derived from: http://data.ga-group.nl/ics/bics/2024/1411101214
  source accessed on: 2023-07-03T18:11:29Z
  source last accessed on: 2024-06-05T14:42:36Z
  definition: This segment includes companies that invest in a leveraged buyout asset class of private equity financial sponsors.
  notation: 1411101214
  valid from: 2020-10-03
source accessed on: 2023-07-03T18:11:29Z
source last accessed on: 2024-06-05T14:42:36Z
definition: This segment includes companies that invest in a leveraged buyout asset class of private equity financial sponsors.
notation: 1411101214
valid from: 2020-10-03

Real Assets Investments
type: BicsLevel5Segment
type: Classifier
type: NamedIndividual
is level5 segment of: Private Equity
created with: infer-bics.sql
derived from: Real Assets Investments
  type: BicsLevel4SubIndustry
  type: Classifier
  type: AnachronousDerivation
  derived from: http://data.ga-group.nl/ics/bics/2014/14101215
  source accessed on: 2019-12-03T20:05:01Z
  source last accessed on: 2019-12-03T20:05:01Z
  definition: This industry subgroup includes companies that invest in an infrastructure asset class of private equity financial sponsors. An infrastructure investment includes transportation, water and waste, and natural resources investments.
  notation: 14101215
  valid from: 2014-08-08
  valid till: 2020-10-03
derived from: Real Assets Investments
  type: BicsLevel5Segment
  type: Classifier
  type: ContemporaryDerivation
  derived from: http://data.ga-group.nl/ics/bics/2020/1411101215
  derived from: http://data.ga-group.nl/ics/bics/2024/1411101215
  source accessed on: 2023-07-03T18:11:29Z
  source last accessed on: 2024-06-05T14:42:36Z
  definition: This segment includes companies that invest in an infrastructure asset class of private equity financial sponsors. An infrastructure investment includes transportation, water and waste, and natural resources investments.
  notation: 1411101215
  valid from: 2020-10-03
source accessed on: 2023-07-03T18:11:29Z
source last accessed on: 2024-06-05T14:42:36Z
definition: This segment includes companies that invest in an infrastructure asset class of private equity financial sponsors. An infrastructure investment includes transportation, water and waste, and natural resources investments.
notation: 1411101215
valid from: 2020-10-03

Real Estate Investments
type: BicsLevel5Segment
type: Classifier
type: NamedIndividual
is level5 segment of: Private Equity
created with: infer-bics.sql
derived from: Real Estate Investments
  type: BicsLevel4SubIndustry
  type: Classifier
  type: AnachronousDerivation
  derived from: http://data.ga-group.nl/ics/bics/2014/14101216
  source accessed on: 2019-12-03T20:05:01Z
  source last accessed on: 2019-12-03T20:05:01Z
  definition: This industry subgroup includes companies that invest in a real estate asset class of private equity financial sponsors. A real estate investment consists of equity and debt investments in property that involves an active management strategy.
  notation: 14101216
  valid from: 2014-08-08
  valid till: 2020-10-03
derived from: Real Estate Investments
  type: BicsLevel5Segment
  type: Classifier
  type: ContemporaryDerivation
  derived from: http://data.ga-group.nl/ics/bics/2020/1411101216
  derived from: http://data.ga-group.nl/ics/bics/2024/1411101216
  source accessed on: 2023-07-03T18:11:29Z
  source last accessed on: 2024-06-05T14:42:36Z
  definition: This segment includes companies that invest in a real estate asset class of private equity financial sponsors. A real estate investment consists of equity and debt investments in property that involves an active management strategy.
  notation: 1411101216
  valid from: 2020-10-03
source accessed on: 2023-07-03T18:11:29Z
source last accessed on: 2024-06-05T14:42:36Z
definition: This segment includes companies that invest in a real estate asset class of private equity financial sponsors. A real estate investment consists of equity and debt investments in property that involves an active management strategy.
notation: 1411101216
valid from: 2020-10-03

Secondary Transactions
type: BicsLevel5Segment
type: Classifier
type: NamedIndividual
is level5 segment of: Private Equity
created with: infer-bics.sql
derived from: Secondary Transactions
  type: BicsLevel4SubIndustry
  type: Classifier
  type: AnachronousDerivation
  derived from: http://data.ga-group.nl/ics/bics/2014/14101217
  source accessed on: 2019-12-03T20:05:01Z
  source last accessed on: 2019-12-03T20:05:01Z
  definition: This industry subgroup includes companies that invest in a secondary transaction asset class of private equity financial sponsors. A secondary transaction investment consists of buying and selling of preexisting investor commitments to private equity and other alternative investment funds. Types of secondary transaction investments are the sale of a limited partnership interest and the sale of a direct interest.
  notation: 14101217
  valid from: 2014-08-08
  valid till: 2020-10-03
derived from: Secondary Transactions
  type: BicsLevel5Segment
  type: Classifier
  type: ContemporaryDerivation
  derived from: http://data.ga-group.nl/ics/bics/2020/1411101217
  derived from: http://data.ga-group.nl/ics/bics/2024/1411101217
  source accessed on: 2023-07-03T18:11:29Z
  source last accessed on: 2024-06-05T14:42:36Z
  definition: This segment includes companies that invest in a secondary transaction asset class of private equity financial sponsors. A secondary transaction investment consists of buying and selling of preexisting investor commitments to private equity and other alternative investment funds. Types of secondary transaction investments are the sale of a limited partnership interest and the sale of a direct interest.
  notation: 1411101217
  valid from: 2020-10-03
source accessed on: 2023-07-03T18:11:29Z
source last accessed on: 2024-06-05T14:42:36Z
definition: This segment includes companies that invest in a secondary transaction asset class of private equity financial sponsors. A secondary transaction investment consists of buying and selling of preexisting investor commitments to private equity and other alternative investment funds. Types of secondary transaction investments are the sale of a limited partnership interest and the sale of a direct interest.
notation: 1411101217
valid from: 2020-10-03

Venture Capital
type: BicsLevel5Segment
type: Classifier
type: NamedIndividual
is level5 segment of: Private Equity
created with: infer-bics.sql
derived from: Venture Capital
  type: BicsLevel4SubIndustry
  type: Classifier
  type: AnachronousDerivation
  derived from: http://data.ga-group.nl/ics/bics/2014/14101218
  source accessed on: 2019-12-03T20:05:01Z
  source last accessed on: 2019-12-03T20:05:01Z
  definition: This industry subgroup includes companies that provide venture capital investments. Such investments are provided to early-stage, high-potential, high-risk, growth startup companies.
  notation: 14101218
  valid from: 2014-08-08
  valid till: 2020-10-03
derived from: Venture Capital
  type: BicsLevel5Segment
  type: Classifier
  type: ContemporaryDerivation
  derived from: http://data.ga-group.nl/ics/bics/2020/1411101218
  derived from: http://data.ga-group.nl/ics/bics/2024/1411101218
  source accessed on: 2023-07-03T18:11:29Z
  source last accessed on: 2024-06-05T14:42:36Z
  definition: This segment includes companies that provide venture capital investments. Such investments are provided to early-stage, high-potential, high-risk, growth startup companies.
  notation: 1411101218
  valid from: 2020-10-03
source accessed on: 2023-07-03T18:11:29Z
source last accessed on: 2024-06-05T14:42:36Z
definition: This segment includes companies that provide venture capital investments. Such investments are provided to early-stage, high-potential, high-risk, growth startup companies.
notation: 1411101218
valid from: 2020-10-03

Private Equity
type: BicsLevel4SubIndustry
type: Classifier
type: NamedIndividual
replaces: Private Equity
created with: infer-bics.sql
derived from: Private Equity
  type: BicsLevel3Industry
  type: Classifier
  type: AnachronousDerivation
  derived from: http://data.ga-group.nl/ics/bics/2014/141012
  source accessed on: 2019-12-03T20:05:01Z
  source last accessed on: 2019-12-03T20:05:01Z
  definition: This industry includes companies that are a type of private equity investment firm, particularly those private equity firms that engage in leveraged buyout (LBO) transactions. Financial sponsors rarely manage a company directly and are most active on issues relating to a company's capital structure and balance sheet and strategic initiatives, such as mergers and acquisitions.
  notation: 141012
  valid from: 2014-08-08
  valid till: 2020-10-03
derived from: Private Equity
  type: BicsLevel4SubIndustry
  type: Classifier
  type: ContemporaryDerivation
  derived from: http://data.ga-group.nl/ics/bics/2020/14111012
  derived from: http://data.ga-group.nl/ics/bics/2024/14111012
  source accessed on: 2023-07-03T18:11:29Z
  source last accessed on: 2024-06-05T14:42:36Z
  definition: This industry subgroup includes investment firms investing in private companies. Such firms engage in leveraged buyout (LBO) transactions, private placements of securities, and ownership of private companies for investment purposes.
  notation: 14111012
  valid from: 2020-10-03
source accessed on: 2023-07-03T18:11:29Z
source last accessed on: 2024-06-05T14:42:36Z
definition: This industry subgroup includes investment firms investing in private companies. Such firms engage in leveraged buyout (LBO) transactions, private placements of securities, and ownership of private companies for investment purposes.
notation: 14111012
valid from: 2020-10-03

Financial Plan & Invst Advisory
type: BicsLevel5Segment
type: Classifier
type: NamedIndividual
is level5 segment of: Wealth Management
created with: infer-bics.sql
derived from: Financial Plan & Invst Advisory
  type: BicsLevel4SubIndustry
  type: Classifier
  type: AnachronousDerivation
  derived from: http://data.ga-group.nl/ics/bics/2014/14101310
  source accessed on: 2019-12-03T20:05:01Z
  source last accessed on: 2019-12-03T20:05:01Z
  definition: This industry subgroup includes companies that provide financial planning and investment advice to clients on a fee basis but do not have authority to execute trades. Financial planning involves creating and preserving personal wealth, retirement planning, and tax- and estate-planning services.
  notation: 14101310
  valid from: 2014-08-08
  valid till: 2020-10-03
derived from: Financial Plan & Invst Advisory
  type: BicsLevel5Segment
  type: Classifier
  type: ContemporaryDerivation
  derived from: http://data.ga-group.nl/ics/bics/2020/1411101310
  derived from: http://data.ga-group.nl/ics/bics/2024/1411101310
  source accessed on: 2023-07-03T18:11:29Z
  source last accessed on: 2024-06-05T14:42:36Z
  definition: This segment includes companies that provide financial planning and investment advice to clients on a fee basis but do not have authority to execute trades. Financial planning involves creating and preserving personal wealth, retirement planning, and tax- and estate-planning services.
  notation: 1411101310
  valid from: 2020-10-03
source accessed on: 2023-07-03T18:11:29Z
source last accessed on: 2024-06-05T14:42:36Z
definition: This segment includes companies that provide financial planning and investment advice to clients on a fee basis but do not have authority to execute trades. Financial planning involves creating and preserving personal wealth, retirement planning, and tax- and estate-planning services.
notation: 1411101310
valid from: 2020-10-03

Private Banking
type: BicsLevel5Segment
type: Classifier
type: NamedIndividual
is level5 segment of: Wealth Management
created with: infer-bics.sql
derived from: Private Banking
  type: BicsLevel4SubIndustry
  type: Classifier
  type: AnachronousDerivation
  derived from: http://data.ga-group.nl/ics/bics/2014/14101311
  source accessed on: 2019-12-03T20:05:01Z
  source last accessed on: 2019-12-03T20:05:01Z
  definition: This industry subgroup includes commercial banks that provide personalized wealth management services to high net worth individuals.
  notation: 14101311
  valid from: 2014-08-08
  valid till: 2020-10-03
derived from: Private Banking
  type: BicsLevel5Segment
  type: Classifier
  type: ContemporaryDerivation
  derived from: http://data.ga-group.nl/ics/bics/2020/1411101311
  derived from: http://data.ga-group.nl/ics/bics/2024/1411101311
  source accessed on: 2023-07-03T18:11:29Z
  source last accessed on: 2024-06-05T14:42:36Z
  definition: This segment includes companies that provide personalized banking services to high-net-worth individuals.
  notation: 1411101311
  valid from: 2020-10-03
source accessed on: 2023-07-03T18:11:29Z
source last accessed on: 2024-06-05T14:42:36Z
definition: This segment includes companies that provide personalized banking services to high-net-worth individuals.
notation: 1411101311
valid from: 2020-10-03

Retail Securities Brokerage
type: BicsLevel5Segment
type: Classifier
type: NamedIndividual
is level5 segment of: Wealth Management
created with: infer-bics.sql
derived from: Retail Securities Brokerage
  type: BicsLevel4SubIndustry
  type: Classifier
  type: AnachronousDerivation
  derived from: http://data.ga-group.nl/ics/bics/2014/14101312
  source accessed on: 2019-12-03T20:05:01Z
  source last accessed on: 2019-12-03T20:05:01Z
  definition: This industry subgroup includes companies that provide securities brokerage services to retail investors. Retail investors are individuals who buy or sell securities for their personal account.
  notation: 14101312
  valid from: 2014-08-08
  valid till: 2020-10-03
derived from: Retail Securities Brokerage
  type: BicsLevel5Segment
  type: Classifier
  type: ContemporaryDerivation
  derived from: http://data.ga-group.nl/ics/bics/2020/1411101312
  derived from: http://data.ga-group.nl/ics/bics/2024/1411101312
  source accessed on: 2023-07-03T18:11:29Z
  source last accessed on: 2024-06-05T14:42:36Z
  definition: This segment includes companies that provide securities brokerage services to retail investors.
  notation: 1411101312
  valid from: 2020-10-03
source accessed on: 2023-07-03T18:11:29Z
source last accessed on: 2024-06-05T14:42:36Z
definition: This segment includes companies that provide securities brokerage services to retail investors.
notation: 1411101312
valid from: 2020-10-03

Wealth Management
type: BicsLevel4SubIndustry
type: Classifier
type: NamedIndividual
replaces: Wealth Management
created with: infer-bics.sql
derived from: Wealth Management
  type: BicsLevel3Industry
  type: Classifier
  type: AnachronousDerivation
  derived from: http://data.ga-group.nl/ics/bics/2014/141013
  source accessed on: 2019-12-03T20:05:01Z
  source last accessed on: 2019-12-03T20:05:01Z
  definition: This industry includes companies that manage investment portfolios, such as private banking, trust, retail securities brokerage, and financial planning and investment advisory services.
  notation: 141013
  valid from: 2014-08-08
  valid till: 2020-10-03
derived from: Wealth Management
  type: BicsLevel4SubIndustry
  type: Classifier
  type: ContemporaryDerivation
  derived from: http://data.ga-group.nl/ics/bics/2020/14111013
  derived from: http://data.ga-group.nl/ics/bics/2024/14111013
  source accessed on: 2023-07-03T18:11:29Z
  source last accessed on: 2024-06-05T14:42:36Z
  definition: This industry subgroup includes companies that specialize in managing the wealth of affluent and high-net-worth individuals. Typically, these companies behave as a one-stop shop and offer other related financial services for the convenience of their clients.
  notation: 14111013
  valid from: 2020-10-03
source accessed on: 2023-07-03T18:11:29Z
source last accessed on: 2024-06-05T14:42:36Z
definition: This industry subgroup includes companies that specialize in managing the wealth of affluent and high-net-worth individuals. Typically, these companies behave as a one-stop shop and offer other related financial services for the convenience of their clients.
notation: 14111013
valid from: 2020-10-03

Asset Management
type: BicsLevel3Industry
type: Classifier
type: NamedIndividual
is industry of: Financial Services
is replaced by: Diversified Banks
replaces: Banking
created with: infer-bics.sql
derived from: Asset Management
  type: BicsLevel2IndustryGroup
  type: Classifier
  type: AnachronousDerivation
  derived from: http://data.ga-group.nl/ics/bics/2014/1410
  source accessed on: 2019-12-03T20:05:01Z
  source last accessed on: 2019-12-03T20:05:01Z
  definition: This industry group includes companies that manage investment portfolios, such as investment companies, investment management companies, private equity firms and wealth management companies.
  notation: 1410
  valid from: 2014-08-08
  valid till: 2020-10-03
derived from: Diversified Banks
  type: BicsLevel3Industry
  type: Classifier
  type: ContemporaryDerivation
  derived from: http://data.ga-group.nl/ics/bics/2014/141110
  source accessed on: 2019-12-03T20:05:01Z
  source last accessed on: 2019-12-03T20:05:01Z
  definition: This industry includes companies that have multinational bank operations with significant investment banking operations.
  notation: 141110
  valid from: 2014-08-08
  valid till: 2020-10-03
derived from: Asset Management
  type: BicsLevel3Industry
  type: Classifier
  type: ContemporaryDerivation
  derived from: http://data.ga-group.nl/ics/bics/2020/141110
  derived from: http://data.ga-group.nl/ics/bics/2024/141110
  source accessed on: 2023-07-03T18:11:29Z
  source last accessed on: 2024-06-05T14:42:36Z
  definition: This industry includes companies that manage investments for others.
  notation: 141110
  valid from: 2020-10-03
source accessed on: 2019-12-03T20:05:01Z
source last accessed on: 2024-06-05T14:42:36Z
definition: This industry includes companies that manage investments for others.
notation: 141110
valid from: 2014-08-08

General Equip Finance & Leasing
type: BicsLevel6Segment
type: Classifier
type: NamedIndividual
is level6 segment of: Comml Equip Finance & Leasing
replaces: Life Insurance Premiums
created with: infer-bics.sql
derived from: General Equip Finance & Leasing
  type: BicsLevel5Segment
  type: Classifier
  type: AnachronousDerivation
  derived from: http://data.ga-group.nl/ics/bics/2014/1412101010
  source accessed on: 2019-12-03T20:05:01Z
  source last accessed on: 2019-12-03T20:05:01Z
  definition: This segment includes companies that finance or lease general equipment. In such a situation, a contractual agreement is established and usually reached through a dealer.
  notation: 1412101010
  valid from: 2014-08-08
  valid till: 2020-10-03
derived from: General Equip Finance & Leasing
  type: BicsLevel6Segment
  type: Classifier
  type: ContemporaryDerivation
  derived from: http://data.ga-group.nl/ics/bics/2020/141111101010
  derived from: http://data.ga-group.nl/ics/bics/2024/141111101010
  source accessed on: 2023-07-03T18:11:29Z
  source last accessed on: 2024-06-05T14:42:36Z
  definition: This segment includes companies that finance or lease generic equipment with broad applications across industries.
  notation: 141111101010
  valid from: 2020-10-03
source accessed on: 2023-07-03T18:11:29Z
source last accessed on: 2024-06-05T14:42:36Z
definition: This segment includes companies that finance or lease generic equipment with broad applications across industries.
notation: 141111101010
valid from: 2020-10-03

Ind Equip Finance & Leasing
type: BicsLevel6Segment
type: Classifier
type: NamedIndividual
is level6 segment of: Comml Equip Finance & Leasing
replaces: Life Insurance Non-Premium
created with: infer-bics.sql
derived from: Ind Equip Finance & Leasing
  type: BicsLevel5Segment
  type: Classifier
  type: AnachronousDerivation
  derived from: http://data.ga-group.nl/ics/bics/2014/1412101011
  source accessed on: 2019-12-03T20:05:01Z
  source last accessed on: 2019-12-03T20:05:01Z
  definition: This segment includes companies that finance or lease industrial equipment. In such a situation, a contractual agreement is established and usually reached through a dealer.
  notation: 1412101011
  valid from: 2014-08-08
  valid till: 2020-10-03
derived from: Ind Equip Finance & Leasing
  type: BicsLevel6Segment
  type: Classifier
  type: ContemporaryDerivation
  derived from: http://data.ga-group.nl/ics/bics/2020/141111101011
  derived from: http://data.ga-group.nl/ics/bics/2024/141111101011
  source accessed on: 2023-07-03T18:11:29Z
  source last accessed on: 2024-06-05T14:42:36Z
  definition: This segment includes companies that finance or lease electrical equipment or other industrial products not elsewhere classified.
  notation: 141111101011
  valid from: 2020-10-03
source accessed on: 2023-07-03T18:11:29Z
source last accessed on: 2024-06-05T14:42:36Z
definition: This segment includes companies that finance or lease electrical equipment or other industrial products not elsewhere classified.
notation: 141111101011
valid from: 2020-10-03

Machinery Finance & Leasing
type: BicsLevel6Segment
type: Classifier
type: NamedIndividual
is level6 segment of: Comml Equip Finance & Leasing
replaces: Machinery Finance & Leasing
created with: infer-bics.sql
derived from: Machinery Finance & Leasing
  type: BicsLevel5Segment
  type: Classifier
  type: AnachronousDerivation
  derived from: http://data.ga-group.nl/ics/bics/2014/1412101012
  source accessed on: 2019-12-03T20:05:01Z
  source last accessed on: 2019-12-03T20:05:01Z
  definition: This segment includes companies that finance or lease machinery not elsewhere classified. In such a situation, a contractual agreement is established and usually reached through a dealer.
  notation: 1412101012
  valid from: 2014-08-08
  valid till: 2020-10-03
derived from: Machinery Finance & Leasing
  type: BicsLevel6Segment
  type: Classifier
  type: ContemporaryDerivation
  derived from: http://data.ga-group.nl/ics/bics/2020/141111101012
  derived from: http://data.ga-group.nl/ics/bics/2024/141111101012
  source accessed on: 2023-07-03T18:11:29Z
  source last accessed on: 2024-06-05T14:42:36Z
  definition: This segment includes companies that finance or lease machinery, including machines used for construction, farming, and mining.
  notation: 141111101012
  valid from: 2020-10-03
source accessed on: 2023-07-03T18:11:29Z
source last accessed on: 2024-06-05T14:42:36Z
definition: This segment includes companies that finance or lease machinery, including machines used for construction, farming, and mining.
notation: 141111101012
valid from: 2020-10-03

Comml Equip Finance & Leasing
type: BicsLevel5Segment
type: Classifier
type: NamedIndividual
is level5 segment of: Commercial Finance
created with: infer-bics.sql
derived from: Comml Equip Finance & Leasing
  type: BicsLevel4SubIndustry
  type: Classifier
  type: AnachronousDerivation
  derived from: http://data.ga-group.nl/ics/bics/2014/14121010
  source accessed on: 2019-12-03T20:05:01Z
  source last accessed on: 2019-12-03T20:05:01Z
  definition: This industry subgroup includes companies that finance or lease light commercial and machinery and equipment, such as office and computer equipment.
  notation: 14121010
  valid from: 2014-08-08
  valid till: 2020-10-03
derived from: Comml Equip Finance & Leasing
  type: BicsLevel5Segment
  type: Classifier
  type: ContemporaryDerivation
  derived from: http://data.ga-group.nl/ics/bics/2020/1411111010
  derived from: http://data.ga-group.nl/ics/bics/2024/1411111010
  source accessed on: 2023-07-03T18:11:29Z
  source last accessed on: 2024-06-05T14:42:36Z
  definition: This segment includes companies that finance or lease equipment used by commercial or industrial users. In such a situation, a contractual agreement is established and usually reached through a dealer.
  notation: 1411111010
  valid from: 2020-10-03
source accessed on: 2023-07-03T18:11:29Z
source last accessed on: 2024-06-05T14:42:36Z
definition: This segment includes companies that finance or lease equipment used by commercial or industrial users. In such a situation, a contractual agreement is established and usually reached through a dealer.
notation: 1411111010
valid from: 2020-10-03

Aircraft Finance & Leasing
type: BicsLevel6Segment
type: Classifier
type: NamedIndividual
is level6 segment of: Transp Equip Finance & Leasing
replaces: P&C Insurance Premiums
created with: infer-bics.sql
derived from: Aircraft Finance & Leasing
  type: BicsLevel5Segment
  type: Classifier
  type: AnachronousDerivation
  derived from: http://data.ga-group.nl/ics/bics/2014/1412101110
  source accessed on: 2019-12-03T20:05:01Z
  source last accessed on: 2019-12-03T20:05:01Z
  definition: This segment includes companies that finance or lease aircraft.
  notation: 1412101110
  valid from: 2014-08-08
  valid till: 2020-10-03
derived from: Aircraft Finance & Leasing
  type: BicsLevel6Segment
  type: Classifier
  type: ContemporaryDerivation
  derived from: http://data.ga-group.nl/ics/bics/2020/141111101110
  derived from: http://data.ga-group.nl/ics/bics/2024/141111101110
  source accessed on: 2023-07-03T18:11:29Z
  source last accessed on: 2024-06-05T14:42:36Z
  definition: This segment includes companies that finance or lease aircrafts.
  notation: 141111101110
  valid from: 2020-10-03
source accessed on: 2023-07-03T18:11:29Z
source last accessed on: 2024-06-05T14:42:36Z
definition: This segment includes companies that finance or lease aircrafts.
notation: 141111101110
valid from: 2020-10-03

Comml Veh Fin & Leasing - Electric
type: BicsLevel7Segment
type: Classifier
type: NamedIndividual
is level7 segment of: Commercial Veh Fin & Leasing
created with: infer-bics.sql
derived from: Comml Veh Fin & Leasing - Electric
  type: BicsLevel7Segment
  type: Classifier
  type: ContemporaryDerivation
  derived from: http://data.ga-group.nl/ics/bics/2020/14111110111110
  derived from: http://data.ga-group.nl/ics/bics/2024/14111110111110
  source accessed on: 2023-07-03T18:11:29Z
  source last accessed on: 2024-06-05T14:42:36Z
  definition: This segment includes companies that finance or lease electric commercial vehicles.
  notation: 14111110111110
  valid from: 2020-10-03
source accessed on: 2023-07-03T18:11:29Z
source last accessed on: 2024-06-05T14:42:36Z
definition: This segment includes companies that finance or lease electric commercial vehicles.
notation: 14111110111110
valid from: 2020-10-03

Comml Veh Fin & Leasing - Fossil Fuels
type: BicsLevel7Segment
type: Classifier
type: NamedIndividual
is level7 segment of: Commercial Veh Fin & Leasing
created with: infer-bics.sql
derived from: Comml Veh Fin & Leasing - Fossil Fuels
  type: BicsLevel7Segment
  type: Classifier
  type: ContemporaryDerivation
  derived from: http://data.ga-group.nl/ics/bics/2020/14111110111111
  derived from: http://data.ga-group.nl/ics/bics/2024/14111110111111
  source accessed on: 2023-07-03T18:11:29Z
  source last accessed on: 2024-06-05T14:42:36Z
  definition: This segment includes companies that finance or lease fossil fuel commercial vehicles.
  notation: 14111110111111
  valid from: 2020-10-03
source accessed on: 2023-07-03T18:11:29Z
source last accessed on: 2024-06-05T14:42:36Z
definition: This segment includes companies that finance or lease fossil fuel commercial vehicles.
notation: 14111110111111
valid from: 2020-10-03

Commercial Veh Fin & Leasing
type: BicsLevel6Segment
type: Classifier
type: NamedIndividual
is level6 segment of: Transp Equip Finance & Leasing
replaces: P&C Insurance Non-Premium
created with: infer-bics.sql
derived from: Commercial Veh Fin & Leasing
  type: BicsLevel5Segment
  type: Classifier
  type: AnachronousDerivation
  derived from: http://data.ga-group.nl/ics/bics/2014/1412101111
  source accessed on: 2019-12-03T20:05:01Z
  source last accessed on: 2019-12-03T20:05:01Z
  definition: This segment includes companies that finance or lease commercial vehicles. In such a situation, a contractual agreement is established and usually reached through a dealer.
  notation: 1412101111
  valid from: 2014-08-08
  valid till: 2020-10-03
derived from: Commercial Veh Fin & Leasing
  type: BicsLevel6Segment
  type: Classifier
  type: ContemporaryDerivation
  derived from: http://data.ga-group.nl/ics/bics/2020/141111101111
  derived from: http://data.ga-group.nl/ics/bics/2024/141111101111
  source accessed on: 2023-07-03T18:11:29Z
  source last accessed on: 2024-06-05T14:42:36Z
  definition: This segment includes companies that finance or lease commercial vehicles. In such a situation, a contractual agreement is established and usually reached through a dealer.
  notation: 141111101111
  valid from: 2020-10-03
source accessed on: 2023-07-03T18:11:29Z
source last accessed on: 2024-06-05T14:42:36Z
definition: This segment includes companies that finance or lease commercial vehicles. In such a situation, a contractual agreement is established and usually reached through a dealer.
notation: 141111101111
valid from: 2020-10-03

Railcar Fin & Leasing - Electric
type: BicsLevel7Segment
type: Classifier
type: NamedIndividual
is level7 segment of: Railroad Car Finance & Leasing
created with: infer-bics.sql
derived from: Railcar Fin & Leasing - Electric
  type: BicsLevel7Segment
  type: Classifier
  type: ContemporaryDerivation
  derived from: http://data.ga-group.nl/ics/bics/2020/14111110111210
  derived from: http://data.ga-group.nl/ics/bics/2024/14111110111210
  source accessed on: 2023-07-03T18:11:29Z
  source last accessed on: 2024-06-05T14:42:36Z
  definition: This segment includes companies that finance or lease electric railroad cars or locomotives. Electric as defined here excludes hybrids that make partial use of fossil fuels.
  notation: 14111110111210
  valid from: 2020-10-03
source accessed on: 2023-07-03T18:11:29Z
source last accessed on: 2024-06-05T14:42:36Z
definition: This segment includes companies that finance or lease electric railroad cars or locomotives. Electric as defined here excludes hybrids that make partial use of fossil fuels.
notation: 14111110111210
valid from: 2020-10-03

Railcar Fin & Leasing - Fossil Fuels
type: BicsLevel7Segment
type: Classifier
type: NamedIndividual
is level7 segment of: Railroad Car Finance & Leasing
created with: infer-bics.sql
derived from: Railcar Fin & Leasing - Fossil Fuels
  type: BicsLevel7Segment
  type: Classifier
  type: ContemporaryDerivation
  derived from: http://data.ga-group.nl/ics/bics/2020/14111110111211
  derived from: http://data.ga-group.nl/ics/bics/2024/14111110111211
  source accessed on: 2023-07-03T18:11:29Z
  source last accessed on: 2024-06-05T14:42:36Z
  definition: This segment includes companies that finance or lease fossil fuel railroad cars or locomotives.
  notation: 14111110111211
  valid from: 2020-10-03
source accessed on: 2023-07-03T18:11:29Z
source last accessed on: 2024-06-05T14:42:36Z
definition: This segment includes companies that finance or lease fossil fuel railroad cars or locomotives.
notation: 14111110111211
valid from: 2020-10-03

Railroad Car Finance & Leasing
type: BicsLevel6Segment
type: Classifier
type: NamedIndividual
is level6 segment of: Transp Equip Finance & Leasing
replaces: Railroad Car Finance & Leasing
created with: infer-bics.sql
derived from: Railroad Car Finance & Leasing
  type: BicsLevel5Segment
  type: Classifier
  type: AnachronousDerivation
  derived from: http://data.ga-group.nl/ics/bics/2014/1412101112
  source accessed on: 2019-12-03T20:05:01Z
  source last accessed on: 2019-12-03T20:05:01Z
  definition: This segment includes companies that finance or lease railroad cars.
  notation: 1412101112
  valid from: 2014-08-08
  valid till: 2020-10-03
derived from: Railroad Car Finance & Leasing
  type: BicsLevel6Segment
  type: Classifier
  type: ContemporaryDerivation
  derived from: http://data.ga-group.nl/ics/bics/2020/141111101112
  derived from: http://data.ga-group.nl/ics/bics/2024/141111101112
  source accessed on: 2023-07-03T18:11:29Z
  source last accessed on: 2024-06-05T14:42:36Z
  definition: This segment includes companies that finance or lease railroad cars or locomotives.
  notation: 141111101112
  valid from: 2020-10-03
source accessed on: 2023-07-03T18:11:29Z
source last accessed on: 2024-06-05T14:42:36Z
definition: This segment includes companies that finance or lease railroad cars or locomotives.
notation: 141111101112
valid from: 2020-10-03

Ship & Boat Finance & Leasing
type: BicsLevel6Segment
type: Classifier
type: NamedIndividual
is level6 segment of: Transp Equip Finance & Leasing
replaces: Ship & Boat Finance & Leasing
created with: infer-bics.sql
derived from: Ship & Boat Finance & Leasing
  type: BicsLevel5Segment
  type: Classifier
  type: AnachronousDerivation
  derived from: http://data.ga-group.nl/ics/bics/2014/1412101113
  source accessed on: 2019-12-03T20:05:01Z
  source last accessed on: 2019-12-03T20:05:01Z
  definition: This segment includes companies that rent or lease boats and ships.
  notation: 1412101113
  valid from: 2014-08-08
  valid till: 2020-10-03
derived from: Ship & Boat Finance & Leasing
  type: BicsLevel6Segment
  type: Classifier
  type: ContemporaryDerivation
  derived from: http://data.ga-group.nl/ics/bics/2020/141111101113
  derived from: http://data.ga-group.nl/ics/bics/2024/141111101113
  source accessed on: 2023-07-03T18:11:29Z
  source last accessed on: 2024-06-05T14:42:36Z
  definition: This segment includes companies that finance or lease boats and ships.
  notation: 141111101113
  valid from: 2020-10-03
source accessed on: 2023-07-03T18:11:29Z
source last accessed on: 2024-06-05T14:42:36Z
definition: This segment includes companies that finance or lease boats and ships.
notation: 141111101113
valid from: 2020-10-03

Transp Equip Finance & Leasing
type: BicsLevel5Segment
type: Classifier
type: NamedIndividual
is level5 segment of: Commercial Finance
created with: infer-bics.sql
derived from: Transp Equip Finance & Leasing
  type: BicsLevel4SubIndustry
  type: Classifier
  type: AnachronousDerivation
  derived from: http://data.ga-group.nl/ics/bics/2014/14121011
  source accessed on: 2019-12-03T20:05:01Z
  source last accessed on: 2019-12-03T20:05:01Z
  definition: This industry subgroup includes companies that provide loans for purchase or contracts permitting the use of non-roadway transportation like aircraft, railroad cars and ocean vessels.
  notation: 14121011
  valid from: 2014-08-08
  valid till: 2020-10-03
derived from: Transp Equip Finance & Leasing
  type: BicsLevel5Segment
  type: Classifier
  type: ContemporaryDerivation
  derived from: http://data.ga-group.nl/ics/bics/2020/1411111011
  derived from: http://data.ga-group.nl/ics/bics/2024/1411111011
  source accessed on: 2023-07-03T18:11:29Z
  source last accessed on: 2024-06-05T14:42:36Z
  definition: This segment includes companies that provide loans for purchase or contracts permitting the use of transportation such as aircraft, railroad cars, and ocean vessels.
  notation: 1411111011
  valid from: 2020-10-03
source accessed on: 2023-07-03T18:11:29Z
source last accessed on: 2024-06-05T14:42:36Z
definition: This segment includes companies that provide loans for purchase or contracts permitting the use of transportation such as aircraft, railroad cars, and ocean vessels.
notation: 1411111011
valid from: 2020-10-03

Commercial Finance
type: BicsLevel4SubIndustry
type: Classifier
type: NamedIndividual
replaces: Insurance
created with: infer-bics.sql
derived from: Corporate Banking
  type: BicsLevel4SubIndustry
  type: Classifier
  type: ContemporaryDerivation
  derived from: http://data.ga-group.nl/ics/bics/2014/14111110
  source accessed on: 2019-12-03T20:05:01Z
  source last accessed on: 2019-12-03T20:05:01Z
  definition: This industry subgroup includes companies that accept deposits and make loans to corporations and large businesses.
  notation: 14111110
  valid from: 2014-08-08
  valid till: 2020-10-03
derived from: Commercial Finance
  type: BicsLevel3Industry
  type: Classifier
  type: AnachronousDerivation
  derived from: http://data.ga-group.nl/ics/bics/2014/141210
  source accessed on: 2019-12-03T20:05:01Z
  source last accessed on: 2019-12-03T20:05:01Z
  definition: This industry includes companies that provide loans and other financing to businesses. This industry includes commercial and industrial leasing, and transportation equipment leasing.
  notation: 141210
  valid from: 2014-08-08
  valid till: 2020-10-03
derived from: Commercial Finance
  type: BicsLevel4SubIndustry
  type: Classifier
  type: ContemporaryDerivation
  derived from: http://data.ga-group.nl/ics/bics/2020/14111110
  derived from: http://data.ga-group.nl/ics/bics/2024/14111110
  source accessed on: 2023-07-03T18:11:29Z
  source last accessed on: 2024-06-05T14:42:36Z
  definition: This industry subgroup includes companies that provide loans, factoring, and other financing to businesses. Includes the leasing of commercial, industrial, and transportation equipment.
  notation: 14111110
  valid from: 2020-10-03
source accessed on: 2019-12-03T20:05:01Z
source last accessed on: 2024-06-05T14:42:36Z
definition: This industry subgroup includes companies that provide loans, factoring, and other financing to businesses. Includes the leasing of commercial, industrial, and transportation equipment.
notation: 14111110
valid from: 2014-08-08

Auto Finance - Electric
type: BicsLevel6Segment
type: Classifier
type: NamedIndividual
is level6 segment of: Auto Finance
created with: infer-bics.sql
derived from: Auto Finance - Electric
  type: BicsLevel6Segment
  type: Classifier
  type: ContemporaryDerivation
  derived from: http://data.ga-group.nl/ics/bics/2020/141111111010
  derived from: http://data.ga-group.nl/ics/bics/2024/141111111010
  source accessed on: 2023-07-03T18:11:29Z
  source last accessed on: 2024-06-05T14:42:36Z
  definition: This segment includes companies that originate, service and/or collect auto loans for electric vehicles.
  notation: 141111111010
  valid from: 2020-10-03
source accessed on: 2023-07-03T18:11:29Z
source last accessed on: 2024-06-05T14:42:36Z
definition: This segment includes companies that originate, service and/or collect auto loans for electric vehicles.
notation: 141111111010
valid from: 2020-10-03

Auto Finance - Fossil Fuels
type: BicsLevel6Segment
type: Classifier
type: NamedIndividual
is level6 segment of: Auto Finance
created with: infer-bics.sql
derived from: Auto Finance - Fossil Fuels
  type: BicsLevel6Segment
  type: Classifier
  type: ContemporaryDerivation
  derived from: http://data.ga-group.nl/ics/bics/2020/141111111011
  derived from: http://data.ga-group.nl/ics/bics/2024/141111111011
  source accessed on: 2023-07-03T18:11:29Z
  source last accessed on: 2024-06-05T14:42:36Z
  definition: This segment includes companies that originate, service, and/or collect auto loans for fossil fuel vehicles.
  notation: 141111111011
  valid from: 2020-10-03
source accessed on: 2023-07-03T18:11:29Z
source last accessed on: 2024-06-05T14:42:36Z
definition: This segment includes companies that originate, service, and/or collect auto loans for fossil fuel vehicles.
notation: 141111111011
valid from: 2020-10-03

Auto Finance
type: BicsLevel5Segment
type: Classifier
type: NamedIndividual
is level5 segment of: Consumer Finance
created with: infer-bics.sql
derived from: Auto Finance
  type: BicsLevel4SubIndustry
  type: Classifier
  type: AnachronousDerivation
  derived from: http://data.ga-group.nl/ics/bics/2014/14121110
  source accessed on: 2019-12-03T20:05:01Z
  source last accessed on: 2019-12-03T20:05:01Z
  definition: This industry subgroup includes companies that originate, service and/or collect auto loans to consumers.
  notation: 14121110
  valid from: 2014-08-08
  valid till: 2020-10-03
derived from: Auto Finance
  type: BicsLevel5Segment
  type: Classifier
  type: ContemporaryDerivation
  derived from: http://data.ga-group.nl/ics/bics/2020/1411111110
  derived from: http://data.ga-group.nl/ics/bics/2024/1411111110
  source accessed on: 2023-07-03T18:11:29Z
  source last accessed on: 2024-06-05T14:42:36Z
  definition: This segment includes companies that originate, service, and/or collect auto loans to consumers.
  notation: 1411111110
  valid from: 2020-10-03
source accessed on: 2023-07-03T18:11:29Z
source last accessed on: 2024-06-05T14:42:36Z
definition: This segment includes companies that originate, service, and/or collect auto loans to consumers.
notation: 1411111110
valid from: 2020-10-03

Consumer Microlending
type: BicsLevel5Segment
type: Classifier
type: NamedIndividual
is level5 segment of: Consumer Finance
created with: infer-bics.sql
derived from: Consumer Microlending
  type: BicsLevel4SubIndustry
  type: Classifier
  type: AnachronousDerivation
  derived from: http://data.ga-group.nl/ics/bics/2014/14121111
  source accessed on: 2019-12-03T20:05:01Z
  source last accessed on: 2019-12-03T20:05:01Z
  definition: This industry subgroup includes companies that provide small amount lending to consumers. Such lending includes payday loans and pawn shop loans. These loans often are made to consumers who have limited access to credit, are short term in duration, have fixed fees and have easy and fast processing.
  notation: 14121111
  valid from: 2014-08-08
  valid till: 2020-10-03
derived from: Consumer Microlending
  type: BicsLevel5Segment
  type: Classifier
  type: ContemporaryDerivation
  derived from: http://data.ga-group.nl/ics/bics/2020/1411111111
  derived from: http://data.ga-group.nl/ics/bics/2024/1411111111
  source accessed on: 2023-07-03T18:11:29Z
  source last accessed on: 2024-06-05T14:42:36Z
  definition: This segment includes companies that provide small amount lending to consumers, including payday loans and pawn shop loans. These loans often are made to consumers who have limited access to credit, are short term in duration, have fixed fees and have easy and fast processing.
  notation: 1411111111
  valid from: 2020-10-03
source accessed on: 2023-07-03T18:11:29Z
source last accessed on: 2024-06-05T14:42:36Z
definition: This segment includes companies that provide small amount lending to consumers, including payday loans and pawn shop loans. These loans often are made to consumers who have limited access to credit, are short term in duration, have fixed fees and have easy and fast processing.
notation: 1411111111
valid from: 2020-10-03

Credit Card Lending
type: BicsLevel5Segment
type: Classifier
type: NamedIndividual
is level5 segment of: Consumer Finance
replaces: Credit Card Issuing
created with: infer-bics.sql
derived from: Credit Card Issuing
  type: BicsLevel5Segment
  type: Classifier
  type: AnachronousDerivation
  derived from: http://data.ga-group.nl/ics/bics/2014/1412111210
  source accessed on: 2019-12-03T20:05:01Z
  source last accessed on: 2019-12-03T20:05:01Z
  definition: This segment includes companies that issue credit cards.
  notation: 1412111210
  valid from: 2014-08-08
  valid till: 2020-10-03
derived from: Credit Card Lending
  type: BicsLevel5Segment
  type: Classifier
  type: ContemporaryDerivation
  derived from: http://data.ga-group.nl/ics/bics/2020/1411111112
  derived from: http://data.ga-group.nl/ics/bics/2024/1411111112
  source accessed on: 2023-07-03T18:11:29Z
  source last accessed on: 2024-06-05T14:42:36Z
  definition: This segment includes companies that issue credit cards.
  notation: 1411111112
  valid from: 2020-10-03
source accessed on: 2023-07-03T18:11:29Z
source last accessed on: 2024-06-05T14:42:36Z
definition: This segment includes companies that issue credit cards.
notation: 1411111112
valid from: 2020-10-03

Student Lending
type: BicsLevel5Segment
type: Classifier
type: NamedIndividual
is level5 segment of: Consumer Finance
created with: infer-bics.sql
derived from: Student Lending
  type: BicsLevel4SubIndustry
  type: Classifier
  type: AnachronousDerivation
  derived from: http://data.ga-group.nl/ics/bics/2014/14121113
  source accessed on: 2019-12-03T20:05:01Z
  source last accessed on: 2019-12-03T20:05:01Z
  definition: This industry subgroup includes companies that originate, service and/or collect student loans to consumers for educational purposes.
  notation: 14121113
  valid from: 2014-08-08
  valid till: 2020-10-03
derived from: Student Lending
  type: BicsLevel5Segment
  type: Classifier
  type: ContemporaryDerivation
  derived from: http://data.ga-group.nl/ics/bics/2020/1411111113
  derived from: http://data.ga-group.nl/ics/bics/2024/1411111113
  source accessed on: 2023-07-03T18:11:29Z
  source last accessed on: 2024-06-05T14:42:36Z
  definition: This segment includes companies that originate, service, and/or collect student loans for educational purposes.
  notation: 1411111113
  valid from: 2020-10-03
source accessed on: 2023-07-03T18:11:29Z
source last accessed on: 2024-06-05T14:42:36Z
definition: This segment includes companies that originate, service, and/or collect student loans for educational purposes.
notation: 1411111113
valid from: 2020-10-03

Consumer Finance
type: BicsLevel4SubIndustry
type: Classifier
type: NamedIndividual
replaces: Consumer Finance
created with: infer-bics.sql
derived from: Retail Banking
  type: BicsLevel4SubIndustry
  type: Classifier
  type: ContemporaryDerivation
  derived from: http://data.ga-group.nl/ics/bics/2014/14111111
  source accessed on: 2019-12-03T20:05:01Z
  source last accessed on: 2019-12-03T20:05:01Z
  definition: This industry subgroup includes companies that accept deposits and make loans to retail (individual) customers.
  notation: 14111111
  valid from: 2014-08-08
  valid till: 2020-10-03
derived from: Consumer Finance
  type: BicsLevel3Industry
  type: Classifier
  type: AnachronousDerivation
  derived from: http://data.ga-group.nl/ics/bics/2014/141211
  source accessed on: 2019-12-03T20:05:01Z
  source last accessed on: 2019-12-03T20:05:01Z
  definition: This industry includes companies that provide loans to consumers. Consumer loans include auto loans, consumer microlending, credit and debit, and student loans.
  notation: 141211
  valid from: 2014-08-08
  valid till: 2020-10-03
derived from: Consumer Finance
  type: BicsLevel4SubIndustry
  type: Classifier
  type: ContemporaryDerivation
  derived from: http://data.ga-group.nl/ics/bics/2020/14111111
  derived from: http://data.ga-group.nl/ics/bics/2024/14111111
  source accessed on: 2023-07-03T18:11:29Z
  source last accessed on: 2024-06-05T14:42:36Z
  definition: This industry subgroup includes companies that provide loans to consumers, including auto loans, consumer microlending, credit and debit, and student loans.
  notation: 14111111
  valid from: 2020-10-03
source accessed on: 2019-12-03T20:05:01Z
source last accessed on: 2024-06-05T14:42:36Z
definition: This industry subgroup includes companies that provide loans to consumers, including auto loans, consumer microlending, credit and debit, and student loans.
notation: 14111111
valid from: 2014-08-08

Mortgage Lenders
type: BicsLevel5Segment
type: Classifier
type: NamedIndividual
is level5 segment of: Mortgage Finance
created with: infer-bics.sql
derived from: Mortgage Lenders
  type: BicsLevel4SubIndustry
  type: Classifier
  type: AnachronousDerivation
  derived from: http://data.ga-group.nl/ics/bics/2014/14121210
  source accessed on: 2019-12-03T20:05:01Z
  source last accessed on: 2019-12-03T20:05:01Z
  definition: This industry subgroup includes companies that provide home financing services, such as mortgages and home equity loans.
  notation: 14121210
  valid from: 2014-08-08
  valid till: 2020-10-03
derived from: Mortgage Lenders
  type: BicsLevel5Segment
  type: Classifier
  type: ContemporaryDerivation
  derived from: http://data.ga-group.nl/ics/bics/2020/1411111210
  derived from: http://data.ga-group.nl/ics/bics/2024/1411111210
  source accessed on: 2023-07-03T18:11:29Z
  source last accessed on: 2024-06-05T14:42:36Z
  definition: This segment includes companies that provide home financing, such as mortgages and home equity loans.
  notation: 1411111210
  valid from: 2020-10-03
source accessed on: 2023-07-03T18:11:29Z
source last accessed on: 2024-06-05T14:42:36Z
definition: This segment includes companies that provide home financing, such as mortgages and home equity loans.
notation: 1411111210
valid from: 2020-10-03

Mortgage Loan Brokers
type: BicsLevel5Segment
type: Classifier
type: NamedIndividual
is level5 segment of: Mortgage Finance
created with: infer-bics.sql
derived from: Mortgage Loan Brokers
  type: BicsLevel4SubIndustry
  type: Classifier
  type: AnachronousDerivation
  derived from: http://data.ga-group.nl/ics/bics/2014/14121211
  source accessed on: 2019-12-03T20:05:01Z
  source last accessed on: 2019-12-03T20:05:01Z
  definition: This industry subgroup includes companies that arrange home loans between borrowers and lenders on a commission or fee basis.
  notation: 14121211
  valid from: 2014-08-08
  valid till: 2020-10-03
derived from: Mortgage Loan Brokers
  type: BicsLevel5Segment
  type: Classifier
  type: ContemporaryDerivation
  derived from: http://data.ga-group.nl/ics/bics/2020/1411111211
  derived from: http://data.ga-group.nl/ics/bics/2024/1411111211
  source accessed on: 2023-07-03T18:11:29Z
  source last accessed on: 2024-06-05T14:42:36Z
  definition: This segment includes companies that arrange home loans between borrowers and lenders on a commission or fee basis.
  notation: 1411111211
  valid from: 2020-10-03
source accessed on: 2023-07-03T18:11:29Z
source last accessed on: 2024-06-05T14:42:36Z
definition: This segment includes companies that arrange home loans between borrowers and lenders on a commission or fee basis.
notation: 1411111211
valid from: 2020-10-03

Mortgage Services
type: BicsLevel5Segment
type: Classifier
type: NamedIndividual
is level5 segment of: Mortgage Finance
created with: infer-bics.sql
derived from: Mortgage Services
  type: BicsLevel4SubIndustry
  type: Classifier
  type: AnachronousDerivation
  derived from: http://data.ga-group.nl/ics/bics/2014/14121212
  source accessed on: 2019-12-03T20:05:01Z
  source last accessed on: 2019-12-03T20:05:01Z
  definition: This industry subgroup includes companies that provide mortgage services other than mortgage lending or mortgage brokerage services.
  notation: 14121212
  valid from: 2014-08-08
  valid till: 2020-10-03
derived from: Mortgage Services
  type: BicsLevel5Segment
  type: Classifier
  type: ContemporaryDerivation
  derived from: http://data.ga-group.nl/ics/bics/2020/1411111212
  derived from: http://data.ga-group.nl/ics/bics/2024/1411111212
  source accessed on: 2023-07-03T18:11:29Z
  source last accessed on: 2024-06-05T14:42:36Z
  definition: This segment includes companies that provide mortgage services other than mortgage lending or mortgage brokerage services.
  notation: 1411111212
  valid from: 2020-10-03
source accessed on: 2023-07-03T18:11:29Z
source last accessed on: 2024-06-05T14:42:36Z
definition: This segment includes companies that provide mortgage services other than mortgage lending or mortgage brokerage services.
notation: 1411111212
valid from: 2020-10-03

Mortgage Insurance Premiums
type: BicsLevel6Segment
type: Classifier
type: NamedIndividual
is level6 segment of: Mortgage Insurance
replaces: Mortgage Insurance Premiums
created with: infer-bics.sql
derived from: Mortgage Insurance Premiums
  type: BicsLevel5Segment
  type: Classifier
  type: AnachronousDerivation
  derived from: http://data.ga-group.nl/ics/bics/2014/1412121310
  source accessed on: 2019-12-03T20:05:01Z
  source last accessed on: 2019-12-03T20:05:01Z
  definition: This segment includes premium revenue generated from mortgage insurance business.
  notation: 1412121310
  valid from: 2014-08-08
  valid till: 2020-10-03
derived from: Mortgage Insurance Premiums
  type: BicsLevel6Segment
  type: Classifier
  type: ContemporaryDerivation
  derived from: http://data.ga-group.nl/ics/bics/2020/141111121310
  derived from: http://data.ga-group.nl/ics/bics/2024/141111121310
  source accessed on: 2023-07-03T18:11:29Z
  source last accessed on: 2024-06-05T14:42:36Z
  definition: This segment includes revenue generated from mortgage insurance premiums.
  notation: 141111121310
  valid from: 2020-10-03
source accessed on: 2023-07-03T18:11:29Z
source last accessed on: 2024-06-05T14:42:36Z
definition: This segment includes revenue generated from mortgage insurance premiums.
notation: 141111121310
valid from: 2020-10-03

Investment Income - Mortg Ins
type: BicsLevel7Segment
type: Classifier
type: NamedIndividual
is level7 segment of: Mortgage Insurance Non-Prem
replaces: Investment Income - Mortg Ins
created with: infer-bics.sql
derived from: Investment Income - Mortg Ins
  type: BicsLevel6Segment
  type: Classifier
  type: AnachronousDerivation
  derived from: http://data.ga-group.nl/ics/bics/2014/141212131110
  source accessed on: 2019-12-03T20:05:01Z
  source last accessed on: 2019-12-03T20:05:01Z
  definition: This segment includes investment income generated from mortgage insurance business.
  notation: 141212131110
  valid from: 2014-08-08
  valid till: 2020-10-03
derived from: Investment Income - Mortg Ins
  type: BicsLevel7Segment
  type: Classifier
  type: ContemporaryDerivation
  derived from: http://data.ga-group.nl/ics/bics/2020/14111112131110
  derived from: http://data.ga-group.nl/ics/bics/2024/14111112131110
  source accessed on: 2023-07-03T18:11:29Z
  source last accessed on: 2024-06-05T14:42:36Z
  definition: This segment includes investment income generated from mortgage insurance.
  notation: 14111112131110
  valid from: 2020-10-03
source accessed on: 2023-07-03T18:11:29Z
source last accessed on: 2024-06-05T14:42:36Z
definition: This segment includes investment income generated from mortgage insurance.
notation: 14111112131110
valid from: 2020-10-03

Realized Gain/Loss - Mortg Ins
type: BicsLevel7Segment
type: Classifier
type: NamedIndividual
is level7 segment of: Mortgage Insurance Non-Prem
replaces: Realized Gain/Loss - Mortg Ins
created with: infer-bics.sql
derived from: Realized Gain/Loss - Mortg Ins
  type: BicsLevel6Segment
  type: Classifier
  type: AnachronousDerivation
  derived from: http://data.ga-group.nl/ics/bics/2014/141212131111
  source accessed on: 2019-12-03T20:05:01Z
  source last accessed on: 2019-12-03T20:05:01Z
  definition: This segment includes realized gains/losses generated from mortgage insurance business.
  notation: 141212131111
  valid from: 2014-08-08
  valid till: 2020-10-03
derived from: Realized Gain/Loss - Mortg Ins
  type: BicsLevel7Segment
  type: Classifier
  type: ContemporaryDerivation
  derived from: http://data.ga-group.nl/ics/bics/2020/14111112131111
  derived from: http://data.ga-group.nl/ics/bics/2024/14111112131111
  source accessed on: 2023-07-03T18:11:29Z
  source last accessed on: 2024-06-05T14:42:36Z
  definition: This segment includes realized gains/losses generated from mortgage insurance.
  notation: 14111112131111
  valid from: 2020-10-03
source accessed on: 2023-07-03T18:11:29Z
source last accessed on: 2024-06-05T14:42:36Z
definition: This segment includes realized gains/losses generated from mortgage insurance.
notation: 14111112131111
valid from: 2020-10-03

Other Income - Mortgage Ins
type: BicsLevel7Segment
type: Classifier
type: NamedIndividual
is level7 segment of: Mortgage Insurance Non-Prem
replaces: Other Income - Mortgage Ins
created with: infer-bics.sql
derived from: Other Income - Mortgage Ins
  type: BicsLevel6Segment
  type: Classifier
  type: AnachronousDerivation
  derived from: http://data.ga-group.nl/ics/bics/2014/141212131112
  source accessed on: 2019-12-03T20:05:01Z
  source last accessed on: 2019-12-03T20:05:01Z
  definition: This segment includes other income generated from mortgage insurance business.
  notation: 141212131112
  valid from: 2014-08-08
  valid till: 2020-10-03
derived from: Other Income - Mortgage Ins
  type: BicsLevel7Segment
  type: Classifier
  type: ContemporaryDerivation
  derived from: http://data.ga-group.nl/ics/bics/2020/14111112131112
  derived from: http://data.ga-group.nl/ics/bics/2024/14111112131112
  source accessed on: 2023-07-03T18:11:29Z
  source last accessed on: 2024-06-05T14:42:36Z
  definition: This segment includes other income generated from mortgage insurance.
  notation: 14111112131112
  valid from: 2020-10-03
source accessed on: 2023-07-03T18:11:29Z
source last accessed on: 2024-06-05T14:42:36Z
definition: This segment includes other income generated from mortgage insurance.
notation: 14111112131112
valid from: 2020-10-03

Mortgage Insurance Non-Prem
type: BicsLevel6Segment
type: Classifier
type: NamedIndividual
is level6 segment of: Mortgage Insurance
replaces: Mortgage Insurance Non-Prem
created with: infer-bics.sql
derived from: Mortgage Insurance Non-Prem
  type: BicsLevel5Segment
  type: Classifier
  type: AnachronousDerivation
  derived from: http://data.ga-group.nl/ics/bics/2014/1412121311
  source accessed on: 2019-12-03T20:05:01Z
  source last accessed on: 2019-12-03T20:05:01Z
  definition: This segment includes total non-premium revenue generated from mortgage insurance business.
  notation: 1412121311
  valid from: 2014-08-08
  valid till: 2020-10-03
derived from: Mortgage Insurance Non-Prem
  type: BicsLevel6Segment
  type: Classifier
  type: ContemporaryDerivation
  derived from: http://data.ga-group.nl/ics/bics/2020/141111121311
  derived from: http://data.ga-group.nl/ics/bics/2024/141111121311
  source accessed on: 2023-07-03T18:11:29Z
  source last accessed on: 2024-06-05T14:42:36Z
  definition: This segment includes total non-premium revenue generated from mortgage insurance.
  notation: 141111121311
  valid from: 2020-10-03
source accessed on: 2023-07-03T18:11:29Z
source last accessed on: 2024-06-05T14:42:36Z
definition: This segment includes total non-premium revenue generated from mortgage insurance.
notation: 141111121311
valid from: 2020-10-03

Mortgage Insurance
type: BicsLevel5Segment
type: Classifier
type: NamedIndividual
is level5 segment of: Mortgage Finance
created with: infer-bics.sql
derived from: Mortgage Insurance
  type: BicsLevel4SubIndustry
  type: Classifier
  type: AnachronousDerivation
  derived from: http://data.ga-group.nl/ics/bics/2014/14121213
  source accessed on: 2019-12-03T20:05:01Z
  source last accessed on: 2019-12-03T20:05:01Z
  definition: This industry subgroup includes companies that provide insurance to cover losses from defaults on mortgage loans. Also known as private mortgage insurance (PMI).
  notation: 14121213
  valid from: 2014-08-08
  valid till: 2020-10-03
derived from: Mortgage Insurance
  type: BicsLevel5Segment
  type: Classifier
  type: ContemporaryDerivation
  derived from: http://data.ga-group.nl/ics/bics/2020/1411111213
  derived from: http://data.ga-group.nl/ics/bics/2024/1411111213
  source accessed on: 2023-07-03T18:11:29Z
  source last accessed on: 2024-06-05T14:42:36Z
  definition: This segment includes companies that provide insurance to cover losses from defaults on mortgage loans. Also known as private mortgage insurance (PMI).
  notation: 1411111213
  valid from: 2020-10-03
source accessed on: 2023-07-03T18:11:29Z
source last accessed on: 2024-06-05T14:42:36Z
definition: This segment includes companies that provide insurance to cover losses from defaults on mortgage loans. Also known as private mortgage insurance (PMI).
notation: 1411111213
valid from: 2020-10-03

Direct Title Insurance Premiums
type: BicsLevel6Segment
type: Classifier
type: NamedIndividual
is level6 segment of: Title Insurance
replaces: Direct Title Insurance Premiums
created with: infer-bics.sql
derived from: Direct Title Insurance Premiums
  type: BicsLevel5Segment
  type: Classifier
  type: AnachronousDerivation
  derived from: http://data.ga-group.nl/ics/bics/2014/1412121410
  source accessed on: 2019-12-03T20:05:01Z
  source last accessed on: 2019-12-03T20:05:01Z
  definition: This segment includes premium revenue generated from direct title business.
  notation: 1412121410
  valid from: 2014-08-08
  valid till: 2020-10-03
derived from: Direct Title Insurance Premiums
  type: BicsLevel6Segment
  type: Classifier
  type: ContemporaryDerivation
  derived from: http://data.ga-group.nl/ics/bics/2020/141111121410
  derived from: http://data.ga-group.nl/ics/bics/2024/141111121410
  source accessed on: 2023-07-03T18:11:29Z
  source last accessed on: 2024-06-05T14:42:36Z
  definition: This segment includes revenue generated from direct title premiums.
  notation: 141111121410
  valid from: 2020-10-03
source accessed on: 2023-07-03T18:11:29Z
source last accessed on: 2024-06-05T14:42:36Z
definition: This segment includes revenue generated from direct title premiums.
notation: 141111121410
valid from: 2020-10-03

Investment Inc - Direct Title Ins
type: BicsLevel7Segment
type: Classifier
type: NamedIndividual
is level7 segment of: Direct Title Insurance Non-Prem
replaces: Investment Inc - Direct Title Ins
created with: infer-bics.sql
derived from: Investment Inc - Direct Title Ins
  type: BicsLevel6Segment
  type: Classifier
  type: AnachronousDerivation
  derived from: http://data.ga-group.nl/ics/bics/2014/141212141110
  source accessed on: 2019-12-03T20:05:01Z
  source last accessed on: 2019-12-03T20:05:01Z
  definition: This segment includes investment income generated from direct title business.
  notation: 141212141110
  valid from: 2014-08-08
  valid till: 2020-10-03
derived from: Investment Inc - Direct Title Ins
  type: BicsLevel7Segment
  type: Classifier
  type: ContemporaryDerivation
  derived from: http://data.ga-group.nl/ics/bics/2020/14111112141110
  derived from: http://data.ga-group.nl/ics/bics/2024/14111112141110
  source accessed on: 2023-07-03T18:11:29Z
  source last accessed on: 2024-06-05T14:42:36Z
  definition: This segment includes investment income generated from direct title insurance.
  notation: 14111112141110
  valid from: 2020-10-03
source accessed on: 2023-07-03T18:11:29Z
source last accessed on: 2024-06-05T14:42:36Z
definition: This segment includes investment income generated from direct title insurance.
notation: 14111112141110
valid from: 2020-10-03

Realized G/L - Direct Title Ins
type: BicsLevel7Segment
type: Classifier
type: NamedIndividual
is level7 segment of: Direct Title Insurance Non-Prem
replaces: Realized G/L - Direct Title Ins
created with: infer-bics.sql
derived from: Realized G/L - Direct Title Ins
  type: BicsLevel6Segment
  type: Classifier
  type: AnachronousDerivation
  derived from: http://data.ga-group.nl/ics/bics/2014/141212141111
  source accessed on: 2019-12-03T20:05:01Z
  source last accessed on: 2019-12-03T20:05:01Z
  definition: This segment includes realized gains/losses generated from direct title business.
  notation: 141212141111
  valid from: 2014-08-08
  valid till: 2020-10-03
derived from: Realized G/L - Direct Title Ins
  type: BicsLevel7Segment
  type: Classifier
  type: ContemporaryDerivation
  derived from: http://data.ga-group.nl/ics/bics/2020/14111112141111
  derived from: http://data.ga-group.nl/ics/bics/2024/14111112141111
  source accessed on: 2023-07-03T18:11:29Z
  source last accessed on: 2024-06-05T14:42:36Z
  definition: This segment includes realized gains/losses generated from direct title insurance.
  notation: 14111112141111
  valid from: 2020-10-03
source accessed on: 2023-07-03T18:11:29Z
source last accessed on: 2024-06-05T14:42:36Z
definition: This segment includes realized gains/losses generated from direct title insurance.
notation: 14111112141111
valid from: 2020-10-03

Other Income - Direct Title Ins
type: BicsLevel7Segment
type: Classifier
type: NamedIndividual
is level7 segment of: Direct Title Insurance Non-Prem
replaces: Other Income - Direct Title Ins
created with: infer-bics.sql
derived from: Other Income - Direct Title Ins
  type: BicsLevel6Segment
  type: Classifier
  type: AnachronousDerivation
  derived from: http://data.ga-group.nl/ics/bics/2014/141212141112
  source accessed on: 2019-12-03T20:05:01Z
  source last accessed on: 2019-12-03T20:05:01Z
  definition: This segment includes other income generated from direct title business.
  notation: 141212141112
  valid from: 2014-08-08
  valid till: 2020-10-03
derived from: Other Income - Direct Title Ins
  type: BicsLevel7Segment
  type: Classifier
  type: ContemporaryDerivation
  derived from: http://data.ga-group.nl/ics/bics/2020/14111112141112
  derived from: http://data.ga-group.nl/ics/bics/2024/14111112141112
  source accessed on: 2023-07-03T18:11:29Z
  source last accessed on: 2024-06-05T14:42:36Z
  definition: This segment includes other income generated from direct title insurance.
  notation: 14111112141112
  valid from: 2020-10-03
source accessed on: 2023-07-03T18:11:29Z
source last accessed on: 2024-06-05T14:42:36Z
definition: This segment includes other income generated from direct title insurance.
notation: 14111112141112
valid from: 2020-10-03

Direct Title Insurance Non-Prem
type: BicsLevel6Segment
type: Classifier
type: NamedIndividual
is level6 segment of: Title Insurance
replaces: Direct Title Insurance Non-Prem
created with: infer-bics.sql
derived from: Direct Title Insurance Non-Prem
  type: BicsLevel5Segment
  type: Classifier
  type: AnachronousDerivation
  derived from: http://data.ga-group.nl/ics/bics/2014/1412121411
  source accessed on: 2019-12-03T20:05:01Z
  source last accessed on: 2019-12-03T20:05:01Z
  definition: This segment includes total non-premium revenue generated from direct title business.
  notation: 1412121411
  valid from: 2014-08-08
  valid till: 2020-10-03
derived from: Direct Title Insurance Non-Prem
  type: BicsLevel6Segment
  type: Classifier
  type: ContemporaryDerivation
  derived from: http://data.ga-group.nl/ics/bics/2020/141111121411
  derived from: http://data.ga-group.nl/ics/bics/2024/141111121411
  source accessed on: 2023-07-03T18:11:29Z
  source last accessed on: 2024-06-05T14:42:36Z
  definition: This segment includes total non-premium revenue generated from direct title insurance.
  notation: 141111121411
  valid from: 2020-10-03
source accessed on: 2023-07-03T18:11:29Z
source last accessed on: 2024-06-05T14:42:36Z
definition: This segment includes total non-premium revenue generated from direct title insurance.
notation: 141111121411
valid from: 2020-10-03

Title Insurance
type: BicsLevel5Segment
type: Classifier
type: NamedIndividual
is level5 segment of: Mortgage Finance
created with: infer-bics.sql
derived from: Title Insurance
  type: BicsLevel4SubIndustry
  type: Classifier
  type: AnachronousDerivation
  derived from: http://data.ga-group.nl/ics/bics/2014/14121214
  source accessed on: 2019-12-03T20:05:01Z
  source last accessed on: 2019-12-03T20:05:01Z
  definition: This industry subgroup includes companies that directly underwrite title insurance policies.
  notation: 14121214
  valid from: 2014-08-08
  valid till: 2020-10-03
derived from: Title Insurance
  type: BicsLevel5Segment
  type: Classifier
  type: ContemporaryDerivation
  derived from: http://data.ga-group.nl/ics/bics/2020/1411111214
  derived from: http://data.ga-group.nl/ics/bics/2024/1411111214
  source accessed on: 2023-07-03T18:11:29Z
  source last accessed on: 2024-06-05T14:42:36Z
  definition: This segment includes companies that directly underwrite title insurance policies.
  notation: 1411111214
  valid from: 2020-10-03
source accessed on: 2023-07-03T18:11:29Z
source last accessed on: 2024-06-05T14:42:36Z
definition: This segment includes companies that directly underwrite title insurance policies.
notation: 1411111214
valid from: 2020-10-03

Commercial Mortgage - REIT
type: BicsLevel6Segment
type: Classifier
type: NamedIndividual
is level6 segment of: Mortgage REIT
replaces: Commercial Mortgage - REIT
created with: infer-bics.sql
derived from: Commercial Mortgage - REIT
  type: BicsLevel5Segment
  type: Classifier
  type: AnachronousDerivation
  derived from: http://data.ga-group.nl/ics/bics/2014/1412121510
  source accessed on: 2019-12-03T20:05:01Z
  source last accessed on: 2019-12-03T20:05:01Z
  definition: This segment includes real estate investment trusts (REITs) that invest in commercial mortgage securities.
  notation: 1412121510
  valid from: 2014-08-08
  valid till: 2020-10-03
derived from: Commercial Mortgage - REIT
  type: BicsLevel6Segment
  type: Classifier
  type: ContemporaryDerivation
  derived from: http://data.ga-group.nl/ics/bics/2020/141111121510
  derived from: http://data.ga-group.nl/ics/bics/2024/141111121510
  source accessed on: 2023-07-03T18:11:29Z
  source last accessed on: 2024-06-05T14:42:36Z
  definition: This segment includes real estate investment trusts (REITs) that invest in commercial mortgage securities.
  notation: 141111121510
  valid from: 2020-10-03
source accessed on: 2023-07-03T18:11:29Z
source last accessed on: 2024-06-05T14:42:36Z
definition: This segment includes real estate investment trusts (REITs) that invest in commercial mortgage securities.
notation: 141111121510
valid from: 2020-10-03

Residential Mortgage - REIT
type: BicsLevel6Segment
type: Classifier
type: NamedIndividual
is level6 segment of: Mortgage REIT
replaces: Residential Mortgage - REIT
created with: infer-bics.sql
derived from: Residential Mortgage - REIT
  type: BicsLevel5Segment
  type: Classifier
  type: AnachronousDerivation
  derived from: http://data.ga-group.nl/ics/bics/2014/1412121511
  source accessed on: 2019-12-03T20:05:01Z
  source last accessed on: 2019-12-03T20:05:01Z
  definition: This segment includes real estate investment trusts (REITs) that invest in residential mortgage securities.
  notation: 1412121511
  valid from: 2014-08-08
  valid till: 2020-10-03
derived from: Residential Mortgage - REIT
  type: BicsLevel6Segment
  type: Classifier
  type: ContemporaryDerivation
  derived from: http://data.ga-group.nl/ics/bics/2020/141111121511
  derived from: http://data.ga-group.nl/ics/bics/2024/141111121511
  source accessed on: 2023-07-03T18:11:29Z
  source last accessed on: 2024-06-05T14:42:36Z
  definition: This segment includes real estate investment trusts (REITs) that invest in residential mortgage securities.
  notation: 141111121511
  valid from: 2020-10-03
source accessed on: 2023-07-03T18:11:29Z
source last accessed on: 2024-06-05T14:42:36Z
definition: This segment includes real estate investment trusts (REITs) that invest in residential mortgage securities.
notation: 141111121511
valid from: 2020-10-03

Mortgage REIT
type: BicsLevel5Segment
type: Classifier
type: NamedIndividual
is level5 segment of: Mortgage Finance
created with: infer-bics.sql
derived from: Mortgage REIT
  type: BicsLevel4SubIndustry
  type: Classifier
  type: AnachronousDerivation
  derived from: http://data.ga-group.nl/ics/bics/2014/14121215
  source accessed on: 2019-12-03T20:05:01Z
  source last accessed on: 2019-12-03T20:05:01Z
  definition: This industry subgroup includes companies that invest in real estate loans and related securities, and meet the criteria necessary to be eligible for real estate investment trust (REIT) tax status.
  notation: 14121215
  valid from: 2014-08-08
  valid till: 2020-10-03
derived from: Mortgage REIT
  type: BicsLevel5Segment
  type: Classifier
  type: ContemporaryDerivation
  derived from: http://data.ga-group.nl/ics/bics/2020/1411111215
  derived from: http://data.ga-group.nl/ics/bics/2024/1411111215
  source accessed on: 2023-07-03T18:11:29Z
  source last accessed on: 2024-06-05T14:42:36Z
  definition: This segment includes companies that invest in real estate loans and related securities, and meet the criteria necessary to be eligible for real estate investment trust (REIT) tax status.
  notation: 1411111215
  valid from: 2020-10-03
source accessed on: 2023-07-03T18:11:29Z
source last accessed on: 2024-06-05T14:42:36Z
definition: This segment includes companies that invest in real estate loans and related securities, and meet the criteria necessary to be eligible for real estate investment trust (REIT) tax status.
notation: 1411111215
valid from: 2020-10-03

Mortgage Finance
type: BicsLevel4SubIndustry
type: Classifier
type: NamedIndividual
replaces: Mortgage Finance
created with: infer-bics.sql
derived from: Mortgage Finance
  type: BicsLevel3Industry
  type: Classifier
  type: AnachronousDerivation
  derived from: http://data.ga-group.nl/ics/bics/2014/141212
  source accessed on: 2019-12-03T20:05:01Z
  source last accessed on: 2019-12-03T20:05:01Z
  definition: This industry includes companies that provide mortgage financing services. Such companies include mortgage lenders, mortgage bankers, mortgage real estate investment trusts (REITs), mortgage loan brokers, mortgage insurers and title insurers.
  notation: 141212
  valid from: 2014-08-08
  valid till: 2020-10-03
derived from: Mortgage Finance
  type: BicsLevel4SubIndustry
  type: Classifier
  type: ContemporaryDerivation
  derived from: http://data.ga-group.nl/ics/bics/2020/14111112
  derived from: http://data.ga-group.nl/ics/bics/2024/14111112
  source accessed on: 2023-07-03T18:11:29Z
  source last accessed on: 2024-06-05T14:42:36Z
  definition: This industry subgroup includes companies that provide mortgage financing services. Includes mortgage lenders, mortgage bankers, mortgage real estate investment trusts (REITs), mortgage loan brokers, mortgage insurers, and title insurers.
  notation: 14111112
  valid from: 2020-10-03
source accessed on: 2023-07-03T18:11:29Z
source last accessed on: 2024-06-05T14:42:36Z
definition: This industry subgroup includes companies that provide mortgage financing services. Includes mortgage lenders, mortgage bankers, mortgage real estate investment trusts (REITs), mortgage loan brokers, mortgage insurers, and title insurers.
notation: 14111112
valid from: 2020-10-03

Receivables Collection & Mgmt
type: BicsLevel5Segment
type: Classifier
type: NamedIndividual
is level5 segment of: Other Financial Services
created with: infer-bics.sql
derived from: Receivables Collection & Mgmt
  type: BicsLevel5Segment
  type: Classifier
  type: ContemporaryDerivation
  derived from: http://data.ga-group.nl/ics/bics/2024/1411111310
  source accessed on: 2024-06-05T14:42:36Z
  source last accessed on: 2024-06-05T14:42:36Z
  definition: This segment includes companies that collect payments for claims. Collected payments are remitted to the company's clients or kept by the company if the company has purchased the claims.
  notation: 1411111310
  valid from: 2024-06-07
source accessed on: 2024-06-05T14:42:36Z
source last accessed on: 2024-06-05T14:42:36Z
definition: This segment includes companies that collect payments for claims. Collected payments are remitted to the company's clients or kept by the company if the company has purchased the claims.
notation: 1411111310
valid from: 2024-06-07

Financial Transaction Processors
type: BicsLevel5Segment
type: Classifier
type: NamedIndividual
is level5 segment of: Other Financial Services
replaces: http://data.ga-group.nl/ics/bics/1911111210
created with: infer-bics.sql
derived from: Financial Transaction Proc Svcs
  type: BicsLevel5Segment
  type: Classifier
  type: AnachronousDerivation
  derived from: http://data.ga-group.nl/ics/bics/2014/1412111211
  source accessed on: 2019-12-03T20:05:01Z
  source last accessed on: 2019-12-03T20:05:01Z
  definition: This segment includes companies that provide financial transaction processing services, such as electronic payment processing.
  notation: 1412111211
  valid from: 2014-08-08
  valid till: 2020-10-03
derived from: Financial Transaction Processors
  type: BicsLevel5Segment
  type: Classifier
  type: AnachronousDerivation
  derived from: http://data.ga-group.nl/ics/bics/2020/1911111210
  source accessed on: 2023-07-03T18:11:29Z
  source last accessed on: 2023-07-03T18:11:29Z
  definition: This segment includes companies that process or facilitate financial transactions. Includes companies that process credit cards, debit cards, or gift cards payments and credit card networks.
  notation: 1911111210
  valid from: 2020-10-03
  valid till: 2024-06-07
derived from: Financial Transaction Processors
  type: BicsLevel5Segment
  type: Classifier
  type: ContemporaryDerivation
  derived from: http://data.ga-group.nl/ics/bics/2024/1411111311
  source accessed on: 2024-06-05T14:42:36Z
  source last accessed on: 2024-06-05T14:42:36Z
  definition: This segment includes companies that process or facilitate financial transactions. Includes companies that process credit cards, debit cards, or gift cards payments and credit card networks.
  notation: 1411111311
  valid from: 2024-06-07
source accessed on: 2024-06-05T14:42:36Z
source last accessed on: 2024-06-05T14:42:36Z
definition: This segment includes companies that process or facilitate financial transactions. Includes companies that process credit cards, debit cards, or gift cards payments and credit card networks.
notation: 1411111311
valid from: 2024-06-07

Credit Agencies
type: BicsLevel6Segment
type: Classifier
type: NamedIndividual
is level6 segment of: Financial Info Services
replaces: http://data.ga-group.nl/ics/bics/191111111010
created with: infer-bics.sql
derived from: Credit Agencies
  type: BicsLevel5Segment
  type: Classifier
  type: AnachronousDerivation
  derived from: http://data.ga-group.nl/ics/bics/2014/1814111010
  source accessed on: 2019-12-03T20:05:01Z
  source last accessed on: 2019-12-03T20:05:01Z
  definition: This segment includes companies that collect credit and employment information on individuals and businesses.
  notation: 1814111010
  valid from: 2014-08-08
  valid till: 2020-10-03
derived from: Credit Agencies
  type: BicsLevel6Segment
  type: Classifier
  type: AnachronousDerivation
  derived from: http://data.ga-group.nl/ics/bics/2020/191111111010
  source accessed on: 2023-07-03T18:11:29Z
  source last accessed on: 2023-07-03T18:11:29Z
  definition: This segment includes companies that collect credit and employment information on individuals and businesses.
  notation: 191111111010
  valid from: 2020-10-03
  valid till: 2024-06-07
derived from: Credit Agencies
  type: BicsLevel6Segment
  type: Classifier
  type: ContemporaryDerivation
  derived from: http://data.ga-group.nl/ics/bics/2024/141111131210
  source accessed on: 2024-06-05T14:42:36Z
  source last accessed on: 2024-06-05T14:42:36Z
  definition: This segment includes companies that collect credit and employment information on individuals and businesses.
  notation: 141111131210
  valid from: 2024-06-07
source accessed on: 2024-06-05T14:42:36Z
source last accessed on: 2024-06-05T14:42:36Z
definition: This segment includes companies that collect credit and employment information on individuals and businesses.
notation: 141111131210
valid from: 2024-06-07

Data & Analytics
type: BicsLevel6Segment
type: Classifier
type: NamedIndividual
is level6 segment of: Financial Info Services
replaces: http://data.ga-group.nl/ics/bics/191111111011
created with: infer-bics.sql
derived from: Data & Analytics
  type: BicsLevel5Segment
  type: Classifier
  type: AnachronousDerivation
  derived from: http://data.ga-group.nl/ics/bics/2014/1814111011
  source accessed on: 2019-12-03T20:05:01Z
  source last accessed on: 2019-12-03T20:05:01Z
  definition: This segment includes companies that provide pricing data, news and analytics along with trading capabilities across major asset classes.
  notation: 1814111011
  valid from: 2014-08-08
  valid till: 2020-10-03
derived from: Data & Analytics
  type: BicsLevel6Segment
  type: Classifier
  type: AnachronousDerivation
  derived from: http://data.ga-group.nl/ics/bics/2020/191111111011
  source accessed on: 2023-07-03T18:11:29Z
  source last accessed on: 2023-07-03T18:11:29Z
  definition: This segment includes companies that provide pricing data, news, and analytics along with trading capabilities across major asset classes.
  notation: 191111111011
  valid from: 2020-10-03
  valid till: 2024-06-07
derived from: Data & Analytics
  type: BicsLevel6Segment
  type: Classifier
  type: ContemporaryDerivation
  derived from: http://data.ga-group.nl/ics/bics/2024/141111131211
  source accessed on: 2024-06-05T14:42:36Z
  source last accessed on: 2024-06-05T14:42:36Z
  definition: This segment includes companies that provide pricing data, news, and analytics along with trading capabilities across major asset classes.
  notation: 141111131211
  valid from: 2024-06-07
source accessed on: 2024-06-05T14:42:36Z
source last accessed on: 2024-06-05T14:42:36Z
definition: This segment includes companies that provide pricing data, news, and analytics along with trading capabilities across major asset classes.
notation: 141111131211
valid from: 2024-06-07

Financial Info Services
type: BicsLevel5Segment
type: Classifier
type: NamedIndividual
is level5 segment of: Other Financial Services
replaces: http://data.ga-group.nl/ics/bics/1911111110
created with: infer-bics.sql
derived from: Financial Info Services
  type: BicsLevel4SubIndustry
  type: Classifier
  type: AnachronousDerivation
  derived from: http://data.ga-group.nl/ics/bics/2014/18141110
  source accessed on: 2019-12-03T20:05:01Z
  source last accessed on: 2019-12-03T20:05:01Z
  definition: This industry subgroup includes companies that serve as credit or ratings agencies, provide pricing data, news and analytics, or create indices.
  notation: 18141110
  valid from: 2014-08-08
  valid till: 2020-10-03
derived from: Financial Info Services
  type: BicsLevel5Segment
  type: Classifier
  type: AnachronousDerivation
  derived from: http://data.ga-group.nl/ics/bics/2020/1911111110
  source accessed on: 2023-07-03T18:11:29Z
  source last accessed on: 2023-07-03T18:11:29Z
  definition: This segment includes companies that provide financial data and information.
  notation: 1911111110
  valid from: 2020-10-03
  valid till: 2024-06-07
derived from: Financial Info Services
  type: BicsLevel5Segment
  type: Classifier
  type: ContemporaryDerivation
  derived from: http://data.ga-group.nl/ics/bics/2024/1411111312
  source accessed on: 2024-06-05T14:42:36Z
  source last accessed on: 2024-06-05T14:42:36Z
  definition: This segment includes companies that provide financial data and information.
  notation: 1411111312
  valid from: 2024-06-07
source accessed on: 2024-06-05T14:42:36Z
source last accessed on: 2024-06-05T14:42:36Z
definition: This segment includes companies that provide financial data and information.
notation: 1411111312
valid from: 2024-06-07

Other Financial Services
type: BicsLevel4SubIndustry
type: Classifier
type: NamedIndividual
replaces: Other Financial Services
created with: infer-bics.sql
derived from: Other Financial Services
  type: BicsLevel3Industry
  type: Classifier
  type: AnachronousDerivation
  derived from: http://data.ga-group.nl/ics/bics/2014/141214
  source accessed on: 2019-12-03T20:05:01Z
  source last accessed on: 2019-12-03T20:05:01Z
  definition: This industry includes companies that provide other types of financial services, such as corporate, treasury, receivable collections and other financial vehicles.
  notation: 141214
  valid from: 2014-08-08
  valid till: 2020-10-03
derived from: Other Financial Services
  type: BicsLevel4SubIndustry
  type: Classifier
  type: ContemporaryDerivation
  derived from: http://data.ga-group.nl/ics/bics/2020/14111113
  derived from: http://data.ga-group.nl/ics/bics/2024/14111113
  source accessed on: 2023-07-03T18:11:29Z
  source last accessed on: 2024-06-05T14:42:36Z
  definition: This industry subgroup includes companies that provide other types of financial services not elsewhere classified.
  notation: 14111113
  valid from: 2020-10-03
source accessed on: 2023-07-03T18:11:29Z
source last accessed on: 2024-06-05T14:42:36Z
definition: This industry subgroup includes companies that provide other types of financial services not elsewhere classified.
notation: 14111113
valid from: 2020-10-03

Specialty Finance
type: BicsLevel3Industry
type: Classifier
type: NamedIndividual
is industry of: Financial Services
is replaced by: Banks
replaces: Insurance
created with: infer-bics.sql
derived from: Banks
  type: BicsLevel3Industry
  type: Classifier
  type: ContemporaryDerivation
  derived from: http://data.ga-group.nl/ics/bics/2014/141111
  source accessed on: 2019-12-03T20:05:01Z
  source last accessed on: 2019-12-03T20:05:01Z
  definition: This industry includes companies that accept deposits and make loans.
  notation: 141111
  valid from: 2014-08-08
  valid till: 2020-10-03
derived from: Specialty Finance
  type: BicsLevel2IndustryGroup
  type: Classifier
  type: AnachronousDerivation
  derived from: http://data.ga-group.nl/ics/bics/2014/1412
  source accessed on: 2019-12-03T20:05:01Z
  source last accessed on: 2019-12-03T20:05:01Z
  definition: This industry group includes companies that provide specialized lending and financing services. Such specialty finance services include consumer and commercial lending, Islamic banking, mortgage finance, auto/equipment financing, credit card services and other financial services.
  notation: 1412
  valid from: 2014-08-08
  valid till: 2020-10-03
derived from: Specialty Finance
  type: BicsLevel3Industry
  type: Classifier
  type: ContemporaryDerivation
  derived from: http://data.ga-group.nl/ics/bics/2020/141111
  source accessed on: 2023-07-03T18:11:29Z
  source last accessed on: 2023-07-03T18:11:29Z
  definition: This industry includes companies that provide specialized loans and financing. Typically, these companies focus on one type of financing and derive their funding from capital markets.
  notation: 141111
  valid from: 2020-10-03
  valid till: 2024-06-07
derived from: Specialty Finance
  type: BicsLevel3Industry
  type: Classifier
  type: ContemporaryDerivation
  derived from: http://data.ga-group.nl/ics/bics/2024/141111
  source accessed on: 2024-06-05T14:42:36Z
  source last accessed on: 2024-06-05T14:42:36Z
  definition: This industry includes companies that provide specialized loans and financing. Typically, these companies focus on one type of financing and derive their funding from capital markets. Also includes other non-institutional financial services.
  notation: 141111
  valid from: 2024-06-07
source accessed on: 2019-12-03T20:05:01Z
source last accessed on: 2024-06-05T14:42:36Z
definition: This industry includes companies that provide specialized loans and financing. Typically, these companies focus on one type of financing and derive their funding from capital markets. Also includes other non-institutional financial services.
notation: 141111
valid from: 2014-08-08

Financial Advisory Services
type: BicsLevel6Segment
type: Classifier
type: NamedIndividual
is level6 segment of: Investment Banking
replaces: Financial Advisory Services
created with: infer-bics.sql
derived from: Financial Advisory Services
  type: BicsLevel5Segment
  type: Classifier
  type: AnachronousDerivation
  derived from: http://data.ga-group.nl/ics/bics/2014/1413101010
  source accessed on: 2019-12-03T20:05:01Z
  source last accessed on: 2019-12-03T20:05:01Z
  definition: This segment includes companies in the investment banking industry that provide advice on corporate financial matters, including restructuring, merger and acquisitions, financial valuations and litigation.
  notation: 1413101010
  valid from: 2014-08-08
  valid till: 2020-10-03
derived from: Financial Advisory Services
  type: BicsLevel6Segment
  type: Classifier
  type: ContemporaryDerivation
  derived from: http://data.ga-group.nl/ics/bics/2020/141112101010
  derived from: http://data.ga-group.nl/ics/bics/2024/141112101010
  source accessed on: 2023-07-03T18:11:29Z
  source last accessed on: 2024-06-05T14:42:36Z
  definition: This segment includes companies that provide advice on corporate financial matters, including restructuring, mergers and acquisitions, financial valuations, and litigation.
  notation: 141112101010
  valid from: 2020-10-03
source accessed on: 2023-07-03T18:11:29Z
source last accessed on: 2024-06-05T14:42:36Z
definition: This segment includes companies that provide advice on corporate financial matters, including restructuring, mergers and acquisitions, financial valuations, and litigation.
notation: 141112101010
valid from: 2020-10-03

Debt Underwriting Services
type: BicsLevel7Segment
type: Classifier
type: NamedIndividual
is level7 segment of: Underwriting Services
replaces: Debt Underwriting Services
created with: infer-bics.sql
derived from: Debt Underwriting Services
  type: BicsLevel6Segment
  type: Classifier
  type: AnachronousDerivation
  derived from: http://data.ga-group.nl/ics/bics/2014/141310101110
  source accessed on: 2019-12-03T20:05:01Z
  source last accessed on: 2019-12-03T20:05:01Z
  definition: This segment includes companies in the investment banking industry that provide access to capital through the sale of debt securities.
  notation: 141310101110
  valid from: 2014-08-08
  valid till: 2020-10-03
derived from: Debt Underwriting Services
  type: BicsLevel7Segment
  type: Classifier
  type: ContemporaryDerivation
  derived from: http://data.ga-group.nl/ics/bics/2020/14111210101110
  derived from: http://data.ga-group.nl/ics/bics/2024/14111210101110
  source accessed on: 2023-07-03T18:11:29Z
  source last accessed on: 2024-06-05T14:42:36Z
  definition: This segment includes companies that provide access to capital through the sale of debt securities.
  notation: 14111210101110
  valid from: 2020-10-03
source accessed on: 2023-07-03T18:11:29Z
source last accessed on: 2024-06-05T14:42:36Z
definition: This segment includes companies that provide access to capital through the sale of debt securities.
notation: 14111210101110
valid from: 2020-10-03

Equity Underwriting Services
type: BicsLevel7Segment
type: Classifier
type: NamedIndividual
is level7 segment of: Underwriting Services
replaces: Equity Underwriting Services
created with: infer-bics.sql
derived from: Equity Underwriting Services
  type: BicsLevel6Segment
  type: Classifier
  type: AnachronousDerivation
  derived from: http://data.ga-group.nl/ics/bics/2014/141310101111
  source accessed on: 2019-12-03T20:05:01Z
  source last accessed on: 2019-12-03T20:05:01Z
  definition: This segment includes companies in the investment banking industry that provide access to capital through the sale of equity securities.
  notation: 141310101111
  valid from: 2014-08-08
  valid till: 2020-10-03
derived from: Equity Underwriting Services
  type: BicsLevel7Segment
  type: Classifier
  type: ContemporaryDerivation
  derived from: http://data.ga-group.nl/ics/bics/2020/14111210101111
  derived from: http://data.ga-group.nl/ics/bics/2024/14111210101111
  source accessed on: 2023-07-03T18:11:29Z
  source last accessed on: 2024-06-05T14:42:36Z
  definition: This segment includes companies that provide access to capital through the sale of equity securities.
  notation: 14111210101111
  valid from: 2020-10-03
source accessed on: 2023-07-03T18:11:29Z
source last accessed on: 2024-06-05T14:42:36Z
definition: This segment includes companies that provide access to capital through the sale of equity securities.
notation: 14111210101111
valid from: 2020-10-03

Underwriting Services
type: BicsLevel6Segment
type: Classifier
type: NamedIndividual
is level6 segment of: Investment Banking
replaces: Underwriting Services
created with: infer-bics.sql
derived from: Underwriting Services
  type: BicsLevel5Segment
  type: Classifier
  type: AnachronousDerivation
  derived from: http://data.ga-group.nl/ics/bics/2014/1413101011
  source accessed on: 2019-12-03T20:05:01Z
  source last accessed on: 2019-12-03T20:05:01Z
  definition: This segment includes companies in the investment banking industry that provide access to capital through the sale of debt and equity securities.
  notation: 1413101011
  valid from: 2014-08-08
  valid till: 2020-10-03
derived from: Underwriting Services
  type: BicsLevel6Segment
  type: Classifier
  type: ContemporaryDerivation
  derived from: http://data.ga-group.nl/ics/bics/2020/141112101011
  derived from: http://data.ga-group.nl/ics/bics/2024/141112101011
  source accessed on: 2023-07-03T18:11:29Z
  source last accessed on: 2024-06-05T14:42:36Z
  definition: This segment includes companies that provide access to capital through the sale of debt and equity securities.
  notation: 141112101011
  valid from: 2020-10-03
source accessed on: 2023-07-03T18:11:29Z
source last accessed on: 2024-06-05T14:42:36Z
definition: This segment includes companies that provide access to capital through the sale of debt and equity securities.
notation: 141112101011
valid from: 2020-10-03

Investment Banking
type: BicsLevel5Segment
type: Classifier
type: NamedIndividual
is level5 segment of: Institutional Brokerage
created with: infer-bics.sql
derived from: Investment Banking
  type: BicsLevel4SubIndustry
  type: Classifier
  type: AnachronousDerivation
  derived from: http://data.ga-group.nl/ics/bics/2014/14131010
  source accessed on: 2019-12-03T20:05:01Z
  source last accessed on: 2019-12-03T20:05:01Z
  definition: This industry subgroup includes companies that provide financial advisory and securities underwriting services on a fee basis.
  notation: 14131010
  valid from: 2014-08-08
  valid till: 2020-10-03
derived from: Investment Banking
  type: BicsLevel5Segment
  type: Classifier
  type: ContemporaryDerivation
  derived from: http://data.ga-group.nl/ics/bics/2020/1411121010
  derived from: http://data.ga-group.nl/ics/bics/2024/1411121010
  source accessed on: 2023-07-03T18:11:29Z
  source last accessed on: 2024-06-05T14:42:36Z
  definition: This segment includes companies that provide financial advisory and securities underwriting services on a fee basis.
  notation: 1411121010
  valid from: 2020-10-03
source accessed on: 2023-07-03T18:11:29Z
source last accessed on: 2024-06-05T14:42:36Z
definition: This segment includes companies that provide financial advisory and securities underwriting services on a fee basis.
notation: 1411121010
valid from: 2020-10-03

Commodities Brokerage
type: BicsLevel6Segment
type: Classifier
type: NamedIndividual
is level6 segment of: Security & Commodity Brokerage
replaces: Commodities Brokerage
created with: infer-bics.sql
derived from: Commodities Brokerage
  type: BicsLevel5Segment
  type: Classifier
  type: AnachronousDerivation
  derived from: http://data.ga-group.nl/ics/bics/2014/1413101110
  source accessed on: 2019-12-03T20:05:01Z
  source last accessed on: 2019-12-03T20:05:01Z
  definition: This segment includes companies that buy and sell commodity contracts and options on a commission or fee basis.
  notation: 1413101110
  valid from: 2014-08-08
  valid till: 2020-10-03
derived from: Commodities Brokerage
  type: BicsLevel6Segment
  type: Classifier
  type: ContemporaryDerivation
  derived from: http://data.ga-group.nl/ics/bics/2020/141112101110
  derived from: http://data.ga-group.nl/ics/bics/2024/141112101110
  source accessed on: 2023-07-03T18:11:29Z
  source last accessed on: 2024-06-05T14:42:36Z
  definition: This segment includes companies that facilitate the buying and selling of commodity contracts and options on a commission or fee basis.
  notation: 141112101110
  valid from: 2020-10-03
source accessed on: 2023-07-03T18:11:29Z
source last accessed on: 2024-06-05T14:42:36Z
definition: This segment includes companies that facilitate the buying and selling of commodity contracts and options on a commission or fee basis.
notation: 141112101110
valid from: 2020-10-03

Instl Securities Brokerage
type: BicsLevel6Segment
type: Classifier
type: NamedIndividual
is level6 segment of: Security & Commodity Brokerage
replaces: Instl Securities Brokerage
created with: infer-bics.sql
derived from: Instl Securities Brokerage
  type: BicsLevel5Segment
  type: Classifier
  type: AnachronousDerivation
  derived from: http://data.ga-group.nl/ics/bics/2014/1413101111
  source accessed on: 2019-12-03T20:05:01Z
  source last accessed on: 2019-12-03T20:05:01Z
  definition: This segment includes companies that buy and sell securities for institutional investors on a commission or fee basis.
  notation: 1413101111
  valid from: 2014-08-08
  valid till: 2020-10-03
derived from: Instl Securities Brokerage
  type: BicsLevel6Segment
  type: Classifier
  type: ContemporaryDerivation
  derived from: http://data.ga-group.nl/ics/bics/2020/141112101111
  derived from: http://data.ga-group.nl/ics/bics/2024/141112101111
  source accessed on: 2023-07-03T18:11:29Z
  source last accessed on: 2024-06-05T14:42:36Z
  definition: This segment includes companies that facilitate the buying and selling of non-commodity securities on a commission or fee basis.
  notation: 141112101111
  valid from: 2020-10-03
source accessed on: 2023-07-03T18:11:29Z
source last accessed on: 2024-06-05T14:42:36Z
definition: This segment includes companies that facilitate the buying and selling of non-commodity securities on a commission or fee basis.
notation: 141112101111
valid from: 2020-10-03

Security & Commodity Brokerage
type: BicsLevel5Segment
type: Classifier
type: NamedIndividual
is level5 segment of: Institutional Brokerage
created with: infer-bics.sql
derived from: Security & Commodity Brokerage
  type: BicsLevel4SubIndustry
  type: Classifier
  type: AnachronousDerivation
  derived from: http://data.ga-group.nl/ics/bics/2014/14131011
  source accessed on: 2019-12-03T20:05:01Z
  source last accessed on: 2019-12-03T20:05:01Z
  definition: This industry subgroup includes companies that buy and sell securities or commodities contracts and options on a commission or fee basis.
  notation: 14131011
  valid from: 2014-08-08
  valid till: 2020-10-03
derived from: Security & Commodity Brokerage
  type: BicsLevel5Segment
  type: Classifier
  type: ContemporaryDerivation
  derived from: http://data.ga-group.nl/ics/bics/2020/1411121011
  derived from: http://data.ga-group.nl/ics/bics/2024/1411121011
  source accessed on: 2023-07-03T18:11:29Z
  source last accessed on: 2024-06-05T14:42:36Z
  definition: This segment includes companies that facilitate the buying and selling of securities on a commission or fee per basis.
  notation: 1411121011
  valid from: 2020-10-03
source accessed on: 2023-07-03T18:11:29Z
source last accessed on: 2024-06-05T14:42:36Z
definition: This segment includes companies that facilitate the buying and selling of securities on a commission or fee per basis.
notation: 1411121011
valid from: 2020-10-03

Equities Trading
type: BicsLevel6Segment
type: Classifier
type: NamedIndividual
is level6 segment of: Trading & Principal Investment
replaces: Equities Trading
created with: infer-bics.sql
derived from: Equities Trading
  type: BicsLevel5Segment
  type: Classifier
  type: AnachronousDerivation
  derived from: http://data.ga-group.nl/ics/bics/2014/1413101210
  source accessed on: 2019-12-03T20:05:01Z
  source last accessed on: 2019-12-03T20:05:01Z
  definition: This segment includes companies that buy and sell equity securities for market-making, and provide specialist activities, in addition to trading their own principal investments.
  notation: 1413101210
  valid from: 2014-08-08
  valid till: 2020-10-03
derived from: Equities Trading
  type: BicsLevel6Segment
  type: Classifier
  type: ContemporaryDerivation
  derived from: http://data.ga-group.nl/ics/bics/2020/141112101210
  derived from: http://data.ga-group.nl/ics/bics/2024/141112101210
  source accessed on: 2023-07-03T18:11:29Z
  source last accessed on: 2024-06-05T14:42:36Z
  definition: This segment includes companies that buy and sell equity securities for market-making, provide specialist activities, and trade their own principal investments.
  notation: 141112101210
  valid from: 2020-10-03
source accessed on: 2023-07-03T18:11:29Z
source last accessed on: 2024-06-05T14:42:36Z
definition: This segment includes companies that buy and sell equity securities for market-making, provide specialist activities, and trade their own principal investments.
notation: 141112101210
valid from: 2020-10-03

Commodities Contract Dealing
type: BicsLevel6Segment
type: Classifier
type: NamedIndividual
is level6 segment of: Trading & Principal Investment
replaces: Commodities Contract Dealing
created with: infer-bics.sql
derived from: Commodities Contract Dealing
  type: BicsLevel6Segment
  type: Classifier
  type: AnachronousDerivation
  derived from: http://data.ga-group.nl/ics/bics/2014/141310121110
  source accessed on: 2019-12-03T20:05:01Z
  source last accessed on: 2019-12-03T20:05:01Z
  definition: This segment includes companies that buy and sell commodities and commodity-related securities for client-driven and proprietary trading.
  notation: 141310121110
  valid from: 2014-08-08
  valid till: 2020-10-03
derived from: Commodities Contract Dealing
  type: BicsLevel6Segment
  type: Classifier
  type: ContemporaryDerivation
  derived from: http://data.ga-group.nl/ics/bics/2020/141112101211
  derived from: http://data.ga-group.nl/ics/bics/2024/141112101211
  source accessed on: 2023-07-03T18:11:29Z
  source last accessed on: 2024-06-05T14:42:36Z
  definition: This segment includes companies that buy and sell commodities and commodity-related securities for client-driven and proprietary trading.
  notation: 141112101211
  valid from: 2020-10-03
source accessed on: 2023-07-03T18:11:29Z
source last accessed on: 2024-06-05T14:42:36Z
definition: This segment includes companies that buy and sell commodities and commodity-related securities for client-driven and proprietary trading.
notation: 141112101211
valid from: 2020-10-03

Currencies Trading
type: BicsLevel6Segment
type: Classifier
type: NamedIndividual
is level6 segment of: Trading & Principal Investment
replaces: Currencies Trading
created with: infer-bics.sql
derived from: Currencies Trading
  type: BicsLevel6Segment
  type: Classifier
  type: AnachronousDerivation
  derived from: http://data.ga-group.nl/ics/bics/2014/141310121111
  source accessed on: 2019-12-03T20:05:01Z
  source last accessed on: 2019-12-03T20:05:01Z
  definition: This segment includes companies that buy and sell currencies in the cash and derivatives markets for client-driven and proprietary trading.
  notation: 141310121111
  valid from: 2014-08-08
  valid till: 2020-10-03
derived from: Currencies Trading
  type: BicsLevel6Segment
  type: Classifier
  type: ContemporaryDerivation
  derived from: http://data.ga-group.nl/ics/bics/2020/141112101212
  derived from: http://data.ga-group.nl/ics/bics/2024/141112101212
  source accessed on: 2023-07-03T18:11:29Z
  source last accessed on: 2024-06-05T14:42:36Z
  definition: This segment includes companies that buy and sell currencies in the cash and derivatives markets for client-driven and proprietary trading.
  notation: 141112101212
  valid from: 2020-10-03
source accessed on: 2023-07-03T18:11:29Z
source last accessed on: 2024-06-05T14:42:36Z
definition: This segment includes companies that buy and sell currencies in the cash and derivatives markets for client-driven and proprietary trading.
notation: 141112101212
valid from: 2020-10-03

Fixed Income Trading
type: BicsLevel6Segment
type: Classifier
type: NamedIndividual
is level6 segment of: Trading & Principal Investment
replaces: Fixed Income Trading
created with: infer-bics.sql
derived from: Fixed Income Trading
  type: BicsLevel6Segment
  type: Classifier
  type: AnachronousDerivation
  derived from: http://data.ga-group.nl/ics/bics/2014/141310121112
  source accessed on: 2019-12-03T20:05:01Z
  source last accessed on: 2019-12-03T20:05:01Z
  definition: This segment includes companies that buy and sell fixed income securities and other interest rate products for client-driven and proprietary trading.
  notation: 141310121112
  valid from: 2014-08-08
  valid till: 2020-10-03
derived from: Fixed Income Trading
  type: BicsLevel6Segment
  type: Classifier
  type: ContemporaryDerivation
  derived from: http://data.ga-group.nl/ics/bics/2020/141112101213
  derived from: http://data.ga-group.nl/ics/bics/2024/141112101213
  source accessed on: 2023-07-03T18:11:29Z
  source last accessed on: 2024-06-05T14:42:36Z
  definition: This segment includes companies that buy and sell fixed income securities and other interest rate products for client-driven and proprietary trading.
  notation: 141112101213
  valid from: 2020-10-03
source accessed on: 2023-07-03T18:11:29Z
source last accessed on: 2024-06-05T14:42:36Z
definition: This segment includes companies that buy and sell fixed income securities and other interest rate products for client-driven and proprietary trading.
notation: 141112101213
valid from: 2020-10-03

Trading & Principal Investment
type: BicsLevel5Segment
type: Classifier
type: NamedIndividual
is level5 segment of: Institutional Brokerage
created with: infer-bics.sql
derived from: Trading & Principal Investment
  type: BicsLevel4SubIndustry
  type: Classifier
  type: AnachronousDerivation
  derived from: http://data.ga-group.nl/ics/bics/2014/14131012
  source accessed on: 2019-12-03T20:05:01Z
  source last accessed on: 2019-12-03T20:05:01Z
  definition: This industry subgroup includes companies that buy and sell equities, fixed income, currencies, commodities and related securities for client-driven and proprietary trading.
  notation: 14131012
  valid from: 2014-08-08
  valid till: 2020-10-03
derived from: Trading & Principal Investment
  type: BicsLevel5Segment
  type: Classifier
  type: ContemporaryDerivation
  derived from: http://data.ga-group.nl/ics/bics/2020/1411121012
  derived from: http://data.ga-group.nl/ics/bics/2024/1411121012
  source accessed on: 2023-07-03T18:11:29Z
  source last accessed on: 2024-06-05T14:42:36Z
  definition: This segment includes companies that buy and sell equities, fixed income, currencies, commodities, and related securities for client-driven and proprietary trading.
  notation: 1411121012
  valid from: 2020-10-03
source accessed on: 2023-07-03T18:11:29Z
source last accessed on: 2024-06-05T14:42:36Z
definition: This segment includes companies that buy and sell equities, fixed income, currencies, commodities, and related securities for client-driven and proprietary trading.
notation: 1411121012
valid from: 2020-10-03

Institutional Brokerage
type: BicsLevel4SubIndustry
type: Classifier
type: NamedIndividual
replaces: Institutional Brokerage
created with: infer-bics.sql
derived from: Institutional Brokerage
  type: BicsLevel3Industry
  type: Classifier
  type: AnachronousDerivation
  derived from: http://data.ga-group.nl/ics/bics/2014/141310
  source accessed on: 2019-12-03T20:05:01Z
  source last accessed on: 2019-12-03T20:05:01Z
  definition: This industry includes companies that provide brokerage services to institutional investors. Institutional investors buy or sell securities on behalf of organizations, such as banks, insurance companies, hedge funds, pension funds and mutual funds.
  notation: 141310
  valid from: 2014-08-08
  valid till: 2020-10-03
derived from: Institutional Brokerage
  type: BicsLevel4SubIndustry
  type: Classifier
  type: ContemporaryDerivation
  derived from: http://data.ga-group.nl/ics/bics/2020/14111210
  derived from: http://data.ga-group.nl/ics/bics/2024/14111210
  source accessed on: 2023-07-03T18:11:29Z
  source last accessed on: 2024-06-05T14:42:36Z
  definition: This industry subgroup includes companies that provide brokerage services to institutional investors. These companies buy or sell securities on behalf of organizations, such as banks, insurance companies, hedge funds, pension funds, and mutual funds. Includes companies that provide financial advice and/or underwriting for corporations and governments.
  notation: 14111210
  valid from: 2020-10-03
source accessed on: 2023-07-03T18:11:29Z
source last accessed on: 2024-06-05T14:42:36Z
definition: This industry subgroup includes companies that provide brokerage services to institutional investors. These companies buy or sell securities on behalf of organizations, such as banks, insurance companies, hedge funds, pension funds, and mutual funds. Includes companies that provide financial advice and/or underwriting for corporations and governments.
notation: 14111210
valid from: 2020-10-03

Asset & Investment Servicing
type: BicsLevel5Segment
type: Classifier
type: NamedIndividual
is level5 segment of: Instl Trust, Fiduciary & Custody
created with: infer-bics.sql
derived from: Asset & Investment Servicing
  type: BicsLevel4SubIndustry
  type: Classifier
  type: AnachronousDerivation
  derived from: http://data.ga-group.nl/ics/bics/2014/14131110
  source accessed on: 2019-12-03T20:05:01Z
  source last accessed on: 2019-12-03T20:05:01Z
  definition: This industry subgroup includes companies that provide investment and other asset services on a fee basis.
  notation: 14131110
  valid from: 2014-08-08
  valid till: 2020-10-03
derived from: Asset & Investment Servicing
  type: BicsLevel5Segment
  type: Classifier
  type: ContemporaryDerivation
  derived from: http://data.ga-group.nl/ics/bics/2020/1411121110
  derived from: http://data.ga-group.nl/ics/bics/2024/1411121110
  source accessed on: 2023-07-03T18:11:29Z
  source last accessed on: 2024-06-05T14:42:36Z
  definition: This segment includes companies that provide investment and other asset services on a fee basis and fund administration.
  notation: 1411121110
  valid from: 2020-10-03
source accessed on: 2023-07-03T18:11:29Z
source last accessed on: 2024-06-05T14:42:36Z
definition: This segment includes companies that provide investment and other asset services on a fee basis and fund administration.
notation: 1411121110
valid from: 2020-10-03

Execution & Clearing Services
type: BicsLevel5Segment
type: Classifier
type: NamedIndividual
is level5 segment of: Instl Trust, Fiduciary & Custody
created with: infer-bics.sql
derived from: Execution & Clearing Services
  type: BicsLevel4SubIndustry
  type: Classifier
  type: AnachronousDerivation
  derived from: http://data.ga-group.nl/ics/bics/2014/14131111
  source accessed on: 2019-12-03T20:05:01Z
  source last accessed on: 2019-12-03T20:05:01Z
  definition: This industry subgroup includes companies that provide trade execution and clearance services on a fee basis.
  notation: 14131111
  valid from: 2014-08-08
  valid till: 2020-10-03
derived from: Execution & Clearing Services
  type: BicsLevel5Segment
  type: Classifier
  type: ContemporaryDerivation
  derived from: http://data.ga-group.nl/ics/bics/2020/1411121111
  derived from: http://data.ga-group.nl/ics/bics/2024/1411121111
  source accessed on: 2023-07-03T18:11:29Z
  source last accessed on: 2024-06-05T14:42:36Z
  definition: This segment includes companies that provide trade execution and clearance services on a fee basis.
  notation: 1411121111
  valid from: 2020-10-03
source accessed on: 2023-07-03T18:11:29Z
source last accessed on: 2024-06-05T14:42:36Z
definition: This segment includes companies that provide trade execution and clearance services on a fee basis.
notation: 1411121111
valid from: 2020-10-03

Issuer Services
type: BicsLevel5Segment
type: Classifier
type: NamedIndividual
is level5 segment of: Instl Trust, Fiduciary & Custody
created with: infer-bics.sql
derived from: Issuer Services
  type: BicsLevel4SubIndustry
  type: Classifier
  type: AnachronousDerivation
  derived from: http://data.ga-group.nl/ics/bics/2014/14131112
  source accessed on: 2019-12-03T20:05:01Z
  source last accessed on: 2019-12-03T20:05:01Z
  definition: This industry subgroup includes companies that provide securities issuance and related services on a fee basis.
  notation: 14131112
  valid from: 2014-08-08
  valid till: 2020-10-03
derived from: Issuer Services
  type: BicsLevel5Segment
  type: Classifier
  type: ContemporaryDerivation
  derived from: http://data.ga-group.nl/ics/bics/2020/1411121112
  derived from: http://data.ga-group.nl/ics/bics/2024/1411121112
  source accessed on: 2023-07-03T18:11:29Z
  source last accessed on: 2024-06-05T14:42:36Z
  definition: This segment includes companies that provide securities issuance and related services on a fee basis.
  notation: 1411121112
  valid from: 2020-10-03
source accessed on: 2023-07-03T18:11:29Z
source last accessed on: 2024-06-05T14:42:36Z
definition: This segment includes companies that provide securities issuance and related services on a fee basis.
notation: 1411121112
valid from: 2020-10-03

Transaction Services
type: BicsLevel5Segment
type: Classifier
type: NamedIndividual
is level5 segment of: Instl Trust, Fiduciary & Custody
created with: infer-bics.sql
derived from: Transaction Services
  type: BicsLevel4SubIndustry
  type: Classifier
  type: AnachronousDerivation
  derived from: http://data.ga-group.nl/ics/bics/2014/14131113
  source accessed on: 2019-12-03T20:05:01Z
  source last accessed on: 2019-12-03T20:05:01Z
  definition: This industry subgroup includes companies that provide cash management, funds transfer or liquidity management services on a fee basis.
  notation: 14131113
  valid from: 2014-08-08
  valid till: 2020-10-03
derived from: Transaction Services
  type: BicsLevel5Segment
  type: Classifier
  type: ContemporaryDerivation
  derived from: http://data.ga-group.nl/ics/bics/2020/1411121113
  derived from: http://data.ga-group.nl/ics/bics/2024/1411121113
  source accessed on: 2023-07-03T18:11:29Z
  source last accessed on: 2024-06-05T14:42:36Z
  definition: This segment includes companies that provide cash management, funds transfer, or liquidity management services on a fee basis.
  notation: 1411121113
  valid from: 2020-10-03
source accessed on: 2023-07-03T18:11:29Z
source last accessed on: 2024-06-05T14:42:36Z
definition: This segment includes companies that provide cash management, funds transfer, or liquidity management services on a fee basis.
notation: 1411121113
valid from: 2020-10-03

Instl Trust, Fiduciary & Custody
type: BicsLevel4SubIndustry
type: Classifier
type: NamedIndividual
replaces: Instl Trust, Fiduciary & Custody
created with: infer-bics.sql
derived from: Instl Trust, Fiduciary & Custody
  type: BicsLevel3Industry
  type: Classifier
  type: AnachronousDerivation
  derived from: http://data.ga-group.nl/ics/bics/2014/141311
  source accessed on: 2019-12-03T20:05:01Z
  source last accessed on: 2019-12-03T20:05:01Z
  definition: This industry includes companies that are authorized to hold assets in trust and provide services for registering securities and transferring ownership.
  notation: 141311
  valid from: 2014-08-08
  valid till: 2020-10-03
derived from: Instl Trust, Fiduciary & Custody
  type: BicsLevel4SubIndustry
  type: Classifier
  type: ContemporaryDerivation
  derived from: http://data.ga-group.nl/ics/bics/2020/14111211
  derived from: http://data.ga-group.nl/ics/bics/2024/14111211
  source accessed on: 2023-07-03T18:11:29Z
  source last accessed on: 2024-06-05T14:42:36Z
  definition: This industry subgroup includes companies that are authorized to hold assets in trust and provide services for registering securities and transferring ownership.
  notation: 14111211
  valid from: 2020-10-03
source accessed on: 2023-07-03T18:11:29Z
source last accessed on: 2024-06-05T14:42:36Z
definition: This industry subgroup includes companies that are authorized to hold assets in trust and provide services for registering securities and transferring ownership.
notation: 14111211
valid from: 2020-10-03

Security & Cmdty Exchanges
type: BicsLevel4SubIndustry
type: Classifier
type: NamedIndividual
replaces: Security & Cmdty Exchanges
created with: infer-bics.sql
derived from: Security & Cmdty Exchanges
  type: BicsLevel3Industry
  type: Classifier
  type: AnachronousDerivation
  derived from: http://data.ga-group.nl/ics/bics/2014/141312
  source accessed on: 2019-12-03T20:05:01Z
  source last accessed on: 2019-12-03T20:05:01Z
  definition: This industry includes firms that operate a marketplace for the buying and selling of securities, commodities or other financial instruments.
  notation: 141312
  valid from: 2014-08-08
  valid till: 2020-10-03
derived from: Security & Cmdty Exchanges
  type: BicsLevel4SubIndustry
  type: Classifier
  type: ContemporaryDerivation
  derived from: http://data.ga-group.nl/ics/bics/2020/14111212
  derived from: http://data.ga-group.nl/ics/bics/2024/14111212
  source accessed on: 2023-07-03T18:11:29Z
  source last accessed on: 2024-06-05T14:42:36Z
  definition: This industry subgroup includes firms that operate a marketplace for the buying and selling of securities, commodities, or other financial instruments.
  notation: 14111212
  valid from: 2020-10-03
source accessed on: 2023-07-03T18:11:29Z
source last accessed on: 2024-06-05T14:42:36Z
definition: This industry subgroup includes firms that operate a marketplace for the buying and selling of securities, commodities, or other financial instruments.
notation: 14111212
valid from: 2020-10-03

Institutional Financial Svcs
type: BicsLevel3Industry
type: Classifier
type: NamedIndividual
is industry of: Financial Services
replaces: Institutional Financial Svcs
created with: infer-bics.sql
derived from: Institutional Financial Svcs
  type: BicsLevel2IndustryGroup
  type: Classifier
  type: AnachronousDerivation
  derived from: http://data.ga-group.nl/ics/bics/2014/1413
  source accessed on: 2019-12-03T20:05:01Z
  source last accessed on: 2019-12-03T20:05:01Z
  definition: This industry group includes companies that provide investment banking and institutional brokerage services or are involved in the buying and selling of equities, fixed income, currencies, commodities and related securities for client-driven and proprietary trading.
  notation: 1413
  valid from: 2014-08-08
  valid till: 2020-10-03
derived from: Institutional Financial Svcs
  type: BicsLevel3Industry
  type: Classifier
  type: ContemporaryDerivation
  derived from: http://data.ga-group.nl/ics/bics/2020/141112
  derived from: http://data.ga-group.nl/ics/bics/2024/141112
  source accessed on: 2023-07-03T18:11:29Z
  source last accessed on: 2024-06-05T14:42:36Z
  definition: This industry includes companies that provide financial services primarily for large financial institutions, corporations, or governments.
  notation: 141112
  valid from: 2020-10-03
source accessed on: 2023-07-03T18:11:29Z
source last accessed on: 2024-06-05T14:42:36Z
definition: This industry includes companies that provide financial services primarily for large financial institutions, corporations, or governments.
notation: 141112
valid from: 2020-10-03

Financial Services
type: BicsLevel2IndustryGroup
type: Classifier
type: NamedIndividual
is industry group of: Financials
is replaced by: Banking
created with: infer-bics.sql
derived from: Banking
  type: BicsLevel2IndustryGroup
  type: Classifier
  type: ContemporaryDerivation
  derived from: http://data.ga-group.nl/ics/bics/2014/1411
  source accessed on: 2019-12-03T20:05:01Z
  source last accessed on: 2019-12-03T20:05:01Z
  definition: This industry group includes companies that accept deposits and make loans to corporations and individuals through either a commercial banking or savings bank structure.
  notation: 1411
  valid from: 2014-08-08
  valid till: 2020-10-03
derived from: Financial Services
  type: BicsLevel2IndustryGroup
  type: Classifier
  type: ContemporaryDerivation
  derived from: http://data.ga-group.nl/ics/bics/2020/1411
  derived from: http://data.ga-group.nl/ics/bics/2024/1411
  source accessed on: 2023-07-03T18:11:29Z
  source last accessed on: 2024-06-05T14:42:36Z
  definition: This industry group includes companies that provide services which focuses on the growth or transaction of money and assets.
  notation: 1411
  valid from: 2020-10-03
source accessed on: 2019-12-03T20:05:01Z
source last accessed on: 2024-06-05T14:42:36Z
definition: This industry group includes companies that provide services which focuses on the growth or transaction of money and assets.
notation: 1411
valid from: 2014-08-08

Protection Prods Premiums
type: BicsLevel6Segment
type: Classifier
type: NamedIndividual
is level6 segment of: Life Insurance Premiums
replaces: Protection Prods Premiums
created with: infer-bics.sql
derived from: Protection Prods Premiums
  type: BicsLevel5Segment
  type: Classifier
  type: AnachronousDerivation
  derived from: http://data.ga-group.nl/ics/bics/2014/1414101010
  source accessed on: 2019-12-03T20:05:01Z
  source last accessed on: 2019-12-03T20:05:01Z
  definition: This segment includes premium income generated from life insurance protection products, including individual and group life, accidental death, and disability policies.
  notation: 1414101010
  valid from: 2014-08-08
  valid till: 2020-10-03
derived from: Protection Prods Premiums
  type: BicsLevel6Segment
  type: Classifier
  type: ContemporaryDerivation
  derived from: http://data.ga-group.nl/ics/bics/2020/141210101010
  derived from: http://data.ga-group.nl/ics/bics/2024/141210101010
  source accessed on: 2023-07-03T18:11:29Z
  source last accessed on: 2024-06-05T14:42:36Z
  definition: This segment includes premium income generated from life insurance protection products, including individual and group life, accidental death, and disability policies.
  notation: 141210101010
  valid from: 2020-10-03
source accessed on: 2023-07-03T18:11:29Z
source last accessed on: 2024-06-05T14:42:36Z
definition: This segment includes premium income generated from life insurance protection products, including individual and group life, accidental death, and disability policies.
notation: 141210101010
valid from: 2020-10-03

Saving & Retire Prods Premiums
type: BicsLevel6Segment
type: Classifier
type: NamedIndividual
is level6 segment of: Life Insurance Premiums
replaces: Saving & Retire Prods Premiums
created with: infer-bics.sql
derived from: Saving & Retire Prods Premiums
  type: BicsLevel5Segment
  type: Classifier
  type: AnachronousDerivation
  derived from: http://data.ga-group.nl/ics/bics/2014/1414101011
  source accessed on: 2019-12-03T20:05:01Z
  source last accessed on: 2019-12-03T20:05:01Z
  definition: This segment includes premium income generated from life insurance savings and retirement products, including individual and group fixed and variable annuities.
  notation: 1414101011
  valid from: 2014-08-08
  valid till: 2020-10-03
derived from: Saving & Retire Prods Premiums
  type: BicsLevel6Segment
  type: Classifier
  type: ContemporaryDerivation
  derived from: http://data.ga-group.nl/ics/bics/2020/141210101011
  derived from: http://data.ga-group.nl/ics/bics/2024/141210101011
  source accessed on: 2023-07-03T18:11:29Z
  source last accessed on: 2024-06-05T14:42:36Z
  definition: This segment includes premium income generated from individual or group life insurance savings and retirement products or fixed and variable annuities.
  notation: 141210101011
  valid from: 2020-10-03
source accessed on: 2023-07-03T18:11:29Z
source last accessed on: 2024-06-05T14:42:36Z
definition: This segment includes premium income generated from individual or group life insurance savings and retirement products or fixed and variable annuities.
notation: 141210101011
valid from: 2020-10-03

Life Insurance Premiums
type: BicsLevel5Segment
type: Classifier
type: NamedIndividual
is level5 segment of: Life Insurance
is replaced by: General Equip Finance & Leasing
created with: infer-bics.sql
derived from: General Equip Finance & Leasing
  type: BicsLevel5Segment
  type: Classifier
  type: ContemporaryDerivation
  derived from: http://data.ga-group.nl/ics/bics/2014/1412101010
  source accessed on: 2019-12-03T20:05:01Z
  source last accessed on: 2019-12-03T20:05:01Z
  definition: This segment includes companies that finance or lease general equipment. In such a situation, a contractual agreement is established and usually reached through a dealer.
  notation: 1412101010
  valid from: 2014-08-08
  valid till: 2020-10-03
derived from: Life Insurance Premiums
  type: BicsLevel4SubIndustry
  type: Classifier
  type: AnachronousDerivation
  derived from: http://data.ga-group.nl/ics/bics/2014/14141010
  source accessed on: 2019-12-03T20:05:01Z
  source last accessed on: 2019-12-03T20:05:01Z
  definition: This industry subgroup includes premium income generated from life insurance products, including life, accidental death, disability and annuities.
  notation: 14141010
  valid from: 2014-08-08
  valid till: 2020-10-03
derived from: Life Insurance Premiums
  type: BicsLevel5Segment
  type: Classifier
  type: ContemporaryDerivation
  derived from: http://data.ga-group.nl/ics/bics/2020/1412101010
  derived from: http://data.ga-group.nl/ics/bics/2024/1412101010
  source accessed on: 2023-07-03T18:11:29Z
  source last accessed on: 2024-06-05T14:42:36Z
  definition: This segment includes premium income generated from life insurance products, including life, accidental death, disability, and annuities.
  notation: 1412101010
  valid from: 2020-10-03
source accessed on: 2019-12-03T20:05:01Z
source last accessed on: 2024-06-05T14:42:36Z
definition: This segment includes premium income generated from life insurance products, including life, accidental death, disability, and annuities.
notation: 1412101010
valid from: 2014-08-08

Investment Income - Life Ins
type: BicsLevel6Segment
type: Classifier
type: NamedIndividual
is level6 segment of: Life Insurance Non-Premium
replaces: Investment Income - Life Ins
created with: infer-bics.sql
derived from: Investment Income - Life Ins
  type: BicsLevel5Segment
  type: Classifier
  type: AnachronousDerivation
  derived from: http://data.ga-group.nl/ics/bics/2014/1414101111
  source accessed on: 2019-12-03T20:05:01Z
  source last accessed on: 2019-12-03T20:05:01Z
  definition: This segment includes investment income generated from direct life business.
  notation: 1414101111
  valid from: 2014-08-08
  valid till: 2020-10-03
derived from: Investment Income - Life Ins
  type: BicsLevel6Segment
  type: Classifier
  type: ContemporaryDerivation
  derived from: http://data.ga-group.nl/ics/bics/2020/141210101110
  derived from: http://data.ga-group.nl/ics/bics/2024/141210101110
  source accessed on: 2023-07-03T18:11:29Z
  source last accessed on: 2024-06-05T14:42:36Z
  definition: This segment includes investment income generated from direct life insurance.
  notation: 141210101110
  valid from: 2020-10-03
source accessed on: 2023-07-03T18:11:29Z
source last accessed on: 2024-06-05T14:42:36Z
definition: This segment includes investment income generated from direct life insurance.
notation: 141210101110
valid from: 2020-10-03

Invst Inc - Protection Prods
type: BicsLevel7Segment
type: Classifier
type: NamedIndividual
is level7 segment of: Protect Prods Non-Premium
replaces: Invst Inc - Protection Prods
created with: infer-bics.sql
derived from: Invst Inc - Protection Prods
  type: BicsLevel6Segment
  type: Classifier
  type: AnachronousDerivation
  derived from: http://data.ga-group.nl/ics/bics/2014/141410111211
  source accessed on: 2019-12-03T20:05:01Z
  source last accessed on: 2019-12-03T20:05:01Z
  definition: This segment includes investment income generated from life insurance protection products, including individual and group life, accidental death, and disability policies.
  notation: 141410111211
  valid from: 2014-08-08
  valid till: 2020-10-03
derived from: Invst Inc - Protection Prods
  type: BicsLevel7Segment
  type: Classifier
  type: ContemporaryDerivation
  derived from: http://data.ga-group.nl/ics/bics/2020/14121010111110
  derived from: http://data.ga-group.nl/ics/bics/2024/14121010111110
  source accessed on: 2023-07-03T18:11:29Z
  source last accessed on: 2024-06-05T14:42:36Z
  definition: This segment includes investment income generated from life insurance protection products, including individual and group life, accidental death, and disability policies.
  notation: 14121010111110
  valid from: 2020-10-03
source accessed on: 2023-07-03T18:11:29Z
source last accessed on: 2024-06-05T14:42:36Z
definition: This segment includes investment income generated from life insurance protection products, including individual and group life, accidental death, and disability policies.
notation: 14121010111110
valid from: 2020-10-03

Realized G/L - Protection Prods
type: BicsLevel7Segment
type: Classifier
type: NamedIndividual
is level7 segment of: Protect Prods Non-Premium
replaces: Realized G/L - Protection Prods
created with: infer-bics.sql
derived from: Realized G/L - Protection Prods
  type: BicsLevel6Segment
  type: Classifier
  type: AnachronousDerivation
  derived from: http://data.ga-group.nl/ics/bics/2014/141410111212
  source accessed on: 2019-12-03T20:05:01Z
  source last accessed on: 2019-12-03T20:05:01Z
  definition: This segment includes realized gains/losses generated from life insurance protection products, including individual and group life, accidental death, and disability policies.
  notation: 141410111212
  valid from: 2014-08-08
  valid till: 2020-10-03
derived from: Realized G/L - Protection Prods
  type: BicsLevel7Segment
  type: Classifier
  type: ContemporaryDerivation
  derived from: http://data.ga-group.nl/ics/bics/2020/14121010111111
  derived from: http://data.ga-group.nl/ics/bics/2024/14121010111111
  source accessed on: 2023-07-03T18:11:29Z
  source last accessed on: 2024-06-05T14:42:36Z
  definition: This segment includes realized gains/losses generated from life insurance protection products, including individual and group life, accidental death, and disability policies.
  notation: 14121010111111
  valid from: 2020-10-03
source accessed on: 2023-07-03T18:11:29Z
source last accessed on: 2024-06-05T14:42:36Z
definition: This segment includes realized gains/losses generated from life insurance protection products, including individual and group life, accidental death, and disability policies.
notation: 14121010111111
valid from: 2020-10-03

Fees & Other Inc - Protect Prods
type: BicsLevel7Segment
type: Classifier
type: NamedIndividual
is level7 segment of: Protect Prods Non-Premium
replaces: Fees & Other Inc - Protect Prods
created with: infer-bics.sql
derived from: Fees & Other Inc - Protect Prods
  type: BicsLevel6Segment
  type: Classifier
  type: AnachronousDerivation
  derived from: http://data.ga-group.nl/ics/bics/2014/141410111210
  source accessed on: 2019-12-03T20:05:01Z
  source last accessed on: 2019-12-03T20:05:01Z
  definition: This segment includes fees and other non-premium income generated from life insurance protection products, including individual and group life, accidental death, and disability policies.
  notation: 141410111210
  valid from: 2014-08-08
  valid till: 2020-10-03
derived from: Fees & Other Inc - Protect Prods
  type: BicsLevel7Segment
  type: Classifier
  type: ContemporaryDerivation
  derived from: http://data.ga-group.nl/ics/bics/2020/14121010111112
  derived from: http://data.ga-group.nl/ics/bics/2024/14121010111112
  source accessed on: 2023-07-03T18:11:29Z
  source last accessed on: 2024-06-05T14:42:36Z
  definition: This segment includes fees and other non-premium income generated from life insurance protection products, including individual and group life, accidental death, and disability policies.
  notation: 14121010111112
  valid from: 2020-10-03
source accessed on: 2023-07-03T18:11:29Z
source last accessed on: 2024-06-05T14:42:36Z
definition: This segment includes fees and other non-premium income generated from life insurance protection products, including individual and group life, accidental death, and disability policies.
notation: 14121010111112
valid from: 2020-10-03

Protect Prods Non-Premium
type: BicsLevel6Segment
type: Classifier
type: NamedIndividual
is level6 segment of: Life Insurance Non-Premium
replaces: Protect Prods Non-Premium
created with: infer-bics.sql
derived from: Protect Prods Non-Premium
  type: BicsLevel5Segment
  type: Classifier
  type: AnachronousDerivation
  derived from: http://data.ga-group.nl/ics/bics/2014/1414101112
  source accessed on: 2019-12-03T20:05:01Z
  source last accessed on: 2019-12-03T20:05:01Z
  definition: This segment includes non-premium income generated from life insurance protection products, including individual and group life, accidental death, and disability policies.
  notation: 1414101112
  valid from: 2014-08-08
  valid till: 2020-10-03
derived from: Protect Prods Non-Premium
  type: BicsLevel6Segment
  type: Classifier
  type: ContemporaryDerivation
  derived from: http://data.ga-group.nl/ics/bics/2020/141210101111
  derived from: http://data.ga-group.nl/ics/bics/2024/141210101111
  source accessed on: 2023-07-03T18:11:29Z
  source last accessed on: 2024-06-05T14:42:36Z
  definition: This segment includes non-premium income generated from life insurance protection products, including individual and group life, accidental death, and disability policies.
  notation: 141210101111
  valid from: 2020-10-03
source accessed on: 2023-07-03T18:11:29Z
source last accessed on: 2024-06-05T14:42:36Z
definition: This segment includes non-premium income generated from life insurance protection products, including individual and group life, accidental death, and disability policies.
notation: 141210101111
valid from: 2020-10-03

Realized G/L - Life Insurance
type: BicsLevel6Segment
type: Classifier
type: NamedIndividual
is level6 segment of: Life Insurance Non-Premium
replaces: Realized G/L - Life Insurance
created with: infer-bics.sql
derived from: Realized G/L - Life Insurance
  type: BicsLevel5Segment
  type: Classifier
  type: AnachronousDerivation
  derived from: http://data.ga-group.nl/ics/bics/2014/1414101113
  source accessed on: 2019-12-03T20:05:01Z
  source last accessed on: 2019-12-03T20:05:01Z
  definition: This segment includes realized gains/losses generated from direct life business.
  notation: 1414101113
  valid from: 2014-08-08
  valid till: 2020-10-03
derived from: Realized G/L - Life Insurance
  type: BicsLevel6Segment
  type: Classifier
  type: ContemporaryDerivation
  derived from: http://data.ga-group.nl/ics/bics/2020/141210101112
  derived from: http://data.ga-group.nl/ics/bics/2024/141210101112
  source accessed on: 2023-07-03T18:11:29Z
  source last accessed on: 2024-06-05T14:42:36Z
  definition: This segment includes realized gains/losses generated from direct life insurance.
  notation: 141210101112
  valid from: 2020-10-03
source accessed on: 2023-07-03T18:11:29Z
source last accessed on: 2024-06-05T14:42:36Z
definition: This segment includes realized gains/losses generated from direct life insurance.
notation: 141210101112
valid from: 2020-10-03

Investment Income - Life Invst
type: BicsLevel7Segment
type: Classifier
type: NamedIndividual
is level7 segment of: Saving & Retire Prods Non-Prem
replaces: Investment Income - Life Invst
created with: infer-bics.sql
derived from: Investment Income - Life Invst
  type: BicsLevel6Segment
  type: Classifier
  type: AnachronousDerivation
  derived from: http://data.ga-group.nl/ics/bics/2014/141410111411
  source accessed on: 2019-12-03T20:05:01Z
  source last accessed on: 2019-12-03T20:05:01Z
  definition: This segment includes investment income generated from life insurance savings and retirement products, including individual and group fixed and variable annuities.
  notation: 141410111411
  valid from: 2014-08-08
  valid till: 2020-10-03
derived from: Investment Income - Life Invst
  type: BicsLevel7Segment
  type: Classifier
  type: ContemporaryDerivation
  derived from: http://data.ga-group.nl/ics/bics/2020/14121010111310
  derived from: http://data.ga-group.nl/ics/bics/2024/14121010111310
  source accessed on: 2023-07-03T18:11:29Z
  source last accessed on: 2024-06-05T14:42:36Z
  definition: This segment includes investment income generated from life insurance savings and retirement products, including individual and group fixed and variable annuities.
  notation: 14121010111310
  valid from: 2020-10-03
source accessed on: 2023-07-03T18:11:29Z
source last accessed on: 2024-06-05T14:42:36Z
definition: This segment includes investment income generated from life insurance savings and retirement products, including individual and group fixed and variable annuities.
notation: 14121010111310
valid from: 2020-10-03

Realized G/L - Life Investment
type: BicsLevel7Segment
type: Classifier
type: NamedIndividual
is level7 segment of: Saving & Retire Prods Non-Prem
replaces: Realized G/L - Life Investment
created with: infer-bics.sql
derived from: Realized G/L - Life Investment
  type: BicsLevel6Segment
  type: Classifier
  type: AnachronousDerivation
  derived from: http://data.ga-group.nl/ics/bics/2014/141410111412
  source accessed on: 2019-12-03T20:05:01Z
  source last accessed on: 2019-12-03T20:05:01Z
  definition: This segment includes realized gains/losses generated from life insurance savings and retirement products, including individual and group fixed and variable annuities.
  notation: 141410111412
  valid from: 2014-08-08
  valid till: 2020-10-03
derived from: Realized G/L - Life Investment
  type: BicsLevel7Segment
  type: Classifier
  type: ContemporaryDerivation
  derived from: http://data.ga-group.nl/ics/bics/2020/14121010111311
  derived from: http://data.ga-group.nl/ics/bics/2024/14121010111311
  source accessed on: 2023-07-03T18:11:29Z
  source last accessed on: 2024-06-05T14:42:36Z
  definition: This segment includes realized gains/losses generated from life insurance savings and retirement products, including individual and group fixed and variable annuities.
  notation: 14121010111311
  valid from: 2020-10-03
source accessed on: 2023-07-03T18:11:29Z
source last accessed on: 2024-06-05T14:42:36Z
definition: This segment includes realized gains/losses generated from life insurance savings and retirement products, including individual and group fixed and variable annuities.
notation: 14121010111311
valid from: 2020-10-03

Fees & Other Income - Life Invst
type: BicsLevel7Segment
type: Classifier
type: NamedIndividual
is level7 segment of: Saving & Retire Prods Non-Prem
replaces: Fees & Other Income - Life Invst
created with: infer-bics.sql
derived from: Fees & Other Income - Life Invst
  type: BicsLevel6Segment
  type: Classifier
  type: AnachronousDerivation
  derived from: http://data.ga-group.nl/ics/bics/2014/141410111410
  source accessed on: 2019-12-03T20:05:01Z
  source last accessed on: 2019-12-03T20:05:01Z
  definition: This segment includes fees and other non-premium income generated from life insurance savings and retirement products, including individual and group fixed and variable annuities.
  notation: 141410111410
  valid from: 2014-08-08
  valid till: 2020-10-03
derived from: Fees & Other Income - Life Invst
  type: BicsLevel7Segment
  type: Classifier
  type: ContemporaryDerivation
  derived from: http://data.ga-group.nl/ics/bics/2020/14121010111312
  derived from: http://data.ga-group.nl/ics/bics/2024/14121010111312
  source accessed on: 2023-07-03T18:11:29Z
  source last accessed on: 2024-06-05T14:42:36Z
  definition: This segment includes fees and other non-premium income generated from individual or group life insurance savings retirement products and fixed and variable annuities.
  notation: 14121010111312
  valid from: 2020-10-03
source accessed on: 2023-07-03T18:11:29Z
source last accessed on: 2024-06-05T14:42:36Z
definition: This segment includes fees and other non-premium income generated from individual or group life insurance savings retirement products and fixed and variable annuities.
notation: 14121010111312
valid from: 2020-10-03

Saving & Retire Prods Non-Prem
type: BicsLevel6Segment
type: Classifier
type: NamedIndividual
is level6 segment of: Life Insurance Non-Premium
replaces: Saving & Retire Prods Non-Prem
created with: infer-bics.sql
derived from: Saving & Retire Prods Non-Prem
  type: BicsLevel5Segment
  type: Classifier
  type: AnachronousDerivation
  derived from: http://data.ga-group.nl/ics/bics/2014/1414101114
  source accessed on: 2019-12-03T20:05:01Z
  source last accessed on: 2019-12-03T20:05:01Z
  definition: This segment includes non-premium income generated from life insurance savings and retirement products, including individual and group fixed and variable annuities.
  notation: 1414101114
  valid from: 2014-08-08
  valid till: 2020-10-03
derived from: Saving & Retire Prods Non-Prem
  type: BicsLevel6Segment
  type: Classifier
  type: ContemporaryDerivation
  derived from: http://data.ga-group.nl/ics/bics/2020/141210101113
  derived from: http://data.ga-group.nl/ics/bics/2024/141210101113
  source accessed on: 2023-07-03T18:11:29Z
  source last accessed on: 2024-06-05T14:42:36Z
  definition: This segment includes non-premium income generated from individual or group life insurance, savings and retirement products, or fixed and variable annuities.
  notation: 141210101113
  valid from: 2020-10-03
source accessed on: 2023-07-03T18:11:29Z
source last accessed on: 2024-06-05T14:42:36Z
definition: This segment includes non-premium income generated from individual or group life insurance, savings and retirement products, or fixed and variable annuities.
notation: 141210101113
valid from: 2020-10-03

Fees & Other Income - Life Ins
type: BicsLevel6Segment
type: Classifier
type: NamedIndividual
is level6 segment of: Life Insurance Non-Premium
replaces: Fees & Other Income - Life Ins
created with: infer-bics.sql
derived from: Fees & Other Income - Life Ins
  type: BicsLevel5Segment
  type: Classifier
  type: AnachronousDerivation
  derived from: http://data.ga-group.nl/ics/bics/2014/1414101110
  source accessed on: 2019-12-03T20:05:01Z
  source last accessed on: 2019-12-03T20:05:01Z
  definition: This segment includes other income generated from direct life business.
  notation: 1414101110
  valid from: 2014-08-08
  valid till: 2020-10-03
derived from: Fees & Other Income - Life Ins
  type: BicsLevel6Segment
  type: Classifier
  type: ContemporaryDerivation
  derived from: http://data.ga-group.nl/ics/bics/2020/141210101114
  derived from: http://data.ga-group.nl/ics/bics/2024/141210101114
  source accessed on: 2023-07-03T18:11:29Z
  source last accessed on: 2024-06-05T14:42:36Z
  definition: This segment includes other income generated from direct life insurance.
  notation: 141210101114
  valid from: 2020-10-03
source accessed on: 2023-07-03T18:11:29Z
source last accessed on: 2024-06-05T14:42:36Z
definition: This segment includes other income generated from direct life insurance.
notation: 141210101114
valid from: 2020-10-03

Life Insurance Non-Premium
type: BicsLevel5Segment
type: Classifier
type: NamedIndividual
is level5 segment of: Life Insurance
is replaced by: Ind Equip Finance & Leasing
created with: infer-bics.sql
derived from: Ind Equip Finance & Leasing
  type: BicsLevel5Segment
  type: Classifier
  type: ContemporaryDerivation
  derived from: http://data.ga-group.nl/ics/bics/2014/1412101011
  source accessed on: 2019-12-03T20:05:01Z
  source last accessed on: 2019-12-03T20:05:01Z
  definition: This segment includes companies that finance or lease industrial equipment. In such a situation, a contractual agreement is established and usually reached through a dealer.
  notation: 1412101011
  valid from: 2014-08-08
  valid till: 2020-10-03
derived from: Life Insurance Non-Premium
  type: BicsLevel4SubIndustry
  type: Classifier
  type: AnachronousDerivation
  derived from: http://data.ga-group.nl/ics/bics/2014/14141011
  source accessed on: 2019-12-03T20:05:01Z
  source last accessed on: 2019-12-03T20:05:01Z
  definition: This industry subgroup includes total non-premium revenue generated from direct life business.
  notation: 14141011
  valid from: 2014-08-08
  valid till: 2020-10-03
derived from: Life Insurance Non-Premium
  type: BicsLevel5Segment
  type: Classifier
  type: ContemporaryDerivation
  derived from: http://data.ga-group.nl/ics/bics/2020/1412101011
  derived from: http://data.ga-group.nl/ics/bics/2024/1412101011
  source accessed on: 2023-07-03T18:11:29Z
  source last accessed on: 2024-06-05T14:42:36Z
  definition: This segment includes total non-premium revenue generated from direct life business.
  notation: 1412101011
  valid from: 2020-10-03
source accessed on: 2019-12-03T20:05:01Z
source last accessed on: 2024-06-05T14:42:36Z
definition: This segment includes total non-premium revenue generated from direct life business.
notation: 1412101011
valid from: 2014-08-08

Machinery Finance & Leasing
type: BicsLevel5Segment
type: Classifier
type: NamedIndividual
is level5 segment of: Life Insurance
is replaced by: Machinery Finance & Leasing
created with: infer-bics.sql
derived from: Machinery Finance & Leasing
  type: BicsLevel5Segment
  type: Classifier
  type: ContemporaryDerivation
  derived from: http://data.ga-group.nl/ics/bics/2014/1412101012
  source accessed on: 2019-12-03T20:05:01Z
  source last accessed on: 2019-12-03T20:05:01Z
  definition: This segment includes companies that finance or lease machinery not elsewhere classified. In such a situation, a contractual agreement is established and usually reached through a dealer.
  notation: 1412101012
  valid from: 2014-08-08
  valid till: 2020-10-03
source accessed on: 2019-12-03T20:05:01Z
source last accessed on: 2019-12-03T20:05:01Z
definition: This segment includes companies that finance or lease machinery not elsewhere classified. In such a situation, a contractual agreement is established and usually reached through a dealer.
notation: 1412101012
valid from: 2014-08-08
valid till: 2020-10-03

Life Insurance
type: BicsLevel4SubIndustry
type: Classifier
type: NamedIndividual
replaces: Life Insurance
created with: infer-bics.sql
derived from: Comml Equip Finance & Leasing
  type: BicsLevel4SubIndustry
  type: Classifier
  type: ContemporaryDerivation
  derived from: http://data.ga-group.nl/ics/bics/2014/14121010
  source accessed on: 2019-12-03T20:05:01Z
  source last accessed on: 2019-12-03T20:05:01Z
  definition: This industry subgroup includes companies that finance or lease light commercial and machinery and equipment, such as office and computer equipment.
  notation: 14121010
  valid from: 2014-08-08
  valid till: 2020-10-03
derived from: Life Insurance
  type: BicsLevel3Industry
  type: Classifier
  type: AnachronousDerivation
  derived from: http://data.ga-group.nl/ics/bics/2014/141410
  source accessed on: 2019-12-03T20:05:01Z
  source last accessed on: 2019-12-03T20:05:01Z
  definition: This industry includes companies that directly underwrite life insurance policies, such as life, accidental death, disability and annuities (pensions).
  notation: 141410
  valid from: 2014-08-08
  valid till: 2020-10-03
derived from: Life Insurance
  type: BicsLevel4SubIndustry
  type: Classifier
  type: ContemporaryDerivation
  derived from: http://data.ga-group.nl/ics/bics/2020/14121010
  derived from: http://data.ga-group.nl/ics/bics/2024/14121010
  source accessed on: 2023-07-03T18:11:29Z
  source last accessed on: 2024-06-05T14:42:36Z
  definition: This industry subgroup includes companies that directly underwrite life insurance policies, such as life, accidental death, disability, and annuities.
  notation: 14121010
  valid from: 2020-10-03
source accessed on: 2019-12-03T20:05:01Z
source last accessed on: 2024-06-05T14:42:36Z
definition: This industry subgroup includes companies that directly underwrite life insurance policies, such as life, accidental death, disability, and annuities.
notation: 14121010
valid from: 2014-08-08

Commercial Auto Premiums
type: BicsLevel7Segment
type: Classifier
type: NamedIndividual
is level7 segment of: P&C Commercial Lines
replaces: Commercial Auto Premiums
created with: infer-bics.sql
derived from: Commercial Auto Premiums
  type: BicsLevel6Segment
  type: Classifier
  type: AnachronousDerivation
  derived from: http://data.ga-group.nl/ics/bics/2014/141411101010
  source accessed on: 2019-12-03T20:05:01Z
  source last accessed on: 2019-12-03T20:05:01Z
  definition: This segment includes premium revenue generated from commercial lines. Such lines include workers’ compensation, commercial auto, commercial multi-peril, surety and fidelity, liability and other commercial lines of business.
  notation: 141411101010
  valid from: 2014-08-08
  valid till: 2020-10-03
derived from: Commercial Auto Premiums
  type: BicsLevel7Segment
  type: Classifier
  type: ContemporaryDerivation
  derived from: http://data.ga-group.nl/ics/bics/2020/14121011101010
  derived from: http://data.ga-group.nl/ics/bics/2024/14121011101010
  source accessed on: 2023-07-03T18:11:29Z
  source last accessed on: 2024-06-05T14:42:36Z
  definition: This segment includes premium revenue generated from commercial vehicle insurance.
  notation: 14121011101010
  valid from: 2020-10-03
source accessed on: 2023-07-03T18:11:29Z
source last accessed on: 2024-06-05T14:42:36Z
definition: This segment includes premium revenue generated from commercial vehicle insurance.
notation: 14121011101010
valid from: 2020-10-03

Comml Prop & Multi-Peril Prem
type: BicsLevel7Segment
type: Classifier
type: NamedIndividual
is level7 segment of: P&C Commercial Lines
replaces: Comml Prop & Multi-Peril Prem
created with: infer-bics.sql
derived from: Comml Prop & Multi-Peril Prem
  type: BicsLevel6Segment
  type: Classifier
  type: AnachronousDerivation
  derived from: http://data.ga-group.nl/ics/bics/2014/141411101011
  source accessed on: 2019-12-03T20:05:01Z
  source last accessed on: 2019-12-03T20:05:01Z
  definition: This segment includes premium revenue generated from commercial property, commercial multi-peril, fire and allied lines, inland marine, theft, earthquake and umbrella lines of business.
  notation: 141411101011
  valid from: 2014-08-08
  valid till: 2020-10-03
derived from: Comml Prop & Multi-Peril Prem
  type: BicsLevel7Segment
  type: Classifier
  type: ContemporaryDerivation
  derived from: http://data.ga-group.nl/ics/bics/2020/14121011101011
  derived from: http://data.ga-group.nl/ics/bics/2024/14121011101011
  source accessed on: 2023-07-03T18:11:29Z
  source last accessed on: 2024-06-05T14:42:36Z
  definition: This segment includes premium revenue generated from commercial property and commercial multi-peril insurance.
  notation: 14121011101011
  valid from: 2020-10-03
source accessed on: 2023-07-03T18:11:29Z
source last accessed on: 2024-06-05T14:42:36Z
definition: This segment includes premium revenue generated from commercial property and commercial multi-peril insurance.
notation: 14121011101011
valid from: 2020-10-03

Financial Guarantee Premiums
type: BicsLevel7Segment
type: Classifier
type: NamedIndividual
is level7 segment of: P&C Commercial Lines
replaces: Financial Guarantee Premiums
created with: infer-bics.sql
derived from: Financial Guarantee Premiums
  type: BicsLevel6Segment
  type: Classifier
  type: AnachronousDerivation
  derived from: http://data.ga-group.nl/ics/bics/2014/141411101012
  source accessed on: 2019-12-03T20:05:01Z
  source last accessed on: 2019-12-03T20:05:01Z
  definition: This segment includes premium revenue generated from financial guarantee lines of business.
  notation: 141411101012
  valid from: 2014-08-08
  valid till: 2020-10-03
derived from: Financial Guarantee Premiums
  type: BicsLevel7Segment
  type: Classifier
  type: ContemporaryDerivation
  derived from: http://data.ga-group.nl/ics/bics/2020/14121011101012
  derived from: http://data.ga-group.nl/ics/bics/2024/14121011101012
  source accessed on: 2023-07-03T18:11:29Z
  source last accessed on: 2024-06-05T14:42:36Z
  definition: This segment includes premium revenue generated from financial guarantee insurance.
  notation: 14121011101012
  valid from: 2020-10-03
source accessed on: 2023-07-03T18:11:29Z
source last accessed on: 2024-06-05T14:42:36Z
definition: This segment includes premium revenue generated from financial guarantee insurance.
notation: 14121011101012
valid from: 2020-10-03

Liability Premiums
type: BicsLevel7Segment
type: Classifier
type: NamedIndividual
is level7 segment of: P&C Commercial Lines
replaces: Liability Premiums
created with: infer-bics.sql
derived from: Liability Premiums
  type: BicsLevel6Segment
  type: Classifier
  type: AnachronousDerivation
  derived from: http://data.ga-group.nl/ics/bics/2014/141411101013
  source accessed on: 2019-12-03T20:05:01Z
  source last accessed on: 2019-12-03T20:05:01Z
  definition: This segment includes premium revenue generated from commercial liability lines of business, such as fraud, general liability, medical malpractice, professional or product liability, environmental liability, director’s and officer’s liability, aviation, boiler and machinery, and ocean marine.
  notation: 141411101013
  valid from: 2014-08-08
  valid till: 2020-10-03
derived from: Liability Premiums
  type: BicsLevel7Segment
  type: Classifier
  type: ContemporaryDerivation
  derived from: http://data.ga-group.nl/ics/bics/2020/14121011101013
  derived from: http://data.ga-group.nl/ics/bics/2024/14121011101013
  source accessed on: 2023-07-03T18:11:29Z
  source last accessed on: 2024-06-05T14:42:36Z
  definition: This segment includes premium revenue generated from commercial liability insurance, such as fraud, general liability, medical malpractice, professional or product liability, environmental liability, director's and officer's liability, aviation, boiler and machinery, and ocean marine.
  notation: 14121011101013
  valid from: 2020-10-03
source accessed on: 2023-07-03T18:11:29Z
source last accessed on: 2024-06-05T14:42:36Z
definition: This segment includes premium revenue generated from commercial liability insurance, such as fraud, general liability, medical malpractice, professional or product liability, environmental liability, director's and officer's liability, aviation, boiler and machinery, and ocean marine.
notation: 14121011101013
valid from: 2020-10-03

Surety & Fidelity Premiums
type: BicsLevel7Segment
type: Classifier
type: NamedIndividual
is level7 segment of: P&C Commercial Lines
replaces: Surety & Fidelity Premiums
created with: infer-bics.sql
derived from: Surety & Fidelity Premiums
  type: BicsLevel6Segment
  type: Classifier
  type: AnachronousDerivation
  derived from: http://data.ga-group.nl/ics/bics/2014/141411101014
  source accessed on: 2019-12-03T20:05:01Z
  source last accessed on: 2019-12-03T20:05:01Z
  definition: This segment includes premium revenue generated from surety and fidelitly bond insurance.
  notation: 141411101014
  valid from: 2014-08-08
  valid till: 2020-10-03
derived from: Surety & Fidelity Premiums
  type: BicsLevel7Segment
  type: Classifier
  type: ContemporaryDerivation
  derived from: http://data.ga-group.nl/ics/bics/2020/14121011101014
  derived from: http://data.ga-group.nl/ics/bics/2024/14121011101014
  source accessed on: 2023-07-03T18:11:29Z
  source last accessed on: 2024-06-05T14:42:36Z
  definition: This segment includes premium revenue generated from surety and fidelity bond insurance.
  notation: 14121011101014
  valid from: 2020-10-03
source accessed on: 2023-07-03T18:11:29Z
source last accessed on: 2024-06-05T14:42:36Z
definition: This segment includes premium revenue generated from surety and fidelity bond insurance.
notation: 14121011101014
valid from: 2020-10-03

Workers Compensation Premiums
type: BicsLevel7Segment
type: Classifier
type: NamedIndividual
is level7 segment of: P&C Commercial Lines
replaces: Workers Compensation Premiums
created with: infer-bics.sql
derived from: Workers Compensation Premiums
  type: BicsLevel6Segment
  type: Classifier
  type: AnachronousDerivation
  derived from: http://data.ga-group.nl/ics/bics/2014/141411101015
  source accessed on: 2019-12-03T20:05:01Z
  source last accessed on: 2019-12-03T20:05:01Z
  definition: This segment includes premium revenue generated from workers compensation insurance.
  notation: 141411101015
  valid from: 2014-08-08
  valid till: 2020-10-03
derived from: Workers Compensation Premiums
  type: BicsLevel7Segment
  type: Classifier
  type: ContemporaryDerivation
  derived from: http://data.ga-group.nl/ics/bics/2020/14121011101015
  derived from: http://data.ga-group.nl/ics/bics/2024/14121011101015
  source accessed on: 2023-07-03T18:11:29Z
  source last accessed on: 2024-06-05T14:42:36Z
  definition: This segment includes premium revenue generated from workers' compensation insurance.
  notation: 14121011101015
  valid from: 2020-10-03
source accessed on: 2023-07-03T18:11:29Z
source last accessed on: 2024-06-05T14:42:36Z
definition: This segment includes premium revenue generated from workers' compensation insurance.
notation: 14121011101015
valid from: 2020-10-03

Other Commercial Premiums
type: BicsLevel7Segment
type: Classifier
type: NamedIndividual
is level7 segment of: P&C Commercial Lines
replaces: Other Commercial Premiums
created with: infer-bics.sql
derived from: Other Commercial Premiums
  type: BicsLevel6Segment
  type: Classifier
  type: AnachronousDerivation
  derived from: http://data.ga-group.nl/ics/bics/2014/141411101016
  source accessed on: 2019-12-03T20:05:01Z
  source last accessed on: 2019-12-03T20:05:01Z
  definition: This segment includes revenue generated from other commercial lines of business, such as terrorism, unidentified specialty lines, and other casualty lines not elsewhere classified.
  notation: 141411101016
  valid from: 2014-08-08
  valid till: 2020-10-03
derived from: Other Commercial Premiums
  type: BicsLevel7Segment
  type: Classifier
  type: ContemporaryDerivation
  derived from: http://data.ga-group.nl/ics/bics/2020/14121011101016
  derived from: http://data.ga-group.nl/ics/bics/2024/14121011101016
  source accessed on: 2023-07-03T18:11:29Z
  source last accessed on: 2024-06-05T14:42:36Z
  definition: This segment includes premium revenue generated from other commercial lines of business, such as terrorism, unidentified specialty lines, and other casualty lines not elsewhere classified.
  notation: 14121011101016
  valid from: 2020-10-03
source accessed on: 2023-07-03T18:11:29Z
source last accessed on: 2024-06-05T14:42:36Z
definition: This segment includes premium revenue generated from other commercial lines of business, such as terrorism, unidentified specialty lines, and other casualty lines not elsewhere classified.
notation: 14121011101016
valid from: 2020-10-03

P&C Commercial Lines
type: BicsLevel6Segment
type: Classifier
type: NamedIndividual
is level6 segment of: P&C Insurance Premiums
replaces: P&C Commercial Lines
created with: infer-bics.sql
derived from: P&C Commercial Lines
  type: BicsLevel5Segment
  type: Classifier
  type: AnachronousDerivation
  derived from: http://data.ga-group.nl/ics/bics/2014/1414111010
  source accessed on: 2019-12-03T20:05:01Z
  source last accessed on: 2019-12-03T20:05:01Z
  definition: This segment includes premium revenue generated from commercial lines of insurance, such as workers compensation, commercial auto, commercial multi-peril, surety and fidelity, liability and other commercial lines of business.
  notation: 1414111010
  valid from: 2014-08-08
  valid till: 2020-10-03
derived from: P&C Commercial Lines
  type: BicsLevel6Segment
  type: Classifier
  type: ContemporaryDerivation
  derived from: http://data.ga-group.nl/ics/bics/2020/141210111010
  derived from: http://data.ga-group.nl/ics/bics/2024/141210111010
  source accessed on: 2023-07-03T18:11:29Z
  source last accessed on: 2024-06-05T14:42:36Z
  definition: This segment includes premium revenue generated from commercial lines of insurance, such as workers' compensation, commercial auto, commercial multi-peril, surety and fidelity, liability, and other commercial lines of business.
  notation: 141210111010
  valid from: 2020-10-03
source accessed on: 2023-07-03T18:11:29Z
source last accessed on: 2024-06-05T14:42:36Z
definition: This segment includes premium revenue generated from commercial lines of insurance, such as workers' compensation, commercial auto, commercial multi-peril, surety and fidelity, liability, and other commercial lines of business.
notation: 141210111010
valid from: 2020-10-03

Homeowners Premiums
type: BicsLevel7Segment
type: Classifier
type: NamedIndividual
is level7 segment of: P&C Personal Lines
replaces: Homeowners Premiums
created with: infer-bics.sql
derived from: Homeowners Premiums
  type: BicsLevel6Segment
  type: Classifier
  type: AnachronousDerivation
  derived from: http://data.ga-group.nl/ics/bics/2014/141411101110
  source accessed on: 2019-12-03T20:05:01Z
  source last accessed on: 2019-12-03T20:05:01Z
  definition: This segment includes premium revenue generated from coverage of residential dwellings and farms.
  notation: 141411101110
  valid from: 2014-08-08
  valid till: 2020-10-03
derived from: Homeowners Premiums
  type: BicsLevel7Segment
  type: Classifier
  type: ContemporaryDerivation
  derived from: http://data.ga-group.nl/ics/bics/2020/14121011101110
  derived from: http://data.ga-group.nl/ics/bics/2024/14121011101110
  source accessed on: 2023-07-03T18:11:29Z
  source last accessed on: 2024-06-05T14:42:36Z
  definition: This segment includes premium revenue generated from coverage of residential dwellings and farms.
  notation: 14121011101110
  valid from: 2020-10-03
source accessed on: 2023-07-03T18:11:29Z
source last accessed on: 2024-06-05T14:42:36Z
definition: This segment includes premium revenue generated from coverage of residential dwellings and farms.
notation: 14121011101110
valid from: 2020-10-03

Personal Auto Premiums
type: BicsLevel7Segment
type: Classifier
type: NamedIndividual
is level7 segment of: P&C Personal Lines
replaces: Personal Auto Premiums
created with: infer-bics.sql
derived from: Personal Auto Premiums
  type: BicsLevel6Segment
  type: Classifier
  type: AnachronousDerivation
  derived from: http://data.ga-group.nl/ics/bics/2014/141411101111
  source accessed on: 2019-12-03T20:05:01Z
  source last accessed on: 2019-12-03T20:05:01Z
  definition: This segment includes premium revenue generated from coverage of all auto physical damage claims and personal auto liability for both standard and non-standard drivers.
  notation: 141411101111
  valid from: 2014-08-08
  valid till: 2020-10-03
derived from: Personal Auto Premiums
  type: BicsLevel7Segment
  type: Classifier
  type: ContemporaryDerivation
  derived from: http://data.ga-group.nl/ics/bics/2020/14121011101111
  derived from: http://data.ga-group.nl/ics/bics/2024/14121011101111
  source accessed on: 2023-07-03T18:11:29Z
  source last accessed on: 2024-06-05T14:42:36Z
  definition: This segment includes premium revenue generated from coverage of all auto physical damage claims and personal auto liability for both standard and non-standard drivers.
  notation: 14121011101111
  valid from: 2020-10-03
source accessed on: 2023-07-03T18:11:29Z
source last accessed on: 2024-06-05T14:42:36Z
definition: This segment includes premium revenue generated from coverage of all auto physical damage claims and personal auto liability for both standard and non-standard drivers.
notation: 14121011101111
valid from: 2020-10-03

Other Personal Premiums
type: BicsLevel7Segment
type: Classifier
type: NamedIndividual
is level7 segment of: P&C Personal Lines
replaces: Other Personal Premiums
created with: infer-bics.sql
derived from: Other Personal Premiums
  type: BicsLevel6Segment
  type: Classifier
  type: AnachronousDerivation
  derived from: http://data.ga-group.nl/ics/bics/2014/141411101112
  source accessed on: 2019-12-03T20:05:01Z
  source last accessed on: 2019-12-03T20:05:01Z
  definition: This segment includes premium revenue generated from other personal lines of business not elsewhere classified.
  notation: 141411101112
  valid from: 2014-08-08
  valid till: 2020-10-03
derived from: Other Personal Premiums
  type: BicsLevel7Segment
  type: Classifier
  type: ContemporaryDerivation
  derived from: http://data.ga-group.nl/ics/bics/2020/14121011101112
  derived from: http://data.ga-group.nl/ics/bics/2024/14121011101112
  source accessed on: 2023-07-03T18:11:29Z
  source last accessed on: 2024-06-05T14:42:36Z
  definition: This segment includes premium revenue generated from other personal lines of business not elsewhere classified.
  notation: 14121011101112
  valid from: 2020-10-03
source accessed on: 2023-07-03T18:11:29Z
source last accessed on: 2024-06-05T14:42:36Z
definition: This segment includes premium revenue generated from other personal lines of business not elsewhere classified.
notation: 14121011101112
valid from: 2020-10-03

P&C Personal Lines
type: BicsLevel6Segment
type: Classifier
type: NamedIndividual
is level6 segment of: P&C Insurance Premiums
replaces: P&C Personal Lines
created with: infer-bics.sql
derived from: P&C Personal Lines
  type: BicsLevel5Segment
  type: Classifier
  type: AnachronousDerivation
  derived from: http://data.ga-group.nl/ics/bics/2014/1414111011
  source accessed on: 2019-12-03T20:05:01Z
  source last accessed on: 2019-12-03T20:05:01Z
  definition: This segment includes premium revenue generated from personal lines of insurance, such as home, personal auto and other personal lines of business.
  notation: 1414111011
  valid from: 2014-08-08
  valid till: 2020-10-03
derived from: P&C Personal Lines
  type: BicsLevel6Segment
  type: Classifier
  type: ContemporaryDerivation
  derived from: http://data.ga-group.nl/ics/bics/2020/141210111011
  derived from: http://data.ga-group.nl/ics/bics/2024/141210111011
  source accessed on: 2023-07-03T18:11:29Z
  source last accessed on: 2024-06-05T14:42:36Z
  definition: This segment includes premium revenue generated from personal lines of insurance, such as home and auto.
  notation: 141210111011
  valid from: 2020-10-03
source accessed on: 2023-07-03T18:11:29Z
source last accessed on: 2024-06-05T14:42:36Z
definition: This segment includes premium revenue generated from personal lines of insurance, such as home and auto.
notation: 141210111011
valid from: 2020-10-03

P&C Insurance Premiums
type: BicsLevel5Segment
type: Classifier
type: NamedIndividual
is level5 segment of: P&C Insurance
is replaced by: Aircraft Finance & Leasing
created with: infer-bics.sql
derived from: Aircraft Finance & Leasing
  type: BicsLevel5Segment
  type: Classifier
  type: ContemporaryDerivation
  derived from: http://data.ga-group.nl/ics/bics/2014/1412101110
  source accessed on: 2019-12-03T20:05:01Z
  source last accessed on: 2019-12-03T20:05:01Z
  definition: This segment includes companies that finance or lease aircraft.
  notation: 1412101110
  valid from: 2014-08-08
  valid till: 2020-10-03
derived from: P&C Insurance Premiums
  type: BicsLevel4SubIndustry
  type: Classifier
  type: AnachronousDerivation
  derived from: http://data.ga-group.nl/ics/bics/2014/14141110
  source accessed on: 2019-12-03T20:05:01Z
  source last accessed on: 2019-12-03T20:05:01Z
  definition: This industry subgroup includes companies that directly underwrite property and casualty insurance policies. Insurance types include automobile, property damage, casualty, theft, fire, malpractice, marine, workers' compensation and homeowners insurance.
  notation: 14141110
  valid from: 2014-08-08
  valid till: 2020-10-03
derived from: P&C Insurance Premiums
  type: BicsLevel5Segment
  type: Classifier
  type: ContemporaryDerivation
  derived from: http://data.ga-group.nl/ics/bics/2020/1412101110
  derived from: http://data.ga-group.nl/ics/bics/2024/1412101110
  source accessed on: 2023-07-03T18:11:29Z
  source last accessed on: 2024-06-05T14:42:36Z
  definition: This segment includes premium revenue generated from underwriting property and casualty insurance policies. Includes automobile, property damage, casualty, theft, fire, malpractice, marine, workers' compensation, and homeowners insurance.
  notation: 1412101110
  valid from: 2020-10-03
source accessed on: 2019-12-03T20:05:01Z
source last accessed on: 2024-06-05T14:42:36Z
definition: This segment includes premium revenue generated from underwriting property and casualty insurance policies. Includes automobile, property damage, casualty, theft, fire, malpractice, marine, workers' compensation, and homeowners insurance.
notation: 1412101110
valid from: 2014-08-08

Investment Income - P&C
type: BicsLevel6Segment
type: Classifier
type: NamedIndividual
is level6 segment of: P&C Insurance Non-Premium
replaces: Investment Income - P&C
created with: infer-bics.sql
derived from: Investment Income - P&C
  type: BicsLevel5Segment
  type: Classifier
  type: AnachronousDerivation
  derived from: http://data.ga-group.nl/ics/bics/2014/1414111111
  source accessed on: 2019-12-03T20:05:01Z
  source last accessed on: 2019-12-03T20:05:01Z
  definition: This segment includes investment income generated from direct property and casualty business.
  notation: 1414111111
  valid from: 2014-08-08
  valid till: 2020-10-03
derived from: Investment Income - P&C
  type: BicsLevel6Segment
  type: Classifier
  type: ContemporaryDerivation
  derived from: http://data.ga-group.nl/ics/bics/2020/141210111110
  derived from: http://data.ga-group.nl/ics/bics/2024/141210111110
  source accessed on: 2023-07-03T18:11:29Z
  source last accessed on: 2024-06-05T14:42:36Z
  definition: This segment includes investment income generated from direct property and casualty insurance.
  notation: 141210111110
  valid from: 2020-10-03
source accessed on: 2023-07-03T18:11:29Z
source last accessed on: 2024-06-05T14:42:36Z
definition: This segment includes investment income generated from direct property and casualty insurance.
notation: 141210111110
valid from: 2020-10-03

Realized Gains/Losses - P&C
type: BicsLevel6Segment
type: Classifier
type: NamedIndividual
is level6 segment of: P&C Insurance Non-Premium
replaces: Realized Gains/Losses - P&C
created with: infer-bics.sql
derived from: Realized Gains/Losses - P&C
  type: BicsLevel5Segment
  type: Classifier
  type: AnachronousDerivation
  derived from: http://data.ga-group.nl/ics/bics/2014/1414111112
  source accessed on: 2019-12-03T20:05:01Z
  source last accessed on: 2019-12-03T20:05:01Z
  definition: This segment includes realized gains/losses generated from direct property and casualty business.
  notation: 1414111112
  valid from: 2014-08-08
  valid till: 2020-10-03
derived from: Realized Gains/Losses - P&C
  type: BicsLevel6Segment
  type: Classifier
  type: ContemporaryDerivation
  derived from: http://data.ga-group.nl/ics/bics/2020/141210111111
  derived from: http://data.ga-group.nl/ics/bics/2024/141210111111
  source accessed on: 2023-07-03T18:11:29Z
  source last accessed on: 2024-06-05T14:42:36Z
  definition: This segment includes realized gains/losses generated from direct property and casualty insurance.
  notation: 141210111111
  valid from: 2020-10-03
source accessed on: 2023-07-03T18:11:29Z
source last accessed on: 2024-06-05T14:42:36Z
definition: This segment includes realized gains/losses generated from direct property and casualty insurance.
notation: 141210111111
valid from: 2020-10-03

Fees & Other Income - P&C
type: BicsLevel6Segment
type: Classifier
type: NamedIndividual
is level6 segment of: P&C Insurance Non-Premium
replaces: Fees & Other Income - P&C
created with: infer-bics.sql
derived from: Fees & Other Income - P&C
  type: BicsLevel5Segment
  type: Classifier
  type: AnachronousDerivation
  derived from: http://data.ga-group.nl/ics/bics/2014/1414111110
  source accessed on: 2019-12-03T20:05:01Z
  source last accessed on: 2019-12-03T20:05:01Z
  definition: This segment includes other income generated from direct property and casualty business.
  notation: 1414111110
  valid from: 2014-08-08
  valid till: 2020-10-03
derived from: Fees & Other Income - P&C
  type: BicsLevel6Segment
  type: Classifier
  type: ContemporaryDerivation
  derived from: http://data.ga-group.nl/ics/bics/2020/141210111112
  derived from: http://data.ga-group.nl/ics/bics/2024/141210111112
  source accessed on: 2023-07-03T18:11:29Z
  source last accessed on: 2024-06-05T14:42:36Z
  definition: This segment includes other income generated from direct property and casualty insurance.
  notation: 141210111112
  valid from: 2020-10-03
source accessed on: 2023-07-03T18:11:29Z
source last accessed on: 2024-06-05T14:42:36Z
definition: This segment includes other income generated from direct property and casualty insurance.
notation: 141210111112
valid from: 2020-10-03

P&C Insurance Non-Premium
type: BicsLevel5Segment
type: Classifier
type: NamedIndividual
is level5 segment of: P&C Insurance
is replaced by: Commercial Veh Fin & Leasing
created with: infer-bics.sql
derived from: Commercial Veh Fin & Leasing
  type: BicsLevel5Segment
  type: Classifier
  type: ContemporaryDerivation
  derived from: http://data.ga-group.nl/ics/bics/2014/1412101111
  source accessed on: 2019-12-03T20:05:01Z
  source last accessed on: 2019-12-03T20:05:01Z
  definition: This segment includes companies that finance or lease commercial vehicles. In such a situation, a contractual agreement is established and usually reached through a dealer.
  notation: 1412101111
  valid from: 2014-08-08
  valid till: 2020-10-03
derived from: P&C Insurance Non-Premium
  type: BicsLevel4SubIndustry
  type: Classifier
  type: AnachronousDerivation
  derived from: http://data.ga-group.nl/ics/bics/2014/14141111
  source accessed on: 2019-12-03T20:05:01Z
  source last accessed on: 2019-12-03T20:05:01Z
  definition: This industry subgroup includes total non-premium revenue generated from direct property and casualty business.
  notation: 14141111
  valid from: 2014-08-08
  valid till: 2020-10-03
derived from: P&C Insurance Non-Premium
  type: BicsLevel5Segment
  type: Classifier
  type: ContemporaryDerivation
  derived from: http://data.ga-group.nl/ics/bics/2020/1412101111
  derived from: http://data.ga-group.nl/ics/bics/2024/1412101111
  source accessed on: 2023-07-03T18:11:29Z
  source last accessed on: 2024-06-05T14:42:36Z
  definition: This segment includes total non-premium revenue generated from direct property and casualty insurance.
  notation: 1412101111
  valid from: 2020-10-03
source accessed on: 2019-12-03T20:05:01Z
source last accessed on: 2024-06-05T14:42:36Z
definition: This segment includes total non-premium revenue generated from direct property and casualty insurance.
notation: 1412101111
valid from: 2014-08-08

Railroad Car Finance & Leasing
type: BicsLevel5Segment
type: Classifier
type: NamedIndividual
is level5 segment of: P&C Insurance
is replaced by: Railroad Car Finance & Leasing
created with: infer-bics.sql
derived from: Railroad Car Finance & Leasing
  type: BicsLevel5Segment
  type: Classifier
  type: ContemporaryDerivation
  derived from: http://data.ga-group.nl/ics/bics/2014/1412101112
  source accessed on: 2019-12-03T20:05:01Z
  source last accessed on: 2019-12-03T20:05:01Z
  definition: This segment includes companies that finance or lease railroad cars.
  notation: 1412101112
  valid from: 2014-08-08
  valid till: 2020-10-03
source accessed on: 2019-12-03T20:05:01Z
source last accessed on: 2019-12-03T20:05:01Z
definition: This segment includes companies that finance or lease railroad cars.
notation: 1412101112
valid from: 2014-08-08
valid till: 2020-10-03

Ship & Boat Finance & Leasing
type: BicsLevel5Segment
type: Classifier
type: NamedIndividual
is level5 segment of: P&C Insurance
is replaced by: Ship & Boat Finance & Leasing
created with: infer-bics.sql
derived from: Ship & Boat Finance & Leasing
  type: BicsLevel5Segment
  type: Classifier
  type: ContemporaryDerivation
  derived from: http://data.ga-group.nl/ics/bics/2014/1412101113
  source accessed on: 2019-12-03T20:05:01Z
  source last accessed on: 2019-12-03T20:05:01Z
  definition: This segment includes companies that rent or lease boats and ships.
  notation: 1412101113
  valid from: 2014-08-08
  valid till: 2020-10-03
source accessed on: 2019-12-03T20:05:01Z
source last accessed on: 2019-12-03T20:05:01Z
definition: This segment includes companies that rent or lease boats and ships.
notation: 1412101113
valid from: 2014-08-08
valid till: 2020-10-03

P&C Insurance
type: BicsLevel4SubIndustry
type: Classifier
type: NamedIndividual
replaces: P&C Insurance
created with: infer-bics.sql
derived from: Transp Equip Finance & Leasing
  type: BicsLevel4SubIndustry
  type: Classifier
  type: ContemporaryDerivation
  derived from: http://data.ga-group.nl/ics/bics/2014/14121011
  source accessed on: 2019-12-03T20:05:01Z
  source last accessed on: 2019-12-03T20:05:01Z
  definition: This industry subgroup includes companies that provide loans for purchase or contracts permitting the use of non-roadway transportation like aircraft, railroad cars and ocean vessels.
  notation: 14121011
  valid from: 2014-08-08
  valid till: 2020-10-03
derived from: P&C Insurance
  type: BicsLevel3Industry
  type: Classifier
  type: AnachronousDerivation
  derived from: http://data.ga-group.nl/ics/bics/2014/141411
  source accessed on: 2019-12-03T20:05:01Z
  source last accessed on: 2019-12-03T20:05:01Z
  definition: This industry includes companies that directly underwrite property and casualty insurance policies, such as automobile, property damage, casualty, theft, fire, malpractice, marine, workers' compensation and homeowners insurance.
  notation: 141411
  valid from: 2014-08-08
  valid till: 2020-10-03
derived from: P&C Insurance
  type: BicsLevel4SubIndustry
  type: Classifier
  type: ContemporaryDerivation
  derived from: http://data.ga-group.nl/ics/bics/2020/14121011
  derived from: http://data.ga-group.nl/ics/bics/2024/14121011
  source accessed on: 2023-07-03T18:11:29Z
  source last accessed on: 2024-06-05T14:42:36Z
  definition: This industry subgroup includes companies that directly underwrite property and casualty insurance policies, such as automobile, property damage, casualty, theft, fire, malpractice, marine, workers' compensation, and homeowners insurance.
  notation: 14121011
  valid from: 2020-10-03
source accessed on: 2019-12-03T20:05:01Z
source last accessed on: 2024-06-05T14:42:36Z
definition: This industry subgroup includes companies that directly underwrite property and casualty insurance policies, such as automobile, property damage, casualty, theft, fire, malpractice, marine, workers' compensation, and homeowners insurance.
notation: 14121011
valid from: 2014-08-08

Islamic Health Ins Premiums
type: BicsLevel6Segment
type: Classifier
type: NamedIndividual
is level6 segment of: Health Insurance - Islamic
replaces: Islamic Health Ins Premiums
created with: infer-bics.sql
derived from: Islamic Health Ins Premiums
  type: BicsLevel5Segment
  type: Classifier
  type: AnachronousDerivation
  derived from: http://data.ga-group.nl/ics/bics/2014/1414151010
  source accessed on: 2019-12-03T20:05:01Z
  source last accessed on: 2019-12-03T20:05:01Z
  definition: This segment includes premium revenue generated from direct health business in compliance with Islamic law.
  notation: 1414151010
  valid from: 2014-08-08
  valid till: 2020-10-03
derived from: Islamic Health Ins Premiums
  type: BicsLevel6Segment
  type: Classifier
  type: ContemporaryDerivation
  derived from: http://data.ga-group.nl/ics/bics/2020/141210121010
  derived from: http://data.ga-group.nl/ics/bics/2024/141210121010
  source accessed on: 2023-07-03T18:11:29Z
  source last accessed on: 2024-06-05T14:42:36Z
  definition: This segment includes premium revenue generated from direct health insurance in compliance with Islamic law.
  notation: 141210121010
  valid from: 2020-10-03
source accessed on: 2023-07-03T18:11:29Z
source last accessed on: 2024-06-05T14:42:36Z
definition: This segment includes premium revenue generated from direct health insurance in compliance with Islamic law.
notation: 141210121010
valid from: 2020-10-03

Invst Inc - Islamic Health Ins
type: BicsLevel7Segment
type: Classifier
type: NamedIndividual
is level7 segment of: Islamic Health Ins Non-Premium
replaces: Invst Inc - Islamic Health Ins
created with: infer-bics.sql
derived from: Invst Inc - Islamic Health Ins
  type: BicsLevel6Segment
  type: Classifier
  type: AnachronousDerivation
  derived from: http://data.ga-group.nl/ics/bics/2014/141415101110
  source accessed on: 2019-12-03T20:05:01Z
  source last accessed on: 2019-12-03T20:05:01Z
  definition: This segment includes investment income generated from direct health business in compliance with Islamic law.
  notation: 141415101110
  valid from: 2014-08-08
  valid till: 2020-10-03
derived from: Invst Inc - Islamic Health Ins
  type: BicsLevel7Segment
  type: Classifier
  type: ContemporaryDerivation
  derived from: http://data.ga-group.nl/ics/bics/2020/14121012101110
  derived from: http://data.ga-group.nl/ics/bics/2024/14121012101110
  source accessed on: 2023-07-03T18:11:29Z
  source last accessed on: 2024-06-05T14:42:36Z
  definition: This segment includes investment income generated from direct health insurance in compliance with Islamic law.
  notation: 14121012101110
  valid from: 2020-10-03
source accessed on: 2023-07-03T18:11:29Z
source last accessed on: 2024-06-05T14:42:36Z
definition: This segment includes investment income generated from direct health insurance in compliance with Islamic law.
notation: 14121012101110
valid from: 2020-10-03

Realized G/L - Islamic Health
type: BicsLevel7Segment
type: Classifier
type: NamedIndividual
is level7 segment of: Islamic Health Ins Non-Premium
replaces: Realized G/L - Islamic Health
created with: infer-bics.sql
derived from: Realized G/L - Islamic Health
  type: BicsLevel6Segment
  type: Classifier
  type: AnachronousDerivation
  derived from: http://data.ga-group.nl/ics/bics/2014/141415101111
  source accessed on: 2019-12-03T20:05:01Z
  source last accessed on: 2019-12-03T20:05:01Z
  definition: This segment includes realized gains/losses generated from direct health business in compliance with Islamic law.
  notation: 141415101111
  valid from: 2014-08-08
  valid till: 2020-10-03
derived from: Realized G/L - Islamic Health
  type: BicsLevel7Segment
  type: Classifier
  type: ContemporaryDerivation
  derived from: http://data.ga-group.nl/ics/bics/2020/14121012101111
  derived from: http://data.ga-group.nl/ics/bics/2024/14121012101111
  source accessed on: 2023-07-03T18:11:29Z
  source last accessed on: 2024-06-05T14:42:36Z
  definition: This segment includes realized gains/losses generated from direct health insurance in compliance with Islamic law.
  notation: 14121012101111
  valid from: 2020-10-03
source accessed on: 2023-07-03T18:11:29Z
source last accessed on: 2024-06-05T14:42:36Z
definition: This segment includes realized gains/losses generated from direct health insurance in compliance with Islamic law.
notation: 14121012101111
valid from: 2020-10-03

Other Income - Islamic Health
type: BicsLevel7Segment
type: Classifier
type: NamedIndividual
is level7 segment of: Islamic Health Ins Non-Premium
replaces: Other Income - Islamic Health
created with: infer-bics.sql
derived from: Other Income - Islamic Health
  type: BicsLevel6Segment
  type: Classifier
  type: AnachronousDerivation
  derived from: http://data.ga-group.nl/ics/bics/2014/141415101112
  source accessed on: 2019-12-03T20:05:01Z
  source last accessed on: 2019-12-03T20:05:01Z
  definition: This segment includes other income generated from direct health business in compliance with Islamic law.
  notation: 141415101112
  valid from: 2014-08-08
  valid till: 2020-10-03
derived from: Other Income - Islamic Health
  type: BicsLevel7Segment
  type: Classifier
  type: ContemporaryDerivation
  derived from: http://data.ga-group.nl/ics/bics/2020/14121012101112
  derived from: http://data.ga-group.nl/ics/bics/2024/14121012101112
  source accessed on: 2023-07-03T18:11:29Z
  source last accessed on: 2024-06-05T14:42:36Z
  definition: This segment includes other income generated from direct health insurance in compliance with Islamic law.
  notation: 14121012101112
  valid from: 2020-10-03
source accessed on: 2023-07-03T18:11:29Z
source last accessed on: 2024-06-05T14:42:36Z
definition: This segment includes other income generated from direct health insurance in compliance with Islamic law.
notation: 14121012101112
valid from: 2020-10-03

Islamic Health Ins Non-Premium
type: BicsLevel6Segment
type: Classifier
type: NamedIndividual
is level6 segment of: Health Insurance - Islamic
replaces: Islamic Health Non-Premium
created with: infer-bics.sql
derived from: Islamic Health Non-Premium
  type: BicsLevel5Segment
  type: Classifier
  type: AnachronousDerivation
  derived from: http://data.ga-group.nl/ics/bics/2014/1414151011
  source accessed on: 2019-12-03T20:05:01Z
  source last accessed on: 2019-12-03T20:05:01Z
  definition: This segment includes total non-premium revenue generated from direct health business in compliance with Islamic law.
  notation: 1414151011
  valid from: 2014-08-08
  valid till: 2020-10-03
derived from: Islamic Health Ins Non-Premium
  type: BicsLevel6Segment
  type: Classifier
  type: ContemporaryDerivation
  derived from: http://data.ga-group.nl/ics/bics/2020/141210121011
  derived from: http://data.ga-group.nl/ics/bics/2024/141210121011
  source accessed on: 2023-07-03T18:11:29Z
  source last accessed on: 2024-06-05T14:42:36Z
  definition: This segment includes total non-premium revenue generated from direct health insurance in compliance with Islamic law.
  notation: 141210121011
  valid from: 2020-10-03
source accessed on: 2023-07-03T18:11:29Z
source last accessed on: 2024-06-05T14:42:36Z
definition: This segment includes total non-premium revenue generated from direct health insurance in compliance with Islamic law.
notation: 141210121011
valid from: 2020-10-03

Health Insurance - Islamic
type: BicsLevel5Segment
type: Classifier
type: NamedIndividual
is level5 segment of: Islamic Insurance
created with: infer-bics.sql
derived from: Health Insurance - Islamic
  type: BicsLevel4SubIndustry
  type: Classifier
  type: AnachronousDerivation
  derived from: http://data.ga-group.nl/ics/bics/2014/14141510
  source accessed on: 2019-12-03T20:05:01Z
  source last accessed on: 2019-12-03T20:05:01Z
  definition: This industry subgroup includes companies that directly underwrite health insurance policies in compliance with Islamic law. Such policies include both health and medical insurance.
  notation: 14141510
  valid from: 2014-08-08
  valid till: 2020-10-03
derived from: Health Insurance - Islamic
  type: BicsLevel5Segment
  type: Classifier
  type: ContemporaryDerivation
  derived from: http://data.ga-group.nl/ics/bics/2020/1412101210
  derived from: http://data.ga-group.nl/ics/bics/2024/1412101210
  source accessed on: 2023-07-03T18:11:29Z
  source last accessed on: 2024-06-05T14:42:36Z
  definition: This segment includes companies that directly underwrite health insurance policies in compliance with Islamic law.
  notation: 1412101210
  valid from: 2020-10-03
source accessed on: 2023-07-03T18:11:29Z
source last accessed on: 2024-06-05T14:42:36Z
definition: This segment includes companies that directly underwrite health insurance policies in compliance with Islamic law.
notation: 1412101210
valid from: 2020-10-03

Islamic Life Ins Premiums
type: BicsLevel6Segment
type: Classifier
type: NamedIndividual
is level6 segment of: Life Insurance - Islamic
replaces: Islamic Life Ins Premiums
created with: infer-bics.sql
derived from: Islamic Life Ins Premiums
  type: BicsLevel5Segment
  type: Classifier
  type: AnachronousDerivation
  derived from: http://data.ga-group.nl/ics/bics/2014/1414151110
  source accessed on: 2019-12-03T20:05:01Z
  source last accessed on: 2019-12-03T20:05:01Z
  definition: This segment includes premium revenue generated from direct life business in compliance with Islamic law.
  notation: 1414151110
  valid from: 2014-08-08
  valid till: 2020-10-03
derived from: Islamic Life Ins Premiums
  type: BicsLevel6Segment
  type: Classifier
  type: ContemporaryDerivation
  derived from: http://data.ga-group.nl/ics/bics/2020/141210121110
  derived from: http://data.ga-group.nl/ics/bics/2024/141210121110
  source accessed on: 2023-07-03T18:11:29Z
  source last accessed on: 2024-06-05T14:42:36Z
  definition: This segment includes premium revenue generated from direct life insurance in compliance with Islamic law.
  notation: 141210121110
  valid from: 2020-10-03
source accessed on: 2023-07-03T18:11:29Z
source last accessed on: 2024-06-05T14:42:36Z
definition: This segment includes premium revenue generated from direct life insurance in compliance with Islamic law.
notation: 141210121110
valid from: 2020-10-03

Invst Income - Islamic Life Ins
type: BicsLevel7Segment
type: Classifier
type: NamedIndividual
is level7 segment of: Islamic Life Ins Non-Premium
replaces: Invst Income - Islamic Life Ins
created with: infer-bics.sql
derived from: Invst Income - Islamic Life Ins
  type: BicsLevel6Segment
  type: Classifier
  type: AnachronousDerivation
  derived from: http://data.ga-group.nl/ics/bics/2014/141415111110
  source accessed on: 2019-12-03T20:05:01Z
  source last accessed on: 2019-12-03T20:05:01Z
  definition: This segment includes investment income generated from direct life business in compliance with Islamic law.
  notation: 141415111110
  valid from: 2014-08-08
  valid till: 2020-10-03
derived from: Invst Income - Islamic Life Ins
  type: BicsLevel7Segment
  type: Classifier
  type: ContemporaryDerivation
  derived from: http://data.ga-group.nl/ics/bics/2020/14121012111110
  derived from: http://data.ga-group.nl/ics/bics/2024/14121012111110
  source accessed on: 2023-07-03T18:11:29Z
  source last accessed on: 2024-06-05T14:42:36Z
  definition: This segment includes investment income generated from direct life insurance in compliance with Islamic law.
  notation: 14121012111110
  valid from: 2020-10-03
source accessed on: 2023-07-03T18:11:29Z
source last accessed on: 2024-06-05T14:42:36Z
definition: This segment includes investment income generated from direct life insurance in compliance with Islamic law.
notation: 14121012111110
valid from: 2020-10-03

Realized G/L - Islamic Life Ins
type: BicsLevel7Segment
type: Classifier
type: NamedIndividual
is level7 segment of: Islamic Life Ins Non-Premium
replaces: Realized G/L - Islamic Life Ins
created with: infer-bics.sql
derived from: Realized G/L - Islamic Life Ins
  type: BicsLevel6Segment
  type: Classifier
  type: AnachronousDerivation
  derived from: http://data.ga-group.nl/ics/bics/2014/141415111111
  source accessed on: 2019-12-03T20:05:01Z
  source last accessed on: 2019-12-03T20:05:01Z
  definition: This segment includes realized gains/losses generated from direct life business in compliance with Islamic law.
  notation: 141415111111
  valid from: 2014-08-08
  valid till: 2020-10-03
derived from: Realized G/L - Islamic Life Ins
  type: BicsLevel7Segment
  type: Classifier
  type: ContemporaryDerivation
  derived from: http://data.ga-group.nl/ics/bics/2020/14121012111111
  derived from: http://data.ga-group.nl/ics/bics/2024/14121012111111
  source accessed on: 2023-07-03T18:11:29Z
  source last accessed on: 2024-06-05T14:42:36Z
  definition: This segment includes realized gains/losses generated from direct life insurance in compliance with Islamic law.
  notation: 14121012111111
  valid from: 2020-10-03
source accessed on: 2023-07-03T18:11:29Z
source last accessed on: 2024-06-05T14:42:36Z
definition: This segment includes realized gains/losses generated from direct life insurance in compliance with Islamic law.
notation: 14121012111111
valid from: 2020-10-03

Other Income - Islamic Life Ins
type: BicsLevel7Segment
type: Classifier
type: NamedIndividual
is level7 segment of: Islamic Life Ins Non-Premium
replaces: Other Income - Islamic Life Ins
created with: infer-bics.sql
derived from: Other Income - Islamic Life Ins
  type: BicsLevel6Segment
  type: Classifier
  type: AnachronousDerivation
  derived from: http://data.ga-group.nl/ics/bics/2014/141415111112
  source accessed on: 2019-12-03T20:05:01Z
  source last accessed on: 2019-12-03T20:05:01Z
  definition: This segment includes other income generated from direct life business in compliance with Islamic law.
  notation: 141415111112
  valid from: 2014-08-08
  valid till: 2020-10-03
derived from: Other Income - Islamic Life Ins
  type: BicsLevel7Segment
  type: Classifier
  type: ContemporaryDerivation
  derived from: http://data.ga-group.nl/ics/bics/2020/14121012111112
  derived from: http://data.ga-group.nl/ics/bics/2024/14121012111112
  source accessed on: 2023-07-03T18:11:29Z
  source last accessed on: 2024-06-05T14:42:36Z
  definition: This segment includes other income generated from direct life insurance in compliance with Islamic law.
  notation: 14121012111112
  valid from: 2020-10-03
source accessed on: 2023-07-03T18:11:29Z
source last accessed on: 2024-06-05T14:42:36Z
definition: This segment includes other income generated from direct life insurance in compliance with Islamic law.
notation: 14121012111112
valid from: 2020-10-03

Islamic Life Ins Non-Premium
type: BicsLevel6Segment
type: Classifier
type: NamedIndividual
is level6 segment of: Life Insurance - Islamic
replaces: Islamic Life Ins Non-Premium
created with: infer-bics.sql
derived from: Islamic Life Ins Non-Premium
  type: BicsLevel5Segment
  type: Classifier
  type: AnachronousDerivation
  derived from: http://data.ga-group.nl/ics/bics/2014/1414151111
  source accessed on: 2019-12-03T20:05:01Z
  source last accessed on: 2019-12-03T20:05:01Z
  definition: This segment includes total non-premium revenue generated from direct life business in compliance with Islamic law.
  notation: 1414151111
  valid from: 2014-08-08
  valid till: 2020-10-03
derived from: Islamic Life Ins Non-Premium
  type: BicsLevel6Segment
  type: Classifier
  type: ContemporaryDerivation
  derived from: http://data.ga-group.nl/ics/bics/2020/141210121111
  derived from: http://data.ga-group.nl/ics/bics/2024/141210121111
  source accessed on: 2023-07-03T18:11:29Z
  source last accessed on: 2024-06-05T14:42:36Z
  definition: This segment includes total non-premium revenue generated from direct life insurance in compliance with Islamic law.
  notation: 141210121111
  valid from: 2020-10-03
source accessed on: 2023-07-03T18:11:29Z
source last accessed on: 2024-06-05T14:42:36Z
definition: This segment includes total non-premium revenue generated from direct life insurance in compliance with Islamic law.
notation: 141210121111
valid from: 2020-10-03

Life Insurance - Islamic
type: BicsLevel5Segment
type: Classifier
type: NamedIndividual
is level5 segment of: Islamic Insurance
created with: infer-bics.sql
derived from: Life Insurance - Islamic
  type: BicsLevel4SubIndustry
  type: Classifier
  type: AnachronousDerivation
  derived from: http://data.ga-group.nl/ics/bics/2014/14141511
  source accessed on: 2019-12-03T20:05:01Z
  source last accessed on: 2019-12-03T20:05:01Z
  definition: This industry subgroup includes companies that directly underwrite life insurance policies in compliance with Islamic law. Insurance types include life, accidental death, disability and annuities (pensions).
  notation: 14141511
  valid from: 2014-08-08
  valid till: 2020-10-03
derived from: Life Insurance - Islamic
  type: BicsLevel5Segment
  type: Classifier
  type: ContemporaryDerivation
  derived from: http://data.ga-group.nl/ics/bics/2020/1412101211
  derived from: http://data.ga-group.nl/ics/bics/2024/1412101211
  source accessed on: 2023-07-03T18:11:29Z
  source last accessed on: 2024-06-05T14:42:36Z
  definition: This segment includes companies that directly underwrite life insurance policies in compliance with Islamic law, including life, accidental death, disability, and annuities (pensions).
  notation: 1412101211
  valid from: 2020-10-03
source accessed on: 2023-07-03T18:11:29Z
source last accessed on: 2024-06-05T14:42:36Z
definition: This segment includes companies that directly underwrite life insurance policies in compliance with Islamic law, including life, accidental death, disability, and annuities (pensions).
notation: 1412101211
valid from: 2020-10-03

Islamic P&C Ins Premiums
type: BicsLevel6Segment
type: Classifier
type: NamedIndividual
is level6 segment of: P&C Insurance - Islamic
replaces: Islamic P&C Ins Premiums
created with: infer-bics.sql
derived from: Islamic P&C Ins Premiums
  type: BicsLevel5Segment
  type: Classifier
  type: AnachronousDerivation
  derived from: http://data.ga-group.nl/ics/bics/2014/1414151210
  source accessed on: 2019-12-03T20:05:01Z
  source last accessed on: 2019-12-03T20:05:01Z
  definition: This segment includes premium revenue generated from direct property and casualty business in compliance with Islamic law.
  notation: 1414151210
  valid from: 2014-08-08
  valid till: 2020-10-03
derived from: Islamic P&C Ins Premiums
  type: BicsLevel6Segment
  type: Classifier
  type: ContemporaryDerivation
  derived from: http://data.ga-group.nl/ics/bics/2020/141210121210
  derived from: http://data.ga-group.nl/ics/bics/2024/141210121210
  source accessed on: 2023-07-03T18:11:29Z
  source last accessed on: 2024-06-05T14:42:36Z
  definition: This segment includes premium revenue generated from direct property and casualty insurance in compliance with Islamic law.
  notation: 141210121210
  valid from: 2020-10-03
source accessed on: 2023-07-03T18:11:29Z
source last accessed on: 2024-06-05T14:42:36Z
definition: This segment includes premium revenue generated from direct property and casualty insurance in compliance with Islamic law.
notation: 141210121210
valid from: 2020-10-03

Invst Income - Islamic P&C Ins
type: BicsLevel7Segment
type: Classifier
type: NamedIndividual
is level7 segment of: Islamic P&C Ins Non-Premium
replaces: Invst Income - Islamic P&C Ins
created with: infer-bics.sql
derived from: Invst Income - Islamic P&C Ins
  type: BicsLevel6Segment
  type: Classifier
  type: AnachronousDerivation
  derived from: http://data.ga-group.nl/ics/bics/2014/141415121110
  source accessed on: 2019-12-03T20:05:01Z
  source last accessed on: 2019-12-03T20:05:01Z
  definition: This segment includes investment income generated from direct property and casualty business in compliance with Islamic law.
  notation: 141415121110
  valid from: 2014-08-08
  valid till: 2020-10-03
derived from: Invst Income - Islamic P&C Ins
  type: BicsLevel7Segment
  type: Classifier
  type: ContemporaryDerivation
  derived from: http://data.ga-group.nl/ics/bics/2020/14121012121110
  derived from: http://data.ga-group.nl/ics/bics/2024/14121012121110
  source accessed on: 2023-07-03T18:11:29Z
  source last accessed on: 2024-06-05T14:42:36Z
  definition: This segment includes investment income generated from direct property and casualty insurance in compliance with Islamic law.
  notation: 14121012121110
  valid from: 2020-10-03
source accessed on: 2023-07-03T18:11:29Z
source last accessed on: 2024-06-05T14:42:36Z
definition: This segment includes investment income generated from direct property and casualty insurance in compliance with Islamic law.
notation: 14121012121110
valid from: 2020-10-03

Realized G/L - Islamic P&C Ins
type: BicsLevel7Segment
type: Classifier
type: NamedIndividual
is level7 segment of: Islamic P&C Ins Non-Premium
replaces: Realized G/L - Islamic P&C Ins
created with: infer-bics.sql
derived from: Realized G/L - Islamic P&C Ins
  type: BicsLevel6Segment
  type: Classifier
  type: AnachronousDerivation
  derived from: http://data.ga-group.nl/ics/bics/2014/141415121111
  source accessed on: 2019-12-03T20:05:01Z
  source last accessed on: 2019-12-03T20:05:01Z
  definition: This segment includes realized gains/losses generated from direct property and casualty business in compliance with Islamic law.
  notation: 141415121111
  valid from: 2014-08-08
  valid till: 2020-10-03
derived from: Realized G/L - Islamic P&C Ins
  type: BicsLevel7Segment
  type: Classifier
  type: ContemporaryDerivation
  derived from: http://data.ga-group.nl/ics/bics/2020/14121012121111
  derived from: http://data.ga-group.nl/ics/bics/2024/14121012121111
  source accessed on: 2023-07-03T18:11:29Z
  source last accessed on: 2024-06-05T14:42:36Z
  definition: This segment includes realized gains/losses generated from direct property and casualty insurance in compliance with Islamic law.
  notation: 14121012121111
  valid from: 2020-10-03
source accessed on: 2023-07-03T18:11:29Z
source last accessed on: 2024-06-05T14:42:36Z
definition: This segment includes realized gains/losses generated from direct property and casualty insurance in compliance with Islamic law.
notation: 14121012121111
valid from: 2020-10-03

Other Income - Islamic P&C Ins
type: BicsLevel7Segment
type: Classifier
type: NamedIndividual
is level7 segment of: Islamic P&C Ins Non-Premium
replaces: Other Income - Islamic P&C Ins
created with: infer-bics.sql
derived from: Other Income - Islamic P&C Ins
  type: BicsLevel6Segment
  type: Classifier
  type: AnachronousDerivation
  derived from: http://data.ga-group.nl/ics/bics/2014/141415121112
  source accessed on: 2019-12-03T20:05:01Z
  source last accessed on: 2019-12-03T20:05:01Z
  definition: This segment includes other income generated from direct property and casualty business in compliance with Islamic law.
  notation: 141415121112
  valid from: 2014-08-08
  valid till: 2020-10-03
derived from: Other Income - Islamic P&C Ins
  type: BicsLevel7Segment
  type: Classifier
  type: ContemporaryDerivation
  derived from: http://data.ga-group.nl/ics/bics/2020/14121012121112
  derived from: http://data.ga-group.nl/ics/bics/2024/14121012121112
  source accessed on: 2023-07-03T18:11:29Z
  source last accessed on: 2024-06-05T14:42:36Z
  definition: This segment includes other income generated from direct property and casualty insurance in compliance with Islamic law.
  notation: 14121012121112
  valid from: 2020-10-03
source accessed on: 2023-07-03T18:11:29Z
source last accessed on: 2024-06-05T14:42:36Z
definition: This segment includes other income generated from direct property and casualty insurance in compliance with Islamic law.
notation: 14121012121112
valid from: 2020-10-03

Islamic P&C Ins Non-Premium
type: BicsLevel6Segment
type: Classifier
type: NamedIndividual
is level6 segment of: P&C Insurance - Islamic
replaces: Islamic P&C Ins Non-Premium
created with: infer-bics.sql
derived from: Islamic P&C Ins Non-Premium
  type: BicsLevel5Segment
  type: Classifier
  type: AnachronousDerivation
  derived from: http://data.ga-group.nl/ics/bics/2014/1414151211
  source accessed on: 2019-12-03T20:05:01Z
  source last accessed on: 2019-12-03T20:05:01Z
  definition: This segment includes total non-premium revenue generated from direct property and casualty business in compliance with Islamic law.
  notation: 1414151211
  valid from: 2014-08-08
  valid till: 2020-10-03
derived from: Islamic P&C Ins Non-Premium
  type: BicsLevel6Segment
  type: Classifier
  type: ContemporaryDerivation
  derived from: http://data.ga-group.nl/ics/bics/2020/141210121211
  derived from: http://data.ga-group.nl/ics/bics/2024/141210121211
  source accessed on: 2023-07-03T18:11:29Z
  source last accessed on: 2024-06-05T14:42:36Z
  definition: This segment includes total non-premium revenue generated from direct property and casualty insurance in compliance with Islamic law.
  notation: 141210121211
  valid from: 2020-10-03
source accessed on: 2023-07-03T18:11:29Z
source last accessed on: 2024-06-05T14:42:36Z
definition: This segment includes total non-premium revenue generated from direct property and casualty insurance in compliance with Islamic law.
notation: 141210121211
valid from: 2020-10-03

P&C Insurance - Islamic
type: BicsLevel5Segment
type: Classifier
type: NamedIndividual
is level5 segment of: Islamic Insurance
created with: infer-bics.sql
derived from: P&C Insurance - Islamic
  type: BicsLevel4SubIndustry
  type: Classifier
  type: AnachronousDerivation
  derived from: http://data.ga-group.nl/ics/bics/2014/14141512
  source accessed on: 2019-12-03T20:05:01Z
  source last accessed on: 2019-12-03T20:05:01Z
  definition: This industry subgroup includes companies that directly underwrite property and casualty insurance policies in compliance with Islamic law. Insurance types include automobile, property damage, casualty, theft, fire, malpractice, marine, workers' compensation and homeowners insurance.
  notation: 14141512
  valid from: 2014-08-08
  valid till: 2020-10-03
derived from: P&C Insurance - Islamic
  type: BicsLevel5Segment
  type: Classifier
  type: ContemporaryDerivation
  derived from: http://data.ga-group.nl/ics/bics/2020/1412101212
  derived from: http://data.ga-group.nl/ics/bics/2024/1412101212
  source accessed on: 2023-07-03T18:11:29Z
  source last accessed on: 2024-06-05T14:42:36Z
  definition: This segment includes companies that directly underwrite property and casualty insurance policies in compliance with Islamic law. Includes automobile, property damage, casualty, theft, fire, malpractice, marine, workers' compensation, and homeowners insurance.
  notation: 1412101212
  valid from: 2020-10-03
source accessed on: 2023-07-03T18:11:29Z
source last accessed on: 2024-06-05T14:42:36Z
definition: This segment includes companies that directly underwrite property and casualty insurance policies in compliance with Islamic law. Includes automobile, property damage, casualty, theft, fire, malpractice, marine, workers' compensation, and homeowners insurance.
notation: 1412101212
valid from: 2020-10-03

Islamic Insurance
type: BicsLevel4SubIndustry
type: Classifier
type: NamedIndividual
replaces: Islamic Insurance Carriers
created with: infer-bics.sql
derived from: Islamic Insurance Carriers
  type: BicsLevel3Industry
  type: Classifier
  type: AnachronousDerivation
  derived from: http://data.ga-group.nl/ics/bics/2014/141415
  source accessed on: 2019-12-03T20:05:01Z
  source last accessed on: 2019-12-03T20:05:01Z
  definition: This industry includes companies that underwrite life, health and medical, property and casualty, and related insurance lines, either directly or as a reinsurer; companies that provide insurance related services, such as claims adjusting, administrative and advisory services; and insurance agencies and brokers. Such companies operate in compliance with Islamic law.
  notation: 141415
  valid from: 2014-08-08
  valid till: 2020-10-03
derived from: Islamic Insurance
  type: BicsLevel4SubIndustry
  type: Classifier
  type: ContemporaryDerivation
  derived from: http://data.ga-group.nl/ics/bics/2020/14121012
  derived from: http://data.ga-group.nl/ics/bics/2024/14121012
  source accessed on: 2023-07-03T18:11:29Z
  source last accessed on: 2024-06-05T14:42:36Z
  definition: This industry subgroup includes companies that underwrite direct or indirect insurance products in compliance with Islamic law such as Takaful. Includes health and life insurance.
  notation: 14121012
  valid from: 2020-10-03
source accessed on: 2023-07-03T18:11:29Z
source last accessed on: 2024-06-05T14:42:36Z
definition: This industry subgroup includes companies that underwrite direct or indirect insurance products in compliance with Islamic law such as Takaful. Includes health and life insurance.
notation: 14121012
valid from: 2020-10-03

Life Reinsurance Premiums
type: BicsLevel6Segment
type: Classifier
type: NamedIndividual
is level6 segment of: Life Reinsurance
replaces: Life Reinsurance Premiums
created with: infer-bics.sql
derived from: Life Reinsurance Premiums
  type: BicsLevel5Segment
  type: Classifier
  type: AnachronousDerivation
  derived from: http://data.ga-group.nl/ics/bics/2014/1414121010
  source accessed on: 2019-12-03T20:05:01Z
  source last accessed on: 2019-12-03T20:05:01Z
  definition: This segment includes premium revenue generated from life reinsurance business.
  notation: 1414121010
  valid from: 2014-08-08
  valid till: 2020-10-03
derived from: Life Reinsurance Premiums
  type: BicsLevel6Segment
  type: Classifier
  type: ContemporaryDerivation
  derived from: http://data.ga-group.nl/ics/bics/2020/141210131010
  source accessed on: 2023-07-03T18:11:29Z
  source last accessed on: 2023-07-03T18:11:29Z
  definition: This segment includes premium revenue generated from life reinsurance.
  notation: 141210131010
  valid from: 2020-10-03
  valid till: 2024-06-07
derived from: Life Reinsurance Premiums
  type: BicsLevel6Segment
  type: Classifier
  type: ContemporaryDerivation
  derived from: http://data.ga-group.nl/ics/bics/2024/141210131010
  source accessed on: 2024-06-05T14:42:36Z
  source last accessed on: 2024-06-05T14:42:36Z
  definition: This segment includes premium revenue generated from life reinsurance insurance.
  notation: 141210131010
  valid from: 2024-06-07
source accessed on: 2023-07-03T18:11:29Z
source last accessed on: 2024-06-05T14:42:36Z
definition: This segment includes premium revenue generated from life reinsurance insurance.
notation: 141210131010
valid from: 2020-10-03

Investment Income - Life Re
type: BicsLevel7Segment
type: Classifier
type: NamedIndividual
is level7 segment of: Life Reinsurance Non-Premium
replaces: Investment Income - Life Re
created with: infer-bics.sql
derived from: Investment Income - Life Re
  type: BicsLevel6Segment
  type: Classifier
  type: AnachronousDerivation
  derived from: http://data.ga-group.nl/ics/bics/2014/141412101110
  source accessed on: 2019-12-03T20:05:01Z
  source last accessed on: 2019-12-03T20:05:01Z
  definition: This segment includes investment-generated income from life reinsurance business.
  notation: 141412101110
  valid from: 2014-08-08
  valid till: 2020-10-03
derived from: Investment Income - Life Re
  type: BicsLevel7Segment
  type: Classifier
  type: ContemporaryDerivation
  derived from: http://data.ga-group.nl/ics/bics/2020/14121013101110
  derived from: http://data.ga-group.nl/ics/bics/2024/14121013101110
  source accessed on: 2023-07-03T18:11:29Z
  source last accessed on: 2024-06-05T14:42:36Z
  definition: This segment includes investment-generated income from life reinsurance business.
  notation: 14121013101110
  valid from: 2020-10-03
source accessed on: 2023-07-03T18:11:29Z
source last accessed on: 2024-06-05T14:42:36Z
definition: This segment includes investment-generated income from life reinsurance business.
notation: 14121013101110
valid from: 2020-10-03

Realized G/L - Life Reinsurance
type: BicsLevel7Segment
type: Classifier
type: NamedIndividual
is level7 segment of: Life Reinsurance Non-Premium
replaces: Realized G/L - Life Reinsurance
created with: infer-bics.sql
derived from: Realized G/L - Life Reinsurance
  type: BicsLevel6Segment
  type: Classifier
  type: AnachronousDerivation
  derived from: http://data.ga-group.nl/ics/bics/2014/141412101111
  source accessed on: 2019-12-03T20:05:01Z
  source last accessed on: 2019-12-03T20:05:01Z
  definition: This segment includes realized gains/losses generated from life reinsurance business.
  notation: 141412101111
  valid from: 2014-08-08
  valid till: 2020-10-03
derived from: Realized G/L - Life Reinsurance
  type: BicsLevel7Segment
  type: Classifier
  type: ContemporaryDerivation
  derived from: http://data.ga-group.nl/ics/bics/2020/14121013101111
  derived from: http://data.ga-group.nl/ics/bics/2024/14121013101111
  source accessed on: 2023-07-03T18:11:29Z
  source last accessed on: 2024-06-05T14:42:36Z
  definition: This segment includes realized gains/losses generated from life reinsurance business.
  notation: 14121013101111
  valid from: 2020-10-03
source accessed on: 2023-07-03T18:11:29Z
source last accessed on: 2024-06-05T14:42:36Z
definition: This segment includes realized gains/losses generated from life reinsurance business.
notation: 14121013101111
valid from: 2020-10-03

Other Income - Life Reinsurance
type: BicsLevel7Segment
type: Classifier
type: NamedIndividual
is level7 segment of: Life Reinsurance Non-Premium
replaces: Other Income - Life Reinsurance
created with: infer-bics.sql
derived from: Other Income - Life Reinsurance
  type: BicsLevel6Segment
  type: Classifier
  type: AnachronousDerivation
  derived from: http://data.ga-group.nl/ics/bics/2014/141412101112
  source accessed on: 2019-12-03T20:05:01Z
  source last accessed on: 2019-12-03T20:05:01Z
  definition: This segment includes other income generated from life reinsurance business.
  notation: 141412101112
  valid from: 2014-08-08
  valid till: 2020-10-03
derived from: Other Income - Life Reinsurance
  type: BicsLevel7Segment
  type: Classifier
  type: ContemporaryDerivation
  derived from: http://data.ga-group.nl/ics/bics/2020/14121013101112
  derived from: http://data.ga-group.nl/ics/bics/2024/14121013101112
  source accessed on: 2023-07-03T18:11:29Z
  source last accessed on: 2024-06-05T14:42:36Z
  definition: This segment includes other income generated from life reinsurance business.
  notation: 14121013101112
  valid from: 2020-10-03
source accessed on: 2023-07-03T18:11:29Z
source last accessed on: 2024-06-05T14:42:36Z
definition: This segment includes other income generated from life reinsurance business.
notation: 14121013101112
valid from: 2020-10-03

Life Reinsurance Non-Premium
type: BicsLevel6Segment
type: Classifier
type: NamedIndividual
is level6 segment of: Life Reinsurance
replaces: Life Reinsurance Non-Premium
created with: infer-bics.sql
derived from: Life Reinsurance Non-Premium
  type: BicsLevel5Segment
  type: Classifier
  type: AnachronousDerivation
  derived from: http://data.ga-group.nl/ics/bics/2014/1414121011
  source accessed on: 2019-12-03T20:05:01Z
  source last accessed on: 2019-12-03T20:05:01Z
  definition: This segment includes total non-premium revenue generated from life reinsurance business.
  notation: 1414121011
  valid from: 2014-08-08
  valid till: 2020-10-03
derived from: Life Reinsurance Non-Premium
  type: BicsLevel6Segment
  type: Classifier
  type: ContemporaryDerivation
  derived from: http://data.ga-group.nl/ics/bics/2020/141210131011
  derived from: http://data.ga-group.nl/ics/bics/2024/141210131011
  source accessed on: 2023-07-03T18:11:29Z
  source last accessed on: 2024-06-05T14:42:36Z
  definition: This segment includes total non-premium revenue generated from life reinsurance.
  notation: 141210131011
  valid from: 2020-10-03
source accessed on: 2023-07-03T18:11:29Z
source last accessed on: 2024-06-05T14:42:36Z
definition: This segment includes total non-premium revenue generated from life reinsurance.
notation: 141210131011
valid from: 2020-10-03

Life Reinsurance
type: BicsLevel5Segment
type: Classifier
type: NamedIndividual
is level5 segment of: Reinsurance
created with: infer-bics.sql
derived from: Life Reinsurance
  type: BicsLevel4SubIndustry
  type: Classifier
  type: AnachronousDerivation
  derived from: http://data.ga-group.nl/ics/bics/2014/14141210
  source accessed on: 2019-12-03T20:05:01Z
  source last accessed on: 2019-12-03T20:05:01Z
  definition: This industry subgroup includes companies that underwrite reinsurance for life insurance policies. Insurance types include life, accidental death, disability and annuities (pensions).
  notation: 14141210
  valid from: 2014-08-08
  valid till: 2020-10-03
derived from: Life Reinsurance
  type: BicsLevel5Segment
  type: Classifier
  type: ContemporaryDerivation
  derived from: http://data.ga-group.nl/ics/bics/2020/1412101310
  derived from: http://data.ga-group.nl/ics/bics/2024/1412101310
  source accessed on: 2023-07-03T18:11:29Z
  source last accessed on: 2024-06-05T14:42:36Z
  definition: This segment includes companies that underwrite reinsurance for life insurance policies. Insurance types include life, accidental death, disability and annuities (pensions).
  notation: 1412101310
  valid from: 2020-10-03
source accessed on: 2023-07-03T18:11:29Z
source last accessed on: 2024-06-05T14:42:36Z
definition: This segment includes companies that underwrite reinsurance for life insurance policies. Insurance types include life, accidental death, disability and annuities (pensions).
notation: 1412101310
valid from: 2020-10-03

Casualty Lines Premiums
type: BicsLevel7Segment
type: Classifier
type: NamedIndividual
is level7 segment of: P&C Reinsurance Premiums
replaces: Casualty Lines Premiums
created with: infer-bics.sql
derived from: Casualty Lines Premiums
  type: BicsLevel6Segment
  type: Classifier
  type: AnachronousDerivation
  derived from: http://data.ga-group.nl/ics/bics/2014/141412111010
  source accessed on: 2019-12-03T20:05:01Z
  source last accessed on: 2019-12-03T20:05:01Z
  definition: This segment includes premium revenue generated from all casualty reinsurance, including specialty coverage and all other casualty lines, including all liability lines of business.
  notation: 141412111010
  valid from: 2014-08-08
  valid till: 2020-10-03
derived from: Casualty Lines Premiums
  type: BicsLevel7Segment
  type: Classifier
  type: ContemporaryDerivation
  derived from: http://data.ga-group.nl/ics/bics/2020/14121013111010
  derived from: http://data.ga-group.nl/ics/bics/2024/14121013111010
  source accessed on: 2023-07-03T18:11:29Z
  source last accessed on: 2024-06-05T14:42:36Z
  definition: This segment includes premium revenue generated from all casualty reinsurance, including specialty coverage and all other casualty lines, including all liability lines of business.
  notation: 14121013111010
  valid from: 2020-10-03
source accessed on: 2023-07-03T18:11:29Z
source last accessed on: 2024-06-05T14:42:36Z
definition: This segment includes premium revenue generated from all casualty reinsurance, including specialty coverage and all other casualty lines, including all liability lines of business.
notation: 14121013111010
valid from: 2020-10-03

Property Lines Premiums
type: BicsLevel7Segment
type: Classifier
type: NamedIndividual
is level7 segment of: P&C Reinsurance Premiums
replaces: Property Lines Premiums
created with: infer-bics.sql
derived from: Property Lines Premiums
  type: BicsLevel6Segment
  type: Classifier
  type: AnachronousDerivation
  derived from: http://data.ga-group.nl/ics/bics/2014/141412111011
  source accessed on: 2019-12-03T20:05:01Z
  source last accessed on: 2019-12-03T20:05:01Z
  definition: This segment includes premium revenue generated from all property reinsurance, including catastrophe coverage and business not specified as catastrophe reinsurance.
  notation: 141412111011
  valid from: 2014-08-08
  valid till: 2020-10-03
derived from: Property Lines Premiums
  type: BicsLevel7Segment
  type: Classifier
  type: ContemporaryDerivation
  derived from: http://data.ga-group.nl/ics/bics/2020/14121013111011
  derived from: http://data.ga-group.nl/ics/bics/2024/14121013111011
  source accessed on: 2023-07-03T18:11:29Z
  source last accessed on: 2024-06-05T14:42:36Z
  definition: This segment includes premium revenue generated from all property reinsurance such as catastrophe coverage.
  notation: 14121013111011
  valid from: 2020-10-03
source accessed on: 2023-07-03T18:11:29Z
source last accessed on: 2024-06-05T14:42:36Z
definition: This segment includes premium revenue generated from all property reinsurance such as catastrophe coverage.
notation: 14121013111011
valid from: 2020-10-03

P&C Reinsurance Premiums
type: BicsLevel6Segment
type: Classifier
type: NamedIndividual
is level6 segment of: P&C Reinsurance
replaces: P&C Reinsurance Premiums
created with: infer-bics.sql
derived from: P&C Reinsurance Premiums
  type: BicsLevel5Segment
  type: Classifier
  type: AnachronousDerivation
  derived from: http://data.ga-group.nl/ics/bics/2014/1414121110
  source accessed on: 2019-12-03T20:05:01Z
  source last accessed on: 2019-12-03T20:05:01Z
  definition: This segment includes premium revenue generated from property and casualty reinsurance business.
  notation: 1414121110
  valid from: 2014-08-08
  valid till: 2020-10-03
derived from: P&C Reinsurance Premiums
  type: BicsLevel6Segment
  type: Classifier
  type: ContemporaryDerivation
  derived from: http://data.ga-group.nl/ics/bics/2020/141210131110
  derived from: http://data.ga-group.nl/ics/bics/2024/141210131110
  source accessed on: 2023-07-03T18:11:29Z
  source last accessed on: 2024-06-05T14:42:36Z
  definition: This segment includes premium revenue generated from property and casualty reinsurance.
  notation: 141210131110
  valid from: 2020-10-03
source accessed on: 2023-07-03T18:11:29Z
source last accessed on: 2024-06-05T14:42:36Z
definition: This segment includes premium revenue generated from property and casualty reinsurance.
notation: 141210131110
valid from: 2020-10-03

Investment Income - P&C Re
type: BicsLevel7Segment
type: Classifier
type: NamedIndividual
is level7 segment of: P&C Reinsurance Non-Premium
replaces: Investment Income - P&C Re
created with: infer-bics.sql
derived from: Investment Income - P&C Re
  type: BicsLevel6Segment
  type: Classifier
  type: AnachronousDerivation
  derived from: http://data.ga-group.nl/ics/bics/2014/141412111110
  source accessed on: 2019-12-03T20:05:01Z
  source last accessed on: 2019-12-03T20:05:01Z
  definition: This segment includes investment income generated from property and casualty reinsurance business.
  notation: 141412111110
  valid from: 2014-08-08
  valid till: 2020-10-03
derived from: Investment Income - P&C Re
  type: BicsLevel7Segment
  type: Classifier
  type: ContemporaryDerivation
  derived from: http://data.ga-group.nl/ics/bics/2020/14121013111110
  derived from: http://data.ga-group.nl/ics/bics/2024/14121013111110
  source accessed on: 2023-07-03T18:11:29Z
  source last accessed on: 2024-06-05T14:42:36Z
  definition: This segment includes investment income generated from property and casualty reinsurance business.
  notation: 14121013111110
  valid from: 2020-10-03
source accessed on: 2023-07-03T18:11:29Z
source last accessed on: 2024-06-05T14:42:36Z
definition: This segment includes investment income generated from property and casualty reinsurance business.
notation: 14121013111110
valid from: 2020-10-03

Realized G/L - P&C Reinsurance
type: BicsLevel7Segment
type: Classifier
type: NamedIndividual
is level7 segment of: P&C Reinsurance Non-Premium
replaces: Realized G/L - P&C Reinsurance
created with: infer-bics.sql
derived from: Realized G/L - P&C Reinsurance
  type: BicsLevel6Segment
  type: Classifier
  type: AnachronousDerivation
  derived from: http://data.ga-group.nl/ics/bics/2014/141412111111
  source accessed on: 2019-12-03T20:05:01Z
  source last accessed on: 2019-12-03T20:05:01Z
  definition: This segment includes realized gains/losses generated from property and casualty reinsurance business.
  notation: 141412111111
  valid from: 2014-08-08
  valid till: 2020-10-03
derived from: Realized G/L - P&C Reinsurance
  type: BicsLevel7Segment
  type: Classifier
  type: ContemporaryDerivation
  derived from: http://data.ga-group.nl/ics/bics/2020/14121013111111
  derived from: http://data.ga-group.nl/ics/bics/2024/14121013111111
  source accessed on: 2023-07-03T18:11:29Z
  source last accessed on: 2024-06-05T14:42:36Z
  definition: This segment includes realized gains/losses generated from property and casualty reinsurance business.
  notation: 14121013111111
  valid from: 2020-10-03
source accessed on: 2023-07-03T18:11:29Z
source last accessed on: 2024-06-05T14:42:36Z
definition: This segment includes realized gains/losses generated from property and casualty reinsurance business.
notation: 14121013111111
valid from: 2020-10-03

Other Income - P&C Reinsurance
type: BicsLevel7Segment
type: Classifier
type: NamedIndividual
is level7 segment of: P&C Reinsurance Non-Premium
replaces: Other Income - P&C Reinsurance
created with: infer-bics.sql
derived from: Other Income - P&C Reinsurance
  type: BicsLevel6Segment
  type: Classifier
  type: AnachronousDerivation
  derived from: http://data.ga-group.nl/ics/bics/2014/141412111112
  source accessed on: 2019-12-03T20:05:01Z
  source last accessed on: 2019-12-03T20:05:01Z
  definition: This segment includes other income generated from property and casualty reinsurance business.
  notation: 141412111112
  valid from: 2014-08-08
  valid till: 2020-10-03
derived from: Other Income - P&C Reinsurance
  type: BicsLevel7Segment
  type: Classifier
  type: ContemporaryDerivation
  derived from: http://data.ga-group.nl/ics/bics/2020/14121013111112
  derived from: http://data.ga-group.nl/ics/bics/2024/14121013111112
  source accessed on: 2023-07-03T18:11:29Z
  source last accessed on: 2024-06-05T14:42:36Z
  definition: This segment includes other income generated from property and casualty reinsurance business.
  notation: 14121013111112
  valid from: 2020-10-03
source accessed on: 2023-07-03T18:11:29Z
source last accessed on: 2024-06-05T14:42:36Z
definition: This segment includes other income generated from property and casualty reinsurance business.
notation: 14121013111112
valid from: 2020-10-03

P&C Reinsurance Non-Premium
type: BicsLevel6Segment
type: Classifier
type: NamedIndividual
is level6 segment of: P&C Reinsurance
replaces: P&C Reinsurance Non-Premium
created with: infer-bics.sql
derived from: P&C Reinsurance Non-Premium
  type: BicsLevel5Segment
  type: Classifier
  type: AnachronousDerivation
  derived from: http://data.ga-group.nl/ics/bics/2014/1414121111
  source accessed on: 2019-12-03T20:05:01Z
  source last accessed on: 2019-12-03T20:05:01Z
  definition: This segment includes total non-premium revenue generated from property and casualty reinsurance business.
  notation: 1414121111
  valid from: 2014-08-08
  valid till: 2020-10-03
derived from: P&C Reinsurance Non-Premium
  type: BicsLevel6Segment
  type: Classifier
  type: ContemporaryDerivation
  derived from: http://data.ga-group.nl/ics/bics/2020/141210131111
  derived from: http://data.ga-group.nl/ics/bics/2024/141210131111
  source accessed on: 2023-07-03T18:11:29Z
  source last accessed on: 2024-06-05T14:42:36Z
  definition: This segment includes total non-premium revenue generated from property and casualty reinsurance.
  notation: 141210131111
  valid from: 2020-10-03
source accessed on: 2023-07-03T18:11:29Z
source last accessed on: 2024-06-05T14:42:36Z
definition: This segment includes total non-premium revenue generated from property and casualty reinsurance.
notation: 141210131111
valid from: 2020-10-03

P&C Reinsurance
type: BicsLevel5Segment
type: Classifier
type: NamedIndividual
is level5 segment of: Reinsurance
created with: infer-bics.sql
derived from: P&C Reinsurance
  type: BicsLevel4SubIndustry
  type: Classifier
  type: AnachronousDerivation
  derived from: http://data.ga-group.nl/ics/bics/2014/14141211
  source accessed on: 2019-12-03T20:05:01Z
  source last accessed on: 2019-12-03T20:05:01Z
  definition: This industry subgroup includes companies that underwrite reinsurance for property and casualty insurance policies. Insurance types include automobile, property damage, casualty, theft, fire, malpractice, marine, workers' compensation and homeowners insurance.
  notation: 14141211
  valid from: 2014-08-08
  valid till: 2020-10-03
derived from: P&C Reinsurance
  type: BicsLevel5Segment
  type: Classifier
  type: ContemporaryDerivation
  derived from: http://data.ga-group.nl/ics/bics/2020/1412101311
  derived from: http://data.ga-group.nl/ics/bics/2024/1412101311
  source accessed on: 2023-07-03T18:11:29Z
  source last accessed on: 2024-06-05T14:42:36Z
  definition: This segment includes companies that underwrite reinsurance for property and casualty insurance policies. Insurance types include automobile, property damage, casualty, theft, fire, malpractice, marine, workers' compensation and homeowners insurance.
  notation: 1412101311
  valid from: 2020-10-03
source accessed on: 2023-07-03T18:11:29Z
source last accessed on: 2024-06-05T14:42:36Z
definition: This segment includes companies that underwrite reinsurance for property and casualty insurance policies. Insurance types include automobile, property damage, casualty, theft, fire, malpractice, marine, workers' compensation and homeowners insurance.
notation: 1412101311
valid from: 2020-10-03

Reinsurance
type: BicsLevel4SubIndustry
type: Classifier
type: NamedIndividual
replaces: Reinsurance
created with: infer-bics.sql
derived from: Reinsurance
  type: BicsLevel3Industry
  type: Classifier
  type: AnachronousDerivation
  derived from: http://data.ga-group.nl/ics/bics/2014/141412
  source accessed on: 2019-12-03T20:05:01Z
  source last accessed on: 2019-12-03T20:05:01Z
  definition: This industry includes companies that underwrite reinsurance for life, health and medical, property and casualty, title, and other insurance policies.
  notation: 141412
  valid from: 2014-08-08
  valid till: 2020-10-03
derived from: Reinsurance
  type: BicsLevel4SubIndustry
  type: Classifier
  type: ContemporaryDerivation
  derived from: http://data.ga-group.nl/ics/bics/2020/14121013
  derived from: http://data.ga-group.nl/ics/bics/2024/14121013
  source accessed on: 2023-07-03T18:11:29Z
  source last accessed on: 2024-06-05T14:42:36Z
  definition: This industry subgroup includes companies that underwrite reinsurance for life, health and medical, property and casualty, title, and other insurance policies.
  notation: 14121013
  valid from: 2020-10-03
source accessed on: 2023-07-03T18:11:29Z
source last accessed on: 2024-06-05T14:42:36Z
definition: This industry subgroup includes companies that underwrite reinsurance for life, health and medical, property and casualty, title, and other insurance policies.
notation: 14121013
valid from: 2020-10-03

Insurance Brokers & Services
type: BicsLevel4SubIndustry
type: Classifier
type: NamedIndividual
replaces: Insurance Brokers
created with: infer-bics.sql
derived from: Insurance Brokers
  type: BicsLevel3Industry
  type: Classifier
  type: AnachronousDerivation
  derived from: http://data.ga-group.nl/ics/bics/2014/141413
  source accessed on: 2019-12-03T20:05:01Z
  source last accessed on: 2019-12-03T20:05:01Z
  definition: This industry includes companies that act as insurance intermediaries that sell insurance policies and other insurance-related products like annuities.
  notation: 141413
  valid from: 2014-08-08
  valid till: 2020-10-03
derived from: Insurance Brokers & Services
  type: BicsLevel4SubIndustry
  type: Classifier
  type: ContemporaryDerivation
  derived from: http://data.ga-group.nl/ics/bics/2020/14121014
  derived from: http://data.ga-group.nl/ics/bics/2024/14121014
  source accessed on: 2023-07-03T18:11:29Z
  source last accessed on: 2024-06-05T14:42:36Z
  definition: This industry subgroup includes companies that act as insurance intermediaries to sell insurance policies and other insurance-related products like annuities.
  notation: 14121014
  valid from: 2020-10-03
source accessed on: 2023-07-03T18:11:29Z
source last accessed on: 2024-06-05T14:42:36Z
definition: This industry subgroup includes companies that act as insurance intermediaries to sell insurance policies and other insurance-related products like annuities.
notation: 14121014
valid from: 2020-10-03

Insurance
type: BicsLevel3Industry
type: Classifier
type: NamedIndividual
is industry of: Insurance
is replaced by: Commercial Finance
created with: infer-bics.sql
derived from: Commercial Finance
  type: BicsLevel3Industry
  type: Classifier
  type: ContemporaryDerivation
  derived from: http://data.ga-group.nl/ics/bics/2014/141210
  source accessed on: 2019-12-03T20:05:01Z
  source last accessed on: 2019-12-03T20:05:01Z
  definition: This industry includes companies that provide loans and other financing to businesses. This industry includes commercial and industrial leasing, and transportation equipment leasing.
  notation: 141210
  valid from: 2014-08-08
  valid till: 2020-10-03
derived from: Insurance
  type: BicsLevel3Industry
  type: Classifier
  type: ContemporaryDerivation
  derived from: http://data.ga-group.nl/ics/bics/2020/141210
  derived from: http://data.ga-group.nl/ics/bics/2024/141210
  source accessed on: 2023-07-03T18:11:29Z
  source last accessed on: 2024-06-05T14:42:36Z
  definition: This industry includes companies that underwrite insurance products or companies that specialize in providing insurance related services.
  notation: 141210
  valid from: 2020-10-03
source accessed on: 2019-12-03T20:05:01Z
source last accessed on: 2024-06-05T14:42:36Z
definition: This industry includes companies that underwrite insurance products or companies that specialize in providing insurance related services.
notation: 141210
valid from: 2014-08-08

Auto Finance
type: BicsLevel4SubIndustry
type: Classifier
type: NamedIndividual
created with: infer-bics.sql
derived from: Auto Finance
  type: BicsLevel4SubIndustry
  type: Classifier
  type: ContemporaryDerivation
  derived from: http://data.ga-group.nl/ics/bics/2014/14121110
  source accessed on: 2019-12-03T20:05:01Z
  source last accessed on: 2019-12-03T20:05:01Z
  definition: This industry subgroup includes companies that originate, service and/or collect auto loans to consumers.
  notation: 14121110
  valid from: 2014-08-08
  valid till: 2020-10-03
source accessed on: 2019-12-03T20:05:01Z
source last accessed on: 2019-12-03T20:05:01Z
definition: This industry subgroup includes companies that originate, service and/or collect auto loans to consumers.
notation: 14121110
valid from: 2014-08-08
valid till: 2020-10-03

Consumer Microlending
type: BicsLevel4SubIndustry
type: Classifier
type: NamedIndividual
created with: infer-bics.sql
derived from: Consumer Microlending
  type: BicsLevel4SubIndustry
  type: Classifier
  type: ContemporaryDerivation
  derived from: http://data.ga-group.nl/ics/bics/2014/14121111
  source accessed on: 2019-12-03T20:05:01Z
  source last accessed on: 2019-12-03T20:05:01Z
  definition: This industry subgroup includes companies that provide small amount lending to consumers. Such lending includes payday loans and pawn shop loans. These loans often are made to consumers who have limited access to credit, are short term in duration, have fixed fees and have easy and fast processing.
  notation: 14121111
  valid from: 2014-08-08
  valid till: 2020-10-03
source accessed on: 2019-12-03T20:05:01Z
source last accessed on: 2019-12-03T20:05:01Z
definition: This industry subgroup includes companies that provide small amount lending to consumers. Such lending includes payday loans and pawn shop loans. These loans often are made to consumers who have limited access to credit, are short term in duration, have fixed fees and have easy and fast processing.
notation: 14121111
valid from: 2014-08-08
valid till: 2020-10-03

Credit Card Issuing
type: BicsLevel5Segment
type: Classifier
type: NamedIndividual
is level5 segment of: Credit & Debit
is replaced by: Credit Card Lending
created with: infer-bics.sql
derived from: Credit Card Issuing
  type: BicsLevel5Segment
  type: Classifier
  type: ContemporaryDerivation
  derived from: http://data.ga-group.nl/ics/bics/2014/1412111210
  source accessed on: 2019-12-03T20:05:01Z
  source last accessed on: 2019-12-03T20:05:01Z
  definition: This segment includes companies that issue credit cards.
  notation: 1412111210
  valid from: 2014-08-08
  valid till: 2020-10-03
source accessed on: 2019-12-03T20:05:01Z
source last accessed on: 2019-12-03T20:05:01Z
definition: This segment includes companies that issue credit cards.
notation: 1412111210
valid from: 2014-08-08
valid till: 2020-10-03

Financial Transaction Proc Svcs
type: BicsLevel5Segment
type: Classifier
type: NamedIndividual
is level5 segment of: Credit & Debit
is replaced by: http://data.ga-group.nl/ics/bics/1911111210
created with: infer-bics.sql
derived from: Financial Transaction Proc Svcs
  type: BicsLevel5Segment
  type: Classifier
  type: ContemporaryDerivation
  derived from: http://data.ga-group.nl/ics/bics/2014/1412111211
  source accessed on: 2019-12-03T20:05:01Z
  source last accessed on: 2019-12-03T20:05:01Z
  definition: This segment includes companies that provide financial transaction processing services, such as electronic payment processing.
  notation: 1412111211
  valid from: 2014-08-08
  valid till: 2020-10-03
source accessed on: 2019-12-03T20:05:01Z
source last accessed on: 2019-12-03T20:05:01Z
definition: This segment includes companies that provide financial transaction processing services, such as electronic payment processing.
notation: 1412111211
valid from: 2014-08-08
valid till: 2020-10-03

Payment Services
type: BicsLevel5Segment
type: Classifier
type: NamedIndividual
is level5 segment of: Credit & Debit
created with: infer-bics.sql
derived from: Payment Services
  type: BicsLevel5Segment
  type: Classifier
  type: ContemporaryDerivation
  derived from: http://data.ga-group.nl/ics/bics/2014/1412111212
  source accessed on: 2019-12-03T20:05:01Z
  source last accessed on: 2019-12-03T20:05:01Z
  definition: This segment includes companies that provide payment services.
  notation: 1412111212
  valid from: 2014-08-08
  valid till: 2020-10-03
source accessed on: 2019-12-03T20:05:01Z
source last accessed on: 2019-12-03T20:05:01Z
definition: This segment includes companies that provide payment services.
notation: 1412111212
valid from: 2014-08-08
valid till: 2020-10-03

Credit & Debit
type: BicsLevel4SubIndustry
type: Classifier
type: NamedIndividual
created with: infer-bics.sql
derived from: Credit & Debit
  type: BicsLevel4SubIndustry
  type: Classifier
  type: ContemporaryDerivation
  derived from: http://data.ga-group.nl/ics/bics/2014/14121112
  source accessed on: 2019-12-03T20:05:01Z
  source last accessed on: 2019-12-03T20:05:01Z
  definition: This industry subgroup includes companies that issue credit and debit cards, or provide financial transaction or payment services.
  notation: 14121112
  valid from: 2014-08-08
  valid till: 2020-10-03
source accessed on: 2019-12-03T20:05:01Z
source last accessed on: 2019-12-03T20:05:01Z
definition: This industry subgroup includes companies that issue credit and debit cards, or provide financial transaction or payment services.
notation: 14121112
valid from: 2014-08-08
valid till: 2020-10-03

Student Lending
type: BicsLevel4SubIndustry
type: Classifier
type: NamedIndividual
created with: infer-bics.sql
derived from: Student Lending
  type: BicsLevel4SubIndustry
  type: Classifier
  type: ContemporaryDerivation
  derived from: http://data.ga-group.nl/ics/bics/2014/14121113
  source accessed on: 2019-12-03T20:05:01Z
  source last accessed on: 2019-12-03T20:05:01Z
  definition: This industry subgroup includes companies that originate, service and/or collect student loans to consumers for educational purposes.
  notation: 14121113
  valid from: 2014-08-08
  valid till: 2020-10-03
source accessed on: 2019-12-03T20:05:01Z
source last accessed on: 2019-12-03T20:05:01Z
definition: This industry subgroup includes companies that originate, service and/or collect student loans to consumers for educational purposes.
notation: 14121113
valid from: 2014-08-08
valid till: 2020-10-03

Consumer Finance
type: BicsLevel3Industry
type: Classifier
type: NamedIndividual
is industry of: Insurance
is replaced by: Consumer Finance
created with: infer-bics.sql
derived from: Consumer Finance
  type: BicsLevel3Industry
  type: Classifier
  type: ContemporaryDerivation
  derived from: http://data.ga-group.nl/ics/bics/2014/141211
  source accessed on: 2019-12-03T20:05:01Z
  source last accessed on: 2019-12-03T20:05:01Z
  definition: This industry includes companies that provide loans to consumers. Consumer loans include auto loans, consumer microlending, credit and debit, and student loans.
  notation: 141211
  valid from: 2014-08-08
  valid till: 2020-10-03
source accessed on: 2019-12-03T20:05:01Z
source last accessed on: 2019-12-03T20:05:01Z
definition: This industry includes companies that provide loans to consumers. Consumer loans include auto loans, consumer microlending, credit and debit, and student loans.
notation: 141211
valid from: 2014-08-08
valid till: 2020-10-03

Mortgage Lenders
type: BicsLevel4SubIndustry
type: Classifier
type: NamedIndividual
created with: infer-bics.sql
derived from: Mortgage Lenders
  type: BicsLevel4SubIndustry
  type: Classifier
  type: ContemporaryDerivation
  derived from: http://data.ga-group.nl/ics/bics/2014/14121210
  source accessed on: 2019-12-03T20:05:01Z
  source last accessed on: 2019-12-03T20:05:01Z
  definition: This industry subgroup includes companies that provide home financing services, such as mortgages and home equity loans.
  notation: 14121210
  valid from: 2014-08-08
  valid till: 2020-10-03
source accessed on: 2019-12-03T20:05:01Z
source last accessed on: 2019-12-03T20:05:01Z
definition: This industry subgroup includes companies that provide home financing services, such as mortgages and home equity loans.
notation: 14121210
valid from: 2014-08-08
valid till: 2020-10-03

Mortgage Loan Brokers
type: BicsLevel4SubIndustry
type: Classifier
type: NamedIndividual
created with: infer-bics.sql
derived from: Mortgage Loan Brokers
  type: BicsLevel4SubIndustry
  type: Classifier
  type: ContemporaryDerivation
  derived from: http://data.ga-group.nl/ics/bics/2014/14121211
  source accessed on: 2019-12-03T20:05:01Z
  source last accessed on: 2019-12-03T20:05:01Z
  definition: This industry subgroup includes companies that arrange home loans between borrowers and lenders on a commission or fee basis.
  notation: 14121211
  valid from: 2014-08-08
  valid till: 2020-10-03
source accessed on: 2019-12-03T20:05:01Z
source last accessed on: 2019-12-03T20:05:01Z
definition: This industry subgroup includes companies that arrange home loans between borrowers and lenders on a commission or fee basis.
notation: 14121211
valid from: 2014-08-08
valid till: 2020-10-03

Mortgage Services
type: BicsLevel4SubIndustry
type: Classifier
type: NamedIndividual
created with: infer-bics.sql
derived from: Mortgage Services
  type: BicsLevel4SubIndustry
  type: Classifier
  type: ContemporaryDerivation
  derived from: http://data.ga-group.nl/ics/bics/2014/14121212
  source accessed on: 2019-12-03T20:05:01Z
  source last accessed on: 2019-12-03T20:05:01Z
  definition: This industry subgroup includes companies that provide mortgage services other than mortgage lending or mortgage brokerage services.
  notation: 14121212
  valid from: 2014-08-08
  valid till: 2020-10-03
source accessed on: 2019-12-03T20:05:01Z
source last accessed on: 2019-12-03T20:05:01Z
definition: This industry subgroup includes companies that provide mortgage services other than mortgage lending or mortgage brokerage services.
notation: 14121212
valid from: 2014-08-08
valid till: 2020-10-03

Mortgage Insurance Premiums
type: BicsLevel5Segment
type: Classifier
type: NamedIndividual
is level5 segment of: Mortgage Insurance
is replaced by: Mortgage Insurance Premiums
created with: infer-bics.sql
derived from: Mortgage Insurance Premiums
  type: BicsLevel5Segment
  type: Classifier
  type: ContemporaryDerivation
  derived from: http://data.ga-group.nl/ics/bics/2014/1412121310
  source accessed on: 2019-12-03T20:05:01Z
  source last accessed on: 2019-12-03T20:05:01Z
  definition: This segment includes premium revenue generated from mortgage insurance business.
  notation: 1412121310
  valid from: 2014-08-08
  valid till: 2020-10-03
source accessed on: 2019-12-03T20:05:01Z
source last accessed on: 2019-12-03T20:05:01Z
definition: This segment includes premium revenue generated from mortgage insurance business.
notation: 1412121310
valid from: 2014-08-08
valid till: 2020-10-03

Investment Income - Mortg Ins
type: BicsLevel6Segment
type: Classifier
type: NamedIndividual
is level6 segment of: Mortgage Insurance Non-Prem
is replaced by: Investment Income - Mortg Ins
created with: infer-bics.sql
derived from: Investment Income - Mortg Ins
  type: BicsLevel6Segment
  type: Classifier
  type: ContemporaryDerivation
  derived from: http://data.ga-group.nl/ics/bics/2014/141212131110
  source accessed on: 2019-12-03T20:05:01Z
  source last accessed on: 2019-12-03T20:05:01Z
  definition: This segment includes investment income generated from mortgage insurance business.
  notation: 141212131110
  valid from: 2014-08-08
  valid till: 2020-10-03
source accessed on: 2019-12-03T20:05:01Z
source last accessed on: 2019-12-03T20:05:01Z
definition: This segment includes investment income generated from mortgage insurance business.
notation: 141212131110
valid from: 2014-08-08
valid till: 2020-10-03

Realized Gain/Loss - Mortg Ins
type: BicsLevel6Segment
type: Classifier
type: NamedIndividual
is level6 segment of: Mortgage Insurance Non-Prem
is replaced by: Realized Gain/Loss - Mortg Ins
created with: infer-bics.sql
derived from: Realized Gain/Loss - Mortg Ins
  type: BicsLevel6Segment
  type: Classifier
  type: ContemporaryDerivation
  derived from: http://data.ga-group.nl/ics/bics/2014/141212131111
  source accessed on: 2019-12-03T20:05:01Z
  source last accessed on: 2019-12-03T20:05:01Z
  definition: This segment includes realized gains/losses generated from mortgage insurance business.
  notation: 141212131111
  valid from: 2014-08-08
  valid till: 2020-10-03
source accessed on: 2019-12-03T20:05:01Z
source last accessed on: 2019-12-03T20:05:01Z
definition: This segment includes realized gains/losses generated from mortgage insurance business.
notation: 141212131111
valid from: 2014-08-08
valid till: 2020-10-03

Other Income - Mortgage Ins
type: BicsLevel6Segment
type: Classifier
type: NamedIndividual
is level6 segment of: Mortgage Insurance Non-Prem
is replaced by: Other Income - Mortgage Ins
created with: infer-bics.sql
derived from: Other Income - Mortgage Ins
  type: BicsLevel6Segment
  type: Classifier
  type: ContemporaryDerivation
  derived from: http://data.ga-group.nl/ics/bics/2014/141212131112
  source accessed on: 2019-12-03T20:05:01Z
  source last accessed on: 2019-12-03T20:05:01Z
  definition: This segment includes other income generated from mortgage insurance business.
  notation: 141212131112
  valid from: 2014-08-08
  valid till: 2020-10-03
source accessed on: 2019-12-03T20:05:01Z
source last accessed on: 2019-12-03T20:05:01Z
definition: This segment includes other income generated from mortgage insurance business.
notation: 141212131112
valid from: 2014-08-08
valid till: 2020-10-03

Mortgage Insurance Non-Prem
type: BicsLevel5Segment
type: Classifier
type: NamedIndividual
is level5 segment of: Mortgage Insurance
is replaced by: Mortgage Insurance Non-Prem
created with: infer-bics.sql
derived from: Mortgage Insurance Non-Prem
  type: BicsLevel5Segment
  type: Classifier
  type: ContemporaryDerivation
  derived from: http://data.ga-group.nl/ics/bics/2014/1412121311
  source accessed on: 2019-12-03T20:05:01Z
  source last accessed on: 2019-12-03T20:05:01Z
  definition: This segment includes total non-premium revenue generated from mortgage insurance business.
  notation: 1412121311
  valid from: 2014-08-08
  valid till: 2020-10-03
source accessed on: 2019-12-03T20:05:01Z
source last accessed on: 2019-12-03T20:05:01Z
definition: This segment includes total non-premium revenue generated from mortgage insurance business.
notation: 1412121311
valid from: 2014-08-08
valid till: 2020-10-03

Mortgage Insurance
type: BicsLevel4SubIndustry
type: Classifier
type: NamedIndividual
created with: infer-bics.sql
derived from: Mortgage Insurance
  type: BicsLevel4SubIndustry
  type: Classifier
  type: ContemporaryDerivation
  derived from: http://data.ga-group.nl/ics/bics/2014/14121213
  source accessed on: 2019-12-03T20:05:01Z
  source last accessed on: 2019-12-03T20:05:01Z
  definition: This industry subgroup includes companies that provide insurance to cover losses from defaults on mortgage loans. Also known as private mortgage insurance (PMI).
  notation: 14121213
  valid from: 2014-08-08
  valid till: 2020-10-03
source accessed on: 2019-12-03T20:05:01Z
source last accessed on: 2019-12-03T20:05:01Z
definition: This industry subgroup includes companies that provide insurance to cover losses from defaults on mortgage loans. Also known as private mortgage insurance (PMI).
notation: 14121213
valid from: 2014-08-08
valid till: 2020-10-03

Direct Title Insurance Premiums
type: BicsLevel5Segment
type: Classifier
type: NamedIndividual
is level5 segment of: Title Insurance
is replaced by: Direct Title Insurance Premiums
created with: infer-bics.sql
derived from: Direct Title Insurance Premiums
  type: BicsLevel5Segment
  type: Classifier
  type: ContemporaryDerivation
  derived from: http://data.ga-group.nl/ics/bics/2014/1412121410
  source accessed on: 2019-12-03T20:05:01Z
  source last accessed on: 2019-12-03T20:05:01Z
  definition: This segment includes premium revenue generated from direct title business.
  notation: 1412121410
  valid from: 2014-08-08
  valid till: 2020-10-03
source accessed on: 2019-12-03T20:05:01Z
source last accessed on: 2019-12-03T20:05:01Z
definition: This segment includes premium revenue generated from direct title business.
notation: 1412121410
valid from: 2014-08-08
valid till: 2020-10-03

Investment Inc - Direct Title Ins
type: BicsLevel6Segment
type: Classifier
type: NamedIndividual
is level6 segment of: Direct Title Insurance Non-Prem
is replaced by: Investment Inc - Direct Title Ins
created with: infer-bics.sql
derived from: Investment Inc - Direct Title Ins
  type: BicsLevel6Segment
  type: Classifier
  type: ContemporaryDerivation
  derived from: http://data.ga-group.nl/ics/bics/2014/141212141110
  source accessed on: 2019-12-03T20:05:01Z
  source last accessed on: 2019-12-03T20:05:01Z
  definition: This segment includes investment income generated from direct title business.
  notation: 141212141110
  valid from: 2014-08-08
  valid till: 2020-10-03
source accessed on: 2019-12-03T20:05:01Z
source last accessed on: 2019-12-03T20:05:01Z
definition: This segment includes investment income generated from direct title business.
notation: 141212141110
valid from: 2014-08-08
valid till: 2020-10-03

Realized G/L - Direct Title Ins
type: BicsLevel6Segment
type: Classifier
type: NamedIndividual
is level6 segment of: Direct Title Insurance Non-Prem
is replaced by: Realized G/L - Direct Title Ins
created with: infer-bics.sql
derived from: Realized G/L - Direct Title Ins
  type: BicsLevel6Segment
  type: Classifier
  type: ContemporaryDerivation
  derived from: http://data.ga-group.nl/ics/bics/2014/141212141111
  source accessed on: 2019-12-03T20:05:01Z
  source last accessed on: 2019-12-03T20:05:01Z
  definition: This segment includes realized gains/losses generated from direct title business.
  notation: 141212141111
  valid from: 2014-08-08
  valid till: 2020-10-03
source accessed on: 2019-12-03T20:05:01Z
source last accessed on: 2019-12-03T20:05:01Z
definition: This segment includes realized gains/losses generated from direct title business.
notation: 141212141111
valid from: 2014-08-08
valid till: 2020-10-03

Other Income - Direct Title Ins
type: BicsLevel6Segment
type: Classifier
type: NamedIndividual
is level6 segment of: Direct Title Insurance Non-Prem
is replaced by: Other Income - Direct Title Ins
created with: infer-bics.sql
derived from: Other Income - Direct Title Ins
  type: BicsLevel6Segment
  type: Classifier
  type: ContemporaryDerivation
  derived from: http://data.ga-group.nl/ics/bics/2014/141212141112
  source accessed on: 2019-12-03T20:05:01Z
  source last accessed on: 2019-12-03T20:05:01Z
  definition: This segment includes other income generated from direct title business.
  notation: 141212141112
  valid from: 2014-08-08
  valid till: 2020-10-03
source accessed on: 2019-12-03T20:05:01Z
source last accessed on: 2019-12-03T20:05:01Z
definition: This segment includes other income generated from direct title business.
notation: 141212141112
valid from: 2014-08-08
valid till: 2020-10-03

Direct Title Insurance Non-Prem
type: BicsLevel5Segment
type: Classifier
type: NamedIndividual
is level5 segment of: Title Insurance
is replaced by: Direct Title Insurance Non-Prem
created with: infer-bics.sql
derived from: Direct Title Insurance Non-Prem
  type: BicsLevel5Segment
  type: Classifier
  type: ContemporaryDerivation
  derived from: http://data.ga-group.nl/ics/bics/2014/1412121411
  source accessed on: 2019-12-03T20:05:01Z
  source last accessed on: 2019-12-03T20:05:01Z
  definition: This segment includes total non-premium revenue generated from direct title business.
  notation: 1412121411
  valid from: 2014-08-08
  valid till: 2020-10-03
source accessed on: 2019-12-03T20:05:01Z
source last accessed on: 2019-12-03T20:05:01Z
definition: This segment includes total non-premium revenue generated from direct title business.
notation: 1412121411
valid from: 2014-08-08
valid till: 2020-10-03

Title Insurance
type: BicsLevel4SubIndustry
type: Classifier
type: NamedIndividual
created with: infer-bics.sql
derived from: Title Insurance
  type: BicsLevel4SubIndustry
  type: Classifier
  type: ContemporaryDerivation
  derived from: http://data.ga-group.nl/ics/bics/2014/14121214
  source accessed on: 2019-12-03T20:05:01Z
  source last accessed on: 2019-12-03T20:05:01Z
  definition: This industry subgroup includes companies that directly underwrite title insurance policies.
  notation: 14121214
  valid from: 2014-08-08
  valid till: 2020-10-03
source accessed on: 2019-12-03T20:05:01Z
source last accessed on: 2019-12-03T20:05:01Z
definition: This industry subgroup includes companies that directly underwrite title insurance policies.
notation: 14121214
valid from: 2014-08-08
valid till: 2020-10-03

Commercial Mortgage - REIT
type: BicsLevel5Segment
type: Classifier
type: NamedIndividual
is level5 segment of: Mortgage REIT
is replaced by: Commercial Mortgage - REIT
created with: infer-bics.sql
derived from: Commercial Mortgage - REIT
  type: BicsLevel5Segment
  type: Classifier
  type: ContemporaryDerivation
  derived from: http://data.ga-group.nl/ics/bics/2014/1412121510
  source accessed on: 2019-12-03T20:05:01Z
  source last accessed on: 2019-12-03T20:05:01Z
  definition: This segment includes real estate investment trusts (REITs) that invest in commercial mortgage securities.
  notation: 1412121510
  valid from: 2014-08-08
  valid till: 2020-10-03
source accessed on: 2019-12-03T20:05:01Z
source last accessed on: 2019-12-03T20:05:01Z
definition: This segment includes real estate investment trusts (REITs) that invest in commercial mortgage securities.
notation: 1412121510
valid from: 2014-08-08
valid till: 2020-10-03

Residential Mortgage - REIT
type: BicsLevel5Segment
type: Classifier
type: NamedIndividual
is level5 segment of: Mortgage REIT
is replaced by: Residential Mortgage - REIT
created with: infer-bics.sql
derived from: Residential Mortgage - REIT
  type: BicsLevel5Segment
  type: Classifier
  type: ContemporaryDerivation
  derived from: http://data.ga-group.nl/ics/bics/2014/1412121511
  source accessed on: 2019-12-03T20:05:01Z
  source last accessed on: 2019-12-03T20:05:01Z
  definition: This segment includes real estate investment trusts (REITs) that invest in residential mortgage securities.
  notation: 1412121511
  valid from: 2014-08-08
  valid till: 2020-10-03
source accessed on: 2019-12-03T20:05:01Z
source last accessed on: 2019-12-03T20:05:01Z
definition: This segment includes real estate investment trusts (REITs) that invest in residential mortgage securities.
notation: 1412121511
valid from: 2014-08-08
valid till: 2020-10-03

Mortgage REIT
type: BicsLevel4SubIndustry
type: Classifier
type: NamedIndividual
created with: infer-bics.sql
derived from: Mortgage REIT
  type: BicsLevel4SubIndustry
  type: Classifier
  type: ContemporaryDerivation
  derived from: http://data.ga-group.nl/ics/bics/2014/14121215
  source accessed on: 2019-12-03T20:05:01Z
  source last accessed on: 2019-12-03T20:05:01Z
  definition: This industry subgroup includes companies that invest in real estate loans and related securities, and meet the criteria necessary to be eligible for real estate investment trust (REIT) tax status.
  notation: 14121215
  valid from: 2014-08-08
  valid till: 2020-10-03
source accessed on: 2019-12-03T20:05:01Z
source last accessed on: 2019-12-03T20:05:01Z
definition: This industry subgroup includes companies that invest in real estate loans and related securities, and meet the criteria necessary to be eligible for real estate investment trust (REIT) tax status.
notation: 14121215
valid from: 2014-08-08
valid till: 2020-10-03

Mortgage Finance
type: BicsLevel3Industry
type: Classifier
type: NamedIndividual
is industry of: Insurance
is replaced by: Mortgage Finance
created with: infer-bics.sql
derived from: Mortgage Finance
  type: BicsLevel3Industry
  type: Classifier
  type: ContemporaryDerivation
  derived from: http://data.ga-group.nl/ics/bics/2014/141212
  source accessed on: 2019-12-03T20:05:01Z
  source last accessed on: 2019-12-03T20:05:01Z
  definition: This industry includes companies that provide mortgage financing services. Such companies include mortgage lenders, mortgage bankers, mortgage real estate investment trusts (REITs), mortgage loan brokers, mortgage insurers and title insurers.
  notation: 141212
  valid from: 2014-08-08
  valid till: 2020-10-03
source accessed on: 2019-12-03T20:05:01Z
source last accessed on: 2019-12-03T20:05:01Z
definition: This industry includes companies that provide mortgage financing services. Such companies include mortgage lenders, mortgage bankers, mortgage real estate investment trusts (REITs), mortgage loan brokers, mortgage insurers and title insurers.
notation: 141212
valid from: 2014-08-08
valid till: 2020-10-03

Corporate Banking - Islamic
type: BicsLevel4SubIndustry
type: Classifier
type: NamedIndividual
created with: infer-bics.sql
derived from: Corporate Banking - Islamic
  type: BicsLevel4SubIndustry
  type: Classifier
  type: ContemporaryDerivation
  derived from: http://data.ga-group.nl/ics/bics/2014/14121310
  source accessed on: 2019-12-03T20:05:01Z
  source last accessed on: 2019-12-03T20:05:01Z
  definition: This industry subgroup includes companies that accept deposits and make loans to corporations and large businesses based on profit participation (non-interest base) in compliance with Shariah law.
  notation: 14121310
  valid from: 2014-08-08
  valid till: 2020-10-03
source accessed on: 2019-12-03T20:05:01Z
source last accessed on: 2019-12-03T20:05:01Z
definition: This industry subgroup includes companies that accept deposits and make loans to corporations and large businesses based on profit participation (non-interest base) in compliance with Shariah law.
notation: 14121310
valid from: 2014-08-08
valid till: 2020-10-03

Investment Banking - Islamic
type: BicsLevel4SubIndustry
type: Classifier
type: NamedIndividual
created with: infer-bics.sql
derived from: Investment Banking - Islamic
  type: BicsLevel4SubIndustry
  type: Classifier
  type: ContemporaryDerivation
  derived from: http://data.ga-group.nl/ics/bics/2014/14121311
  source accessed on: 2019-12-03T20:05:01Z
  source last accessed on: 2019-12-03T20:05:01Z
  definition: This industry subgroup includes companies that provide financial advisory and securities underwriting services on a fee basis in compliance with Islamic law, such as Wikala, Ju'ala, Kifala, Ijarah, Istisna, Mudarabah, Special Mudarabah, and Musharakah.
  notation: 14121311
  valid from: 2014-08-08
  valid till: 2020-10-03
source accessed on: 2019-12-03T20:05:01Z
source last accessed on: 2019-12-03T20:05:01Z
definition: This industry subgroup includes companies that provide financial advisory and securities underwriting services on a fee basis in compliance with Islamic law, such as Wikala, Ju'ala, Kifala, Ijarah, Istisna, Mudarabah, Special Mudarabah, and Musharakah.
notation: 14121311
valid from: 2014-08-08
valid till: 2020-10-03

Portfolio Management - Islamic
type: BicsLevel4SubIndustry
type: Classifier
type: NamedIndividual
created with: infer-bics.sql
derived from: Portfolio Management - Islamic
  type: BicsLevel4SubIndustry
  type: Classifier
  type: ContemporaryDerivation
  derived from: http://data.ga-group.nl/ics/bics/2014/14121312
  source accessed on: 2019-12-03T20:05:01Z
  source last accessed on: 2019-12-03T20:05:01Z
  definition: This industry subgroup includes companies that manage investment portfolios on a commission or fee basis in compliance with Islamic law, such as Wikala, Ju'ala and Kifala.
  notation: 14121312
  valid from: 2014-08-08
  valid till: 2020-10-03
source accessed on: 2019-12-03T20:05:01Z
source last accessed on: 2019-12-03T20:05:01Z
definition: This industry subgroup includes companies that manage investment portfolios on a commission or fee basis in compliance with Islamic law, such as Wikala, Ju'ala and Kifala.
notation: 14121312
valid from: 2014-08-08
valid till: 2020-10-03

Private Comml Banking - Islamic
type: BicsLevel4SubIndustry
type: Classifier
type: NamedIndividual
created with: infer-bics.sql
derived from: Private Comml Banking - Islamic
  type: BicsLevel4SubIndustry
  type: Classifier
  type: ContemporaryDerivation
  derived from: http://data.ga-group.nl/ics/bics/2014/14121313
  source accessed on: 2019-12-03T20:05:01Z
  source last accessed on: 2019-12-03T20:05:01Z
  definition: This industry subgroup includes commercial banks that provide personalized wealth management services to high net worth individuals (equity partnership) in compliance with Shariah law.
  notation: 14121313
  valid from: 2014-08-08
  valid till: 2020-10-03
source accessed on: 2019-12-03T20:05:01Z
source last accessed on: 2019-12-03T20:05:01Z
definition: This industry subgroup includes commercial banks that provide personalized wealth management services to high net worth individuals (equity partnership) in compliance with Shariah law.
notation: 14121313
valid from: 2014-08-08
valid till: 2020-10-03

Retail Comml Banking - Islamic
type: BicsLevel4SubIndustry
type: Classifier
type: NamedIndividual
created with: infer-bics.sql
derived from: Retail Comml Banking - Islamic
  type: BicsLevel4SubIndustry
  type: Classifier
  type: ContemporaryDerivation
  derived from: http://data.ga-group.nl/ics/bics/2014/14121314
  source accessed on: 2019-12-03T20:05:01Z
  source last accessed on: 2019-12-03T20:05:01Z
  definition: This industry subgroup includes companies that accept deposits and make loans to retail (individual) customers based on profit participation (non-interest base) in compliance with Shariah law.
  notation: 14121314
  valid from: 2014-08-08
  valid till: 2020-10-03
source accessed on: 2019-12-03T20:05:01Z
source last accessed on: 2019-12-03T20:05:01Z
definition: This industry subgroup includes companies that accept deposits and make loans to retail (individual) customers based on profit participation (non-interest base) in compliance with Shariah law.
notation: 14121314
valid from: 2014-08-08
valid till: 2020-10-03

Sec & Cmdty Banking - Islamic
type: BicsLevel4SubIndustry
type: Classifier
type: NamedIndividual
created with: infer-bics.sql
derived from: Sec & Cmdty Banking - Islamic
  type: BicsLevel4SubIndustry
  type: Classifier
  type: ContemporaryDerivation
  derived from: http://data.ga-group.nl/ics/bics/2014/14121315
  source accessed on: 2019-12-03T20:05:01Z
  source last accessed on: 2019-12-03T20:05:01Z
  definition: This industry subgroup includes companies that buy and sell securities or commodities contracts on a commission or fee basis in compliance with Islamic law, such as Wikala, Ju'ala and Kifala.
  notation: 14121315
  valid from: 2014-08-08
  valid till: 2020-10-03
source accessed on: 2019-12-03T20:05:01Z
source last accessed on: 2019-12-03T20:05:01Z
definition: This industry subgroup includes companies that buy and sell securities or commodities contracts on a commission or fee basis in compliance with Islamic law, such as Wikala, Ju'ala and Kifala.
notation: 14121315
valid from: 2014-08-08
valid till: 2020-10-03

Trading & Investment - Islamic
type: BicsLevel4SubIndustry
type: Classifier
type: NamedIndividual
created with: infer-bics.sql
derived from: Trading & Investment - Islamic
  type: BicsLevel4SubIndustry
  type: Classifier
  type: ContemporaryDerivation
  derived from: http://data.ga-group.nl/ics/bics/2014/14121316
  source accessed on: 2019-12-03T20:05:01Z
  source last accessed on: 2019-12-03T20:05:01Z
  definition: This industry subgroup includes companies that buy and sell equities, floating income (Sukuk), currencies, commodities and related securities for client-driven and proprietary trading.
  notation: 14121316
  valid from: 2014-08-08
  valid till: 2020-10-03
source accessed on: 2019-12-03T20:05:01Z
source last accessed on: 2019-12-03T20:05:01Z
definition: This industry subgroup includes companies that buy and sell equities, floating income (Sukuk), currencies, commodities and related securities for client-driven and proprietary trading.
notation: 14121316
valid from: 2014-08-08
valid till: 2020-10-03

Islamic Banking
type: BicsLevel3Industry
type: Classifier
type: NamedIndividual
is industry of: Insurance
is replaced by: Islamic Banking
created with: infer-bics.sql
derived from: Islamic Banking
  type: BicsLevel3Industry
  type: Classifier
  type: ContemporaryDerivation
  derived from: http://data.ga-group.nl/ics/bics/2014/141213
  source accessed on: 2019-12-03T20:05:01Z
  source last accessed on: 2019-12-03T20:05:01Z
  definition: This industry includes companies that provide loans and other financing to businesses in compliance with Shariah law. Such loans cannot charge interest. Instead, the loan is structured using discounts, sale or lease, profit participation, or repurchase agreements.
  notation: 141213
  valid from: 2014-08-08
  valid till: 2020-10-03
source accessed on: 2019-12-03T20:05:01Z
source last accessed on: 2019-12-03T20:05:01Z
definition: This industry includes companies that provide loans and other financing to businesses in compliance with Shariah law. Such loans cannot charge interest. Instead, the loan is structured using discounts, sale or lease, profit participation, or repurchase agreements.
notation: 141213
valid from: 2014-08-08
valid till: 2020-10-03

Corp, Treasury & Investments
type: BicsLevel4SubIndustry
type: Classifier
type: NamedIndividual
created with: infer-bics.sql
derived from: Corp, Treasury & Investments
  type: BicsLevel4SubIndustry
  type: Classifier
  type: ContemporaryDerivation
  derived from: http://data.ga-group.nl/ics/bics/2014/14121410
  source accessed on: 2019-12-03T20:05:01Z
  source last accessed on: 2019-12-03T20:05:01Z
  definition: This industry subgroup includes companies that act as principals (excluding investment banks) in the buying or selling of securities for their own portfolios. This includes the internal investment activities of a bank.
  notation: 14121410
  valid from: 2014-08-08
  valid till: 2020-10-03
source accessed on: 2019-12-03T20:05:01Z
source last accessed on: 2019-12-03T20:05:01Z
definition: This industry subgroup includes companies that act as principals (excluding investment banks) in the buying or selling of securities for their own portfolios. This includes the internal investment activities of a bank.
notation: 14121410
valid from: 2014-08-08
valid till: 2020-10-03

Receivables Collection & Mgmt
type: BicsLevel4SubIndustry
type: Classifier
type: NamedIndividual
created with: infer-bics.sql
derived from: Receivables Collection & Mgmt
  type: BicsLevel4SubIndustry
  type: Classifier
  type: ContemporaryDerivation
  derived from: http://data.ga-group.nl/ics/bics/2014/14121411
  source accessed on: 2019-12-03T20:05:01Z
  source last accessed on: 2019-12-03T20:05:01Z
  definition: This industry subgroup includes companies that collect payments for claims and remit collected payments to their clients.
  notation: 14121411
  valid from: 2014-08-08
  valid till: 2020-10-03
source accessed on: 2019-12-03T20:05:01Z
source last accessed on: 2019-12-03T20:05:01Z
definition: This industry subgroup includes companies that collect payments for claims and remit collected payments to their clients.
notation: 14121411
valid from: 2014-08-08
valid till: 2020-10-03

Misc. Financial Services
type: BicsLevel4SubIndustry
type: Classifier
type: NamedIndividual
created with: infer-bics.sql
derived from: Misc. Financial Services
  type: BicsLevel4SubIndustry
  type: Classifier
  type: ContemporaryDerivation
  derived from: http://data.ga-group.nl/ics/bics/2014/14121412
  source accessed on: 2019-12-03T20:05:01Z
  source last accessed on: 2019-12-03T20:05:01Z
  definition: This industry subgroup includes companies that provide miscellaneous financial services activities not elsewhere classified.
  notation: 14121412
  valid from: 2014-08-08
  valid till: 2020-10-03
source accessed on: 2019-12-03T20:05:01Z
source last accessed on: 2019-12-03T20:05:01Z
definition: This industry subgroup includes companies that provide miscellaneous financial services activities not elsewhere classified.
notation: 14121412
valid from: 2014-08-08
valid till: 2020-10-03

Other Financial Services
type: BicsLevel3Industry
type: Classifier
type: NamedIndividual
is industry of: Insurance
is replaced by: Other Financial Services
created with: infer-bics.sql
derived from: Other Financial Services
  type: BicsLevel3Industry
  type: Classifier
  type: ContemporaryDerivation
  derived from: http://data.ga-group.nl/ics/bics/2014/141214
  source accessed on: 2019-12-03T20:05:01Z
  source last accessed on: 2019-12-03T20:05:01Z
  definition: This industry includes companies that provide other types of financial services, such as corporate, treasury, receivable collections and other financial vehicles.
  notation: 141214
  valid from: 2014-08-08
  valid till: 2020-10-03
source accessed on: 2019-12-03T20:05:01Z
source last accessed on: 2019-12-03T20:05:01Z
definition: This industry includes companies that provide other types of financial services, such as corporate, treasury, receivable collections and other financial vehicles.
notation: 141214
valid from: 2014-08-08
valid till: 2020-10-03

Insurance
type: BicsLevel2IndustryGroup
type: Classifier
type: NamedIndividual
is industry group of: Financials
is replaced by: Specialty Finance
replaces: Insurance
created with: infer-bics.sql
derived from: Specialty Finance
  type: BicsLevel2IndustryGroup
  type: Classifier
  type: ContemporaryDerivation
  derived from: http://data.ga-group.nl/ics/bics/2014/1412
  source accessed on: 2019-12-03T20:05:01Z
  source last accessed on: 2019-12-03T20:05:01Z
  definition: This industry group includes companies that provide specialized lending and financing services. Such specialty finance services include consumer and commercial lending, Islamic banking, mortgage finance, auto/equipment financing, credit card services and other financial services.
  notation: 1412
  valid from: 2014-08-08
  valid till: 2020-10-03
derived from: Insurance
  type: BicsLevel2IndustryGroup
  type: Classifier
  type: AnachronousDerivation
  derived from: http://data.ga-group.nl/ics/bics/2014/1414
  source accessed on: 2019-12-03T20:05:01Z
  source last accessed on: 2019-12-03T20:05:01Z
  definition: This industry group includes companies that underwrite life, health and medical, property and casualty, and related insurance lines, either directly or as a reinsurer; companies that provide insurance-related services, such as claims adjusting, administrative and advisory services; and insurance agencies and brokers.
  notation: 1414
  valid from: 2014-08-08
  valid till: 2020-10-03
derived from: Insurance
  type: BicsLevel2IndustryGroup
  type: Classifier
  type: ContemporaryDerivation
  derived from: http://data.ga-group.nl/ics/bics/2020/1412
  derived from: http://data.ga-group.nl/ics/bics/2024/1412
  source accessed on: 2023-07-03T18:11:29Z
  source last accessed on: 2024-06-05T14:42:36Z
  definition: This industry group includes companies providing insurance related products and services.
  notation: 1412
  valid from: 2020-10-03
source accessed on: 2019-12-03T20:05:01Z
source last accessed on: 2024-06-05T14:42:36Z
definition: This industry group includes companies providing insurance related products and services.
notation: 1412
valid from: 2014-08-08

Financial Advisory Services
type: BicsLevel5Segment
type: Classifier
type: NamedIndividual
is level5 segment of: Investment Banking
is replaced by: Financial Advisory Services
created with: infer-bics.sql
derived from: Financial Advisory Services
  type: BicsLevel5Segment
  type: Classifier
  type: ContemporaryDerivation
  derived from: http://data.ga-group.nl/ics/bics/2014/1413101010
  source accessed on: 2019-12-03T20:05:01Z
  source last accessed on: 2019-12-03T20:05:01Z
  definition: This segment includes companies in the investment banking industry that provide advice on corporate financial matters, including restructuring, merger and acquisitions, financial valuations and litigation.
  notation: 1413101010
  valid from: 2014-08-08
  valid till: 2020-10-03
source accessed on: 2019-12-03T20:05:01Z
source last accessed on: 2019-12-03T20:05:01Z
definition: This segment includes companies in the investment banking industry that provide advice on corporate financial matters, including restructuring, merger and acquisitions, financial valuations and litigation.
notation: 1413101010
valid from: 2014-08-08
valid till: 2020-10-03

Debt Underwriting Services
type: BicsLevel6Segment
type: Classifier
type: NamedIndividual
is level6 segment of: Underwriting Services
is replaced by: Debt Underwriting Services
created with: infer-bics.sql
derived from: Debt Underwriting Services
  type: BicsLevel6Segment
  type: Classifier
  type: ContemporaryDerivation
  derived from: http://data.ga-group.nl/ics/bics/2014/141310101110
  source accessed on: 2019-12-03T20:05:01Z
  source last accessed on: 2019-12-03T20:05:01Z
  definition: This segment includes companies in the investment banking industry that provide access to capital through the sale of debt securities.
  notation: 141310101110
  valid from: 2014-08-08
  valid till: 2020-10-03
source accessed on: 2019-12-03T20:05:01Z
source last accessed on: 2019-12-03T20:05:01Z
definition: This segment includes companies in the investment banking industry that provide access to capital through the sale of debt securities.
notation: 141310101110
valid from: 2014-08-08
valid till: 2020-10-03

Equity Underwriting Services
type: BicsLevel6Segment
type: Classifier
type: NamedIndividual
is level6 segment of: Underwriting Services
is replaced by: Equity Underwriting Services
created with: infer-bics.sql
derived from: Equity Underwriting Services
  type: BicsLevel6Segment
  type: Classifier
  type: ContemporaryDerivation
  derived from: http://data.ga-group.nl/ics/bics/2014/141310101111
  source accessed on: 2019-12-03T20:05:01Z
  source last accessed on: 2019-12-03T20:05:01Z
  definition: This segment includes companies in the investment banking industry that provide access to capital through the sale of equity securities.
  notation: 141310101111
  valid from: 2014-08-08
  valid till: 2020-10-03
source accessed on: 2019-12-03T20:05:01Z
source last accessed on: 2019-12-03T20:05:01Z
definition: This segment includes companies in the investment banking industry that provide access to capital through the sale of equity securities.
notation: 141310101111
valid from: 2014-08-08
valid till: 2020-10-03

Underwriting Services
type: BicsLevel5Segment
type: Classifier
type: NamedIndividual
is level5 segment of: Investment Banking
is replaced by: Underwriting Services
created with: infer-bics.sql
derived from: Underwriting Services
  type: BicsLevel5Segment
  type: Classifier
  type: ContemporaryDerivation
  derived from: http://data.ga-group.nl/ics/bics/2014/1413101011
  source accessed on: 2019-12-03T20:05:01Z
  source last accessed on: 2019-12-03T20:05:01Z
  definition: This segment includes companies in the investment banking industry that provide access to capital through the sale of debt and equity securities.
  notation: 1413101011
  valid from: 2014-08-08
  valid till: 2020-10-03
source accessed on: 2019-12-03T20:05:01Z
source last accessed on: 2019-12-03T20:05:01Z
definition: This segment includes companies in the investment banking industry that provide access to capital through the sale of debt and equity securities.
notation: 1413101011
valid from: 2014-08-08
valid till: 2020-10-03

Investment Banking
type: BicsLevel4SubIndustry
type: Classifier
type: NamedIndividual
created with: infer-bics.sql
derived from: Investment Banking
  type: BicsLevel4SubIndustry
  type: Classifier
  type: ContemporaryDerivation
  derived from: http://data.ga-group.nl/ics/bics/2014/14131010
  source accessed on: 2019-12-03T20:05:01Z
  source last accessed on: 2019-12-03T20:05:01Z
  definition: This industry subgroup includes companies that provide financial advisory and securities underwriting services on a fee basis.
  notation: 14131010
  valid from: 2014-08-08
  valid till: 2020-10-03
source accessed on: 2019-12-03T20:05:01Z
source last accessed on: 2019-12-03T20:05:01Z
definition: This industry subgroup includes companies that provide financial advisory and securities underwriting services on a fee basis.
notation: 14131010
valid from: 2014-08-08
valid till: 2020-10-03

Commodities Brokerage
type: BicsLevel5Segment
type: Classifier
type: NamedIndividual
is level5 segment of: Security & Commodity Brokerage
is replaced by: Commodities Brokerage
created with: infer-bics.sql
derived from: Commodities Brokerage
  type: BicsLevel5Segment
  type: Classifier
  type: ContemporaryDerivation
  derived from: http://data.ga-group.nl/ics/bics/2014/1413101110
  source accessed on: 2019-12-03T20:05:01Z
  source last accessed on: 2019-12-03T20:05:01Z
  definition: This segment includes companies that buy and sell commodity contracts and options on a commission or fee basis.
  notation: 1413101110
  valid from: 2014-08-08
  valid till: 2020-10-03
source accessed on: 2019-12-03T20:05:01Z
source last accessed on: 2019-12-03T20:05:01Z
definition: This segment includes companies that buy and sell commodity contracts and options on a commission or fee basis.
notation: 1413101110
valid from: 2014-08-08
valid till: 2020-10-03

Instl Securities Brokerage
type: BicsLevel5Segment
type: Classifier
type: NamedIndividual
is level5 segment of: Security & Commodity Brokerage
is replaced by: Instl Securities Brokerage
created with: infer-bics.sql
derived from: Instl Securities Brokerage
  type: BicsLevel5Segment
  type: Classifier
  type: ContemporaryDerivation
  derived from: http://data.ga-group.nl/ics/bics/2014/1413101111
  source accessed on: 2019-12-03T20:05:01Z
  source last accessed on: 2019-12-03T20:05:01Z
  definition: This segment includes companies that buy and sell securities for institutional investors on a commission or fee basis.
  notation: 1413101111
  valid from: 2014-08-08
  valid till: 2020-10-03
source accessed on: 2019-12-03T20:05:01Z
source last accessed on: 2019-12-03T20:05:01Z
definition: This segment includes companies that buy and sell securities for institutional investors on a commission or fee basis.
notation: 1413101111
valid from: 2014-08-08
valid till: 2020-10-03

Security & Commodity Brokerage
type: BicsLevel4SubIndustry
type: Classifier
type: NamedIndividual
created with: infer-bics.sql
derived from: Security & Commodity Brokerage
  type: BicsLevel4SubIndustry
  type: Classifier
  type: ContemporaryDerivation
  derived from: http://data.ga-group.nl/ics/bics/2014/14131011
  source accessed on: 2019-12-03T20:05:01Z
  source last accessed on: 2019-12-03T20:05:01Z
  definition: This industry subgroup includes companies that buy and sell securities or commodities contracts and options on a commission or fee basis.
  notation: 14131011
  valid from: 2014-08-08
  valid till: 2020-10-03
source accessed on: 2019-12-03T20:05:01Z
source last accessed on: 2019-12-03T20:05:01Z
definition: This industry subgroup includes companies that buy and sell securities or commodities contracts and options on a commission or fee basis.
notation: 14131011
valid from: 2014-08-08
valid till: 2020-10-03

Equities Trading
type: BicsLevel5Segment
type: Classifier
type: NamedIndividual
is level5 segment of: Trading & Principal Investment
is replaced by: Equities Trading
created with: infer-bics.sql
derived from: Equities Trading
  type: BicsLevel5Segment
  type: Classifier
  type: ContemporaryDerivation
  derived from: http://data.ga-group.nl/ics/bics/2014/1413101210
  source accessed on: 2019-12-03T20:05:01Z
  source last accessed on: 2019-12-03T20:05:01Z
  definition: This segment includes companies that buy and sell equity securities for market-making, and provide specialist activities, in addition to trading their own principal investments.
  notation: 1413101210
  valid from: 2014-08-08
  valid till: 2020-10-03
source accessed on: 2019-12-03T20:05:01Z
source last accessed on: 2019-12-03T20:05:01Z
definition: This segment includes companies that buy and sell equity securities for market-making, and provide specialist activities, in addition to trading their own principal investments.
notation: 1413101210
valid from: 2014-08-08
valid till: 2020-10-03

Commodities Contract Dealing
type: BicsLevel6Segment
type: Classifier
type: NamedIndividual
is level6 segment of: Fixed Income, Crncy & Cmdty
is replaced by: Commodities Contract Dealing
created with: infer-bics.sql
derived from: Commodities Contract Dealing
  type: BicsLevel6Segment
  type: Classifier
  type: ContemporaryDerivation
  derived from: http://data.ga-group.nl/ics/bics/2014/141310121110
  source accessed on: 2019-12-03T20:05:01Z
  source last accessed on: 2019-12-03T20:05:01Z
  definition: This segment includes companies that buy and sell commodities and commodity-related securities for client-driven and proprietary trading.
  notation: 141310121110
  valid from: 2014-08-08
  valid till: 2020-10-03
source accessed on: 2019-12-03T20:05:01Z
source last accessed on: 2019-12-03T20:05:01Z
definition: This segment includes companies that buy and sell commodities and commodity-related securities for client-driven and proprietary trading.
notation: 141310121110
valid from: 2014-08-08
valid till: 2020-10-03

Currencies Trading
type: BicsLevel6Segment
type: Classifier
type: NamedIndividual
is level6 segment of: Fixed Income, Crncy & Cmdty
is replaced by: Currencies Trading
created with: infer-bics.sql
derived from: Currencies Trading
  type: BicsLevel6Segment
  type: Classifier
  type: ContemporaryDerivation
  derived from: http://data.ga-group.nl/ics/bics/2014/141310121111
  source accessed on: 2019-12-03T20:05:01Z
  source last accessed on: 2019-12-03T20:05:01Z
  definition: This segment includes companies that buy and sell currencies in the cash and derivatives markets for client-driven and proprietary trading.
  notation: 141310121111
  valid from: 2014-08-08
  valid till: 2020-10-03
source accessed on: 2019-12-03T20:05:01Z
source last accessed on: 2019-12-03T20:05:01Z
definition: This segment includes companies that buy and sell currencies in the cash and derivatives markets for client-driven and proprietary trading.
notation: 141310121111
valid from: 2014-08-08
valid till: 2020-10-03

Fixed Income Trading
type: BicsLevel6Segment
type: Classifier
type: NamedIndividual
is level6 segment of: Fixed Income, Crncy & Cmdty
is replaced by: Fixed Income Trading
created with: infer-bics.sql
derived from: Fixed Income Trading
  type: BicsLevel6Segment
  type: Classifier
  type: ContemporaryDerivation
  derived from: http://data.ga-group.nl/ics/bics/2014/141310121112
  source accessed on: 2019-12-03T20:05:01Z
  source last accessed on: 2019-12-03T20:05:01Z
  definition: This segment includes companies that buy and sell fixed income securities and other interest rate products for client-driven and proprietary trading.
  notation: 141310121112
  valid from: 2014-08-08
  valid till: 2020-10-03
source accessed on: 2019-12-03T20:05:01Z
source last accessed on: 2019-12-03T20:05:01Z
definition: This segment includes companies that buy and sell fixed income securities and other interest rate products for client-driven and proprietary trading.
notation: 141310121112
valid from: 2014-08-08
valid till: 2020-10-03

Fixed Income, Crncy & Cmdty
type: BicsLevel5Segment
type: Classifier
type: NamedIndividual
is level5 segment of: Trading & Principal Investment
created with: infer-bics.sql
derived from: Fixed Income, Crncy & Cmdty
  type: BicsLevel5Segment
  type: Classifier
  type: ContemporaryDerivation
  derived from: http://data.ga-group.nl/ics/bics/2014/1413101211
  source accessed on: 2019-12-03T20:05:01Z
  source last accessed on: 2019-12-03T20:05:01Z
  definition: This segment includes companies that buy and sell fixed income, currencies and commodities and related securities for client-driven and proprietary trading.
  notation: 1413101211
  valid from: 2014-08-08
  valid till: 2020-10-03
source accessed on: 2019-12-03T20:05:01Z
source last accessed on: 2019-12-03T20:05:01Z
definition: This segment includes companies that buy and sell fixed income, currencies and commodities and related securities for client-driven and proprietary trading.
notation: 1413101211
valid from: 2014-08-08
valid till: 2020-10-03

Other Trading Activities
type: BicsLevel5Segment
type: Classifier
type: NamedIndividual
is level5 segment of: Trading & Principal Investment
created with: infer-bics.sql
derived from: Other Trading Activities
  type: BicsLevel5Segment
  type: Classifier
  type: ContemporaryDerivation
  derived from: http://data.ga-group.nl/ics/bics/2014/1413101212
  source accessed on: 2019-12-03T20:05:01Z
  source last accessed on: 2019-12-03T20:05:01Z
  definition: This segment includes companies that buy and sell financial instruments not elsewhere classified.
  notation: 1413101212
  valid from: 2014-08-08
  valid till: 2020-10-03
source accessed on: 2019-12-03T20:05:01Z
source last accessed on: 2019-12-03T20:05:01Z
definition: This segment includes companies that buy and sell financial instruments not elsewhere classified.
notation: 1413101212
valid from: 2014-08-08
valid till: 2020-10-03

Trading & Principal Investment
type: BicsLevel4SubIndustry
type: Classifier
type: NamedIndividual
created with: infer-bics.sql
derived from: Trading & Principal Investment
  type: BicsLevel4SubIndustry
  type: Classifier
  type: ContemporaryDerivation
  derived from: http://data.ga-group.nl/ics/bics/2014/14131012
  source accessed on: 2019-12-03T20:05:01Z
  source last accessed on: 2019-12-03T20:05:01Z
  definition: This industry subgroup includes companies that buy and sell equities, fixed income, currencies, commodities and related securities for client-driven and proprietary trading.
  notation: 14131012
  valid from: 2014-08-08
  valid till: 2020-10-03
source accessed on: 2019-12-03T20:05:01Z
source last accessed on: 2019-12-03T20:05:01Z
definition: This industry subgroup includes companies that buy and sell equities, fixed income, currencies, commodities and related securities for client-driven and proprietary trading.
notation: 14131012
valid from: 2014-08-08
valid till: 2020-10-03

Institutional Brokerage
type: BicsLevel3Industry
type: Classifier
type: NamedIndividual
is industry of: Institutional Financial Svcs
is replaced by: Institutional Brokerage
created with: infer-bics.sql
derived from: Institutional Brokerage
  type: BicsLevel3Industry
  type: Classifier
  type: ContemporaryDerivation
  derived from: http://data.ga-group.nl/ics/bics/2014/141310
  source accessed on: 2019-12-03T20:05:01Z
  source last accessed on: 2019-12-03T20:05:01Z
  definition: This industry includes companies that provide brokerage services to institutional investors. Institutional investors buy or sell securities on behalf of organizations, such as banks, insurance companies, hedge funds, pension funds and mutual funds.
  notation: 141310
  valid from: 2014-08-08
  valid till: 2020-10-03
source accessed on: 2019-12-03T20:05:01Z
source last accessed on: 2019-12-03T20:05:01Z
definition: This industry includes companies that provide brokerage services to institutional investors. Institutional investors buy or sell securities on behalf of organizations, such as banks, insurance companies, hedge funds, pension funds and mutual funds.
notation: 141310
valid from: 2014-08-08
valid till: 2020-10-03

Asset & Investment Servicing
type: BicsLevel4SubIndustry
type: Classifier
type: NamedIndividual
created with: infer-bics.sql
derived from: Asset & Investment Servicing
  type: BicsLevel4SubIndustry
  type: Classifier
  type: ContemporaryDerivation
  derived from: http://data.ga-group.nl/ics/bics/2014/14131110
  source accessed on: 2019-12-03T20:05:01Z
  source last accessed on: 2019-12-03T20:05:01Z
  definition: This industry subgroup includes companies that provide investment and other asset services on a fee basis.
  notation: 14131110
  valid from: 2014-08-08
  valid till: 2020-10-03
source accessed on: 2019-12-03T20:05:01Z
source last accessed on: 2019-12-03T20:05:01Z
definition: This industry subgroup includes companies that provide investment and other asset services on a fee basis.
notation: 14131110
valid from: 2014-08-08
valid till: 2020-10-03

Execution & Clearing Services
type: BicsLevel4SubIndustry
type: Classifier
type: NamedIndividual
created with: infer-bics.sql
derived from: Execution & Clearing Services
  type: BicsLevel4SubIndustry
  type: Classifier
  type: ContemporaryDerivation
  derived from: http://data.ga-group.nl/ics/bics/2014/14131111
  source accessed on: 2019-12-03T20:05:01Z
  source last accessed on: 2019-12-03T20:05:01Z
  definition: This industry subgroup includes companies that provide trade execution and clearance services on a fee basis.
  notation: 14131111
  valid from: 2014-08-08
  valid till: 2020-10-03
source accessed on: 2019-12-03T20:05:01Z
source last accessed on: 2019-12-03T20:05:01Z
definition: This industry subgroup includes companies that provide trade execution and clearance services on a fee basis.
notation: 14131111
valid from: 2014-08-08
valid till: 2020-10-03

Issuer Services
type: BicsLevel4SubIndustry
type: Classifier
type: NamedIndividual
created with: infer-bics.sql
derived from: Issuer Services
  type: BicsLevel4SubIndustry
  type: Classifier
  type: ContemporaryDerivation
  derived from: http://data.ga-group.nl/ics/bics/2014/14131112
  source accessed on: 2019-12-03T20:05:01Z
  source last accessed on: 2019-12-03T20:05:01Z
  definition: This industry subgroup includes companies that provide securities issuance and related services on a fee basis.
  notation: 14131112
  valid from: 2014-08-08
  valid till: 2020-10-03
source accessed on: 2019-12-03T20:05:01Z
source last accessed on: 2019-12-03T20:05:01Z
definition: This industry subgroup includes companies that provide securities issuance and related services on a fee basis.
notation: 14131112
valid from: 2014-08-08
valid till: 2020-10-03

Transaction Services
type: BicsLevel4SubIndustry
type: Classifier
type: NamedIndividual
created with: infer-bics.sql
derived from: Transaction Services
  type: BicsLevel4SubIndustry
  type: Classifier
  type: ContemporaryDerivation
  derived from: http://data.ga-group.nl/ics/bics/2014/14131113
  source accessed on: 2019-12-03T20:05:01Z
  source last accessed on: 2019-12-03T20:05:01Z
  definition: This industry subgroup includes companies that provide cash management, funds transfer or liquidity management services on a fee basis.
  notation: 14131113
  valid from: 2014-08-08
  valid till: 2020-10-03
source accessed on: 2019-12-03T20:05:01Z
source last accessed on: 2019-12-03T20:05:01Z
definition: This industry subgroup includes companies that provide cash management, funds transfer or liquidity management services on a fee basis.
notation: 14131113
valid from: 2014-08-08
valid till: 2020-10-03

Instl Trust, Fiduciary & Custody
type: BicsLevel3Industry
type: Classifier
type: NamedIndividual
is industry of: Institutional Financial Svcs
is replaced by: Instl Trust, Fiduciary & Custody
created with: infer-bics.sql
derived from: Instl Trust, Fiduciary & Custody
  type: BicsLevel3Industry
  type: Classifier
  type: ContemporaryDerivation
  derived from: http://data.ga-group.nl/ics/bics/2014/141311
  source accessed on: 2019-12-03T20:05:01Z
  source last accessed on: 2019-12-03T20:05:01Z
  definition: This industry includes companies that are authorized to hold assets in trust and provide services for registering securities and transferring ownership.
  notation: 141311
  valid from: 2014-08-08
  valid till: 2020-10-03
source accessed on: 2019-12-03T20:05:01Z
source last accessed on: 2019-12-03T20:05:01Z
definition: This industry includes companies that are authorized to hold assets in trust and provide services for registering securities and transferring ownership.
notation: 141311
valid from: 2014-08-08
valid till: 2020-10-03

Security & Cmdty Exchanges
type: BicsLevel3Industry
type: Classifier
type: NamedIndividual
is industry of: Institutional Financial Svcs
is replaced by: Security & Cmdty Exchanges
created with: infer-bics.sql
derived from: Security & Cmdty Exchanges
  type: BicsLevel3Industry
  type: Classifier
  type: ContemporaryDerivation
  derived from: http://data.ga-group.nl/ics/bics/2014/141312
  source accessed on: 2019-12-03T20:05:01Z
  source last accessed on: 2019-12-03T20:05:01Z
  definition: This industry includes firms that operate a marketplace for the buying and selling of securities, commodities or other financial instruments.
  notation: 141312
  valid from: 2014-08-08
  valid till: 2020-10-03
source accessed on: 2019-12-03T20:05:01Z
source last accessed on: 2019-12-03T20:05:01Z
definition: This industry includes firms that operate a marketplace for the buying and selling of securities, commodities or other financial instruments.
notation: 141312
valid from: 2014-08-08
valid till: 2020-10-03

Institutional Financial Svcs
type: BicsLevel2IndustryGroup
type: Classifier
type: NamedIndividual
is industry group of: Financials
is replaced by: Institutional Financial Svcs
created with: infer-bics.sql
derived from: Institutional Financial Svcs
  type: BicsLevel2IndustryGroup
  type: Classifier
  type: ContemporaryDerivation
  derived from: http://data.ga-group.nl/ics/bics/2014/1413
  source accessed on: 2019-12-03T20:05:01Z
  source last accessed on: 2019-12-03T20:05:01Z
  definition: This industry group includes companies that provide investment banking and institutional brokerage services or are involved in the buying and selling of equities, fixed income, currencies, commodities and related securities for client-driven and proprietary trading.
  notation: 1413
  valid from: 2014-08-08
  valid till: 2020-10-03
source accessed on: 2019-12-03T20:05:01Z
source last accessed on: 2019-12-03T20:05:01Z
definition: This industry group includes companies that provide investment banking and institutional brokerage services or are involved in the buying and selling of equities, fixed income, currencies, commodities and related securities for client-driven and proprietary trading.
notation: 1413
valid from: 2014-08-08
valid till: 2020-10-03

Protection Prods Premiums
type: BicsLevel5Segment
type: Classifier
type: NamedIndividual
is level5 segment of: Life Insurance Premiums
is replaced by: Protection Prods Premiums
created with: infer-bics.sql
derived from: Protection Prods Premiums
  type: BicsLevel5Segment
  type: Classifier
  type: ContemporaryDerivation
  derived from: http://data.ga-group.nl/ics/bics/2014/1414101010
  source accessed on: 2019-12-03T20:05:01Z
  source last accessed on: 2019-12-03T20:05:01Z
  definition: This segment includes premium income generated from life insurance protection products, including individual and group life, accidental death, and disability policies.
  notation: 1414101010
  valid from: 2014-08-08
  valid till: 2020-10-03
source accessed on: 2019-12-03T20:05:01Z
source last accessed on: 2019-12-03T20:05:01Z
definition: This segment includes premium income generated from life insurance protection products, including individual and group life, accidental death, and disability policies.
notation: 1414101010
valid from: 2014-08-08
valid till: 2020-10-03

Saving & Retire Prods Premiums
type: BicsLevel5Segment
type: Classifier
type: NamedIndividual
is level5 segment of: Life Insurance Premiums
is replaced by: Saving & Retire Prods Premiums
created with: infer-bics.sql
derived from: Saving & Retire Prods Premiums
  type: BicsLevel5Segment
  type: Classifier
  type: ContemporaryDerivation
  derived from: http://data.ga-group.nl/ics/bics/2014/1414101011
  source accessed on: 2019-12-03T20:05:01Z
  source last accessed on: 2019-12-03T20:05:01Z
  definition: This segment includes premium income generated from life insurance savings and retirement products, including individual and group fixed and variable annuities.
  notation: 1414101011
  valid from: 2014-08-08
  valid till: 2020-10-03
source accessed on: 2019-12-03T20:05:01Z
source last accessed on: 2019-12-03T20:05:01Z
definition: This segment includes premium income generated from life insurance savings and retirement products, including individual and group fixed and variable annuities.
notation: 1414101011
valid from: 2014-08-08
valid till: 2020-10-03

Life Insurance Premiums
type: BicsLevel4SubIndustry
type: Classifier
type: NamedIndividual
created with: infer-bics.sql
derived from: Life Insurance Premiums
  type: BicsLevel4SubIndustry
  type: Classifier
  type: ContemporaryDerivation
  derived from: http://data.ga-group.nl/ics/bics/2014/14141010
  source accessed on: 2019-12-03T20:05:01Z
  source last accessed on: 2019-12-03T20:05:01Z
  definition: This industry subgroup includes premium income generated from life insurance products, including life, accidental death, disability and annuities.
  notation: 14141010
  valid from: 2014-08-08
  valid till: 2020-10-03
source accessed on: 2019-12-03T20:05:01Z
source last accessed on: 2019-12-03T20:05:01Z
definition: This industry subgroup includes premium income generated from life insurance products, including life, accidental death, disability and annuities.
notation: 14141010
valid from: 2014-08-08
valid till: 2020-10-03

Fees & Other Income - Life Ins
type: BicsLevel5Segment
type: Classifier
type: NamedIndividual
is level5 segment of: Life Insurance Non-Premium
is replaced by: Fees & Other Income - Life Ins
created with: infer-bics.sql
derived from: Fees & Other Income - Life Ins
  type: BicsLevel5Segment
  type: Classifier
  type: ContemporaryDerivation
  derived from: http://data.ga-group.nl/ics/bics/2014/1414101110
  source accessed on: 2019-12-03T20:05:01Z
  source last accessed on: 2019-12-03T20:05:01Z
  definition: This segment includes other income generated from direct life business.
  notation: 1414101110
  valid from: 2014-08-08
  valid till: 2020-10-03
source accessed on: 2019-12-03T20:05:01Z
source last accessed on: 2019-12-03T20:05:01Z
definition: This segment includes other income generated from direct life business.
notation: 1414101110
valid from: 2014-08-08
valid till: 2020-10-03

Investment Income - Life Ins
type: BicsLevel5Segment
type: Classifier
type: NamedIndividual
is level5 segment of: Life Insurance Non-Premium
is replaced by: Investment Income - Life Ins
created with: infer-bics.sql
derived from: Investment Income - Life Ins
  type: BicsLevel5Segment
  type: Classifier
  type: ContemporaryDerivation
  derived from: http://data.ga-group.nl/ics/bics/2014/1414101111
  source accessed on: 2019-12-03T20:05:01Z
  source last accessed on: 2019-12-03T20:05:01Z
  definition: This segment includes investment income generated from direct life business.
  notation: 1414101111
  valid from: 2014-08-08
  valid till: 2020-10-03
source accessed on: 2019-12-03T20:05:01Z
source last accessed on: 2019-12-03T20:05:01Z
definition: This segment includes investment income generated from direct life business.
notation: 1414101111
valid from: 2014-08-08
valid till: 2020-10-03

Fees & Other Inc - Protect Prods
type: BicsLevel6Segment
type: Classifier
type: NamedIndividual
is level6 segment of: Protect Prods Non-Premium
is replaced by: Fees & Other Inc - Protect Prods
created with: infer-bics.sql
derived from: Fees & Other Inc - Protect Prods
  type: BicsLevel6Segment
  type: Classifier
  type: ContemporaryDerivation
  derived from: http://data.ga-group.nl/ics/bics/2014/141410111210
  source accessed on: 2019-12-03T20:05:01Z
  source last accessed on: 2019-12-03T20:05:01Z
  definition: This segment includes fees and other non-premium income generated from life insurance protection products, including individual and group life, accidental death, and disability policies.
  notation: 141410111210
  valid from: 2014-08-08
  valid till: 2020-10-03
source accessed on: 2019-12-03T20:05:01Z
source last accessed on: 2019-12-03T20:05:01Z
definition: This segment includes fees and other non-premium income generated from life insurance protection products, including individual and group life, accidental death, and disability policies.
notation: 141410111210
valid from: 2014-08-08
valid till: 2020-10-03

Invst Inc - Protection Prods
type: BicsLevel6Segment
type: Classifier
type: NamedIndividual
is level6 segment of: Protect Prods Non-Premium
is replaced by: Invst Inc - Protection Prods
created with: infer-bics.sql
derived from: Invst Inc - Protection Prods
  type: BicsLevel6Segment
  type: Classifier
  type: ContemporaryDerivation
  derived from: http://data.ga-group.nl/ics/bics/2014/141410111211
  source accessed on: 2019-12-03T20:05:01Z
  source last accessed on: 2019-12-03T20:05:01Z
  definition: This segment includes investment income generated from life insurance protection products, including individual and group life, accidental death, and disability policies.
  notation: 141410111211
  valid from: 2014-08-08
  valid till: 2020-10-03
source accessed on: 2019-12-03T20:05:01Z
source last accessed on: 2019-12-03T20:05:01Z
definition: This segment includes investment income generated from life insurance protection products, including individual and group life, accidental death, and disability policies.
notation: 141410111211
valid from: 2014-08-08
valid till: 2020-10-03

Realized G/L - Protection Prods
type: BicsLevel6Segment
type: Classifier
type: NamedIndividual
is level6 segment of: Protect Prods Non-Premium
is replaced by: Realized G/L - Protection Prods
created with: infer-bics.sql
derived from: Realized G/L - Protection Prods
  type: BicsLevel6Segment
  type: Classifier
  type: ContemporaryDerivation
  derived from: http://data.ga-group.nl/ics/bics/2014/141410111212
  source accessed on: 2019-12-03T20:05:01Z
  source last accessed on: 2019-12-03T20:05:01Z
  definition: This segment includes realized gains/losses generated from life insurance protection products, including individual and group life, accidental death, and disability policies.
  notation: 141410111212
  valid from: 2014-08-08
  valid till: 2020-10-03
source accessed on: 2019-12-03T20:05:01Z
source last accessed on: 2019-12-03T20:05:01Z
definition: This segment includes realized gains/losses generated from life insurance protection products, including individual and group life, accidental death, and disability policies.
notation: 141410111212
valid from: 2014-08-08
valid till: 2020-10-03

Protect Prods Non-Premium
type: BicsLevel5Segment
type: Classifier
type: NamedIndividual
is level5 segment of: Life Insurance Non-Premium
is replaced by: Protect Prods Non-Premium
created with: infer-bics.sql
derived from: Protect Prods Non-Premium
  type: BicsLevel5Segment
  type: Classifier
  type: ContemporaryDerivation
  derived from: http://data.ga-group.nl/ics/bics/2014/1414101112
  source accessed on: 2019-12-03T20:05:01Z
  source last accessed on: 2019-12-03T20:05:01Z
  definition: This segment includes non-premium income generated from life insurance protection products, including individual and group life, accidental death, and disability policies.
  notation: 1414101112
  valid from: 2014-08-08
  valid till: 2020-10-03
source accessed on: 2019-12-03T20:05:01Z
source last accessed on: 2019-12-03T20:05:01Z
definition: This segment includes non-premium income generated from life insurance protection products, including individual and group life, accidental death, and disability policies.
notation: 1414101112
valid from: 2014-08-08
valid till: 2020-10-03

Realized G/L - Life Insurance
type: BicsLevel5Segment
type: Classifier
type: NamedIndividual
is level5 segment of: Life Insurance Non-Premium
is replaced by: Realized G/L - Life Insurance
created with: infer-bics.sql
derived from: Realized G/L - Life Insurance
  type: BicsLevel5Segment
  type: Classifier
  type: ContemporaryDerivation
  derived from: http://data.ga-group.nl/ics/bics/2014/1414101113
  source accessed on: 2019-12-03T20:05:01Z
  source last accessed on: 2019-12-03T20:05:01Z
  definition: This segment includes realized gains/losses generated from direct life business.
  notation: 1414101113
  valid from: 2014-08-08
  valid till: 2020-10-03
source accessed on: 2019-12-03T20:05:01Z
source last accessed on: 2019-12-03T20:05:01Z
definition: This segment includes realized gains/losses generated from direct life business.
notation: 1414101113
valid from: 2014-08-08
valid till: 2020-10-03

Fees & Other Income - Life Invst
type: BicsLevel6Segment
type: Classifier
type: NamedIndividual
is level6 segment of: Saving & Retire Prods Non-Prem
is replaced by: Fees & Other Income - Life Invst
created with: infer-bics.sql
derived from: Fees & Other Income - Life Invst
  type: BicsLevel6Segment
  type: Classifier
  type: ContemporaryDerivation
  derived from: http://data.ga-group.nl/ics/bics/2014/141410111410
  source accessed on: 2019-12-03T20:05:01Z
  source last accessed on: 2019-12-03T20:05:01Z
  definition: This segment includes fees and other non-premium income generated from life insurance savings and retirement products, including individual and group fixed and variable annuities.
  notation: 141410111410
  valid from: 2014-08-08
  valid till: 2020-10-03
source accessed on: 2019-12-03T20:05:01Z
source last accessed on: 2019-12-03T20:05:01Z
definition: This segment includes fees and other non-premium income generated from life insurance savings and retirement products, including individual and group fixed and variable annuities.
notation: 141410111410
valid from: 2014-08-08
valid till: 2020-10-03

Investment Income - Life Invst
type: BicsLevel6Segment
type: Classifier
type: NamedIndividual
is level6 segment of: Saving & Retire Prods Non-Prem
is replaced by: Investment Income - Life Invst
created with: infer-bics.sql
derived from: Investment Income - Life Invst
  type: BicsLevel6Segment
  type: Classifier
  type: ContemporaryDerivation
  derived from: http://data.ga-group.nl/ics/bics/2014/141410111411
  source accessed on: 2019-12-03T20:05:01Z
  source last accessed on: 2019-12-03T20:05:01Z
  definition: This segment includes investment income generated from life insurance savings and retirement products, including individual and group fixed and variable annuities.
  notation: 141410111411
  valid from: 2014-08-08
  valid till: 2020-10-03
source accessed on: 2019-12-03T20:05:01Z
source last accessed on: 2019-12-03T20:05:01Z
definition: This segment includes investment income generated from life insurance savings and retirement products, including individual and group fixed and variable annuities.
notation: 141410111411
valid from: 2014-08-08
valid till: 2020-10-03

Realized G/L - Life Investment
type: BicsLevel6Segment
type: Classifier
type: NamedIndividual
is level6 segment of: Saving & Retire Prods Non-Prem
is replaced by: Realized G/L - Life Investment
created with: infer-bics.sql
derived from: Realized G/L - Life Investment
  type: BicsLevel6Segment
  type: Classifier
  type: ContemporaryDerivation
  derived from: http://data.ga-group.nl/ics/bics/2014/141410111412
  source accessed on: 2019-12-03T20:05:01Z
  source last accessed on: 2019-12-03T20:05:01Z
  definition: This segment includes realized gains/losses generated from life insurance savings and retirement products, including individual and group fixed and variable annuities.
  notation: 141410111412
  valid from: 2014-08-08
  valid till: 2020-10-03
source accessed on: 2019-12-03T20:05:01Z
source last accessed on: 2019-12-03T20:05:01Z
definition: This segment includes realized gains/losses generated from life insurance savings and retirement products, including individual and group fixed and variable annuities.
notation: 141410111412
valid from: 2014-08-08
valid till: 2020-10-03

Saving & Retire Prods Non-Prem
type: BicsLevel5Segment
type: Classifier
type: NamedIndividual
is level5 segment of: Life Insurance Non-Premium
is replaced by: Saving & Retire Prods Non-Prem
created with: infer-bics.sql
derived from: Saving & Retire Prods Non-Prem
  type: BicsLevel5Segment
  type: Classifier
  type: ContemporaryDerivation
  derived from: http://data.ga-group.nl/ics/bics/2014/1414101114
  source accessed on: 2019-12-03T20:05:01Z
  source last accessed on: 2019-12-03T20:05:01Z
  definition: This segment includes non-premium income generated from life insurance savings and retirement products, including individual and group fixed and variable annuities.
  notation: 1414101114
  valid from: 2014-08-08
  valid till: 2020-10-03
source accessed on: 2019-12-03T20:05:01Z
source last accessed on: 2019-12-03T20:05:01Z
definition: This segment includes non-premium income generated from life insurance savings and retirement products, including individual and group fixed and variable annuities.
notation: 1414101114
valid from: 2014-08-08
valid till: 2020-10-03

Life Insurance Non-Premium
type: BicsLevel4SubIndustry
type: Classifier
type: NamedIndividual
created with: infer-bics.sql
derived from: Life Insurance Non-Premium
  type: BicsLevel4SubIndustry
  type: Classifier
  type: ContemporaryDerivation
  derived from: http://data.ga-group.nl/ics/bics/2014/14141011
  source accessed on: 2019-12-03T20:05:01Z
  source last accessed on: 2019-12-03T20:05:01Z
  definition: This industry subgroup includes total non-premium revenue generated from direct life business.
  notation: 14141011
  valid from: 2014-08-08
  valid till: 2020-10-03
source accessed on: 2019-12-03T20:05:01Z
source last accessed on: 2019-12-03T20:05:01Z
definition: This industry subgroup includes total non-premium revenue generated from direct life business.
notation: 14141011
valid from: 2014-08-08
valid till: 2020-10-03

Life Insurance
type: BicsLevel3Industry
type: Classifier
type: NamedIndividual
is industry of: Insurance
is replaced by: Life Insurance
created with: infer-bics.sql
derived from: Life Insurance
  type: BicsLevel3Industry
  type: Classifier
  type: ContemporaryDerivation
  derived from: http://data.ga-group.nl/ics/bics/2014/141410
  source accessed on: 2019-12-03T20:05:01Z
  source last accessed on: 2019-12-03T20:05:01Z
  definition: This industry includes companies that directly underwrite life insurance policies, such as life, accidental death, disability and annuities (pensions).
  notation: 141410
  valid from: 2014-08-08
  valid till: 2020-10-03
source accessed on: 2019-12-03T20:05:01Z
source last accessed on: 2019-12-03T20:05:01Z
definition: This industry includes companies that directly underwrite life insurance policies, such as life, accidental death, disability and annuities (pensions).
notation: 141410
valid from: 2014-08-08
valid till: 2020-10-03

Commercial Auto Premiums
type: BicsLevel6Segment
type: Classifier
type: NamedIndividual
is level6 segment of: P&C Commercial Lines
is replaced by: Commercial Auto Premiums
created with: infer-bics.sql
derived from: Commercial Auto Premiums
  type: BicsLevel6Segment
  type: Classifier
  type: ContemporaryDerivation
  derived from: http://data.ga-group.nl/ics/bics/2014/141411101010
  source accessed on: 2019-12-03T20:05:01Z
  source last accessed on: 2019-12-03T20:05:01Z
  definition: This segment includes premium revenue generated from commercial lines. Such lines include workers’ compensation, commercial auto, commercial multi-peril, surety and fidelity, liability and other commercial lines of business.
  notation: 141411101010
  valid from: 2014-08-08
  valid till: 2020-10-03
source accessed on: 2019-12-03T20:05:01Z
source last accessed on: 2019-12-03T20:05:01Z
definition: This segment includes premium revenue generated from commercial lines. Such lines include workers’ compensation, commercial auto, commercial multi-peril, surety and fidelity, liability and other commercial lines of business.
notation: 141411101010
valid from: 2014-08-08
valid till: 2020-10-03

Comml Prop & Multi-Peril Prem
type: BicsLevel6Segment
type: Classifier
type: NamedIndividual
is level6 segment of: P&C Commercial Lines
is replaced by: Comml Prop & Multi-Peril Prem
created with: infer-bics.sql
derived from: Comml Prop & Multi-Peril Prem
  type: BicsLevel6Segment
  type: Classifier
  type: ContemporaryDerivation
  derived from: http://data.ga-group.nl/ics/bics/2014/141411101011
  source accessed on: 2019-12-03T20:05:01Z
  source last accessed on: 2019-12-03T20:05:01Z
  definition: This segment includes premium revenue generated from commercial property, commercial multi-peril, fire and allied lines, inland marine, theft, earthquake and umbrella lines of business.
  notation: 141411101011
  valid from: 2014-08-08
  valid till: 2020-10-03
source accessed on: 2019-12-03T20:05:01Z
source last accessed on: 2019-12-03T20:05:01Z
definition: This segment includes premium revenue generated from commercial property, commercial multi-peril, fire and allied lines, inland marine, theft, earthquake and umbrella lines of business.
notation: 141411101011
valid from: 2014-08-08
valid till: 2020-10-03

Financial Guarantee Premiums
type: BicsLevel6Segment
type: Classifier
type: NamedIndividual
is level6 segment of: P&C Commercial Lines
is replaced by: Financial Guarantee Premiums
created with: infer-bics.sql
derived from: Financial Guarantee Premiums
  type: BicsLevel6Segment
  type: Classifier
  type: ContemporaryDerivation
  derived from: http://data.ga-group.nl/ics/bics/2014/141411101012
  source accessed on: 2019-12-03T20:05:01Z
  source last accessed on: 2019-12-03T20:05:01Z
  definition: This segment includes premium revenue generated from financial guarantee lines of business.
  notation: 141411101012
  valid from: 2014-08-08
  valid till: 2020-10-03
source accessed on: 2019-12-03T20:05:01Z
source last accessed on: 2019-12-03T20:05:01Z
definition: This segment includes premium revenue generated from financial guarantee lines of business.
notation: 141411101012
valid from: 2014-08-08
valid till: 2020-10-03

Liability Premiums
type: BicsLevel6Segment
type: Classifier
type: NamedIndividual
is level6 segment of: P&C Commercial Lines
is replaced by: Liability Premiums
created with: infer-bics.sql
derived from: Liability Premiums
  type: BicsLevel6Segment
  type: Classifier
  type: ContemporaryDerivation
  derived from: http://data.ga-group.nl/ics/bics/2014/141411101013
  source accessed on: 2019-12-03T20:05:01Z
  source last accessed on: 2019-12-03T20:05:01Z
  definition: This segment includes premium revenue generated from commercial liability lines of business, such as fraud, general liability, medical malpractice, professional or product liability, environmental liability, director’s and officer’s liability, aviation, boiler and machinery, and ocean marine.
  notation: 141411101013
  valid from: 2014-08-08
  valid till: 2020-10-03
source accessed on: 2019-12-03T20:05:01Z
source last accessed on: 2019-12-03T20:05:01Z
definition: This segment includes premium revenue generated from commercial liability lines of business, such as fraud, general liability, medical malpractice, professional or product liability, environmental liability, director’s and officer’s liability, aviation, boiler and machinery, and ocean marine.
notation: 141411101013
valid from: 2014-08-08
valid till: 2020-10-03

Surety & Fidelity Premiums
type: BicsLevel6Segment
type: Classifier
type: NamedIndividual
is level6 segment of: P&C Commercial Lines
is replaced by: Surety & Fidelity Premiums
created with: infer-bics.sql
derived from: Surety & Fidelity Premiums
  type: BicsLevel6Segment
  type: Classifier
  type: ContemporaryDerivation
  derived from: http://data.ga-group.nl/ics/bics/2014/141411101014
  source accessed on: 2019-12-03T20:05:01Z
  source last accessed on: 2019-12-03T20:05:01Z
  definition: This segment includes premium revenue generated from surety and fidelitly bond insurance.
  notation: 141411101014
  valid from: 2014-08-08
  valid till: 2020-10-03
source accessed on: 2019-12-03T20:05:01Z
source last accessed on: 2019-12-03T20:05:01Z
definition: This segment includes premium revenue generated from surety and fidelitly bond insurance.
notation: 141411101014
valid from: 2014-08-08
valid till: 2020-10-03

Workers Compensation Premiums
type: BicsLevel6Segment
type: Classifier
type: NamedIndividual
is level6 segment of: P&C Commercial Lines
is replaced by: Workers Compensation Premiums
created with: infer-bics.sql
derived from: Workers Compensation Premiums
  type: BicsLevel6Segment
  type: Classifier
  type: ContemporaryDerivation
  derived from: http://data.ga-group.nl/ics/bics/2014/141411101015
  source accessed on: 2019-12-03T20:05:01Z
  source last accessed on: 2019-12-03T20:05:01Z
  definition: This segment includes premium revenue generated from workers compensation insurance.
  notation: 141411101015
  valid from: 2014-08-08
  valid till: 2020-10-03
source accessed on: 2019-12-03T20:05:01Z
source last accessed on: 2019-12-03T20:05:01Z
definition: This segment includes premium revenue generated from workers compensation insurance.
notation: 141411101015
valid from: 2014-08-08
valid till: 2020-10-03

Other Commercial Premiums
type: BicsLevel6Segment
type: Classifier
type: NamedIndividual
is level6 segment of: P&C Commercial Lines
is replaced by: Other Commercial Premiums
created with: infer-bics.sql
derived from: Other Commercial Premiums
  type: BicsLevel6Segment
  type: Classifier
  type: ContemporaryDerivation
  derived from: http://data.ga-group.nl/ics/bics/2014/141411101016
  source accessed on: 2019-12-03T20:05:01Z
  source last accessed on: 2019-12-03T20:05:01Z
  definition: This segment includes revenue generated from other commercial lines of business, such as terrorism, unidentified specialty lines, and other casualty lines not elsewhere classified.
  notation: 141411101016
  valid from: 2014-08-08
  valid till: 2020-10-03
source accessed on: 2019-12-03T20:05:01Z
source last accessed on: 2019-12-03T20:05:01Z
definition: This segment includes revenue generated from other commercial lines of business, such as terrorism, unidentified specialty lines, and other casualty lines not elsewhere classified.
notation: 141411101016
valid from: 2014-08-08
valid till: 2020-10-03

P&C Commercial Lines
type: BicsLevel5Segment
type: Classifier
type: NamedIndividual
is level5 segment of: P&C Insurance Premiums
is replaced by: P&C Commercial Lines
created with: infer-bics.sql
derived from: P&C Commercial Lines
  type: BicsLevel5Segment
  type: Classifier
  type: ContemporaryDerivation
  derived from: http://data.ga-group.nl/ics/bics/2014/1414111010
  source accessed on: 2019-12-03T20:05:01Z
  source last accessed on: 2019-12-03T20:05:01Z
  definition: This segment includes premium revenue generated from commercial lines of insurance, such as workers compensation, commercial auto, commercial multi-peril, surety and fidelity, liability and other commercial lines of business.
  notation: 1414111010
  valid from: 2014-08-08
  valid till: 2020-10-03
source accessed on: 2019-12-03T20:05:01Z
source last accessed on: 2019-12-03T20:05:01Z
definition: This segment includes premium revenue generated from commercial lines of insurance, such as workers compensation, commercial auto, commercial multi-peril, surety and fidelity, liability and other commercial lines of business.
notation: 1414111010
valid from: 2014-08-08
valid till: 2020-10-03

Homeowners Premiums
type: BicsLevel6Segment
type: Classifier
type: NamedIndividual
is level6 segment of: P&C Personal Lines
is replaced by: Homeowners Premiums
created with: infer-bics.sql
derived from: Homeowners Premiums
  type: BicsLevel6Segment
  type: Classifier
  type: ContemporaryDerivation
  derived from: http://data.ga-group.nl/ics/bics/2014/141411101110
  source accessed on: 2019-12-03T20:05:01Z
  source last accessed on: 2019-12-03T20:05:01Z
  definition: This segment includes premium revenue generated from coverage of residential dwellings and farms.
  notation: 141411101110
  valid from: 2014-08-08
  valid till: 2020-10-03
source accessed on: 2019-12-03T20:05:01Z
source last accessed on: 2019-12-03T20:05:01Z
definition: This segment includes premium revenue generated from coverage of residential dwellings and farms.
notation: 141411101110
valid from: 2014-08-08
valid till: 2020-10-03

Personal Auto Premiums
type: BicsLevel6Segment
type: Classifier
type: NamedIndividual
is level6 segment of: P&C Personal Lines
is replaced by: Personal Auto Premiums
created with: infer-bics.sql
derived from: Personal Auto Premiums
  type: BicsLevel6Segment
  type: Classifier
  type: ContemporaryDerivation
  derived from: http://data.ga-group.nl/ics/bics/2014/141411101111
  source accessed on: 2019-12-03T20:05:01Z
  source last accessed on: 2019-12-03T20:05:01Z
  definition: This segment includes premium revenue generated from coverage of all auto physical damage claims and personal auto liability for both standard and non-standard drivers.
  notation: 141411101111
  valid from: 2014-08-08
  valid till: 2020-10-03
source accessed on: 2019-12-03T20:05:01Z
source last accessed on: 2019-12-03T20:05:01Z
definition: This segment includes premium revenue generated from coverage of all auto physical damage claims and personal auto liability for both standard and non-standard drivers.
notation: 141411101111
valid from: 2014-08-08
valid till: 2020-10-03

Other Personal Premiums
type: BicsLevel6Segment
type: Classifier
type: NamedIndividual
is level6 segment of: P&C Personal Lines
is replaced by: Other Personal Premiums
created with: infer-bics.sql
derived from: Other Personal Premiums
  type: BicsLevel6Segment
  type: Classifier
  type: ContemporaryDerivation
  derived from: http://data.ga-group.nl/ics/bics/2014/141411101112
  source accessed on: 2019-12-03T20:05:01Z
  source last accessed on: 2019-12-03T20:05:01Z
  definition: This segment includes premium revenue generated from other personal lines of business not elsewhere classified.
  notation: 141411101112
  valid from: 2014-08-08
  valid till: 2020-10-03
source accessed on: 2019-12-03T20:05:01Z
source last accessed on: 2019-12-03T20:05:01Z
definition: This segment includes premium revenue generated from other personal lines of business not elsewhere classified.
notation: 141411101112
valid from: 2014-08-08
valid till: 2020-10-03

P&C Personal Lines
type: BicsLevel5Segment
type: Classifier
type: NamedIndividual
is level5 segment of: P&C Insurance Premiums
is replaced by: P&C Personal Lines
created with: infer-bics.sql
derived from: P&C Personal Lines
  type: BicsLevel5Segment
  type: Classifier
  type: ContemporaryDerivation
  derived from: http://data.ga-group.nl/ics/bics/2014/1414111011
  source accessed on: 2019-12-03T20:05:01Z
  source last accessed on: 2019-12-03T20:05:01Z
  definition: This segment includes premium revenue generated from personal lines of insurance, such as home, personal auto and other personal lines of business.
  notation: 1414111011
  valid from: 2014-08-08
  valid till: 2020-10-03
source accessed on: 2019-12-03T20:05:01Z
source last accessed on: 2019-12-03T20:05:01Z
definition: This segment includes premium revenue generated from personal lines of insurance, such as home, personal auto and other personal lines of business.
notation: 1414111011
valid from: 2014-08-08
valid till: 2020-10-03

P&C Insurance Premiums
type: BicsLevel4SubIndustry
type: Classifier
type: NamedIndividual
created with: infer-bics.sql
derived from: P&C Insurance Premiums
  type: BicsLevel4SubIndustry
  type: Classifier
  type: ContemporaryDerivation
  derived from: http://data.ga-group.nl/ics/bics/2014/14141110
  source accessed on: 2019-12-03T20:05:01Z
  source last accessed on: 2019-12-03T20:05:01Z
  definition: This industry subgroup includes companies that directly underwrite property and casualty insurance policies. Insurance types include automobile, property damage, casualty, theft, fire, malpractice, marine, workers' compensation and homeowners insurance.
  notation: 14141110
  valid from: 2014-08-08
  valid till: 2020-10-03
source accessed on: 2019-12-03T20:05:01Z
source last accessed on: 2019-12-03T20:05:01Z
definition: This industry subgroup includes companies that directly underwrite property and casualty insurance policies. Insurance types include automobile, property damage, casualty, theft, fire, malpractice, marine, workers' compensation and homeowners insurance.
notation: 14141110
valid from: 2014-08-08
valid till: 2020-10-03

Fees & Other Income - P&C
type: BicsLevel5Segment
type: Classifier
type: NamedIndividual
is level5 segment of: P&C Insurance Non-Premium
is replaced by: Fees & Other Income - P&C
created with: infer-bics.sql
derived from: Fees & Other Income - P&C
  type: BicsLevel5Segment
  type: Classifier
  type: ContemporaryDerivation
  derived from: http://data.ga-group.nl/ics/bics/2014/1414111110
  source accessed on: 2019-12-03T20:05:01Z
  source last accessed on: 2019-12-03T20:05:01Z
  definition: This segment includes other income generated from direct property and casualty business.
  notation: 1414111110
  valid from: 2014-08-08
  valid till: 2020-10-03
source accessed on: 2019-12-03T20:05:01Z
source last accessed on: 2019-12-03T20:05:01Z
definition: This segment includes other income generated from direct property and casualty business.
notation: 1414111110
valid from: 2014-08-08
valid till: 2020-10-03

Investment Income - P&C
type: BicsLevel5Segment
type: Classifier
type: NamedIndividual
is level5 segment of: P&C Insurance Non-Premium
is replaced by: Investment Income - P&C
created with: infer-bics.sql
derived from: Investment Income - P&C
  type: BicsLevel5Segment
  type: Classifier
  type: ContemporaryDerivation
  derived from: http://data.ga-group.nl/ics/bics/2014/1414111111
  source accessed on: 2019-12-03T20:05:01Z
  source last accessed on: 2019-12-03T20:05:01Z
  definition: This segment includes investment income generated from direct property and casualty business.
  notation: 1414111111
  valid from: 2014-08-08
  valid till: 2020-10-03
source accessed on: 2019-12-03T20:05:01Z
source last accessed on: 2019-12-03T20:05:01Z
definition: This segment includes investment income generated from direct property and casualty business.
notation: 1414111111
valid from: 2014-08-08
valid till: 2020-10-03

Realized Gains/Losses - P&C
type: BicsLevel5Segment
type: Classifier
type: NamedIndividual
is level5 segment of: P&C Insurance Non-Premium
is replaced by: Realized Gains/Losses - P&C
created with: infer-bics.sql
derived from: Realized Gains/Losses - P&C
  type: BicsLevel5Segment
  type: Classifier
  type: ContemporaryDerivation
  derived from: http://data.ga-group.nl/ics/bics/2014/1414111112
  source accessed on: 2019-12-03T20:05:01Z
  source last accessed on: 2019-12-03T20:05:01Z
  definition: This segment includes realized gains/losses generated from direct property and casualty business.
  notation: 1414111112
  valid from: 2014-08-08
  valid till: 2020-10-03
source accessed on: 2019-12-03T20:05:01Z
source last accessed on: 2019-12-03T20:05:01Z
definition: This segment includes realized gains/losses generated from direct property and casualty business.
notation: 1414111112
valid from: 2014-08-08
valid till: 2020-10-03

P&C Insurance Non-Premium
type: BicsLevel4SubIndustry
type: Classifier
type: NamedIndividual
created with: infer-bics.sql
derived from: P&C Insurance Non-Premium
  type: BicsLevel4SubIndustry
  type: Classifier
  type: ContemporaryDerivation
  derived from: http://data.ga-group.nl/ics/bics/2014/14141111
  source accessed on: 2019-12-03T20:05:01Z
  source last accessed on: 2019-12-03T20:05:01Z
  definition: This industry subgroup includes total non-premium revenue generated from direct property and casualty business.
  notation: 14141111
  valid from: 2014-08-08
  valid till: 2020-10-03
source accessed on: 2019-12-03T20:05:01Z
source last accessed on: 2019-12-03T20:05:01Z
definition: This industry subgroup includes total non-premium revenue generated from direct property and casualty business.
notation: 14141111
valid from: 2014-08-08
valid till: 2020-10-03

P&C Insurance
type: BicsLevel3Industry
type: Classifier
type: NamedIndividual
is industry of: Insurance
is replaced by: P&C Insurance
created with: infer-bics.sql
derived from: P&C Insurance
  type: BicsLevel3Industry
  type: Classifier
  type: ContemporaryDerivation
  derived from: http://data.ga-group.nl/ics/bics/2014/141411
  source accessed on: 2019-12-03T20:05:01Z
  source last accessed on: 2019-12-03T20:05:01Z
  definition: This industry includes companies that directly underwrite property and casualty insurance policies, such as automobile, property damage, casualty, theft, fire, malpractice, marine, workers' compensation and homeowners insurance.
  notation: 141411
  valid from: 2014-08-08
  valid till: 2020-10-03
source accessed on: 2019-12-03T20:05:01Z
source last accessed on: 2019-12-03T20:05:01Z
definition: This industry includes companies that directly underwrite property and casualty insurance policies, such as automobile, property damage, casualty, theft, fire, malpractice, marine, workers' compensation and homeowners insurance.
notation: 141411
valid from: 2014-08-08
valid till: 2020-10-03

Life Reinsurance Premiums
type: BicsLevel5Segment
type: Classifier
type: NamedIndividual
is level5 segment of: Life Reinsurance
is replaced by: Life Reinsurance Premiums
created with: infer-bics.sql
derived from: Life Reinsurance Premiums
  type: BicsLevel5Segment
  type: Classifier
  type: ContemporaryDerivation
  derived from: http://data.ga-group.nl/ics/bics/2014/1414121010
  source accessed on: 2019-12-03T20:05:01Z
  source last accessed on: 2019-12-03T20:05:01Z
  definition: This segment includes premium revenue generated from life reinsurance business.
  notation: 1414121010
  valid from: 2014-08-08
  valid till: 2020-10-03
source accessed on: 2019-12-03T20:05:01Z
source last accessed on: 2019-12-03T20:05:01Z
definition: This segment includes premium revenue generated from life reinsurance business.
notation: 1414121010
valid from: 2014-08-08
valid till: 2020-10-03

Investment Income - Life Re
type: BicsLevel6Segment
type: Classifier
type: NamedIndividual
is level6 segment of: Life Reinsurance Non-Premium
is replaced by: Investment Income - Life Re
created with: infer-bics.sql
derived from: Investment Income - Life Re
  type: BicsLevel6Segment
  type: Classifier
  type: ContemporaryDerivation
  derived from: http://data.ga-group.nl/ics/bics/2014/141412101110
  source accessed on: 2019-12-03T20:05:01Z
  source last accessed on: 2019-12-03T20:05:01Z
  definition: This segment includes investment-generated income from life reinsurance business.
  notation: 141412101110
  valid from: 2014-08-08
  valid till: 2020-10-03
source accessed on: 2019-12-03T20:05:01Z
source last accessed on: 2019-12-03T20:05:01Z
definition: This segment includes investment-generated income from life reinsurance business.
notation: 141412101110
valid from: 2014-08-08
valid till: 2020-10-03

Realized G/L - Life Reinsurance
type: BicsLevel6Segment
type: Classifier
type: NamedIndividual
is level6 segment of: Life Reinsurance Non-Premium
is replaced by: Realized G/L - Life Reinsurance
created with: infer-bics.sql
derived from: Realized G/L - Life Reinsurance
  type: BicsLevel6Segment
  type: Classifier
  type: ContemporaryDerivation
  derived from: http://data.ga-group.nl/ics/bics/2014/141412101111
  source accessed on: 2019-12-03T20:05:01Z
  source last accessed on: 2019-12-03T20:05:01Z
  definition: This segment includes realized gains/losses generated from life reinsurance business.
  notation: 141412101111
  valid from: 2014-08-08
  valid till: 2020-10-03
source accessed on: 2019-12-03T20:05:01Z
source last accessed on: 2019-12-03T20:05:01Z
definition: This segment includes realized gains/losses generated from life reinsurance business.
notation: 141412101111
valid from: 2014-08-08
valid till: 2020-10-03

Other Income - Life Reinsurance
type: BicsLevel6Segment
type: Classifier
type: NamedIndividual
is level6 segment of: Life Reinsurance Non-Premium
is replaced by: Other Income - Life Reinsurance
created with: infer-bics.sql
derived from: Other Income - Life Reinsurance
  type: BicsLevel6Segment
  type: Classifier
  type: ContemporaryDerivation
  derived from: http://data.ga-group.nl/ics/bics/2014/141412101112
  source accessed on: 2019-12-03T20:05:01Z
  source last accessed on: 2019-12-03T20:05:01Z
  definition: This segment includes other income generated from life reinsurance business.
  notation: 141412101112
  valid from: 2014-08-08
  valid till: 2020-10-03
source accessed on: 2019-12-03T20:05:01Z
source last accessed on: 2019-12-03T20:05:01Z
definition: This segment includes other income generated from life reinsurance business.
notation: 141412101112
valid from: 2014-08-08
valid till: 2020-10-03

Life Reinsurance Non-Premium
type: BicsLevel5Segment
type: Classifier
type: NamedIndividual
is level5 segment of: Life Reinsurance
is replaced by: Life Reinsurance Non-Premium
created with: infer-bics.sql
derived from: Life Reinsurance Non-Premium
  type: BicsLevel5Segment
  type: Classifier
  type: ContemporaryDerivation
  derived from: http://data.ga-group.nl/ics/bics/2014/1414121011
  source accessed on: 2019-12-03T20:05:01Z
  source last accessed on: 2019-12-03T20:05:01Z
  definition: This segment includes total non-premium revenue generated from life reinsurance business.
  notation: 1414121011
  valid from: 2014-08-08
  valid till: 2020-10-03
source accessed on: 2019-12-03T20:05:01Z
source last accessed on: 2019-12-03T20:05:01Z
definition: This segment includes total non-premium revenue generated from life reinsurance business.
notation: 1414121011
valid from: 2014-08-08
valid till: 2020-10-03

Life Reinsurance
type: BicsLevel4SubIndustry
type: Classifier
type: NamedIndividual
created with: infer-bics.sql
derived from: Life Reinsurance
  type: BicsLevel4SubIndustry
  type: Classifier
  type: ContemporaryDerivation
  derived from: http://data.ga-group.nl/ics/bics/2014/14141210
  source accessed on: 2019-12-03T20:05:01Z
  source last accessed on: 2019-12-03T20:05:01Z
  definition: This industry subgroup includes companies that underwrite reinsurance for life insurance policies. Insurance types include life, accidental death, disability and annuities (pensions).
  notation: 14141210
  valid from: 2014-08-08
  valid till: 2020-10-03
source accessed on: 2019-12-03T20:05:01Z
source last accessed on: 2019-12-03T20:05:01Z
definition: This industry subgroup includes companies that underwrite reinsurance for life insurance policies. Insurance types include life, accidental death, disability and annuities (pensions).
notation: 14141210
valid from: 2014-08-08
valid till: 2020-10-03

Specialty Lines Premiums
type: BicsLevel7Segment
type: Classifier
type: NamedIndividual
is level7 segment of: Casualty Lines Premiums
created with: infer-bics.sql
derived from: Specialty Lines Premiums
  type: BicsLevel7Segment
  type: Classifier
  type: ContemporaryDerivation
  derived from: http://data.ga-group.nl/ics/bics/2014/14141211101010
  source accessed on: 2019-12-03T20:05:01Z
  source last accessed on: 2019-12-03T20:05:01Z
  definition: This segment includes premium revenue generated from all reinsurance lines of business designated as specialty lines.
  notation: 14141211101010
  valid from: 2014-08-08
  valid till: 2020-10-03
source accessed on: 2019-12-03T20:05:01Z
source last accessed on: 2019-12-03T20:05:01Z
definition: This segment includes premium revenue generated from all reinsurance lines of business designated as specialty lines.
notation: 14141211101010
valid from: 2014-08-08
valid till: 2020-10-03

Other Casualty Lines Premiums
type: BicsLevel7Segment
type: Classifier
type: NamedIndividual
is level7 segment of: Casualty Lines Premiums
created with: infer-bics.sql
derived from: Other Casualty Lines Premiums
  type: BicsLevel7Segment
  type: Classifier
  type: ContemporaryDerivation
  derived from: http://data.ga-group.nl/ics/bics/2014/14141211101011
  source accessed on: 2019-12-03T20:05:01Z
  source last accessed on: 2019-12-03T20:05:01Z
  definition: This segment includes premium revenue generated from all casualty reinsurance lines of business not elsewhere classified.
  notation: 14141211101011
  valid from: 2014-08-08
  valid till: 2020-10-03
source accessed on: 2019-12-03T20:05:01Z
source last accessed on: 2019-12-03T20:05:01Z
definition: This segment includes premium revenue generated from all casualty reinsurance lines of business not elsewhere classified.
notation: 14141211101011
valid from: 2014-08-08
valid till: 2020-10-03

Casualty Lines Premiums
type: BicsLevel6Segment
type: Classifier
type: NamedIndividual
is level6 segment of: P&C Reinsurance Premiums
is replaced by: Casualty Lines Premiums
created with: infer-bics.sql
derived from: Casualty Lines Premiums
  type: BicsLevel6Segment
  type: Classifier
  type: ContemporaryDerivation
  derived from: http://data.ga-group.nl/ics/bics/2014/141412111010
  source accessed on: 2019-12-03T20:05:01Z
  source last accessed on: 2019-12-03T20:05:01Z
  definition: This segment includes premium revenue generated from all casualty reinsurance, including specialty coverage and all other casualty lines, including all liability lines of business.
  notation: 141412111010
  valid from: 2014-08-08
  valid till: 2020-10-03
source accessed on: 2019-12-03T20:05:01Z
source last accessed on: 2019-12-03T20:05:01Z
definition: This segment includes premium revenue generated from all casualty reinsurance, including specialty coverage and all other casualty lines, including all liability lines of business.
notation: 141412111010
valid from: 2014-08-08
valid till: 2020-10-03

Catastrophe Coverage Premiums
type: BicsLevel7Segment
type: Classifier
type: NamedIndividual
is level7 segment of: Property Lines Premiums
created with: infer-bics.sql
derived from: Catastrophe Coverage Premiums
  type: BicsLevel7Segment
  type: Classifier
  type: ContemporaryDerivation
  derived from: http://data.ga-group.nl/ics/bics/2014/14141211101110
  source accessed on: 2019-12-03T20:05:01Z
  source last accessed on: 2019-12-03T20:05:01Z
  definition: This segment includes premium revenue generated from property catastrophe reinsurance business.
  notation: 14141211101110
  valid from: 2014-08-08
  valid till: 2020-10-03
source accessed on: 2019-12-03T20:05:01Z
source last accessed on: 2019-12-03T20:05:01Z
definition: This segment includes premium revenue generated from property catastrophe reinsurance business.
notation: 14141211101110
valid from: 2014-08-08
valid till: 2020-10-03

Other Property Coverage Prem
type: BicsLevel7Segment
type: Classifier
type: NamedIndividual
is level7 segment of: Property Lines Premiums
created with: infer-bics.sql
derived from: Other Property Coverage Prem
  type: BicsLevel7Segment
  type: Classifier
  type: ContemporaryDerivation
  derived from: http://data.ga-group.nl/ics/bics/2014/14141211101111
  source accessed on: 2019-12-03T20:05:01Z
  source last accessed on: 2019-12-03T20:05:01Z
  definition: This segment includes premium revenue generated from property reinsurance not elsewhere classified.
  notation: 14141211101111
  valid from: 2014-08-08
  valid till: 2020-10-03
source accessed on: 2019-12-03T20:05:01Z
source last accessed on: 2019-12-03T20:05:01Z
definition: This segment includes premium revenue generated from property reinsurance not elsewhere classified.
notation: 14141211101111
valid from: 2014-08-08
valid till: 2020-10-03

Property Lines Premiums
type: BicsLevel6Segment
type: Classifier
type: NamedIndividual
is level6 segment of: P&C Reinsurance Premiums
is replaced by: Property Lines Premiums
created with: infer-bics.sql
derived from: Property Lines Premiums
  type: BicsLevel6Segment
  type: Classifier
  type: ContemporaryDerivation
  derived from: http://data.ga-group.nl/ics/bics/2014/141412111011
  source accessed on: 2019-12-03T20:05:01Z
  source last accessed on: 2019-12-03T20:05:01Z
  definition: This segment includes premium revenue generated from all property reinsurance, including catastrophe coverage and business not specified as catastrophe reinsurance.
  notation: 141412111011
  valid from: 2014-08-08
  valid till: 2020-10-03
source accessed on: 2019-12-03T20:05:01Z
source last accessed on: 2019-12-03T20:05:01Z
definition: This segment includes premium revenue generated from all property reinsurance, including catastrophe coverage and business not specified as catastrophe reinsurance.
notation: 141412111011
valid from: 2014-08-08
valid till: 2020-10-03

P&C Reinsurance Premiums
type: BicsLevel5Segment
type: Classifier
type: NamedIndividual
is level5 segment of: P&C Reinsurance
is replaced by: P&C Reinsurance Premiums
created with: infer-bics.sql
derived from: P&C Reinsurance Premiums
  type: BicsLevel5Segment
  type: Classifier
  type: ContemporaryDerivation
  derived from: http://data.ga-group.nl/ics/bics/2014/1414121110
  source accessed on: 2019-12-03T20:05:01Z
  source last accessed on: 2019-12-03T20:05:01Z
  definition: This segment includes premium revenue generated from property and casualty reinsurance business.
  notation: 1414121110
  valid from: 2014-08-08
  valid till: 2020-10-03
source accessed on: 2019-12-03T20:05:01Z
source last accessed on: 2019-12-03T20:05:01Z
definition: This segment includes premium revenue generated from property and casualty reinsurance business.
notation: 1414121110
valid from: 2014-08-08
valid till: 2020-10-03

Investment Income - P&C Re
type: BicsLevel6Segment
type: Classifier
type: NamedIndividual
is level6 segment of: P&C Reinsurance Non-Premium
is replaced by: Investment Income - P&C Re
created with: infer-bics.sql
derived from: Investment Income - P&C Re
  type: BicsLevel6Segment
  type: Classifier
  type: ContemporaryDerivation
  derived from: http://data.ga-group.nl/ics/bics/2014/141412111110
  source accessed on: 2019-12-03T20:05:01Z
  source last accessed on: 2019-12-03T20:05:01Z
  definition: This segment includes investment income generated from property and casualty reinsurance business.
  notation: 141412111110
  valid from: 2014-08-08
  valid till: 2020-10-03
source accessed on: 2019-12-03T20:05:01Z
source last accessed on: 2019-12-03T20:05:01Z
definition: This segment includes investment income generated from property and casualty reinsurance business.
notation: 141412111110
valid from: 2014-08-08
valid till: 2020-10-03

Realized G/L - P&C Reinsurance
type: BicsLevel6Segment
type: Classifier
type: NamedIndividual
is level6 segment of: P&C Reinsurance Non-Premium
is replaced by: Realized G/L - P&C Reinsurance
created with: infer-bics.sql
derived from: Realized G/L - P&C Reinsurance
  type: BicsLevel6Segment
  type: Classifier
  type: ContemporaryDerivation
  derived from: http://data.ga-group.nl/ics/bics/2014/141412111111
  source accessed on: 2019-12-03T20:05:01Z
  source last accessed on: 2019-12-03T20:05:01Z
  definition: This segment includes realized gains/losses generated from property and casualty reinsurance business.
  notation: 141412111111
  valid from: 2014-08-08
  valid till: 2020-10-03
source accessed on: 2019-12-03T20:05:01Z
source last accessed on: 2019-12-03T20:05:01Z
definition: This segment includes realized gains/losses generated from property and casualty reinsurance business.
notation: 141412111111
valid from: 2014-08-08
valid till: 2020-10-03

Other Income - P&C Reinsurance
type: BicsLevel6Segment
type: Classifier
type: NamedIndividual
is level6 segment of: P&C Reinsurance Non-Premium
is replaced by: Other Income - P&C Reinsurance
created with: infer-bics.sql
derived from: Other Income - P&C Reinsurance
  type: BicsLevel6Segment
  type: Classifier
  type: ContemporaryDerivation
  derived from: http://data.ga-group.nl/ics/bics/2014/141412111112
  source accessed on: 2019-12-03T20:05:01Z
  source last accessed on: 2019-12-03T20:05:01Z
  definition: This segment includes other income generated from property and casualty reinsurance business.
  notation: 141412111112
  valid from: 2014-08-08
  valid till: 2020-10-03
source accessed on: 2019-12-03T20:05:01Z
source last accessed on: 2019-12-03T20:05:01Z
definition: This segment includes other income generated from property and casualty reinsurance business.
notation: 141412111112
valid from: 2014-08-08
valid till: 2020-10-03

P&C Reinsurance Non-Premium
type: BicsLevel5Segment
type: Classifier
type: NamedIndividual
is level5 segment of: P&C Reinsurance
is replaced by: P&C Reinsurance Non-Premium
created with: infer-bics.sql
derived from: P&C Reinsurance Non-Premium
  type: BicsLevel5Segment
  type: Classifier
  type: ContemporaryDerivation
  derived from: http://data.ga-group.nl/ics/bics/2014/1414121111
  source accessed on: 2019-12-03T20:05:01Z
  source last accessed on: 2019-12-03T20:05:01Z
  definition: This segment includes total non-premium revenue generated from property and casualty reinsurance business.
  notation: 1414121111
  valid from: 2014-08-08
  valid till: 2020-10-03
source accessed on: 2019-12-03T20:05:01Z
source last accessed on: 2019-12-03T20:05:01Z
definition: This segment includes total non-premium revenue generated from property and casualty reinsurance business.
notation: 1414121111
valid from: 2014-08-08
valid till: 2020-10-03

P&C Reinsurance
type: BicsLevel4SubIndustry
type: Classifier
type: NamedIndividual
created with: infer-bics.sql
derived from: P&C Reinsurance
  type: BicsLevel4SubIndustry
  type: Classifier
  type: ContemporaryDerivation
  derived from: http://data.ga-group.nl/ics/bics/2014/14141211
  source accessed on: 2019-12-03T20:05:01Z
  source last accessed on: 2019-12-03T20:05:01Z
  definition: This industry subgroup includes companies that underwrite reinsurance for property and casualty insurance policies. Insurance types include automobile, property damage, casualty, theft, fire, malpractice, marine, workers' compensation and homeowners insurance.
  notation: 14141211
  valid from: 2014-08-08
  valid till: 2020-10-03
source accessed on: 2019-12-03T20:05:01Z
source last accessed on: 2019-12-03T20:05:01Z
definition: This industry subgroup includes companies that underwrite reinsurance for property and casualty insurance policies. Insurance types include automobile, property damage, casualty, theft, fire, malpractice, marine, workers' compensation and homeowners insurance.
notation: 14141211
valid from: 2014-08-08
valid till: 2020-10-03

Reinsurance
type: BicsLevel3Industry
type: Classifier
type: NamedIndividual
is industry of: Insurance
is replaced by: Reinsurance
created with: infer-bics.sql
derived from: Reinsurance
  type: BicsLevel3Industry
  type: Classifier
  type: ContemporaryDerivation
  derived from: http://data.ga-group.nl/ics/bics/2014/141412
  source accessed on: 2019-12-03T20:05:01Z
  source last accessed on: 2019-12-03T20:05:01Z
  definition: This industry includes companies that underwrite reinsurance for life, health and medical, property and casualty, title, and other insurance policies.
  notation: 141412
  valid from: 2014-08-08
  valid till: 2020-10-03
source accessed on: 2019-12-03T20:05:01Z
source last accessed on: 2019-12-03T20:05:01Z
definition: This industry includes companies that underwrite reinsurance for life, health and medical, property and casualty, title, and other insurance policies.
notation: 141412
valid from: 2014-08-08
valid till: 2020-10-03

Insurance Brokers
type: BicsLevel3Industry
type: Classifier
type: NamedIndividual
is industry of: Insurance
is replaced by: Insurance Brokers & Services
created with: infer-bics.sql
derived from: Insurance Brokers
  type: BicsLevel3Industry
  type: Classifier
  type: ContemporaryDerivation
  derived from: http://data.ga-group.nl/ics/bics/2014/141413
  source accessed on: 2019-12-03T20:05:01Z
  source last accessed on: 2019-12-03T20:05:01Z
  definition: This industry includes companies that act as insurance intermediaries that sell insurance policies and other insurance-related products like annuities.
  notation: 141413
  valid from: 2014-08-08
  valid till: 2020-10-03
source accessed on: 2019-12-03T20:05:01Z
source last accessed on: 2019-12-03T20:05:01Z
definition: This industry includes companies that act as insurance intermediaries that sell insurance policies and other insurance-related products like annuities.
notation: 141413
valid from: 2014-08-08
valid till: 2020-10-03

Claims Adjusting
type: BicsLevel4SubIndustry
type: Classifier
type: NamedIndividual
created with: infer-bics.sql
derived from: Claims Adjusting
  type: BicsLevel4SubIndustry
  type: Classifier
  type: ContemporaryDerivation
  derived from: http://data.ga-group.nl/ics/bics/2014/14141410
  source accessed on: 2019-12-03T20:05:01Z
  source last accessed on: 2019-12-03T20:05:01Z
  definition: This industry subgroup includes companies that offer claims adjusting services, such as insurance claims investigation services.
  notation: 14141410
  valid from: 2014-08-08
  valid till: 2020-10-03
source accessed on: 2019-12-03T20:05:01Z
source last accessed on: 2019-12-03T20:05:01Z
definition: This industry subgroup includes companies that offer claims adjusting services, such as insurance claims investigation services.
notation: 14141410
valid from: 2014-08-08
valid till: 2020-10-03

Insurance Related Svcs - Other
type: BicsLevel4SubIndustry
type: Classifier
type: NamedIndividual
created with: infer-bics.sql
derived from: Insurance Related Svcs - Other
  type: BicsLevel4SubIndustry
  type: Classifier
  type: ContemporaryDerivation
  derived from: http://data.ga-group.nl/ics/bics/2014/14141411
  source accessed on: 2019-12-03T20:05:01Z
  source last accessed on: 2019-12-03T20:05:01Z
  definition: This industry subgroup includes companies that offer other insurance related services not elsewhere classified, such as actuarial services, loss prevention services, insurance exchanges, advisory services, consulting services and insurance reporting services.
  notation: 14141411
  valid from: 2014-08-08
  valid till: 2020-10-03
source accessed on: 2019-12-03T20:05:01Z
source last accessed on: 2019-12-03T20:05:01Z
definition: This industry subgroup includes companies that offer other insurance related services not elsewhere classified, such as actuarial services, loss prevention services, insurance exchanges, advisory services, consulting services and insurance reporting services.
notation: 14141411
valid from: 2014-08-08
valid till: 2020-10-03

Other Insurance Premiums
type: BicsLevel4SubIndustry
type: Classifier
type: NamedIndividual
created with: infer-bics.sql
derived from: Other Insurance Premiums
  type: BicsLevel4SubIndustry
  type: Classifier
  type: ContemporaryDerivation
  derived from: http://data.ga-group.nl/ics/bics/2014/14141412
  source accessed on: 2019-12-03T20:05:01Z
  source last accessed on: 2019-12-03T20:05:01Z
  definition: This industry subgroup includes premium revenue generated from other direct insurance business.
  notation: 14141412
  valid from: 2014-08-08
  valid till: 2020-10-03
source accessed on: 2019-12-03T20:05:01Z
source last accessed on: 2019-12-03T20:05:01Z
definition: This industry subgroup includes premium revenue generated from other direct insurance business.
notation: 14141412
valid from: 2014-08-08
valid till: 2020-10-03

Investment Inc - Other Insurance
type: BicsLevel5Segment
type: Classifier
type: NamedIndividual
is level5 segment of: Other Insurance Non-Premium
created with: infer-bics.sql
derived from: Investment Inc - Other Insurance
  type: BicsLevel5Segment
  type: Classifier
  type: ContemporaryDerivation
  derived from: http://data.ga-group.nl/ics/bics/2014/1414141310
  source accessed on: 2019-12-03T20:05:01Z
  source last accessed on: 2019-12-03T20:05:01Z
  definition: This segment includes investment income generated from other direct insurance business.
  notation: 1414141310
  valid from: 2014-08-08
  valid till: 2020-10-03
source accessed on: 2019-12-03T20:05:01Z
source last accessed on: 2019-12-03T20:05:01Z
definition: This segment includes investment income generated from other direct insurance business.
notation: 1414141310
valid from: 2014-08-08
valid till: 2020-10-03

Realized G/L - Other Insurance
type: BicsLevel5Segment
type: Classifier
type: NamedIndividual
is level5 segment of: Other Insurance Non-Premium
created with: infer-bics.sql
derived from: Realized G/L - Other Insurance
  type: BicsLevel5Segment
  type: Classifier
  type: ContemporaryDerivation
  derived from: http://data.ga-group.nl/ics/bics/2014/1414141311
  source accessed on: 2019-12-03T20:05:01Z
  source last accessed on: 2019-12-03T20:05:01Z
  definition: This segment includes realized gains/losses generated from other direct insurance business.
  notation: 1414141311
  valid from: 2014-08-08
  valid till: 2020-10-03
source accessed on: 2019-12-03T20:05:01Z
source last accessed on: 2019-12-03T20:05:01Z
definition: This segment includes realized gains/losses generated from other direct insurance business.
notation: 1414141311
valid from: 2014-08-08
valid till: 2020-10-03

Other Income - Other Insurance
type: BicsLevel5Segment
type: Classifier
type: NamedIndividual
is level5 segment of: Other Insurance Non-Premium
created with: infer-bics.sql
derived from: Other Income - Other Insurance
  type: BicsLevel5Segment
  type: Classifier
  type: ContemporaryDerivation
  derived from: http://data.ga-group.nl/ics/bics/2014/1414141312
  source accessed on: 2019-12-03T20:05:01Z
  source last accessed on: 2019-12-03T20:05:01Z
  definition: This segment includes other income generated from other direct insurance business.
  notation: 1414141312
  valid from: 2014-08-08
  valid till: 2020-10-03
source accessed on: 2019-12-03T20:05:01Z
source last accessed on: 2019-12-03T20:05:01Z
definition: This segment includes other income generated from other direct insurance business.
notation: 1414141312
valid from: 2014-08-08
valid till: 2020-10-03

Other Insurance Non-Premium
type: BicsLevel4SubIndustry
type: Classifier
type: NamedIndividual
created with: infer-bics.sql
derived from: Other Insurance Non-Premium
  type: BicsLevel4SubIndustry
  type: Classifier
  type: ContemporaryDerivation
  derived from: http://data.ga-group.nl/ics/bics/2014/14141413
  source accessed on: 2019-12-03T20:05:01Z
  source last accessed on: 2019-12-03T20:05:01Z
  definition: This industry subgroup includes total non-premium revenue generated from other direct insurance business.
  notation: 14141413
  valid from: 2014-08-08
  valid till: 2020-10-03
source accessed on: 2019-12-03T20:05:01Z
source last accessed on: 2019-12-03T20:05:01Z
definition: This industry subgroup includes total non-premium revenue generated from other direct insurance business.
notation: 14141413
valid from: 2014-08-08
valid till: 2020-10-03

Self Insurance Funds
type: BicsLevel4SubIndustry
type: Classifier
type: NamedIndividual
created with: infer-bics.sql
derived from: Self Insurance Funds
  type: BicsLevel4SubIndustry
  type: Classifier
  type: ContemporaryDerivation
  derived from: http://data.ga-group.nl/ics/bics/2014/14141414
  source accessed on: 2019-12-03T20:05:01Z
  source last accessed on: 2019-12-03T20:05:01Z
  definition: This industry subgroup includes self-insurance funds.
  notation: 14141414
  valid from: 2014-08-08
  valid till: 2020-10-03
source accessed on: 2019-12-03T20:05:01Z
source last accessed on: 2019-12-03T20:05:01Z
definition: This industry subgroup includes self-insurance funds.
notation: 14141414
valid from: 2014-08-08
valid till: 2020-10-03

Third Party Admin of Insurance
type: BicsLevel4SubIndustry
type: Classifier
type: NamedIndividual
created with: infer-bics.sql
derived from: Third Party Admin of Insurance
  type: BicsLevel4SubIndustry
  type: Classifier
  type: ContemporaryDerivation
  derived from: http://data.ga-group.nl/ics/bics/2014/14141415
  source accessed on: 2019-12-03T20:05:01Z
  source last accessed on: 2019-12-03T20:05:01Z
  definition: This industry subgroup includes companies that offer third-party administration of insurance and pension plans, such as claims processing.
  notation: 14141415
  valid from: 2014-08-08
  valid till: 2020-10-03
source accessed on: 2019-12-03T20:05:01Z
source last accessed on: 2019-12-03T20:05:01Z
definition: This industry subgroup includes companies that offer third-party administration of insurance and pension plans, such as claims processing.
notation: 14141415
valid from: 2014-08-08
valid till: 2020-10-03

Insurance Services & Other
type: BicsLevel3Industry
type: Classifier
type: NamedIndividual
is industry of: Insurance
created with: infer-bics.sql
derived from: Insurance Services & Other
  type: BicsLevel3Industry
  type: Classifier
  type: ContemporaryDerivation
  derived from: http://data.ga-group.nl/ics/bics/2014/141414
  source accessed on: 2019-12-03T20:05:01Z
  source last accessed on: 2019-12-03T20:05:01Z
  definition: This industry includes companies that provide insurance-related services, such as claims adjusting, third-party administration of insurance plans, actuarial services, loss prevention services, insurance exchanges, claims processing and self-insurance funds.
  notation: 141414
  valid from: 2014-08-08
  valid till: 2020-10-03
source accessed on: 2019-12-03T20:05:01Z
source last accessed on: 2019-12-03T20:05:01Z
definition: This industry includes companies that provide insurance-related services, such as claims adjusting, third-party administration of insurance plans, actuarial services, loss prevention services, insurance exchanges, claims processing and self-insurance funds.
notation: 141414
valid from: 2014-08-08
valid till: 2020-10-03

Islamic Health Ins Premiums
type: BicsLevel5Segment
type: Classifier
type: NamedIndividual
is level5 segment of: Health Insurance - Islamic
is replaced by: Islamic Health Ins Premiums
created with: infer-bics.sql
derived from: Islamic Health Ins Premiums
  type: BicsLevel5Segment
  type: Classifier
  type: ContemporaryDerivation
  derived from: http://data.ga-group.nl/ics/bics/2014/1414151010
  source accessed on: 2019-12-03T20:05:01Z
  source last accessed on: 2019-12-03T20:05:01Z
  definition: This segment includes premium revenue generated from direct health business in compliance with Islamic law.
  notation: 1414151010
  valid from: 2014-08-08
  valid till: 2020-10-03
source accessed on: 2019-12-03T20:05:01Z
source last accessed on: 2019-12-03T20:05:01Z
definition: This segment includes premium revenue generated from direct health business in compliance with Islamic law.
notation: 1414151010
valid from: 2014-08-08
valid till: 2020-10-03

Invst Inc - Islamic Health Ins
type: BicsLevel6Segment
type: Classifier
type: NamedIndividual
is level6 segment of: Islamic Health Non-Premium
is replaced by: Invst Inc - Islamic Health Ins
created with: infer-bics.sql
derived from: Invst Inc - Islamic Health Ins
  type: BicsLevel6Segment
  type: Classifier
  type: ContemporaryDerivation
  derived from: http://data.ga-group.nl/ics/bics/2014/141415101110
  source accessed on: 2019-12-03T20:05:01Z
  source last accessed on: 2019-12-03T20:05:01Z
  definition: This segment includes investment income generated from direct health business in compliance with Islamic law.
  notation: 141415101110
  valid from: 2014-08-08
  valid till: 2020-10-03
source accessed on: 2019-12-03T20:05:01Z
source last accessed on: 2019-12-03T20:05:01Z
definition: This segment includes investment income generated from direct health business in compliance with Islamic law.
notation: 141415101110
valid from: 2014-08-08
valid till: 2020-10-03

Realized G/L - Islamic Health
type: BicsLevel6Segment
type: Classifier
type: NamedIndividual
is level6 segment of: Islamic Health Non-Premium
is replaced by: Realized G/L - Islamic Health
created with: infer-bics.sql
derived from: Realized G/L - Islamic Health
  type: BicsLevel6Segment
  type: Classifier
  type: ContemporaryDerivation
  derived from: http://data.ga-group.nl/ics/bics/2014/141415101111
  source accessed on: 2019-12-03T20:05:01Z
  source last accessed on: 2019-12-03T20:05:01Z
  definition: This segment includes realized gains/losses generated from direct health business in compliance with Islamic law.
  notation: 141415101111
  valid from: 2014-08-08
  valid till: 2020-10-03
source accessed on: 2019-12-03T20:05:01Z
source last accessed on: 2019-12-03T20:05:01Z
definition: This segment includes realized gains/losses generated from direct health business in compliance with Islamic law.
notation: 141415101111
valid from: 2014-08-08
valid till: 2020-10-03

Other Income - Islamic Health
type: BicsLevel6Segment
type: Classifier
type: NamedIndividual
is level6 segment of: Islamic Health Non-Premium
is replaced by: Other Income - Islamic Health
created with: infer-bics.sql
derived from: Other Income - Islamic Health
  type: BicsLevel6Segment
  type: Classifier
  type: ContemporaryDerivation
  derived from: http://data.ga-group.nl/ics/bics/2014/141415101112
  source accessed on: 2019-12-03T20:05:01Z
  source last accessed on: 2019-12-03T20:05:01Z
  definition: This segment includes other income generated from direct health business in compliance with Islamic law.
  notation: 141415101112
  valid from: 2014-08-08
  valid till: 2020-10-03
source accessed on: 2019-12-03T20:05:01Z
source last accessed on: 2019-12-03T20:05:01Z
definition: This segment includes other income generated from direct health business in compliance with Islamic law.
notation: 141415101112
valid from: 2014-08-08
valid till: 2020-10-03

Islamic Health Non-Premium
type: BicsLevel5Segment
type: Classifier
type: NamedIndividual
is level5 segment of: Health Insurance - Islamic
is replaced by: Islamic Health Ins Non-Premium
created with: infer-bics.sql
derived from: Islamic Health Non-Premium
  type: BicsLevel5Segment
  type: Classifier
  type: ContemporaryDerivation
  derived from: http://data.ga-group.nl/ics/bics/2014/1414151011
  source accessed on: 2019-12-03T20:05:01Z
  source last accessed on: 2019-12-03T20:05:01Z
  definition: This segment includes total non-premium revenue generated from direct health business in compliance with Islamic law.
  notation: 1414151011
  valid from: 2014-08-08
  valid till: 2020-10-03
source accessed on: 2019-12-03T20:05:01Z
source last accessed on: 2019-12-03T20:05:01Z
definition: This segment includes total non-premium revenue generated from direct health business in compliance with Islamic law.
notation: 1414151011
valid from: 2014-08-08
valid till: 2020-10-03

Health Insurance - Islamic
type: BicsLevel4SubIndustry
type: Classifier
type: NamedIndividual
created with: infer-bics.sql
derived from: Health Insurance - Islamic
  type: BicsLevel4SubIndustry
  type: Classifier
  type: ContemporaryDerivation
  derived from: http://data.ga-group.nl/ics/bics/2014/14141510
  source accessed on: 2019-12-03T20:05:01Z
  source last accessed on: 2019-12-03T20:05:01Z
  definition: This industry subgroup includes companies that directly underwrite health insurance policies in compliance with Islamic law. Such policies include both health and medical insurance.
  notation: 14141510
  valid from: 2014-08-08
  valid till: 2020-10-03
source accessed on: 2019-12-03T20:05:01Z
source last accessed on: 2019-12-03T20:05:01Z
definition: This industry subgroup includes companies that directly underwrite health insurance policies in compliance with Islamic law. Such policies include both health and medical insurance.
notation: 14141510
valid from: 2014-08-08
valid till: 2020-10-03

Islamic Life Ins Premiums
type: BicsLevel5Segment
type: Classifier
type: NamedIndividual
is level5 segment of: Life Insurance - Islamic
is replaced by: Islamic Life Ins Premiums
created with: infer-bics.sql
derived from: Islamic Life Ins Premiums
  type: BicsLevel5Segment
  type: Classifier
  type: ContemporaryDerivation
  derived from: http://data.ga-group.nl/ics/bics/2014/1414151110
  source accessed on: 2019-12-03T20:05:01Z
  source last accessed on: 2019-12-03T20:05:01Z
  definition: This segment includes premium revenue generated from direct life business in compliance with Islamic law.
  notation: 1414151110
  valid from: 2014-08-08
  valid till: 2020-10-03
source accessed on: 2019-12-03T20:05:01Z
source last accessed on: 2019-12-03T20:05:01Z
definition: This segment includes premium revenue generated from direct life business in compliance with Islamic law.
notation: 1414151110
valid from: 2014-08-08
valid till: 2020-10-03

Invst Income - Islamic Life Ins
type: BicsLevel6Segment
type: Classifier
type: NamedIndividual
is level6 segment of: Islamic Life Ins Non-Premium
is replaced by: Invst Income - Islamic Life Ins
created with: infer-bics.sql
derived from: Invst Income - Islamic Life Ins
  type: BicsLevel6Segment
  type: Classifier
  type: ContemporaryDerivation
  derived from: http://data.ga-group.nl/ics/bics/2014/141415111110
  source accessed on: 2019-12-03T20:05:01Z
  source last accessed on: 2019-12-03T20:05:01Z
  definition: This segment includes investment income generated from direct life business in compliance with Islamic law.
  notation: 141415111110
  valid from: 2014-08-08
  valid till: 2020-10-03
source accessed on: 2019-12-03T20:05:01Z
source last accessed on: 2019-12-03T20:05:01Z
definition: This segment includes investment income generated from direct life business in compliance with Islamic law.
notation: 141415111110
valid from: 2014-08-08
valid till: 2020-10-03

Realized G/L - Islamic Life Ins
type: BicsLevel6Segment
type: Classifier
type: NamedIndividual
is level6 segment of: Islamic Life Ins Non-Premium
is replaced by: Realized G/L - Islamic Life Ins
created with: infer-bics.sql
derived from: Realized G/L - Islamic Life Ins
  type: BicsLevel6Segment
  type: Classifier
  type: ContemporaryDerivation
  derived from: http://data.ga-group.nl/ics/bics/2014/141415111111
  source accessed on: 2019-12-03T20:05:01Z
  source last accessed on: 2019-12-03T20:05:01Z
  definition: This segment includes realized gains/losses generated from direct life business in compliance with Islamic law.
  notation: 141415111111
  valid from: 2014-08-08
  valid till: 2020-10-03
source accessed on: 2019-12-03T20:05:01Z
source last accessed on: 2019-12-03T20:05:01Z
definition: This segment includes realized gains/losses generated from direct life business in compliance with Islamic law.
notation: 141415111111
valid from: 2014-08-08
valid till: 2020-10-03

Other Income - Islamic Life Ins
type: BicsLevel6Segment
type: Classifier
type: NamedIndividual
is level6 segment of: Islamic Life Ins Non-Premium
is replaced by: Other Income - Islamic Life Ins
created with: infer-bics.sql
derived from: Other Income - Islamic Life Ins
  type: BicsLevel6Segment
  type: Classifier
  type: ContemporaryDerivation
  derived from: http://data.ga-group.nl/ics/bics/2014/141415111112
  source accessed on: 2019-12-03T20:05:01Z
  source last accessed on: 2019-12-03T20:05:01Z
  definition: This segment includes other income generated from direct life business in compliance with Islamic law.
  notation: 141415111112
  valid from: 2014-08-08
  valid till: 2020-10-03
source accessed on: 2019-12-03T20:05:01Z
source last accessed on: 2019-12-03T20:05:01Z
definition: This segment includes other income generated from direct life business in compliance with Islamic law.
notation: 141415111112
valid from: 2014-08-08
valid till: 2020-10-03

Islamic Life Ins Non-Premium
type: BicsLevel5Segment
type: Classifier
type: NamedIndividual
is level5 segment of: Life Insurance - Islamic
is replaced by: Islamic Life Ins Non-Premium
created with: infer-bics.sql
derived from: Islamic Life Ins Non-Premium
  type: BicsLevel5Segment
  type: Classifier
  type: ContemporaryDerivation
  derived from: http://data.ga-group.nl/ics/bics/2014/1414151111
  source accessed on: 2019-12-03T20:05:01Z
  source last accessed on: 2019-12-03T20:05:01Z
  definition: This segment includes total non-premium revenue generated from direct life business in compliance with Islamic law.
  notation: 1414151111
  valid from: 2014-08-08
  valid till: 2020-10-03
source accessed on: 2019-12-03T20:05:01Z
source last accessed on: 2019-12-03T20:05:01Z
definition: This segment includes total non-premium revenue generated from direct life business in compliance with Islamic law.
notation: 1414151111
valid from: 2014-08-08
valid till: 2020-10-03

Life Insurance - Islamic
type: BicsLevel4SubIndustry
type: Classifier
type: NamedIndividual
created with: infer-bics.sql
derived from: Life Insurance - Islamic
  type: BicsLevel4SubIndustry
  type: Classifier
  type: ContemporaryDerivation
  derived from: http://data.ga-group.nl/ics/bics/2014/14141511
  source accessed on: 2019-12-03T20:05:01Z
  source last accessed on: 2019-12-03T20:05:01Z
  definition: This industry subgroup includes companies that directly underwrite life insurance policies in compliance with Islamic law. Insurance types include life, accidental death, disability and annuities (pensions).
  notation: 14141511
  valid from: 2014-08-08
  valid till: 2020-10-03
source accessed on: 2019-12-03T20:05:01Z
source last accessed on: 2019-12-03T20:05:01Z
definition: This industry subgroup includes companies that directly underwrite life insurance policies in compliance with Islamic law. Insurance types include life, accidental death, disability and annuities (pensions).
notation: 14141511
valid from: 2014-08-08
valid till: 2020-10-03

Islamic P&C Ins Premiums
type: BicsLevel5Segment
type: Classifier
type: NamedIndividual
is level5 segment of: P&C Insurance - Islamic
is replaced by: Islamic P&C Ins Premiums
created with: infer-bics.sql
derived from: Islamic P&C Ins Premiums
  type: BicsLevel5Segment
  type: Classifier
  type: ContemporaryDerivation
  derived from: http://data.ga-group.nl/ics/bics/2014/1414151210
  source accessed on: 2019-12-03T20:05:01Z
  source last accessed on: 2019-12-03T20:05:01Z
  definition: This segment includes premium revenue generated from direct property and casualty business in compliance with Islamic law.
  notation: 1414151210
  valid from: 2014-08-08
  valid till: 2020-10-03
source accessed on: 2019-12-03T20:05:01Z
source last accessed on: 2019-12-03T20:05:01Z
definition: This segment includes premium revenue generated from direct property and casualty business in compliance with Islamic law.
notation: 1414151210
valid from: 2014-08-08
valid till: 2020-10-03

Invst Income - Islamic P&C Ins
type: BicsLevel6Segment
type: Classifier
type: NamedIndividual
is level6 segment of: Islamic P&C Ins Non-Premium
is replaced by: Invst Income - Islamic P&C Ins
created with: infer-bics.sql
derived from: Invst Income - Islamic P&C Ins
  type: BicsLevel6Segment
  type: Classifier
  type: ContemporaryDerivation
  derived from: http://data.ga-group.nl/ics/bics/2014/141415121110
  source accessed on: 2019-12-03T20:05:01Z
  source last accessed on: 2019-12-03T20:05:01Z
  definition: This segment includes investment income generated from direct property and casualty business in compliance with Islamic law.
  notation: 141415121110
  valid from: 2014-08-08
  valid till: 2020-10-03
source accessed on: 2019-12-03T20:05:01Z
source last accessed on: 2019-12-03T20:05:01Z
definition: This segment includes investment income generated from direct property and casualty business in compliance with Islamic law.
notation: 141415121110
valid from: 2014-08-08
valid till: 2020-10-03

Realized G/L - Islamic P&C Ins
type: BicsLevel6Segment
type: Classifier
type: NamedIndividual
is level6 segment of: Islamic P&C Ins Non-Premium
is replaced by: Realized G/L - Islamic P&C Ins
created with: infer-bics.sql
derived from: Realized G/L - Islamic P&C Ins
  type: BicsLevel6Segment
  type: Classifier
  type: ContemporaryDerivation
  derived from: http://data.ga-group.nl/ics/bics/2014/141415121111
  source accessed on: 2019-12-03T20:05:01Z
  source last accessed on: 2019-12-03T20:05:01Z
  definition: This segment includes realized gains/losses generated from direct property and casualty business in compliance with Islamic law.
  notation: 141415121111
  valid from: 2014-08-08
  valid till: 2020-10-03
source accessed on: 2019-12-03T20:05:01Z
source last accessed on: 2019-12-03T20:05:01Z
definition: This segment includes realized gains/losses generated from direct property and casualty business in compliance with Islamic law.
notation: 141415121111
valid from: 2014-08-08
valid till: 2020-10-03

Other Income - Islamic P&C Ins
type: BicsLevel6Segment
type: Classifier
type: NamedIndividual
is level6 segment of: Islamic P&C Ins Non-Premium
is replaced by: Other Income - Islamic P&C Ins
created with: infer-bics.sql
derived from: Other Income - Islamic P&C Ins
  type: BicsLevel6Segment
  type: Classifier
  type: ContemporaryDerivation
  derived from: http://data.ga-group.nl/ics/bics/2014/141415121112
  source accessed on: 2019-12-03T20:05:01Z
  source last accessed on: 2019-12-03T20:05:01Z
  definition: This segment includes other income generated from direct property and casualty business in compliance with Islamic law.
  notation: 141415121112
  valid from: 2014-08-08
  valid till: 2020-10-03
source accessed on: 2019-12-03T20:05:01Z
source last accessed on: 2019-12-03T20:05:01Z
definition: This segment includes other income generated from direct property and casualty business in compliance with Islamic law.
notation: 141415121112
valid from: 2014-08-08
valid till: 2020-10-03

Islamic P&C Ins Non-Premium
type: BicsLevel5Segment
type: Classifier
type: NamedIndividual
is level5 segment of: P&C Insurance - Islamic
is replaced by: Islamic P&C Ins Non-Premium
created with: infer-bics.sql
derived from: Islamic P&C Ins Non-Premium
  type: BicsLevel5Segment
  type: Classifier
  type: ContemporaryDerivation
  derived from: http://data.ga-group.nl/ics/bics/2014/1414151211
  source accessed on: 2019-12-03T20:05:01Z
  source last accessed on: 2019-12-03T20:05:01Z
  definition: This segment includes total non-premium revenue generated from direct property and casualty business in compliance with Islamic law.
  notation: 1414151211
  valid from: 2014-08-08
  valid till: 2020-10-03
source accessed on: 2019-12-03T20:05:01Z
source last accessed on: 2019-12-03T20:05:01Z
definition: This segment includes total non-premium revenue generated from direct property and casualty business in compliance with Islamic law.
notation: 1414151211
valid from: 2014-08-08
valid till: 2020-10-03

P&C Insurance - Islamic
type: BicsLevel4SubIndustry
type: Classifier
type: NamedIndividual
created with: infer-bics.sql
derived from: P&C Insurance - Islamic
  type: BicsLevel4SubIndustry
  type: Classifier
  type: ContemporaryDerivation
  derived from: http://data.ga-group.nl/ics/bics/2014/14141512
  source accessed on: 2019-12-03T20:05:01Z
  source last accessed on: 2019-12-03T20:05:01Z
  definition: This industry subgroup includes companies that directly underwrite property and casualty insurance policies in compliance with Islamic law. Insurance types include automobile, property damage, casualty, theft, fire, malpractice, marine, workers' compensation and homeowners insurance.
  notation: 14141512
  valid from: 2014-08-08
  valid till: 2020-10-03
source accessed on: 2019-12-03T20:05:01Z
source last accessed on: 2019-12-03T20:05:01Z
definition: This industry subgroup includes companies that directly underwrite property and casualty insurance policies in compliance with Islamic law. Insurance types include automobile, property damage, casualty, theft, fire, malpractice, marine, workers' compensation and homeowners insurance.
notation: 14141512
valid from: 2014-08-08
valid till: 2020-10-03

Islamic Reinsurance Premiums
type: BicsLevel5Segment
type: Classifier
type: NamedIndividual
is level5 segment of: Reinsurance - Islamic
created with: infer-bics.sql
derived from: Islamic Reinsurance Premiums
  type: BicsLevel5Segment
  type: Classifier
  type: ContemporaryDerivation
  derived from: http://data.ga-group.nl/ics/bics/2014/1414151310
  source accessed on: 2019-12-03T20:05:01Z
  source last accessed on: 2019-12-03T20:05:01Z
  definition: This segment includes premium revenue generated from life, health and medical, and property and casualty reinsurance business in compliance with Islamic law.
  notation: 1414151310
  valid from: 2014-08-08
  valid till: 2020-10-03
source accessed on: 2019-12-03T20:05:01Z
source last accessed on: 2019-12-03T20:05:01Z
definition: This segment includes premium revenue generated from life, health and medical, and property and casualty reinsurance business in compliance with Islamic law.
notation: 1414151310
valid from: 2014-08-08
valid till: 2020-10-03

Investment Income - Islamic Re
type: BicsLevel6Segment
type: Classifier
type: NamedIndividual
is level6 segment of: Islamic Reinsurance Non-Prem
created with: infer-bics.sql
derived from: Investment Income - Islamic Re
  type: BicsLevel6Segment
  type: Classifier
  type: ContemporaryDerivation
  derived from: http://data.ga-group.nl/ics/bics/2014/141415131110
  source accessed on: 2019-12-03T20:05:01Z
  source last accessed on: 2019-12-03T20:05:01Z
  definition: This segment includes investment income generated from life, health and medical, and property and casualty reinsurance business in compliance with Islamic law.
  notation: 141415131110
  valid from: 2014-08-08
  valid till: 2020-10-03
source accessed on: 2019-12-03T20:05:01Z
source last accessed on: 2019-12-03T20:05:01Z
definition: This segment includes investment income generated from life, health and medical, and property and casualty reinsurance business in compliance with Islamic law.
notation: 141415131110
valid from: 2014-08-08
valid till: 2020-10-03

Realized G/L - Islamic Re
type: BicsLevel6Segment
type: Classifier
type: NamedIndividual
is level6 segment of: Islamic Reinsurance Non-Prem
created with: infer-bics.sql
derived from: Realized G/L - Islamic Re
  type: BicsLevel6Segment
  type: Classifier
  type: ContemporaryDerivation
  derived from: http://data.ga-group.nl/ics/bics/2014/141415131111
  source accessed on: 2019-12-03T20:05:01Z
  source last accessed on: 2019-12-03T20:05:01Z
  definition: This segment includes realized gains/losses generated from life, health and medical, and property and casualty reinsurance business in compliance with Islamic law.
  notation: 141415131111
  valid from: 2014-08-08
  valid till: 2020-10-03
source accessed on: 2019-12-03T20:05:01Z
source last accessed on: 2019-12-03T20:05:01Z
definition: This segment includes realized gains/losses generated from life, health and medical, and property and casualty reinsurance business in compliance with Islamic law.
notation: 141415131111
valid from: 2014-08-08
valid till: 2020-10-03

Other Income - Islamic Re
type: BicsLevel6Segment
type: Classifier
type: NamedIndividual
is level6 segment of: Islamic Reinsurance Non-Prem
created with: infer-bics.sql
derived from: Other Income - Islamic Re
  type: BicsLevel6Segment
  type: Classifier
  type: ContemporaryDerivation
  derived from: http://data.ga-group.nl/ics/bics/2014/141415131112
  source accessed on: 2019-12-03T20:05:01Z
  source last accessed on: 2019-12-03T20:05:01Z
  definition: This segment includes other income generated from life, health and medical, and property and casualty reinsurance business in compliance with Islamic law.
  notation: 141415131112
  valid from: 2014-08-08
  valid till: 2020-10-03
source accessed on: 2019-12-03T20:05:01Z
source last accessed on: 2019-12-03T20:05:01Z
definition: This segment includes other income generated from life, health and medical, and property and casualty reinsurance business in compliance with Islamic law.
notation: 141415131112
valid from: 2014-08-08
valid till: 2020-10-03

Islamic Reinsurance Non-Prem
type: BicsLevel5Segment
type: Classifier
type: NamedIndividual
is level5 segment of: Reinsurance - Islamic
created with: infer-bics.sql
derived from: Islamic Reinsurance Non-Prem
  type: BicsLevel5Segment
  type: Classifier
  type: ContemporaryDerivation
  derived from: http://data.ga-group.nl/ics/bics/2014/1414151311
  source accessed on: 2019-12-03T20:05:01Z
  source last accessed on: 2019-12-03T20:05:01Z
  definition: This segment includes total non-premium revenue generated from life, health and medical, and property and casualty reinsurance business in compliance with Islamic law.
  notation: 1414151311
  valid from: 2014-08-08
  valid till: 2020-10-03
source accessed on: 2019-12-03T20:05:01Z
source last accessed on: 2019-12-03T20:05:01Z
definition: This segment includes total non-premium revenue generated from life, health and medical, and property and casualty reinsurance business in compliance with Islamic law.
notation: 1414151311
valid from: 2014-08-08
valid till: 2020-10-03

Reinsurance - Islamic
type: BicsLevel4SubIndustry
type: Classifier
type: NamedIndividual
created with: infer-bics.sql
derived from: Reinsurance - Islamic
  type: BicsLevel4SubIndustry
  type: Classifier
  type: ContemporaryDerivation
  derived from: http://data.ga-group.nl/ics/bics/2014/14141513
  source accessed on: 2019-12-03T20:05:01Z
  source last accessed on: 2019-12-03T20:05:01Z
  definition: This industry subgroup includes companies that underwrite reinsurance for life, health and medical, property and casualty, and other insurance policies in compliance with Islamic law.
  notation: 14141513
  valid from: 2014-08-08
  valid till: 2020-10-03
source accessed on: 2019-12-03T20:05:01Z
source last accessed on: 2019-12-03T20:05:01Z
definition: This industry subgroup includes companies that underwrite reinsurance for life, health and medical, property and casualty, and other insurance policies in compliance with Islamic law.
notation: 14141513
valid from: 2014-08-08
valid till: 2020-10-03

Islamic Insurance Carriers
type: BicsLevel3Industry
type: Classifier
type: NamedIndividual
is industry of: Insurance
is replaced by: Islamic Insurance
created with: infer-bics.sql
derived from: Islamic Insurance Carriers
  type: BicsLevel3Industry
  type: Classifier
  type: ContemporaryDerivation
  derived from: http://data.ga-group.nl/ics/bics/2014/141415
  source accessed on: 2019-12-03T20:05:01Z
  source last accessed on: 2019-12-03T20:05:01Z
  definition: This industry includes companies that underwrite life, health and medical, property and casualty, and related insurance lines, either directly or as a reinsurer; companies that provide insurance related services, such as claims adjusting, administrative and advisory services; and insurance agencies and brokers. Such companies operate in compliance with Islamic law.
  notation: 141415
  valid from: 2014-08-08
  valid till: 2020-10-03
source accessed on: 2019-12-03T20:05:01Z
source last accessed on: 2019-12-03T20:05:01Z
definition: This industry includes companies that underwrite life, health and medical, property and casualty, and related insurance lines, either directly or as a reinsurer; companies that provide insurance related services, such as claims adjusting, administrative and advisory services; and insurance agencies and brokers. Such companies operate in compliance with Islamic law.
notation: 141415
valid from: 2014-08-08
valid till: 2020-10-03

Insurance
type: BicsLevel2IndustryGroup
type: Classifier
type: NamedIndividual
is industry group of: Financials
is replaced by: Insurance
created with: infer-bics.sql
derived from: Insurance
  type: BicsLevel2IndustryGroup
  type: Classifier
  type: ContemporaryDerivation
  derived from: http://data.ga-group.nl/ics/bics/2014/1414
  source accessed on: 2019-12-03T20:05:01Z
  source last accessed on: 2019-12-03T20:05:01Z
  definition: This industry group includes companies that underwrite life, health and medical, property and casualty, and related insurance lines, either directly or as a reinsurer; companies that provide insurance-related services, such as claims adjusting, administrative and advisory services; and insurance agencies and brokers.
  notation: 1414
  valid from: 2014-08-08
  valid till: 2020-10-03
source accessed on: 2019-12-03T20:05:01Z
source last accessed on: 2019-12-03T20:05:01Z
definition: This industry group includes companies that underwrite life, health and medical, property and casualty, and related insurance lines, either directly or as a reinsurer; companies that provide insurance-related services, such as claims adjusting, administrative and advisory services; and insurance agencies and brokers.
notation: 1414
valid from: 2014-08-08
valid till: 2020-10-03

Hospital Owners & Developers
type: BicsLevel5Segment
type: Classifier
type: NamedIndividual
is level5 segment of: Health Care Owners & Develop
created with: infer-bics.sql
derived from: Hospital Owners & Developers
  type: BicsLevel5Segment
  type: Classifier
  type: ContemporaryDerivation
  derived from: http://data.ga-group.nl/ics/bics/2014/1415101010
  source accessed on: 2019-12-03T20:05:01Z
  source last accessed on: 2019-12-03T20:05:01Z
  definition: This segment includes non-REIT owners and developers of hospitals.
  notation: 1415101010
  valid from: 2014-08-08
  valid till: 2020-10-03
source accessed on: 2019-12-03T20:05:01Z
source last accessed on: 2019-12-03T20:05:01Z
definition: This segment includes non-REIT owners and developers of hospitals.
notation: 1415101010
valid from: 2014-08-08
valid till: 2020-10-03

Medical Office Own & Develop
type: BicsLevel5Segment
type: Classifier
type: NamedIndividual
is level5 segment of: Health Care Owners & Develop
created with: infer-bics.sql
derived from: Medical Office Own & Develop
  type: BicsLevel5Segment
  type: Classifier
  type: ContemporaryDerivation
  derived from: http://data.ga-group.nl/ics/bics/2014/1415101011
  source accessed on: 2019-12-03T20:05:01Z
  source last accessed on: 2019-12-03T20:05:01Z
  definition: This segment includes non-REIT owners and developers of medical office buildings. These medical offices primarily house health care tenants, such as general and specialty physician practices, as well as health care testing service providers.
  notation: 1415101011
  valid from: 2014-08-08
  valid till: 2020-10-03
source accessed on: 2019-12-03T20:05:01Z
source last accessed on: 2019-12-03T20:05:01Z
definition: This segment includes non-REIT owners and developers of medical office buildings. These medical offices primarily house health care tenants, such as general and specialty physician practices, as well as health care testing service providers.
notation: 1415101011
valid from: 2014-08-08
valid till: 2020-10-03

Senior Housing Own & Develop
type: BicsLevel5Segment
type: Classifier
type: NamedIndividual
is level5 segment of: Health Care Owners & Develop
created with: infer-bics.sql
derived from: Senior Housing Own & Develop
  type: BicsLevel5Segment
  type: Classifier
  type: ContemporaryDerivation
  derived from: http://data.ga-group.nl/ics/bics/2014/1415101012
  source accessed on: 2019-12-03T20:05:01Z
  source last accessed on: 2019-12-03T20:05:01Z
  definition: This segment includes non-REIT owners and developers of senior housing, such as retirement living communities and assisted living facilities.
  notation: 1415101012
  valid from: 2014-08-08
  valid till: 2020-10-03
source accessed on: 2019-12-03T20:05:01Z
source last accessed on: 2019-12-03T20:05:01Z
definition: This segment includes non-REIT owners and developers of senior housing, such as retirement living communities and assisted living facilities.
notation: 1415101012
valid from: 2014-08-08
valid till: 2020-10-03

Skilled Nursing Owners & Dev
type: BicsLevel5Segment
type: Classifier
type: NamedIndividual
is level5 segment of: Health Care Owners & Develop
created with: infer-bics.sql
derived from: Skilled Nursing Owners & Dev
  type: BicsLevel5Segment
  type: Classifier
  type: ContemporaryDerivation
  derived from: http://data.ga-group.nl/ics/bics/2014/1415101013
  source accessed on: 2019-12-03T20:05:01Z
  source last accessed on: 2019-12-03T20:05:01Z
  definition: This segment includes non-REIT owners and developers of nursing homes.
  notation: 1415101013
  valid from: 2014-08-08
  valid till: 2020-10-03
source accessed on: 2019-12-03T20:05:01Z
source last accessed on: 2019-12-03T20:05:01Z
definition: This segment includes non-REIT owners and developers of nursing homes.
notation: 1415101013
valid from: 2014-08-08
valid till: 2020-10-03

Health Care Owners & Develop
type: BicsLevel4SubIndustry
type: Classifier
type: NamedIndividual
created with: infer-bics.sql
derived from: Health Care Owners & Develop
  type: BicsLevel4SubIndustry
  type: Classifier
  type: ContemporaryDerivation
  derived from: http://data.ga-group.nl/ics/bics/2014/14151010
  source accessed on: 2019-12-03T20:05:01Z
  source last accessed on: 2019-12-03T20:05:01Z
  definition: This industry subgroup includes non-REIT owners and developers of health care properties.
  notation: 14151010
  valid from: 2014-08-08
  valid till: 2020-10-03
source accessed on: 2019-12-03T20:05:01Z
source last accessed on: 2019-12-03T20:05:01Z
definition: This industry subgroup includes non-REIT owners and developers of health care properties.
notation: 14151010
valid from: 2014-08-08
valid till: 2020-10-03

Hotel Owners & Developers
type: BicsLevel4SubIndustry
type: Classifier
type: NamedIndividual
created with: infer-bics.sql
derived from: Hotel Owners & Developers
  type: BicsLevel4SubIndustry
  type: Classifier
  type: ContemporaryDerivation
  derived from: http://data.ga-group.nl/ics/bics/2014/14151011
  source accessed on: 2019-12-03T20:05:01Z
  source last accessed on: 2019-12-03T20:05:01Z
  definition: This industry subgroup includes non-REIT owners and developers of hotel/lodging properties.
  notation: 14151011
  valid from: 2014-08-08
  valid till: 2020-10-03
source accessed on: 2019-12-03T20:05:01Z
source last accessed on: 2019-12-03T20:05:01Z
definition: This industry subgroup includes non-REIT owners and developers of hotel/lodging properties.
notation: 14151011
valid from: 2014-08-08
valid till: 2020-10-03

Apartment Owners & Develop
type: BicsLevel5Segment
type: Classifier
type: NamedIndividual
is level5 segment of: Housing Owners & Developers
is replaced by: Apartment Owners & Develop
created with: infer-bics.sql
derived from: Apartment Owners & Develop
  type: BicsLevel5Segment
  type: Classifier
  type: ContemporaryDerivation
  derived from: http://data.ga-group.nl/ics/bics/2014/1415101210
  source accessed on: 2019-12-03T20:05:01Z
  source last accessed on: 2019-12-03T20:05:01Z
  definition: This segment includes non-REIT owners and developers of apartments. Such apartments include affordable and non-affordable units.
  notation: 1415101210
  valid from: 2014-08-08
  valid till: 2020-10-03
source accessed on: 2019-12-03T20:05:01Z
source last accessed on: 2019-12-03T20:05:01Z
definition: This segment includes non-REIT owners and developers of apartments. Such apartments include affordable and non-affordable units.
notation: 1415101210
valid from: 2014-08-08
valid till: 2020-10-03

Mfgd Housing Owners & Develop
type: BicsLevel5Segment
type: Classifier
type: NamedIndividual
is level5 segment of: Housing Owners & Developers
is replaced by: http://data.ga-group.nl/ics/bics/1510101311
created with: infer-bics.sql
derived from: Mfgd Housing Owners & Develop
  type: BicsLevel5Segment
  type: Classifier
  type: ContemporaryDerivation
  derived from: http://data.ga-group.nl/ics/bics/2014/1415101211
  source accessed on: 2019-12-03T20:05:01Z
  source last accessed on: 2019-12-03T20:05:01Z
  definition: This segment includes non-REIT owners and developers of pad sites and mobile/manufactured homes. This also includes companies that operate resort communities. Such communities are areas where you bring RVs and pay a fee to rent the ground space/pad site.
  notation: 1415101211
  valid from: 2014-08-08
  valid till: 2020-10-03
source accessed on: 2019-12-03T20:05:01Z
source last accessed on: 2019-12-03T20:05:01Z
definition: This segment includes non-REIT owners and developers of pad sites and mobile/manufactured homes. This also includes companies that operate resort communities. Such communities are areas where you bring RVs and pay a fee to rent the ground space/pad site.
notation: 1415101211
valid from: 2014-08-08
valid till: 2020-10-03

Military Housing Own & Develop
type: BicsLevel5Segment
type: Classifier
type: NamedIndividual
is level5 segment of: Housing Owners & Developers
created with: infer-bics.sql
derived from: Military Housing Own & Develop
  type: BicsLevel5Segment
  type: Classifier
  type: ContemporaryDerivation
  derived from: http://data.ga-group.nl/ics/bics/2014/1415101212
  source accessed on: 2019-12-03T20:05:01Z
  source last accessed on: 2019-12-03T20:05:01Z
  definition: This segment includes non-REIT owners and developers of housing expressly for military personnel.
  notation: 1415101212
  valid from: 2014-08-08
  valid till: 2020-10-03
source accessed on: 2019-12-03T20:05:01Z
source last accessed on: 2019-12-03T20:05:01Z
definition: This segment includes non-REIT owners and developers of housing expressly for military personnel.
notation: 1415101212
valid from: 2014-08-08
valid till: 2020-10-03

Student Housing Own & Develop
type: BicsLevel5Segment
type: Classifier
type: NamedIndividual
is level5 segment of: Housing Owners & Developers
is replaced by: http://data.ga-group.nl/ics/bics/1510101312
created with: infer-bics.sql
derived from: Student Housing Own & Develop
  type: BicsLevel5Segment
  type: Classifier
  type: ContemporaryDerivation
  derived from: http://data.ga-group.nl/ics/bics/2014/1415101213
  source accessed on: 2019-12-03T20:05:01Z
  source last accessed on: 2019-12-03T20:05:01Z
  definition: This segment includes non-REIT owners and developers of student housing. Such housing is any for-rent housing that is available to students only.
  notation: 1415101213
  valid from: 2014-08-08
  valid till: 2020-10-03
source accessed on: 2019-12-03T20:05:01Z
source last accessed on: 2019-12-03T20:05:01Z
definition: This segment includes non-REIT owners and developers of student housing. Such housing is any for-rent housing that is available to students only.
notation: 1415101213
valid from: 2014-08-08
valid till: 2020-10-03

Housing Owners & Developers
type: BicsLevel4SubIndustry
type: Classifier
type: NamedIndividual
created with: infer-bics.sql
derived from: Housing Owners & Developers
  type: BicsLevel4SubIndustry
  type: Classifier
  type: ContemporaryDerivation
  derived from: http://data.ga-group.nl/ics/bics/2014/14151012
  source accessed on: 2019-12-03T20:05:01Z
  source last accessed on: 2019-12-03T20:05:01Z
  definition: This industry subgroup includes non-REIT owners and developers of housing facilities.
  notation: 14151012
  valid from: 2014-08-08
  valid till: 2020-10-03
source accessed on: 2019-12-03T20:05:01Z
source last accessed on: 2019-12-03T20:05:01Z
definition: This industry subgroup includes non-REIT owners and developers of housing facilities.
notation: 14151012
valid from: 2014-08-08
valid till: 2020-10-03

Bulk Warehouse Own & Develop
type: BicsLevel5Segment
type: Classifier
type: NamedIndividual
is level5 segment of: Industrial Owners & Developers
is replaced by: http://data.ga-group.nl/ics/bics/1510101410
created with: infer-bics.sql
derived from: Bulk Warehouse Own & Develop
  type: BicsLevel5Segment
  type: Classifier
  type: ContemporaryDerivation
  derived from: http://data.ga-group.nl/ics/bics/2014/1415101310
  source accessed on: 2019-12-03T20:05:01Z
  source last accessed on: 2019-12-03T20:05:01Z
  definition: This segment includes non-REIT owners and developers of high-ceiling industrial properties used for distribution, warehousing and manufacturing.
  notation: 1415101310
  valid from: 2014-08-08
  valid till: 2020-10-03
source accessed on: 2019-12-03T20:05:01Z
source last accessed on: 2019-12-03T20:05:01Z
definition: This segment includes non-REIT owners and developers of high-ceiling industrial properties used for distribution, warehousing and manufacturing.
notation: 1415101310
valid from: 2014-08-08
valid till: 2020-10-03

Flex Industrial Own & Develop
type: BicsLevel5Segment
type: Classifier
type: NamedIndividual
is level5 segment of: Industrial Owners & Developers
is replaced by: http://data.ga-group.nl/ics/bics/1510101411
created with: infer-bics.sql
derived from: Flex Industrial Own & Develop
  type: BicsLevel5Segment
  type: Classifier
  type: ContemporaryDerivation
  derived from: http://data.ga-group.nl/ics/bics/2014/1415101311
  source accessed on: 2019-12-03T20:05:01Z
  source last accessed on: 2019-12-03T20:05:01Z
  definition: This segment includes non-REIT owners and developers of flex space. Such space is versatile one- or two-floor structure with ceiling heights up to 16 feet and with some loading door/dock option. Such space can easily be fitted out for office, light manufacturing, R&D and storage, all under the same roof and in the same unit.
  notation: 1415101311
  valid from: 2014-08-08
  valid till: 2020-10-03
source accessed on: 2019-12-03T20:05:01Z
source last accessed on: 2019-12-03T20:05:01Z
definition: This segment includes non-REIT owners and developers of flex space. Such space is versatile one- or two-floor structure with ceiling heights up to 16 feet and with some loading door/dock option. Such space can easily be fitted out for office, light manufacturing, R&D and storage, all under the same roof and in the same unit.
notation: 1415101311
valid from: 2014-08-08
valid till: 2020-10-03

Temp Control Logist Own & Dev
type: BicsLevel5Segment
type: Classifier
type: NamedIndividual
is level5 segment of: Industrial Owners & Developers
is replaced by: http://data.ga-group.nl/ics/bics/1510101412
created with: infer-bics.sql
derived from: Temp Control Logist Own & Dev
  type: BicsLevel5Segment
  type: Classifier
  type: ContemporaryDerivation
  derived from: http://data.ga-group.nl/ics/bics/2014/1415101312
  source accessed on: 2019-12-03T20:05:01Z
  source last accessed on: 2019-12-03T20:05:01Z
  definition: This segment includes non-REIT owners and developers of temperature-controlled industrial, warehouse or distribution facilities. Such facilities are equipped to accommodate temperature adjustment, refrigeration and/or freezing.
  notation: 1415101312
  valid from: 2014-08-08
  valid till: 2020-10-03
source accessed on: 2019-12-03T20:05:01Z
source last accessed on: 2019-12-03T20:05:01Z
definition: This segment includes non-REIT owners and developers of temperature-controlled industrial, warehouse or distribution facilities. Such facilities are equipped to accommodate temperature adjustment, refrigeration and/or freezing.
notation: 1415101312
valid from: 2014-08-08
valid till: 2020-10-03

Industrial Owners & Developers
type: BicsLevel4SubIndustry
type: Classifier
type: NamedIndividual
created with: infer-bics.sql
derived from: Industrial Owners & Developers
  type: BicsLevel4SubIndustry
  type: Classifier
  type: ContemporaryDerivation
  derived from: http://data.ga-group.nl/ics/bics/2014/14151013
  source accessed on: 2019-12-03T20:05:01Z
  source last accessed on: 2019-12-03T20:05:01Z
  definition: This industry subgroup includes non-REIT owners and developers of industrial properties, such as warehouse, distribution, temperature-controlled logistics, and flex space.
  notation: 14151013
  valid from: 2014-08-08
  valid till: 2020-10-03
source accessed on: 2019-12-03T20:05:01Z
source last accessed on: 2019-12-03T20:05:01Z
definition: This industry subgroup includes non-REIT owners and developers of industrial properties, such as warehouse, distribution, temperature-controlled logistics, and flex space.
notation: 14151013
valid from: 2014-08-08
valid till: 2020-10-03

Multi Asset Class Own & Develop
type: BicsLevel4SubIndustry
type: Classifier
type: NamedIndividual
created with: infer-bics.sql
derived from: Multi Asset Class Own & Develop
  type: BicsLevel4SubIndustry
  type: Classifier
  type: ContemporaryDerivation
  derived from: http://data.ga-group.nl/ics/bics/2014/14151014
  source accessed on: 2019-12-03T20:05:01Z
  source last accessed on: 2019-12-03T20:05:01Z
  definition: This industry subgroup includes non-REIT owners and developers multiple property types. Typically, these companies would construct multiple property types within the scope of a single development project.
  notation: 14151014
  valid from: 2014-08-08
  valid till: 2020-10-03
source accessed on: 2019-12-03T20:05:01Z
source last accessed on: 2019-12-03T20:05:01Z
definition: This industry subgroup includes non-REIT owners and developers multiple property types. Typically, these companies would construct multiple property types within the scope of a single development project.
notation: 14151014
valid from: 2014-08-08
valid till: 2020-10-03

CBD Office Own & Developers
type: BicsLevel5Segment
type: Classifier
type: NamedIndividual
is level5 segment of: Office Owners & Developers
is replaced by: http://data.ga-group.nl/ics/bics/1510101510
created with: infer-bics.sql
derived from: CBD Office Own & Developers
  type: BicsLevel5Segment
  type: Classifier
  type: ContemporaryDerivation
  derived from: http://data.ga-group.nl/ics/bics/2014/1415101510
  source accessed on: 2019-12-03T20:05:01Z
  source last accessed on: 2019-12-03T20:05:01Z
  definition: This segment includes non-REIT owners and developers of office buildings in central business districts (CBDs). Outside of the U.S., if the office is not identified as being in a CBD, the number of stories in the building will be used to determine whether it is CBD (greater than 5+ stories) or suburban (less than 5 stories).
  notation: 1415101510
  valid from: 2014-08-08
  valid till: 2020-10-03
source accessed on: 2019-12-03T20:05:01Z
source last accessed on: 2019-12-03T20:05:01Z
definition: This segment includes non-REIT owners and developers of office buildings in central business districts (CBDs). Outside of the U.S., if the office is not identified as being in a CBD, the number of stories in the building will be used to determine whether it is CBD (greater than 5+ stories) or suburban (less than 5 stories).
notation: 1415101510
valid from: 2014-08-08
valid till: 2020-10-03

Suburban Office Own & Develop
type: BicsLevel5Segment
type: Classifier
type: NamedIndividual
is level5 segment of: Office Owners & Developers
is replaced by: http://data.ga-group.nl/ics/bics/1510101511
created with: infer-bics.sql
derived from: Suburban Office Own & Develop
  type: BicsLevel5Segment
  type: Classifier
  type: ContemporaryDerivation
  derived from: http://data.ga-group.nl/ics/bics/2014/1415101511
  source accessed on: 2019-12-03T20:05:01Z
  source last accessed on: 2019-12-03T20:05:01Z
  definition: This segment includes non-REIT owners and developers of office buildings in the suburbs. Outside of the U.S., if the office is not identified as being in a CBD, the number of stories in the building will be used to determine whether it is CBD (greater than 5+ stories) or suburban (less than 5 stories).
  notation: 1415101511
  valid from: 2014-08-08
  valid till: 2020-10-03
source accessed on: 2019-12-03T20:05:01Z
source last accessed on: 2019-12-03T20:05:01Z
definition: This segment includes non-REIT owners and developers of office buildings in the suburbs. Outside of the U.S., if the office is not identified as being in a CBD, the number of stories in the building will be used to determine whether it is CBD (greater than 5+ stories) or suburban (less than 5 stories).
notation: 1415101511
valid from: 2014-08-08
valid till: 2020-10-03

Office Owners & Developers
type: BicsLevel4SubIndustry
type: Classifier
type: NamedIndividual
created with: infer-bics.sql
derived from: Office Owners & Developers
  type: BicsLevel4SubIndustry
  type: Classifier
  type: ContemporaryDerivation
  derived from: http://data.ga-group.nl/ics/bics/2014/14151015
  source accessed on: 2019-12-03T20:05:01Z
  source last accessed on: 2019-12-03T20:05:01Z
  definition: This industry subgroup includes non-REIT owners and developers of office buildings.
  notation: 14151015
  valid from: 2014-08-08
  valid till: 2020-10-03
source accessed on: 2019-12-03T20:05:01Z
source last accessed on: 2019-12-03T20:05:01Z
definition: This industry subgroup includes non-REIT owners and developers of office buildings.
notation: 14151015
valid from: 2014-08-08
valid till: 2020-10-03

Parking Owners & Developers
type: BicsLevel4SubIndustry
type: Classifier
type: NamedIndividual
created with: infer-bics.sql
derived from: Parking Owners & Developers
  type: BicsLevel4SubIndustry
  type: Classifier
  type: ContemporaryDerivation
  derived from: http://data.ga-group.nl/ics/bics/2014/14151016
  source accessed on: 2019-12-03T20:05:01Z
  source last accessed on: 2019-12-03T20:05:01Z
  definition: This industry subgroup includes non-REIT owners and developers of parking lots/garages.
  notation: 14151016
  valid from: 2014-08-08
  valid till: 2020-10-03
source accessed on: 2019-12-03T20:05:01Z
source last accessed on: 2019-12-03T20:05:01Z
definition: This industry subgroup includes non-REIT owners and developers of parking lots/garages.
notation: 14151016
valid from: 2014-08-08
valid till: 2020-10-03

Regional Malls Own & Develop
type: BicsLevel5Segment
type: Classifier
type: NamedIndividual
is level5 segment of: Retail Owners & Developers
is replaced by: http://data.ga-group.nl/ics/bics/1510101610
created with: infer-bics.sql
derived from: Regional Malls Own & Develop
  type: BicsLevel5Segment
  type: Classifier
  type: ContemporaryDerivation
  derived from: http://data.ga-group.nl/ics/bics/2014/1415101710
  source accessed on: 2019-12-03T20:05:01Z
  source last accessed on: 2019-12-03T20:05:01Z
  definition: This segment includes non-REIT owners and developers of mall space.
  notation: 1415101710
  valid from: 2014-08-08
  valid till: 2020-10-03
source accessed on: 2019-12-03T20:05:01Z
source last accessed on: 2019-12-03T20:05:01Z
definition: This segment includes non-REIT owners and developers of mall space.
notation: 1415101710
valid from: 2014-08-08
valid till: 2020-10-03

Shopping Center Own & Develop
type: BicsLevel5Segment
type: Classifier
type: NamedIndividual
is level5 segment of: Retail Owners & Developers
is replaced by: http://data.ga-group.nl/ics/bics/1510101611
created with: infer-bics.sql
derived from: Shopping Center Own & Develop
  type: BicsLevel5Segment
  type: Classifier
  type: ContemporaryDerivation
  derived from: http://data.ga-group.nl/ics/bics/2014/1415101711
  source accessed on: 2019-12-03T20:05:01Z
  source last accessed on: 2019-12-03T20:05:01Z
  definition: This segment includes non-REIT owners and developers of shopping centers, community or lifestyle centers. Such centers are also known as strip centers or power centers.
  notation: 1415101711
  valid from: 2014-08-08
  valid till: 2020-10-03
source accessed on: 2019-12-03T20:05:01Z
source last accessed on: 2019-12-03T20:05:01Z
definition: This segment includes non-REIT owners and developers of shopping centers, community or lifestyle centers. Such centers are also known as strip centers or power centers.
notation: 1415101711
valid from: 2014-08-08
valid till: 2020-10-03

Single Tenant Own & Develop
type: BicsLevel5Segment
type: Classifier
type: NamedIndividual
is level5 segment of: Retail Owners & Developers
is replaced by: http://data.ga-group.nl/ics/bics/1510101612
created with: infer-bics.sql
derived from: Single Tenant Own & Develop
  type: BicsLevel5Segment
  type: Classifier
  type: ContemporaryDerivation
  derived from: http://data.ga-group.nl/ics/bics/2014/1415101712
  source accessed on: 2019-12-03T20:05:01Z
  source last accessed on: 2019-12-03T20:05:01Z
  definition: This segment includes non-REIT owners and developers of outparcel buildings, such as gas station sites or stand-alone restaurant buildings.
  notation: 1415101712
  valid from: 2014-08-08
  valid till: 2020-10-03
source accessed on: 2019-12-03T20:05:01Z
source last accessed on: 2019-12-03T20:05:01Z
definition: This segment includes non-REIT owners and developers of outparcel buildings, such as gas station sites or stand-alone restaurant buildings.
notation: 1415101712
valid from: 2014-08-08
valid till: 2020-10-03

Retail Owners & Developers
type: BicsLevel4SubIndustry
type: Classifier
type: NamedIndividual
created with: infer-bics.sql
derived from: Retail Owners & Developers
  type: BicsLevel4SubIndustry
  type: Classifier
  type: ContemporaryDerivation
  derived from: http://data.ga-group.nl/ics/bics/2014/14151017
  source accessed on: 2019-12-03T20:05:01Z
  source last accessed on: 2019-12-03T20:05:01Z
  definition: This industry subgroup includes non-REIT owners and developers of retail real estate, such as outlet space, strip centers, malls and single-tenant entities.
  notation: 14151017
  valid from: 2014-08-08
  valid till: 2020-10-03
source accessed on: 2019-12-03T20:05:01Z
source last accessed on: 2019-12-03T20:05:01Z
definition: This industry subgroup includes non-REIT owners and developers of retail real estate, such as outlet space, strip centers, malls and single-tenant entities.
notation: 14151017
valid from: 2014-08-08
valid till: 2020-10-03

Self-Storage Owners & Develop
type: BicsLevel4SubIndustry
type: Classifier
type: NamedIndividual
created with: infer-bics.sql
derived from: Self-Storage Owners & Develop
  type: BicsLevel4SubIndustry
  type: Classifier
  type: ContemporaryDerivation
  derived from: http://data.ga-group.nl/ics/bics/2014/14151018
  source accessed on: 2019-12-03T20:05:01Z
  source last accessed on: 2019-12-03T20:05:01Z
  definition: This industry subgroup includes non-REIT owners and developers of self-storage units/properties.
  notation: 14151018
  valid from: 2014-08-08
  valid till: 2020-10-03
source accessed on: 2019-12-03T20:05:01Z
source last accessed on: 2019-12-03T20:05:01Z
definition: This industry subgroup includes non-REIT owners and developers of self-storage units/properties.
notation: 14151018
valid from: 2014-08-08
valid till: 2020-10-03

Life Science Owners & Develop
type: BicsLevel5Segment
type: Classifier
type: NamedIndividual
is level5 segment of: Specialty & Other Own & Develop
created with: infer-bics.sql
derived from: Life Science Owners & Develop
  type: BicsLevel5Segment
  type: Classifier
  type: ContemporaryDerivation
  derived from: http://data.ga-group.nl/ics/bics/2014/1415101910
  source accessed on: 2019-12-03T20:05:01Z
  source last accessed on: 2019-12-03T20:05:01Z
  definition: This segment includes non-REIT non-REIT owners and developers of office and laboratory properties that are leased to life science‒related tenants, such as pharmaceutical companies, research institutions and government agencies.
  notation: 1415101910
  valid from: 2014-08-08
  valid till: 2020-10-03
source accessed on: 2019-12-03T20:05:01Z
source last accessed on: 2019-12-03T20:05:01Z
definition: This segment includes non-REIT non-REIT owners and developers of office and laboratory properties that are leased to life science‒related tenants, such as pharmaceutical companies, research institutions and government agencies.
notation: 1415101910
valid from: 2014-08-08
valid till: 2020-10-03

Specialty & Other Own & Develop
type: BicsLevel4SubIndustry
type: Classifier
type: NamedIndividual
created with: infer-bics.sql
derived from: Specialty & Other Own & Develop
  type: BicsLevel4SubIndustry
  type: Classifier
  type: ContemporaryDerivation
  derived from: http://data.ga-group.nl/ics/bics/2014/14151019
  source accessed on: 2019-12-03T20:05:01Z
  source last accessed on: 2019-12-03T20:05:01Z
  definition: This industry subgroup includes non-REIT owners and developers of specialty and other properties not elsewhere classified. Such property includes master planned communities, data centers, and life science/research and development facilities.
  notation: 14151019
  valid from: 2014-08-08
  valid till: 2020-10-03
source accessed on: 2019-12-03T20:05:01Z
source last accessed on: 2019-12-03T20:05:01Z
definition: This industry subgroup includes non-REIT owners and developers of specialty and other properties not elsewhere classified. Such property includes master planned communities, data centers, and life science/research and development facilities.
notation: 14151019
valid from: 2014-08-08
valid till: 2020-10-03

Real Estate Owners & Developers
type: BicsLevel3Industry
type: Classifier
type: NamedIndividual
is industry of: Real Estate
is replaced by: http://data.ga-group.nl/ics/bics/151010
created with: infer-bics.sql
derived from: Real Estate Owners & Developers
  type: BicsLevel3Industry
  type: Classifier
  type: ContemporaryDerivation
  derived from: http://data.ga-group.nl/ics/bics/2014/141510
  source accessed on: 2019-12-03T20:05:01Z
  source last accessed on: 2019-12-03T20:05:01Z
  definition: This industry group includes companies that are involved with real estate, such as companies that own and develop real estate . Sectors include office, retail, housing, healthcare, hotel, industrial, self-storage and specialty. Such companies are not structured as real estate investment trusts (REITs).
  notation: 141510
  valid from: 2014-08-08
  valid till: 2020-10-03
source accessed on: 2019-12-03T20:05:01Z
source last accessed on: 2019-12-03T20:05:01Z
definition: This industry group includes companies that are involved with real estate, such as companies that own and develop real estate . Sectors include office, retail, housing, healthcare, hotel, industrial, self-storage and specialty. Such companies are not structured as real estate investment trusts (REITs).
notation: 141510
valid from: 2014-08-08
valid till: 2020-10-03

Hospital REIT
type: BicsLevel5Segment
type: Classifier
type: NamedIndividual
is level5 segment of: Health Care REIT
is replaced by: http://data.ga-group.nl/ics/bics/1510111110
created with: infer-bics.sql
derived from: Hospital REIT
  type: BicsLevel5Segment
  type: Classifier
  type: ContemporaryDerivation
  derived from: http://data.ga-group.nl/ics/bics/2014/1415111010
  source accessed on: 2019-12-03T20:05:01Z
  source last accessed on: 2019-12-03T20:05:01Z
  definition: This segment includes real estate investment trusts (REITs) that own and develop hospitals.
  notation: 1415111010
  valid from: 2014-08-08
  valid till: 2020-10-03
source accessed on: 2019-12-03T20:05:01Z
source last accessed on: 2019-12-03T20:05:01Z
definition: This segment includes real estate investment trusts (REITs) that own and develop hospitals.
notation: 1415111010
valid from: 2014-08-08
valid till: 2020-10-03

Medical Office REIT
type: BicsLevel5Segment
type: Classifier
type: NamedIndividual
is level5 segment of: Health Care REIT
is replaced by: http://data.ga-group.nl/ics/bics/1510111111
created with: infer-bics.sql
derived from: Medical Office REIT
  type: BicsLevel5Segment
  type: Classifier
  type: ContemporaryDerivation
  derived from: http://data.ga-group.nl/ics/bics/2014/1415111011
  source accessed on: 2019-12-03T20:05:01Z
  source last accessed on: 2019-12-03T20:05:01Z
  definition: This segment includes real estate investment trusts (REITs) that own and develop medical office buildings. These medical offices primarily house health care tenants, such as general and specialty physician practices, as well as health care testing service providers.
  notation: 1415111011
  valid from: 2014-08-08
  valid till: 2020-10-03
source accessed on: 2019-12-03T20:05:01Z
source last accessed on: 2019-12-03T20:05:01Z
definition: This segment includes real estate investment trusts (REITs) that own and develop medical office buildings. These medical offices primarily house health care tenants, such as general and specialty physician practices, as well as health care testing service providers.
notation: 1415111011
valid from: 2014-08-08
valid till: 2020-10-03

Senior Housing REIT
type: BicsLevel5Segment
type: Classifier
type: NamedIndividual
is level5 segment of: Health Care REIT
is replaced by: http://data.ga-group.nl/ics/bics/1510111112
created with: infer-bics.sql
derived from: Senior Housing REIT
  type: BicsLevel5Segment
  type: Classifier
  type: ContemporaryDerivation
  derived from: http://data.ga-group.nl/ics/bics/2014/1415111012
  source accessed on: 2019-12-03T20:05:01Z
  source last accessed on: 2019-12-03T20:05:01Z
  definition: This segment includes real estate investment trusts (REITs) that own and develop senior housing, such as retirement living communities and assisted living facilities.
  notation: 1415111012
  valid from: 2014-08-08
  valid till: 2020-10-03
source accessed on: 2019-12-03T20:05:01Z
source last accessed on: 2019-12-03T20:05:01Z
definition: This segment includes real estate investment trusts (REITs) that own and develop senior housing, such as retirement living communities and assisted living facilities.
notation: 1415111012
valid from: 2014-08-08
valid till: 2020-10-03

Skilled Nursing REIT
type: BicsLevel5Segment
type: Classifier
type: NamedIndividual
is level5 segment of: Health Care REIT
is replaced by: http://data.ga-group.nl/ics/bics/1510111113
created with: infer-bics.sql
derived from: Skilled Nursing REIT
  type: BicsLevel5Segment
  type: Classifier
  type: ContemporaryDerivation
  derived from: http://data.ga-group.nl/ics/bics/2014/1415111013
  source accessed on: 2019-12-03T20:05:01Z
  source last accessed on: 2019-12-03T20:05:01Z
  definition: This segment includes real estate investment trusts (REITs) that own and develop nursing homes.
  notation: 1415111013
  valid from: 2014-08-08
  valid till: 2020-10-03
source accessed on: 2019-12-03T20:05:01Z
source last accessed on: 2019-12-03T20:05:01Z
definition: This segment includes real estate investment trusts (REITs) that own and develop nursing homes.
notation: 1415111013
valid from: 2014-08-08
valid till: 2020-10-03

Health Care REIT
type: BicsLevel4SubIndustry
type: Classifier
type: NamedIndividual
created with: infer-bics.sql
derived from: Health Care REIT
  type: BicsLevel4SubIndustry
  type: Classifier
  type: ContemporaryDerivation
  derived from: http://data.ga-group.nl/ics/bics/2014/14151110
  source accessed on: 2019-12-03T20:05:01Z
  source last accessed on: 2019-12-03T20:05:01Z
  definition: This industry subgroup includes real estate investment trusts (REITs) that own and develop health care properties.
  notation: 14151110
  valid from: 2014-08-08
  valid till: 2020-10-03
source accessed on: 2019-12-03T20:05:01Z
source last accessed on: 2019-12-03T20:05:01Z
definition: This industry subgroup includes real estate investment trusts (REITs) that own and develop health care properties.
notation: 14151110
valid from: 2014-08-08
valid till: 2020-10-03

Hotel REIT
type: BicsLevel4SubIndustry
type: Classifier
type: NamedIndividual
created with: infer-bics.sql
derived from: Hotel REIT
  type: BicsLevel4SubIndustry
  type: Classifier
  type: ContemporaryDerivation
  derived from: http://data.ga-group.nl/ics/bics/2014/14151111
  source accessed on: 2019-12-03T20:05:01Z
  source last accessed on: 2019-12-03T20:05:01Z
  definition: This industry subgroup includes real estate investment trusts (REITs) that own and develop hotel/resort properties.
  notation: 14151111
  valid from: 2014-08-08
  valid till: 2020-10-03
source accessed on: 2019-12-03T20:05:01Z
source last accessed on: 2019-12-03T20:05:01Z
definition: This industry subgroup includes real estate investment trusts (REITs) that own and develop hotel/resort properties.
notation: 14151111
valid from: 2014-08-08
valid till: 2020-10-03

Apartment REIT
type: BicsLevel5Segment
type: Classifier
type: NamedIndividual
is level5 segment of: Housing REIT
is replaced by: http://data.ga-group.nl/ics/bics/1510111310
created with: infer-bics.sql
derived from: Apartment REIT
  type: BicsLevel5Segment
  type: Classifier
  type: ContemporaryDerivation
  derived from: http://data.ga-group.nl/ics/bics/2014/1415111210
  source accessed on: 2019-12-03T20:05:01Z
  source last accessed on: 2019-12-03T20:05:01Z
  definition: This segment includes real estate investment trusts (REITs) that own and develop apartments. Such apartments include affordable and non-affordable units, which typically are buildings with 5+ units.
  notation: 1415111210
  valid from: 2014-08-08
  valid till: 2020-10-03
source accessed on: 2019-12-03T20:05:01Z
source last accessed on: 2019-12-03T20:05:01Z
definition: This segment includes real estate investment trusts (REITs) that own and develop apartments. Such apartments include affordable and non-affordable units, which typically are buildings with 5+ units.
notation: 1415111210
valid from: 2014-08-08
valid till: 2020-10-03

Single Family Housing REIT
type: BicsLevel5Segment
type: Classifier
type: NamedIndividual
is level5 segment of: Housing REIT
is replaced by: http://data.ga-group.nl/ics/bics/1510111311
created with: infer-bics.sql
derived from: Single Family Housing REIT
  type: BicsLevel5Segment
  type: Classifier
  type: ContemporaryDerivation
  derived from: http://data.ga-group.nl/ics/bics/2014/1415111211
  source accessed on: 2019-12-03T20:05:01Z
  source last accessed on: 2019-12-03T20:05:01Z
  definition: This segment includes real estate investment trusts (REITs) that own and develop single family homes.
  notation: 1415111211
  valid from: 2014-08-08
  valid till: 2020-10-03
source accessed on: 2019-12-03T20:05:01Z
source last accessed on: 2019-12-03T20:05:01Z
definition: This segment includes real estate investment trusts (REITs) that own and develop single family homes.
notation: 1415111211
valid from: 2014-08-08
valid till: 2020-10-03

Manufactured Housing REIT
type: BicsLevel5Segment
type: Classifier
type: NamedIndividual
is level5 segment of: Housing REIT
is replaced by: http://data.ga-group.nl/ics/bics/1510111312
created with: infer-bics.sql
derived from: Manufactured Housing REIT
  type: BicsLevel5Segment
  type: Classifier
  type: ContemporaryDerivation
  derived from: http://data.ga-group.nl/ics/bics/2014/1415111212
  source accessed on: 2019-12-03T20:05:01Z
  source last accessed on: 2019-12-03T20:05:01Z
  definition: This segment includes real estate investment trusts (REITs) that own and develop pad sites and mobile/manufactured homes. This also includes REITs that operate resort communities. Such communities are areas where you bring RVs and pay a fee to rent the ground space/pad site.
  notation: 1415111212
  valid from: 2014-08-08
  valid till: 2020-10-03
source accessed on: 2019-12-03T20:05:01Z
source last accessed on: 2019-12-03T20:05:01Z
definition: This segment includes real estate investment trusts (REITs) that own and develop pad sites and mobile/manufactured homes. This also includes REITs that operate resort communities. Such communities are areas where you bring RVs and pay a fee to rent the ground space/pad site.
notation: 1415111212
valid from: 2014-08-08
valid till: 2020-10-03

Military Housing REIT
type: BicsLevel5Segment
type: Classifier
type: NamedIndividual
is level5 segment of: Housing REIT
created with: infer-bics.sql
derived from: Military Housing REIT
  type: BicsLevel5Segment
  type: Classifier
  type: ContemporaryDerivation
  derived from: http://data.ga-group.nl/ics/bics/2014/1415111213
  source accessed on: 2019-12-03T20:05:01Z
  source last accessed on: 2019-12-03T20:05:01Z
  definition: This segment includes real estate investment trusts (REITs) that own and develop housing expressly to military personnel.
  notation: 1415111213
  valid from: 2014-08-08
  valid till: 2020-10-03
source accessed on: 2019-12-03T20:05:01Z
source last accessed on: 2019-12-03T20:05:01Z
definition: This segment includes real estate investment trusts (REITs) that own and develop housing expressly to military personnel.
notation: 1415111213
valid from: 2014-08-08
valid till: 2020-10-03

Student Housing REIT
type: BicsLevel5Segment
type: Classifier
type: NamedIndividual
is level5 segment of: Housing REIT
is replaced by: http://data.ga-group.nl/ics/bics/1510111313
created with: infer-bics.sql
derived from: Student Housing REIT
  type: BicsLevel5Segment
  type: Classifier
  type: ContemporaryDerivation
  derived from: http://data.ga-group.nl/ics/bics/2014/1415111214
  source accessed on: 2019-12-03T20:05:01Z
  source last accessed on: 2019-12-03T20:05:01Z
  definition: This segment includes real estate investment trusts (REITs) that own and develop student housing. Such housing is any for-rent housing that is available only to students.
  notation: 1415111214
  valid from: 2014-08-08
  valid till: 2020-10-03
source accessed on: 2019-12-03T20:05:01Z
source last accessed on: 2019-12-03T20:05:01Z
definition: This segment includes real estate investment trusts (REITs) that own and develop student housing. Such housing is any for-rent housing that is available only to students.
notation: 1415111214
valid from: 2014-08-08
valid till: 2020-10-03

Housing REIT
type: BicsLevel4SubIndustry
type: Classifier
type: NamedIndividual
created with: infer-bics.sql
derived from: Housing REIT
  type: BicsLevel4SubIndustry
  type: Classifier
  type: ContemporaryDerivation
  derived from: http://data.ga-group.nl/ics/bics/2014/14151112
  source accessed on: 2019-12-03T20:05:01Z
  source last accessed on: 2019-12-03T20:05:01Z
  definition: This industry subgroup includes real estate investment trusts (REITs) that own and develop housing facilities.
  notation: 14151112
  valid from: 2014-08-08
  valid till: 2020-10-03
source accessed on: 2019-12-03T20:05:01Z
source last accessed on: 2019-12-03T20:05:01Z
definition: This industry subgroup includes real estate investment trusts (REITs) that own and develop housing facilities.
notation: 14151112
valid from: 2014-08-08
valid till: 2020-10-03

Bulk Warehouse REIT
type: BicsLevel5Segment
type: Classifier
type: NamedIndividual
is level5 segment of: Industrial REIT
is replaced by: http://data.ga-group.nl/ics/bics/1510111410
created with: infer-bics.sql
derived from: Bulk Warehouse REIT
  type: BicsLevel5Segment
  type: Classifier
  type: ContemporaryDerivation
  derived from: http://data.ga-group.nl/ics/bics/2014/1415111310
  source accessed on: 2019-12-03T20:05:01Z
  source last accessed on: 2019-12-03T20:05:01Z
  definition: This segment includes real estate investment trusts (REITs) that own and develop high-ceiling industrial properties used for distribution, warehousing and manufacturing.
  notation: 1415111310
  valid from: 2014-08-08
  valid till: 2020-10-03
source accessed on: 2019-12-03T20:05:01Z
source last accessed on: 2019-12-03T20:05:01Z
definition: This segment includes real estate investment trusts (REITs) that own and develop high-ceiling industrial properties used for distribution, warehousing and manufacturing.
notation: 1415111310
valid from: 2014-08-08
valid till: 2020-10-03

Flex Industrial REIT
type: BicsLevel5Segment
type: Classifier
type: NamedIndividual
is level5 segment of: Industrial REIT
is replaced by: http://data.ga-group.nl/ics/bics/1510111411
created with: infer-bics.sql
derived from: Flex Industrial REIT
  type: BicsLevel5Segment
  type: Classifier
  type: ContemporaryDerivation
  derived from: http://data.ga-group.nl/ics/bics/2014/1415111311
  source accessed on: 2019-12-03T20:05:01Z
  source last accessed on: 2019-12-03T20:05:01Z
  definition: This segment includes real estate investment trusts (REITS) that own and develop flex space. Such space is versatile one- or two-floor structures with ceiling heights up to 16 feet and with some loading door/dock options. Such space can easily be fitted out for office, light manufacturing, R&D and storage all under the same roof and in the same unit.
  notation: 1415111311
  valid from: 2014-08-08
  valid till: 2020-10-03
source accessed on: 2019-12-03T20:05:01Z
source last accessed on: 2019-12-03T20:05:01Z
definition: This segment includes real estate investment trusts (REITS) that own and develop flex space. Such space is versatile one- or two-floor structures with ceiling heights up to 16 feet and with some loading door/dock options. Such space can easily be fitted out for office, light manufacturing, R&D and storage all under the same roof and in the same unit.
notation: 1415111311
valid from: 2014-08-08
valid till: 2020-10-03

Temp Control Logistics REIT
type: BicsLevel5Segment
type: Classifier
type: NamedIndividual
is level5 segment of: Industrial REIT
is replaced by: http://data.ga-group.nl/ics/bics/1510111412
created with: infer-bics.sql
derived from: Temp Control Logistics REIT
  type: BicsLevel5Segment
  type: Classifier
  type: ContemporaryDerivation
  derived from: http://data.ga-group.nl/ics/bics/2014/1415111312
  source accessed on: 2019-12-03T20:05:01Z
  source last accessed on: 2019-12-03T20:05:01Z
  definition: This segment includes real estate investment trusts (REITs) that own and develop industrial properties, such as warehouse, distribution, temperature-controlled logistics, and flex space. Such facilities are equipped to accommodate temperature adjustment, refrigeration and/or freezing.
  notation: 1415111312
  valid from: 2014-08-08
  valid till: 2020-10-03
source accessed on: 2019-12-03T20:05:01Z
source last accessed on: 2019-12-03T20:05:01Z
definition: This segment includes real estate investment trusts (REITs) that own and develop industrial properties, such as warehouse, distribution, temperature-controlled logistics, and flex space. Such facilities are equipped to accommodate temperature adjustment, refrigeration and/or freezing.
notation: 1415111312
valid from: 2014-08-08
valid till: 2020-10-03

Industrial REIT
type: BicsLevel4SubIndustry
type: Classifier
type: NamedIndividual
created with: infer-bics.sql
derived from: Industrial REIT
  type: BicsLevel4SubIndustry
  type: Classifier
  type: ContemporaryDerivation
  derived from: http://data.ga-group.nl/ics/bics/2014/14151113
  source accessed on: 2019-12-03T20:05:01Z
  source last accessed on: 2019-12-03T20:05:01Z
  definition: This industry subgroup includes real estate investment trusts (REITs) that own and develop temperature-controlled storage space. Typically, these companies will disclose whether the space is temperature-controlled.
  notation: 14151113
  valid from: 2014-08-08
  valid till: 2020-10-03
source accessed on: 2019-12-03T20:05:01Z
source last accessed on: 2019-12-03T20:05:01Z
definition: This industry subgroup includes real estate investment trusts (REITs) that own and develop temperature-controlled storage space. Typically, these companies will disclose whether the space is temperature-controlled.
notation: 14151113
valid from: 2014-08-08
valid till: 2020-10-03

Multi Asset Class REIT
type: BicsLevel4SubIndustry
type: Classifier
type: NamedIndividual
created with: infer-bics.sql
derived from: Multi Asset Class REIT
  type: BicsLevel4SubIndustry
  type: Classifier
  type: ContemporaryDerivation
  derived from: http://data.ga-group.nl/ics/bics/2014/14151114
  source accessed on: 2019-12-03T20:05:01Z
  source last accessed on: 2019-12-03T20:05:01Z
  definition: This industry subgroup includes real estate investment trusts (REITs) that own and develop multiple types of property. Typically, these companies would construct multiple property types within the scope of a single development project.
  notation: 14151114
  valid from: 2014-08-08
  valid till: 2020-10-03
source accessed on: 2019-12-03T20:05:01Z
source last accessed on: 2019-12-03T20:05:01Z
definition: This industry subgroup includes real estate investment trusts (REITs) that own and develop multiple types of property. Typically, these companies would construct multiple property types within the scope of a single development project.
notation: 14151114
valid from: 2014-08-08
valid till: 2020-10-03

CBD Office REIT
type: BicsLevel5Segment
type: Classifier
type: NamedIndividual
is level5 segment of: Office REIT
is replaced by: http://data.ga-group.nl/ics/bics/1510111510
created with: infer-bics.sql
derived from: CBD Office REIT
  type: BicsLevel5Segment
  type: Classifier
  type: ContemporaryDerivation
  derived from: http://data.ga-group.nl/ics/bics/2014/1415111510
  source accessed on: 2019-12-03T20:05:01Z
  source last accessed on: 2019-12-03T20:05:01Z
  definition: This segment includes real estate investment trusts (REITs) that own and develop office buildings in central business districts (CBDs). Outside of the U.S., if the office is not identified as being in a CBD, the number of stories in the building will be used to determine whether it is CBD (greater than 5+ stories) or suburban (less than 5 stories).
  notation: 1415111510
  valid from: 2014-08-08
  valid till: 2020-10-03
source accessed on: 2019-12-03T20:05:01Z
source last accessed on: 2019-12-03T20:05:01Z
definition: This segment includes real estate investment trusts (REITs) that own and develop office buildings in central business districts (CBDs). Outside of the U.S., if the office is not identified as being in a CBD, the number of stories in the building will be used to determine whether it is CBD (greater than 5+ stories) or suburban (less than 5 stories).
notation: 1415111510
valid from: 2014-08-08
valid till: 2020-10-03

Suburban Office REIT
type: BicsLevel5Segment
type: Classifier
type: NamedIndividual
is level5 segment of: Office REIT
is replaced by: http://data.ga-group.nl/ics/bics/1510111511
created with: infer-bics.sql
derived from: Suburban Office REIT
  type: BicsLevel5Segment
  type: Classifier
  type: ContemporaryDerivation
  derived from: http://data.ga-group.nl/ics/bics/2014/1415111511
  source accessed on: 2019-12-03T20:05:01Z
  source last accessed on: 2019-12-03T20:05:01Z
  definition: This segment includes real estate investment trusts (REITs) that own and develop office buildings in the suburbs. Outside of the U.S., if the office is not identified as being in the suburbs, the number of stories in the building will be used to determine whether it is CBD (greater than 5+ stories) or suburban (less than 5 stories).
  notation: 1415111511
  valid from: 2014-08-08
  valid till: 2020-10-03
source accessed on: 2019-12-03T20:05:01Z
source last accessed on: 2019-12-03T20:05:01Z
definition: This segment includes real estate investment trusts (REITs) that own and develop office buildings in the suburbs. Outside of the U.S., if the office is not identified as being in the suburbs, the number of stories in the building will be used to determine whether it is CBD (greater than 5+ stories) or suburban (less than 5 stories).
notation: 1415111511
valid from: 2014-08-08
valid till: 2020-10-03

Office REIT
type: BicsLevel4SubIndustry
type: Classifier
type: NamedIndividual
created with: infer-bics.sql
derived from: Office REIT
  type: BicsLevel4SubIndustry
  type: Classifier
  type: ContemporaryDerivation
  derived from: http://data.ga-group.nl/ics/bics/2014/14151115
  source accessed on: 2019-12-03T20:05:01Z
  source last accessed on: 2019-12-03T20:05:01Z
  definition: This industry subgroup includes real estate investment trusts (REITs) that own and develop office buildings in either central business districts or the suburbs.
  notation: 14151115
  valid from: 2014-08-08
  valid till: 2020-10-03
source accessed on: 2019-12-03T20:05:01Z
source last accessed on: 2019-12-03T20:05:01Z
definition: This industry subgroup includes real estate investment trusts (REITs) that own and develop office buildings in either central business districts or the suburbs.
notation: 14151115
valid from: 2014-08-08
valid till: 2020-10-03

Parking REIT
type: BicsLevel4SubIndustry
type: Classifier
type: NamedIndividual
created with: infer-bics.sql
derived from: Parking REIT
  type: BicsLevel4SubIndustry
  type: Classifier
  type: ContemporaryDerivation
  derived from: http://data.ga-group.nl/ics/bics/2014/14151116
  source accessed on: 2019-12-03T20:05:01Z
  source last accessed on: 2019-12-03T20:05:01Z
  definition: This industry subgroup includes real estate investment trusts (REITs) that own and develop parking lots/garages.
  notation: 14151116
  valid from: 2014-08-08
  valid till: 2020-10-03
source accessed on: 2019-12-03T20:05:01Z
source last accessed on: 2019-12-03T20:05:01Z
definition: This industry subgroup includes real estate investment trusts (REITs) that own and develop parking lots/garages.
notation: 14151116
valid from: 2014-08-08
valid till: 2020-10-03

Regional Mall REIT
type: BicsLevel5Segment
type: Classifier
type: NamedIndividual
is level5 segment of: Retail REIT
is replaced by: http://data.ga-group.nl/ics/bics/1510111610
created with: infer-bics.sql
derived from: Regional Mall REIT
  type: BicsLevel5Segment
  type: Classifier
  type: ContemporaryDerivation
  derived from: http://data.ga-group.nl/ics/bics/2014/1415111710
  source accessed on: 2019-12-03T20:05:01Z
  source last accessed on: 2019-12-03T20:05:01Z
  definition: This segment includes real estate investment trusts (REITs) that own and develop mall space.
  notation: 1415111710
  valid from: 2014-08-08
  valid till: 2020-10-03
source accessed on: 2019-12-03T20:05:01Z
source last accessed on: 2019-12-03T20:05:01Z
definition: This segment includes real estate investment trusts (REITs) that own and develop mall space.
notation: 1415111710
valid from: 2014-08-08
valid till: 2020-10-03

Shopping Center REIT
type: BicsLevel5Segment
type: Classifier
type: NamedIndividual
is level5 segment of: Retail REIT
is replaced by: http://data.ga-group.nl/ics/bics/1510111611
created with: infer-bics.sql
derived from: Shopping Center REIT
  type: BicsLevel5Segment
  type: Classifier
  type: ContemporaryDerivation
  derived from: http://data.ga-group.nl/ics/bics/2014/1415111711
  source accessed on: 2019-12-03T20:05:01Z
  source last accessed on: 2019-12-03T20:05:01Z
  definition: This segment includes real estate investment trusts (REITs) that own and develop shopping centers, community or lifestyle centers. Such centers are also known as strip centers or power centers.
  notation: 1415111711
  valid from: 2014-08-08
  valid till: 2020-10-03
source accessed on: 2019-12-03T20:05:01Z
source last accessed on: 2019-12-03T20:05:01Z
definition: This segment includes real estate investment trusts (REITs) that own and develop shopping centers, community or lifestyle centers. Such centers are also known as strip centers or power centers.
notation: 1415111711
valid from: 2014-08-08
valid till: 2020-10-03

Single Tenant REIT
type: BicsLevel5Segment
type: Classifier
type: NamedIndividual
is level5 segment of: Retail REIT
is replaced by: http://data.ga-group.nl/ics/bics/1510111612
created with: infer-bics.sql
derived from: Single Tenant REIT
  type: BicsLevel5Segment
  type: Classifier
  type: ContemporaryDerivation
  derived from: http://data.ga-group.nl/ics/bics/2014/1415111712
  source accessed on: 2019-12-03T20:05:01Z
  source last accessed on: 2019-12-03T20:05:01Z
  definition: This segment includes real estate investment trusts (REITs) that own and develop outparcel buildings, such as gas station sites or stand-alone restaurant buildings.
  notation: 1415111712
  valid from: 2014-08-08
  valid till: 2020-10-03
source accessed on: 2019-12-03T20:05:01Z
source last accessed on: 2019-12-03T20:05:01Z
definition: This segment includes real estate investment trusts (REITs) that own and develop outparcel buildings, such as gas station sites or stand-alone restaurant buildings.
notation: 1415111712
valid from: 2014-08-08
valid till: 2020-10-03

Retail REIT
type: BicsLevel4SubIndustry
type: Classifier
type: NamedIndividual
created with: infer-bics.sql
derived from: Retail REIT
  type: BicsLevel4SubIndustry
  type: Classifier
  type: ContemporaryDerivation
  derived from: http://data.ga-group.nl/ics/bics/2014/14151117
  source accessed on: 2019-12-03T20:05:01Z
  source last accessed on: 2019-12-03T20:05:01Z
  definition: This industry subgroup includes real estate investment trusts (REITS) that own and develop retail real estate, such as outlet space, strip centers, malls and single-tenant entities).
  notation: 14151117
  valid from: 2014-08-08
  valid till: 2020-10-03
source accessed on: 2019-12-03T20:05:01Z
source last accessed on: 2019-12-03T20:05:01Z
definition: This industry subgroup includes real estate investment trusts (REITS) that own and develop retail real estate, such as outlet space, strip centers, malls and single-tenant entities).
notation: 14151117
valid from: 2014-08-08
valid till: 2020-10-03

Self-storage REIT
type: BicsLevel4SubIndustry
type: Classifier
type: NamedIndividual
created with: infer-bics.sql
derived from: Self-storage REIT
  type: BicsLevel4SubIndustry
  type: Classifier
  type: ContemporaryDerivation
  derived from: http://data.ga-group.nl/ics/bics/2014/14151118
  source accessed on: 2019-12-03T20:05:01Z
  source last accessed on: 2019-12-03T20:05:01Z
  definition: This industry subgroup includes real estate investment trusts (REITs) that own and develop self-storage units/properties.
  notation: 14151118
  valid from: 2014-08-08
  valid till: 2020-10-03
source accessed on: 2019-12-03T20:05:01Z
source last accessed on: 2019-12-03T20:05:01Z
definition: This industry subgroup includes real estate investment trusts (REITs) that own and develop self-storage units/properties.
notation: 14151118
valid from: 2014-08-08
valid till: 2020-10-03

Life Science REIT
type: BicsLevel5Segment
type: Classifier
type: NamedIndividual
is level5 segment of: Specialty & Other REIT
created with: infer-bics.sql
derived from: Life Science REIT
  type: BicsLevel5Segment
  type: Classifier
  type: ContemporaryDerivation
  derived from: http://data.ga-group.nl/ics/bics/2014/1415111910
  source accessed on: 2019-12-03T20:05:01Z
  source last accessed on: 2019-12-03T20:05:01Z
  definition: This segment includes real estate investment trusts (REITs) that own and develop office and laboratory properties that lease to life science‒related tenants, such as pharmaceutical companies, research institutions and government agencies.
  notation: 1415111910
  valid from: 2014-08-08
  valid till: 2020-10-03
source accessed on: 2019-12-03T20:05:01Z
source last accessed on: 2019-12-03T20:05:01Z
definition: This segment includes real estate investment trusts (REITs) that own and develop office and laboratory properties that lease to life science‒related tenants, such as pharmaceutical companies, research institutions and government agencies.
notation: 1415111910
valid from: 2014-08-08
valid till: 2020-10-03

Specialty & Other REIT
type: BicsLevel4SubIndustry
type: Classifier
type: NamedIndividual
created with: infer-bics.sql
derived from: Specialty & Other REIT
  type: BicsLevel4SubIndustry
  type: Classifier
  type: ContemporaryDerivation
  derived from: http://data.ga-group.nl/ics/bics/2014/14151119
  source accessed on: 2019-12-03T20:05:01Z
  source last accessed on: 2019-12-03T20:05:01Z
  definition: This industry subgroup includes real estate investment trusts (REITs) that own and develop specialty and other properties not elsewhere classified. Such property includes master planned communities (MPCs), data centers, and life science/research & development facilities.
  notation: 14151119
  valid from: 2014-08-08
  valid till: 2020-10-03
source accessed on: 2019-12-03T20:05:01Z
source last accessed on: 2019-12-03T20:05:01Z
definition: This industry subgroup includes real estate investment trusts (REITs) that own and develop specialty and other properties not elsewhere classified. Such property includes master planned communities (MPCs), data centers, and life science/research & development facilities.
notation: 14151119
valid from: 2014-08-08
valid till: 2020-10-03

REIT
type: BicsLevel3Industry
type: Classifier
type: NamedIndividual
is industry of: Real Estate
is replaced by: http://data.ga-group.nl/ics/bics/151011
created with: infer-bics.sql
derived from: REIT
  type: BicsLevel3Industry
  type: Classifier
  type: ContemporaryDerivation
  derived from: http://data.ga-group.nl/ics/bics/2014/141511
  source accessed on: 2019-12-03T20:05:01Z
  source last accessed on: 2019-12-03T20:05:01Z
  definition: This industry includes real estate investment trusts (REITs). REITS own and develop income-producing real estate and real estate mortgages. Sectors include office, retail, housing, healthcare, hotel, industrial, self-storage and specialty. To be considered a REIT, a company must have most of its assets and income tied to real estate and must distribute at least 90% of it taxable income as dividends to shareholders.
  notation: 141511
  valid from: 2014-08-08
  valid till: 2020-10-03
source accessed on: 2019-12-03T20:05:01Z
source last accessed on: 2019-12-03T20:05:01Z
definition: This industry includes real estate investment trusts (REITs). REITS own and develop income-producing real estate and real estate mortgages. Sectors include office, retail, housing, healthcare, hotel, industrial, self-storage and specialty. To be considered a REIT, a company must have most of its assets and income tied to real estate and must distribute at least 90% of it taxable income as dividends to shareholders.
notation: 141511
valid from: 2014-08-08
valid till: 2020-10-03

Comml Real Estate Info Svcs
type: BicsLevel4SubIndustry
type: Classifier
type: NamedIndividual
created with: infer-bics.sql
derived from: Comml Real Estate Info Svcs
  type: BicsLevel4SubIndustry
  type: Classifier
  type: ContemporaryDerivation
  derived from: http://data.ga-group.nl/ics/bics/2014/14151210
  source accessed on: 2019-12-03T20:05:01Z
  source last accessed on: 2019-12-03T20:05:01Z
  definition: This industry subgroup includes companies that provide data, market research and information/technology products and services to the real estate community.
  notation: 14151210
  valid from: 2014-08-08
  valid till: 2020-10-03
source accessed on: 2019-12-03T20:05:01Z
source last accessed on: 2019-12-03T20:05:01Z
definition: This industry subgroup includes companies that provide data, market research and information/technology products and services to the real estate community.
notation: 14151210
valid from: 2014-08-08
valid till: 2020-10-03

Commercial Property Mgmt
type: BicsLevel5Segment
type: Classifier
type: NamedIndividual
is level5 segment of: Property Management
is replaced by: http://data.ga-group.nl/ics/bics/151012101010
created with: infer-bics.sql
derived from: Commercial Property Mgmt
  type: BicsLevel5Segment
  type: Classifier
  type: ContemporaryDerivation
  derived from: http://data.ga-group.nl/ics/bics/2014/1415121110
  source accessed on: 2019-12-03T20:05:01Z
  source last accessed on: 2019-12-03T20:05:01Z
  definition: This segment includes companies that provide management services for commercial property. Such property includes all property types other than any type under multi-housing. Excludes senior housing facilities (see Senior Housing Operators).
  notation: 1415121110
  valid from: 2014-08-08
  valid till: 2020-10-03
source accessed on: 2019-12-03T20:05:01Z
source last accessed on: 2019-12-03T20:05:01Z
definition: This segment includes companies that provide management services for commercial property. Such property includes all property types other than any type under multi-housing. Excludes senior housing facilities (see Senior Housing Operators).
notation: 1415121110
valid from: 2014-08-08
valid till: 2020-10-03

Residential Property Mgmt
type: BicsLevel5Segment
type: Classifier
type: NamedIndividual
is level5 segment of: Property Management
is replaced by: http://data.ga-group.nl/ics/bics/151012101011
created with: infer-bics.sql
derived from: Residential Property Mgmt
  type: BicsLevel5Segment
  type: Classifier
  type: ContemporaryDerivation
  derived from: http://data.ga-group.nl/ics/bics/2014/1415121111
  source accessed on: 2019-12-03T20:05:01Z
  source last accessed on: 2019-12-03T20:05:01Z
  definition: This segment includes companies that provide management services for residential property.
  notation: 1415121111
  valid from: 2014-08-08
  valid till: 2020-10-03
source accessed on: 2019-12-03T20:05:01Z
source last accessed on: 2019-12-03T20:05:01Z
definition: This segment includes companies that provide management services for residential property.
notation: 1415121111
valid from: 2014-08-08
valid till: 2020-10-03

Senior Housing Operators
type: BicsLevel5Segment
type: Classifier
type: NamedIndividual
is level5 segment of: Property Management
is replaced by: http://data.ga-group.nl/ics/bics/151012101012
created with: infer-bics.sql
derived from: Senior Housing Operators
  type: BicsLevel5Segment
  type: Classifier
  type: ContemporaryDerivation
  derived from: http://data.ga-group.nl/ics/bics/2014/1415121112
  source accessed on: 2019-12-03T20:05:01Z
  source last accessed on: 2019-12-03T20:05:01Z
  definition: This segment includes companies that manages and operate senior housing facilities. These companies provide outsourced management services on behalf of the property owners.
  notation: 1415121112
  valid from: 2014-08-08
  valid till: 2020-10-03
source accessed on: 2019-12-03T20:05:01Z
source last accessed on: 2019-12-03T20:05:01Z
definition: This segment includes companies that manages and operate senior housing facilities. These companies provide outsourced management services on behalf of the property owners.
notation: 1415121112
valid from: 2014-08-08
valid till: 2020-10-03

Property Management
type: BicsLevel4SubIndustry
type: Classifier
type: NamedIndividual
created with: infer-bics.sql
derived from: Property Management
  type: BicsLevel4SubIndustry
  type: Classifier
  type: ContemporaryDerivation
  derived from: http://data.ga-group.nl/ics/bics/2014/14151211
  source accessed on: 2019-12-03T20:05:01Z
  source last accessed on: 2019-12-03T20:05:01Z
  definition: This industry subgroup includes companies that provide property management services. Such services include building maintenance and security, and bill payment services.
  notation: 14151211
  valid from: 2014-08-08
  valid till: 2020-10-03
source accessed on: 2019-12-03T20:05:01Z
source last accessed on: 2019-12-03T20:05:01Z
definition: This industry subgroup includes companies that provide property management services. Such services include building maintenance and security, and bill payment services.
notation: 14151211
valid from: 2014-08-08
valid till: 2020-10-03

Real Estate Appraisers
type: BicsLevel4SubIndustry
type: Classifier
type: NamedIndividual
created with: infer-bics.sql
derived from: Real Estate Appraisers
  type: BicsLevel4SubIndustry
  type: Classifier
  type: ContemporaryDerivation
  derived from: http://data.ga-group.nl/ics/bics/2014/14151212
  source accessed on: 2019-12-03T20:05:01Z
  source last accessed on: 2019-12-03T20:05:01Z
  definition: This industry subgroup includes companies that appraise real estate values for a fee.
  notation: 14151212
  valid from: 2014-08-08
  valid till: 2020-10-03
source accessed on: 2019-12-03T20:05:01Z
source last accessed on: 2019-12-03T20:05:01Z
definition: This industry subgroup includes companies that appraise real estate values for a fee.
notation: 14151212
valid from: 2014-08-08
valid till: 2020-10-03

RE Brokerage - Leasing
type: BicsLevel4SubIndustry
type: Classifier
type: NamedIndividual
created with: infer-bics.sql
derived from: RE Brokerage - Leasing
  type: BicsLevel4SubIndustry
  type: Classifier
  type: ContemporaryDerivation
  derived from: http://data.ga-group.nl/ics/bics/2014/14151213
  source accessed on: 2019-12-03T20:05:01Z
  source last accessed on: 2019-12-03T20:05:01Z
  definition: This industry subgroup includes companies that provide brokerage services between a lessee and the property owner for a fee. These companies may represent either sides of the transaction and may provide marketing services. These companies do not own the underlying property.
  notation: 14151213
  valid from: 2014-08-08
  valid till: 2020-10-03
source accessed on: 2019-12-03T20:05:01Z
source last accessed on: 2019-12-03T20:05:01Z
definition: This industry subgroup includes companies that provide brokerage services between a lessee and the property owner for a fee. These companies may represent either sides of the transaction and may provide marketing services. These companies do not own the underlying property.
notation: 14151213
valid from: 2014-08-08
valid till: 2020-10-03

Real Estate Brokerage - Sales
type: BicsLevel4SubIndustry
type: Classifier
type: NamedIndividual
created with: infer-bics.sql
derived from: Real Estate Brokerage - Sales
  type: BicsLevel4SubIndustry
  type: Classifier
  type: ContemporaryDerivation
  derived from: http://data.ga-group.nl/ics/bics/2014/14151214
  source accessed on: 2019-12-03T20:05:01Z
  source last accessed on: 2019-12-03T20:05:01Z
  definition: This industry subgroup includes companies that provide brokerage services between a buyer and the property owner for a fee. These companies may represent either side of the transaction and may provide marketing services. These companies do not own the underlying property.
  notation: 14151214
  valid from: 2014-08-08
  valid till: 2020-10-03
source accessed on: 2019-12-03T20:05:01Z
source last accessed on: 2019-12-03T20:05:01Z
definition: This industry subgroup includes companies that provide brokerage services between a buyer and the property owner for a fee. These companies may represent either side of the transaction and may provide marketing services. These companies do not own the underlying property.
notation: 14151214
valid from: 2014-08-08
valid till: 2020-10-03

Real Estate Fee & Asset Mgmt
type: BicsLevel4SubIndustry
type: Classifier
type: NamedIndividual
created with: infer-bics.sql
derived from: Real Estate Fee & Asset Mgmt
  type: BicsLevel4SubIndustry
  type: Classifier
  type: ContemporaryDerivation
  derived from: http://data.ga-group.nl/ics/bics/2014/14151215
  source accessed on: 2019-12-03T20:05:01Z
  source last accessed on: 2019-12-03T20:05:01Z
  definition: This industry subgroup includes fee income directly attributable to fee and asset management financing, excluding property management. These are fees generated from a managed portfolio for overseeing a client’s investments, making decisions about capital expenditures, or hiring building managers.
  notation: 14151215
  valid from: 2014-08-08
  valid till: 2020-10-03
source accessed on: 2019-12-03T20:05:01Z
source last accessed on: 2019-12-03T20:05:01Z
definition: This industry subgroup includes fee income directly attributable to fee and asset management financing, excluding property management. These are fees generated from a managed portfolio for overseeing a client’s investments, making decisions about capital expenditures, or hiring building managers.
notation: 14151215
valid from: 2014-08-08
valid till: 2020-10-03

Real Estate Services
type: BicsLevel3Industry
type: Classifier
type: NamedIndividual
is industry of: Real Estate
is replaced by: http://data.ga-group.nl/ics/bics/15101210
created with: infer-bics.sql
derived from: Real Estate Services
  type: BicsLevel3Industry
  type: Classifier
  type: ContemporaryDerivation
  derived from: http://data.ga-group.nl/ics/bics/2014/141512
  source accessed on: 2019-12-03T20:05:01Z
  source last accessed on: 2019-12-03T20:05:01Z
  definition: This industry includes companies that provide real estate services in addition to normal operations. Such services include property and/or third-party asset management, brokerage and information services for real estate owners.
  notation: 141512
  valid from: 2014-08-08
  valid till: 2020-10-03
source accessed on: 2019-12-03T20:05:01Z
source last accessed on: 2019-12-03T20:05:01Z
definition: This industry includes companies that provide real estate services in addition to normal operations. Such services include property and/or third-party asset management, brokerage and information services for real estate owners.
notation: 141512
valid from: 2014-08-08
valid till: 2020-10-03

Real Estate
type: BicsLevel2IndustryGroup
type: Classifier
type: NamedIndividual
is industry group of: Financials
is replaced by: http://data.ga-group.nl/ics/bics/1510
created with: infer-bics.sql
derived from: Real Estate
  type: BicsLevel2IndustryGroup
  type: Classifier
  type: ContemporaryDerivation
  derived from: http://data.ga-group.nl/ics/bics/2014/1415
  source accessed on: 2019-12-03T20:05:01Z
  source last accessed on: 2019-12-03T20:05:01Z
  definition: This industry group includes companies that are involved with real estate, such as companies that own and develop real estate, as well as companies that provide specialized real estate‒related services.
  notation: 1415
  valid from: 2014-08-08
  valid till: 2020-10-03
source accessed on: 2019-12-03T20:05:01Z
source last accessed on: 2019-12-03T20:05:01Z
definition: This industry group includes companies that are involved with real estate, such as companies that own and develop real estate, as well as companies that provide specialized real estate‒related services.
notation: 1415
valid from: 2014-08-08
valid till: 2020-10-03

Financials
type: BicsLevel1Sector
type: Classifier
type: NamedIndividual
created with: infer-bics.sql
derived from: Financials
  type: BicsLevel1Sector
  type: Classifier
  type: ContemporaryDerivation
  derived from: http://data.ga-group.nl/ics/bics/2014/14
  source accessed on: 2019-12-03T20:05:01Z
  source last accessed on: 2019-12-03T20:05:01Z
  definition: This sector includes companies that provide financial services or products to retail and commercial clients.
  notation: 14
  valid from: 2014-08-08
  valid till: 2020-10-03
derived from: Financials
  type: BicsLevel1Sector
  type: Classifier
  type: ContemporaryDerivation
  derived from: http://data.ga-group.nl/ics/bics/2020/14
  derived from: http://data.ga-group.nl/ics/bics/2024/14
  source accessed on: 2023-07-03T18:11:29Z
  source last accessed on: 2024-06-05T14:42:36Z
  definition: This sector includes companies that provide services or products which focus on the growth, storage, or transaction of money and assets.
  notation: 14
  valid from: 2020-10-03
source accessed on: 2019-12-03T20:05:01Z
source last accessed on: 2024-06-05T14:42:36Z
definition: This sector includes companies that provide services or products which focus on the growth, storage, or transaction of money and assets.
notation: 14
valid from: 2014-08-08

Multi Asset Class Own & Develop
type: BicsLevel4SubIndustry
type: Classifier
type: NamedIndividual
created with: infer-bics.sql
derived from: Multi Asset Class Own & Develop
  type: BicsLevel4SubIndustry
  type: Classifier
  type: AnachronousDerivation
  derived from: http://data.ga-group.nl/ics/bics/2014/14151014
  source accessed on: 2019-12-03T20:05:01Z
  source last accessed on: 2019-12-03T20:05:01Z
  definition: This industry subgroup includes non-REIT owners and developers multiple property types. Typically, these companies would construct multiple property types within the scope of a single development project.
  notation: 14151014
  valid from: 2014-08-08
  valid till: 2020-10-03
derived from: Multi Asset Class Own & Develop
  type: BicsLevel4SubIndustry
  type: Classifier
  type: ContemporaryDerivation
  derived from: http://data.ga-group.nl/ics/bics/2020/15101010
  derived from: http://data.ga-group.nl/ics/bics/2024/15101010
  source accessed on: 2023-07-03T18:11:29Z
  source last accessed on: 2024-06-05T14:42:36Z
  definition: This industry subgroup includes non-REIT owners and developers of multiple property types.
  notation: 15101010
  valid from: 2020-10-03
source accessed on: 2023-07-03T18:11:29Z
source last accessed on: 2024-06-05T14:42:36Z
definition: This industry subgroup includes non-REIT owners and developers of multiple property types.
notation: 15101010
valid from: 2020-10-03

Health Care Owners & Develop
type: BicsLevel4SubIndustry
type: Classifier
type: NamedIndividual
created with: infer-bics.sql
derived from: Health Care Owners & Develop
  type: BicsLevel4SubIndustry
  type: Classifier
  type: AnachronousDerivation
  derived from: http://data.ga-group.nl/ics/bics/2014/14151010
  source accessed on: 2019-12-03T20:05:01Z
  source last accessed on: 2019-12-03T20:05:01Z
  definition: This industry subgroup includes non-REIT owners and developers of health care properties.
  notation: 14151010
  valid from: 2014-08-08
  valid till: 2020-10-03
derived from: Health Care Owners & Develop
  type: BicsLevel4SubIndustry
  type: Classifier
  type: ContemporaryDerivation
  derived from: http://data.ga-group.nl/ics/bics/2020/15101011
  derived from: http://data.ga-group.nl/ics/bics/2024/15101011
  source accessed on: 2023-07-03T18:11:29Z
  source last accessed on: 2024-06-05T14:42:36Z
  definition: This industry subgroup includes non-REIT owners and developers of health care properties.
  notation: 15101011
  valid from: 2020-10-03
source accessed on: 2023-07-03T18:11:29Z
source last accessed on: 2024-06-05T14:42:36Z
definition: This industry subgroup includes non-REIT owners and developers of health care properties.
notation: 15101011
valid from: 2020-10-03

Hotel Owners & Developers
type: BicsLevel4SubIndustry
type: Classifier
type: NamedIndividual
created with: infer-bics.sql
derived from: Hotel Owners & Developers
  type: BicsLevel4SubIndustry
  type: Classifier
  type: AnachronousDerivation
  derived from: http://data.ga-group.nl/ics/bics/2014/14151011
  source accessed on: 2019-12-03T20:05:01Z
  source last accessed on: 2019-12-03T20:05:01Z
  definition: This industry subgroup includes non-REIT owners and developers of hotel/lodging properties.
  notation: 14151011
  valid from: 2014-08-08
  valid till: 2020-10-03
derived from: Hotel Owners & Developers
  type: BicsLevel4SubIndustry
  type: Classifier
  type: ContemporaryDerivation
  derived from: http://data.ga-group.nl/ics/bics/2020/15101012
  derived from: http://data.ga-group.nl/ics/bics/2024/15101012
  source accessed on: 2023-07-03T18:11:29Z
  source last accessed on: 2024-06-05T14:42:36Z
  definition: This industry subgroup includes non-REIT owners and developers of hotel/lodging properties.
  notation: 15101012
  valid from: 2020-10-03
source accessed on: 2023-07-03T18:11:29Z
source last accessed on: 2024-06-05T14:42:36Z
definition: This industry subgroup includes non-REIT owners and developers of hotel/lodging properties.
notation: 15101012
valid from: 2020-10-03

Apartment Owners & Develop
type: BicsLevel5Segment
type: Classifier
type: NamedIndividual
is level5 segment of: http://data.ga-group.nl/ics/bics/15101013
replaces: Apartment Owners & Develop
created with: infer-bics.sql
derived from: Apartment Owners & Develop
  type: BicsLevel5Segment
  type: Classifier
  type: AnachronousDerivation
  derived from: http://data.ga-group.nl/ics/bics/2014/1415101210
  source accessed on: 2019-12-03T20:05:01Z
  source last accessed on: 2019-12-03T20:05:01Z
  definition: This segment includes non-REIT owners and developers of apartments. Such apartments include affordable and non-affordable units.
  notation: 1415101210
  valid from: 2014-08-08
  valid till: 2020-10-03
source accessed on: 2023-07-03T18:11:29Z
source last accessed on: 2024-06-05T14:42:36Z
definition: This segment includes non-REIT owners and developers of apartments that typically have 5+ units.
notation: 1510101310
valid from: 2020-10-03